
##TITLE=UV1053_TOCA01-ROVE100D_6099910_yjoKhAglnJ
##JCAMPDX= 6.0         $$ Bruker NMR JCAMP-DX V2.0
##DATA TYPE= NMR SPECTRUM
##DATA CLASS= NTUPLES
##ORIGIN= BRUKER
##OWNER= Administrator
$$ 1.72 TOPSPIN		Version 2.1
$$ 2012-05-12 23:07:43.140 -0500  Administrator@TOPSPIN
$$ Compression mode = diff/dup
##.OBSERVE FREQUENCY= 400.13188235
##.OBSERVE NUCLEUS= ^1H
##.ACQUISITION MODE= SIMULTANEOUS (DQD)
##.ACQUISITION SCHEME= undefined
##.AVERAGES= 64
##.DIGITISER RES= 22
##SPECTROMETER/DATA SYSTEM= spect
##.PULSE SEQUENCE= noesygpps1d.comp
##.SOLVENT NAME= COFFEE_meoh
##.SHIFT REFERENCE= INTERNAL, COFFEE_meoh, 1, 14.96676
##AUDIT TRAIL= $$ (NUMBER, WHEN, WHO, WHERE, PROCESS, VERSION, WHAT)
$$ ##TITLE= Audit trail, TOPSPIN		Version 2.1
$$ ##JCAMPDX= 5.01
$$ ##ORIGIN= Bruker BioSpin GmbH
$$ ##OWNER= Administrator
$$ $$ C:\Bruker\TOPSPIN/data/COFFEE/nmr/UV1053_TOCA01-ROVE100D_6099910_yjoKhAglnJ/12/pdata/1/auditp.txt
$$ ##AUDIT TRAIL=  $$ (NUMBER, WHEN, WHO, WHERE, PROCESS, VERSION, WHAT)
(   1,<2012-05-12 23:07:38.281 -0500>,<Administrator>,<TOPSPIN>,<go>,<TOPSPIN 2.1>,
      <created by zg
	started at 2012-05-12 22:56:08.000 -0500,
	POWCHK enabled, PULCHK disabled,
       configuration hash MD5:
       AF F2 23 6B 01 CD 40 DD E5 A1 38 A0 06 EA F7 77
       data hash MD5: 64K
       11 BB 10 09 16 1D EB 26 CD 76 E8 AF E6 E9 D4 B1>)
(   2,<2012-05-12 23:07:41.031 -0500>,<Administrator>,<TOPSPIN>,<proc1d>,<TOPSPIN 2.1>,
      <Start of raw data processing
       efp LB = 0.3 FT_mod = 6 PKNL = 1 PHC0 = 0 PHC1 = 0 SI = 128K 
       data hash MD5: 128K
       50 B6 F4 98 82 43 24 91 2E 94 22 90 0C 28 7F 18>)
(   3,<2012-05-12 23:07:42.265 -0500>,<Administrator>,<TOPSPIN>,<proc1d>,<TOPSPIN 2.1>,
      <pk PHC0 = 36.06812 PHC1 = 0 
       data hash MD5: 128K
       09 01 5C A2 24 2D 66 02 A4 BC AC 32 96 37 0F C7>)
(   4,<2012-05-12 23:07:42.843 -0500>,<Administrator>,<TOPSPIN>,<proc1d>,<TOPSPIN 2.1>,
      <abs ABSG = 1 
       data hash MD5: 128K
       30 AE EE 69 94 B2 8E EC E1 33 C9 B3 25 69 D6 F7>)
(   5,<2012-05-12 23:07:42.906 -0500>,<Administrator>,<TOPSPIN>,<proc1d>,<TOPSPIN 2.1>,
      <abs ABSG = 2 
       data hash MD5: 128K
       05 8B F9 06 9C DB 04 8F 84 F5 2E E9 11 56 D8 4D>)
(   6,<2012-05-12 23:07:42.953 -0500>,<Administrator>,<TOPSPIN>,<proc1d>,<TOPSPIN 2.1>,
      <abs ABSG = 3 
       data hash MD5: 128K
       E0 72 DE 95 55 A6 81 6B E7 15 CE 78 A3 11 76 50>)
(   7,<2012-05-12 23:07:43.015 -0500>,<Administrator>,<TOPSPIN>,<proc1d>,<TOPSPIN 2.1>,
      <abs ABSG = 4 
       data hash MD5: 128K
       5E D8 F6 2E DB 8C 46 F8 2B 6D 4B 58 50 BC 36 FF>)
(   8,<2012-05-12 23:07:43.062 -0500>,<Administrator>,<TOPSPIN>,<proc1d>,<TOPSPIN 2.1>,
      <abs ABSG = 5 
       data hash MD5: 128K
       B9 D4 60 92 BC 51 8F 04 66 79 59 2C 8E D2 32 E3>)
$$ ##END=
$$ 
$$ $$ hash MD5
$$ $$ 2F 51 64 ED F3 E3 74 8C C3 A0 10 EA 6C 59 39 FA
##$RELAX= 
##$RELAX= 
##$RELAX= 
##$RELAX= 
##$RELAX= 
##$RELAX= 
##$RELAX= 
##$RELAX= 
$$ [...]
##$TP07= 0
##$TPNAME0= <>
##$TPNAME1= <>
##$TPNAME2= <>
##$TPNAME3= <>
##$TPNAME4= <>
##$TPNAME5= <>
##$TPNAME6= <>
##$TPNAME7= <>
##$TPOAL= (0..7)
0.5 0.5 0.5 0.5 0.5 0.5 0.5 0.5
##$TPOFFS= (0..7)
0 0 0 0 0 0 0 0
##$TUNHIN= 0
##$TUNHOUT= 0
##$TUNXOUT= 0
##$USERA1= <user>
##$USERA2= <user>
##$USERA3= <user>
##$USERA4= <user>
##$USERA5= <user>
##$V9= 5
##$VALIST= <valist>
##$VCLIST= <CCCCCCCCCCCCCCC>
##$VD= 0
##$VDLIST= <DDDDDDDDDDDDDDD>
##$VPLIST= <PPPPPPPPPPPPPPP>
##$VTLIST= <TTTTTTTTTTTTTTT>
##$WBST= 2048
##$WBSW= 25
##$XGAIN= (0..3)
0 0 0 0
##$XL= 0
##$YL= 0
##$YMAX_a= 11050712
##$YMIN_a= -5680821
##$ZGOPTNS= <>
##$ZL1= 120
##$ZL2= 120
##$ZL3= 120
##$ZL4= 120
##$ABSF1= 14.96676
##$ABSF2= -5.585771
##$ABSG= 5
##$ABSL= 3
##$ALPHA= 0
##$AQORDER= 0
##$ASSFAC= 0
##$ASSFACI= 0
##$ASSFACX= 0
##$ASSWID= 0
##$AUNMP= <proc_prof1d_extract.lims>
##$AXLEFT= 0
##$AXNAME= <>
##$AXNUC= <1H>
##$AXRIGHT= 0
##$AXTYPE= 0
##$AXUNIT= <>
##$AZFE= 0.1
##$AZFW= 0.1
##$BCFW= 0
##$BC_mod= 0
##$BYTORDP= 0
##$COROFFS= 0
##$CY= 15
##$DATMOD= 1
##$DC= 0
##$DFILT= <>
##$DTYPP= 0
##$F1P= 0
##$F2P= 0
##$FCOR= 0.5
##$FTSIZE= 131072
##$FT_mod= 6
##$GAMMA= 0
##$GB= 0
##$INTBC= 1
##$INTSCL= 1
##$ISEN= 128
##$LB= 0.3
##$LEV0= 0
##$LPBIN= 0
##$MAXI= 10000
##$MC2= 0
##$MEAN= 0
##$ME_mod= 0
##$MI= 0
##$NCOEF= 0
##$NC_proc= -3
##$NLEV= 6
##$NOISF1= 0
##$NOISF2= 0
##$NSP= 0
##$NTH_PI= 0
##$NZP= 0
##$OFFSET= 14.96676
##$PC= 1
##$PHC0= 36.06812
##$PHC1= 0
##$PH_mod= 1
##$PKNL= yes
##$PPARMOD= 0
##$PPDIAG= 0
##$PPIPTYP= 0
##$PPMPNUM= 2147483647
##$PPRESOL= 1
##$PSCAL= 4
##$PSIGN= 0
##$PYNMP= <proc.py>
##$REVERSE= no
##$SF= 400.130005540509
##$SI= 131072
##$SIGF1= 0
##$SIGF2= 0
##$SINO= 400
##$SIOLD= 131072
##$SPECTYP= <>
##$SREGLST= <1H.CDCl3>
##$SSB= 0
##$STSI= 131072
##$STSR= 0
##$SW_p= 8223.68421052632
##$SYMM= 0
##$S_DEV= 0
##$TDeff= 65536
##$TDoff= 0
##$TI= <>
##$TILT= no
##$TM1= 0
##$TM2= 0
##$TOPLEV= 0
##$USERP1= <user>
##$USERP2= <user>
##$USERP3= <user>
##$USERP4= <user>
##$USERP5= <user>
##$WDW= 1
##$XDIM= 131072
##$YMAX_p= 447403364
##$YMIN_p= -56139378
##$CURPLOT= <Network HP LaserJet P1505>
##$CURPRIN= <$Network HP LaserJet P1505>
##$DFORMAT= <normdp>
##$LAYOUT= <+/1D_H.xwp>
##$LFORMAT= <normlp>
##$PFORMAT= <normpl>
##$SURQMSG= 1
$$ End of Bruker specific parameters
$$ ---------------------------------
##NTUPLES= NMR SPECTRUM
##VAR_NAME=  FREQUENCY,     SPECTRUM/REAL,   SPECTRUM/IMAG
##SYMBOL=    X,             R,               I
##VAR_TYPE=  INDEPENDENT,   DEPENDENT,       DEPENDENT
##VAR_FORM=  AFFN,          ASDF,            ASDF
##VAR_DIM=   131072,        131072,          131072
##UNITS=     HZ,            ARBITRARY UNITS, ARBITRARY UNITS
##FACTOR=    0.0627417313425165, 1,          1
##FIRST=     8223.62146879498, -2468,        -103941
##LAST=      0,             1443,            -107314
##MIN=       0,             -56139378,       0
##MAX=       8223.62146879498, 447403364,    0
$$ Real data points
##PAGE= N=1
##DATA TABLE= (X++(R..R)), XYDATA
$$ [...]
63698C39303n70K596M936M782K670N48k56j26j81n28j88J081J942J278M9R9J603
63681C59038L080L782M556N975P071O560M506K095M60Q7P60J628J964K205L540
63666D07307O003P873P564N571L800L460M270N314N836N437M214K769J551L34
63652D71303j156k342k286j153l95j054k408k900k118j171j119j550j142P07L183
63637D54399M925N286M683L936L444K873J663r6j379j100O75K689L785L976M135
63622D93894M798N559N556M429K820J773J531J159j50j653j702N8K062K759K413
63607E25306K266K634K821K390J515K44j441k867l088k262j667j910k189j796
63593E19956j292j319j182O1J615J615j67j725j438R3J628L344N917Q376Q839
$$ plain form
63698 339303 338733 341329 346265 351047 353717 354265 354009 353883 353702 353174 352986 354067 356009 357287 357336 357435 359038
63681 359038 362118 365900 370456 376431 383502 390062 394568 396663 397123 397210 397970 399598 401562 403767 407307
63666 407307 413310 421183 428747 434318 438118 441578 445848 451162 456998 462435 466649 469418 470969 471303
63652 471303 470147 467805 465519 464366 463971 462917 460509 457609 455491 454320 453201 451651 450509 451216 454399
63637 454399 459324 464610 469293 473229 476673 479546 481209 481113 479734 478634 479309 481998 485783 489759 493894
63622 493894 498692 504251 509807 514236 517056 518829 520360 521519 521369 519716 518014 518072 520134 522893 525306
63607 525306 527572 530206 533027 535417 536932 537176 535735 532868 529780 527518 525851 523941 521752 519956
63593 519956 518664 517345 516163 516224 517839 519454 519287 517562 516124 516217 517845 521189 527106 535482 544321
63578E44321P379O357P380R442J0850J1492J2051J2354J2163J2616J4894J7881
63566F79180J9240J8794J8830K0657K2965K4376K5616K7840L0492L2504L4421
63555I54915L7492M1423M4744M7042M9143N1416N3427N5166N6970N8049N6618
63544A506405N1894M4740L6171K6463J6246P070Q7m932q644j1113j2449j3488
63532A638450j4962j6666j8323k0647k4594k9844l5012l9040m1619m2610m2060
63521A313073m0708l9444l8072l5465l1217k6285k1683j7413j3243r747p617o402
63509A025777m919k724k54K400N725R536J2676J4579J6215J8589K1142K2848K4266
63496A165856K6947L0891L4216L5855L7258M0606M6213N2525N7879O1451O3067
$$ plain form
63578 544321 551700 558057 565437 574879 585729 597221 609272 621626 633789 646405 661299 679180
63566 679180 698420 717214 736044 756701 779666 804042 829658 857498 887990 920494 954915
63555 954915 992407 1033830 1078574 1125616 1174759 1226175 1279602 1334768 1391738 1449787 1506405
63544 1506405 1558299 1603039 1639210 1665673 1681919 1688989 1689076 1684144 1675500 1664387 1651938 1638450
63532 1638450 1623488 1606822 1588499 1567852 1543258 1513414 1478402 1439362 1397743 1355133 1313073
63521 1313073 1272365 1232921 1194849 1159384 1128167 1101882 1080199 1062786 1049543 1039796 1032179 1025777
63509 1025777 1020858 1018134 1017880 1020280 1026005 1035541 1048217 1062796 1079011 1097600 1118742 1141590 1165856
63496 1165856 1192803 1223694 1257910 1293765 1331023 1371629 1417842 1470367 1528246 1589697 1652764
63485A652764O2987O1414N7498M9440L6608K1153O616m864j3070j8144k0017j9566
63473A872819j8794j9197k0667k2459k4527k7454l1691l7313m3937n0364n4940
63462A521476n6840n6796n6185n5623n4797n3234n0731m7304m3273l9277l5888
63451I71528l3141l0675k8147k5433k2644k0241j8809j8360j8003j6624j3962
63440G25489j0839q443p518p930q686q517o893m517k634j873j925k171k152j544
63426F49847k70J101J581R16J72N69J876K598J948R41J100K518L811L845K842
63411F75395J731R40J40j069k510l462l349k431j604j391j333p33L13J085J311
63396F63033J383J611J973K678M136O119P747Q716R824J1694J3772J5221J6306
$$ plain form
63485 1652764 1715751 1777165 1834663 1884103 1920711 1941864 1948480 1943616 1930546 1912402 1892385 1872819
63473 1872819 1854025 1834828 1814161 1791702 1767175 1739721 1708030 1670717 1626780 1576416 1521476
63462 1521476 1464636 1407840 1351655 1296032 1241235 1188001 1137270 1089966 1046693 1007416 971528
63451 971528 938387 907712 879565 854132 831488 811247 792438 774078 756075 739451 725489
63440 725489 714650 706207 698689 690759 682073 673556 666663 662146 659512 657639 655714 653543 651391 649847
63426 649847 649577 650678 652259 653175 653347 653916 655792 658390 660338 661279 662379 664897 668708 672553 675395
63411 675395 677126 678066 678206 677137 674627 671165 667816 665385 663781 662390 661057 660324 660637 661722 663033
63396 663033 664416 666027 668000 670678 674814 680933 688680 697396 707220 718914 732686 747907 764213
63383G64213J7976K0448K3048K5284K7398K9988L3597L8437M3825M8133M9954
63372A122301M9191M6445M1909L5815K9737K6019K5598K7480L0668L5326M1321
63361A511810M6873N0156N1832N4563N9724O5588O9093O8659O4726N8253M9678
63350B150955L9234K7509J5332L596o617j4235j9015k1802k3625k4929k6207k8768
63338B071428l3777m0548m6942n1754n5652n9388o2225o2876o1145n7669n2859
63327A486593m7256m2326l9381l7664l4823k9614k3283j7960j4513j2304j0298
63316A177171p801m559p47L215P070J0889J4794J8686K2396K5861K9192L2627
63304A328794L6351M0155M3549M6464M9640N3842N8844O3496O6659O7814O6990
$$ plain form
63383 764213 782189 802637 825685 850969 878367 908355 941952 980389 1024214 1072347 1122301
63372 1122301 1171492 1217937 1259846 1295661 1325398 1351417 1377015 1404495 1435163 1470489 1511810
63361 1511810 1558683 1608839 1660671 1715234 1774958 1840546 1909639 1978298 2043024 2101277 2150955
63350 2150955 2190189 2217698 2233030 2236626 2230009 2215774 2196759 2174957 2151332 2126403 2100196 2071428
63338 2071428 2037651 1997103 1950161 1898407 1842755 1783367 1721142 1658266 1597121 1539452 1486593
63327 1486593 1439337 1397011 1357630 1319966 1285143 1255529 1232246 1214286 1199773 1187469 1177171
63316 1177171 1169370 1164811 1164064 1167279 1174349 1185238 1200032 1218718 1241114 1266975 1296167 1328794
63304 1328794 1365145 1405300 1448849 1495313 1544953 1598795 1657639 1721135 1787794 1855608 1922598
63293A922598O4485O0431N4251M5010L2810J9483P282k830j0917j6715j9829k1174
63281B134885k2860k6132l0293l4094l7488m1343m6159n1561n6721o0672o2620
63270A664942o2452o0869n8609n5707n1803m7021m2083l7554l3205k8429k3354
63259A163856j9411j8505k1289k6280l0795l2866l2426l0930k9901k9542k8674
63248H63237k6232k2623j9237j6762j4798j3020j1714j1019j0702j0944j2026
63237F94160j2787j1186p336m323m447o205o806o162n991o203n222l449l168m683
63223F06192n589m619l439l480l653k754j749j832k130j341q1M28O83J761K956
63208E81353K642R53m34p66o89n22J64J279K086K363K551K783K945L433M697O213
$$ plain form
63293 1922598 1987083 2047514 2101765 2146775 2179585 2199068 2206350 2203520 2192603 2175888 2156059 2134885
63281 2134885 2112025 2085893 2055600 2021506 1984018 1942675 1896516 1844955 1788234 1727562 1664942
63270 1664942 1602490 1541621 1483012 1427305 1375502 1328481 1286398 1248844 1215639 1187210 1163856
63259 1163856 1144445 1125940 1104651 1078371 1047576 1014710 982284 951354 921453 891911 863237
63248 863237 837005 814382 795145 778383 763585 750565 738851 727832 717130 706186 694160
63237 694160 681373 670187 662851 658528 654081 647876 641070 634908 628917 622714 617492 614043 610875 606192
63223 606192 600603 595984 592545 589065 585412 582658 580909 579077 576947 575606 575525 575953 576636 578397 581353
63208 581353 583995 584948 584514 583748 583059 582537 582701 583980 586066 588429 590980 593763 596708 600141 604838 611051
63192F11051P088P400P817Q201P951P478P853R076J0307J1777J4676J8665K1279
63179G50619K0834J8801J8063J9618K1905K3000K2573K1830K2093K3545K5113
63168I87994K5627K4952K3835K2960K2606K2883K3564K3878K3233K2051K1201
63157A244784K0719J9926J8569J6700J3595Q204J105n339r477j2014j4576j7689
63145A284507k0949k4006k6304k6784k5167k3008k1952k1304j8764j3642p901
63134A054726l692j115R70L081N036O985R327J1834J3679J4438J4493J4517J5022
63121A159301J6319J8230J9878K0416K0121J9994K0113J9200J6436J2860J0150
63110A353018Q515O826M542K202o5l228p887j3158j7889k2237k6951l1478l4073
$$ plain form
63192 611051 618139 625539 633356 641557 649508 656986 664839 673915 684222 695999 710675 729340 750619
63179 750619 771453 790254 808317 827935 849840 872840 895413 917243 939336 962881 987994
63168 987994 1013621 1038573 1062408 1085368 1107974 1130857 1154421 1178299 1201532 1223583 1244784
63157 1244784 1265503 1285429 1303998 1320698 1334293 1342497 1343602 1338263 1328786 1316772 1302196 1284507
63145 1284507 1263558 1239552 1213248 1186464 1161297 1138289 1116337 1095033 1076269 1062627 1054726
63134 1054726 1051034 1049919 1050889 1053970 1059006 1065991 1075318 1087152 1100831 1115269 1129762 1144279 1159301
63121 1159301 1175620 1193850 1213728 1234144 1254265 1274259 1294372 1313572 1330008 1342868 1353018
63110 1353018 1361533 1368359 1372901 1375103 1375038 1371810 1363923 1350765 1332876 1310639 1283688 1252210 1218137
63097A218137l3886l2059l0289k9134k8199k7328k6766k6371k5622k4471k3393
63086I10619k2291k0187j6769j3528j2135j1991j0858q170o083o320p461o935
63074G67891m771l309l576l942k816p84P46J590K413L349M059M464M638M560M614
63059G79126N554P288Q469Q158P091O492O388O130N807N882N984N466M779M883
63045H67497N364M686K627J093J912M663P279Q218P571O575O396P089P562O734
63031I45266M656K166k40k332l258j927J305M321N334M682L890L563L146K512
63017I73084K710M630P579R863J0676J0898J1817J3605J5420J6674J7644J8842
63005A113442K0436K2390K4712K7365L0235L3205L5930L7784L8756M0225M3704
$$ plain form
63097 1218137 1184251 1152192 1121903 1092769 1064570 1037242 1010476 984105 958483 934012 910619
63086 910619 888328 868141 851372 837844 825709 813718 802860 794690 788607 782287 774826 767891
63074 767891 763120 759811 756235 752293 749477 748693 749439 751029 753442 756791 760850 765314 769952 774512 779126
63059 779126 784680 791968 800437 808595 815686 822178 828566 834696 840503 846385 852369 857835 862614 867497
63045 867497 872861 877547 880174 881267 883179 887842 895121 903339 910910 917485 923881 930970 938532 945266
63031 945266 949922 952088 951848 949516 946258 944331 945636 949957 955291 959973 963863 967426 970572 973084
63017 973084 975794 980424 988003 997866 1008542 1019440 1031257 1044862 1060282 1076956 1094600 1113442
63005 1113442 1133878 1156268 1180980 1208345 1238580 1271785 1307715 1345499 1384255 1424480 1468184
62994A468184M8639N2684N4658N5927N7990O0040O0313N9003N8138N8913O0558
62983B095047O1775O2004O1287O0004N8937N8537N8130N6667N4171N1290M7591
62972B725440M1667L3271K4060J5547P233k490j4100k6195l6641m4205m9303n3273
62960B621011n6699n8725n8499n6742n4946n3216n0073m4522l7273k9744k2795
62949B097777j6738j1557o683j269M870J1102J6827K1727K5272K7036K7695K8569
62937B224628K9866L0524L0130K9726L0028L0169K9067K6989K4641K1720J7599
62926B525087J2714P903K682m367j3538k3396l2488m0718m8548n5535o0288o2020
62914B207488o1835o2017o3729o5720o5905o3877o0957n7850n3763m8366m3212
$$ plain form
62994 1468184 1516823 1569507 1624165 1680092 1738082 1798122 1858435 1917438 1975576 2034489 2095047
62983 2095047 2156822 2218826 2280113 2340117 2399054 2457591 2515721 2572388 2626559 2677849 2725440
62972 2725440 2767107 2800378 2824438 2839985 2847218 2844728 2830628 2804433 2767792 2723587 2674284 2621011
62960 2621011 2564312 2505587 2447088 2390346 2335400 2282184 2232111 2187589 2150316 2120572 2097777
62949 2097777 2081039 2069482 2062799 2061530 2066400 2077502 2094329 2116056 2141328 2168364 2196059 2224628
62937 2224628 2254494 2285018 2315148 2344874 2374902 2405071 2434138 2461127 2485768 2507488 2525087
62926 2525087 2537801 2545704 2548386 2544019 2530481 2507085 2474597 2433879 2385331 2329796 2269508 2207488
62914 2207488 2145653 2083636 2019907 1954187 1888282 1824405 1763448 1705598 1651835 1603469 1560257
62903A560257m0063l8686l7520l5857l4096l2296k9974k7328k5403k4762k4949
62892A209323k5498k6463k7533k7451k5132k1078j7204j5265j5573j7054j8265
62881I72807j8402j7489j5908j3997j2163j0882j0308j0125j0007r998j0104r899
62869H23525q974p615o560o102n800n049l696k100p66N5M23L32n60k389m315m964
62853G65445l924k230j072n60k96m56j498l130m358m572l977l025k064j525j752
62838G31006k436k596j490N00K075K215J259O13J045J556O47j372k449j483J75
62823G29265O90J66p2K16J28m83o79j37K61m1l34J52R83J113J54j404k731l120
62805G24127k496j730j884k851l437k969j967r63L44K043L135K770J651J098J204
$$ plain form
62903 1560257 1520194 1481508 1443988 1408131 1374035 1341739 1311765 1284437 1259034 1234272 1209323
62892 1209323 1183825 1157362 1129829 1102378 1077246 1056168 1038964 1023699 1008126 991072 972807
62881 972807 954405 936916 921008 907011 894848 883966 873658 863533 853526 843528 833424 823525
62869 823525 814551 806936 800376 794274 788474 783425 779729 777629 776863 776918 777341 777673 777113 774724 770409 765445
62853 765445 761521 759291 758219 757659 757363 756907 755409 752279 747921 743349 739372 736347 734283 732758 731006
62838 731006 728570 725974 724484 724984 727059 729274 730533 731146 732191 733747 734394 733022 730573 729090 729265
62823 729265 729955 730121 730049 730265 730393 729910 729231 729094 729355 729314 728980 729132 730115 731228 731382 729978 727247 724127
62805 724127 721631 719901 718017 715166 711729 708760 706793 705830 706174 708217 711352 714122 715773 716871 718075
62790G18075J121Q12J087J901K111J395J045J944K887K197K68q36k17Q53J004
62775G35647N79O24J070J018L56o5J44L17p4m68L5J459L007L937L948L147K177
62758G56858K116L480N407O516O583O751P819R057R087P585N727N176O789R974
62744H48925J3001J4265J3691J2743J2935J4598J7231K0280K3077K4642K4626
62733A040014K4274K5406K8320L1555L3962L6138L9371M3894M8892N3736N8551
62722A464113O3726O9341P4961P9766Q3178Q5411Q6859Q6910Q4274P8908P2436
62711B329883O5839N7851M6942L3908K0794P860o221k1296l5137m6377n5889o4404
62699B333753p0852p4376p6278p8186p9595p9051p6811p4427p2336o9643o5932
$$ plain form
62790 718075 719196 720008 721095 722996 725107 726502 727547 729491 732378 734575 734843 734007 733790 734643 735647
62775 735647 736226 736850 737920 738938 739294 739229 739373 739690 739616 739148 739183 740642 743649 747586 751534 754681 756858
62758 756858 758974 762454 767861 774377 780960 787711 795530 804587 813674 821259 826986 832162 838951 848925
62744 848925 861926 876191 889882 902625 915560 930158 947389 967669 990746 1015388 1040014
62733 1040014 1064288 1089694 1118014 1149569 1183531 1219669 1259040 1302934 1351826 1405562 1464113
62722 1464113 1527839 1597180 1672141 1751907 1835085 1920496 2007355 2094265 2178539 2257447 2329883
62711 2329883 2395722 2453573 2500515 2534423 2555217 2563077 2556856 2535560 2500423 2454046 2398157 2333753
62699 2333753 2262901 2188525 2112247 2034061 1954466 1875415 1798604 1724177 1651841 1582198 1516266
62688A516266o1606n6774n1506m6903m4145m2492m0040l6492l3334l1034k8215
62677A043725k4330k1110j9976j9559j7434j3386r410o890n254l409j433l81q35
62664I00318j882j742L73L192M831N180N920Q104J0906J3218J5305J8038K1379
62651A003140K4596K7403L0048L2652L5249L8219M1987M6503N1393N6364O1103
62640A448657O5282O8945P2306P4954P6003P5426P4376P3493P1739O7702O1284
62629B230167N3247M3781L2545J9743O217p256k0107l1937m3015n4061o4626p2457
62617B092241p5737p5480p4466p4123p3807p2776p1254o9324o6395o2329n8036
62606A318514n4339n1033m7593m4052m0650l7268l3681l0000k6516k3473k1143
$$ plain form
62688 1516266 1454660 1397886 1346380 1299477 1255332 1212840 1172800 1136308 1102974 1071940 1043725
62677 1043725 1019395 998285 978309 958750 941316 927930 918520 911630 906376 902967 901534 901153 900318
62664 900318 898436 896694 897067 900259 905090 910270 916190 924294 935200 948418 963723 981761 1003140
62651 1003140 1027736 1055139 1085187 1117839 1153088 1191307 1233294 1279797 1331190 1387554 1448657
62640 1448657 1513939 1582884 1655190 1730144 1806147 1881573 1955949 2029442 2101181 2168883 2230167
62629 2230167 2283414 2327195 2359740 2379483 2385700 2378444 2358337 2326400 2283385 2229324 2164698 2092241
62617 2092241 2016504 1941024 1866558 1792435 1718628 1645852 1574598 1505274 1438879 1376550 1318514
62606 1318514 1264175 1213142 1165549 1121497 1080847 1043579 1009898 979898 953382 929909 908766
62595I08766j9705j8805j7704j6126j4536j3451j2827j2320j1751j1060j0167
62584G50314r099q100p367o769n906m507k861j758j694k103j940j094n27p76j201
62569F94612j203j162j344r44M90J599R18n63m60J493L060K920K411L061M311
62554G09199M962N371O693Q958J1311J3421J5281J6285J6068J5802J7109J9783
62542H60243K1995K2906K3629K5351K7811L0262L2717L5385L7763L9328M0570
62531A197960M2154M3258M1840L6940K9926K2979J6846J0662L617l877j0848j6893
62519A414564k2252k7027l0900l3692l5789l7701l9307l9826l8594l5860l2787
62508A040829l0668k9898k9554k8143k5119k1606j9257j8355j7564j5793j3566
$$ plain form
62595 908766 889061 870256 852552 836426 821890 808439 795612 783292 771541 760481 750314
62584 750314 741215 733115 725748 718979 713073 708566 705705 703947 702253 700150 698210 697116 696589 695813 694612
62569 694612 693409 692247 690903 689959 690449 692048 692966 692403 691943 693436 696496 699416 701827 704888 709199
62554 709199 714161 719532 726225 735183 746494 759915 775196 791481 807549 823351 840460 860243
62542 860243 882238 905144 928773 954124 981935 1012197 1044914 1080299 1118062 1157390 1197960
62531 1197960 1240114 1283372 1325212 1362152 1392078 1415057 1431903 1442565 1446182 1442305 1431457 1414564
62519 1414564 1392312 1365285 1334385 1300693 1264904 1227203 1187896 1148070 1109476 1073616 1040829
62508 1040829 1010161 980263 950709 922566 897447 875841 856584 838229 820665 804872 791306
62497G91306j1925j0646q719o464n662o982q545q066n689l540k958l288l154j865
62483G03803L71K594L554K934K048K287L159L107K110J884L275N067O025O536
62469G48754P471Q747J0022J1601J3644J5534J7023J8923K1619K4128K5793K7735
62457I50994L1171L5310L8528M0767M3070M5482M7136M7889M8024M6763M3011
62446A418145L7410L1760K6479K0414J3268O218p7o123j1785j5704j7351j8030
62434A484624j8933j9533j8771j6621j3553r642n146j013K113M658P293J0134
62422A405610J3330J7298K1709K5193K6964K7833K8769K9244K7965K4608J9860
62411A668383J4277Q036J430n239j2054j9186k6417l3322l9595m4806m8295m9720
$$ plain form
62497 791306 779381 768735 760016 753552 747890 740908 732363 724297 718608 715068 712110 708822 705668 703803
62483 703803 704174 706768 710322 713256 715304 717591 720750 723857 725967 727851 731126 736193 742218 748754
62469 748754 756225 764972 774994 786595 800239 815773 832796 851719 873338 897466 923259 950994
62457 950994 982165 1017475 1056003 1096770 1139840 1185322 1232458 1280347 1328371 1375134 1418145
62446 1418145 1455555 1487315 1513794 1534208 1547476 1553694 1553617 1547494 1535709 1520005 1502654 1484624
62434 1484624 1465691 1446158 1427387 1410766 1397213 1387571 1382425 1381412 1383525 1388183 1395476 1405610
62422 1405610 1418940 1436238 1457947 1483140 1510104 1537937 1566706 1595950 1623915 1648523 1668383
62411 1668383 1682660 1690696 1692126 1686887 1674833 1655647 1629230 1595908 1556313 1511507 1463212 1413492
62399A413492m9445m8170m6539m5062m3798m2069l9275l5966l3234l0938k7843
62388I71153k3705j9791j6863j4111j0874p990o324n217l729k334k018k480k642
62375H53075k263j738r11N17J718J374o25l167n367o936p541p148o815p793r744
62360G96636j0954j0468q999p714p046o818o651o062m921l818l367l282k881k238
62346G11417j907j755j080J00J027J457J917K541K747K360K146K844M326N912
62332G34052O944P033O458O226O869P358O430M862M929P315J0116J1624J2573
62319H32789J4505J7180J9110J9854K0282K0947K1621K2457K4302K7559L1586
62308A072192L5425L8598M1146M3544M6642N0979N6046O0874O5428P0703P7290
$$ plain form
62399 1413492 1364047 1315877 1269338 1224276 1180478 1138409 1099134 1063168 1029934 998996 971153
62388 971153 947448 927657 910794 896683 885809 877819 871495 866278 862549 860215 858197 855717 853075
62375 853075 850812 849074 848163 848680 850398 851772 851147 847980 842613 835677 828136 820988 814173 806380 796636
62360 796636 785682 775214 766215 758501 751455 744637 737986 731924 727003 723185 719818 716536 713655 711417
62346 711417 709510 707755 706675 706775 707802 709259 711176 713717 716464 718824 720970 723814 728140 734052
62332 734052 740996 748029 754487 760713 767582 774940 781370 786232 791161 798476 808592 820216 832789
62319 832789 847294 864474 883584 903438 923720 944667 966288 988745 1013047 1040606 1072192
62308 1072192 1107617 1146215 1187361 1230905 1277547 1328526 1384572 1445446 1510874 1581577 1658867
62297A658867Q4487R1172R6773J00988J03177J02579R8805R1670Q1022O7300N1692
62286B628532L5207J8156J439j2532k1870k8100l5308m5698n7306o6792p3135
62275B342593p7367p9977q0378p8523p5325p1382o6633o1368n6334n1657m6837
62264A596812m2046l8226l5762l4135l3241l3626l4931l5480l4381l2817l2190
62253A209977l1978l0659k8028k5349k3642k2900k2627k2119k0550j7737j4610
62242I49778j2147j0205q253o668o190o342n667l570q59J475L047L699L491L210
62228I04799L840N269O461P132Q236J0356J2472J3121J2216J1134J1258J2819
62216A019113J4968J6673J7610J8229J8933J9572K0140K1415K4134K7791L1226
$$ plain form
62297 1658867 1743354 1834526 1931299 2032287 2135464 2238043 2336848 2428518 2509540 2576840 2628532
62286 2628532 2663739 2681895 2683334 2670802 2648932 2620832 2585524 2539826 2482520 2415728 2342593
62275 2342593 2265226 2185249 2104871 2026348 1951023 1879641 1813008 1751640 1695306 1643649 1596812
62264 1596812 1554766 1516540 1480778 1446643 1413402 1379776 1344845 1309365 1274984 1242167 1209977
62253 1209977 1177999 1147340 1119312 1093963 1070321 1047421 1024794 1002675 982125 964388 949778
62242 949778 937631 927426 919173 912505 906315 899973 894306 890736 889877 891352 894399 898098 901589 904799
62228 904799 908639 913908 920369 927501 935737 946093 958565 971686 983902 995036 1006294 1019113
62216 1019113 1034081 1050754 1068364 1086593 1105526 1125098 1145238 1166653 1190787 1218578 1249804
62205A249804L4312L7967M2527M7332N2285N8417O6164P4148Q0739Q6052R1291
62194A921038R6591J00683J02399J01325R6982Q8613P6301O1516M5962L0383J4936
62183B736729K34j2757k3857l4098m4817n6428o8088p8291q5840r0519r2931r3566
62171B055771r2112q8125q2327p6398p1165o5672n8924n1930m6778m3835m1116
62160A337389l6835l1418k6383k2260j8570j5178j2604j1119j0278r227p181l991
62148A132345p45P51k50k482m057m313l675k481r33K16J96o07j032o84k09m6J58
62131A112152Q72K275M508P458J0287J2086J3076J4198J5565J6318J6181J5901
62119A240877J5948J5952J5906J6647J8496K0567K2286K4684K9084L5297M2029
$$ plain form
62205 1249804 1284116 1322083 1364610 1411942 1464227 1522644 1588808 1662956 1743695 1829747 1921038
62194 1921038 2017629 2118312 2220711 2322036 2419018 2507631 2583932 2645448 2691410 2721793 2736729
62183 2736729 2736963 2724206 2700349 2666251 2621434 2565006 2496918 2418627 2332787 2242268 2149337 2055771
62171 2055771 1963659 1875534 1793207 1716809 1645644 1579972 1521048 1469118 1422340 1378505 1337389
62160 1337389 1300554 1269136 1242753 1220493 1201923 1186745 1174141 1163022 1152744 1143517 1136336 1132345
62148 1132345 1131600 1132351 1132101 1129619 1125562 1121249 1117574 1115093 1114160 1114376 1114572 1113965 1112933 1112249 1112040 1111994 1112152
62131 1112152 1113024 1115299 1119807 1127265 1137552 1149638 1162714 1176912 1192477 1208795 1224976 1240877
62119 1240877 1256825 1272777 1288683 1305330 1323826 1344393 1366679 1391363 1420447 1455744 1497773
62108A497773M8521N4703O0239O4647O8209P1651P4803P6369P5112P0638O3005
62097B225670N2424L9653K6167J3477K424o891j4890k2296k9792l7568m5318n2589
62085B150471n8862o3319o5057o3812o0400n6181n2202m8842m5942m2923l8929
62074A554002l3513k7469k2511j9673j8135j6192j3265j0303q135o285l985j595
62062A372941j19L33N36N86n83l609p284r313q441n486k562j456k531m761o856
62047A321395q349r667j1138j2227j1946r983p250n151m203l541j991M72K823
62034A239244M488O047Q105J0213J1564J2348J3562J5603J7743J9070J9437J9487
62022A396911K0144K1956K4583K7000K8601K9929L1906L4643L7456L9795M1628
$$ plain form
62108 1497773 1546294 1600997 1661236 1725883 1794092 1865743 1940546 2016915 2092027 2162665 2225670
62097 2225670 2278094 2317747 2343914 2357391 2359815 2352924 2338034 2315738 2285946 2248378 2203060 2150471
62085 2150471 2091609 2028290 1963233 1899421 1839021 1782840 1730638 1681796 1635854 1592931 1554002
62074 1554002 1520489 1493020 1470509 1450836 1432701 1416509 1403244 1392941 1384806 1378521 1374536 1372941
62062 1372941 1372822 1373155 1373691 1374277 1373694 1370085 1362801 1353488 1345047 1339561 1336999 1335543 1333012 1328251 1321395
62047 1321395 1313046 1303379 1292241 1280014 1268068 1258085 1250835 1245684 1241481 1237940 1235949 1236421 1239244
62034 1239244 1243732 1249779 1257884 1268097 1279661 1292009 1305571 1321174 1338917 1357987 1377424 1396911
62022 1396911 1417055 1439011 1463594 1490594 1519195 1549124 1581030 1615673 1653129 1692924 1734552
62011A734552M3191M4834M6903M9246N1195N2628N4423N7177N9983O1375O0924
62000B316431N8800N4488M7474L8873L0577K2651J3275J719j0298k0826k9738
61989B523426l7768m5011n1448n7793o4427p0264p3880p5335p5894p6313p6283
61978A819010p5144p2362o7711o1858n6378n2398m9338m5847m1658l7702l4438
61967A224176l1133k7159k3333k1269k1400k2217k1809j9925j7950j6886j6212
61956I84883j5121j3958j3442j3257j2605j1628j0856r694p164m016k228k206
61944H68708k293j472n54p4Q83K665L815L362K682L368M635M640L288J933J177
61929H96763O96M35K67q51l604o757q468q591q180p497o285n268n246n336m288
$$ plain form
62011 1734552 1777743 1822577 1869480 1918726 1969921 2022549 2076972 2134149 2194132 2255507 2316431
62000 2316431 2375231 2429719 2477193 2516066 2546643 2569294 2582569 2584288 2573990 2553164 2523426
61989 2523426 2485658 2440647 2389199 2331406 2266979 2196715 2122835 2047500 1971606 1895293 1819010
61978 1819010 1743866 1671504 1603793 1541935 1485557 1433159 1383821 1337974 1296316 1258614 1224176
61967 1224176 1193043 1165884 1142551 1121282 1099882 1077665 1055856 1035931 1017981 1001095 984883
61956 984883 969762 955804 942362 929105 916500 904872 894016 884322 877158 873142 870914 868708
61944 868708 866415 864943 864389 864315 865198 867863 871678 875040 877722 881090 885725 890365 893653 895586 896763
61929 896763 897459 897894 898161 897310 893706 886949 878481 869890 861710 854213 847928 842660 837414 832078 827790
61914H27790l105l826n848o258m218k345k708l951l808k451j561j521j346n30
61900G84314M78J158J214N15m46o26L83J831L010M118N393O360O776P412Q890
61885H30780J0563J1474J1864J2717J4301J6136J7963J9852K1556K2598K2805
61874A012609K2306K1183J9608J7929J6225J4232J2085J0430R477Q693P844P152
61862A179773N826K012m340r813j0814q022n555n863p500q095p228n540k887R87
61848A112941N175Q455J0862J3104J4978J5578J4785J3307J1291Q096L601j189
61836A230984n244q511j1407j4058j6379j8384j9872k0301j9565j8499j7938j7447
61824A043379j5805j2832r975q805r422j0670j1398j1148j0054q725p974p996
$$ plain form
61914 827790 824685 820859 815011 808753 804535 802190 799482 795531 791723 789272 787711 786190 784844 784314
61900 784314 784792 785950 787164 787679 787233 786607 786990 788821 791831 795949 801342 807702 814478 821890 830780
61885 830780 841343 852817 864681 877398 891699 907835 925798 945650 967206 989804 1012609
61874 1012609 1034915 1056098 1075706 1093635 1109860 1124092 1136177 1146607 1156084 1164777 1172621 1179773
61862 1179773 1185599 1187611 1183271 1173458 1162644 1154622 1149067 1143204 1135704 1127609 1120381 1114841 1111954 1112941
61848 1112941 1118116 1126571 1137433 1150537 1165515 1181093 1195878 1209185 1220476 1228572 1232173 1230984
61836 1230984 1225740 1217229 1205822 1191764 1175385 1157001 1137129 1116828 1097263 1078764 1060826 1043379
61824 1043379 1027574 1014742 1004767 995962 986540 975870 964472 953324 943270 934545 926571 918575
61812I18575p939o757m506k191l64J360L298M969N922O607P708R075J0145J1259
61798I57161J3509J7014K0334K2274K3625K6217L0370L4272L6133L6245L6261
61787A253415L6889L7061L5490L2416K9398K7500K6012K3066J7604J0634M383
61776A533868L3l342p247j1494j4223j4225j2478j0830r763q175n148j093K931
61763A438814O307Q889J0336J0047P855M411N64l621q880j5542k2547k8130l1510
61750A376993l3417l4877l6022l6451l6148l5411l4107l1809k8736k6027k4694
61739A019294k4507k4089k2268j9265j6513j5138j4805j4367j3382j2271j1084
61728H31605r190o661m866m759n415n464n299o350q367r108p193l944j622r26
$$ plain form
61812 918575 910636 903879 899373 897182 896818 898178 901476 906445 912367 918974 926682 935757 945902 957161
61798 957161 970670 987684 1008018 1030292 1053917 1080134 1110504 1144776 1180909 1217154 1253415
61787 1253415 1290304 1327365 1362855 1395271 1424669 1452169 1478181 1501247 1518851 1529485 1533868
61776 1533868 1533901 1530559 1523312 1511818 1497595 1483370 1470892 1460062 1450299 1442124 1436976 1435883 1438814
61763 1438814 1445121 1454010 1464346 1474393 1482248 1486659 1487223 1483602 1474722 1459180 1436633 1408503 1376993
61750 1376993 1343576 1308699 1272677 1236226 1200078 1164667 1130560 1098751 1070015 1043988 1019294
61739 1019294 994787 970698 948430 929165 912652 897514 882709 868342 854960 842689 831605
61728 831605 822415 815754 810888 806129 800714 795250 789951 783601 775234 766126 758933 754989 753367 752441
61714G52441r81r94r53j104j560k226k643k188r74l2%o3R74K814L795L061J697
61697G51064J253J769J890P10j066j871q54J435L647M638M062K369M85p36j140
61682G67655j385k146l117l167j715K62J107L35p85p73L69J437J827K185L067
61667G65156L811L573K864K891L554L455K178J067J048J056j32j620j621k94N38
61652G87524K88K35J019J522R75L37L96K4k066m836n972m940l414k912l425m396
61636G60359n544o415o413n748n347n400m969l611k371k334l029l229k804k605
61622G00540k802k499j250M0J27j153k844l777l281j587J14M29q93k599l260k687
61606F72618j638o28K98Q97P87K45M7K56O4p22q76P02L190M505L638J523l91j495
$$ plain form
61714 752441 751460 750466 749513 748409 746849 744623 741980 739792 738818 738786 738786 738723 739697 742511 746306 749367 751064
61697 751064 752317 754086 755976 756686 755620 753749 752895 754330 757977 762615 766677 769046 769531 768795 767655
61682 767655 766270 764124 761007 757840 756125 756387 757494 757829 757044 756271 756640 758077 759904 762089 765156
61667 765156 768967 772540 775404 778295 781849 785304 787482 788549 789597 790653 790521 788901 787280 786986 787524
61652 787524 787812 788047 789066 790588 791563 791900 792296 792320 790254 785418 779446 774506 771092 768180 764755 760359
61636 760359 754815 748400 741987 736239 730892 725492 720523 716912 714541 712207 709178 705949 703145 700540
61622 700540 697738 695239 693989 694029 694156 693003 690159 686382 683101 681514 681628 682057 681164 678565 675305 672618
61606 672618 670980 670352 670650 671547 672334 672579 672626 672882 672946 672224 671348 672050 675240 679745 683383 684906 684515 683020
61588F83020j780j131M21K086K715K005R73R68K216L532L558K195O38P7N91J291
61572G03375J250K14j286k406k862l315m474n830o038m806l547l578m382m548
61558F57767l802l103l037l194l108k815k387j706r65p28j365k838m907o960p950
61543F08902p377o238o017o788p382p337p381p723p383n891m366m078m790n472
61529E20679n742n704n209m256l545l624m043m150m096m176l873k740j588j445
61515D66488j863j639r17q95j522j367j58L40j067k993l284j907o66n88r69q71
61499D46122m00j70k54j28O34J811K710K878K674K755L033K661J421M13P02J689
61483D68551J813P25k14J49J295J907J538P26Nm23k85O63K016K792K382J118j80
$$ plain form
61588 683020 681240 680109 680530 682616 685331 687336 688309 689277 691493 695025 698583 700778 701416 701493 702084 703375
61572 703375 704625 704839 703553 701147 698285 694970 690496 684666 678628 673822 670275 666697 662315 657767
61558 657767 653965 650862 647825 644631 641523 638708 636321 634615 633650 632922 631557 628719 623812 616852 608902
61543 608902 601525 595287 589270 582482 575100 567763 560382 552659 545276 539385 535019 530941 526151 520679
61529 520679 514937 509233 504024 499768 496223 492599 488556 484406 480310 476134 472261 469521 467933 466488
61515 466488 464625 462986 462069 461174 459652 458285 458127 458467 457400 454407 451123 449216 448550 447962 446993 446122
61499 446122 445722 445552 445298 445170 445804 447615 450325 453203 455877 458632 461665 464326 465747 466160 466862 468551
61483 468551 470364 471089 470875 471024 472319 474226 475764 476490 476495 476072 475787 476450 478466 481258 483640 484758 484578
61466D84578r27j013p65p72j416k350k806k581k334k575k720j777J72J703J576
61451D65993J99p58j93J301K285K116J301L24r86k571l460k888j598r02p26P0
61435D59507J547K400K203K168K870K948J410k89k92P04O46m18m70J048K345K119
61419D80446J184N71Jq06j053k58O50Q12Q59J613K478K393J567R93Q71O88L09
61402D93318q2o05j268j438o87K92O05M09L36K78j64n36j07Q24J387J508J681
61385D95751J709J002n9m03J85J016J877L124M394M749M338M478N582O347N651
61370E39741M177L272L025K404R51m73o25O36J956J913R70J206L385N330M642
61355E72510K304J490L054M532M023K679K158J912P05q55j431j400k086l210l381
$$ plain form
61466 484578 483651 482638 481873 481101 479685 477335 474529 471948 469614 467039 464319 462542 462714 464417 465993
61451 465993 466192 465434 465241 466542 468827 470943 472244 472568 471582 469011 465551 462663 461065 460163 459437 459507
61435 459507 461054 463454 465657 467825 470695 473643 475053 474764 474472 475176 475822 475404 474934 475982 478327 480446
61419 480446 481630 482201 482202 481396 480343 480085 480735 481547 482406 484019 486497 488890 490457 491450 492321 493009 493318
61402 493318 493236 492631 491363 489925 489238 489530 490135 490544 490880 491158 490994 490458 490351 491175 492562 494070 495751
61385 495751 497460 498462 498403 498000 498185 499201 501078 504202 508596 513345 517683 522161 527743 534090 539741
61370 539741 543918 547190 550215 552619 553570 553097 552472 553108 555064 556977 557947 559153 562538 567868 572510
61355 572510 574814 576304 579358 583890 587913 590592 592750 594662 595367 594512 593081 591681 589595 586385 583004
61340E83004k730k890m183m830l645j819j040j125p01N02J294Q22k07m71K75R66
61324E63222P02nJP72J129M29m77n87j37J63M53J208J998K041J659J870K689L141
61306E80271K910K723K893K920K850L613N419P018P296O647O060N751N508N509
61292F47388N968O628P366Q578J0156J0929J0035Q266O990O358N621M713M327
61279G43323M636N079N371N738O228O520O311N346L418J068l70m14m31j709l229
61264G86885l096j727j424k697l253j330J989M763O617P843P844O246M486M466
61250H17612O208Q202R574J0551J1302J1764J2299J3183J3690J2805J0672Q220
61238I46082N761L134R00r2k60r65k562m077n026o128p843r413r976r707r370
$$ plain form
61340 583004 580274 577384 573201 568371 564726 562907 561867 560742 560041 560543 561837 562659 562452 561981 562256 563222
61324 563222 563924 563919 563920 564692 565821 566250 565773 565186 565049 565212 565665 566873 568871 570912 572571 574441 577130 580271
61306 580271 583181 585904 588797 591717 594567 598180 603599 610617 617913 624560 630620 636371 641879 647388
61292 647388 653356 659984 667350 675928 686084 697013 707048 715314 722304 728662 734283 738996 743323
61279 743323 747959 753038 758409 764147 770375 776895 783206 788552 791970 793038 792668 792254 791823 790114 786885
61264 786885 783789 782062 780638 777941 774688 773358 775347 780110 786727 794570 802414 808660 813146 817612
61250 817612 823820 832022 841596 852147 863449 875213 887512 900695 914385 927190 937862 946082
61238 946082 951843 954977 955877 955785 955525 954560 951998 947921 942895 936767 928924 919511 909535 899828 890458
61223H90458r414r882j0436j0271q773o484m606l420k214q06K11R18K316M448
61209H32045N746N303M399M585N419N676N807P287R859J1446J0994R776R303R391
61195I37036R001P898O556N244M191M077N257O738O972N681M013K833J752K83
61181A007532j015j352j021r88j508k127k883m293o049o893o243m929l734k220
61167I62277J58K718M354M950N037M668L782L108L581N123P016Q921J0454J0538
61153A036685Q800O987P149Q583Q716O975N538N693N908M691L258L587N198N871
61139A123639M876L852M628P402J1007J4084J5947J6802J7124J6872J5716J3851
61127A265800J1771R358O416M033L767N055N266L130M62o64p96j669l286m251
$$ plain form
61223 890458 881044 871162 860726 850455 841682 835198 830592 827172 824958 824152 824363 825281 827597 832045
61209 832045 837791 843094 847493 852078 857497 863173 868980 876267 886126 897572 908566 918342 927645 937036
61195 937036 946037 953935 960491 965735 969926 974003 979260 985998 992970 998651 1002664 1005497 1007249 1007532
61181 1007532 1006517 1005165 1004144 1003156 1001648 999521 996638 992345 986296 979403 973160 968231 964497 962277
61167 962277 962435 965153 969507 974457 979494 984162 987944 991052 994633 999756 1006772 1015693 1026147 1036685
61153 1036685 1045485 1052472 1059621 1068204 1076920 1083895 1089433 1095126 1101034 1105725 1108983 1112570 1117768 1123639
61139 1123639 1128515 1132367 1136995 1144397 1155404 1169488 1185435 1202237 1219361 1236233 1251949 1265800
61127 1265800 1277571 1286929 1293345 1297378 1301145 1306200 1311466 1314596 1315058 1314394 1313598 1311929 1308643 1304392
61113A304392m102l597l314l425m314o079p826q718r095r511r508q671q068r005
61099A209159j1025j2701j3733j4604j4795j3332j0865r218q801q195o539m646
61087A080705l511l137l299m135n517o789p469p559p184o630o392o465o015m694
61073A001909l437k908k058J83K787M183M958O732R008R981J0106J1712J4816
61060A067972J6623J6114J5993J8481K2110K4633K6572K9352L2063L2859L2286
61049A335058L2355L3065L2494L0140K7828K7049K7289K7232K6181K3917K0489
61038A643097J6441J2281P594J777m333q760j0740j1729j3491j5969j7731j8040
61026A580397j7743j8150j9539k0999k1552k1118k0302j9450j8431j7248j6359
$$ plain form
61113 1304392 1300290 1296693 1293379 1289954 1285640 1279561 1271735 1263017 1253922 1244411 1234903 1226232 1218164 1209159
61099 1209159 1198134 1185433 1171700 1157096 1142301 1128969 1118104 1108886 1100085 1091890 1085351 1080705
61087 1080705 1077194 1074057 1070758 1066623 1061106 1054317 1046848 1039289 1032105 1025475 1019083 1012618 1006603 1001909
61073 1001909 998472 995564 993506 993689 996476 1000659 1005617 1012349 1021357 1031338 1041444 1053156 1067972
61060 1067972 1084595 1100709 1116702 1135183 1157293 1181926 1208498 1237850 1269913 1302772 1335058
61049 1335058 1367413 1400478 1432972 1463112 1490940 1517989 1545278 1572510 1598691 1622608 1643097
61038 1643097 1659538 1671819 1679413 1681190 1676857 1668097 1657357 1645628 1632137 1616168 1598437 1580397
61026 1580397 1562654 1544504 1524965 1503966 1482414 1461296 1440994 1421544 1403113 1385865 1369506
61015A369506j6075j5945j5138j3339j1067r053p354n253k148J527M743P232R641
61002A297277J2153J3983J4926J6352J9324K2650K4463K5185K7003L0473L3787
60991A537576L5808L7752M0951M4835M8345N1917N6491O1616O6088O9914P4236
60980B125529P9681Q5907R2567R9667J07000J14112J20978J27999J35196J41834
60970C230470J47163J51555J56678J64212J74354J86058J98981K14209K32333
60961D856013K51937K71468K92004L16597L47370L85085M31113M87908N57961
60952H197456O44184P50243Q77189J020365J173728J337417J516916J715243J931012
60943A9163753K158711K370216K484296K377138J966898J311585O10078Q1394
$$ plain form
61015 1369506 1353431 1337486 1322348 1309009 1297942 1288889 1281535 1276282 1274134 1275661 1280404 1287636 1297277
61002 1297277 1309430 1323413 1338339 1354691 1374015 1396665 1421128 1446313 1473316 1503789 1537576
60991 1537576 1573384 1611136 1652087 1696922 1745267 1797184 1853675 1915291 1981379 2051293 2125529
60980 2125529 2205210 2291117 2383684 2483351 2590351 2704463 2825441 2953440 3088636 3230470
60970 3230470 3377633 3529188 3685866 3850078 4024432 4210490 4409471 4623680 4856013
60961 4856013 5107950 5379418 5671422 5988019 6335389 6720474 7151587 7639495 8197456
60952 8197456 8841640 9591883 10469072 11489437 12663165 14000582 15517498 17232741 19163753
60943 19163753 21322464 23692680 26176976 28554114 30521012 31832597 32442675 32524069
60935C2524069j68244j68852j0456K17321M09164M20703J26448m72130j211228
60926C1666795j859607k260094k392973k332198k167489j963338j757936j570558
60918A5362602j405245j257751j124524j004810q97024p98561p09307o31401n64943
60909F969036n06954m54963m08919l69029l34117l02840k74660k49048k25383
60900C843123k03804j84557j66532j48348j30968j17135j07778j00908r4471q8187
60890B500435q1948p4690o6171n8078n1864m6816m1597l6387l2069k8347k4353
60879A958115k0529j8101j6916j5296j2399r492q296q691q847p427n034l187k279
60866A821621j221P98L048M333M734N342O585P766Q256Q176P669O350L873N46
$$ plain form
60935 32524069 32355825 32186973 32176517 32393838 32803002 33223705 33350153 32878023 31666795
60926 31666795 29807188 27547094 25154121 22821923 20654434 18691096 16933160 15362602
60918 15362602 13957357 12699606 11575082 10570272 9673248 8874687 8165380 7533979 6969036
60909 6969036 6462082 6007119 5598200 5229171 4895054 4592214 4317554 4068506 3843123
60900 3843123 3639319 3454762 3288230 3139882 3008914 2891779 2784001 2683093 2588622 2500435
60890 2500435 2418487 2343797 2277626 2219548 2167684 2120868 2079271 2042884 2010815 1982468 1958115
60879 1958115 1937586 1919485 1902569 1887273 1874874 1865382 1857086 1848395 1839548 1832121 1827087 1823900 1821621
60866 1821621 1820400 1821198 1824246 1828579 1833313 1838655 1845240 1853006 1861262 1869438 1877107 1883457 1887330 1887876
60852A887876l030o570j0184j3943j7487k0037k1101k1323k2131k4141k6431k7852
60840A673646k8378k8516k8101k6803k5330k4866k5432k5837k5279k4112k3081
60829A387911k2635k2884k3430k3486k2890k2587k3113k3237k1511j8729j7116
60818A146293j7189j7207j5979j4481j4042j4412j4428j3502j1746r598p956p667
60806I88086q336q488p406n962n334n918p728j0500j2848j2801j0217p530o970
60793H78048p965q498q069p915q775r881j0270r946r532r404r443r258q555p416
60779G53121o210n222m628m641n185n541n077m339m559n800o648o105m851l981
60765F80334l466k664j644j012q75p67l37M87J651K712K864J903Q32P74J577K178
$$ plain form
60852 1887876 1884846 1878276 1868092 1854149 1836662 1816625 1795524 1774201 1752070 1727929 1701498 1673646
60840 1673646 1645268 1616752 1588651 1561848 1536518 1511652 1486220 1460383 1435104 1410992 1387911
60829 1387911 1365276 1342392 1318962 1295476 1272586 1249999 1226886 1203649 1182138 1163409 1146293
60818 1146293 1129104 1111897 1095918 1081437 1067395 1052983 1038555 1025053 1013307 1003709 995753 988086
60806 988086 979750 971262 963856 957894 952560 946642 938914 928414 915566 902765 892548 885018 878048
60793 878048 870083 861585 853516 845601 836826 826945 816675 806729 797197 787793 778350 769092 760537 753121
60779 753121 746911 741689 737061 732420 727235 721694 716617 712278 707719 701919 695271 689166 684315 680334
60765 680334 676868 674204 672560 671548 670673 669906 669569 670056 671707 674419 677283 679186 680018 680792 682369 684547
60749F84547K029J500J049P58O79Q94J086O50l67q57L07K708M275L105m53l989
60733F97921n478n256n120n931o808o595n382m317m307n076n320m079k077j227
60719F30948k292l785m024l384l247l490k975k163k927n335o850n747l421k111
60705E79197j908j552q03k79J96J334K931M068M431M283L602K482J850K459L504
60690F05795L650L206L784N765P548P675O468N076L898K612J061n47k048l464
60676F50479m891o289p259p287o560o231p228q895r576q589o974o103o122o197
60662E52278n807n287n166n250m643k785m51O27n37l026m832m759l271j620n82
60647E04889j52q3k94o72p38K8J417K398K161J047P6k37q9K60P95J435K077K876
$$ plain form
60749 684547 686576 688076 689125 689883 690562 691456 692542 693192 692825 691968 692275 694983 699258 702363 701910 697921
60733 697921 692443 687187 682067 676136 669328 662733 657351 653034 648727 643651 638331 634252 632175 630948
60719 630948 628656 624871 620847 617463 614216 610726 607751 605588 602661 597326 590476 584729 581308 579197
60705 579197 577289 575737 574934 574655 574851 576185 579116 583184 587615 591898 595500 597982 599832 602291 605795
60690 605795 609445 612651 616435 622200 629748 637423 643891 648967 652865 655477 656538 655991 653943 650479
60676 650479 645588 639299 632040 624753 618193 611962 604734 595839 586263 577674 570700 564597 558475 552278
60662 552278 546471 541184 536018 530768 526125 523340 522889 523516 522979 519953 515121 510362 507091 505471 504889
60647 504889 504737 504654 504360 503688 502950 502978 504395 506793 508954 510001 510077 509840 509751 510011 510806 512241 514318 517194
60629E17194L867M482M234L724M010M995N601N599N961P050P856P659P137O891
60615E96260O261M749L543M077N792O777O200M728K931P72j298k284k060j791
60601F34657k323l044k861j799j031j472k728l488k930j590o45n02m93j2O83J013
60585F11435P74J4j176k384l004l025l060l324l380l222l493m106l819k194q10
60570E75226j332l172m348l931k416m19J433K029Q14q92j190m7J021J419J916
60555E66111K595K275M89j493k265j745n31R39K044J999R86L26Q01J704K086K091
60539E78412K306K597K443J830J065J90q05j507j460p28K98J306J997K077J726
60524E91747J683K444L619M372M309L744L416L976N448P103Q287R186J0335J1641
$$ plain form
60629 517194 521061 525543 529777 533501 537511 542506 548107 553706 559667 566717 574573 582232 589369 596260
60615 596260 602521 607270 610813 614890 620682 627459 633659 638387 641318 642090 640792 638508 636448 634657
60601 634657 632334 629290 626429 624630 623599 622127 619399 615911 612981 611391 610746 610244 609751 609739 610422 611435
60585 611435 612209 612223 611047 608663 605659 602634 599574 596250 592870 589648 586155 582049 578230 576036 575226
60570 575226 573894 570722 566374 562443 560027 559608 561041 563070 563884 562992 561802 561755 562776 564195 566111
60555 566111 568706 570981 571470 569977 567712 565967 565436 566375 568419 570418 571404 571730 572531 574235 576321 578412
60539 578412 580718 583315 585758 587588 588653 588843 588038 586531 585071 584343 584641 585947 587944 590021 591747
60524 591747 593430 595874 599493 603865 608174 611918 615334 619310 624758 631861 640148 649334 659669 671310
60510F71310J2702J3812J5469J6937J6828J5387J4590J5053J4445J0447M190j046
60498H20124l892n771p894r369q848o557l689q23K084M783O784Q017Q825R529
60484H13303J0599J2819J6494K0549K3224K3775K2866K1223J8776J5399J1688
60473A010715Q283N057J778r23k288k877m120o263p869p838o834o020n300l868
60459I71633j949p51p66j048m48J194L288N370P357R265J1126J3122J5669J9106
60445A052168K3235K7321L0942L4741L9734M5777N1376N5425N8414O1298O3765
60434A544196O4449O2503N7994N0913M0728K7274J1540m733k0053l3793m5946
60423A755072n6236o3576o6959o6986o5709o4338o1971n7438n1642m6809m3721
$$ plain form
60510 671310 684012 697824 713293 730230 747058 762445 777035 792088 806533 816980 821170 820124
60498 820124 816232 810461 802567 793198 784350 777793 774104 773281 775365 780148 786932 794949 803774 813303
60484 813303 823902 836721 853215 873764 896988 920763 943629 964852 983628 999027 1010715
60473 1010715 1018998 1024055 1025833 1024910 1022622 1019745 1015625 1009362 1001493 993655 986821 980801 975501 971633
60459 971633 969684 968933 968167 967119 966671 967865 971153 976523 983880 993145 1004271 1017393 1033062 1052168
60445 1052168 1075403 1102724 1133666 1168407 1208141 1253918 1305294 1360719 1419133 1480431 1544196
60434 1544196 1608645 1671148 1729142 1780055 1820783 1848057 1859597 1854864 1834811 1801018 1755072
60423 1755072 1698836 1635260 1568301 1501315 1435606 1371268 1309297 1251859 1200217 1153408 1109687
60412A109687m1053l7498l3427l0070k8048k7072k6412k5226k2998k0055j7306
60401H00522j5346j4078j3100j2017j0539q834p719p888q932r684r527q730p688
60388F66440o497n327m526m209m205m326m250l548k395j884k642l596l227j834
60374F13974j171j824k428j875r12q77j881k971l345k744j340K26J222J592J715
60359E97361J422K79r89p23J352L257L192J761P38O09N61L14M87J317K217K697
60343F15852K844K809K534K056J592J271J240J780K849L678L500K626K178K654
60329F49463L348L393K996L208M514N985O126M652L057L002M345N359M843L382
60315G07673K377K544L556M623N023M659M312M821N818O021N028L953L803M197
$$ plain form
60412 1109687 1068634 1031136 997709 967639 939591 912519 886107 860881 837883 817828 800522
60401 800522 785176 771098 757998 745981 735442 726608 718889 711001 702069 692385 682858 674128 666440
60388 666440 659943 654616 650090 645881 641676 637350 633100 629552 627157 625273 622631 619035 615808 613974
60374 613974 612803 610979 608551 606676 605764 604887 603006 600035 596690 593946 592606 592832 594054 595646 597361
60359 597361 598783 599062 598073 597350 598702 601959 605151 606912 607650 608259 608820 609134 609621 610938 613155 615852
60343 615852 618696 621505 624039 626095 627687 628958 630198 631978 634827 638505 642005 644631 646809 649463
60329 649463 652811 656204 659200 662408 666922 672907 679033 683685 686742 689744 694089 699448 704291 707673
60315 707673 710050 712594 716150 720773 725796 730455 734767 739588 745406 751427 756455 760408 764211 768408
60301G68408M345M400M863N401N429N395O278Q067R790J0950J1798J2239J1602
60288H68965R782P641N858M211K236r5k685n493p971r060q360o840n796n508n439
60273H41446n239m897m254l266k598l015m124m582l865l071l393m479n007m383
60259G85273l059j418O80L138N276O574P263P920Q969J0731J3343J6350J8962
60246H80002K1027K3105K5178K5960K4145J9874J4394Q683K959k884q967j5197
60234A018279k0785k4357k5144k3715k1120j7914j4462j1471r344p697o391o207
60222H29672p352q214p111m744l200k947k632j786j631k843m266m611l938k862
60208G71535j633o11l90p77q99p93j510l093l965l205j977j639j831j597j134
$$ plain form
60301 768408 772753 777153 782016 787417 792846 798241 804519 812586 822376 833326 845124 857363 868965
60288 868965 878747 886388 892246 896457 898693 898598 895913 890420 882449 873389 865029 858189 852393 846885 841446
60273 841446 836207 831310 827056 823790 821192 818177 814053 809471 805606 802535 799142 794663 789656 785273
60259 785273 782214 780796 781476 784614 789890 796464 803727 811647 820616 831347 844690 861040 880002
60246 880002 901029 924134 949312 975272 999417 1019291 1033685 1042368 1045327 1042443 1033476 1018279
60234 1018279 997494 973137 947993 924278 903158 885244 870782 859311 849967 842270 835879 829672
60222 829672 822320 814106 806995 802251 799051 796104 793472 791686 790055 787212 782946 778335 774397 771535
60208 771535 769902 769291 768901 768124 767225 766432 764922 761829 757864 754659 752682 751043 749212 747615 746481
60193G46481j071j090o54k42n19r48n77M63J377J976K401K358J840J836K909L837
60177G60377L196J742J418K368K804J873P19L44J41o07j225p01O21J568J828K167
60161G78633L014L719L602L196L736N352O540O093M946N000O385P334P012O806
60147H51368Q006R673J0055Q955P390N921M824M959O786Q988R785R299Q932Q799
60133I63740P593N116K992K374K473J959O04j037k447l180k986k463k680l854
60119I68204n150o048o837p553p565o678n647n061m716m493m810n506n447m175
60105H88518l043l508m817m711k366M22J233l86k677l635k930j835j434j349n54
60090H56928R15J815J345K33j33P96K404L714M195M022L881M314N215N972O175
$$ plain form
60193 746481 745410 744320 743666 743424 742905 741957 741380 741843 743220 745196 747597 749955 751795 753631 756540 760377
60177 760377 763573 765315 766733 769101 771905 773778 774497 774841 774982 774375 773150 772449 773070 774638 776466 778633
60161 778633 781647 785366 788968 792164 795900 801252 807792 813885 818831 823831 830216 837550 844562 851368
60147 851368 859374 869047 879102 888057 895447 901368 906192 911151 917937 926925 936710 946009 954941 963740
60133 963740 971333 976449 979441 981815 984288 986247 986851 985814 983367 980187 977201 974738 972058 968204
60119 968204 963054 957006 950169 942616 935051 928373 922726 917665 912949 908456 903646 898140 892693 888518
60105 888518 885475 881967 877150 872439 870073 870495 871728 871342 868665 865030 862100 860265 858831 857482 856928
60090 856928 857843 859658 861003 861236 861103 861899 864303 868017 872212 876234 880115 884429 889644 895616 901791
60075I01791N992N966O528P490P918P007N334M535N140N494L960J506O90K324
60061I71675M657N928O131N807M745K833R47o5m57p25n44M11J320J103O9l69N12
60044A003978K016K984K689J012j574m165o087p300p840p330n624l484j859q68
60030I66548k59m10j703l140l037j394k75j215l344m834n193m949m040k135l17
60015I30303n69l085n458n565m263m023n631p594q533q595q264p330n841m971
60001H50581n748p391q125p382o255n735n492m764l707l238l748m504m424l257
59987G76811j787q26j66J145L518O220Q168Q860Q338O861N073L968M033M580M447
59972H39243L322J888Q78L75j29j268l188n082n751m978l925l709m170m627n128
$$ plain form
60075 901791 907783 913749 920277 927767 935685 942692 948026 952561 957701 963195 967155 968661 969351 971675
60061 971675 976332 982260 988391 994198 998943 1001776 1002723 1002658 1002201 1001476 1000932 1001343 1002663 1003766 1003835 1003466 1003978
60044 1003978 1005994 1008978 1011667 1012679 1011105 1006940 1000853 993553 985713 978383 972759 969275 967416 966548
60030 966548 966289 965879 964176 961036 957999 956605 956330 955115 951771 946937 941744 936795 932755 930620 930303
60015 930303 929734 926649 921191 915626 911363 907340 901709 894115 885582 876987 868723 861393 855552 850581
60001 850581 844833 837442 829317 821935 815680 809945 804453 799689 795982 792744 788996 784492 780068 776811
59987 776811 775024 774198 774032 775177 778695 784915 793083 801943 810281 817142 822215 826183 830216 834796 839243
59972 839243 842565 844453 845331 845706 845577 844309 841121 836039 830288 825310 821385 817676 813506 808879 803751
59957H03751o022o828o787o254o351p228p774p250o116n100m475m471n320o426
59943G17349o491n079l312k443k406k334j948j742k147k959l426k713o74J662
59929F81337K922K809K232J974J976K068K482L173L465K944K041J185J73j016
59915G09765j563q66L18P50L28j30m03j025j914j982n71J364K092Q67j419l116
59899G02495l190j975p36m21q66j241j111p15m07k34k15n66j336j989j725k95
59883F85473J610K857K825J873J037J154K126K997K960K352K267L002L353K196
59869G18082L86N5J833L903M412L845M018N414O778P105O832O874P398P915P978
59854G92828P539O944O642O556N987M514K723J409M67o32j641j893j623j744k309
$$ plain form
59957 803751 797729 790901 784114 777860 771509 764281 756507 749257 743141 738041 733566 729095 723775 717349
59943 717349 710858 705779 702467 700024 697618 695284 693336 691594 689447 686488 683062 680349 679675 681337
59929 681337 684259 687068 689300 691274 693250 695318 697800 700973 704438 707382 709423 710608 710781 709765
59915 709765 708202 707336 707654 708404 708732 708602 708199 707174 705260 703278 702707 704071 706163 707030 705611 702495
59899 702495 699305 697330 696594 696173 695307 694066 692955 692240 691833 691599 691384 690818 689482 687493 685768 685473
59883 685473 687083 689940 692765 694638 695675 696829 698955 701952 704912 707264 709531 712533 715886 718082
59869 718082 718468 718523 720356 724259 728671 732516 736534 741948 748726 755831 762663 769537 776935 784850 792828
59854 792828 800367 807311 813953 820509 826496 831010 833733 835142 835609 834977 833336 831443 829820 828076 825767
59839H25767k445j981j733j865j410p6R56R85J258L056N360O054M997M221N091
59824H48235O778P876Q154Q075P557O243M572L690M252N735O983P129N973L852
59810I35104J327j164l461n433o529o049m165k237j367q63P89L410M755L468J165
59795I18750M95J978M115N989P734Q686P163L018j206k940k396j600j403r02L37
59780I47818Q66j116n369r378j0667r225p343p030q032q635p927o470n061l787
59766H58644k455j210m56n64j617l062l849l574l131l392l620k506m28P87N05
59751H30072k5j1m34k081l821m177l561l524m438n203m956m049l457l879n175
59736G81281o195n678l804k266k268l061l145k178r68k06j04o87j544j723p68
$$ plain form
59839 825767 823322 821341 819608 817743 816333 816257 817213 818198 819456 822512 827872 833926 838923 843144 848235
59824 848235 855013 862889 871043 879118 886675 892918 897490 901180 905432 911167 918150 925279 931252 935104
59810 935104 936431 935267 931806 926373 919844 913795 909630 907393 906026 905163 905952 909362 914117 917585 918750
59795 918750 919245 921223 925338 931327 939061 947747 954910 957928 956722 953782 951386 949786 948383 947481 947818
59780 947818 948684 947568 942199 932821 922154 912929 905586 898556 890524 881889 873962 867492 862431 858644
59766 858644 856189 854979 854523 853959 852342 849280 845431 841857 838726 835334 831714 829208 828780 829567 830072
59751 830072 830047 830036 829602 827521 823700 819523 815962 812438 808000 802797 797841 793792 790335 786456 781281
59736 781281 775086 769408 765604 763338 761070 758009 754864 752686 751718 751512 751408 750721 749177 747454 746686
59721G46686M99J032R57J155J867K567K858K572J299j088l517m231k508N98L244
59706G53990M190L476K290K026L016M197M290L034J167l15o53L01J808K868L400
59691G89085M052M686M208K512J284J842L200L604L132L251M357N366N561N292
59677H41432M830L806K170O83Q3L45Q52R23L27k51K52J709K459J467J6L1J278
59660H62412J802Q70k27l51O4J06m02j238k167k587j908o99l65j213j928j548
59644H50621q38q69j224o99P43J863J874J391J455K215K969L251L448M081M745
59629H75026M335K541M68o50q83j091j541j781j609j326j164j200j627k430k987
59614H64081k855k703l523n071o081n975n386n016m969n237n687n583m284k538
$$ plain form
59721 746686 747185 748217 749174 750329 752196 754763 757621 760193 761492 760404 756887 752656 750148 750746 753990
59706 753990 758180 761656 763946 765972 768988 773185 777475 780509 781676 781361 780708 781009 782817 785685 789085
59691 789085 793137 797823 802031 804543 805827 807669 810869 814473 817605 820856 825213 830579 836140 841432
59677 841432 846262 850068 852238 852921 853004 853349 854201 855124 855451 855200 855452 857161 859620 861087 861103 861134 862412
59660 862412 864214 865084 864857 864506 864570 864676 864274 863036 860869 858282 856374 855675 855310 854097 852169 850621
59644 850621 849783 848914 847690 846991 847734 849597 851471 852862 854317 856532 859501 862752 866200 870281 875026
59629 875026 879361 881902 882370 881720 880837 879746 878205 876424 874815 873489 872325 871125 869498 867068 864081
59614 864081 861226 858523 855000 849929 843848 837873 832487 827471 822502 817265 811578 805995 801711 799173
59600G99173j831k196k036n75R38J212P94R53J799K619L353M425N538N836N094
59585H25096L837K370N60j405k707k607j236K43K95j623m134m963l396j150k42
59570H08938o84j107r66r27j263j292p16l41q98j925k532k688l041l774m388m499
59554G77897m188l637k887k088j428o92N10J925K536J735K17q37j083r95p84j82
59538G66019P47J426J599J612J608J171K76j32Q26K672L974L818K401M76j193
59523G87300k026j976j813k504m068n358n231l831k508k351k957l044k257j602
59509G45774j576q36J897N131N710K931k55j086k68q9q10r12m8N68N99J297L209
59492G61236M843M627L167K538L769N799O792O135N089N487P783J0654J2659J3896
$$ plain form
59600 799173 797342 795146 793110 792535 793473 794685 795479 796432 798231 800850 804203 808628 814166 820002 825096
59585 825096 828933 831303 831863 830458 827751 825144 823908 824151 824446 822823 818689 813726 810330 809180 808938
59570 808938 808254 807147 806181 805254 803991 802699 801983 801642 800744 798819 796287 793599 790558 786784 782396 777897
59554 777897 773709 770072 767185 765097 763669 762977 763487 765412 767948 769683 769900 769063 767980 766985 766201 766019
59538 766019 766766 768192 769791 771403 773011 774182 774458 774326 775152 777824 781798 785616 788017 788493 787300
59523 787300 785274 783298 781485 778981 774913 769555 764324 760493 757985 755634 752677 749633 747376 745774
59509 745774 744198 743362 745259 750390 756100 759031 758776 757690 757422 757333 756523 755611 755563 756131 756730 758027 761236
59492 761236 766079 770706 773873 776411 780180 785979 792771 798906 803995 809482 817265 827919 840578 854474
59478H54474J5586J8347K1252K2371J9918J3445M588l652q879j0590r659p370
59466I29831n135l962l453k241j40J302J277J302K811M439L806J209q29j424k302
59451I26491m607p001p839p515p526q352r236r346q413o813n354m551m091l589
59437H32258l493m239m990m608l611l496m083l483j142R55J073J29J18J426K906
59422H05720L802M369N018N845O809P813Q724R446R723Q987P022M621K771J473
59408H92143L06k43N86K034K399J546J225K433M164N230N720N977N820N593O318
59393I41251P887Q654P979P501Q637J0331J0888J0699J1216J2163J1694Q928M731
59380A062559K86l748o862q792r881j0363r644p332m636l525m546o379p443p075
$$ plain form
59478 854474 870060 888407 909659 932030 951948 965393 969981 966329 957450 946860 937201 929831
59466 929831 924696 920734 917281 915040 914900 916202 917479 918781 921592 926031 929837 931046 930217 928793 926491
59451 926491 921884 914883 907044 899529 892003 883651 874415 865069 856656 849843 844489 839938 835847 832258
59437 832258 828765 824526 819536 814928 811317 807821 803738 800255 799113 800068 801141 801270 801388 802814 805720
59422 805720 809522 813891 818909 824754 831563 839376 848100 857546 867269 876256 883278 887899 890670 892143
59408 892143 892449 892206 892792 894826 897225 898771 899996 902429 906593 911823 917543 923520 929340 934933 941251
59393 941251 949138 957792 965771 973272 981909 992240 1003128 1013827 1025043 1037206 1048900 1057828 1062559
59380 1062559 1062845 1059097 1052235 1043443 1033562 1023199 1013555 1006223 1001587 998062 993516 987137 979694 972619
59366I72619n298k450P17L298M965O243Q039J0895J4441J7620J9775K1405K3412
59353A095681K6015K9174L3287L7676L8733L2159J8083K126r766j5988j8036j7068
59341A252076j3637q972l941K112R054J3211R804j605j6133k8176l5325l7800
59329A140668l6417l2294k7163k2607j9112j6159j2983r372o133m462m346m232
59317I45388k972j371p15o54O5J409K189K202K489L530M709N644O497O808N711
59302I80929L786L152M983Q013J0227J0940J0624R752Q816Q674R861J1840J3600
59289A095197J4750J5521J6028J6074J5568J4790J4211J4197J4776J5563J5855
59278A262530J4902J2258Q348M652K601J920P89j872n011p055q065r165j0570
$$ plain form
59366 972619 967321 964871 965588 968886 973851 980094 988133 999028 1013469 1031089 1050864 1072269 1095681
59353 1095681 1121696 1150870 1184157 1221833 1260566 1292725 1310808 1312934 1303168 1287180 1269144 1252076
59341 1252076 1238439 1229467 1225526 1227638 1236692 1249903 1259707 1258102 1241969 1213793 1178468 1140668
59329 1140668 1104251 1071957 1044794 1022187 1003075 986916 973933 964561 958428 953966 949620 945388
59317 945388 942416 941045 940330 939676 939741 941150 943339 945541 948030 951560 956269 961913 968410 975218 980929
59302 980929 984715 987867 992850 1000863 1011090 1022030 1032654 1042406 1051222 1059896 1069757 1081597 1095197
59289 1095197 1109947 1125468 1141496 1157570 1173138 1187928 1202139 1216336 1231112 1246675 1262530
59278 1262530 1277432 1289690 1298038 1302690 1305291 1307211 1308000 1306128 1301117 1294062 1285997 1276832 1266262
59265A266262j1561j2126j3070j4380j4960j4371j3569j3297j2835j1105q276
59254A126712n502l523k182r98L68K092M151O326Q351J0084J1539J2764J3409
59241A183591J2346Q278J380o058j1457j4371j6268j7932j8274j6240j2978j0956
59229A081061j1115j1827j0966q384n749m403m220m625n576o842p169n496k665
59216I92024n65M67J977M806P673R055R200R308R803J0506J1601J3123J4117J3455
59202A106550J1183Q301N633L624K427J348q84m285o974p527o992p156p810p506
59188A089932o331n752o130o397o236o471p015o392l951r79J078K176K908L401
59174A043841L619L709L539K937K591L521N263N996M931L259K102R99p53k582
$$ plain form
59265 1266262 1254701 1242575 1229505 1215125 1200165 1185794 1172225 1158928 1146093 1134988 1126712
59254 1126712 1121210 1117687 1115505 1114507 1114875 1116967 1121118 1127444 1135795 1145879 1157418 1170182 1183591
59241 1183591 1195937 1204215 1205595 1199537 1188080 1173709 1157441 1139509 1121235 1104995 1092017 1081061
59229 1081061 1069946 1058119 1047153 1038769 1033020 1028617 1024397 1019772 1014196 1007354 1000185 994689 992024
59216 992024 991459 991926 993903 998709 1006382 1015437 1024637 1033945 1043748 1054254 1065855 1078978 1093095 1106550
59202 1106550 1117733 1126034 1131667 1135291 1137718 1139066 1138182 1133897 1126923 1119396 1112404 1105248 1097438 1089932
59188 1089932 1083601 1077849 1071719 1065322 1059086 1052615 1045600 1039208 1035257 1034278 1035356 1037532 1040440 1043841
59174 1043841 1047460 1051169 1054708 1057645 1060236 1063757 1069020 1075016 1079947 1083206 1085308 1086307 1085554 1082972
59160A082972l664m325n158n546m496k476j125j303k372l285l480k815j556n47
59146A040824o51j725k630k509j667r27m55K81J443K258J924Q36K50P64J648J861
59130A041525J093l28j790k338j255O32J302J65p29N79K894L402J732M83J499
59115A048866L626M752M411L496K739K551L380N092O659P255P293P763R032J0732
59101A127647J2178J2406J0566P023L573J806J625J822J677J270O35n35k326m388
59087A174979o328p934q963r136q538p777p516p848q262q303q137q258q685q816
59073A060478q218p252o689o849p304p240o121m167k158m82J263L176M146L238
59059A015821J761K264N171Q135R371R796J0759J1545J0877R372Q509Q252P710
$$ plain form
59160 1082972 1079308 1074983 1069825 1064279 1059783 1057307 1056182 1054879 1052507 1049222 1045742 1042927 1041371 1040824
59146 1040824 1040173 1038448 1035818 1033309 1031642 1030715 1030260 1030541 1031984 1034242 1036166 1037002 1037252 1038016 1039664 1041525
59130 1041525 1042618 1042290 1040500 1038162 1036907 1037539 1038841 1039006 1038277 1038856 1041750 1045152 1046884 1047367 1048866
59115 1048866 1052492 1057244 1061655 1065151 1067890 1070441 1073821 1078913 1085572 1092827 1100120 1107883 1116915 1127647
59101 1127647 1139825 1152231 1162797 1169820 1173393 1175199 1176824 1178646 1180323 1181593 1182228 1181693 1179367 1174979
59087 1174979 1168651 1160717 1151754 1142618 1134080 1126303 1118787 1110939 1102677 1094374 1086237 1077979 1069294 1060478
59073 1060478 1052260 1045008 1038319 1031470 1024166 1016926 1010805 1006638 1004480 1003998 1005261 1008437 1012583 1015821
59059 1015821 1017582 1019846 1025017 1033152 1042523 1052319 1063078 1074623 1085500 1094872 1103381 1111633 1119343
59046A119343P175P325P259N770M022M279O043O187L366j40j792j788j714k070
59032A163265k383k455k405k336k560l316m027l924l491l987n331o038n541n066
59018A110405n774p429r247j0573j0532q778o939p329r587j0599q629n543l817
59005A005629l296k536j646j909l471n088n703n193m055l056k539j669N48L230
58991I69246M056K312q9j366j871k334k132p39P15J180J495K784M234M410L677
58976I85578L389L546L166K338K052K468L069M079N901P642Q017P505P842R485
58962A056077J1228J2272J2917J3063J1921R730Q220Q548R838J0461R910Q803
58950A182988P742O879O149N360M217K651J110M38J275L491O059P839Q525Q673
$$ plain form
59046 1119343 1126518 1133843 1141102 1146872 1150894 1155173 1161216 1167403 1170769 1170629 1168837 1167049 1165335 1163265
59032 1163265 1160882 1158427 1156022 1153686 1151126 1147810 1143783 1139859 1136368 1132381 1127050 1121012 1115471 1110405
59018 1110405 1104631 1097202 1087955 1077382 1066850 1058072 1051133 1043804 1034217 1023618 1014989 1009446 1005629
59005 1005629 1002333 999797 998151 996242 992771 987683 981980 976787 972732 969676 967137 965468 966016 969246
58991 969246 973302 975614 975525 974159 972288 969954 967822 967083 967798 968978 970473 973257 977491 981901 985578
58976 985578 988967 992513 995679 998017 1000069 1002537 1005606 1009685 1015586 1023228 1031245 1038750 1046592 1056077
58962 1056077 1067305 1079577 1092494 1105557 1117478 1127208 1135428 1143976 1153814 1164275 1174185 1182988
58950 1182988 1190730 1197609 1203758 1209118 1213335 1215986 1217096 1217534 1218809 1222300 1228359 1236198 1244723 1253396
58936A253396Q785Q948R293J0088J1123J1738J1781J1876J2358J2605J1870J0217
58924A384078Q320O965O770P711Q715Q670P962P982R045J0147J0937J2242J4140
58911A503684J5364J5547J6258J8550K1058K1975K1502K0806J9901J8359J6951
58900A709955J6651J6832J6241J5122J4519J4152J2876J0734Q618O216K333k731
58888A841518o984r111r502q792p035m771l429l897n598p372q599r240r535r891
58874A737762j0613j1638j2894j4507j6225j7152j6783j5753j4793j3607j1686
58863A582111r531p933o711n346m337m440n077m900l704k362j058Q11L022M344
58849A534889M330M068M691O229Q219J0530J3030J5171J6391J6711J6706J6978
$$ plain form
58936 1253396 1262181 1271129 1280422 1290510 1301633 1313371 1325152 1337028 1349386 1361991 1373861 1384078
58924 1384078 1392398 1399363 1406133 1413844 1422559 1431229 1439191 1447173 1456218 1466365 1477302 1489544 1503684
58911 1503684 1519048 1534595 1550853 1569403 1590461 1612436 1633938 1654744 1674645 1693004 1709955
58900 1709955 1726606 1743438 1759679 1774801 1789320 1803472 1816348 1827082 1835700 1841916 1844249 1841518
58888 1841518 1834534 1825423 1815921 1807129 1800094 1795323 1791894 1787997 1782399 1775027 1766428 1757188 1747653 1737762
58874 1737762 1727149 1715511 1702617 1688110 1671885 1654733 1637950 1622197 1607404 1593797 1582111
58863 1582111 1572580 1564647 1557936 1552590 1548253 1543813 1538736 1533836 1530132 1527770 1526712 1527523 1530545 1534889
58849 1534889 1539219 1543287 1547978 1554207 1562426 1572956 1585986 1601157 1617548 1634259 1650965 1667943
58837A667943J7425J7078J5211J2708J1283J1076J0389Q583P609R199J1927J2990
58825A813421J1963J0677J0005R028P155M935K570l58l449n568o788q645j1923
58812A833023j5695j8909k1420k3029k3117k1984k1168k1531k2143k1815k0677
58801A601535j9476j8265j6819j5664j5746j7237j9148k0060j9107j6686j4362
58790A408965j3579j4361j5451j5588j4309j1927r525q635r946j2319j3787j3524
58778A256014j2196j0744r679r304r566r753r212q194p227n991m043k290k229
58765A155586l641m418l171q20Q04J051O64P46J935L955N571N541L850J713K63
58750A169629l21n45r63j721k299k028j274j530l535n907o666n748m884n266o501
$$ plain form
58837 1667943 1685368 1702446 1717657 1730365 1741648 1752724 1763113 1771696 1779305 1788504 1800431 1813421
58825 1813421 1825384 1836061 1846066 1855094 1862249 1867184 1869754 1869396 1865947 1860379 1853591 1844946 1833023
58812 1833023 1817328 1798419 1776999 1753970 1730853 1708869 1687701 1666170 1644027 1622212 1601535
58801 1601535 1582059 1563794 1546975 1531311 1515565 1498328 1479180 1459120 1440013 1423327 1408965
58790 1408965 1395386 1381025 1365574 1349986 1335677 1323750 1314225 1305590 1295644 1283325 1269538 1256014
58778 1256014 1243818 1233074 1223395 1214091 1204525 1194772 1185560 1177366 1170139 1164148 1160105 1157815 1155586
58765 1155586 1151945 1147527 1144356 1143536 1144340 1145391 1146055 1146801 1148736 1152691 1158262 1163803 1167653 1169366 1169629
58750 1169629 1169308 1168763 1167800 1166079 1163780 1161752 1160478 1158948 1155413 1149506 1142840 1137092 1132208 1126942 1120441
58735A120441p761q776r509r777r421q334o566m851m364n123n339l584r62K98
58721A036372n9k69O25J581J535R22O84Q38O81l11k160m354n997o405n701m573
58705A013409l688l520m059m311l108r76m7j141k361j850n49m19j246j364p19
58690I84051p61j640j881p54J018K844M660N838N679M899M804N222N182N273O982
58675A031416R749J1168J0432R284R041Q970Q249P465P340P685Q264R074R373
58662A147510Q161N952M386L825L257K685L403N523P439Q297Q828R138Q091N715
58648A232210L966M002M630M363L128J105j975n498q044r741j2356j6133j8866
58635A180791j9371j9319k0079k0155j7947j4891j3526j3946j4402j4205j3935
$$ plain form
58735 1120441 1112680 1103904 1094395 1084618 1075197 1066863 1060297 1055446 1051082 1045959 1040620 1037036 1036074 1036372
58721 1036372 1036313 1036044 1036669 1038250 1039785 1040707 1041391 1042229 1042910 1042599 1040439 1036085 1030088 1023683 1017982 1013409
58705 1013409 1009721 1006201 1002142 997831 994723 993747 993700 992559 990198 988348 987799 987380 986134 984770 984051
58690 984051 983290 981650 979769 979015 980033 982877 987537 993375 999054 1003953 1008757 1013979 1019161 1024434 1031416
58675 1031416 1041165 1052333 1062765 1072049 1081090 1090060 1098309 1105774 1113114 1120799 1129063 1138137 1147510
58662 1147510 1155671 1161623 1166009 1169834 1173091 1175776 1179179 1184702 1192141 1200438 1209266 1218404 1226495 1232210
58648 1232210 1236176 1240178 1244808 1249171 1252299 1253404 1251429 1245931 1237887 1228146 1215790 1199657 1180791
58635 1180791 1161420 1142101 1122022 1101867 1083920 1069029 1055503 1041557 1027155 1012950 999015
58624I99015j3598j2551j0654q176n356l132l110n511q143q779p492n522l149
58611I03842j56K737M428M766M288L593L715N677Q594R848Q418O362N560M866
58597I76538K577j08p25L50L12j966m657n860n618m824l942l358l547m342m863
58582I35967m526l515k332j494j510k460l639m146l677k426o56J311L154M837
58568I14888O281O750N493L224J808J986K547K245J407R52R99J199J490J774J739
58553I54782J676K481M246N889O690P049P160O318M343K387J367P66o1n40J21
58538A004674J458K291K055J021j05m62K83J250J331Q45R30J506J597J677L470
58523A023821O994J0035J1304J1950J3078J3925J3610J2682J1818J0861J0072
$$ plain form
58624 999015 985417 972866 962212 954036 948680 945548 942438 936927 928784 920005 912513 906991 903842
58611 903842 903686 906423 910851 915617 919905 923498 927213 932890 941484 951332 959750 966112 971672 976538
58597 976538 979115 979007 978282 978632 978944 976978 972321 966461 960843 956019 952077 948719 945172 940830 935967
58582 935967 931441 927926 925594 924100 922590 920130 916491 912345 908668 906242 905586 906897 910051 914888
58568 914888 921169 927919 933412 936636 938444 940430 942977 945222 946629 947581 948580 949779 951269 953043 954782
58553 954782 956458 958939 963185 969074 975764 982813 989973 996291 1000634 1003021 1004388 1005154 1005093 1004553 1004674
58538 1004674 1006132 1008423 1010478 1011499 1011394 1010932 1011215 1012465 1013796 1014641 1015571 1017077 1018674 1020351 1023821
58523 1023821 1030815 1040850 1052154 1064104 1077182 1091107 1104717 1117399 1129217 1140078 1150150
58512A150150J0398J1465J1545J0484J0383J2290J4670J6418J8622K1668K3482
58501A311575K2897K2166K3597K5897K6572K5928K5767K5598K3240J8356J2856
58490A564449Q344N160L255K122N13k291n523q112r700r940q651p535r341j4082
58476A508668j8457k0401k1423k2807k2904k0580j8245j8206j8751j7166j4355
58465A295373j2908j2600j1479r689q598p617n405l033k476l153l098k442k517
58452A210358k820k145j419k104l070k517j530k230l759l915l332l927m531k609
58438A170450N21R82j436l027k063m12Q83K964N403N688L677K508L763N366N682
58423A200949O075P883R964J1022J1767J3214J4999J6510J7605J7623J5849J3413
$$ plain form
58512 1150150 1160548 1172013 1183558 1194042 1204425 1216715 1231385 1247803 1266425 1288093 1311575
58501 1311575 1334472 1356638 1380235 1406132 1432704 1458632 1484399 1509997 1533237 1551593 1564449
58490 1564449 1572793 1577953 1581208 1583330 1583843 1581552 1576029 1567917 1558217 1548277 1539626 1532091 1522750 1508668
58476 1508668 1490211 1469810 1448387 1425580 1402676 1382096 1363851 1345645 1326894 1309728 1295373
58465 1295373 1282465 1269865 1258386 1248697 1240099 1232482 1227077 1224044 1221568 1218415 1215317 1212875 1210358
58452 1210358 1207538 1205393 1203974 1201870 1198800 1196283 1194753 1192523 1188764 1184849 1181517 1177590 1173059 1170450
58438 1170450 1170971 1171953 1170517 1167490 1165427 1165015 1165898 1168862 1174265 1179953 1183630 1186138 1189901 1195267 1200949
58423 1200949 1207024 1214907 1224871 1235893 1247660 1260874 1275873 1292383 1309988 1327611 1343460 1356873
58411A356873J2348J2405J1291Q320N203K882M09k525m731n793o493o449m183
58398A379557j83K848L591L462L746M118M642O388R065J0633J0193Q933P459M786
58384A459238P96k842n247p383r565j0272q702o450n401n593n981n810m611k338
58370A379839L8J500K472L904N354N931O465Q335J0697J1523J1030J1128J1825
58357A470041J1259R252P592O605M745J942J19k13q83k884n058o438p153o737
58343A482189m452j705j020k162k203oK319L015K735K530K569L300N093O525N925
58328A504652M533M963O684O777N174N092P677J0252J0739R931Q569O084L331
58315A594458K817M898P112Q165R144J0194R916Q871R576J2002J3175J2351J2325
$$ plain form
58411 1356873 1369221 1381626 1392917 1401237 1406440 1409322 1409731 1407206 1402475 1396682 1390189 1383740 1379557
58398 1379557 1379374 1382222 1385813 1389275 1393021 1397139 1401781 1408169 1417234 1427867 1438060 1446993 1454452 1459238
58384 1459238 1460034 1457192 1451945 1444562 1434997 1424725 1416023 1409573 1404172 1398579 1392598 1386788 1382177 1379839
58370 1379839 1379877 1381377 1383849 1387753 1393107 1399038 1405503 1413838 1424535 1436058 1447088 1458216 1470041
58357 1470041 1481300 1490552 1498144 1504749 1509494 1511436 1511555 1511342 1510459 1507575 1502517 1496079 1488926 1482189
58343 1482189 1477737 1476032 1475012 1472850 1470647 1470641 1472960 1475975 1478710 1481240 1483809 1487109 1492202 1498727 1504652
58328 1504652 1509185 1514148 1520832 1527609 1532783 1537875 1545552 1555804 1566543 1576474 1585043 1591127 1594458
58315 1594458 1597275 1602173 1609285 1617450 1626594 1636788 1646704 1655575 1665151 1677153 1690328 1702679 1715004
58302A715004J4343J6048J6065J6343J8075J9356J8837J7986J7933J7726J7243
58291A904959J7942J9174J7903J3795J0573J0507J1632J2146J3252J5638J7510
58280B065031J8271J9990K2979K4222K2449K0631K1098K2402K3283K5145K8077
58269B313578K8986K6686K4632K5559K7484K7824K7372K7206K5897K3048K1567
58258B599839K3178K5277K5352K4796K5448K6215K6082K6623K8507K9379K8165
58247B888861K7557K9457L1962L3530L5821L9501M1832M1536M1562M3881M6137
58236C301637M6643M7763N0840N2808N1712N0764N2808N5489N5986N6020N7997
58225C880467O0651O2573O5474P0023P3160P3627P5213Q0340Q5439Q7147Q7996
$$ plain form
58302 1715004 1729347 1745395 1761460 1777803 1795878 1815234 1834071 1852057 1869990 1887716 1904959
58291 1904959 1922901 1942075 1959978 1973773 1984346 1994853 2006485 2018631 2031883 2047521 2065031
58280 2065031 2083302 2103292 2126271 2150493 2172942 2193573 2214671 2237073 2260356 2285501 2313578
58269 2313578 2342564 2369250 2393882 2419441 2446925 2474749 2502121 2529327 2555224 2578272 2599839
58258 2599839 2623017 2648294 2673646 2698442 2723890 2750105 2776187 2802810 2831317 2860696 2888861
58247 2888861 2916418 2945875 2977837 3011367 3047188 3086689 3128521 3170057 3211619 3255500 3301637
58236 3301637 3348280 3396043 3446883 3499691 3551403 3602167 3654975 3710464 3766450 3822470 3880467
58225 3880467 3941118 4003691 4069165 4139188 4212348 4285975 4361188 4441528 4526967 4614114 4702110
58214D702110R1414R6084R9885J04369J10595J15663J18090J21519J28433J35608
58204E823770J40508J46366J55840J65475J71920J77778J85899J93872J99790
58195G361218K07283K18893K30651K39139K47677K59516K71590K81135K91559
58186I608661L05435L19033L30444L45311L67354L91215M12309M35393M65422
58177A2980577M98649N31463N68755O13889O59381O97899P33978P74414Q16125
58168A8875130Q54570Q95047R44045R98240J053442J114621J185118J256790J324146
58159B8501149J397357J487211J588694J694257J810852J946986K095259K246077
58151D2767842K406885K589482K791130L007931L253131L541392L870069M238970
$$ plain form
58214 4702110 4793524 4889608 4989493 5093862 5204457 5320120 5438210 5559729 5688162 5823770
58204 5823770 5964278 6110644 6266484 6431959 6603879 6781657 6967556 7161428 7361218
58195 7361218 7568501 7787394 8018045 8257184 8504861 8764377 9035967 9317102 9608661
58186 9608661 9914096 10233129 10563573 10908884 11276238 11667453 12079762 12515155 12980577
58177 12980577 13479226 14010689 14579444 15193333 15852714 16550613 17284591 18059005 18875130
58168 18875130 19729700 20624747 21568792 22567032 23620474 24735095 25920213 27177003 28501149
58159 28501149 29898506 31385717 32974411 34668668 36479520 38426506 40521765 42767842
58151 42767842 45174727 47764209 50555339 53563270 56816401 60357793 64227862 68466832
58143F8466832M672434N197126N816220O533120P381371Q402112R615899J1048704
58135A27133818J2750421J4736789J6939810J9268646K1693324K4224246K6864736
58128B63611790K9620671L2353448L4310051L3822568K8969302J9066717N648817
58121D47403364q180598j9509937k6932197l0564693l1298282l0158037k8030701
58114B72728919k5553481k3073813k0730461j8584811j6670150j4976902j3470997
58107A39668304j2133447j0952644r895944q926753q039682p248307o548667n922174
58099G0000686n362907m873900m444025m053304l695301l373367l081564k809083
58091C8307235k557106k332754k132093j945948j776175j629809j503075j386936
$$ plain form
58143 68466832 73139266 78336392 84152612 90685732 98067103 106469215 116085114 127133818
58135 127133818 139884239 154621028 171560838 190829484 212522808 236747054 263611790
58128 263611790 293232461 325585909 359895960 393718528 422687830 441754547 447403364
58121 447403364 439222766 419712829 392780632 362215939 330917657 300759620 272728919
58114 272728919 247175438 224101625 203371164 184786353 168116203 153139301 139668304
58107 139668304 127534857 116582213 106686269 97759516 89719834 82471527 75922860 70000686
58099 70000686 64637779 59763879 55319854 51266550 47571249 44197882 41116318 38307235
58091 38307235 35750129 33417375 31285282 29339334 27563159 25933350 24430275 23043339
58083B3043339j282628j196045j122088j049751r78469r15215q59601q05588p54068
58074A4079886p10320o72064o32567n92715n58149n27446m94680m61092m32880
58065H997973m09671l85861l61402l41082l24830l08224k90992k76244k63282
58056F036385k49448k36586k27526k19081k06949j94343j86966j82626j75181
58047D157679j65762j60145j57207j50365j39253j30010j24230j17207j07486
58038B906014r9193r3880q8321q1465p6302p3607p0557o6389o3226o0712n5959
58027B076403m9449m5057m3647m2194l9594l7821l7055l5154l2357l1196l1444
58016A651435l0191k7260k5630k6208k6951k7232k8316k9429k8124k4811k2433
$$ plain form
58083 23043339 21760711 20564666 19442578 18392827 17414358 16499143 15639542 14833954 14079886
58074 14079886 13369566 12697502 12064935 11472220 10914071 10386625 9891945 9430853 8997973
58065 8997973 8588302 8202441 7841039 7499957 7175127 6866903 6575911 6299667 6036385
58056 6036385 5786937 5550351 5322825 5103744 4896795 4702452 4515486 4332860 4157679
58047 4157679 3991917 3831772 3674565 3524200 3384947 3254937 3130707 3013500 2906014
58038 2906014 2806821 2712941 2624620 2543155 2466853 2393246 2322689 2256300 2193074 2132362 2076403
58027 2076403 2026954 1981897 1938250 1896056 1856462 1818641 1781586 1746432 1714075 1682879 1651435
58016 1651435 1621244 1593984 1568354 1542146 1515195 1487963 1459647 1430218 1402094 1377283 1354850
58005A354850k1529k0030j7792j6896j7406j7189j5919j5170j4913j4061j3802
57994A170143j5857j8158j7168j4018j3071j4691j4897j2502j1010j2384j4095
57983A012292j3818j2529j1478j0111q406p760q413r219j0360j2747j4745j3543
57971H79163j0122q508r428r256o315l703m222o562q365r522j0457j0441r489
57958G72773r150r739r415p407n456m817m422l427k980l966n377o227o952p726
57944F85712p494n877m136l311l207l695m878n521l740o2K450K084L59p51j326
57929F46607k199l103l259k571j505p73j125k193k070J94K331J395j959m381m617
57914F20772m415m721m330k960k408l457m250l153j021N79J456K009K074J551
$$ plain form
58005 1354850 1333321 1313291 1295499 1278603 1261197 1244008 1228089 1212919 1198006 1183945 1170143
57994 1170143 1154286 1136128 1118960 1104942 1091871 1077180 1062283 1049781 1038771 1026387 1012292
57983 1012292 998474 985945 974467 964356 955950 948190 939777 930558 920198 907451 892706 879163
57971 879163 869041 860533 851105 841849 835534 831831 827609 821047 812682 803160 792703 782262 772773
57958 772773 763623 753884 744469 737062 731606 726789 722367 718940 715960 711994 706617 700390 693438 685712
57944 685712 678218 672341 668205 664894 661687 657992 653114 647593 643853 643791 646241 648325 648684 647933 646607
57929 646607 644408 641305 638046 635475 633970 633197 632072 629879 627809 628003 630334 631729 629770 625389 620772
57914 620772 616357 611636 607306 604346 601938 598481 594231 591078 590057 590636 592092 594101 596175 597726
57900E97726Q84K76l53n15K91J290J312P08N42M04p69k165j973n10K25q3Q3R20
57882E98293J114Q27J677L393L807K730K485L820M616L817L193L867M267L325
57868F41231K715L926N594N703M264K198l08k767l901l668l691m340l788j500
57854F41668J6j090k954l010j921j985l289m085l882l684l779l358k043m66M92
57839F06630K08j275k886l517l587m262m993m001j570k73j015j577m78M93l74
57824E77523j442m28J709K373J379O77R95J291R48K48p89k129k883k368j457j168
57808E74479q56M43J736J284m07r97M29K260K682J574J1r29o99N12K034L469M694
57791E91719M935L152N1j804j176Lm92j884j955p45k42r43j321p93q56k551m593
$$ plain form
57900 597726 598610 598886 598533 598018 598309 599599 600911 601619 602161 602565 601796 599631 597658 597148 597373 597290 597373 598293
57882 598293 599407 600234 601911 605304 609111 611841 614326 618146 622762 626579 629772 633639 637906 641231
57868 641231 643946 647872 653466 659169 663433 665631 665323 662556 658655 654987 651296 646956 643168 641668
57854 641668 641684 640594 637640 634630 632709 630724 627435 623350 619468 615784 612005 608647 606604 606138 606630
57839 606630 606838 605563 602677 599160 595573 591311 586318 582317 580747 580474 579459 577882 577404 577897 577523
57824 577523 576081 575653 577362 579735 581114 581791 582786 584077 585025 585273 584484 582355 579472 577104 575647 574479
57808 574479 573623 574066 575802 577086 576679 575682 576111 578371 581053 582627 582638 581709 581010 581522 583556 587025 591719
57791 591719 596654 599806 599857 598053 596877 596880 596388 594504 592549 591804 591562 590619 589298 588505 587649 585098 580505
57774E80505m968l297r24N42L15j146k384k135n22J245K252K420J961J034oo52
57758E74240o03J74J460K481K087m9k580l665k933j725j377j896k398k383k143
57743E58690k040j758o96R20J922J617P87N87R78J186J330K303M088N540N961
57728E81415N726N181M150K820J846J274N97J23Q80K666L770L316K459K466L012
57713F21701L278L387L593L283K041P37L89O70N93k1p00j307j949k479k838l257
57697F27121l599l195j915n42L23Q62J155R10N49J160K698L635L311L089M118
57682F39680N345N219M102L600M203N028N211M547L346K509K929M082M198K575
57668F96574N71m18o93r92r90k34O90J055R16K73j209k733k472l85J062N23jJ370
$$ plain form
57774 580505 575537 572240 571316 571858 572173 571027 568643 566508 565986 567231 569483 571903 573864 574898 574892 574240
57758 574240 573637 573811 575271 577752 579839 579790 577210 573545 570612 568887 567510 565614 563216 560833 558690
57743 558690 556650 554892 554196 555116 557038 558655 559442 560029 561007 562193 563523 565826 569914 575454 581415
57728 581415 587141 592322 596472 599292 601138 602412 603009 603132 604012 606678 610448 613764 616223 618689 621701
57713 621701 624979 628366 631959 635242 637283 638020 638409 639079 639672 639651 638951 637644 635695 633216 630378 627121
57697 627121 623522 620327 618412 617870 618193 619055 620210 621120 621669 622829 625527 629162 632473 635562 639680
57682 639680 645025 650244 654346 657946 662149 667177 672388 676935 680281 682790 685719 689801 693999 696574
57668 696574 697145 696727 696034 695042 694052 693818 694508 695563 696479 696752 695543 692810 690338 689953 691015 691538 691537 692907
57650F92907K931J987p90k577k666k509k447j590m42m72j150l53K066L814L748
57635F92457L320L814M467M213L345K523J740R51M79L25K26O63K416M907O366
57620G32212N980M767M230N224P996J1996J5794J8493K1025K4776K9294L3028
57608I14815L5928L9343M3213M5081M2147L3165J8739J489j4352k5442l1588l4285
57596A068253l3901l0321k5482k2242k0749j8792j5845j3769j3064j1764r046
57585H53278o910o643o493m696k385j352j042k4J234J408Q74J016J851K273K050
57570H34439J915K123K331K376K183J559R81J586L388M603L913K321J526J651
57556H66895J885K227K948L383K910K282K354K410J511P39J895M384N604M517
$$ plain form
57650 692907 695838 697825 697035 694458 691792 689283 686836 685246 684804 684332 683182 682829 684895 688709 692457
57635 692457 695777 699591 704058 708271 711616 714139 715879 716830 717309 717634 717860 718523 720939 725846 732212
57620 732212 738192 742959 747189 752413 760409 772405 788199 806692 827717 852493 881787 914815
57608 914815 950743 990086 1033299 1078380 1120527 1153692 1172431 1173920 1159568 1134126 1102538 1068253
57596 1068253 1034352 1004031 978549 956307 935558 916766 900921 887152 874088 862324 853278
57585 853278 846368 839725 833232 828536 826151 824799 823757 823733 824967 826375 827249 828265 830116 832389 834439
57570 834439 836354 838477 840808 843184 845367 846926 847907 849493 852881 857484 861397 863718 865244 866895
57556 866895 868780 871007 873955 877338 880248 882530 884884 887294 888805 889544 891439 895823 901427 905944
57542I05944K892K644L631M570M685L879K452J235J084J794K279K105J966K373
57528I43533K759K479J978K293L737N459O217N474L953L119L788N224N899N126
57514A001038L643K671K764L618M622N409O009O525O813O656O211N913N856N704
57500A073452N316N021N065N300N636O154O505N940M524L648M531O617Q238Q633
57486A154580Q537Q875R575R820R010P401O067O109P608R433J0391J0343J0005
57473A267754R850R691R248Q723Q596Q982R276Q647P057N565N256O043O972P480
57459A379140P630P366O587O033O894R053J0767J0792R922R631J0026J0141R699
57446A493681R362R579J0120J0743J1470J2127J2272J1687J0493Q920P346O439
$$ plain form
57542 905944 908836 911480 915111 919681 924366 928245 930697 931932 933016 934810 937089 939194 941160 943533
57528 943533 946292 948771 950749 953042 956779 962238 968455 973929 977882 981001 984789 990013 995912 1001038
57514 1001038 1004681 1007352 1010116 1013734 1018356 1023765 1029774 1036299 1043112 1049768 1055979 1061892 1067748 1073452
57500 1073452 1078768 1083789 1088854 1094154 1099790 1105944 1112449 1118389 1122913 1126561 1131092 1137709 1145947 1154580
57486 1154580 1163117 1171992 1181567 1191387 1200397 1207798 1213865 1219974 1227582 1237015 1247406 1257749 1267754
57473 1267754 1277604 1287295 1296543 1305266 1313862 1322844 1332120 1340767 1347824 1353389 1358645 1364688 1371660 1379140
57459 1379140 1386770 1394136 1400723 1406756 1413650 1422703 1433470 1444262 1454184 1463815 1473841 1483982 1493681
57446 1493681 1503043 1512622 1522742 1533485 1544955 1557082 1569354 1581041 1591534 1600454 1607800 1614239
57434A614239O695P874R225J0246J0829J0913J0379R394Q519Q389R248J0659J1752
57421A738361J2009J1764J1572J1360J0753J0064R976J0292J0011Q977Q337Q962
57409A862438J0412J1925J3317J4244J3882J2333J1238J1800J3150J3917J4387
57398B003043J5511J6626J6103J4097J2737J3382J5066J6021J5516J3978J2470
57387B164550J2260J3773J5699J6208J5233J4528J5186J6416J7098J7251J7337
57376B335539J7187J6590J6021J6048J6588J7409J8593J9825K0076J8951J7752
57365B530579J8078J9760K1145K1195K0282J9060J7740J6646J6474J7409J8597
57354B736965J9047J8741J8502J9007K0261K1739K2755K2893K2369K1827K1547
$$ plain form
57434 1614239 1620934 1628808 1638033 1648279 1659108 1670021 1680400 1689794 1698313 1706702 1715950 1726609 1738361
57421 1738361 1750370 1762134 1773706 1785066 1795819 1805883 1815859 1826151 1836162 1845139 1853476 1862438
57409 1862438 1872850 1884775 1898092 1912336 1926218 1938551 1949789 1961589 1974739 1988656 2003043
57398 2003043 2018554 2035180 2051283 2065380 2078117 2091499 2106565 2122586 2138102 2152080 2164550
57387 2164550 2176810 2190583 2206282 2222490 2237723 2252251 2267437 2283853 2300951 2318202 2335539
57376 2335539 2352726 2369316 2385337 2401385 2417973 2435382 2453975 2473800 2493876 2512827 2530579
57365 2530579 2548657 2568417 2589562 2610757 2631039 2650099 2667839 2684485 2700959 2718368 2736965
57354 2736965 2756012 2774753 2793255 2812262 2832523 2854262 2877017 2899910 2922279 2944106 2965653
57343B965653K1081K0007J8735J8164J8640J9808K1312K2916K3913K3420K1633
57332C195282K0010J9551J9644J9483J9771K1720K4691K6471K6126K5129K5121
57321C442999K5816K6005K5507K4972K4511K3812K3255K3640K4789K5495K5017
57310C715818K3830K2693K1768K1017K0821K1554K2864K3871K4111K3992K4180
57299C966519K4764K5237K5318K5430K6107K7195K7987K8001K7207K5731K4070
57288D253566K3378K4552K6819K8212K7881K7143K7656K9381L1052L1891L2006
57277D563537L1646L1057L0811L1412L2698L4155L5550L6705L7141L6678L5972
57266D937362L5688L5556L5037L4425L4278L4094L2798L0498K8621K8166K8820
$$ plain form
57343 2965653 2986734 3006741 3025476 3043640 3062280 3082088 3103400 3126316 3150229 3173649 3195282
57332 3195282 3215292 3234843 3254487 3273970 3293741 3315461 3340152 3366623 3392749 3417878 3442999
57321 3442999 3468815 3494820 3520327 3545299 3569810 3593622 3616877 3640517 3665306 3690801 3715818
57310 3715818 3739648 3762341 3784109 3805126 3825947 3847501 3870365 3894236 3918347 3942339 3966519
57299 3966519 3991283 4016520 4041838 4067268 4093375 4120570 4148557 4176558 4203765 4229496 4253566
57288 4253566 4276944 4301496 4328315 4356527 4384408 4411551 4439207 4468588 4499640 4531531 4563537
57277 4563537 4595183 4626240 4657051 4688463 4721161 4755316 4790866 4827571 4864712 4901390 4937362
57266 4937362 4973050 5008606 5043643 5078068 5112346 5146440 5179238 5209736 5238357 5266523 5295343
57255E295343K9909L1179L2289L2563L1745L0361K8948K7570K6435K6240K7314
57244E619896K8899K9869K9960K9800L0029L0749L1690L2517L2984L3095L3168
57233E962656L3498L3799L3195L1127K8407K6817K7124K7845K6935K4600K3242
57222F279245K4229K5893K5703K3438K1068K0075K0256K0873K1723K2860K4281
57211F529644K6076K8229L0165L1168L1266L1221L1682L2756L4073L4802L4099
57200F875181L2268L0842L0672L0597K9134K6832K5382K4948K4038K1929J9381
57189G171204J6889J4166J1745J1216J3041J5724J7959K0125K2781K5319K7319
57178G367488K9819L3805L8452M2273M5022M7152M8385M8489M8720N0575N3369
$$ plain form
57255 5295343 5325252 5356431 5388720 5421283 5453028 5483389 5512337 5539907 5566342 5592582 5619896
57244 5619896 5648795 5678664 5708624 5738424 5768453 5799202 5830892 5863409 5896393 5929488 5962656
57233 5962656 5996154 6029953 6063148 6094275 6122682 6149499 6176623 6204468 6231403 6256003 6279245
57222 6279245 6303474 6329367 6355070 6378508 6399576 6419651 6439907 6460780 6482503 6505363 6529644
57211 6529644 6555720 6583949 6614114 6645282 6676548 6707769 6739451 6772207 6806280 6841082 6875181
57200 6875181 6907449 6938291 6968963 6999560 7028694 7055526 7080908 7105856 7129894 7151823 7171204
57189 7171204 7188093 7202259 7214004 7225220 7238261 7253985 7271944 7292069 7314850 7340169 7367488
57178 7367488 7397307 7431112 7469564 7511837 7556859 7604011 7652396 7700885 7749605 7800180 7853549
57167G853549N4904N4531N3807N3794N3478N1654M9050M7402M7106M6851M5321
57156H411447M2450L9077L6120L4074L2861L1834L0233K7963K5755K4396K3813
57145H760023K3324K2621K2039K1663K0845J9168J7325J6399J6562J7255J8254
57134H975478J9578K0615K0578J9932K0073K1342K2563K2983K3178K3353K2154
57123I211827J8559J3898J0404Q219N204m90q859j8794k9067l8554m6710n4187
57111I071450o2216p1061p9626q6610r1445r4017r4240r1973q6858p8421o7042
57100H167941n4723m3835l5076k7719k1981j9785k2502k9134l7607m6771n5896
57089G772912o3220o6991o7921o8879p1481p4373p5658p5878p7379q1325q6607
$$ plain form
57167 7853549 7908453 7962984 8016791 8070585 8124063 8175717 8224767 8272169 8319275 8366126 8411447
57156 8411447 8453897 8492974 8529094 8563168 8596029 8627863 8658096 8686059 8711814 8736210 8760023
57145 8760023 8783347 8805968 8828007 8849670 8870515 8889683 8907008 8923407 8939969 8957224 8975478
57134 8975478 8995056 9015671 9036249 9056181 9076254 9097596 9120159 9143142 9166320 9189673 9211827
57123 9211827 9230386 9244284 9254688 9262907 9268111 9267621 9258762 9239968 9210901 9172347 9125637 9071450
57111 9071450 9009234 8938173 8858547 8771937 8680492 8586475 8492235 8400262 8313404 8234983 8167941
57100 8167941 8113218 8069383 8034307 8006588 7984607 7964822 7942320 7913186 7875579 7828808 7772912
57089 7772912 7709692 7642701 7574780 7505901 7434420 7360047 7284389 7208511 7131132 7049807 6963200
57078F963200r1470r5131r7793j00278j03837j09342j16110j22239j26614j30077
57068E870309j34275j40154j48052j58399j71244j85496j99571k12786k25576
57059D294756k38767k53342k70511k90947l14015l38575l64538l92847m24197
57050A407017m58963D49747i4228n96561o55014p18665p88546q65944r50602j041614
57040e711174j139419j245207j357872j472557j582471j681017j761794j818444
57032a7769955j847485j851998j841297j826558j817653j822988j847785j890612
57024c2516331j947342k025233k148500k335242k559518k741198k782154k613697
57016e1669215k209297j565623o95243L50564J462114K493200L316309L867952
$$ plain form
57078 6963200 6871730 6776599 6678806 6578528 6474691 6365349 6249239 6127000 6000386 5870309
57068 5870309 5736034 5595880 5447828 5289429 5118185 4932689 4733118 4520332 4294756
57059 4294756 4055989 3802647 3532136 3241189 2927174 2588599 2224061 1831214 1407017
57050 1407017 948054 449747 -94228 -690789 -1345803 -2064468 -2853014 -3718958 -4669560 -5711174
57040 -5711174 -6850593 -8095800 -9453672 -10926229 -12508700 -14189717 -15951511 -17769955
57032 -17769955 -19617440 -21469438 -23310735 -25137293 -26954946 -28777934 -30625719 -32516331
57024 -32516331 -34463673 -36488906 -38637406 -40972648 -43532166 -46273364 -49055518 -51669215
57016 -51669215 -53878512 -55444135 -56139378 -55788814 -54326700 -51833500 -48517191 -44649239
57008d4649239M154544M225665M140265L946324L679575L372369L057967K764547
57000a5307983K507106K286901K096982J926913J765708J605667J445177c86662
56991G46969R87801Q52473P30687O23201N29122M48345L81257L26259K79835K39301
56981F145250K03756J72441J44147J18511R6104P6993O0544M6703L6123K8979
56971G129551K4529K0619J1891r722m8554r8378j44774j75816j89355j90389j84671
56960F144931j76046j66878j58135j49795j42611j38537j38452j40771j43476
56951D790230j46362j50235j55099j60358j65755j70953j75177j78346j81500
56942C306445j84967j87175j86596j83860j80461j76272j70054j61823j52964
$$ plain form
57008 -44649239 -40494695 -36269030 -32128765 -28182441 -24502866 -21130497 -18072530 -15307983
57000 -15307983 -12800877 -10513976 -8416994 -6490081 -4724373 -3118706 -1673529 -386662
56991 746969 1734770 2587243 3317930 3941131 4470253 4918598 5299855 5626114 5905949 6145250
56981 6145250 6349006 6521447 6665594 6784105 6880209 6957202 7017746 7064449 7100572 7129551
56971 7129551 7154080 7174699 7186590 7176868 7128314 7029936 6885162 6709346 6519991 6329602 6144931
56960 6144931 5968885 5802007 5643872 5494077 5351466 5212929 5074477 4933706 4790230
56951 4790230 4643868 4493633 4338534 4178176 4012421 3841468 3666291 3487945 3306445
56942 3306445 3121478 2934303 2747707 2563847 2383386 2207114 2037060 1875237 1722273
56933A722273j44078j34456j23845j13270j03579r4324q4806p5399o6960n9313
56923G22243n1236m2295l4073k8909k7334k7398k6792k4995k2802k0698j8675
56912C97036j7090j6102j4520j0905n969k217p30P7J827M115O093Q340J1508J4348
56898C75811J5110J4199J3467J3083J1100O368K87n027r068j2614j5828j7733
56886C89155j7392j5003j1584p916m188p46J416J669J085J845M903Q943J2092
56873C64279J3928J5356J7111J9006K0062J8784J3943N992k664r555j4114j7218
56861D44910j9277j9754j8398j5963j3491j1502j0106r349r220r511r793r513
56849B89033q321o485m766l590k632j522o17o49j735l142l986l905l137k091q32
$$ plain form
56933 1722273 1578195 1443739 1319894 1206624 1103045 1008721 923915 848516 781556 722243
56923 722243 671007 628712 594639 565730 538396 510998 484206 459211 436409 415711 397036
56912 397036 379946 363844 349324 338419 332450 330233 329503 329580 331407 335522 341615 349955 361463 375811
56898 375811 390921 405120 418587 431670 442770 449138 449425 444398 435330 422716 406888 389155
56886 389155 371763 356760 345176 337260 333072 332326 333742 335411 336496 338341 343244 352187 364279
56873 364279 378207 393563 410674 429680 449742 468526 482469 488461 485797 476242 462128 444910
56861 444910 425633 405879 387481 371518 358027 346525 336419 327070 317850 308339 298546 289033
56849 289033 280712 274227 269461 265871 263239 261717 261100 260451 258716 255574 251588 247683 244546 242455 241623
56834B41623J017L563N957O980O524N928O513Q198R935J1044J1602J1688J0810
56821C41382Q240L972o69l697m219l394l011l344l093j340J446M443P340R879
56807C53935J1649J2974J5036J8416K2334K5909K9240L2476L4707L4794L2557
56796F24027K8213K1337J1634M02r802j6986k0600k1063j9186j5892j1725o833
56784E63526j731K567N756Q953J3344J8723K4278L0103L6745M3527M8669N0915
56772H45375N0071M5869L7531K4789Q832p874k2384l2301l6961l7685l6354l3836
56760H05072l0147k5554k0664j5800j1046o721k906J106O020J1422J6370K0726
56748G47878K4868K8237K9348K7207K1707J2784O22j3055k5069l2889l6076l5665
$$ plain form
56834 241623 242640 246203 252160 259140 265664 271592 278105 286303 296238 307282 318884 330572 341382
56821 341382 349622 353594 352925 349228 345009 341615 338604 335260 332167 330827 332273 336716 344056 353935
56807 353935 365584 378558 393594 412010 434344 460253 489493 521969 556676 591470 624027
56796 624027 652240 673577 685211 685613 675811 658825 638225 617162 597976 582084 570359 563526
56784 563526 561795 564362 570118 579071 592415 611138 635416 665519 702264 745791 794460 845375
56772 845375 895446 941315 978846 1003635 1012467 1004593 982209 949908 912947 875262 838908 805072
56760 805072 774925 749371 728707 712907 701861 695140 692234 693340 699360 710782 727152 747878
56748 747878 772746 800983 830331 857538 879245 892029 892651 879596 854527 821638 785562 749897
56736G49897l3154l0259k8466k7892k7225k5264k2111j8418j4250r408m440m78
56724E08532K021L897O346R464J1848J1835Q997M108k156r573j7147k2651k4511
56711D91010k3652k2423k1999k1803k1091j9786j7873j5328j2974j2072j2593
56700B89416j2865j1531r022o684n224m548m394m442m372m260m445m638l959k404
56686B06628j496k499m514n426m591l452l291l476k646j009l51j704l874m752
56672A63547l565j236J009K524K924J967J41j468k290k567k251p05J880L770L550
56657A67230K006J004R83R12L04k00k72m19o86j34J668L589M150L256K025J385
56641A86801J418J748J915J396j37k270l823l725k179o08j47m48m41Q2N78J164
$$ plain form
56736 749897 716743 686484 658018 630126 602901 577637 555526 537108 522858 513450 509010 508532
56724 508532 510553 514450 520796 530260 542108 553943 562940 567048 564892 555319 538172 515521 491010
56711 491010 467358 444935 422936 401133 380042 360256 342383 327055 314081 302009 289416
56700 289416 276551 265020 255998 249314 244090 239542 235148 230706 226334 222074 217629 212991 209032 206628
56686 206628 205132 202633 198119 192693 188102 184650 181359 177883 175237 174228 173877 172173 168299 163547
56672 163547 159982 158746 159755 162279 165203 167170 167311 165843 163553 160986 158735 158030 159910 163680 167230
56657 167230 169236 170240 171223 172135 172439 172239 171967 171548 170862 170728 172396 175985 180135 183391 185416 186801
56641 186801 188219 189967 191882 193278 193141 190871 187048 183323 181144 180536 180389 179941 179500 179582 180160 181324
56625A81324K474L927L751J602m15n79L4m16j340o98J492K925K288P75P8N00J421
56608A99143K152J998P67n30p82m76r26j824j405P27K770L306K946K678K383J878
56592B14805J867K694L358K922J802P78o6n27K85K449M310M340L076J976J373
56577B45442Q26N48Q70R88j00j684j984o63O58M47j259l410m822m418j868J526
56561B31097L467K819P04q80j109o39l58m26n04l59R5R91K191K764J616r64l021
56544B37484k953j294K65J020J346J265N23j26N08J963K316J015k88m45m85j423
56528B40691k157j386j89n61k077k237q7K504L513L060K385J876J129J61l58L9
56512B46306J109K195K722K437J503N75N30J768L683N216O094O948P894P866O293
$$ plain form
56625 181324 183798 187725 191476 193078 192663 192084 192118 191702 190362 189664 191156 194081 196369 197144 197222 197722 199143
56608 199143 201295 203293 204060 203530 202748 202272 201346 199522 198117 198844 201614 204920 207866 210544 212927 214805
56592 214805 216672 219366 222724 225646 227448 228226 228160 227633 227918 230367 234677 239017 242093 244069 245442
56577 245442 246268 246816 247686 248674 248574 246890 244906 244243 244901 245348 244089 240679 235857 231439 229571 231097
56561 231097 234564 237383 238087 237207 236098 235459 235101 234675 234171 233812 233907 234898 237089 239853 241469 240505 237484
56544 237484 234531 233237 233502 234522 235868 237133 237656 237530 238038 240001 242317 243332 243044 242599 242114 240691
56528 240691 238534 237148 236959 236398 234321 232084 231997 234501 238014 241074 243459 245335 246464 246625 246267 246306
56512 246306 247415 249610 252332 254769 256272 256847 257377 259145 262828 268044 274138 281086 288980 296846 303139
56497C03139M607M598N666N422L163Q76L12Q16R34O41P33J168J351J213R45L64
56481C35948n81j422k024k868l738l403j720o85j815l638l590j686k35l66q39
56466C07338m03N73J167J118M88o52j724j912j290q50j045j198p15l9K8o93j800
56449B98391k730k878j875j95J006J049L71k16n68j128j873j978q86N34O29q13
56433B86840j803n24K002K994J585j57l77J79q0r54j107m38mn5K49J078J320J09
56415B90857j904l107k329K09K878L799K596Q07J38P07J490J818J668J080K42
56400C00949j81L01J187J610J442J099O25k73j462k380k532j529P64L472M764
56385C07856L748J696N37N22M96l1l41J53J141J999K257J631L74n65n17l7k8l54
$$ plain form
56497 303139 307746 312344 318010 323432 326595 327471 327783 328599 329533 330174 330907 332075 333426 334639 335584 335948
56481 335948 335367 333945 331921 329053 325315 321912 320192 319507 317692 314054 310464 308778 308543 308177 307338
56466 307338 306935 307508 308675 309793 310281 309629 307905 305993 304703 303853 302808 301610 300895 300856 300884 300191 298391
56449 298391 295661 292783 290908 290713 291719 292768 293139 292923 292355 291227 289354 287376 286490 287024 287653 286840
56433 286840 285037 284513 286515 289509 291094 290937 290560 290739 290659 289705 288598 288160 288156 288101 288350 289428 290748 290857
56415 290857 288953 285846 283517 283726 286604 290403 292999 293806 293944 294651 296141 297959 299627 300707 300949
56400 300949 300768 301069 302256 303866 305308 306407 307032 306759 305297 302917 300385 298856 299620 303092 307856
56385 307856 311604 313300 313837 314359 314855 314824 314483 314636 315777 317776 320033 321664 322038 321473 320956 320919 320891 320537
56367C20537j73O14J208J066M17k04l10K92R26L68j347k224n90K398L993L248
56351C30219J705Q05K51o61j516j480p43m38j218k254j902L92K944L307J257o46
56335C30022k7K604M889N422M472K843J277N20P44J157J055P78R20J328J758K557
56319C62319L659L982L136K589L474M374L311J017o9M62P15j36o66K16J696K709
56303C92788L348L858L793K963K079J817K054K426K704K483J542N59M80J133J521
56288D25548J436J633K376K938K669J646L65m64j18J136J882J452J196K473M221
56273D50389M379L124K560L464M510M811N101N945O656O506N689M666L748L342
56259E14890L459L162J811M90P05K052K802K426J849J698J984K964M392M754L339
$$ plain form
56367 320537 320364 320978 322186 323252 323669 323465 323155 323447 324373 324741 323394 321170 320580 322978 326971 330219
56351 330219 331924 332729 332980 332319 330803 329323 328580 328142 326924 324670 322768 323160 326104 329411 330668 330022
56335 330022 329995 332599 337488 342910 347382 350225 351502 352022 352766 353923 354978 355756 356676 358004 359762 362319
56319 362319 365978 369960 373096 375685 379159 383533 386844 387861 387792 388254 388969 388833 388167 388383 390079 392788
56303 392788 396136 399994 403787 406750 408829 410646 412700 415126 417830 420313 421855 422414 422894 424027 425548
56288 425548 426984 428617 430993 433931 436600 438246 438611 438147 438029 439165 441047 442499 443695 446168 450389
56273 450389 454768 457892 460452 463916 468426 473237 478338 484283 490939 497445 503134 507800 511548 514890
56259 514890 518349 521511 523322 523812 524517 526569 529371 531797 533646 535344 537328 540292 544684 549438 552777
56244E52777K186L380N421N345L695L741O077P975Q291Q904J0405J0560Q645P457
56230F44859Q924J1060J1507J1015J1150J1277J0414R591R901J0362J0137J0741
56218G70938J3471J6578J7684J7350J7635J8607J9042J9392K1188K4104K6198
56207I82187K6835K7269K8593L0835L3847L7419M0705M2958M4619M6700M9411
56196A391378N2380N5769O0293O6500P4524Q3930R3364J01345J07830J14128J21031
56185B322472J28162J35142J41691J46462J47681J45500J41647J36344J27723
56176C572824J14874R9068Q1165O0583L7991J6180l334k2091m1402n9828p5769
56165C780261q9880j02824j13022j19086j22339j24495j24934j22771j19540j17015
$$ plain form
56244 552777 554963 558343 563764 569109 572804 576545 582622 590597 598888 607792 618197 628757 637402 644859
56230 644859 653783 664843 676350 687365 698515 709792 720206 729797 739698 750060 760197 770938
56218 770938 784409 800987 818671 836021 853656 872263 891305 910697 931885 955989 982187
56207 982187 1009022 1036291 1064884 1095719 1129566 1166985 1207690 1250648 1295267 1341967 1391378
56196 1391378 1443758 1499527 1559820 1626320 1700844 1784774 1878138 1979483 2087313 2201441 2322472
56185 2322472 2450634 2585776 2727467 2873929 3021610 3167110 3308757 3445101 3572824
56176 3572824 3687698 3786766 3867931 3928514 3966505 3982685 3979351 3957260 3915858 3856030 3780261
56165 3780261 3690381 3587557 3474535 3355449 3233110 3108615 2983681 2860910 2741370 2624355
56155B624355j14189j09232j02829r6820r1094q4676p8571p4483p1635o7741o2395
56144A670690n7010n2208m7700m3915m1359l9032l5713l1948k8881k6209k3377
56133A243338k1370k0838j9989j7021j3415j1770j1572j0299p909o801p592q162
56121A086600p095n221l436j557L14J440J846K359L137L718M226N064N848O169
56107A103412O705Q037R345R841J0321J1522J2443J2372J2923J5456J8052J8190
56095A248619J7080J8013K1293K4352K6292K8645L1774L4192L5849L8833M4084
56084A569026N0251N6431O3423P1494P9270Q5647R0835R4928R7158R6888R3785
56073B449136Q7162P7023O5609N6055M9550M5361M2959M2007M0756L6954L0283
$$ plain form
56155 2624355 2510166 2400934 2298105 2201285 2110191 2025515 1946944 1872461 1800826 1733085 1670690
56144 1670690 1613680 1561472 1513772 1469857 1428498 1389466 1353753 1321805 1292924 1266715 1243338
56133 1243338 1221968 1201130 1181141 1164120 1150705 1138935 1127363 1117064 1109155 1102354 1094762 1086600
56121 1086600 1079505 1074284 1070848 1069291 1069605 1071045 1072891 1075250 1078387 1082105 1086331 1091395 1097243 1103412
56107 1103412 1110117 1118154 1127499 1137340 1147661 1159183 1171626 1183998 1196921 1212377 1230429 1248619
56095 1248619 1265699 1283712 1305005 1329357 1355649 1384294 1416068 1450260 1486109 1524942 1569026
56084 1569026 1619277 1675708 1739131 1810625 1889895 1975542 2066377 2161305 2258463 2355351 2449136
56073 2449136 2536298 2613321 2678930 2734985 2784535 2829896 2872855 2914862 2955618 2992572 3022855
56062C022855K2134J3464M824k352p133j1368j8041k7624l8329m9340o0913p1558
56050B776619p8177p9535p7277p3229o7826o1373n4716m8245m1838l5749l0204
56039B128450k4638j8810j3889j0758q358n467k839j459k32K203M889O392P628
56026B063112R977J2138J2170J1241J1928J4019J5489J6458J8505K1102K2548
56015B228687K3435K5437K7658K8132K7949K9640L2339L2926L1496L1245L3318
56004B552262L6029L8744M2021M4362M3602M1459M2036M5655M8782M9983N1238
55993C036173N3149N3801N3076N3424N5522N7419N8506O0093O1883O2263O2343
55982C667652O4981O9568P2584P3598P5674P9396Q1843Q2312Q3841Q7890R2447
$$ plain form
56062 3022855 3044989 3058453 3063277 3060925 3053792 3042424 3024383 2996759 2958430 2909090 2848177 2776619
56050 2776619 2698442 2618907 2541630 2468401 2400575 2339202 2284486 2236241 2194403 2158654 2128450
56039 2128450 2103812 2085002 2071113 2060355 2051997 2046530 2043691 2042232 2042000 2044203 2049092 2055484 2063112
56026 2063112 2073089 2085227 2097397 2108638 2120566 2134585 2150074 2166532 2185037 2206139 2228687
56015 2228687 2252122 2277559 2305217 2333349 2361298 2390938 2423277 2456203 2487699 2518944 2552262
56004 2552262 2588291 2627035 2669056 2713418 2757020 2798479 2840515 2886170 2934952 2984935 3036173
55993 3036173 3089322 3143123 3196199 3249623 3305145 3362564 3421070 3481163 3543046 3605309 3667652
55982 3667652 3732633 3802201 3874785 3948383 4024057 4103453 4185296 4267608 4351449 4439339 4531786
55971D531786R6479J01504J07627J12695J16450J21090J27031J32473J37482J43812
55961E728429J50701J55833J60334J67470J76671J84711J92434K03765K18128
55952G338476K30846K41273K53357K67569K79805K89405L00658L15125L29829
55943I846343L44437L62569L84606M06811M28999M55257M85865N16671N47633
55934A3779191N83167O22739O60358O95166P32858P74820Q16104Q56330R01934
55925B0422667R54836J009801J065918J129301J201114J274870J349606J433718
55917B9841831J531445J637720J750624J876061K015600K163208K319170K493689
55909D5629348K692122K911354L155623L439843L772382M152034M587511N101352
$$ plain form
55971 4531786 4628265 4729769 4837396 4950091 5066541 5187631 5314662 5447135 5584617 5728429
55961 5728429 5879130 6034963 6195297 6362767 6539438 6724149 6916583 7120348 7338476
55952 7338476 7569322 7810595 8063952 8331521 8611326 8900731 9201389 9516514 9846343
55943 9846343 10190780 10553349 10937955 11344766 11773765 12229022 12714887 13231558 13779191
55934 13779191 14362358 14985097 15645455 16340621 17073479 17848299 18664403 19520733 20422667
55925 20422667 21377503 22387304 23453222 24582523 25783637 27058507 28408113 29841831
55917 29841831 31373276 33010996 34761620 36637681 38653281 40816489 43135659 45629348
55909 45629348 48321470 51232824 54388447 57828290 61600672 65752706 70340217 75441569
55901G5441569N709308O417105P243674Q224904R389505J0757181J2362087J4239313
55893A49784646J6377636J8726399K1260596K3988480K6871145K9762998L2370244
55886C19142144L4066181L3659432K9632334K1113286Q904352m532558j6329205
55879D25655966k4653334k9205062l0707706l0166004k8458891k6231186k3876374
55872B32357409k1575856j9402701j7403558j5603891j3996974j2566392j1302866
55865A20505171j0188227r189158q282583p468520o748025o107870n535740n030545
55857F1954503m587139m187961l819901l484634l183912k908965k652640k418631
55849C4710720k210382k022552j850604j697621j564779j445519j335238j236816
$$ plain form
55901 75441569 81150877 87567982 94811656 103036560 112426065 123183246 135545333 149784646
55893 149784646 166162282 184888681 206149277 230137757 257008902 286771900 319142144
55886 319142144 353208325 386867757 416500091 437613377 446517729 441985171 425655966
55879 425655966 401002632 371797570 341089864 310923860 282464969 256233783 232357409
55872 232357409 210781553 191378852 173975294 158371403 144374429 131808037 120505171
55865 120505171 110316944 101127786 92845203 85376683 78628658 72520788 66985048 61954503
55857 61954503 57367364 53179403 49359502 45874868 42690956 39781991 37129351 34710720
55849 34710720 32500338 30477786 28627182 26929561 25364782 23919263 22584025 21347209
55841B1347209j151042j071628r95304r27194q70623q20529p72194p27564o87661
55832A3323470o47605o04709n63663n28275m95500m62567m32750m09115l89229
55823H790057l70604l54772l41665l26647l07616k88854k73788k60194k46438
55814F019479k35700k29683k24500k17437k11585k09067k05707j97519j87137
55805D101144j78576j70579j60282j48981j39158j29689j18864j08714j01866
55796B844435r7108r2047q7204q3846q0649p5932p0497o5507o0412n5396n2540
55785B023297n2196n1639m9506m7789m7251m5206m0557l6639l5981l6305l4912
55774A545316l2965l2169l1113k8503k6303k6171k6248k4774k3281k2920k1534
$$ plain form
55841 21347209 20196167 19124539 18129235 17202041 16331418 15510889 14738695 14011131 13323470
55832 13323470 12675865 12071156 11507493 10979218 10483718 10021151 9588401 9179286 8790057
55823 8790057 8419453 8064681 7723016 7396369 7088753 6799899 6526111 6265917 6019479
55814 6019479 5783779 5554096 5329596 5112159 4900574 4691507 4485800 4288281 4101144
55805 4101144 3922568 3751989 3591707 3442726 3303568 3173879 3055015 2946301 2844435
55796 2844435 2747327 2655280 2568076 2484230 2403581 2327649 2257152 2191645 2131233 2075837 2023297
55785 2023297 1971101 1919462 1869956 1822167 1774916 1729710 1689153 1652514 1616533 1580228 1545316
55774 1545316 1512351 1480182 1449069 1420566 1394263 1368092 1341844 1317070 1293789 1270869 1249335
55763A249335j8064j5953j7870k0714k0401j8308j8224j9751j9783j8201j7089
55752A044977j6033j3143r602q507r885j0881j0342r488q641o938m969m368m956
55739I27224n063m356l906l861l487k886k455j377J107L773M867M663M369L689
55725I22301J736o35j972k990n712j0276j4760j7740j9058j8536j5992j2400r359
55712G94607p469o261n233m047k543j604k880o668j1100j4311j6072j6527j5243
55699F84649j2740j0933j0489r687p479n629n923p353q251r181j1143j2707j1893
55686E61241r598q282q167p505n951m963n170n682n925o115o156n722n192n033
55672D71780m814m173l933m720n459m912l895m137n704p217p933p943p064n246
$$ plain form
55763 1249335 1231271 1215318 1197448 1176734 1156333 1138025 1119801 1100050 1080267 1062066 1044977
55752 1044977 1028944 1015801 1006199 997692 987807 976926 966584 957096 948455 941517 936548 932180 927224
55739 927224 922161 917805 913899 910038 906551 903665 901210 899833 900940 904713 909580 914243 918612 922301
55725 922301 924037 923402 921430 918440 912728 902452 887692 869952 850894 832358 816366 803966 794607
55712 794607 787138 780877 775644 771597 769054 767450 764570 757902 746802 732491 716419 699892 684649
55699 684649 671909 660976 650487 640800 633321 627692 621769 614416 606165 596984 585841 573134 561241
55686 561241 551643 543361 535194 527689 521738 516775 511605 505923 499998 493883 487727 482005 476813 471780
55672 471780 466966 462793 458860 454140 448681 443769 439874 435737 430033 422816 414883 406940 399876 394630
55658C94630l507k887k993k854k413j954j020P21K591M046N446O473N547K450
55644D04276l34r51r86k671n088o035o105p488r636r681o926l788k125j512j359
55629C39591j967k951l125k549k547l289l383k313j209p02o9R31J440J460K373
55614C21691M364N112K591j803m440l396k53J824J154j274l213l390k154l53J451
55599C17911K563K162M52j183j876k089k109j147R13K369J795K41l01L84J145
55584C21230J579J900J661M83n60k90M29j68k043l649m498n431o648p461p787
55569B88747q001p633o088m431m349n401n452l823k045j260r57n61l80m54j92
55554B37720M45P77N27l00k307n582p954o802k929j80n64k096k341j629j362j287
$$ plain form
55658 394630 391123 388236 385243 382389 379976 378022 377002 377723 380314 384360 389806 396279 401826 404276
55644 404276 403942 402991 402005 399334 394246 388211 382106 374618 364982 355301 348375 344587 342462 340950 339591
55629 339591 337624 334673 331548 328999 326452 323163 319780 317467 316258 315556 315487 316418 317858 319318 321691
55614 321691 326055 331167 333758 331955 327515 324119 323866 325690 326844 325570 322357 318967 316813 316460 317911
55599 317911 320474 322636 323088 321905 320029 317940 315831 314684 315597 317966 319761 320002 319701 320085 321230
55584 321230 322809 324709 326370 326853 326293 326003 326432 326264 324221 320572 316074 310643 303995 296534 288747
55569 288747 280746 273113 267025 262594 258245 252844 247392 243569 241524 240264 239307 238746 238366 237912 237720
55554 237720 238165 238942 239469 239169 236862 231280 223326 216524 213595 213415 212851 210755 208414 206785 205423 204136
55538B04136m74N30N36j03k7R21J537J132K88l16p72j396j997k100j595q87l66
55521A99047kM34R04J384K427M473O580O978N522M268M843O379P201P119O719
55506B64276N610L366J126K18j16j453l366m163m014m647o075o433n363m849n848
55491B28269o695o043n013m982n245m507l186k479k292j667n89l5n22j539k122
55476A81353j723r37j307l476n589n003j706J536K692K359J663N02j076j775r55
55461A66558r6o97j920k039j184p46r20p51k70n94j837k621k006o93K00M90N29
55444A51403K00q96k552l736l493j920j37Q01P49J39p48j716k145j371L56J971
55428A36905K637K198Q62p36j409m79J052J497P45K23N86Q44K77l76l97l84j016
$$ plain form
55538 204136 203662 204192 204728 204625 204598 205519 207056 208188 208476 208160 207388 205992 203995 201895 200300 199413 199047
55521 199047 199045 199479 200383 201767 204194 208667 215247 222225 227747 232015 236858 243237 250438 257557 264276
55506 264276 269886 273252 274378 274596 274480 273027 269661 265498 261484 256837 250762 244329 238966 234117 228269
55491 228269 221574 215531 210518 205536 200291 195784 192598 190119 187827 186160 185571 185536 185014 183475 181353
55476 181353 179630 178693 177386 173910 168321 163318 161612 163148 165840 168199 169862 170364 169288 167513 166558
55461 166558 166462 165765 163845 161806 160622 159876 158956 158205 157935 157341 155504 152883 150877 150184 150384 150874 151403
55444 151403 151603 150707 148155 144419 140926 139006 138869 139670 140419 140558 139810 138094 135949 134578 134934 136905
55428 136905 139542 141740 142602 141866 140457 139978 141030 142527 143272 143495 144081 144925 145202 144826 144429 144045 143029
55411A43029j696j678j649k796m730n582m174j217J459K438J646L47m8O25J362
55396A27336J575J824K638L481L534K786J685L94q75j430r61k74l34q68q41m9
55380A39621O45N90R1k75m62q04j367j622q48R76K706K900J415k40n55L04Q32
55363A43907qj637k486j549O77K722L637L755L835L755K717N15j969l617l942
55348A50312l184k148j875k760l906l895k307q1J566K027J363K49l33j28j77j377
55332A33346k780k498l77J618J901R69J50j06m2K08M17J4j216k567l042k256o62
55315A23077O68N77r72k357j974l50N85K70K6N72Q48K1r46q57j39K5n06r50p54
55296A16864K05J731K909K451L18j878k750k540j969r92L53J118Q54P52J901L205
$$ plain form
55411 143029 141333 139655 138006 135210 130480 124898 120724 119507 120966 123404 125050 125397 125349 125974 127336
55396 127336 128911 130735 133373 136854 140388 143174 144859 145253 144378 142948 141987 141713 141379 140511 139670 139621
55380 139621 140266 140856 140947 140672 140210 139406 138039 136417 135569 136545 139251 142151 143566 143326 142771 143075 143907
55363 143907 143899 142262 139776 138227 138904 141626 145263 149018 152853 156608 159325 159840 157871 154254 150312
55348 150312 147128 144980 143105 140345 136439 132544 130237 130156 131722 133749 135112 135361 135028 134900 134723 133346
55332 133346 130566 128068 127691 129309 131210 132179 132329 132223 132181 132389 132806 132820 131604 129037 125995 123739 123077
55315 123077 123745 124322 123350 120993 119019 118669 119254 119524 119550 120122 120970 120991 120045 119188 119049 119074 118568 117618 116864
55296 116864 117069 118800 121709 124160 124478 122600 119850 117310 115341 114349 114702 115820 116674 117426 119327 122532
55280A22532K709M93j335j428n19J17K96P09J754K937L204K011K12o46j20P26
55264A33652R44P10K50q95k660l595k528k44J534K120J750N24j171k018j198L1
55248A27206k19j769k626j679K96K233L719M403L916K789K079J722N08j797l511
55233A37270k969o68J340J733R22On81j030j202m30J346K874K903J941J487J655
55217A46597J026p47j976j501n98r53k092k406j647p35N3Q55J000n8j139o09J070
55200A36140J962J568J099J034O40m0O2P65L53j612l199k822j308j54N96J425
55184A36509J732R26Q4O62K063K154K54j777j859j40J399J353K27o45r97j672
55168A40273k812l037j267J312K339J147o73j492j296q27l85J09O33J167J599
$$ plain form
55280 122532 125241 125734 124399 122971 122452 122569 122865 123574 125328 128265 131469 133480 133692 133046 132926 133652
55264 133652 134596 135306 135556 134661 132001 128406 125878 125634 127168 129288 131038 131562 130391 128373 127175 127206
55248 127206 126987 125218 122592 120913 121209 123442 127161 131564 135480 138269 140348 142070 142578 140781 137270
55233 137270 134301 133633 134973 136706 137628 137634 137053 136023 134821 134391 135737 138611 141514 143455 144942 146597
55217 146597 147623 146876 144900 143399 142801 141848 139756 137350 135703 134968 135021 135876 136876 136818 135679 135070 136140
55200 136140 138102 139670 140769 141803 142443 142403 142465 143230 143583 141971 138772 135950 134642 134488 135084 136509
55184 136509 138241 139167 139251 139913 141976 144130 144384 142607 140748 140608 142007 143360 143587 142942 141945 140273
55168 140273 137461 134424 133157 134469 136808 137955 137282 135790 134494 133667 133282 133391 134024 135191 136790
55153A36790J446N17k21L94J770K007O29n73j66J028J581J609J844J791N20j397
55137A49569k466k508k574k769j907K40J940J662J33q12o80m99r36j543j920k403
55121A32527l017k765r58J259J995J137N36J395K736L180L016L290L688K902P71
55106A51692j433k824l663m060l291r78K032M490N776N726M387K453J155J019
55092A62481J251Q00m95k031l074k950j471L31P66n31j947j946j006o44j118j310
55076A47106n65N02J143J477J960K518K582J777L40j070j941k297k411k188j278
55061A47655Q5Q68L36j019k080k316j940j211l05K41k16j452k147j126J356L805
55045A40534M887M365K807Q50r14j675q07J225K829K742J296r0m68O0R62J709
$$ plain form
55153 136790 138236 138753 138532 138926 140696 142703 143332 142759 142593 143621 145202 146811 148655 150446 150966 149569
55137 149569 147103 144595 142021 139252 137345 137585 139525 141187 141320 140508 139828 139329 138393 136850 134930 132527
55121 132527 129510 126745 125787 127046 129041 130178 130714 132109 134845 138025 141041 144331 148019 150921 151692
55106 151692 150259 147435 143772 139712 136421 135443 137475 141965 147741 153467 157854 160307 161462 162481
55092 162481 163732 164532 164037 162006 158932 155982 154511 154842 155608 155077 153130 151184 150178 149534 148416 147106
55076 147106 146541 147043 148186 149663 151623 154141 156723 158500 158840 157770 155829 153532 151121 148933 147655
55061 147655 147740 148608 148944 147925 145845 143529 141589 140378 140073 140314 140098 138646 136499 135373 136729 140534
55045 140534 145421 149786 152593 153443 152529 150854 150047 151272 154101 156843 158139 158049 157581 157641 158603 160312
55029A60312J783J000Pk64K49P35P19M89K34l13r15n56J074K507K046l0j731j771
55011A65575q04j41j22j48J89O08N68j16j111j827j939j588j069l89O25J769K328
54994A62408J830P15o3j86k52p43j178p86K51Q39K93r37j897j887p00J085J936
54977A60728O33j853k787q35K128L342K424J052J28j007k641l639k873o23J800
54962A55977L026K264j09k354k777j523j48M99Q92J260Q67n78j950j934m66J422
54946A54368K566K268Q36k89M6J101J298Q63J659L935N315M053J508j54r73k062
54930A76338k847j798O94K376K072P77j55m06j44M35Q31O10K32M67J045J000K49
54913A81776l49n14q28j454j796j645j495j475j105l06M81J300K520L555L205
$$ plain form
55029 160312 162095 163095 163102 162838 163087 163822 164541 165030 165264 164951 164036 163480 164554 167061 169107 169077 167346 165575
55011 165575 164771 164630 164508 164360 164549 165157 165725 165609 164498 162671 160732 159144 158075 157686 158311 160080 162408
54994 162408 164238 164953 164890 164704 164452 163709 162531 161745 161996 162835 163128 162191 160294 158407 157707 158792 160728
54977 160728 161361 159508 156721 155886 158014 161356 163780 164832 164960 163953 161312 157673 154800 154177 155977
54962 155977 159003 161267 161158 158804 156027 154504 154356 154855 155747 157007 157874 157296 155346 153412 152946 154368
54946 154368 156934 159202 160038 159749 159795 160896 162194 163057 164716 168651 173966 178019 179527 179373 178400 176338
54930 176338 173491 171693 172387 174763 176835 177612 177457 177051 176907 177342 178173 178783 179015 179482 180527 181527 181776
54913 181776 181427 180913 180085 178631 176835 175190 173695 172220 171115 170809 171290 172590 175110 178665 181870
54898A81870J752J018J681K082Q28q71j059j48l05k216m099m035j997O33K508
54883A77642K939K063P91J08J26J41l19r52j227j052q08r33j513j937j257P08
54867A74520K799L614L033K096J549J283J221J874L623O012Q132R202Q685O660
54853B34303M411L838N425P385P545N586K771J0k591m663n506n306n206n708n944
54838B36350n089l658k734k625k936l303l370k589q79Q93J677J231p8j777k953
54823B08160k345J08K457K752J477O62R23J099O98Q33K166L697M477N082O316
54808B38562P585P754O738N131L091P68r49j538k075l924o464p647o782n259m414
54793B30577m049l563l136l059k897k263j798k454m153n761o234n286l348j289
$$ plain form
54898 181870 183622 184640 186321 188403 189231 188360 187301 187153 186848 184632 180533 176498 174501 175134 177642
54883 177642 180581 182644 183435 183543 183669 183810 183491 182539 181312 180260 179452 178519 177006 175069 173812 174520
54867 174520 177319 180933 183966 186062 187611 188894 190115 191989 195612 201624 209756 218958 227643 234303
54853 234303 238714 242552 247977 255362 262907 268493 271264 271274 268683 264020 258514 253208 248002 242294 236350
54838 236350 231261 227603 224869 222244 219308 216005 212635 210046 209167 210060 211737 212968 212890 211113 208160
54823 208160 205815 205923 208380 211132 212609 213271 214194 215293 215991 216824 218990 222687 227164 232246 238562
54808 238562 246147 253901 260639 265770 268861 269629 268680 267142 265067 261143 254679 247032 240250 234991 230577
54793 230577 226528 222965 219829 216770 213873 211610 209812 207358 203205 197444 191210 185924 182576 181287
54779A81287NL51L04K69k6o47p61K88J571J468j3j081p35k10r38k149j979m15
54761A76589N35k43j477j468k98Q63J577K149K405J763L77q04j166q74k38N96
54745A80286J288J347P15j07n77l85N65J868K561K039Q54k2n12j203k054k360
54729A84303j923j237m61P09K069K866K925K744K361J257k22p34K07J417J778
54714A98059J647J780J975J772J607K192L370M447N142N468N273M663M218M200
54700B45813M193M157M843O370P427O873N270L719K091k36k733m298m971n618
54686B72900o317o412n848n066l969k343j007r92j804k064j780k270l582l935
54672B25511k321k32K58r23k131k223j583j196j330j172K20K612M553N060M815
$$ plain form
54779 181287 181292 181643 181947 182216 182190 181543 180782 181070 182641 184109 184096 183015 182280 182070 181132 178983 177004 176589
54761 176589 177124 176881 175404 173936 173638 174501 176078 178227 180632 182395 182772 181968 180802 179928 179690 180286
54745 180286 181574 182921 183636 183529 182952 182567 183132 185000 187561 189600 190454 190432 189920 188717 186663 184303
54729 184303 182380 181143 180682 181391 183460 186326 189251 191995 194356 195613 195391 194657 194864 196281 198059
54714 198059 199706 201486 203461 205233 206840 209032 212402 216849 221991 227459 232732 237395 241613 245813
54700 245813 250006 254163 259006 265376 272803 279676 284946 288665 290756 290520 287787 283489 278518 272900
54686 272900 266583 260171 254323 249257 245288 242945 241938 240946 239142 237078 235298 233028 229446 225511
54672 225511 223190 222958 223216 222293 220162 217939 216356 215160 213830 212658 212878 215490 220043 225103 229918
54657B29918N047N726N793M834L544K692K623L406M458M308K039j220l478m310
54643B65380m810n334n092m032l286l323l296k841k872l814m596m300l482k925
54629B11377k323j374q93j592k594k516j364k60K04K69J41j48l12j21Qn75j915
54612A96012l434m340l933k175k86J89o07p49Q19K718L133K267J501J077L01n93
54596A91900n44M20R73M33m10p29o84o22l34K39M07m26j795k653k542j878j179
54579A80576n28K43J073J615J695J601J553J099l52k213k798j307Q28J462L46
54564A84893o23J30K044L291K868J309k33j007p77L75J866K511J392q92k432k003
54548A92712m97K90j39p72p86l99qL28L13n59j928k496j646k49O18R16R56N57
$$ plain form
54657 229918 234965 240691 246484 251318 254862 257554 260177 263583 268041 272349 274388 273168 269690 265380
54643 265380 260570 255236 250144 246112 242826 239503 236207 233366 230494 226680 222084 217784 214302 211377
54629 211377 209054 207680 206787 205195 202601 200085 198721 198461 198665 198934 199075 198927 198615 198494 198502 197927 196012
54612 196012 192578 188238 184305 182130 181844 182033 181426 180677 181496 184214 187347 189614 191115 192192 192493 191900
54596 191900 191356 191776 192749 193182 192772 192043 191359 190737 190403 190642 191049 190623 188828 186175 183633 181755 180576
54579 180576 180048 180291 181364 182979 184674 186275 187828 188927 188575 186362 183564 182257 183085 184547 184893
54564 184893 184270 184400 186444 189735 192603 193912 193679 192672 191895 192270 194136 196647 198039 197147 194715 192712
54548 192712 192215 192505 192366 191594 190808 190409 190401 190729 191042 190483 188555 186059 184413 184164 184782 185698 186654 187211
54530A87211k79o89m4R59J306J171J407J986K133J673J188R73Q04N44K23l12r60
54513A99294j002q7P59L17q82j089J46J309J061r1q34p61l99j87j59k53m31o14
54495A96097o94m39M98K048L246K913R97j160k036j179O38K008J830K89j057q07
54479B03192N70J184O1j633j890k0K736M334L629J398k87j34R77J193R1r93j031
54462B13377o73r22j399q53Q83K438K472J119l54r84q17m45k53l51q38j613k067
54445B08720j548l73L51J60j04L92J234J554J456J678K162K117J319L45n18j528
54429B17417k482k604j775r75r99j476j632j346q68j84Q34J937K711K955K633
54414B14146J776Q15N05J122K028K341J811Q83K43M47J522K588K402O41j575k739
$$ plain form
54530 187211 186932 186243 186199 187158 188464 189635 191042 193028 195161 196834 198022 198995 199799 200343 200566 200254 199294
54513 199294 198292 198205 198964 199281 198399 197310 197456 198765 199826 199735 198901 198140 197741 197554 197395 197142 196711 196097
54495 196097 195403 194964 195462 197510 200756 203669 204666 203506 201470 200291 200929 202937 204767 205056 203999 203192
54479 203192 203762 204946 205007 203374 201484 201464 204200 208534 212163 213561 213274 213140 214117 215310 215401 214408 213377
54462 213377 212704 211782 210383 209530 210413 212851 215323 216442 216088 215104 214287 213842 213589 213238 212400 210787 208720
54445 208720 207172 206799 207150 207310 207206 207598 208832 210386 211842 213520 215682 217799 219118 219463 218945 217417
54429 217417 214935 212331 210556 209581 208582 207106 205474 204128 203260 203076 203910 205847 208558 211513 214146
54414 214146 215922 216737 217242 218364 220392 222733 224544 225427 225670 226117 227639 230227 232629 233270 231695 228956
54398B28956k329r58M17J186J292J126J046R46M75k49n88j93M97P43K85m82q78
54381B31292n87j15l66j291j540j96J563J784M49n99n15n28j582k581k152p22
54365B22314N26J571K870L613K577L51j093j051p02r25j203j066j096j642j813
54350B23231p25J040K191K356K118J935J794J691J641J415Q27K52K81R63J817
54335B42827K509L002L126K634J777J276J350J297M50o66q17L01J492J492O06
54320B62656K27Q89J499Q72n68j363r68l42m59j014j111o79l92m34j06J008K198
54303B61913K470J867J337J402J631J549J376J459J542J227P63O42O00qp96l40
54287B78634J790L874L765J486q96j816j739j914k568k967k753k395k438k870
$$ plain form
54398 228956 226627 225669 226086 227272 228564 229690 230736 231682 232157 231908 231320 231127 231624 232367 232652 232170 231292
54381 231292 230705 230590 230224 228933 227393 227197 228760 230544 230993 230394 229879 229351 227769 225188 223036 222314
54365 222314 222840 224411 227281 230894 233471 233822 232729 231678 230976 230051 228848 227782 226686 225044 223231
54350 223231 222506 223546 225737 228093 230211 232146 233940 235631 237272 238687 239514 239766 240047 241010 242827
54335 242827 245336 248338 251464 254098 255875 257151 258501 259798 260248 259582 258765 259066 260558 262050 262656
54320 262656 262883 263772 265271 266143 265575 264212 263244 262902 262443 261429 260318 259639 259247 258813 258707 259715 261913
54303 261913 264383 266250 267587 268989 270620 272169 273545 275004 276546 277773 278536 279178 279778 279770 278974 278634
54287 278634 280424 284298 288063 289549 288653 286837 285098 283184 280616 277649 274896 272501 270063 267193
54273B67193l388l774l864l567l102k894k843k182n57J072J386N18m8L44N01p47
54257B44048k559l108k093q68k37L79J232J302Jj397j373m57l86j265j273N41
54241B32487K641L066J940P88J19q82k384l210k701j973k307l033k428m18J075
54226B22780Q38j1J38J052J405J030R25J358J494J137J250K269L036K351O79n27
54210B41204o40j57K93M32J67k81k61O53K075L271L923L890K879J074l39k62P80
54193B58701J158J39j485k711l277l134k013j43J335J399K65j032j830k217k388
54178B42767k222j535m89M39Q47P77O96J078J946K662K204ml064m743l522o28
54162B37209R60mj606j530o5Q63P12N35O93L91l70m01N48J089M97O7R61K144J981
$$ plain form
54273 267193 263805 260031 256167 252600 249498 246604 243761 241579 241022 242094 243480 243998 243950 244294 244795 244048
54257 244048 241489 238381 236288 235420 235183 235562 236794 238096 238097 236700 235327 234870 234484 233219 231946 232487
54241 232487 235128 238194 240134 240922 241041 240159 237775 234565 231864 229891 227584 224551 222123 221705 222780
54226 222780 223618 223607 223745 224797 226202 227232 228157 229515 231009 232146 233396 235665 238701 241052 241731 241204
54210 241204 240564 240407 240700 241132 241299 241018 240757 241410 243485 246756 250679 254569 257448 258522 258183 257921 258701
54193 258701 259859 259998 258513 255802 252525 249391 247378 247235 248570 249969 250234 249202 247372 245155 242767
54178 242767 240545 239010 238521 238960 239807 240584 241280 242358 244304 246966 249170 249166 246102 241359 237837 237209
54162 237209 238169 238165 236559 235029 234964 235827 236539 237074 237767 238158 237788 237387 237935 239024 239521 239588 240549 242693 244674
54143B44674P59jK8n4m57m75j47m86j747k707k184m27J293J823Q10r64j869r55
54125B36914P60J335L89m96K6J414K269K015J064Ro91q18o39o44p62m14L92P61
54107B42884J57p38r85o08k26l4J45J96j36o88r20n23L36J099J021j53j599k082
54089B37146j494r37r48o99M15J575J871J806K213K523J683J76m91j15L6o30j333
54072B42797j503j517j457o29J096K703L309K991K044O02n57l11J051J728Q25
54057B53172m28p16n00o64p26R2J116J198P71J103K033K128R79l04q67r16o82
54040B56789JQ20R13P2r52j496j462p53O82K142K685K533K778L403K972Q54j443
54023B70538k066r82M80J448J944K103J963J685J330O82j32k89P75K390L373L565
$$ plain form
54143 244674 245433 245432 245460 245406 244949 244474 244327 243841 242094 239387 237203 236776 238069 239892 240702 239738 237869 236914
54125 236914 237674 239009 239398 238902 238928 240342 242611 244626 245690 245699 245008 244190 243551 242907 242145 241731 242123 242884
54107 242884 243041 242303 241318 240710 240484 240450 240595 240791 240655 239967 239047 238524 238860 239959 240980 240827 239228 237146
54089 237146 235652 234715 233767 233068 233483 235058 236929 238735 240948 243471 245154 245330 244839 244724 244760 244130 242797
54072 242797 241294 239777 238320 237691 238787 241490 244799 247790 249834 250436 249879 249568 250619 252347 253172
54057 253172 252744 252028 251528 250864 250138 250230 251346 252544 253315 254418 256451 258579 259558 259254 258387 257471 256789
54040 256789 256790 257610 258523 258595 257643 256147 254685 253932 254614 256756 259441 261974 264752 268155 271127 271981 270538
54023 270538 268472 267490 267970 269418 271362 273465 275428 277113 278443 279125 278993 278704 279479 281869 285242 288807
54007B88807L900M953O070O194N201M165M256N486O599O299M413J622j514m681
53993C41770p024p213m844j264J413K085J273L15J46O73J158J204J197J629K407
53978C34925L299M508O048P045O715N772N563O022N939N285N424O551O860N271
53964D15227L225K321J839L57j477j966j372j441k305k236q43k43k052m968o532
53949C97534o170n338n402o441p709q262p421n259k681o68L69M26l73j491j928
53934C39186j096L62J107M56r61j863j439L8J547K288K345K360K623K737K160
53919C51850R46j78m11L28J219J273L81o33j061j055j084j143r64o68p00j204
53903C46896j953k620k867k402j420o26k91K39J461K616K586J555P90R36J647
$$ plain form
54007 288807 292707 297660 303730 309924 315125 319290 323546 329032 335631 341930 346343 347965 346451 341770
53993 341770 334746 327533 322689 321425 322838 324923 326196 326511 326657 327330 328488 329692 330889 332518 334925
53978 334925 338224 342732 348780 355825 362540 368312 373875 379897 385836 391121 396545 403096 409956 415227
53964 415227 418452 420773 422612 422969 421492 419526 418154 416713 414408 412172 411329 411086 409034 404066 397534
53949 397534 391364 386026 380624 374183 366474 358212 350791 345532 342851 342183 342552 342978 342605 341114 339186
53934 339186 338090 338452 339559 340015 339054 337191 335752 335790 337337 339625 341970 344330 346953 349690 351850
53919 351850 352796 352618 352207 352535 353754 355027 355408 354775 353714 352659 351575 350432 349468 348800 348100 346896
53903 346896 344943 342323 339456 337054 335634 335008 334717 334956 336417 339033 341619 343174 343964 344900 346547
53888C46547K738M429O183O677N616M434M502N397N813N456N111N332N903O457
53874D20595O795O769O372N932N665N275M479L847M482O797J0052J3048J4902
53861E15010J5255J4429J3609J4201J6279J7888J6587J1909N824O62k875n232
53849F33546o307n508l371j781j930l002l696m066m877n860o037n471n279n848
53835E70513o233n643m479l665l828n223p468r228r315q445q542r915j0529q922
53821D69078o421n234n487n667n244n131n754o248n812m741l788l355l515m127
53807C98554m712m843m694m739m846m361l182k149k115l012l969m097l124j634
53793C47077o91q41j537j781j245m06J84L27Pn91j026j076j178j752k220j547
$$ plain form
53888 346547 349285 353714 359897 366574 372190 376624 381126 386523 392336 397792 402903 408235 414138 420595
53874 420595 427390 434159 440531 446463 452128 457403 461882 465729 470211 477008 487060 500108 515010
53861 515010 530265 544694 558303 572504 588783 606671 623258 635167 640991 641653 638778 633546
53849 633546 627239 621731 618360 616579 614649 611647 607951 603885 599008 593148 587111 581640 576361 570513
53835 570513 564280 558637 554158 550493 546665 541442 533974 524746 515431 506986 498444 488529 478000 469078
53821 469078 462657 457423 451936 446269 441025 435894 430140 423892 418080 413339 409551 406196 402681 398554
53807 398554 393842 388999 384305 379566 374720 370359 367177 365028 362913 359901 355932 351835 348711 347077
53793 347077 346386 345545 344008 342227 340982 340576 340760 341087 341094 340503 339477 338401 337223 335471 333251 331704
53777C31704Q6J097L85j252k194j948j259o68J10J144J529M24j379j863j13K337
53761C28140L129J814J16m44j44J38N74J801L336L884L207K524K779L555M085
53746C58494M497N361O588P554P923P685O688M973L581L884N680O760N328K451
53732D37447R32J679K549J467n32r16N18J343J55j478j646r21j099k270k935k486
53716D31807j887k014k717l538m070l659k194j135k188m659n824m564k958l260
53702C87140m839n504m563k948j165Q48K261J664q49l424m733n242n798o167n741
53687C40940m625l147j020J912M563N361M124K304J198P31L35K28R89K239K734
53672C58866K046J312J709K640K462R06l00L05J881K415J400L52P34K197L337
$$ plain form
53777 331704 331790 332887 333272 332020 329826 327878 326619 325951 326061 327205 328734 329158 327779 325916 325803 328140
53761 328140 331269 333083 333199 332755 332611 332749 333323 335124 338460 342344 345551 348075 350854 354409 358494
53746 358494 362991 368352 374940 382494 390417 398102 404790 409763 413344 417228 422908 429668 434996 437447
53732 437447 438379 440058 442607 444074 443542 442626 443144 444487 444642 443164 441518 440597 439498 437228 434293 431807
53716 431807 429920 427906 425189 421651 417581 413922 411728 410593 408405 403746 397922 393358 390400 387140
53702 387140 382301 376797 372234 369286 368121 368969 371230 372894 372045 368621 363888 358646 352848 346681 340940
53687 340940 336315 333168 332148 334060 338623 343984 348108 350412 351610 352341 352676 352904 353893 356132 358866
53672 358866 360912 362224 363933 366573 369035 369941 369641 369946 371827 374242 375642 375994 376728 378925 382262
53657C82262L501L289L486M043M263L733K891K498K683K930K977L244L961M487
53643D30248M202L588L512L730L348K712L301N234O378N099K773K061L348M507
53629D84041L930K169N13n22p95j26R73J251K86p70q60o32j393l097m460m637
53613D75871l706j922M20K432L074K299R67l81j783k945l164k417j573j164q72
53598D65136n55p52j539j832p47J020K087K167K012J935J510P26M00J195K734
53583D75497M061M573M345L808L255K585J610O89O36J686L043L909M550N501O274
53568E26022N768L949K040J022R78J987M312P186Q708Q027O684O606P520P696
53554E98505O784O268P003P965Q006P487P276P221O733O215O544P441P603O512
$$ plain form
53657 382262 385763 389052 392538 396581 400844 404577 407468 409966 412649 415579 418556 421800 425761 430248
53643 430248 434450 438038 441550 445280 448628 451340 454641 459875 466253 471352 474125 476186 479534 484041
53629 484041 487971 490140 490653 490131 489336 489210 490183 491434 491720 490950 490090 489458 488065 484968 480508 475871
53613 475871 472165 470243 470663 473095 476169 478468 479435 479054 477271 474326 471162 468745 467172 466008 465136
53598 465136 464581 463829 462290 460458 459711 460731 462818 464985 466997 468932 470442 471168 471568 472763 475497
53583 475497 479558 484131 488476 492284 495539 498124 499734 500423 501059 502745 505788 509697 514247 519748 526022
53568 526022 531790 535739 537779 538801 539779 541766 546078 553264 561972 569999 576683 583289 590809 598505
53554 598505 605289 611557 618560 626525 634531 642018 649294 656515 663248 669463 676007 683448 691051 697563
53540F97563M986L647J989l52k344k621j460o83j439k888l498l057k821l732n101
53525F78189n462m493l486l704m725m999l820k066r57p68j039j355j405q27L71
53510F39454J443J607R14O3l57l0J238L042M176L763K485J810K128K509K310J902
53494F68457J735J730K009L145N107O803P372P158O895O625O234O242P131Q432
53480G45075R497J0658J2622J4983J6446J6521J6037J5971J6595J7765J9116J9869
53468I31155J9438J8594J9146K1891K5521K8059K8938K9117K9636L0729L2080
53457A214304L3304L4145L4796L6099L8820M2399M4969M5178M3802M2893M3337
53446A654046M3990M3448M1887M0503L9833L9591L9694M0231M0485L9283L6702
$$ plain form
53540 697563 702549 706196 708185 707833 705489 702868 701408 700725 699286 696398 692900 689843 687022 683290 678189
53525 678189 672727 668234 664748 661044 656319 651320 647500 645434 644477 643709 642670 641315 639910 639083 639454
53510 639454 640897 642504 643418 643481 643124 643094 644332 647374 651550 655313 657798 659608 661736 664245 666555 668457
53494 668457 670192 671922 673931 677076 682183 688986 696358 703516 710411 717036 723270 729512 736643 745075
53480 745075 754572 765230 777852 792835 809281 825802 841839 857810 874405 892170 911286 931155
53468 931155 950593 969187 988333 1010224 1035745 1063804 1092742 1121859 1151495 1182224 1214304
53457 1214304 1247608 1281753 1316549 1352648 1391468 1433867 1478836 1524014 1567816 1610709 1654046
53446 1654046 1698036 1741484 1783371 1823874 1863707 1903298 1942992 1983223 2023708 2062991 2099693
53435B099693L4319L3244L2881L2223L1398L1095L1215L1075L0447K9540K8354
53424B445484K6868K5394K4091K2579K0771J9425J8944J8144J5415J0795N789
53413B653699J383k747p113j1519j5282j7661j8385j8472j9981k3757k7953l0182
53401B462030l0632l1381l2938l3629l2709l1885l2712l4289l4831l4211l3445
53390B099368l2673l1246k9298k7791k7019k6183k4475k1844j8633j5024j1127
53379A834055p314m305k718k258j631K35K984N523P708J0375J3677J6584J8428
53366A891343J9918K2093K5173K8824L2558L5427L6591L6951L8869M3163M7457
53355B258367M9057M8693M9792N4242O0360O5163O7401O8024O8625P0079P2327
$$ plain form
53435 2099693 2134012 2167256 2200137 2232360 2263758 2294853 2326068 2357143 2387590 2417130 2445484
53424 2445484 2472352 2497746 2521837 2544416 2565187 2584612 2603556 2621700 2637115 2647910 2653699
53413 2653699 2655082 2652335 2645222 2633703 2618421 2600760 2582375 2563903 2543922 2520165 2492212 2462030
53401 2462030 2431398 2400017 2367079 2333450 2300741 2268856 2236144 2201855 2167024 2132813 2099368
53390 2099368 2066695 2035449 2006151 1978360 1951341 1925158 1900683 1878839 1860206 1845182 1834055
53379 1834055 1826741 1822436 1819718 1817460 1815829 1816064 1819048 1824571 1832279 1842654 1856331 1872915 1891343
53366 1891343 1911261 1933354 1958527 1987351 2019909 2055336 2091927 2128878 2167747 2210910 2258367
53355 2258367 2307424 2356117 2405909 2460151 2520511 2585674 2653075 2721099 2789724 2859803 2932130
53344B932130P4990P8020Q1600Q5469Q8909R1599R3834R5525R5767R4135R1817
53333C903795R0637R1153R2338R2774R1582Q8539Q4164P9510P5234P0853O5389
53322D825968N8620N1373M4617L8514L2235K4729J6008P454J94o616j4785k4420
53310E053891l3772m2031n0495o0170o9842p7787q3905q8779r2014r3279r3784
53299D268033r4877r6071r6315r6134r6350r5671r2202q6949q3055q1496q0236
53288C268677p7971p5952p5328p5124p4067p2179o9374o4548n7746n1502m8157
53277B526729m7050m5858m3648m0997l8091l4492l0353k6480k3361k1120j9918
53266B155361j9533j9022j7771j6282j5131j3811j1595q858o485m516k484m61
$$ plain form
53344 2932130 3007120 3085140 3166740 3252209 3341118 3432717 3526551 3622076 3717843 3811978 3903795
53333 3903795 3994432 4085585 4177923 4270697 4362279 4450818 4534982 4614492 4689726 4760579 4825968
53322 4825968 4884588 4935961 4980578 5019092 5051327 5076056 5092064 5099518 5099712 5093096 5078311 5053891
53310 5053891 5020119 4978088 4927593 4867423 4797581 4719794 4635889 4547110 4455096 4361817 4268033
53299 4268033 4173156 4077085 3980770 3884636 3788286 3692615 3600413 3513464 3430409 3348913 3268677
53288 3268677 3190706 3114754 3039426 2964302 2890235 2818056 2748682 2684134 2626388 2574886 2526729
53277 2526729 2479679 2433821 2390173 2349176 2311085 2276593 2246240 2219760 2196399 2175279 2155361
53266 2155361 2135828 2116806 2099035 2082753 2067622 2053811 2042216 2033358 2026873 2022357 2019873 2019412
53254B019412J372L613O766R938J1761J2436J3454J5428J7624J9656K2122K5156
53242B178738K7781K9479L1193L3871L6834L8706L9518M0692M3000M5479M6772
53231B592063M6707M5981M4736M2406L8952L5240L1747K7818K2990J8183J4339
53220B961162J0454M641k755r011j2599j5230j9239k4374k8681l1541l4081l7110
53208B761636m0260m3076m5592m7737m9250n0255n0972n1069n0321m9764n0907
53197B232433n3689n6318n7336n6839n5554n3910n2376n1560n1401n1076n0090
53186A642284m8699m7003m4634m1823l9629l8421l7143l4977l2875l2185l2380
53175A212515l1369k8064k3619k0060j8468j8527j9103j9090j8267j7534j7879
$$ plain form
53254 2019412 2020784 2024397 2031163 2041101 2052862 2065298 2078752 2094180 2111804 2131460 2153582 2178738
53242 2178738 2206519 2235998 2267191 2301062 2337896 2376602 2416120 2456812 2499812 2545291 2592063
53231 2592063 2638770 2684751 2729487 2771893 2810845 2846085 2877832 2905650 2928640 2946823 2961162
53220 2961162 2971616 2976257 2973502 2964491 2951892 2936662 2917423 2893049 2864368 2832827 2798746 2761636
53208 2761636 2721376 2678300 2632708 2584971 2535721 2485466 2434494 2383425 2333104 2283340 2232433
53197 2232433 2178744 2122426 2065090 2008251 1952697 1898787 1846411 1794851 1743450 1692374 1642284
53186 1642284 1593585 1546582 1501948 1460125 1420496 1382075 1344932 1309955 1277080 1244895 1212515
53175 1212515 1181146 1153082 1129463 1109403 1090935 1072408 1053305 1034215 1015948 998414 980535
53164I80535j8997j9426j8289j6516j5893j7053j8709j8967j7218j4632j2858
53153G91977j2531j3090j3745j4046j3809j3129j2655j3155j4427j5197j4590
53142F41603j3274j2463j2187j1440r953q860r122j0057j0119q879p491p066p184
53129E13508o521m744l114k954l985m739m454l730l332l137k766k529k915l555
53115D61033l614l057k617k487j997q98j11n13j625k218j912j440j601k443l479
53100D31021l978l234j216Q45J236l77k313k583j147K9p21k812m107l373j623
53085D05647p28j124j493p50N72J396J863K880M177M074J800r37j720m08P89K19
53069D16257j230j620o31K26j43j032j178n25J10N57J368K385K526J455L99M36
$$ plain form
53164 980535 961538 942112 923823 907307 891414 874361 855652 836685 819467 804835 791977
53153 791977 779446 766356 752611 738565 724756 711627 698972 685817 671390 656193 641603
53142 641603 628329 615866 603679 592239 582286 573426 564304 554247 544128 535249 527758 520692 513508
53129 513508 506987 502243 499129 496175 492190 487451 482997 479267 475935 472798 470032 467503 464588 461033
53115 461033 457419 454362 451745 449258 447261 446363 446252 445739 444114 441896 439984 438544 436943 434500 431021
53100 431021 427043 423809 422593 423438 424674 424297 421984 419401 418254 418283 417562 414750 410643 407270 405647
53085 405647 404919 403795 402302 401552 402124 403520 405383 408263 412440 416514 418314 417377 415657 415249 416038 416257
53069 416257 415027 413407 412776 413002 412859 411827 410649 410124 410234 410791 412159 414544 417070 418525 418924 419360
53053D19360Q10J27j387k175j746j254j560k098k190k141k253j870n17Q70J020
53038D02996J11o31p87j070j882k580k338j034P78K222K391R48j394l339l988
53023C90403l264j710k71K33n1j7R60K041K084J297Q04R45R64K28j180k872m157
53006C86437l966j984K61P18o78k062k207j641j069k91O72R49K42l01K68J231
52990C76579J390Q15L07j72j244k736l695l591k706j562o77n23r70j113m24L05
52974C59983qj072j538q24K89Q57P33K30m54j103j359j168j062j500j964j085
52958C48955J682M677N240K922N43R02L104L845J994k83j145j375k079k496j875
52943C64611j451k253k606m97K623L412J507k51m60p58j994k039P34M197N031
$$ plain form
53053 419360 420170 420297 418910 416735 414989 413735 412175 410077 407887 405746 403493 401623 401106 401976 402996
53038 402996 403107 402476 401689 400619 398737 396157 393819 392785 393563 395785 398176 399124 397730 394391 390403
53023 390403 387139 385429 385158 385391 385340 385323 386283 388324 390408 391705 392509 393454 394418 394646 393466 390594 386437
53006 386437 382471 380487 380748 381466 380788 378726 376519 374878 373809 373518 374190 375139 375381 375080 375348 376579
52990 376579 377969 378784 379091 378919 377675 374939 371244 367653 364947 363385 362708 362185 361215 360102 359678 359983
52974 359983 359975 358903 357365 356541 356830 357687 358420 358650 358196 357093 355734 354566 353504 352004 350040 348955
52958 348955 350637 355314 360554 363476 364019 364921 368025 371870 373864 373581 372436 371061 368982 366486 364611
52943 364611 363160 360907 358301 357804 360427 363839 365346 365095 364635 363877 361883 359844 360578 364775 369806
52928C69806L121J222J075J956K636K786K329J055o39j677j523p39l8N79J363
52913C83312K053K204J993K136K861L469L282K764L040M198M753L369N90j823
52899D18201l002l479l696l200j776m50n05j771k866l075l124l727m063k683M6
52884C80830J619L23k226k886j095M80j48j552j318K83R81Q9p54m23J10l92j563
52867C72358k195j882j136n46l77m37r0R44J776J174o39k081k285j897j345J69
52851C61511K962N236M676J322k271l643k452j44J535J642M41r28j365n95P65
52836C68692J727J596N51m58p41o96j039j478j043J73P50j96j819k769k799k451
52820C58000j903r19M64J873K942L314K744J639R76J338K420L666M664M693L014
$$ plain form
52928 369806 372927 374149 375224 377180 379816 382602 384931 385986 385347 383670 382147 381408 381370 381949 383312
52913 383312 385365 387569 389562 391698 394559 398028 401310 404074 407114 411312 416065 419434 420024 418201
52899 418201 415199 411720 408024 404824 403048 402598 402093 400322 397456 394381 391257 387530 383467 380784 380830
52884 380830 382449 382772 380546 377660 376565 377045 376897 375345 374027 374310 375291 375380 374626 374203 374313 373921 372358
52867 372358 370163 368281 367145 366599 366222 365785 365695 366639 368415 369589 368950 366869 364584 362687 361342 361511
52851 361511 364473 369709 374385 375707 373436 369793 367341 367197 368732 370374 370815 369887 368522 367927 368692
52836 368692 370419 372015 372566 372108 371367 370671 369632 368154 367111 367284 368034 367838 366019 363250 360451 358000
52820 358000 356097 355178 355642 357515 360457 363771 366515 368154 369130 370468 372888 376554 381218 385911 388925
52805C88925K90j402r91J3m79k192k926j586O05J941K054J668J473J625J791J345
52789C92154k9j851l302m010m101l679k920k489l090m474n437m989l195r12Q74
52774C48550J484Q71l37j390k055k472k589k176j319m78rQ4j06n06q78p96K2J352
52756C37252K507K777K085J095N14L29R9j12K78J429K707L528L946M132L767K421
52740C68754J64k397m402n063m323l166k628k459j692m59N5m31q78q90j366k402
52724C36417k350m02J599J654N90M60J133R18j23j50J250K257J684M95j67m61
52708C44804o28j16R98J331L2j699j998m19K057M024M167K044q23j761M3K320
52692C54376K521Q91m52n65l37n23p09l30M26J074J422J608J937K633L354L256
$$ plain form
52805 388925 389215 387813 386822 386835 386356 384164 381238 379652 380257 382198 384252 385920 387393 389018 390809 392154
52789 392154 392125 390274 386972 382962 378861 375182 372262 369773 366683 362209 356772 351783 348588 347676 348550
52774 348550 350034 350905 350568 349178 347123 344651 342062 339886 338567 338089 338080 338164 338058 337552 336674 335878 335900 337252
52756 337252 339759 342536 344621 345716 346230 346559 346658 346546 346824 348253 350960 354488 358434 362566 366333 368754
52740 368754 368918 366521 362119 357056 352733 349567 346939 344480 342788 342329 342384 341953 341075 340185 338819 336417
52724 336417 334067 333665 335264 336918 337508 337968 339101 340019 339896 339746 340996 343253 344937 345432 345265 344804
52708 344804 344176 344060 345058 346389 346421 344722 342724 342305 344362 348386 352553 354597 353774 352013 352056 354376
52692 354376 356897 357788 357336 356771 356434 355911 355202 354872 355298 356372 357794 359402 361339 363972 367326 370582
52676C70582K134J078J215K034K068J222J103K508L739K620l52k312j660k1J81
52661C86139r58j365l46M08l88j486j017N95J133m16k850m587n127m502k793o63
52645C61777O70P88N64P43Q61K35o97r58n00j65l22l96J21Q41J012O03M36J266
52627C66879K906M392M889M191K526M32j158j427o69r3k43l15K16L46j019l053
52611C78800l918l244k182j279n5J281J592P40L2M4l23j713k731j817M45K191
52595C67863K550K006J272R78J725L237M070L219J494L28q9l89m87J13R79J205
52579C90074J005J367K184K093N20j395k259j891j002k55l1l59p05l68O91J890
52563C91559K921L938M663M182K037r36l332m396m259l399k229j067j28M68P07
$$ plain form
52676 370582 372716 373794 375009 377043 379111 380333 381436 383944 387683 390303 389951 387639 385979 385958 386139
52661 386139 385181 383816 383470 383878 383490 382004 380987 381582 382715 382299 379449 374862 369735 365233 362440 361777
52645 361777 362447 363235 363799 364542 365403 365638 364941 363983 363483 363318 362996 362600 362721 363562 364574 365177 365613 366879
52627 366879 369785 374177 379066 383257 385783 386215 385057 383630 382961 382868 382625 382310 382526 382872 381853 378800
52611 378800 374882 371638 369456 368177 368122 369403 370995 371735 371767 371811 371488 369775 367044 365227 365672 367863
52595 367863 370413 372419 373691 374669 376394 379631 383701 386920 388414 388742 388653 388264 387777 387890 388869 390074
52579 390074 391079 392446 394630 396723 397243 395848 393589 391698 390696 390441 390410 390051 389346 388978 389669 391559
52563 391559 394480 398418 403081 407263 409300 408364 405032 400636 396377 392978 390749 389682 389554 390022 390729
52548C90729O97O70P40P41M26k15r87j665j986j743j066m22RO08J608K393K086
52531C92623Q20j63J69J513K584K431J254Ro69r62j270j515j375q07K02K010M478
52514D01332O033M937J778p11r64l91r59k279k565j537o48p85j395j819k001j795
52498C96231r32Q6K41l81m86M55J235O14q64j636j098j8O90P40K27o64j495j640
52480C91305q84K64J183J936K996M089M006K164j12q03L71J702J737O34r00k658
52464D07030m235m622l530k157j540j125j39P04M16j98N32K579M346M981M886
52449D07928M175K648J237J520L304M537M159L368L481M057L931K736P22j627
52435D46176l236l096j914j636k649l082j772k19k83j506k258k243k113j675l95
$$ plain form
52548 390729 391426 392096 392836 393577 394003 393788 392801 391136 389150 387407 386341 385919 385928 386536 388144 390537 392623
52531 392623 393443 393280 393449 394962 397546 399977 401231 401240 400571 399609 398339 396824 395449 394642 394844 396854 401332
52514 401332 407365 412302 414080 413369 412405 412014 411055 408776 406211 404674 404026 403241 401846 400027 398026 396231
52498 396231 395299 395385 395626 395245 394759 395214 396449 397063 396199 394563 393465 393447 394137 394877 395104 394440 392945 391305
52480 391305 390421 390685 391868 393804 396800 400889 404895 407059 406947 406144 406515 408217 409954 410588 409688 407030
52464 407030 402795 398173 394643 392486 390946 389821 389682 390386 390802 390604 391136 393715 398061 403042 407928
52449 407928 412103 414751 415988 417508 420812 425349 429508 432876 436357 440414 444345 447081 447803 446176
52435 446176 442940 439844 437930 436294 433645 430563 428791 428572 428289 426783 424525 422282 420169 418494 418099
52420D18099R87J180L22l06k64k05l71l52k11m53q00l18J094K438L060L223L217
52403D30340K836K110J619J828K622L621M314M021K431K41j408k074k089j833
52389D48579j697k396m184n878n898m320k802k319k162j543r36j084j577j367
52375D10416k69Q69J323J312J567K344L042K930K287K146K640K391M45j887k465
52360D29091j231p1J72O51K010K863K075R85J655L844N516N919O361P831R575
52345D77246J0589J1158J1906J2081J0061N412l24n131q203r747r708p642m091
52332D93607j080l86j532k493k191j302n61L88J821K804K388J169N56Q87J391
$$ plain form
52420 418099 419086 420266 420588 420282 420018 419813 419442 419090 418879 418426 417626 417308 418402 420840 423900 427123 430340
52403 430340 433176 435286 436905 438733 441355 444976 449290 453311 455742 455983 454575 452501 450412 448579
52389 448579 446882 444486 440302 434424 428526 424206 421404 419085 416923 415380 414444 413360 411783 410416
52375 410416 410147 411016 412339 413651 415218 417562 420604 423534 425821 427967 430607 432998 433443 431556 429091
52360 429091 427860 427789 427961 428612 430622 433485 435560 436545 438200 442044 447560 453479 459840 467671 477246
52345 477246 487835 498993 510899 522980 533041 538453 538129 532998 524795 515048 505340 497698 493607
52332 493607 492527 492141 490609 488116 485925 484623 484062 484450 486271 489075 491463 492632 493188 494075 495466
$$ [...]
##END NTUPLES=NMR SPECTRUM
##END=
