
##TITLE=UV1066_Cafestol_6114776_qL7CiwJWX0
##JCAMPDX= 6.0         $$ Bruker NMR JCAMP-DX V2.0
##DATA TYPE= NMR SPECTRUM
##DATA CLASS= NTUPLES
##ORIGIN= BRUKER
##OWNER= Administrator
$$ 1.72 TOPSPIN		Version 2.1
$$ 2012-05-14 21:20:57.781 -0500  Administrator@TOPSPIN
$$ Compression mode = diff/dup
##.OBSERVE FREQUENCY= 400.13188235
##.OBSERVE NUCLEUS= ^1H
##.ACQUISITION MODE= SIMULTANEOUS (DQD)
##.ACQUISITION SCHEME= undefined
##.AVERAGES= 512
##.DIGITISER RES= 22
##SPECTROMETER/DATA SYSTEM= spect
##.PULSE SEQUENCE= noesygpps1d.comp
##.SOLVENT NAME= COFFEE_meoh
##.SHIFT REFERENCE= INTERNAL, COFFEE_meoh, 1, 14.96657
##AUDIT TRAIL= $$ (NUMBER, WHEN, WHO, WHERE, PROCESS, VERSION, WHAT)
$$ ##TITLE= Audit trail, TOPSPIN		Version 2.1
$$ ##JCAMPDX= 5.01
$$ ##ORIGIN= Bruker BioSpin GmbH
$$ ##OWNER= Administrator
$$ $$ C:\Bruker\TOPSPIN/data/COFFEE/nmr/UV1066_Cafestol_6114776_qL7CiwJWX0/12/pdata/1/auditp.txt
$$ ##AUDIT TRAIL=  $$ (NUMBER, WHEN, WHO, WHERE, PROCESS, VERSION, WHAT)
(   1,<2012-05-14 21:20:52.171 -0500>,<Administrator>,<TOPSPIN>,<go>,<TOPSPIN 2.1>,
      <created by zg
	started at 2012-05-14 19:54:23.906 -0500,
	POWCHK enabled, PULCHK disabled,
       configuration hash MD5:
       AF F2 23 6B 01 CD 40 DD E5 A1 38 A0 06 EA F7 77
       data hash MD5: 64K
       17 99 C4 49 0C CD 2A 7B DF 26 B6 F7 F5 8D 8D AC>)
(   2,<2012-05-14 21:20:55.734 -0500>,<Administrator>,<TOPSPIN>,<proc1d>,<TOPSPIN 2.1>,
      <Start of raw data processing
       efp LB = 0.3 FT_mod = 6 PKNL = 1 PHC0 = 0 PHC1 = 0 SI = 128K 
       data hash MD5: 128K
       57 0E 1F 12 26 3E AD 12 EE 4F 31 32 C9 54 29 85>)
(   3,<2012-05-14 21:20:57.000 -0500>,<Administrator>,<TOPSPIN>,<proc1d>,<TOPSPIN 2.1>,
      <pk PHC0 = 36.87012 PHC1 = 0 
       data hash MD5: 128K
       D8 A4 93 C5 2A D0 B1 FC 88 8E E3 55 E8 F6 4D 1E>)
(   4,<2012-05-14 21:20:57.265 -0500>,<Administrator>,<TOPSPIN>,<proc1d>,<TOPSPIN 2.1>,
      <abs ABSG = 1 
       data hash MD5: 128K
       15 DC 5E D4 83 98 03 AD AF 35 78 04 35 FA BA BC>)
(   5,<2012-05-14 21:20:57.343 -0500>,<Administrator>,<TOPSPIN>,<proc1d>,<TOPSPIN 2.1>,
      <abs ABSG = 2 
       data hash MD5: 128K
       E9 0D 43 1A C7 53 76 7E 5D D6 DD 78 6A B6 00 30>)
(   6,<2012-05-14 21:20:57.390 -0500>,<Administrator>,<TOPSPIN>,<proc1d>,<TOPSPIN 2.1>,
      <abs ABSG = 3 
       data hash MD5: 128K
       AC 3D 0C 64 F4 6E A8 37 13 DD 53 40 FD 65 11 A1>)
(   7,<2012-05-14 21:20:57.453 -0500>,<Administrator>,<TOPSPIN>,<proc1d>,<TOPSPIN 2.1>,
      <abs ABSG = 4 
       data hash MD5: 128K
       B0 3F 86 A4 7E AF 55 38 35 EB B0 FA 68 CB 76 C0>)
(   8,<2012-05-14 21:20:57.515 -0500>,<Administrator>,<TOPSPIN>,<proc1d>,<TOPSPIN 2.1>,
      <abs ABSG = 5 
       data hash MD5: 128K
       09 46 5A 95 91 47 0C C1 8E 1C 40 35 97 12 21 D5>)
$$ ##END=
$$ 
$$ $$ hash MD5
$$ $$ 6E 40 6C 6B E8 D5 09 6B 11 CD BE 0E B1 E1 08 72
##$RELAX= 
##$RELAX= 
##$RELAX= 
##$RELAX= 
##$RELAX= 
##$RELAX= 
##$RELAX= 
##$RELAX= 
$$ Bruker specific parameters
$$ [...]
##$TP07= 0
##$TPNAME0= <>
##$TPNAME1= <>
##$TPNAME2= <>
##$TPNAME3= <>
##$TPNAME4= <>
##$TPNAME5= <>
##$TPNAME6= <>
##$TPNAME7= <>
##$TPOAL= (0..7)
0.5 0.5 0.5 0.5 0.5 0.5 0.5 0.5
##$TPOFFS= (0..7)
0 0 0 0 0 0 0 0
##$TUNHIN= 0
##$TUNHOUT= 0
##$TUNXOUT= 0
##$USERA1= <user>
##$USERA2= <user>
##$USERA3= <user>
##$USERA4= <user>
##$USERA5= <user>
##$V9= 5
##$VALIST= <valist>
##$VCLIST= <CCCCCCCCCCCCCCC>
##$VD= 0
##$VDLIST= <DDDDDDDDDDDDDDD>
##$VPLIST= <PPPPPPPPPPPPPPP>
##$VTLIST= <TTTTTTTTTTTTTTT>
##$WBST= 2048
##$WBSW= 25
##$XGAIN= (0..3)
0 0 0 0
##$XL= 0
##$YL= 0
##$YMAX_a= 44583351
##$YMIN_a= -30557641
##$ZGOPTNS= <>
##$ZL1= 120
##$ZL2= 120
##$ZL3= 120
##$ZL4= 120
##$ABSF1= 14.96657
##$ABSF2= -5.58596
##$ABSG= 5
##$ABSL= 3
##$ALPHA= 0
##$AQORDER= 0
##$ASSFAC= 0
##$ASSFACI= 0
##$ASSFACX= 0
##$ASSWID= 0
##$AUNMP= <proc_prof1d_extract.lims>
##$AXLEFT= 0
##$AXNAME= <>
##$AXNUC= <1H>
##$AXRIGHT= 0
##$AXTYPE= 0
##$AXUNIT= <>
##$AZFE= 0.1
##$AZFW= 0.1
##$BCFW= 0
##$BC_mod= 0
##$BYTORDP= 0
##$COROFFS= 0
##$CY= 15
##$DATMOD= 1
##$DC= 0
##$DFILT= <>
##$DTYPP= 0
##$F1P= 0
##$F2P= 0
##$FCOR= 0.5
##$FTSIZE= 131072
##$FT_mod= 6
##$GAMMA= 0
##$GB= 0
##$INTBC= 1
##$INTSCL= 1
##$ISEN= 128
##$LB= 0.3
##$LEV0= 0
##$LPBIN= 0
##$MAXI= 10000
##$MC2= 0
##$MEAN= 0
##$ME_mod= 0
##$MI= 0
##$NCOEF= 0
##$NC_proc= 0
##$NLEV= 6
##$NOISF1= 0
##$NOISF2= 0
##$NSP= 0
##$NTH_PI= 0
##$NZP= 0
##$OFFSET= 14.96657
##$PC= 1
##$PHC0= 36.87012
##$PHC1= 0
##$PH_mod= 1
##$PKNL= yes
##$PPARMOD= 0
##$PPDIAG= 0
##$PPIPTYP= 0
##$PPMPNUM= 2147483647
##$PPRESOL= 1
##$PSCAL= 4
##$PSIGN= 0
##$PYNMP= <proc.py>
##$REVERSE= no
##$SF= 400.130005618937
##$SI= 131072
##$SIGF1= 0
##$SIGF2= 0
##$SINO= 400
##$SIOLD= 131072
##$SPECTYP= <>
##$SREGLST= <1H.CDCl3>
##$SSB= 0
##$STSI= 131072
##$STSR= 0
##$SW_p= 8223.68421052632
##$SYMM= 0
##$S_DEV= 0
##$TDeff= 65536
##$TDoff= 0
##$TI= <>
##$TILT= no
##$TM1= 0
##$TM2= 0
##$TOPLEV= 0
##$USERP1= <user>
##$USERP2= <user>
##$USERP3= <user>
##$USERP4= <user>
##$USERP5= <user>
##$WDW= 1
##$XDIM= 131072
##$YMAX_p= 324115251
##$YMIN_p= -20672630
##$CURPLOT= <Network HP LaserJet P1505>
##$CURPRIN= <$Network HP LaserJet P1505>
##$DFORMAT= <normdp>
##$LAYOUT= <+/1D_H.xwp>
##$LFORMAT= <normlp>
##$PFORMAT= <normpl>
##$SURQMSG= 1
$$ End of Bruker specific parameters
$$ ---------------------------------
##NTUPLES= NMR SPECTRUM
##VAR_NAME=  FREQUENCY,     SPECTRUM/REAL,   SPECTRUM/IMAG
##SYMBOL=    X,             R,               I
##VAR_TYPE=  INDEPENDENT,   DEPENDENT,       DEPENDENT
##VAR_FORM=  AFFN,          ASDF,            ASDF
##VAR_DIM=   131072,        131072,          131072
##UNITS=     HZ,            ARBITRARY UNITS, ARBITRARY UNITS
##FACTOR=    0.0627417313425165, 1,          1
##FIRST=     8223.62146879498, 2634,         -45526
##LAST=      0,             3515,            -44787
##MIN=       0,             -20672630,       0
##MAX=       8223.62146879498, 324115251,    0
$$ Real data points
##PAGE= N=1
##DATA TABLE= (X++(R..R)), XYDATA
$$ [...]
$$ plain form
65009 236277 237854 239160 240218 241162 242240 243719 245637 247638 249163 249944 250405 251496 253916 257459 261236
64994 261236 264576 267469 270099 272361 274137 275772 277843 280560 283702 287028 290346 293307 295644 297666
64980 297666 300059 303037 306071 308634 310811 312993 315330 317824 320570 323514 326232 328371 330209 332367
64966 332367 335016 337755 340239 342560 344952 347517 350403 353893 358005 362192 365787 368716 371533 374735
64952 374735 378285 381871 385392 388935 392436 395716 398905 402495 406718 411149 415257 419184 423527 428399
64938 428399 433208 437534 441704 446143 450595 454529 458065 461914 466395 471071 475438 479485 483405 487257
64924 487257 491249 495918 501508 507323 512228 515848 518918 522404 526641 531416 536507 541737 546714 550963
64910 550963 554458 557774 561538 565867 570416 574815 578866 582473 585661 588707 592005 595703 599607 603516
$$ packed form
65009B36277J577J306J058R44J078J479J918K001J525P81M61J091K420L543L777
64994B61236L340K893K630K262J776J635K071K717L142L326L318K961K337K022
64980B97666K393K978L034K563K177K182K337K494K746K944K718K139J838K158
64966C32367K649K739K484K321K392K565K886L490M112M187L595K929K817L202
64952C74735L550L586L521L543L501L280L189L590M223M431M108L927M343M872
64938D28399M809M326M170M439M452L934L536L849M481M676M367M047L920L852
64924D87257L992M669N590N815M905L620L070L486M237M775N091N230M977M249
64910E50963L495L316L764M329M549M399M051L607L188L046L298L698L904L909
$$ plain form
64896 603516 607417 611222 614584 617209 619222 620944 622403 623391 623993 624674 625733 626942 627933 628698 629505 630484
64880 630484 631529 632486 633202 633472 633190 632552 631875 631222 630366 629145 627641 625982 624167 622204 620188 618132
64864 618132 615833 613096 610046 607077 604516 602402 600521 598501 595935 592564 588425 583831 579185 574813
64850 574813 570847 567147 563406 559416 555155 550614 545699 540528 535612 531415 527736 523903 519638 515398
64836 515398 511663 508265 504688 500753 496621 492311 487682 482889 478402 474471 470832 467043 462863 458241
64822 458241 453290 448435 444276 440973 437899 434166 429409 423900 418114 412501 407572 403724 400783 397938
64808 397938 394424 390252 386109 382572 379519 376361 372724 368772 364912 361366 358112 355006 351793 348151
64794 348151 344024 339874 336305 333427 330853 328297 325795 323238 320167 316337 312151 308184 304552 301094
$$ packed form
64896F03516L901L805L362K625K013J722J459R88O02O81J059J209R91P65Q07R79
64880F30484J045R57P16K70k82o38o77o53q56j221j504j659j815j963k016k056
64864F18132k299k737l050k969k561k114j881k020k566l371m139m594m646m372
64850E74813l966l700l741l990m261m541m915n171m916m197l679l833m265m240
64836E15398l735l398l577l935m132m310m629m793m487l931l639l789m180m622
64822D58241m951m855m159l303l074l733m757n509n786n613m929l848k941k845
64808C97938l514m172m143l537l053l158l637l952l860l546l254l106l213l642
64794C48151m127m150l569k878k574k556k502k557l071l830m186l967l632l458
$$ plain form
64780 301094 297888 295106 292489 289521 286136 282867 280228 278291 276839 275546 273944 271671 268962 266525
64766 266525 264746 263270 261554 259496 257281 254870 252022 248751 245505 242860 241078 239890 238666 236939
64752 236939 234781 232534 230227 227604 224771 222368 220830 219773 218414 216387 213919 211438 209342 207915
64738 207915 207061 206266 205161 204039 203408 203127 202429 200838 198692 196636 194930 193428 191927 190308 188537
64723 188537 186766 185295 184170 182905 180843 177964 175158 173508 173272 173678 173785 173371 172849 172474 172023 171234
64707 171234 170196 169124 168090 167181 166584 166229 165601 164299 162549 160824 159205 157558 156155 155490 155491 155464 154961
64690 154961 154187 153415 152540 151411 150175 148970 147664 146201 144902 144103 143716 143439 143194 143092 143151 143302 143450
64673 143450 143319 142525 141075 139578 138588 137976 137242 136232 135152 134130 133206 132599 132396 132098 131046 129415
$$ packed form
64780C01094l206k782k617k968l385l269k639j937j452j293j602k273k709k437
64766B66525j779j476j716k058k215k411k848l271l246k645j782j188j224j727
64752B36939k158k247k307k623k833k403j538j057j359k027k468k481k096j427
64738B07915q54p95j105j122o31k81o98j591k146k056j706j502j501j619j771
64723A88537j771j471j125j265k062k879k806j650k36M06J07m14n22l75m51p89
64707A71234j038j072j034r09n97l55o28j302j750j725j619j647j403o65Jk7n03
64690A54961p74p72q75j129j236j205j306j463j299p99l87k77k45j02N9J51J48
64673A43450j31p94j450j497r90o12p34j010j080j022r24o07k03k98j052j631
$$ plain form
64657 129415 128217 128162 128944 129776 130159 129870 128764 127027 125339 124273 123702 123098 122284 121486 120803 120087 119361
64640 119361 118951 119064 119505 119969 120406 120916 121469 121846 121785 121145 120033 118871 118161 118004 117958 117490 116564 115600 114965
64621 114965 114648 114451 114289 114179 114059 113779 113274 112663 112162 111896 111769 111564 111246 111079 111280 111552 111218 110009
64603 110009 108502 107508 107173 107004 106710 106559 106785 107080 106967 106448 105960 105796 105865 105922 105760 105268 104553 103996 103893
64584 103893 104064 104097 103982 104168 104888 105746 106170 106042 105656 105204 104609 103802 102971 102434 102340 102486 102458 102041 101515 101376
64564 101376 101704 101991 101741 101028 100296 99764 99340 98983 98809 98789 98665 98318 97977 97925 98121 98275 98205 97918 97427 96693
64544 96693 95810 95106 94917 95252 95735 95970 95940 95985 96289 96526 96184 95235 94295 93959 94105 94038 93300 92198 91464 91463
64524 91463 91801 91736 90923 89737 88843 88531 88569 88618 88632 88766 89034 89235 89155 88743 88115 87532 87395 88006 89203 90276
$$ packed form
64657A29415j198n5P82Q32L83k89j106j737j688j066n71o04q14p98o83p16p26
64640A19361m10J13M41M64M37N10N53L77o1o40j112j162p10j57m6m68r26r64o35
64621A14965l17j97j62j10j20k80n05o11n01k66j27k05l18j67K01K72l34j209
64603A10009j507r94l35j69k94j51K26K95j13n19m88j64O9N7j62m92p15n57j03
64584A03893J71L3j15J86P20Q58M24j28l86m52n95q07q31n37r4J46k8m17n26j39
64564A01376L28K87k50p13p32n32m24l57j74k0j24l47l41n2J96J54p0k87m91p34
64544I6693q83p04j89L35M83K35l0M5L04K37l42r49r40l36J46o7p38j102p34j
64524I1463L38o5q13j186q94l12L8M9J4J34K68K01q0m12o28n83j37O11J197J073
$$ plain form
64504 90276 90458 89568 88183 87086 86613 86529 86493 86468 86598 86845 86951 86760 86368 85907 85368 84794 84432 84504 84924 85438
64484 85438 85956 86552 87174 87602 87718 87616 87456 87419 87747 88536 89425 89826 89605 89251 89163 89101 88610 87711 86821 86173
64464 86173 85726 85512 85629 85907 86028 86059 86426 87205 87814 87680 86943 86215 85853 85732 85621 85477 85352 85210 84857
64445 84857 84060 82844 81694 81258 81687 82445 82920 83058 83156 83262 83109 82597 81987 81560 81371 81371 81533 81760 81876
64426 81876 81847 81883 82152 82512 82630 82302 81599 80755 79987 79372 78843 78313 77787 77340 77035 76979 77344 78169 79143 79800
64406 79800 79996 79996 80034 80034 79923 79994 80654 81824 82843 83063 82437 81483 80790 80609 80841 81278 81796 82321 82676 82586 81906
64385 81906 80813 79734 79030 78751 78685 78636 78628 78828 79265 79722 79950 79921 79738 79387 78759 77954 77339 77202 77471 77914
64365 77914 78462 79125 79653 79560 78607 77190 76060 75666 75826 76005 75875 75554 75386 75619 76301 77295 78244 78631 78143
$$ packed form
64504I0276J82q90j385j097m73q4l6k5J30K47J06j91l92m61n39n74l62P2M20N14
64484H5438N18N96O22M28J16j02j60l7L28P89Q89M01k21l54q8o2m91q99q90o48
64464H6173m47k14J17K78J21L1L67P79O09j34p37p28l62j21j11j44j25j42l53
64445H4857p97j216j150m36M29P58M75J38R8J06j53n12o10m27j89%J62K27J16
64426H1876k9L6K69L60J18l28p03q44p68o15n29n30n26m47l05n6L65Q25R74O57
64406G9800J96%L8%j11P1O60J170J019K20o26r54o93j81K32M37N18N25L55r0o80
64385H1906j093j079p04k79o6m9qK00M37M57K28k9j83l51o28q05o15j37K69M43
64365G7914N48O63N28r3r53j417j130l94J60J79j30l21j68K33O82R94R49L87m88
$$ plain form
64346 78143 77071 76129 75778 75828 75818 75610 75426 75392 75359 75210 75105 75247 75563 75772 75775 75791 76079 76613 77115 77302 77023
64325 77023 76239 75093 74034 73649 74180 75253 76238 76827 77087 77060 76607 75748 74874 74394 74305 74288 74115 73833 73629
64306 73629 73748 74431 75654 76914 77538 77309 76667 76161 75899 75678 75488 75574 75946 76122 75607 74558 73665 73359
64288 73359 73374 73237 72933 72804 72905 72855 72363 71596 70943 70703 71091 72174 73521 74266 73935 73079 72722 73260 74265
64269 74265 75231 76014 76470 76248 75282 74191 73792 74293 75181 75858 76146 76239 76344 76483 76579 76671 76929 77373 77668 77427
64249 77427 76743 76140 75900 75723 75244 74611 74248 74166 73899 73138 72095 71183 70582 70278 70269 70473 70578 70237 69505 68894
64229 68894 68902 69570 70550 71508 72315 72895 73102 72897 72476 72111 71887 71788 71913 72344 72837 72940 72590 72328 72713 73649
64209 73649 74515 74807 74455 73627 72529 71428 70631 70343 70645 71548 72873 74136 74854 75059 75259 75705 75969 75512
$$ packed form
64346G8143j072r42l51N0j0k08j84l4l3j49j05J42L16K09LJ6K88N34N02J87k79
64325G7023p84j146j059l85N31J073R85N89K60k7m53q59q74m80q9j7j73k82k04
64306G3629J19O83J223J260O24k29o42n06k62k21j90Q6L72J76n15j049q93l06
64288G3359J5j37l04j29J01n0m92p67o53k40L88J083J347P45l31q56l57N38J005
64269G4265R66P83M56k22r66j091l99N01Q88O77K88R3J05J39R6R2K58M44K95k41
64249G7427o84o03k40j77m79o33l63q2k67p61j043r12o01l04rK04J05l41p32o11
64229F8894QO68R80R58Q07N80K07k05m21l65k24r9J25M31M93J03l50k62L85R36
64209G3649Q66K92l52q28j098j101p97k88L02R03J325J263P18K05K00M46K64m57
$$ plain form
64191 75512 74490 73647 73425 73498 73297 72740 72234 72160 72561 73267 74053 74619 74641 74014 72982 71948 71159 70604 70109
64172 70109 69498 68765 68157 67955 68119 68299 68346 68608 69424 70492 71107 71017 70593 70119 69384 68229 67083 66564 66800
64153 66800 67492 68403 69351 69937 69836 69320 68988 68912 68544 67629 66737 66576 67076 67517 67381 66794 66225 65974 65914 65614
64133 65614 64865 64134 64253 65465 66989 67789 67623 67082 66837 67165 68011 69092 69897 70048 69791 69854 70681 71949
64115 71949 72882 72877 71865 70363 69245 69137 69873 70678 70965 70763 70372 69932 69517 69256 69109 68733 67901 66884
64097 66884 66112 65648 65303 65118 65323 65846 66290 66436 66405 66300 66049 65749 65774 66336 67201 68016 68666 69133 69344 69361
64077 69361 69451 69687 69768 69513 69203 69063 68755 67955 67180 67276 68133 68669 68301 67732 67912 68787 69574 69794 69522 68955
64057 68955 68348 68146 68586 69195 69230 68628 68062 68019 68283 68455 68525 68715 69097 69549 69824 69565 68555 67154 66180
$$ packed form
64191G5512j022q43k22P3k01n57n06p4M01P06P86N66K2o27j032j034p89n55m95
64172G0109o11p33o08k02J64J80M7K62Q16J068O15r0m24m74p35j155j146n19K36
64153F6800O92R11R48N86j01n16l32p6l68r15q92j61N00M41j36n87n69k51o0l00
64133F5614p49p31J19J212J524Q00j66n41k45L28Q46J081Q05J51k57O3Q27J268
64115G1949R33nj012j502j118j08P36Q05K87k02l91m40m15k61j47l76q32j017
64097F6884p72m64l45j85K05N23M44J46l1j05k51l00K5N62Q65Q15O50M67K11J7
64077F9361R0K36Q1k55l10j40l08q00p75R6Q57N36l68n69J80Q75P87K20k72n67
64057F8955o07k02M40O09L5o02n66m3K64J72P0J90L82M52K75k59j010j401r74
$$ plain form
64038 66180 66139 66774 67490 67949 68054 67713 66973 66219 65892 66069 66551 67198 67909 68404 68382 67949 67595 67685 68127 68531
64018 68531 68542 68054 67287 66635 66299 66077 65688 65201 64945 64974 64914 64407 63580 62949 62935 63462 63992 64012 63591 63323 63623
63997 63623 64201 64475 64338 64228 64498 65068 65697 66240 66559 66507 66133 65687 65307 64978 64863 65304 66251 67047 67077 66430
63977 66430 65632 64952 64334 63833 63719 64113 64814 65481 65817 65657 65137 64667 64442 64091 63221 62242 62118 63165 64575
63958 64575 65401 65552 65455 65160 64412 63429 62921 63175 63661 63790 63669 63756 64077 64233 64044 63731 63440 63025 62456 62085
63938 62085 62239 62751 63197 63433 63646 63947 64208 64280 64157 63886 63580 63468 63707 64060 64073 63677 63309 63268 63236 62736
63918 62736 61837 61077 60845 61132 61771 62552 63110 63135 62797 62622 62852 63206 63421 63672 64197 64779 64928 64508 63872
63899 63872 63435 63357 63598 64041 64505 64831 65063 65369 65760 66041 66090 66030 66020 65999 65724 65046 64031 62870 61747 60802
$$ packed form
64038F6180m1O35P16M59J05l41p40p54l27J77M82O47P11M95k2m33l54R0M42M04
64018F8531J1m88p67o52l36k22l89m87k56K9o0n07q27o31j4N27N30K0m21k68L00
63997F3623N78K74j37j10K70N70O29N43L19n2l74m46l80l29j15M41R47P96L0o47
63977F6430p98o80o18n01j14L94P01O67L36j60n20m70k25l51q70r79j24J047J410
63958F4575Q26J51r7k95p48r83n08K54M86J29j21Q7L21J56j89l13k91m15n69l71
63938F2085J54N12M46K36K13L01K61P2j23k71l06j12K39L53J3l96l68m1l2n00
63918F2736q99p60k32K87O39P81N58K5l38j75K30L54K15K51N25N82J49m20o36
63899F3872m37p8K41M43M64L26K32L06L91K81M9o0j0k1k75o78j015j161j123r45
$$ plain form
63879 60802 60158 59941 60209 60798 61303 61360 61023 60700 60672 60813 60936 61185 61803 62592 62974 62679 62103 61820 61974 62345
63859 62345 62772 63171 63292 62856 61999 61222 60792 60494 60131 59988 60445 61345 62122 62538 62920 63561 64216 64397 63957
63840 63957 63134 62158 61141 60366 60323 61218 62588 63671 64144 64283 64414 64457 64168 63638 63272 63305 63578 63833 64007
63821 64007 64136 64111 63711 62823 61602 60481 60014 60496 61616 62615 62998 62999 63209 63854 64648 65278 65757 66240 66713
63802 66713 66957 66710 65845 64535 63299 62688 62811 63275 63690 64083 64665 65294 65406 64569 63015 61540 60852 61003
63784 61003 61430 61563 61309 60943 60652 60381 60132 60114 60480 61023 61345 61229 60770 60220 59855 59934 60613 61796 63164
63765 63164 64336 65011 65073 64667 64099 63509 62723 61639 60682 60536 61323 62342 62803 62580 62026 61294 60263 59049
63747 59049 58102 57689 57644 57846 58550 59873 61267 61991 62007 61909 61941 61638 60653 59459 58848 59034 59656 60416 61276
$$ packed form
63879F0802o44k17K68N89N05N7l37l23k8J41J23K49O18P89L82k95n76k83J54L71
63859F2345M27L99J21m36q57p77m30k98l63j43M57R00P77M16L82O41O55J81m40
63840F3957q23r76j017p75m3Q95J370J083M73J39J31M3k89n30l66L3K73K55J74
63821F4007J29k5m00q88j221j121m67M82J120R99L83JK10O45P94O30M79M83M73
63802F6713K44k47q65j310j236o11J23M64M15L93N82O29J12q37j554j475o88J51
63784F1003M27J33k54l66k91k71k49j8L66N43L22j16m59n50l65P9O79J183J368
63765F3164J172O75O2m06n68n90p86j084r57j46P87J019M61k23n54p32j031j214
63747E9049r47m13m5K02P04J323J394P24J6r8L2l03r85j194o11J86O22P60Q60
$$ plain form
63728 61276 62092 62597 62798 63054 63626 64440 65316 66128 66615 66427 65538 64384 63401 62673 62229 62341 63152 64168
63710 64168 64538 63898 62673 61594 61116 61265 61746 62114 62070 61686 61245 60860 60441 59983 59655 59517 59418 59276 59258
63691 59258 59498 59843 60088 60272 60499 60582 60179 59350 58624 58413 58554 58651 58666 58910 59527 60281 60935 61582 62434 63437
63671 63437 64229 64423 63830 62569 61088 59959 59415 59164 58789 58291 58011 58161 58713 59678 61059 62443 63100
63654 63100 62765 62059 61826 62275 63016 63674 64044 63846 62862 61408 60250 59862 60025 60311 60669 61305 62144 62706
63636 62706 62576 61820 60938 60427 60396 60579 60668 60592 60455 60291 59995 59478 58781 58064 57564 57516 57945 58570 59036 59233
63616 59233 59303 59363 59388 59391 59502 59775 60059 60154 60048 59919 59953 60153 60324 60282 60157 60409 61421 63055 64735 65918
63596 65918 66402 66260 65703 64994 64294 63526 62545 61425 60414 59651 59130 58892 58979 59160 59059 58701 58644 59361 60687
$$ packed form
63728F1276Q16N05K01K56N72Q14Q76Q12M87j88q89j154r83p28m44J12Q11J016
63710F4168L70o40j225j079m78J49M81L68m4l84m41l85m19m58l28j38r9j42j8
63691E9258K40L45K45J84K27Q3m03q29p26k11J41R7J5K44O17P54O54O47Q52J003
63671F3437P92J94n93j261j481j129n44k51l75m98k80J50N52R65J381J384O57
63654F3100l35p06k33M49P41O58L70j98r84j454j158l88J63K86L58O36Q39N62
63636F2706j30p56q82n11l1J83Q9p6j37j64k96n17o97p17n00m8M29O25M66J97
63616E9233P0O0K5LJ11K73K84R5j06j29L4K00J71m2j25K52J012J634J680J183
63596F5918M84j42n57p09p00p68r81j120j011p63n21k38Q7J81j01l58n7P17J326
$$ plain form
63577 60687 62050 63048 63625 63907 64129 64584 65366 66190 66633 66506 65915 65114 64469 64355 64822 65506 66108 66799 67871
63558 67871 69091 69818 69771 69346 69075 69115 69393 69926 70724 71536 71967 71831 71253 70492 69823 69535 69808 70504 71197
63539 71197 71575 71795 72277 73128 73920 74185 74000 73862 74066 74478 74933 75497 76167 76672 76814 76752 76623 76127 74964
63520 74964 73553 72824 73182 74083 74755 74989 75025 75024 74967 74870 74817 74821 74802 74657 74261 73568 72833 72531 72839 73328 73361 72771
63498 72771 71954 71401 71376 71934 72948 74040 74735 74850 74607 74337 74206 74317 74836 75765 76675 76931 76279 75130
63480 75130 74203 73941 74259 74734 74968 74904 74934 75651 77281 79327 80889 81436 81186 80720 80347 79955 79375 78702 78274
63461 78274 78393 79056 79910 80515 80695 80577 80270 79686 78803 77918 77351 76979 76384 75472 74641 74227 74081 73894 73667
63442 73667 73566 73449 72882 71669 70181 68979 68278 67845 67369 66815 66389 66266 66472 66986 67779 68646 69176 69086
$$ packed form
63577F0687J363R98N77K82K22M55P82Q24M43j27n91q01o45j14M67O84O02O91J072
63558F7871J220P27m7m25k71M0K78N33P98Q12M31j36n78p61o69k88K73O96O93
63539G1197L78K20M82Q51P92K65j85j38K04M12M55N64O70N05J42o2j29m96j163
63520G4964j411p29L58R01O72K34L6jn7r7n3Mj9j45l96o93p35l02L08M89L3n90
63498G2771q17n53k5N58J014J092O95J15k43k70j31J11N19R29R10K56o52j149
63480G5130r27k62L18M75K34o4L0P17J630K046J562N47k50m66l73l92n80o73m28
63461G8274J19O63Q54O05J80j18l07n84q83q85n67l72n95r12q31m14j46j87k27
63442G3667j01j17n67j213j488j202p01m33m76n54m26j23K06N14P93Q67N30r0
$$ plain form
63424 69086 68563 68043 67674 67214 66501 65776 65386 65382 65577 65851 66173 66432 66456 66185 65659 64949 64228 63846 64085 64826
63404 64826 65620 66124 66337 66478 66779 67385 68233 69017 69477 69742 70133 70585 70577 69864 68990 68753 69220 69628 69297 68363
63384 68363 67518 67275 67624 68221 68631 68517 67854 67013 66472 66357 66375 66217 65920 65769 65990 66656 67753 69152 70559
63365 70559 71682 72480 73199 74126 75363 76799 78164 79184 79831 80417 81285 82373 83317 84002 84791 86030 87564
63348 87564 88987 90196 91365 92441 93052 93036 92750 92676 92876 93065 93057 92846 92271 90929 88615 85763 83243 81671
63330 81671 80957 80513 79898 79211 78897 79218 79990 80826 81490 81910 81947 81426 80466 79569 79171 79216 79334 79316 79198 79005
63310 79005 78733 78562 78697 78896 78561 77557 76566 76283 76493 76401 75745 75103 75069 75571 76145 76511 76685 76782 76914 77110
63290 77110 77240 77150 76927 76808 76815 76786 76835 77352 78415 79571 80461 81284 82286 83168 83459 83219 82883 82577 82122 81607
$$ packed form
63424F9086n23n20l69m60p13p25l90mJ95K74L22K59K4k71n26p10p21l82K39P41
63404F4826P94N04K13J41L01O06Q48P84M60K65L91M52qp13q74k37M67M08l31r34
63384F8363q45k43L49N97M10j14o63q41n41j15J8j58k97j51K21O66J097J399J407
63365G0559J123P98P19R27J237J436J365J020O47N86Q68J088R44O85P89J239J534
63348H7564J423J209J169J076O11j6k86p4K00J89qk11n75j342k314k852k520j572
63330H1671p14m44o15o87l14L21P72Q36O64M20L7n21r60q97l98M5J18j8j18j93
63310G9005k72j71J35J99l35j004r91k83K10r2o56o42l4N02N74L66J74R7J32J96
63290G7110J30r0k23j19Pk9M9N17J063J156Q90Q23J002Q82K91k40l36l06m55n15
$$ plain form
63270 81607 81372 81396 81254 80781 80242 79679 78653 77007 75465 74997 75738 76900 77641 77706 77332 76836 76364 75840
63252 75840 75098 74146 73288 72892 73054 73530 73921 73933 73575 73129 72819 72503 71899 71163 70934 71649 73047 74567 75972
63233 75972 77353 78712 79869 80637 80795 80043 78414 76564 75237 74425 73502 72212 70989 70150 69337 68133
63217 68133 66811 65947 65550 65101 64378 63711 63356 63109 62653 61970 61223 60549 60162 60354 61126 61983 62375 62213 61785
63198 61785 61358 61137 61425 62386 63618 64318 64037 63095 62188 61787 61972 62528 63026 63013 62379 61475 60723 60234 59892
63179 59892 59636 59458 59240 58872 58452 58173 58032 57837 57467 56997 56583 56453 56892 58003 59460 60720 61531 62046
63161 62046 62426 62599 62468 62117 61677 61169 60624 60204 60051 60106 60218 60347 60535 60745 60874 60862 60755 60667 60707 60853
63141 60853 60895 60618 60113 59750 59802 60240 60907 61674 62320 62513 62151 61593 61349 61632 62362 63453 64795 66053 66819
$$ packed form
63270H1607k35K4j42m73n39n63j026j646j542m68P41J162P41O5l74m96m72n24
63252G5840p42r52q58l96J62M76L91J2l58m46l10l16o04p36k29P15J398J520J405
63233G5972J381J359J157P68J58p52j629j850j327q12r23j290j223q39q13j204
63217F8133j322q64l97m49p23o67l55k47m56o83p47o74l87J92P72Q57L92j62m28
63198F1785m27k21K88R61J232P00k81r42r07m01J85N56M98j3o34r04p52m89l42
63179E9892k56j78k18l68m20k79j41j95l70m70m14j30M39J111J457J260Q11N15
63161F2046L80J73j31l51m40n08n45m20j53N5J12J29J88K10J29j2j07q8M0J46
63141F0853M2k77n05l63N2M38O67P67O46J93l62n58k44K83P30J091J342J258P66
$$ plain form
63122 66819 67019 66961 66934 66943 66844 66566 66123 65573 65028 64524 63837 62641 60958 59341 58409 58334 58878 59811 61019 62226
63102 62226 62903 62656 61640 60449 59624 59351 59540 59977 60403 60688 61010 61675 62591 63127 62772 61792 60913 60460
63084 60460 60117 59581 59033 58798 58852 58910 58756 58321 57644 57036 57031 57871 59135 60083 60290 59800 58901 58069 57880 58563
63064 58563 59665 60497 60879 61114 61325 61252 60766 60162 59735 59401 58952 58491 58372 58786 59514 60062 60069 59687 59509 59931
63044 59931 60679 61214 61470 61802 62270 62434 62014 61332 60901 60895 61211 61673 61990 61827 61223 60658 60490 60592 60748 61026
63024 61026 61459 61709 61516 61188 61175 61414 61563 61682 62093 62641 62737 62189 61479 61075 60909 60754 60684 60920 61476 62150
63004 62150 62723 63021 62982 62740 62446 62024 61358 60683 60404 60504 60544 60398 60524 61239 62168 62744 62982 63343 64026 64810
62984 64810 65428 65751 65673 65208 64654 64375 64397 64475 64515 64625 64740 64538 63871 63054 62590 62706 63225 63799 64179 64389
$$ packed form
63122F6819K00n8k7Rr9k78m43n50n45n04o87j196j683j617r32p5N44R33J208J207
63102F2226O77k47j016j191q25k73J89M37M26K85L22O65R16N36l55r80q79m53
63084F0460l43n36n48k35N4N8j54m35o77o08nQ40J264R48K07m90q99q32j89O83
63064E8563J102Q32L82K35K11p3m86o04m27l34m49m61j19M14P28N48Pl82j78M22
63044E9931P48N35K56L32M68J64m20o82m31oL16M62L17j63o04n65j68J02J56K78
63024F1026M33K50j93l28j3K39J49J19M11N48R6n48p10m04j66j55p0K36N56O74
63004F2150N73K98l9k42k94m22o66o75k79J00M0j46J26P15R29N76K38L61O83P84
62984F4810O18L23p8m65n54k79K2P8M0J10J15k02o67q17m64J16N19N74L80K10
$$ plain form
62964 64389 64687 65318 66247 67131 67593 67512 67105 66755 66678 66769 66801 66766 66806 66847 66643 66316 66461 67370 68458 68924 68808
62943 68808 68844 69342 69812 69810 69552 69384 69141 68520 67755 67438 67817 68676 69769 70930 71801 71930 71247 70173 69148
62924 69148 68319 67715 67368 67151 66797 66318 66121 66431 66816 66612 65762 64854 64350 64128 63890 63706 63889 64489 65176
62905 65176 65625 65824 65968 66208 66517 66733 66680 66337 65890 65560 65372 65163 64802 64321 63827 63381 62981 62569 62037
62886 62037 61355 60698 60311 60237 60321 60465 60683 60847 60680 60199 59908 60264 61131 61989 62546 62842 62916 62748 62467 62226
62866 62226 61910 61383 61004 61383 62476 63415 63470 62818 62068 61471 60966 60652 60707 60994 61195 61246 61297 61377 61445 61642 62105
62845 62105 62612 62846 62899 63116 63429 63367 62754 61963 61369 60993 60779 60753 60723 60324 59648 59375 59897 60681 60937 60637
62825 60637 60438 60784 61521 62242 62606 62415 61845 61538 62039 63095 63890 64014 63787 63585 63297 62682 61892 61339 61216
$$ packed form
62964F4389K98O31R29Q84M62q1m07l50p7R1L2l5M0M1k04l27J45R09J088M66j16
62943F8808L6M98M70kk58j68k43o21p65l17L79Q59J093J161Q71J29o83j074j025
62924F9148q29o04l47k17l54m79j97L10L85k04q50r08n04k22k38j84J83O00O87
62905F5176M49J99J44K40L09K16n3l43m47l30j88k09l61m81m94m46m00m12n32
62886F2037o82o57l87p4Q4J44K18J64j67m81k91L56Q67Q58N57K96P4j68k81k41
62866F2226l16n27l79L79J093R39N5o52p50n97n05l14N5K87K01N1N1Q0O8J97M63
62845F2105N07K34N3K17L13o2o13p91n94l76k14k6l0l99o76k73N22P84K56l00
62825F0637j99L46P37P21L64j91n70l07N01J056P95J24k27k02k88o15p90n53j23
$$ plain form
62806 61216 61416 61787 62216 62586 62890 63351 64206 65368 66382 66794 66505 65802 65116 64711 64519 64273 63823 63336
62788 63336 63152 63473 64186 64936 65377 65414 65229 65058 64951 64817 64616 64366 63992 63353 62458 61526 60718 59990 59330
62769 59330 58980 59250 60116 61184 62045 62587 62928 63148 63171 62896 62393 61938 61805 62069 62596 63167 63501 63293 62493
62750 62493 61596 61405 62309 63890 65408 66492 67215 67677 67852 67802 67671 67416 66799 65868 65163 65227 66029 67055
62732 67055 67859 68326 68503 68516 68644 69140 69827 70059 69352 67924 66461 65426 64832 64578 64734 65339 66181 66925
62714 66925 67417 67717 67924 68052 68054 67874 67516 67126 66927 66965 67003 66790 66411 66198 66289 66461 66418 66124 65762 65491 65315
62693 65315 65141 64893 64625 64532 64749 65134 65356 65266 65043 64889 64764 64576 64510 64892 65692 66427 66642 66370 65963 65620
62673 65620 65305 65073 65211 65879 66694 66919 66150 64725 63403 62697 62587 62799 63120 63394 63383 62871 61982 61259 61262
$$ packed form
62806F1216K00L71M29L70L04M61Q55J162J014M12k89p03o86m05j92k46m50m87
62788F3336j84L21P13P50M41L7j85j71j07j34k01k50l74o39q95r32q08p28o60
62769E9330l50K70Q66J068Q61N42L41K20K3k75n03m55j33K64N27N71L34k08q00
62750F2493q97j91R04J581J518J084P23M62J75n0j31k55o17r31p05O4Q02J026
62732F7055Q04M67J77J3J28M96O87K32p07j428j463j035n94k54J56O05Q42P44
62714F6925M92L00K07J28Kj80l58l90j99L8L8k13l79k13R1J72m3k94l62k71j76
62693F5315j74k48k68r3K17L85K22r0k23j54j25j88o6L82Q00P35K15k72m07l43
62673F5620l15k32J38O68Q15K25p69j425j322p06j10K12L21K74j1n12q89p23L
$$ plain form
62654 61262 62015 62914 63289 63067 62815 63101 63907 64715 65078 64949 64541 64053 63621 63390 63472 63812 64148 64167 63764 63175
62634 63175 62787 62735 62759 62493 61866 61124 60586 60479 60886 61611 62229 62519 62763 63322 63978 64167 63843 63597 63751 63869
62614 63869 63554 63222 63513 64238 64550 64070 63241 62598 62246 62156 62439 63068 63761 64349 64925 65463 65675 65476 65245
62595 65245 65301 65468 65429 65267 65262 65392 65469 65597 66092 66978 67974 68886 69664 70131 70084 69741 69641 70003 70535 70984 71474
62574 71474 72144 72853 73529 74437 75728 76952 77486 77330 77094 77220 77574 77842 77948 77962 77868 77626 77306 77022 76826
62555 76826 76765 76903 77192 77444 77569 77729 78141 78771 79337 79562 79369 78913 78523 78537 79085 79987 80937 81715 82202 82355
62535 82355 82330 82533 83298 84477 85489 85882 85687 85166 84316 82812 80473 77706 75363 74097 73840 73920 73694
62518 73694 73044 72270 71661 71274 71035 70882 70827 70934 71262 71725 72081 72170 72089 71998 71819 71336 70575 69865 69442 69185
$$ packed form
62654F1262P53Q99L75k22k52K86Q06Q08L63j29m08m88m32k31Q2L40L36J9m03n89
62634F3175l88n2K4k66o27p42n38j07M07P25O18K90K44N59O56J89l24k46J54J18
62614F3869l15l32K91P25L12m80q29o43l52r0K83O29O93N88N76N38K12j99k31
62595F5245N6J67l9j62nJ30P7J28M95Q86R96R12P78M67m7l43j00L62N32M49M90
62574G1474O70P09O76R08J291J224N34j56k36J26L54K68J06J4r4k42l20k84j96
62555G6826o1J38K89K52J25J60M12O30N66K25j93m56l90J4N48R02R50P78M87J53
62535H2355k5K03P65J179J012L93j95n21q50j504k339k767k343j266k57Q0k26
62518G3694o50p74o09l87k39j53n5J07L28M63L56Q9q1r1j79m83p61p10m23k57
$$ plain form
62498 69185 68837 68318 67770 67438 67609 68462 69828 71223 72251 72888 73305 73610 73891 74305 74926 75635 76309 76978
62480 76978 77643 78161 78525 79066 80040 81149 81858 82119 82400 82995 83678 84112 84199 83911 83123 81865 80505 79450
62462 79450 78798 78467 78454 78763 79196 79485 79581 79661 79871 80185 80420 80320 79731 78909 78513 79084 80461 81867 82586
62443 82586 82492 81933 81291 80716 80210 79818 79643 79694 79753 79506 78838 77967 77282 77018 77068 77060 76693 76043 75480 75151 74669
62422 74669 73515 71771 70217 69591 69855 70247 70019 69085 68094 67840 68517 69575 70423 71106 71974 72822 72907 71953
62404 71953 70654 69862 69619 69339 68675 67812 67072 66627 66479 66383 65911 64926 63922 63531 63789 64259 64781 65615 66788
62385 66788 67770 68029 67588 66885 66381 66410 67086 68058 68660 68590 68314 68540 69366 70181 70369 69926 69333 68947 68663 68185
62365 68185 67564 67299 67768 68743 69654 70221 70557 70728 70605 70182 69668 69154 68498 67713 67128 66944 66952 66900 66885 67070
$$ packed form
62498F9185l48n19n48l32J71Q53J366J395J028O37M17L05K81M14O21P09O74O69
62480G6978O65N18L64N41R74J109P09K61K81N95O83M34Q7k88p88j258j360j055
62462G9450o52l31j3L09M33K89R6Q0K10L14K35j00n89q22l96N71J377J406P19
62443H2586r4n59o42n75n06l92j75N1N9k47o68q71o85k64N0ql67o50n63l29m82
62422G4669j154j744j554o26K64L92k28r34r91k54O77J058Q48O83Q68Q48Q5r54
62404G1953j299p92k43k80o64q63p40m45j48r6m72r85j004l91K58M70N22Q34J173
62385F6788R82K59m41p03n04K9O76R72O02p0k76K26Q26Q15J88m43n93l86k84m78
62365F8185o21k65M69R75R11N67L36J71j23m23n14n14o56p85n85j84Qn2j5J85
$$ plain form
62345 67070 67276 67225 67051 67140 67577 68063 68341 68394 68227 67819 67333 67065 67113 67296 67455 67579 67613 67431 67122 67072 67616
62324 67616 68719 70141 71705 73307 74833 76223 77503 78628 79453 79989 80533 81346 82249 82749 82536 81739
62308 81739 80731 79854 79304 79104 79120 79224 79490 80130 81211 82521 83772 84836 85725 86416 86835 87008 87192 87756
62290 87756 88854 90154 90976 90859 90033 89235 88991 89205 89510 89836 90432 91367 92304 92827 92815 92421 91812 91049 90145
62271 90145 89145 88201 87576 87444 87610 87545 86849 85597 84152 82766 81491 80360 79403 78537 77652 76800 76171
62254 76171 75908 76084 76718 77606 78259 78336 78128 78244 78778 79172 79021 78600 78352 78207 77797 77084 76413 76024 75872
62235 75872 75842 75841 75693 75297 74940 75137 76034 77151 77828 77857 77560 77359 77347 77292 77041 76785 76786 76879 76607 75951 75573 75984
62213 75984 76763 77072 76823 76780 77498 78685 79795 80771 81842 82920 83620 83806 83830 84216 85242 86775 88356
$$ packed form
62345F7070K06n1j74Q9M37M86K78N3j67m08m86k68M8J83J59J24L4j82l09n0N44
62324F7616J103J422J564J602J526J390J280J125Q25N36N44Q13R03N00k13p97
62308H1739j008q77n50k00J6J04K66O40J081J310J251J064Q89O91M19J73J84N64
62290H7756J098J300Q22j17q26p98k44K14L05L26N96R35R37N23j2l94o09p63r04
62271I0145j000r44o25j32J66o5o96j252j445j386j275j131r57q66q85q52o29
62254G6171k63J76O34Q88O53P7k08J16N34L94j51m21k48j45m10p13o71l89j52
62235G5872l0jj48l96l57J97Q97J117O77K9k97k01j2n5k51k56JR3k72o56l78M11
62213G5984P79L09k49m3P18J187J110R76J071J078P00J86K4L86J026J533J581
$$ plain form
62196 88356 89549 90269 90728 91020 91023 90811 90926 91884 93478 94876 95473 95429 95315 95357 95194 94378 93039 91955 91847
62177 91847 92636 93465 93487 92566 91190 89893 88807 87633 85974 83828 81868 81027 81568 82669 83125 82485 81325
62160 81325 80462 80103 79823 79165 78085 76881 75894 75370 75490 76276 77411 78341 78757 78897 79165 79532 79573 79063
62142 79063 78245 77443 76738 76166 75877 75906 76009 75986 75937 76002 76040 75849 75525 75288 75120 74860 74573 74520 74852 75587 76742
62121 76742 78226 79653 80631 81147 81421 81515 81397 81308 81552 81999 82218 82147 82229 82826 83894 85243 86662 87714
62103 87714 87923 87384 86765 86546 86666 87031 87788 88771 89292 88946 88229 87888 88001 88208 88474 89001 89613 89878 89742
62084 89742 89443 88851 87522 85488 83461 82104 81490 81361 81479 81587 81450 81096 80728 80315 79645 78846 78430 78625
62066 78625 79070 79366 79583 79893 80073 79715 78745 77442 76095 74910 74109 73816 73904 74120 74286 74300 74115 73912 74075
$$ packed form
62196H8356J193P20M59K92Lk12J15R58J594J398N97m4j14M2j63q16j339j084j08
62177I1847P89Q29K2r21j376j297j086j174j659k146j960q41N41J101M56o40j160
62160H1325q63l59k80o58j080j204r87n24J20P86J135R30M16J40K68L67M1n10
62142G9063q18q02p05n72k89K9J03k3m9O5L8j91l24k37j68k60k87n3L32P35J155
62121G6742J484J427R78N16K74R4j18q9K44M47K19p1Q2N97J068J349J419J052
62103H7714K09n39o19k19J20L65P57R83N21l46p17l41J13K07K66N27O12K65j36
62084H9742k99n92j329k034k027j357o14j29J18J08j37l54l68m13o70p99m16J95
62066G8625M45K96K17L10J80l58r70j303j347j185q01k93Q8K16J66J4j85k03J63
$$ plain form
62047 74075 74759 75578 75948 75684 75094 74630 74599 75078 75870 76587 76934 76883 76528 75958 75390 75191 75506 76023 76380 76642
62027 76642 77118 77833 78538 79135 79743 80348 80771 81038 81487 82327 83317 83993 84103 83790 83480 83632 84416 85591 86826
62008 86826 88082 89502 90933 91878 92047 91715 91426 91484 91811 92122 92123 91689 91017 90492 90297 90259 90141 89980 90037 90464
61988 90464 91119 91636 91660 91118 90294 89598 89239 89177 89262 89238 88741 87627 86331 85580 85617 85961 86028 85657 84905 83715
61968 83715 82154 80708 79925 79860 80167 80567 80877 80729 79768 78228 76926 76471 76702 77029 77100 76948 76706 76420
61950 76420 76125 75933 75986 76283 76578 76519 76007 75388 75110 75228 75473 75800 76591 78104 79923 81217 81510 81003 80213
61931 80213 79506 79016 78744 78533 78084 77222 76195 75528 75500 75869 76219 76466 76823 77375 77963 78507 79151 79920 80494
61912 80494 80593 80390 80245 80171 79920 79534 79396 79619 79780 79443 78689 77943 77491 77373 77529 77775 77817 77560 77300 77338
$$ packed form
62047G4075O84Q19L70k64n90m64l1M79P92P17L47n1l55n70n68j99L15N17L57K62
62027G6642M76P15P05N97O08O05M23K67M49Q40R90O76J10l13l10J52P84J175J235
62008H6826J256J420J431R45J69l32k89N8L27L11Jm34o72n25j95l8j18j61N7M27
61988I0464O55N17K4n42q24o96l59o2Q5k4m97j114j296p51L7L44O7l71p52j190
61968H3715j561j446p83o5L07M00L10j48r61j540j302m55K31L27P1j52k42k86
61950G6420k95j92N3K97K95n9n12o19k78J18K45L27P91J513J819J294K93n07p90
61931H0213p07m90k72k11m49q62j027o67k8L69L50K47L57N52N88N44O44P69N74
61912H0494R9k03j45p4k51l86j38K23J61l37p54p46m52j18J56K46M2k57k60L8
$$ plain form
61892 77338 77544 77569 77408 77382 77604 77820 77868 77937 78213 78543 78703 78767 78984 79359 79653 79724 79716 79883 80384 81238 82362
61871 82362 83630 84947 86229 87284 87906 88220 88769 89942 91368 92173 91926 91068 90352 90058 89933 89642 89088
61854 89088 88440 88060 88268 88995 89780 90330 90920 91977 93353 94392 94750 94780 94995 95442 95758 95615 94924 93851
61836 93851 92828 92343 92462 92684 92465 91771 90908 90032 89149 88473 88341 88732 89264 89751 90367 91114 91520 91198 90445
61817 90445 89894 89683 89405 88833 88259 87998 87899 87646 87316 87335 87938 88953 90038 90880 91111 90420 88961 87479
61799 87479 86726 86795 87234 87709 88288 89073 89915 90678 91528 92728 94237 95745 96971 97777 98076 97906 97586 97566
61781 97566 98053 98873 99672 100141 100101 99583 98869 98303 98012 97951 98180 98857 99878 100775 101107 100888 100494 100269 100288 100374
61761 100374 100274 99893 99420 99103 98894 98482 97780 97121 96811 96699 96419 95910 95385 94891 94285 93626 93264 93352 93560
$$ packed form
61892G7338K06K5j61k6K22K16M8O9K76L30J60O4K17L75K94P1qJ67N01Q54J124
61871H2362J268J317J282J055O22L14N49J173J426Q05k47q58p16k94j25k91n54
61854H9088o48l80K08P27P85N50N90J057J376J039L58L0K15M47L16j43o91j073
61836I3851j023m85J19K22k19o94q63q76q83o76j32L91N32M87O16P47M06l22p53
61817I0445n51k11k78n72n74k61r9k53l30J9O03J015J085Q42K31o91j459j482
61799H7479p53O9M39M75N79P85Q42P63Q50J200J509J508J226Q06K99j70l20k0
61781I7566M87Q20P99M69m0n18p14n66k91o1K29O77J021Q97L32k19l94k25J9Q6
61761A00374j00l81m73l17k09m12p02o59l10j12k80n09n25m94o06o59l62Q8K08
$$ plain form
61742 93560 93485 93166 92925 92817 92520 91830 90974 90301 89834 89345 88780 88321 87990 87481 86576 85527 84772 84359 83900
61723 83900 83068 81897 80608 79439 78701 78654 79179 79776 80092 80220 80370 80511 80575 80748 81223 81818 82193 82373 82694
61704 82694 83290 83934 84381 84554 84397 83911 83335 82969 82727 82263 81615 81348 81828 82715 83463 83988 84539 85132 85514
61685 85514 85602 85609 85745 86039 86442 86915 87426 87975 88560 88981 88836 87989 86918 86304 86273 86368 86267 86228 86711 87831
61665 87831 89303 90759 91965 92852 93488 93947 94209 94291 94454 95048 96107 97271 98222 98996 99763 100496 101029 101284
61647 101284 101319 101241 101238 101562 102283 103146 103814 104136 104064 103456 102263 100821 99643 98834 97968 96643 94985 93490
61629 93490 92477 91833 91248 90578 89962 89635 89635 89753 89752 89560 89217 88740 88180 87713 87498 87500 87610 87831 88141 88224 87699
61608 87699 86690 85853 85653 85888 86107 86237 86526 87038 87548 87888 88089 88167 88041 87709 87311 86966 86721 86699 87063
$$ packed form
61742I3560p5l19k41j08k97o90q56o73m67m89n65m59l31n09r05j049p55m13m59
61723H3900q32j171j289j169p38m7N25N97L16J28J50J41O4J73M75N95L75J80L21
61704H2694N96O44M47J73j57m86n76l66k42m64o48k67M80Q87P48N25N51N93L82
61685H5514Q8PJ36K94M03M73N11N49N85M21j45q47j071o14l1R5j01l9M83J120
61665H7831J472J456J206Q87O36M59K62Q2J63N94J059J164R51P74P67P33N33K55
61647A01284L5p8lL24P21Q63O68L22p2o08j193j442j178q09q66j325j658j495
61629I3490j013o44n85o70o16l27%J18jj92l43m77n60m67k15KJ10K21L10Q3n25
61608H7699j009q37k00K35K19J30K89N12N10L40K01P8j26l32l98l45k45k2L64
$$ plain form
61589 87063 87757 88434 88753 88657 88250 87604 86845 86327 86456 87260 88287 89046 89455 89808 90314 90850 91216 91531 92168
61570 92168 93279 94548 95554 96301 97219 98641 100407 102052 103304 104293 105274 106234 106881 107090 107217 107831 109153
61553 109153 110894 112636 114191 115544 116684 117693 118794 120145 121654 123145 124492 125470 125753 125397 125099
61538 125099 125488 126233 126301 125110 122981 120438 117646 114777 112362 110804 109827 108832 107601 106336 105207 104245
61522 104245 103485 102842 101951 100534 98862 97478 96544 95830 95271 95041 95024 94743 94004 93196 92705 92404 91999 91500
61504 91500 90957 90040 88458 86710 85863 86426 87833 89211 90275 91186 91885 92094 91890 91743 91815 91656 90942 90164
61486 90164 90111 90769 91301 91212 91032 91509 92549 93403 93705 93794 94029 94328 94490 94551 94539 94283 93781 93537 94113 95400
61466 95400 96713 97647 98472 99508 100463 100718 100221 99684 99790 100446 101034 101235 101305 101546 101858 101954 101843 101858 102253
$$ packed form
61589H7063O94O77L19r6m07o46p59n18J29Q04J027P59M09L53N06N36L66L15O37
61570I2168J111J269J006P47R18J422J766J645J252R89R81R60O47K09J27O14J322
61553A09153J741J742J555J353J140J009J101J351J509J491J347R78K83l56k98
61538A25099L89P45O8j191k129k543k792k869k415j558r77r95j231j265j129r62
61522A04245p60o43q91j417j672j384r34p14n59k30j7k81p39q08m91l01m05m99
61504I1500n43r17j582j748q47N63J407J378J064R11O99K09k04j47P2j59p14p78
61486I0164n3O58N32q9j80M77J040Q54L02Q9K35K99J62O1j2k56n02k44N76J287
61466I5400J313R34Q25J036R55K55m97n37J06O56N88K01P0K41L12R6j11J5L95
$$ plain form
61447 102253 102913 103518 103929 104383 105288 106722 108218 109211 109715 110258 111046 111529 111080 109853 108617 107865 107479
61430 107479 107197 106948 106639 106040 105085 104063 103280 102699 102009 100903 99259 97260 95449 94406 94208 94394 94562
61413 94562 94743 95011 95071 94612 93906 93644 94150 95043 95753 96099 96244 96299 96152 95686 95001 94357 93960 93844 94000 94477
61393 94477 95247 96040 96499 96511 96221 95735 95057 94338 93896 93828 93872 93832 93878 94162 94358 93972 93029 92117 91765 92021 92626
61372 92626 93245 93536 93358 93057 93239 94075 95024 95455 95320 94981 94608 94079 93447 93100 93275 93697 93905 93815 93686
61353 93686 93601 93285 92554 91708 91245 91293 91548 91743 91967 92448 93208 93997 94470 94405 93884 93332 93215 93637 94273 94712
61333 94712 94738 94324 93612 92944 92701 92919 93293 93652 94205 95114 96094 96731 97008 97176 97209 96790 95884 94992 94689 95069
61313 95069 95720 96154 96257 96381 96950 97898 98609 98582 98023 97562 97509 97659 97736 97681 97477 97066 96537 96137 95995 96000 95986
$$ packed form
61447A02253O60O05M11M54R05J434J496R93N04N43P88M83m49j227j236p52l86
61430A07479k82k49l09n99r55j022p83n81o90j106j644j999j811j043j98J86J68
61413I4562J81K68O0m59p06k62N06Q93P10L46J45N5j47m66o85o44l97j16J56M77
61393I4477P70P93M59J2k90m86o78p19m42o8M4m0M6K84J96l86r43r12l52K56O05
61372I2626O19K91j78l01J82Q36R49M31j35l39l73n29o32l47J75M22K08r0j29
61353I3686q5l16p31q46m63M8K55J95K24M81P60P89M73o5n21n52j17M22O36M39
61333I4712K6m14p12o68k43K18L74L59N53R09R80O37K77J68L3m19r06q92l03L80
61313I5069O51M34J03J24N69R48P11k7n59m61n3J50P7n5k04m11n29m00j42Nj4
$$ plain form
61292 95986 95857 95553 95195 95212 95947 97044 97662 97469 97020 96883 96785 96088 94834 93830 93689 94214 94804 95146 95425
61273 95425 96031 97194 98730 100122 100928 101111 100920 100533 100016 99543 99356 99484 99689 99831 100088 100663 101400 101893
61255 101893 101956 101800 101761 101917 102097 102139 102044 101897 101748 101593 101365 100923 100221 99596 99658 100644 101947 102614 102342 101681
61235 101681 101225 100923 100356 99367 98146 96936 95998 95699 96222 97219 98093 98689 99414 100592 101995 103161 103872
61218 103872 104144 103964 103349 102611 102254 102539 103225 103826 104048 104011 104108 104654 105573 106425 106828 106867 107060 107864 109285
61199 109285 110935 112398 113477 114228 114915 115918 117475 119393 121097 122083 122315 122130 121803 121330 120635 119843
61183 119843 119224 118871 118508 117680 116212 114436 112883 111734 110708 109556 108511 108063 108400 109229 110139 110867
61167 110867 111254 111160 110550 109540 108341 107292 106862 107318 108301 109008 108993 108569 108299 108333 108451 108513 108528 108379 107852
$$ packed form
61292I5986j29l04l58J7P35J097O18j93m49j37r8o97j254j004j41N25N90L42K79
61273I5425O06J163J536J392Q06J83j91l87n17m73j87J28K05J42K57N75P37M93
61255A01893O3j56l9J56J80M2r5j47j49j55k28m42p02o25O2R86J303O67k72o61
61235A01681m56l02n67r89j221j210r38k99N23R97Q74N96P25J178J403J166P11
61218A03872K72j80o15p38l57K85O86O01K22l7R7N46R19Q52M03L9J93Q04J421
61199A09285J650J463J079P51O87J003J557J918J704R86K32j85l27m73o95p92
61183A19843o19l53l63q28j468j776j553j149j026j152j045m48L37Q29R10P28
61167A10867L87r4o10j010j199j049m30M56R83P07j5m24k70L4J18O2J5j49n27
$$ plain form
61148 107852 106992 106201 105852 105906 105947 105566 104758 103991 103797 104215 104739 104859 104476 103723 102686 101610 101100 101647 102963
61129 102963 104176 104751 104916 105185 105780 106616 107471 107994 107841 107117 106493 106608 107472 108598 109621 110540 111438 112220
61111 112220 112738 113041 113387 113987 114773 115497 116061 116629 117329 117959 118181 117973 117634 117332 116945 116404 115930 115730 115664
61092 115664 115404 114785 113859 112724 111507 110421 109628 109046 108420 107598 106666 105871 105427 105326 105332 105259 105228 105413 105571
61073 105571 105163 104128 103164 102952 103354 103702 103674 103459 103219 102872 102430 102134 102111 102170 102068 101755 101300 100806 100464
61054 100464 100396 100424 100214 99745 99376 99376 99639 99988 100383 100716 100695 100233 99730 99678 100104 100648 101062 101418 101900 102601 103441
61033 103441 104122 104302 103995 103675 103804 104356 104998 105566 106083 106474 106642 106774 107215 108008 108825 109415 109862 110346 110881
61014 110881 111352 111607 111440 110697 109490 108138 106911 105975 105530 105636 105937 105905 105471 105087 105016 104971 104651 104261 104110
$$ packed form
61148A07852q60p91l49N4M1l81q08p67j94M18N24J20l83p53j037j076n10N47J316
61129A02963J213N75J65K69N95Q36Q55N23j53p24o24J15Q64J126J023R19Q98P82
61111A12220N18L03L46O00P86P24N64N68P00O30K22k08l39l02l87n41m74k00o6
61092A15664k60o19r26j135j217j086p93n82o26q22r32p95m44j01Op3l1J85J58
61073A05571m08j035r64k12M02L48k8k15k40l47m42k96k3N9j02l13m55m94l42
61054A00464o8K8k10m69l69%K63L49L95L33k1m62n03n2M26N44M14L56M82P01Q40
61033A03441O81J80l07l20J29N52O42N68N17L91J68J32M41P93Q17N90M47M84N35
61014A10881M71K55j67p43j207j352j227r36m45J06L01l2m34l84p1m5l20l90j51
$$ plain form
60995 104110 104026 103643 103067 102770 102887 103079 103178 103507 104352 105431 106159 106296 106117 106024 106178 106486 106833 107251 107853
60976 107853 108647 109497 110259 110932 111596 112302 113086 113972 114811 115278 115192 114827 114702 115060 115679 116163 116267 116034 115782
60957 115782 115955 116728 117751 118451 118595 118396 118075 117622 117000 116321 115670 114976 114184 113391 112720 112236 112029 112172
60939 112172 112446 112406 111923 111449 111454 111795 111945 111771 111725 112218 113108 113892 114236 114183 114004 113934 114046 114268 114538 114915 115479
60918 115479 116158 116708 116860 116475 115573 114328 113041 112024 111488 111496 111986 112815 113821 114885 115897 116708 117207
60901 117207 117467 117673 117866 117877 117626 117314 117199 117265 117258 116986 116501 116070 116056 116676 117705 118539 118766 118602 118573 118847
60881 118847 119134 119169 119055 119067 119372 119979 120780 121558 122112 122444 122669 122720 122349 121482 120389 119349 118346 117252
60863 117252 116187 115465 115252 115407 115681 115923 116094 116174 116154 116056 115923 115731 115365 114775 114197 114076 114596 115355 115707
$$ packed form
60995A04110q4l83n76k97J17J92R9L29Q45J079P28J37j79r3J54L08L47M18O02
60976A07853P94Q50P62O73O64P06P84Q86Q39M67q6l65j25L58O19M84J04k33k52
60957A15782J73P73J023P00J44j99l21m53o22o79o51o94p92p93o71m84k07J43
60939A12172K74m0m83m74NL41J50j74m6M93Q90P84L44n3j79p0J12K22K70L77N64
60918A15479O79N50J52l85r02j245j287j017n36QM90Q29J006J064J012Q11M99
60901A17207K60K06J93J1k51l12j15O6pk72m85m31j4O20J029Q34K27j64k9K74
60881A18847K87L5j14J2L05O07Q01P78N54L32K25N1l71q67j093j040j003j094
60863A17252j065p22k13J55K74K42J71Q0k0r8j33j92l66n90n78j21N20P59L52
$$ plain form
60844 115707 115469 115036 114767 114529 114012 113280 112730 112605 112792 113113 113529 113971 114209 114026 113461 112715 111886 110958 110058
60825 110058 109541 109697 110385 111114 111526 111736 112110 112782 113527 114092 114530 115129 116059 117160 118059 118466 118418 118244 118245
60806 118245 118368 118308 117964 117687 117962 118904 120232 121670 123172 124706 126074 127131 128037 129082 130283 131368
60790 131368 132185 132911 133765 134719 135629 136501 137360 137960 137867 136927 135545 134395 133938 134159 134645 134933 134920 134999 135595
60771 135595 136609 137478 137832 137834 137770 137594 137109 136404 135796 135380 134928 134241 133429 132750 132340 132126 131968 131828 131770 131767
60751 131767 131601 131105 130446 129926 129504 128865 128082 127758 128170 128665 128414 127512 126749 126407 125929 124886 123664 122952
60733 122952 122999 123620 124496 125186 125213 124577 123961 124009 124573 124949 124760 124270 123919 123914 124278 124976 125874 126708 127217 127286 127021
60712 127021 126763 126895 127534 128422 129216 129830 130424 131201 132257 133502 134616 135259 135473 135709 136331 137262 138260 139343
$$ packed form
60844A15707k38m33k69k38n17p32n50j25J87L21M16M42K38j83n65p46q29r28r00
60825A10058n17J56O88P29M12K10L74O72P45N65M38N99R30J101Q99M07m8j74J
60806A18245J23o0l44k77K75R42J328J438J502J534J368J057R06J045J201J085
60790A31368Q17P26Q54R54R10Q72Q59O00r3r40j382j150m57K21M86K88j3P9N96
60771A35595J014Q69L54Ko4j76m85p05o08m16m52o87q12o79m10k14j58j40n8l
60751A31767j66m96o59n20m22o39p83l24M12M95k51r02p63l42m78j043j222p12
60733A22952M7O21Q76O90K7o36o16M8N64L76j89m90l51nL64O98Q98Q34N09O9k65
60712A27021k58J32O39Q88P94O14N94P77J056J245J114O43K14K36O22R31R98J083
$$ plain form
60694 139343 140644 142010 143087 143770 144313 145011 145980 147154 148273 148955 149132 149353 150243 151622 152598 152648 152212
60677 152212 151921 151692 151054 150080 149440 149495 149879 150156 150433 150998 151663 151933 151734 151522 151517 151222 149988 147862 145610
60658 145610 143953 143016 142478 142012 141466 140812 140062 139211 138184 136928 135505 134031 132552 131099 129874 129196
60642 129196 129181 129542 129791 129592 128946 128139 127477 127001 126528 126086 126133 127023 128334 129140 129029 128485 128075 127680 126828
60623 126828 125510 124275 123641 123757 124548 125841 127301 128528 129342 129914 130594 131599 132751 133508 133443 132805 132420
60606 132420 132849 133815 134609 134861 134704 134446 134373 134722 135519 136519 137538 138645 139767 140370 140046 139322 139337 140614
60588 140614 142533 144078 144751 144651 144139 143615 143407 143576 143972 144500 145129 145601 145493 144748 143887 143474 143537 143679
60570 143679 143623 143453 143426 143658 143961 143929 143327 142416 141696 141276 140710 139556 137935 136417 135484 135186 135203 135105 134661
$$ packed form
60694A39343J301J366J077O83N43O98R69J174J119O82J77K21Q90J379R76N0m36
60677A52212k91k29o38r74o40N5L84K77K77N65O65K70j99k12nk95j234k126k252
60658A45610j657r37n38m66n46o54p50q51j027j256j423j474j479j453j225o78
60642A29196j5L61K49j99o46q07o62m76m73m42M7Q90J311Q06j11n44m10l95q52
60623A26828j318j235o34J16P91J293J460J227Q14N72O80J005J152P57o5o38l85
60606A32420M29R66P94K52j57k58p3L49P97J000J019J107J122O03l24p24J5J277
60588A40614J919J545O73j00n12n24k08J69L96N28O29M72j08p45q61m13O3J42
60570A43679n6j70k7K32L03l2o02r11p20m20n66j154j621j518r33k98J7r8m44
$$ plain form
60551 134661 133964 133233 132526 131818 131302 131280 131681 131955 131607 130689 129633 128826 128485 128707 129350 129993 130272 130227 130133
60532 130133 130034 129648 128782 127644 126632 125923 125460 125324 125862 127223 128862 129894 129993 129623 129219 128591 127489
60515 127489 126402 126132 126688 127234 127204 126923 126964 127405 128006 128656 129317 129835 130145 130450 130959 131629 132371 133235 134187
60496 134187 134957 135341 135413 135294 134975 134557 134323 134365 134480 134650 135191 136097 136695 136445 135716 135260 135195 135113 134957 135068
60476 135068 135458 135643 135336 134733 134105 133548 133205 133229 133401 133295 132972 133015 133669 134387 134539 134148 133606 133012 132263
60457 132263 131572 131359 131595 131626 130877 129560 128557 128608 129690 131186 132550 133682 134637 135240 135189 134452 133354
60440 133354 132307 131579 131249 131210 131262 131358 131651 132138 132424 132148 131546 131195 131234 131225 130877 130528 130705 131468 132399 133053
60420 133053 133241 133010 132555 132130 131939 132058 132391 132637 132478 131945 131482 131430 131613 131664 131582 131583 131549 131146 130498 130221 130635
$$ packed form
60551A34661o97p31p07p08n16k2M01K74l48r18j056q07l41K22O43O43K79m5r4
60532A30133r9l86q66j138j012p09m63j36N38J361J639J032R9l70m04o28j102
60515A27489j087k70N56N46l0k81M1M41O01O50O61N18L10L05N09O70P42Q64R52
60496A34187P70L84P2j19l19m18k34M2J15J70N41R06N98k50p29m56o5q2j56J11
60476A35068L90J85l07o03o28n57l43K4J72j06l23M3O54P18J52l91n42n94p49
60457A32263o91k13K36L1p49j317j003N1J082J496J364J132R55O03n1p37j098
60440A33354j047p28l30l9N2R6K93M87K86k76o02l51L9rl48l49J77P63R31O54
60420A33053J88k31m55m25j91J19L33K46j59n33m63n2J83N1q2Jl4m03o48k77M14
$$ plain form
60399 130635 131354 131853 132044 132150 132330 132682 133270 133921 134259 134129 133767 133425 133149 133035 133337 134100 135015 135829 136519
60380 136519 136927 136702 135884 135096 134747 134527 134101 133827 134183 134851 135071 134725 134384 134364 134342 133945 133221 132490 132105
60361 132105 132352 133124 133750 133536 132471 131017 129479 128073 127398 127990 129413 130552 130995 131417 132393 133614
60345 133614 134569 135274 135818 135861 135214 134394 133971 133749 133311 133018 133699 135373 137003 137611 137171 136362 135842 135902 136425
60326 136425 137013 137353 137518 137783 138193 138522 138600 138443 138148 137859 137712 137572 137026 136005 135200 135401 136496 137558
60308 137558 137943 137817 137616 137537 137697 138256 139072 139571 139332 138553 137741 137178 136874 136803 136920 137073 137099 136905 136454 135839
60288 135839 135390 135377 135585 135555 135373 135699 136778 137917 138398 138447 138782 139514 140124 140345 140401 140402 140137 139612 139268 139435
60268 139435 139972 140635 141450 142464 143402 143833 143572 142753 141648 140553 139752 139462 139783 140665 141811 142706 142962
$$ packed form
60399A30635P19M99J91J06J80L52N88O51L38j30l62l42k76j14L02P63R15Q14O90
60380A36519M08k25q18p88l49k20m26k74L56O68K20l46l41k0k2l97p24p31l85
60361A32105K47P72O26k14j065j454j538j406o75N92J423J139M43M22R76J221
60345A33614R55P05N44M3o47q20m23k22m38k93O81J674J630O08m40q09n20O0N23
60326A36425N88L40J65K65M10L29P8j57k95k89j47j40n46j021q05K01J095J062
60308A37558L85j26k01p9J60N59Q16M99k39p79q12n63l04p1J17J53K6j94m51o15
60288A35839m49j3K08l0j82L26J079J139M81M9L35P32O10K21N6Jk65n25l44J67
60268A39435N37O63Q15J014R38M31k61q19j105j095q01k90L21Q82J146Q95K56
$$ plain form
60251 142962 142625 142011 141359 140832 140741 141336 142354 143119 143187 142635 141722 140635 139640 139066 138944 138950 138887 138949 139358 140028
60231 140028 140731 141303 141569 141431 141232 141542 142339 142799 142319 141377 140935 141312 142144 143183 144475 145797 146573 146510
60213 146510 145955 145471 145344 145560 145943 146222 146180 145833 145327 144762 144284 144212 144761 145720 146678 147488 148164 148491 148229
60194 148229 147678 147522 147989 148580 148777 148598 148300 147958 147640 147659 148338 149585 150875 151549 151140 149732 148084 147081
60176 147081 146936 147166 147381 147693 148225 148760 149182 149844 151012 152230 152709 152262 151441 150856 150703 150883 151224 151534
60158 151534 151676 151663 151536 151264 150907 150749 151048 151721 152474 153123 153607 153826 153760 153650 153787 154183 154664 155172 155693
60139 155693 155995 155903 155779 156317 157653 159026 159576 159283 158916 159148 159932 160727 161174 161433 161822 162283 162444 162291
60121 162291 162465 163552 165204 166357 166422 165911 165781 166352 167093 167357 167151 167096 167688 168701 169483 169804 170109 170764
$$ packed form
60251A42962l37o14o52n27r1N95J018P65O8n52r13j087r95n74j22Oo3O2M09O70
60231A40028P03N72K66j38j99L10P97M60m80r42m42L77Q32J039J292J322P76o3
60213A46510n55m84j27K16L83K79m2l47n06n65m78p2N49R59R58Q10O76L27k62
60194A48229n51j56M67N91J97j79k98l42l18J9O79J247J290O74m09j408j648j003
60176A47081j45K30K15L12N32N35M22O62J168J218M79m47q21n85j53J80L41L10
60158A51534J42j3j27k72l57j58K99O73P53O49M84K19o6j10J37L96M81N08N21
60139A55693L02r2j24N38J336J373N50k93l67K32P84P95M47K59L89M61J61j53
60121A62291J74J087J652J153O5n11j30N71P41K64k06n5N92J013P82L21L05O55
$$ plain form
60103 170764 171408 171420 170872 170509 170772 171322 171662 171842 172302 173283 174629 175985 176987 177482 177745 178340 179528 180983
60085 180983 182245 183290 184446 185849 187258 188379 189190 189920 190771 191652 192180 192102 191781 192027 193299 195247
60069 195247 197192 198821 200139 201039 201393 201548 202208 203677 205499 207034 208036 208550 208559 208080 207455 207190 207532
60052 207532 208426 209820 211711 213846 215661 216720 217120 217336 217748 218394 219103 219703 220089 220234 220194 220094 220082 220264
60034 220264 220668 221219 221737 222042 222096 222046 222128 222531 223316 224346 225272 225674 225376 224664 224142 224297 225193 226504 227776
60015 227776 228606 228729 228105 227011 225948 225320 225136 225058 224734 224099 223335 222627 221986 221327 220614 219914 219282 218669
59997 218669 217942 217030 215974 214849 213702 212630 211867 211611 211739 211828 211558 210984 210314 209568 208683 207866 207567 208056
59979 208056 209126 210339 211376 212064 212223 211720 210712 209736 209436 210144 211655 213448 215118 216562 217782 218663
$$ packed form
60103A70764O44J2n48l63K63N50L40J80M60R81J346J356J002M95K63N95J188J455
60085A80983J262J045J156J403J409J121Q11P30Q51Q81N28p8l21K46J272J948
60069A95247J945J629J318R00L54J55O60J469J822J535J002N14Rm79o25k65L42
60052B07532Q94J394J891K135J815J059M00K16M12O46P09O00L86J45m0j00j2J82
60034B20264M04N51N18L05N4n0Q2M03P85J030R26M02k98p12n22J55Q96J311J272
60015B27776Q30J23o24j094j063o28j84p8l24o35p64p08o41o59p13p00o32o13
59997B18669p27r12j056j125j147j072p63k56J28Q9k70n74o70p46q85q17k99M89
59979B08056J070J213J037O88J59n03j008r76l00P08J511J793J670J444J220Q81
$$ plain form
59963 218663 219114 219297 219521 219969 220701 221866 223590 225619 227412 228732 229910 231368 233098 234805 236358
59948 236358 237878 239503 241255 243017 244507 245423 245840 246298 247302 248825 250517 252220 254032 255963 257893
59933 257893 259853 262088 264770 267834 271063 274212 277120 279942 283164 287135 291585 295846 299511 302719
59919 302719 305925 309609 314101 319271 324500 329342 334148 339637 345893 352364 358783 365418 372198 378364
59905 378364 383557 388694 395090 403008 411675 420483 429442 438535 447445 456164 465280 475267 485802 496223
59891 496223 506411 516869 527993 539632 551421 563313 575566 588290 601220 614020 626691
59880 626691 639455 652266 664733 676736 688904 702150 716726 732031 747380 762640 777990
59869 777990 793318 808249 822699 837102 851990 867527 883551 899851 916201 932216 947516
$$ packed form
59963B18663M51J83K24M48P32J165J724K029J793J320J178J458J730J707J553
59948B36358J520J625J752J762J490R16M17M58J004J523J692J703J812J931J930
59933B57893J960K235K682L064L229L149K908K822L222L971M450M261L665L208
59919C02719L206L684M492N170N229M842M806N489O256O471O419O635O780O166
59905C78364N193N137O396P918Q667Q808Q959R093Q910Q719R116R987J0535J0421
59891D96223J0188J0458J1124J1639J1789J1892J2253J2724J2930J2800J2671
59880F26691J2764J2811J2467J2003J2168J3246J4576J5305J5349J5260J5350
59869G77990J5328J4931J4450J4403J4888J5537J6024J6300J6350J6015J5300
$$ plain form
59858 947516 962146 976675 991736 1007510 1023637 1039478 1054444 1068372 1081781 1095524 1109911
59847 1109911 1124366 1138229 1151661 1165277 1179051 1192223 1204410 1216144 1227999 1239727 1250713
59836 1250713 1260913 1270777 1280495 1289876 1298849 1307526 1315747 1323070 1329313 1334706 1339412 1343312 1346419 1349124
59822 1349124 1351730 1353951 1355144 1354927 1353438 1351076 1348144 1344696 1340619 1335871 1330592 1324899 1318637 1311574
59808 1311574 1303839 1295862 1287807 1279306 1269899 1259555 1248592 1237284 1225742 1214046 1202266 1190407
59796 1190407 1178443 1166317 1153786 1140505 1126481 1112333 1098737 1085642 1072282 1058096 1043317
59785 1043317 1028508 1013675 998160 981410 963679 945811 928427 911476 894607 877737 861059
59774 861059 844606 828089 811277 794295 777423 760711 743951 726944 709701 692432 675504
$$ packed form
59858I47516J4630J4529J5061J5774J6127J5841J4966J3928J3409J3743J4387
59847A109911J4455J3863J3432J3616J3774J3172J2187J1734J1855J1728J0986
59836A250713J0200R864R718R381Q973Q677Q221P323O243N393M706L900L107K705
59822A349124K606K221J193k17j489k362k932l448m077m748n279n693o262p063
59808A311574p735p977q055q501r407j0344j0963j1308j1542j1696j1780j1859
59796A190407j1964j2126j2531j3281j4024j4148j3596j3095j3360j4186j4779
59785A043317j4809j4833j5515j6750j7731j7868j7384j6951j6869j6870j6678
59774H61059j6453j6517j6812j6982j6872j6712j6760j7007j7243j7269j6928
$$ plain form
59763 675504 659254 643718 628537 613282 597846 582425 567273 552675 539001 526453 514715
59752 514715 503159 491464 479811 468428 457246 446201 435605 425914 417228 409253 401666 394310
59740 394310 387086 379934 372909 366137 359689 353686 348389 343895 339745 335195 330023 324819 320328 316680
59726 316680 313458 310303 307157 304051 300935 297728 294345 290714 286952 283478 280686 278436 276144 273467
59712 273467 270693 268317 266396 264526 262303 259638 256724 253964 251909 250955 250924 251136 251050 250698 250332 249794
59696 249794 248585 246622 244607 243388 243108 243209 243168 242908 242529 242024 241412 240905 240673 240575 240309 239742 238970 238210
59678 238210 237745 237818 238293 238594 238263 237569 237268 237742 238641 239388 239774 239987 240239 240509 240556 240171 239516 239116 239281
59659 239281 239595 239327 238357 237338 236884 236941 237141 237395 237823 238378 238848 239097 239066 238736 238351 238498 239581 241251
$$ packed form
59763F75504j6250j5536j5181j5255j5436j5421j5152j4598j3674j2548j1738
59752E14715j1556j1695j1653j1383j1182j1045j0596r691q686p975p587p356
59740C94310p224p152p025o772o448o003n297m494m150m550n172n204m491l648
59726C16680l222l155l146l106l116l207l383l631l762l474k792k250k292k677
59712B73467k774k376j921j870k223k665k914k760k055r54l1K12q6l52l66n38
59696B49794j209j963k015j219k80J01m1k60l79n05o12n07k32r8k66n67p72p60
59678B38210m65P3M75L01l31o94l01M74Q99P47L86K13K52K70M7l85o55m00J65
59659B39281L14k68r70j019m54N7K00K54M28N55M70K49l1l30l85J47J083J670
$$ plain form
59641 241251 242650 243218 243119 242930 243153 243951 245096 246116 246657 246730 246587 246493 246695 247399 248518 249573 250120 250210
59623 250210 250248 250503 250965 251615 252472 253438 254305 254954 255364 255557 255751 256385 257659 259113 260051 260335 260428 260698 261056
59604 261056 261296 261325 260997 260203 259290 258919 259269 259723 259660 259205 258917 259011 259308 259692 260166 260524 260384 259622 258561
59585 258561 257657 257136 256923 256751 256355 255694 255001 254563 254507 254744 255013 254942 254291 253203 252057 250986 249766 248258
59567 248258 246708 245418 244392 243517 242856 242478 242218 241872 241451 240969 240209 239079 237978 237374 237105 236581 235692
59550 235692 234981 234870 235135 235332 235318 235174 234941 234694 234579 234535 234186 233300 232182 231390 231134 231152 231068 230714 230238 230019
59530 230019 230337 230973 231319 231066 230599 230493 230811 231180 231411 231636 231932 232196 232478 233021 233836 234577 235010 235331 235794
59511 235794 236288 236577 236742 237028 237366 237426 237179 237026 237226 237530 237606 237613 238065 239173 240600 241913 243117 244641
$$ packed form
59641B41251J399N68r9j89K23P98J145J020N41P3j43r4K02P04J119J055N47R0
59623B50210L8K55M62O50Q57R66Q67O49M10J93J94O34J274J454R38K84R3K70L58
59604B61056K40K9l28p94r13l71L50M54o3m55k88R4K97L84M74L58j40p62j061
59585B58561r04n21k13j72l96o61o93m38n6K37K69p1o51j088j146j071j220j508
59567B48258j550j290j026q75o61l78k60l46m21m82p60j130j101o04k69n24q89
59550B35692p11j11K65J97j4j44k33k47j15m4l49q86j118p92k56J8q4l54m76k19
59530B30019L18O36L46k53m67j06L18L69K31K25K96K64K82N43Q15P41M33L21M63
59511B35794M94K89J65K86L38O0k47j53K00L04P6PM52J108J427J313J204J524
$$ plain form
59493 244641 246860 249667 252581 255308 258141 261693 266186 271186 276186 281239 286832 293182 300025 307098
59479 307098 314583 322963 332650 343794 356038 368129 377999 383737 384731 381728 375840 367713 357720 346567
59465 346567 335285 324625 314713 305424 296900 289536 283511 278535 274117 270007 266275 263055 260311 257854
59451 257854 255520 253290 251289 249698 248609 247916 247303 246414 245086 243473 241941 240778 239999 239454 239076 238903
59435 238903 238913 239026 239288 239785 240297 240309 239641 238808 238427 238429 238283 237910 237840 238373 239051 239252 238957 238659 238701 239045 239491
59414 239491 239888 240226 240655 241314 242035 242480 242706 243262 244442 245754 246500 246629 246608 246699 246905 247464 248734 250483
59396 250483 251880 252406 252385 252403 252644 253077 253866 255166 256754 258242 259531 260742 261858 262795 263713 264869 266104
59379 266104 266837 266743 266235 266116 266805 268031 269235 270185 271185 272695 274885 277620 280856 284771 289411 294361
$$ packed form
59493B44641K219K807K914K727K833L552M493N000N000N053N593O350O843P073
59479C07098P485Q380R687J1144J2244J2091R870N738R94l003n888q127r993j1153
59465C46567j1282j0660r912r289q524p364o025m976m418m110l732l220k744k457
59451B57854k334k230k001j591j089o93o13q89j328j613j532j163p79n45l78j73
59435B38903J0J13K62M97N12J2o68q33l81Kj46l73p0N33O78K01k95k98M2L44M46
59414B39491L97L38M29O59P21M45K26N56J180J312P46J29k1R1K06N59J270J749
59396B50483J397N26k1J8K41M33P89J300J588J488J289J211J116R37R18J156J235
59379B66104P33r4n08j19O89J226J204R50J000J510K190K735L236L915M640M950
$$ plain form
59363 294361 299048 303373 307849 313089 319284 326222 333676 341643 350345 360126 371379 384431 399359
59350 399359 415839 433054 449805 464848 477392 487414 495458 502047 507381 511645 515493 519956 525794
59337 525794 533067 541277 549556 556544 560515 560145 555192 546248 533897 518523 500798 481820 462513
59324 462513 443196 423999 405432 388279 373110 360113 349200 339971 331742 323966 316692 310415
59312 310415 305494 301805 298934 296491 294324 292540 291258 290204 288696 286351 283702 281768 280945 280610 279900
59297 279900 278587 277003 275430 273893 272457 271391 270918 270960 271206 271333 271151 270647 270040 269658 269690 269973 270144
59280 270144 270038 269882 269998 270406 270835 271095 271275 271487 271640 271599 271473 271491 271604 271402 270553 269249 268089 267508 267338
59261 267338 267023 266280 265458 265122 265357 265725 265912 266137 266743 267653 268504 269200 269996 271060 272253 273368 274319 275068
$$ packed form
59363B94361M687M325M476N240O195O938P454P967Q702R781J1253J3052J4928
59350C99359J6480J7215J6751J5043J2544J0022Q044O589N334M264L848M463N838
59337E25794P273Q210Q279O988L971l70m953q944j2351j5374j7725j8978j9307
59324D62513j9317j9197j8567j7153j5169j2997j0913r229q229p776p274o277
59312C10415m921l689k871k443k167j784j282j054j508k345k649j934q23l35p10
59297B79900j313j584j573j537j436j066m73M2K46J27j82n04o07l82L2K83J71
59280B70144j06j56J16M08M29K60J80K12J53m1j26J8J13k02q49j304j160n81j70
59261B67338l15p43q22l36K35L68J87K25O06R10Q51O96P96J064J193J115R51P49
$$ plain form
59243 275068 275597 276028 276533 277048 277281 277106 276746 276443 276188 275892 275658 275646 275839 276082 276267 276314 276161 275955 276105
59224 276105 276828 277735 278182 278069 277957 278315 278938 279323 279422 279698 280447 281366 281948 282110 282212 282468 282679 282644 282611 283017
59204 283017 283878 284742 285261 285485 285528 285303 284816 284474 284736 285545 286361 286772 286845 286930 287296 287979 288823 289625 290305 290849
59184 290849 291086 290737 289879 289143 289107 289644 290125 290173 289892 289464 289019 288902 289525 290780 291982 292660 293035 293500 293997
59165 293997 294282 294493 295011 295852 296606 296956 296972 296951 297182 297840 298868 299926 300634 300792 300352 299411 298449 298252 299151
59146 299151 300434 301020 300719 300372 300708 301522 302178 302459 302602 302821 303163 303663 304283 304781 304935 304845 304795 304869 304954 305062
59126 305062 305396 306009 306672 307174 307628 308309 309231 310040 310382 310322 310307 310679 311314 311844 312155 312497 313035 313509 313545 313215
59106 313215 313032 313355 313978 314421 314509 314528 314856 315592 316537 317368 317760 317524 316874 316488 317034 318528 320341 321854
$$ packed form
59243B75068N29M31N05N15K33j75l60l03k55k96k34j2J93K43J85M7j53k06J50
59224B76105P23R07M47j13j12L58O23L85R9K76P49R19N82J62J02K56K11l5l3M06
59204B83017Q61Q64N19K24M3k25m87l42K62Q09Q16M11P3Q5L66O83Q44Q02O80N44
59184B90849K37l49q58p36l6N37M81M8k81m28m45j17O23J255J202O78L75M65M97
59165B93997K85K11N18Q41P54L50J6k1K31O58J028J058P08J58m40r41r62j97Q99
59146B99151J283N86l01l47L36Q14O56K81J43K19L42N00O20M98J54r0n0P4Q5J08
59126C05062L34O13O63N02M54O81R22Q09L42o0j5L72O35N30L11L42N38M74L6l30
59106C13215j83L23O23M43Q8J9L28P36R45Q31L92k36o50l86N46J494J813J513
$$ plain form
59088 321854 322924 323641 323974 323903 323692 323692 323931 324178 324296 324301 324203 324103 324376 325330 326661 327645 327947 327920 327989 328132 328106
59067 328106 327874 327602 327546 328115 329710 332220 334879 336864 337839 337882 337273 336590 336558 337399 338621 339796 341146
59050 341146 342925 344673 345774 346515 347786 349724 351475 352444 353106 354215 355733 356988 357591 357814 358262 359383
59034 359383 361141 362967 364222 364849 365339 365984 366484 366520 366339 366426 366829 367190 367317 367357 367409 367335 367037 366685 366534
59015 366534 366590 366588 366300 365833 365540 365596 365781 365806 365724 365769 365871 365729 365439 365632 366701 368182 369172 369208 368536 367701 367153
58994 367153 367095 367377 367556 367326 366884 366733 367136 367875 368490 368666 368520 368613 369467 370916 372150 372633 372723 373092 373792
58975 373792 374353 374635 375019 375746 376666 377748 379263 381204 382987 384156 384934 385665 386064 385675 384908 384921 386288
58958 386288 388343 390124 391527 393135 395210 397342 399022 400166 401044 402003 403303 404899 406313 407050 407295
$$ packed form
59088C21854J070P17L33p1k11%K39K47J18Nr8j00K73R54J331R84L02k7O9J43k6
59067C28106k32k72n6N69J595K510K659J985R75M3o09o83l2Q41J222J175J350
59050C41146J779J748J101P41J271J938J751R69O62J109J518J255O03K23M48J121
59034C59383J758J826J255O27M90O45N00L6j81Q7M03L61J27M0N2p4k98l52j51
59015C66534N6kk88m67k93N6J85K5q2M5J02j42k90J93J069J481R90L6o72q35n48
58994C67153n8K82J79k30m42j51M03P39O15J76j46R3Q54J449J234M83R0L69P00
58975C73792N61K82L84P27R20J082J515J941J783J169P78P31L99l89p67J3J367
58958C86288K055J781J403J608K075K132J680J144Q78R59J300J596J414P37K45
$$ plain form
58943 407295 407890 409424 411636 413963 416313 418828 421140 422527 422830 422685 422647 422599 422287 421956 422022 422368 422432 421856
58925 421856 420728 419279 417734 416416 415647 415454 415599 415952 416593 417552 418665 419777 420879 421967 422919 423623
58909 423623 424141 424678 425463 426631 428080 429435 430247 430331 429864 429191 428602 428225 428029 427869 427622 427240 426712 426150
58891 426150 425952 426685 428546 431046 433441 435386 436974 438267 439203 439923 440766 441768 442539 442884 443271 444371
58875 444371 446243 448282 449891 450997 451861 452649 453315 453795 454181 454668 455379 456293 457376 458705 460372 462252
58859 462252 463987 465289 466237 467229 468610 470360 472193 473950 475827 478088 480635 483084 485373 488008 491490
58844 491490 495626 499723 503363 506748 510311 514270 518529 522675 526022 527984 528597 528441 527913 526845 525036
58829 525036 522837 520816 519042 517032 514504 511839 509743 508620 508372 508591 508809 508663 508031 507126 506426 506409
$$ packed form
58943D07295N95J534K212K327K350K515K312J387L03j45l8m8l12l31O6L46O4n76
58925D21856j128j449j545j318p69j93J45L53O41R59J113J112J102J088R52P04
58909D23623N18N37P85J168J449J355Q12Q4m67o73n89l77j96j60k47l82n28n62
58891D26150j98P33J861K500K395J945J588J293R36P20Q43J002P71L45L87J100
58875D44371J872K039J609J106Q64P88O66M80L86M87P11R14J083J329J667J880
58859D62252J735J302R48R92J381J750J833J757J877K261K547K449K289K635L482
58844D91490M136M097L640L385L563L959M259M146L347J962O13j56n28j068j809
58829E25036k199k021j774k010k528k665k096j123k48K19K18j46o32r05p00j7
$$ plain form
58813 506409 507270 508795 510516 512051 513400 514951 517142 520016 523116 525938 528505 531365 534942 539084
58799 539084 543333 547430 551237 554382 556486 557735 558794 559882 560307 559245 556768 553749 550867 548066
58785 548066 544982 541548 537984 534448 530976 527694 524842 522488 520407 518423 516748 515731 515271 514796 514002
58770 514002 513335 513425 514256 515235 515972 516564 517117 517453 517457 517337 517375 517712 518454 519622 520813 521334 521022 520598 520898
58751 520898 521997 523424 524941 526622 528387 530003 531461 532875 534019 534487 534406 534519 535380 536771 538113
58736 538113 539104 539805 540387 541055 542048 543467 545178 546981 548763 550406 551754 552828 553915 555292 556948
58721 556948 558691 560436 562254 564259 566508 568941 571317 573385 575187 577036 579101 581151 582833 584009
58707 584009 584647 584595 583810 582722 582024 581963 582073 581727 580793 579597 578435 577324 576243 575363 574917 574917 575154 575431
$$ packed form
58813E06409Q61J525J721J535J349J551K191K874L100K822K567K860L577M142
58799E39084M249M097L807L145K104J249J059J088M25j062k477l019k882k801
58785E48066l084l434l564l536l472l282k852k354k081j984j675j017m60m75p94
58770E14002o67R0Q31R79P37N92N53L36Mj20L8L37P42J168J191N21l12m24L00
58751E20898J099J427J517J681J765J616J458J414J144M68q1J13Q61J391J342
58736E38113R91P01N82O68R93J419J711J803J782J643J348J074J087J377J656
58721E56948J743J745J818K005K249K433K376K068J802J849K065K050J682J176
58707E84009O38n2p85j088o98o1J10l46r34j196j162j111j081q80m46%K37K77
$$ plain form
58689 575431 575644 575609 575024 573816 572431 571489 571156 571071 570975 571091 571744 572813 573923 575020 576386 577998 579292
58672 579292 579785 579760 580084 581381 583553 586076 588514 590737 592877 595174 597780 600578 603217 605391 607048
58657 607048 608304 609312 610265 611332 612433 613227 613554 613790 614452 615468 616177 616187 615874 615844 616193 616558 616670 616519
58639 616519 616131 615577 615183 615362 616158 617209 618220 619224 620312 621397 622393 623408 624600 625980 627514 629213
58623 629213 631001 632658 634050 635323 636674 638057 639316 640543 642090 644240 646982 650064 653151 656015
58609 656015 658723 661612 664877 668237 671235 673847 676510 679498 682555 685304 687756 690137 692375 694127
58595 694127 695322 696295 697281 698076 698416 698450 698568 698841 699002 698921 698765 698618 698314 697830 697557 697864 698569 699187 699612
58576 699612 700205 701164 702149 702650 702521 702026 701540 701365 701645 702260 702848 703081 702959 702751 702700 702836 703031 703183 703357
$$ packed form
58689E75431K13l5n85j208j385r42l33q5r6J16O53J069J110J097J366J612J294
58672E79292M93k5L24J297K172K523K438K223K140K297K606K798K639K174J657
58657F07048J256J008R53J067J101P94L27K36O62J016P09J0l13l0L49L65J12j51
58639F16519l88n54l94J79P96J051J011J004J088J085R96J015J192J380J534J699
58623F29213J788J657J392J273J351J383J259J227J547K150K742L082L087K864
58609F56015K708K889L265L360K998K612K663K988L057K749K452K381K238J752
58595F94127J195R73R86P95L40L4J18K73J61q1j56j47l04m84k73L07P05O18M25
58576F99612N93R59R85N01j29m95m86j75K80O15N88K33j22k08n1J36J95J52J74
$$ plain form
58557 703357 703784 704669 705972 707428 708772 709901 710859 711801 712956 714477 716315 718355 720642 723261 725965
58542 725965 728191 729604 730418 731083 731866 732940 734599 737014 739848 742442 744423 745985 747632 749794 752576
58527 752576 755648 758448 760757 762976 765565 768372 770948 773467 776731 781001 785292 788269 789643 790362
58513 790362 791571 793746 796717 800145 803847 807832 812118 816512 820680 824508 828222 831987 835627 839049
58499 839049 842763 847488 853219 859131 864545 869611 874800 880134 885291 890259 895417 900976 906734 912439
58485 912439 918030 923424 928341 932583 936270 939616 942564 944917 946738 948400 950206 952126 953938 955483
58471 955483 956728 957712 958551 959393 960296 961225 962213 963433 964963 966579 967956 969061 970178 971485 972774 973694
58455 973694 974196 974639 975532 977256 979925 983334 987030 990588 993912 997244 1000859 1004777 1008757 1012480 1015785
$$ packed form
58557G03357M27Q85J303J456J344J129R58R42J155J521J838K040K287K619K704
58542G25965K226J413Q14O65P83J074J659K415K834K594J981J562J647K162K782
58527G52576L072K800K309K219K589K807K576K519L264M270M291K977J374P19
58513G90362J209K175K971L428L702L985M286M394M168L828L714L765L640L422
58499H39049L714M725N731N912N414N066N189N334N157M968N158N559N758N705
58485I12439N591N394M917M242L687L346K948K353J821J662J806J920J812J545
58471I55483J245R84Q39Q42R03R29R88J220J530J616J377J105J117J307J289R20
58455I73694N02M43Q93J724K669L409L696L558L324L332L615L918L980L723L305
$$ plain form
58440 1015785 1018816 1021979 1025616 1029676 1033789 1037695 1041494 1045391 1049378 1053306 1057202 1061273 1065628 1070214
58426 1070214 1075096 1080534 1086637 1093054 1099237 1104971 1110495 1116138 1122018 1128126 1134536 1141377 1148699 1156454
58412 1156454 1164542 1172730 1180626 1187898 1194599 1201113 1207693 1214234 1220642 1227229 1234399 1241934 1248986 1254950
58398 1254950 1260112 1265236 1270671 1276190 1281489 1286525 1291335 1295950 1300570 1305517 1310858 1316327 1321775 1327458
58384 1327458 1333713 1340526 1347630 1354826 1361936 1368656 1374771 1380505 1386380 1392746 1399635 1406943 1414456 1421772
58370 1421772 1428603 1435227 1442347 1450404 1459252 1468475 1477710 1486621 1495030 1503283 1512113 1521789 1531692 1541060
58356 1541060 1549944 1559009 1568550 1578200 1587662 1597301 1607762 1619240 1631320 1643442 1655377 1667277
58344 1667277 1679354 1691570 1703707 1715775 1728109 1740934 1753992 1766935 1779929 1793510 1807805
$$ packed form
58440A015785L031L163L637M060M113L906L799L897L987L928L896M071M355M586
58426A070214M882N438O103O417O183N734N524N643N880O108O410O841P322P755
58412A156454Q088Q188P896P272O701O514O580O541O408O587P170P535P052N964
58398A254950N162N124N435N519N299N036M810M615M620M947N341N469N448N683
58384A327458O255O813P104P196P110O720O115N734N875O366O889P308P513P316
58370A421772O831O624P120Q057Q848R223R235Q911Q409Q253Q830R676R903R368
58356A541060Q884R065R541R650R462R639J0461J1478J2080J2122J1935J1900
58344A667277J2077J2216J2137J2068J2334J2825J3058J2943J2994J3581J4295
$$ plain form
58333 1807805 1822327 1836693 1851129 1865986 1881078 1895940 1910575 1925527 1941172 1957330 1973670
58322 1973670 1990150 2006851 2023633 2040260 2056815 2073781 2091608 2110292 2129409 2148507 2167460
58311 2167460 2186470 2205740 2225216 2244656 2263977 2283422 2303395 2324205 2346034 2368963 2392841
58300 2392841 2417202 2441553 2465863 2490616 2516285 2542820 2569760 2596742 2623759 2651055 2678955
58289 2678955 2707803 2737752 2768490 2799362 2829973 2860632 2891965 2924168 2956889 2989908 3023631
58278 3023631 3058709 3095299 3133011 3171523 3210894 3251222 3292268 3333669 3375366 3417618 3460725
58267 3460725 3504977 3550754 3598265 3647192 3696958 3747450 3799135 3852258 3906341 3960882 4016277
58256 4016277 4073541 4133166 4194736 4257736 4322253 4388647 4456915 4526754 4598036 4670887 4745396
$$ packed form
58333A807805J4522J4366J4436J4857J5092J4862J4635J4952J5645J6158J6340
58322A973670J6480J6701J6782J6627J6555J6966J7827J8684J9117J9098J8953
58311B167460J9010J9270J9476J9440J9321J9445J9973K0810K1829K2929K3878
58300B392841K4361K4351K4310K4753K5669K6535K6940K6982K7017K7296K7900
58289B678955K8848K9949L0738L0872L0611L0659L1333L2203L2721L3019L3723
58278C023631L5078L6590L7712L8512L9371M0328M1046M1401M1697M2252M3107
58267C460725M4252M5777M7511M8927M9766N0492N1685N3123N4083N4541N5395
58256D016277N7264N9625O1570O3000O4517O6394O8268O9839P1282P2851P4509
$$ plain form
58245 4745396 4821563 4899512 4979473 5061530 5145598 5231718 5320209 5411467 5505727 5603046 5703412
58234 5703412 5806795 5913228 6022920 6136240 6253488 6374687 6499591 6627936 6759706
58225 6759706 6895217 7034959 7179350 7328618 7482917 7642431 7807362 7977914 8154412
58216 8154412 8337354 8527214 8724149 8928029 9138792 9356781 9582748 9817576 10061922
58207 10061922 10316040 10579944 10853768 11137929 11432940 11739195 12057029 12386887 12729287
58198 12729287 13084727 13453831 13837544 14236931 14652714 15085183 15534644 16001879 16488110
58189 16488110 16994638 17522610 18073034 18646992 19245838 19871178 20524573 21207354 21920974
58180 21920974 22667450 23449217 24268515 25127291 26027830 26973167 27966598 29011039 30109155
$$ packed form
58245D745396P6167P7949P9961Q2057Q4068Q6120Q8491R1258R4260R7319J00366
58234E703412J03383J06433J09692J13320J17248J21199J24904J28345J31770
58225F759706J35511J39742J44391J49268J54299J59514J64931J70552J76498
58216H154412J82942J89860J96935K03880K10763K17989K25967K34828K44346
58207A0061922K54118K63904K73824K84161K95011L06255L17834L29858L42400
58198A2729287L55440L69104L83713L99387M15783M32469M49461M67235M86231
58189A6488110N06528N27972N50424N73958N98846O25340O53395O82781P13620
58180B1920974P46476P81767Q19298Q58776R00539R45337R93431J044441J098116
$$ plain form
58171 30109155 31263861 32478341 33755778 35099675 36514643 38006502 39581401 41245116
58163 41245116 43003439 44863084 46832067 48919474 51135296 53490634 55997991 58671413
58155 58671413 61526538 64580631 67852736 71364012 75138047 79200812 83580229 88305846
58147 88305846 93408899 98922246 104879599 111314312 118258401 125741786 133791071 142427588
58139 142427588 151665219 161508231 171948743 182963596 194511404 206530513 218937317
58132 218937317 231623396 244450551 257244190 269786313 281810035 292999224 302998083
58125 302998083 311433913 317951060 322248898 324115251 323449108 320269482 314709656 306998624
58117 306998624 297434815 286358400 274126244 261090145 247578443 233882582 220250048
$$ packed form
58171C0109155J154706J214480J277437J343897J414968J491859J574899J663715
58163D1245116J758323J859645J968983K087407K215822K355338K507357K673422
58155E8671413K855125L054093L272105L511276L774035M062765M379417M725617
58147H8305846N103053N513347N957353O434713O944089P483385Q049285Q636517
58139A42427588R237631R843012J0440512J1014853J1547808J2019109J2406804
58132B18937317J2686079J2827155J2793639J2542123J2023722J1189189R998859
58125C02998083Q435830O517147M297838J866353o66143l179626n559826p711032
58117C06998624r563809j1076415j2232156j3036099j3511702j3695861j3632534
$$ plain form
58110 220250048 206882596 193937080 181527714 169730543 158589995 148125676 138337840
58103 138337840 129211998 120723536 112841873 105533271 98762494 92494107 86693398 81326555
58095 81326555 76360656 71764274 67508288 63565867 59911833 56522508 53376181 50453135
58087 50453135 47735001 45204543 42846297 40646910 38594398 36677284 34884744 33207206
58079 33207206 31636226 30163781 28782049 27483889 26263124 25114297 24032315 23012291
58071 23012291 22049431 21138987 20276560 19458582 18682367 17945671 17246297 16582043 15950779
58062 15950779 15350451 14779169 14235347 13717649 13224748 12755303 12308194 11882670 11478142
58053 11478142 11093841 10728628 10381087 10049939 9734486 9434497 9149427 8877892 8618244
$$ packed form
58110B20250048j3367452j2945516j2409366j1797171j1140548j0464319r787836
58103A38337840r125842q488462p881663p308602o770777o268387n800709n366843
58095H1326555m965899m596382m255986l942421l654034l389325l146327k923046
58087E0453135k718134k530458k358246k199387k052512j917114j792540j677538
58079C3207206j570980j472445j381732j298160j220765j148827j081982j020024
58071B3012291r62860r10444q62427q17978p76215p36696o99374o64254o31264
58062A5950779o00328n71282n43822n17698m92901m69445m47109m25524m04528
58053A1478142l84301l65213l47541l31148l15453k99989k85070k71535k59648
$$ plain form
58044 8618244 8369604 8131919 7905007 7688066 7480317 7281557 7091646 6909810 6735070
58035 6735070 6567203 6406682 6253610 6107216 5966546 5831212 5701137 5575933 5454946
58026 5454946 5337764 5224305 5114399 5007657 4903860 4803194 4705865 4611575 4519645 4429665
58016 4429665 4341854 4256699 4174393 4094742 4017533 3942768 3870474 3800483 3732550 3666641 3602919
58005 3602919 3541387 3481668 3423228 3365829 3309735 3255392 3202891 3151780 3101491 3051980 3003773
57994 3003773 2957326 2912448 2868531 2825262 2782813 2741336 2700640 2660606 2621678 2584481 2548987
57983 2548987 2514455 2480326 2446834 2414477 2383165 2352274 2321446 2290968 2261307 2232613 2204788
57972 2204788 2177768 2151510 2125896 2100835 2076391 2052600 2029230 2005904 1982453 1959017 1935805
$$ packed form
58044H618244k48640k37685k26912k16941k07749j98760j89911j81836j74740
58035F735070j67867j60521j53072j46394j40670j35334j30075j25204j20987
58026E454946j17182j13459j09906j06742j03797j00666r7329r4290r1930q9980
58016D429665q7811q5155q2306p9651p7209p4765p2294o9991o7933o5909o3722
58005C602919o1532n9719n8440n7399n6094n4343n2501n1111n0289m9511m8207
57994C003773m6447m4878m3917m3269m2449m1477m0696m0034l8928l7197l5494
57983B548987l4532l4129l3492l2357l1312l0891l0828l0478k9661k8694k7825
57972B204788k7020k6258k5614k5061k4444k3791k3370k3326k3451k3436k3212
$$ plain form
57961 1935805 1912890 1890287 1868091 1846473 1825593 1805499 1786099 1767187 1748565 1730157 1712036
57950 1712036 1694379 1677368 1661123 1645677 1631013 1617057 1603542 1590015 1576183 1562251 1548757
57939 1548757 1536036 1524028 1512592 1501657 1490985 1480168 1469124 1458275 1447974 1437974 1427869
57928 1427869 1417791 1408237 1399361 1390914 1382804 1375217 1368129 1361192 1354190 1347225 1340330 1333307 1326088 1318868
57914 1318868 1311709 1304414 1296980 1289759 1282889 1275982 1268670 1261133 1253754 1246544 1239337 1232261 1225566 1219169
57900 1219169 1212811 1206567 1200689 1195003 1188950 1182355 1175791 1169981 1165053 1160470 1155587 1150238 1144851 1139959
57886 1139959 1135511 1130877 1125694 1120462 1115934 1112134 1108463 1104688 1101198 1098138 1094908 1090887 1086315 1082046
57872 1082046 1078629 1075942 1073568 1071099 1068159 1064470 1060083 1055383 1050783 1046485 1042556 1039063 1036003 1033133
$$ packed form
57961A935805k2915k2603k2196k1618k0880k0094j9400j8912j8622j8408j8121
57950A712036j7657j7011j6245j5446j4664j3956j3515j3527j3832j3932j3494
57939A548757j2721j2008j1436j0935j0672j0817j1044j0849j0301j0000j0105
57928A427869j0078r554q876q447q110p587p088o937p002o965o895p023p219p220
57914A318868p159p295p434p221o870o907p312p537p379p210p207p076o695o397
57900A219169o358o244n878n686o053o595o564n810m928m583m883n349n387m892
57886A139959m448m634n183n232m528l800l671l775l490l060l230m021m572m269
57872A082046l417k687k374k469k940l689m387m700m600m298l929l493l060k870
$$ plain form
57858 1033133 1029999 1026274 1022113 1018138 1014931 1012504 1010307 1007779 1004858 1001985 999640 997924 996566 995292
57844 995292 994058 992873 991509 989600 987073 984229 981325 978324 975251 972492 970430 968881 967250 965205
57830 965205 962888 960519 958167 955964 954154 952784 951631 950546 949615 948836 947906 946538 944782 942862 940883
57815 940883 938879 936984 935331 933907 932605 931317 929882 928119 926094 924159 922542 921106 919744 918770
57801 918770 918538 918760 918641 917767 916560 915653 915079 914329 913074 911602 910459 909833 909401 908754 907871 907083 906612
57784 906612 906274 905666 904628 903442 902617 902477 902887 903378 903551 903362 902992 902562 902098 901701 901494 901421 901283 901049
57766 901049 900930 901073 901367 901601 901633 901373 900852 900442 900705 901814 903306 904584 905463 906038 906279 906102 905700 905455
57748 905455 905539 905841 906229 906663 907124 907674 908486 909582 910621 911234 911494 911771 912190 912599 912972 913460 914020 914377
$$ packed form
57858A033133l134l725m161l975l207k427k197k528k921k873k345j716j358j274
57844I95292j234j185j364j909k527k844k904l001l073k759k062j549j631k045
57830I65205k317k369k352k203j810j370j153j085r31p79r30j368j756j920j979
57815I40883k004j895j653j424j302j288j435j763k025j935j617j436j362r74
57801I18770k32K22j19q74j207r07n74p50j255j472j143o26m32o47q83p88m71
57784I06612l38o08j038j186q25j40M10M91J73j89l70m30m64l97k07p3j38k34
57766I01049j19J43K94K34L2k60n21m10K63J109J492J278Q79N75K41j77m02k45
57748I05455Q4L02L88M34M61N50Q12J096J039O13K60K77M19M09L73M88N60L57
$$ plain form
57730 914377 914478 914605 914945 915353 915665 915933 916225 916523 916942 917675 918509 918855 918572 918445 919344 921129 922849 923922
57712 923922 924611 925344 926101 926645 927010 927447 928022 928573 929020 929517 930215 930951 931342 931234 930962 930971 931287 931584 931816
57693 931816 932355 933330 934227 934530 934491 934764 935405 935801 935650 935428 935687 936322 936837 936990 936894 936773 936940 937739 939144
57674 939144 940561 941389 941651 941776 941923 941955 941921 942111 942607 943278 944251 945882 948033 949901 950904 951409 952194 953440
57656 953440 954651 955407 955745 955853 955820 955786 956036 956797 958090 959795 961685 963401 964651 965511 966337 967304 968208
57639 968208 968773 969024 969264 969851 970996 972588 974160 975291 976163 977471 979558 981885 983602 984532 985247 986235
57623 986235 987357 988251 988936 989751 990779 991673 992156 992517 993375 994885 996398 997080 996822 996359 996513 997539 999208
57606 999208 1001236 1003380 1005307 1006693 1007494 1007952 1008303 1008566 1008627 1008445 1008179 1008177 1008818 1010227 1012090 1013793 1014818
$$ packed form
57730I14377J01J27L40M08L12K68K92K98M19P33Q34L46k83j27Q99J785J720J073
57712I23922O89P33P57N44L65M37N75N51M47M97O98P36L91j08k72RL16K97K32
57693I31816N39R75Q97L03l9K73O41L96j51k22K59O35N15J53r6j21J67P99J405
57674I39144J417Q28K62J25J47L2l4J90M96O71R73J631K151J868J003N05P85J246
57656I53440J211P56L38J08l3l4K50P61J293J705J890J716J250Q60Q26R67R04
57639I68208N65K51K40N87J145J592J572J131Q72J308K087K327J717R30P15R88
57623I86235J122Q94O85Q15J028Q94M83L61Q58J510J513O82k58m63J54J026J669
57606I99208K028K144J927J386Q01M58L51K63O1j82k66kO41J409J863J703J025
$$ plain form
57589 1014818 1015132 1015283 1016042 1017758 1020011 1022094 1023847 1025739 1028063 1030354 1031966 1032930 1033899 1035314 1037040
57574 1037040 1038811 1040610 1042479 1044256 1045753 1046998 1048125 1049118 1049837 1050293 1050768 1051626 1052954 1054393 1055429
57559 1055429 1055959 1056444 1057364 1058691 1060142 1061768 1063857 1066258 1068283 1069461 1070064 1070652 1071429 1072318 1073361 1074662
57543 1074662 1076037 1077138 1077926 1078765 1079992 1081621 1083458 1085322 1087033 1088391 1089287 1089868 1090507 1091558 1093029
57528 1093029 1094459 1095273 1095403 1095483 1096239 1097769 1099573 1101239 1102847 1104643 1106541 1108172 1109339 1110236 1111189 1112297
57512 1112297 1113429 1114473 1115475 1116505 1117545 1118565 1119620 1120766 1121943 1123050 1124056 1124925 1125581 1126139 1127059
57497 1127059 1128719 1130874 1132865 1134398 1135687 1136795 1137381 1137381 1137454 1138197 1139267 1139918 1140218 1141005 1142594 1144255
57481 1144255 1145288 1146036 1147335 1149315 1151307 1152756 1153756 1154626 1155401 1155962 1156365 1156807 1157382 1158058 1158877 1160026
$$ packed form
57589A014818L14J51P59J716K253K083J753J892K324K291J612R64R69J415J726
57574A037040J771J799J869J777J497J245J127R93P19M56M75Q58J328J439J036
57559A055429N30M85R20J327J451J626K089K401K025J178O03N88P77Q89J043J301
57543A074662J375J101P88Q39J227J629J837J864J711J358Q96N81O39J051J471
57528A093029J430Q14J30Q0P56J530J804J666J608J796J898J631J167Q97R53J108
57512A112297J132J044J002J030J040J020J055J146J177J107J006Q69O56N58R20
57497A127059J660K155J991J533J289J108N86%P3P43J070O51L00P87J589J661
57481A144255J033P48J299J980J992J449J000Q70P75N61M03M42N75O76Q19J149
$$ plain form
57465 1160026 1161640 1163621 1165697 1167656 1169425 1170961 1172178 1173077 1173926 1175101 1176699 1178348 1179538 1180154 1180635
57450 1180635 1181529 1182956 1184536 1185840 1186829 1187817 1189137 1190935 1193171 1195618 1197844 1199488 1200693 1202029 1203873
57435 1203873 1206018 1208093 1210173 1212634 1215481 1218195 1220329 1221982 1223548 1225221 1226946 1228670 1230424 1232191
57421 1232191 1233881 1235423 1236787 1237934 1238900 1239945 1241472 1243649 1246193 1248666 1250981 1253414 1256003 1258201
57407 1258201 1259483 1260178 1261301 1263418 1266075 1268576 1270889 1273379 1275956 1278107 1279717 1281268 1283175 1285450
57393 1285450 1288119 1291398 1295108 1298444 1300808 1302570 1304557 1307031 1309668 1312394 1315628 1319639 1324158 1328769
57379 1328769 1333335 1337842 1342205 1346416 1350661 1355044 1359427 1363764 1368399 1373716 1379589 1385442 1390872 1395970
57365 1395970 1401103 1406633 1412818 1419662 1426669 1433042 1438452 1443458 1448906 1454957 1460993 1466523 1471819 1477522
$$ packed form
57465A160026J614J981K076J959J769J536J217Q99Q49J175J598J649J190O16M81
57450A180635Q94J427J580J304R89R88J320J798K236K447K226J644J205J336J844
57435A203873K145K075K080K461K847K714K134J653J566J673J725J724J754J767
57421A232191J690J542J364J147R66J045J527K177K544K473K315K433K589K198
57407A258201J282O95J123K117K657K501K313K490K577K151J610J551J907K275
57393A285450K669L279L710L336K364J762J987K474K637K726L234M011M519M611
57379A328769M566M507M363M211M245M383M383M337M635N317N873N853N430N098
57365A395970N133N530O185O844P007O373N410N006N448O051O036N530N296N703
$$ plain form
57351 1477522 1483888 1490676 1497585 1504526 1511495 1518482 1525574 1532903 1540463 1548064 1555484 1562554 1569174 1575487
57337 1575487 1581993 1589158 1596817 1604261 1611087 1617641 1624415 1631270 1637661 1643506 1649415 1656015 1663368 1671097
57323 1671097 1678809 1686209 1693076 1699423 1705685 1712512 1720235 1728539 1736746 1744446 1751762 1758988 1766069 1772700
57309 1772700 1778948 1785458 1792800 1800787 1808713 1816196 1823473 1830854 1838235 1845337 1852191 1859164 1866524 1874182
57295 1874182 1881880 1889550 1897422 1905726 1914297 1922616 1930319 1937597 1944964 1952697 1960699 1968875 1977357 1986321
57281 1986321 1995787 2005713 2016056 2026643 2037168 2047465 2057612 2067616 2077262 2086542 2096027 2106404
57269 2106404 2117630 2128921 2139654 2149994 2160439 2171052 2181472 2191561 2201707 2212380 2223563
57258 2223563 2234814 2245804 2256632 2267579 2278680 2289705 2300575 2311583 2323069 2335021 2347210
$$ packed form
57351A477522O366O788O909O941O969O987P092P329P560P601P420P070O620O313
57337A575487O506P165P659P444O826O554O774O855O391N845N909O600P353P729
57323A671097P712P400O867O347O262O827P723Q304Q207P700P316P226P081O631
57309A772700O248O510P342P987P926P483P277P381P381P102O854O973P360P658
57295A874182P698P670P872Q304Q571Q319P703P278P367P733Q002Q176Q482Q964
57281A986321R466R926J0343J0587J0525J0297J0147J0004R646R280R485J0377
57269B106404J1226J1291J0733J0340J0445J0613J0420J0089J0146J0673J1183
57258B223563J1251J0990J0828J0947J1101J1025J0870J1008J1486J1952J2189
$$ plain form
57247 2347210 2359658 2372637 2386142 2399681 2412824 2425782 2439131 2453057 2467161 2480991 2494498
57236 2494498 2507942 2521604 2535681 2550209 2564920 2579366 2593354 2607124 2620973 2634919 2648877
57225 2648877 2662966 2677337 2691829 2706148 2720350 2734799 2749694 2764943 2780515 2796523 2812807
57214 2812807 2828863 2844465 2860079 2876292 2893039 2909737 2926103 2942461 2959241 2976517 2994079
57203 2994079 3011724 3029395 3047272 3065845 3085658 3106797 3128726 3150826 3173099 3196224 3220868
57192 3220868 3246958 3273658 3300118 3326273 3352839 3380517 3409360 3439063 3469676 3501661 3535241
57181 3535241 3570040 3605592 3641916 3679305 3717720 3756746 3796200 3836456 3878035 3921005 3964957
57170 3964957 4009445 4054307 4099576 4145348 4191812 4239246 4287765 4337087 4386691 4436256 4485819
$$ packed form
57247B347210J2448J2979J3505J3539J3143J2958J3349J3926J4104J3830J3507
57236B494498J3444J3662J4077J4528J4711J4446J3988J3770J3849J3946J3958
57225B648877J4089J4371J4492J4319J4202J4449J4895J5249J5572J6008J6284
57214B812807J6056J5602J5614J6213J6747J6698J6366J6358J6780J7276J7562
57203B994079J7645J7671J7877J8573J9813K1139K1929K2100K2273K3125K4644
57192C220868K6090K6700K6460K6155K6566K7678K8843K9703L0613L1985L3580
57181C535241L4799L5552L6324L7389L8415L9026L9454M0256M1579M2970M3952
57170C964957M4488M4862M5269M5772M6464M7434M8519M9322M9604M9565M9563
$$ plain form
57159 4485819 4535515 4585374 4635496 4686212 4737794 4790013 4842227 4894049 4945806 4998210 5051630
57148 5051630 5105759 5159999 5214069 5268221 5322877 5378199 5434064 5490364 5547085 5604071 5661004
57137 5661004 5717861 5775179 5833561 5892941 5952637 6012173 6071687 6131419 6191112 6250223 6308635
57126 6308635 6366858 6425517 6484770 6544297 6603747 6663101 6722652 6782651 6843098 6903875 6964984
57115 6964984 7026561 7088692 7151326 7214304 7277340 7340068 7402350 7464562 7527326 7590910 7655129
57104 7655129 7719866 7785387 7851937 7919338 7987246 8055550 8124227 8192896 8260927 8327962 8394054
57093 8394054 8459304 8523605 8586706 8648165 8707224 8763071 8815426 8864547 8910513 8952765 8990671
57082 8990671 9024337 9054497 9081635 9105508 9125488 9141038 9151740 9157167 9157043 9151388 9140261 9123381
$$ packed form
57159D485819M9696M9859N0122N0716N1582N2219N2214N1822N1757N2404N3420
57148E051630N4129N4240N4070N4152N4656N5322N5865N6300N6721N6986N6933
57137E661004N6857N7318N8382N9380N9696N9536N9514N9732N9693N9111N8412
57126F308635N8223N8659N9253N9527N9450N9354N9551N9999O0447O0777O1109
57115F964984O1577O2131O2634O2978O3036O2728O2282O2212O2764O3584O4219
57104G655129O4737O5521O6550O7401O7908O8304O8677O8669O8031O7035O6092
57093H394054O5250O4301O3101O1459N9059N5847N2355M9121M5966M2252L7906
57082H990671L3666L0160K7138K3873J9980J5550J0702N427j24n655j1127j6880
$$ plain form
57070 9123381 9100200 9070336 9033725 8990237 8939334 8880212 8812142 8734530 8646795 8548359 8438667
57059 8438667 8317077 8182813 8035281 7874278 7699625 7510591 7306070 7085379 6848513
57050 6848513 6595362 6324954 6035677 5725972 5394402 5039150 4657728 4247122 3803820
57041 3803820 3323643 2801832 2233432 1613553 937376 200341 -601341 -1470256 -2407590
57032 -2407590 -3413020 -4484428 -5617683 -6806599 -8042830 -9315637 -10611755 -11915459
57024 -11915459 -13208718 -14471306 -15681019 -16814013 -17845299 -18749659 -19503211 -20085159
57016 -20085159 -20478920 -20672630 -20659771 -20440101 -20020012 -19411694 -18631759 -17700319 -16640426
57007 -16640426 -15477261 -14236973 -12945745 -11629162 -10311403 -9014163 -7755768 -6550861
$$ packed form
57070I123381k3181k9864l6611m3488n0903n9122o8070p7612q7735r8436j09692
57059H438667j21590j34264j47532j61003j74653j89034k04521k20691k36866
57050F848513k53151k70408k89277l09705l31570l55252l81422m10606m43302
57041C803820m80177n21811n68400o19879o76177B00341f01341q68915r37334
57032b407590j005430j071408j133255j188916j236231j272807j296118j303704
57024a1915459j293259j262588j209713j132994j031286r04360p53552n81948
57016b0085159l93761j93710J2859K19670M20089O08318P79935R31440J059893
57007a6640426J163165J240288J291228J316583J317759J297240J258395J204907
$$ plain form
56999 -6550861 -5410522 -4342567 -3351960 -2441198 -1610500 -857999 -180330 426552 967070
56990 967070 1446259 1869886 2243723 2572661 2860714 3111770 3329990 3519344 3683109 3824075
56980 3824075 3945015 4048551 4136607 4210385 4271090 4320427 4360223 4391697 4415346 4431458 4440482
56969 4440482 4442896 4438943 4428673 4412158 4389569 4361053 4326681 4286504 4240699 4189591 4133553 4072825
56957 4072825 4007482 3937638 3863777 3786945 3708583 3630098 3552450 3476061 3401084 3327739 3256437
56946 3256437 3187628 3121662 3058786 2999183 2942918 2889881 2839813 2792420 2747496 2704965 2664782
56935 2664782 2626739 2590401 2555370 2521655 2489656 2459691 2431601 2404883 2379121 2354201 2330174
56924 2330174 2307070 2284817 2263231 2242079 2221205 2200628 2180486 2160847 2141495 2121885 2101506
$$ packed form
56999f550861J140339J067955R90607R10762Q30698P52501a80330D26552N40518
56990I67070M79189M23627L73837L28938K88053K51056K18220J89354J63765J40966
56980C824075J20940J03536Q8056P3778O0705M9337L9796L1474K3649J6112R024
56969D440482K414l953j0270j6515k2589k8516l4372m0177m5805n1108n6038o0728
56957D072825o5343o9844p3861p6832p8362p8485p7648p6389p4977p3345p1302
56946C256437o8809o5966o2876n9603n6265n3037n0068m7393m4924m2531m0183
56935B664782l8043l6338l5031l3715l1999k9965k8090k6718k5762k4920k4027
56924B330174k3104k2253k1586k1152k0874k0577k0142j9639j9352j9610k0379
$$ plain form
56913 2101506 2080518 2059982 2041080 2023955 2007608 1991120 1974719 1959387 1945688 1933374 1921982
56902 1921982 1911338 1901470 1892436 1884353 1877244 1870703 1864013 1856750 1849062 1841278 1833504 1825796 1818394 1811459
56888 1811459 1804709 1797616 1789992 1782241 1774992 1768600 1762953 1757683 1752598 1747954 1744256 1741716 1739983 1738480
56874 1738480 1736951 1735558 1734508 1733668 1732586 1730873 1728472 1725486 1721789 1717019 1711051 1704237 1696967 1689203
56860 1689203 1680761 1671851 1662919 1654042 1644992 1635918 1627402 1619616 1611951 1603831 1595485 1587527 1580146 1573139
56846 1573139 1566481 1560376 1554876 1549931 1545682 1542258 1539383 1536687 1534342 1532849 1532133 1531398 1530141 1528824
56832 1528824 1528246 1528539 1529173 1529741 1530352 1531259 1532426 1533570 1534499 1535322 1536351 1537841 1539788 1541966 1544047 1545675
56816 1545675 1546598 1546892 1547031 1547578 1548797 1550691 1553285 1556650 1560658 1565013 1569595 1574563 1579990 1585621 1591178
$$ packed form
56913B101506k0988k0536j8902j7125j6347j6488j6401j5332j3699j2314j1392
56902A921982j0644r868r034q083p109o541o690p263p688p784p774p708p402o935
56888A811459o750p093p624p751p249o392n647n270n085m644l698k540j733j503
56874A738480j529j393j050q40j082j713k401k986l697m770n968o814p270p764
56860A689203q442q910q932q877r050r074q516p786p665q120q346p958p381p007
56846A573139o658o105n500m945m249l424k875k696k345j493p16p35j257j317
56832A528824n78K93O34N68O11R07J167J144R29Q23J029J490J947K178K081J628
56816A545675R23K94J39N47J219J894K594L365M008M355M582M968N427N631N557
$$ plain form
56801 1591178 1596748 1602708 1609252 1616116 1622701 1628418 1632996 1636587 1639547 1642089 1644168 1645745 1646979 1648077
56787 1648077 1649076 1649987 1651121 1653093 1656347 1660797 1665993 1671667 1677960 1685129 1693130 1701608 1710202 1718691
56773 1718691 1726850 1734366 1740992 1746567 1750813 1753242 1753471 1751547 1747834 1742718 1736592 1730003 1723485 1717202
56759 1717202 1710947 1704544 1698152 1692154 1686876 1682400 1678570 1675199 1672375 1670462 1669708 1669929 1670684 1671625 1672396
56744 1672396 1672405 1671046 1668124 1663770 1657961 1650511 1641590 1631844 1621859 1611774 1601551 1591308 1581193 1571243
56730 1571243 1561595 1552621 1544630 1537560 1531163 1525348 1520163 1515583 1511468 1507620 1503755 1499580 1494997 1490062
56716 1490062 1484628 1478292 1470899 1462872 1454744 1446535 1437834 1428385 1418347 1408041 1397786 1387862 1378410
56703 1378410 1369317 1360396 1351649 1343200 1335085 1327343 1320211 1313921 1308288 1302790 1297154 1291663 1286773 1282613
$$ packed form
56801A591178N570N960O544O864O585N717M578L591K960K542K079J577J234J098
56787A648077R99R11J134J972L254M450N196N674O293P169Q001Q478Q594Q489
56773A718691Q159P516O626N575M246K429K29j924l713n116o126o589o518o283
56759A717202o255o403o392n998n278m476l830l371k824j913p54K21P55R41P71
56744A672396Rj359k922m354n809p450q921r746r985j0085j0223j0243j0115r950
56730A571243r648q974p991p070o397n815n185m580m115l848l865m175m583m935
56716A490062n434o336p393q027q128q209q701r449j0038j0306j0255r924r452
56703A378410r093q921q747q449q115p742p132o290n633n498n636n491m890m160
$$ plain form
56689 1282613 1278909 1275258 1271369 1267184 1262892 1258803 1255096 1251685 1248323 1244856 1241410 1238315 1235816 1233810
56675 1233810 1231943 1229972 1227940 1225987 1224151 1222432 1220876 1219445 1217924 1216146 1214268 1212652 1211468 1210473
56661 1210473 1209172 1207232 1204903 1203033 1202366 1202674 1202836 1201980 1200324 1198596 1196968 1195022 1192658 1190440 1188935
56646 1188935 1188105 1187522 1186890 1186165 1185379 1184553 1183669 1182652 1181503 1180463 1179830 1179592 1179420 1179044 1178388 1177320 1175654
56629 1175654 1173589 1171854 1171106 1171233 1171465 1171111 1170074 1168737 1167526 1166576 1165706 1164712 1163611 1162546 1161502 1160316
56613 1160316 1158976 1157661 1156444 1155159 1153740 1152455 1151628 1151233 1150939 1150444 1149653 1148642 1147645 1146993 1146851 1147009
56597 1147009 1147067 1146807 1146316 1145769 1145178 1144340 1143022 1141258 1139489 1138276 1137800 1137748 1137719 1137576 1137304 1136735 1135609 1133887
56579 1133887 1131830 1129860 1128395 1127668 1127518 1127457 1127094 1126431 1125668 1124872 1124040 1123326 1122900 1122659 1122341 1121885 1121449 1121064
$$ packed form
56689A282613l704l651l889m185m292m089l707l411l362l467l446l095k499k006
56675A233810j867j971k032j953j836j719j556j431j521j778j878j616j184r95
56661A210473j301j940k329j870o67L08J62q56j656j728j628j946k364k218j505
56646A188935q30n83o32p25p86q26q84j017j149j040o33k38j72l76o56j068j666
56629A175654k065j735p48J27K32l54j037j337j211r50q70r94j101j065j044j186
56613A160316j340j315j217j285j419j285q27l95k94m95p91j011r97o52j42J58
56597A147009N8k60m91n47n91q38j318j764j769j213m76n2k9j43k72n69j126j722
56579A133887k057j970j465p27j50o1l63o63p63p96q32p14m26k41l18m56m36l85
$$ plain form
56561 1121064 1120579 1119957 1119345 1118729 1117822 1116505 1115172 1114333 1114013 1113764 1113271 1112678 1112269 1112030 1111693 1111084 1110238 1109176
56543 1109176 1107752 1105916 1104025 1102689 1102183 1102139 1101955 1101456 1100996 1100919 1101136 1101257 1100969 1100120 1098613 1096507 1094214
56526 1094214 1092388 1091445 1091258 1091351 1091298 1090869 1089989 1088780 1087576 1086668 1086003 1085337 1084695 1084425 1084643 1084883 1084537 1083553
56508 1083553 1082423 1081550 1080921 1080417 1080129 1080220 1080624 1081036 1081122 1080673 1079688 1078390 1077094 1075993 1075113 1074444 1073992 1073671
56490 1073671 1073299 1072773 1072136 1071457 1070783 1070232 1069938 1069813 1069551 1068941 1068040 1066959 1065693 1064278 1062904 1061684 1060502
56473 1060502 1059257 1058108 1057230 1056497 1055654 1054734 1054074 1053948 1054316 1054891 1055280 1055165 1054566 1053855 1053331 1052869 1052211 1051471
56455 1051471 1051051 1050985 1050720 1049682 1047953 1046257 1045318 1045262 1045579 1045652 1045319 1044831 1044342 1043688 1042769 1041832 1041120 1040471
56437 1040471 1039570 1038481 1037602 1037207 1037327 1037897 1038664 1039059 1038682 1037870 1037341 1037250 1037043 1036321 1035318 1034386 1033503 1032544
$$ packed form
56561A121064m85o22o12o16r07j317j333q39l20k49m93n93m09k39l37o09q46j062
56543A109176j424j836j891j336n06m4j84m99m60p7K17J21k88q49j507k106k293
56526A094214j826r43j87R3n3m29q80j209j204r08o65o66o42k70K18K40l46r84
56508A083553j130q73o29n04k88R1M04M12Q6m49r85j298j296j101q80o69m52l21
56490A073671l72n26o37o79o74n51k94j25k62o10r01j081j266j415j374j220j182
56473A060502j245j149q78p33q43r20o60j26L68N75L89j15n99p11n24m62o58p40
56455A051471m20o6k65j038j729j696r39n6L17P3l33m88m89o54r19r37p12o49
56437A040471r01j089q79l95J20N70P67L95l77q12n29r1k07p22j003r32q83r59
$$ plain form
56419 1032544 1031658 1031044 1030657 1030395 1030328 1030517 1030840 1031149 1031382 1031378 1030935 1030193 1029616 1029411 1029359 1029401 1029876 1030829 1031600 1031583
56399 1031583 1030990 1030327 1029531 1028248 1026706 1025563 1025020 1024751 1024615 1024750 1024958 1024696 1023850 1022944 1022438 1022318 1022443
56382 1022443 1022692 1022595 1021483 1019340 1017035 1015390 1014479 1014086 1014226 1014764 1015074 1014746 1014292 1014486 1015182 1015454 1014829
56365 1014829 1013846 1013289 1013402 1013921 1014482 1014819 1014839 1014689 1014567 1014446 1014127 1013580 1013014 1012598 1012308 1012055 1011790 1011504 1011286
56346 1011286 1011357 1011822 1012422 1012726 1012591 1012230 1011891 1011694 1011752 1012100 1012482 1012457 1011845 1010871 1009832 1008916 1008333 1008260 1008513
56327 1008513 1008612 1008400 1008290 1008616 1009046 1009019 1008591 1008365 1008621 1008963 1008954 1008694 1008589 1008802 1009217 1009775 1010519 1011350 1011986 1012236
56307 1012236 1012157 1011875 1011400 1010759 1010188 1010006 1010253 1010632 1010878 1011070 1011472 1012162 1012929 1013486 1013640 1013337 1012707 1012080 1011780
56288 1011780 1011866 1012200 1012762 1013730 1015122 1016565 1017553 1017894 1017813 1017781 1018303 1019653 1021559 1023222 1023938 1023753 1023359 1023373
$$ packed form
56419A032544q86o14l87k62o7J89L23L09K33mm43p42n77k05n2M2M75R53P71j7
56399A031583n93o63p96j283j542j143n43k69j36J35K08k62q46r06n06j20J25
56382A022443K49r7j112k143k305j645r11l93J40N38L10l28m54J94O96K72o25
56365A014829r83n57J13N19N61L37K0j50j22j21l19n47n66m16k90k53k65k86k18
56346A011286P1M65O00L04j35l61l39j97N8L48L82k5o12r74j039r16n83p3K53
56327A008513R9k12j10L26M30k7m28k26K56L42rk60j05K13M15N58P44Q31O36K50
56307A012236p9k82m75o41n71j82K47L79K46J92M02O90P67N57J54l03o30o27l00
56288A011780Q6L34N62R68J392J443R88L41q1l2N22J350J906J663P16j85l94J4
$$ plain form
56270 1023373 1023904 1024811 1026032 1027508 1028970 1030077 1030734 1031164 1031660 1032388 1033337 1034390 1035405 1036377 1037468 1038775
56254 1038775 1040105 1041093 1041622 1042031 1042796 1044031 1045402 1046516 1047357 1048301 1049674 1051395 1053066 1054362 1055276 1056010
56238 1056010 1056798 1057901 1059577 1061828 1064234 1066246 1067707 1068938 1070272 1071733 1073273 1075067 1077298 1079726
56224 1079726 1081819 1083366 1084758 1086567 1088984 1091753 1094495 1096930 1098920 1100470 1101714 1102832 1103978 1105306
56210 1105306 1106962 1108967 1111171 1113401 1115555 1117519 1119147 1120499 1121970 1123928 1126246 1128443 1130322 1132191
56196 1132191 1134346 1136638 1138773 1140832 1143141 1145730 1148275 1150647 1153170 1156072 1158959 1161234 1162975 1165038
56182 1165038 1168136 1172096 1176203 1180020 1183576 1186969 1190233 1193598 1197427 1201689 1205835 1209455 1212807 1216411
56168 1216411 1220312 1224094 1227502 1230717 1234084 1237844 1242121 1246820 1251534 1255869 1259913 1264097 1268603 1273235
$$ packed form
56270A023373N31R07J221J476J462J107O57M30M96P28R49J053J015R72J091J307
56254A038775J330R88N29M09P65J235J371J114Q41R44J373J721J671J296R14P34
56238A056010P88J103J676K251K406K012J461J231J334J461J540J794K231K428
56224A079726K093J547J392J809K417K769K742K435J990J550J244J118J146J328
56210A105306J656K005K204K230K154J964J628J352J471J958K318K197J879J869
56196A132191K155K292K135K059K309K589K545K372K523K902K887K275J741K063
56182A165038L098L960M107L817L556L393L264L365L829M262M146L620L352L604
56168A216411L901L782L408L215L367L760M277M699M714M335M044M184M506M632
$$ plain form
56154 1273235 1277940 1283020 1288609 1294317 1299659 1304602 1309444 1314371 1319406 1324551 1329683 1334500 1338899 1343260
56140 1343260 1348045 1353263 1358648 1364190 1370035 1375976 1381530 1386590 1391592 1396935 1402611 1408477 1414490 1420551
56126 1420551 1426504 1432486 1438914 1445916 1453137 1460365 1467925 1476063 1484301 1491955 1499084 1506360 1514033 1521641
56112 1521641 1528859 1536106 1544002 1552592 1561432 1570222 1579007 1587907 1596929 1606032 1615185 1624423 1634000 1644289
56098 1644289 1655304 1666452 1677101 1687363 1697969 1709337 1721119 1732798 1744379 1756222 1768493
56087 1768493 1781109 1794050 1807350 1820861 1834368 1847960 1861939 1876341 1890835 1905212 1919668
56076 1919668 1934488 1949670 1965046 1980546 1996167 2011906 2027899 2044478 2061864 2079920 2098367
56065 2098367 2117133 2136340 2156095 2176394 2197046 2217607 2237704 2257677 2278525 2300820 2323918
$$ packed form
56154A273235M705N080N589N708N342M943M842M927N035N145N132M817M399M361
56140A343260M785N218N385N542N845N941N554N060N002N343N676N866O013O061
56126A420551N953N982O428P002P221P228P560Q138Q238P654P129P276P673P608
56112A521641P218P247P896Q590Q840Q790Q785Q900R022R103R153R238R577J0289
56098A644289J1015J1148J0649J0262J0606J1368J1782J1679J1581J1843J2271
56087A768493J2616J2941J3300J3511J3507J3592J3979J4402J4494J4377J4456
56076A919668J4820J5182J5376J5500J5621J5739J5993J6579J7386J8056J8447
56065B098367J8766J9207J9755K0299K0652K0561K0097J9973K0848K2295K3098
$$ plain form
56054 2323918 2346747 2369144 2391800 2415035 2438399 2461733 2485838 2511592 2538826 2566594 2594331
56043 2594331 2622262 2650787 2680002 2709852 2740370 2771592 2803451 2835935 2869255 2903697 2939256
56032 2939256 2975453 3011686 3047865 3084662 3122950 3163015 3204461 3246836 3290032 3334078 3378921
56021 3378921 3424646 3471671 3520425 3570976 3623100 3676571 3731195 3786766 3843272 3901044 3960487
56010 3960487 4021706 4084543 4148855 4214628 4282005 4351381 4423273 4497831 4574636 4653253 4733817
55999 4733817 4816798 4902362 4990346 5080741 5173774 5269516 5367847 5468892 5573111 5680813 5791936
55988 5791936 5906486 6024906 6147794 6275484 6408109 6545882 6689002 6837329 6990401
55979 6990401 7147906 7310134 7477928 7652159 7833226 8021153 8216164 8418958 8630228
$$ packed form
56054B323918K2829K2397K2656K3235K3364K3334K4105K5754K7234K7768K7737
56043B594331K7931K8525K9215K9850L0518L1222L1859L2484L3320L4442L5559
56032B939256L6197L6233L6179L6797L8288M0065M1446M2375M3196M4046M4843
56021C378921M5725M7025M8754N0551N2124N3471N4624N5571N6506N7772N9443
56010C960487O1219O2837O4312O5773O7377O9376P1892P4558P6805P8617Q0564
55999D733817Q2981Q5564Q7984R0395R3033R5742R8331J01045J04219J07702J11123
55988E791936J14550J18420J22888J27690J32625J37773J43120J48327J53072
55979F990401J57505J62228J67794J74231J81067J87927J95011K02794K11270
$$ plain form
55970 8630228 8850156 9078672 9316099 9563155 9820439 10088360 10367595 10659071 10963315
55961 10963315 11280303 11610269 11954389 12314373 12691758 13087969 13504687 13943689 14406490
55952 14406490 14894696 15410626 15957076 16536397 17150228 17800149 18488080 19215748 19984171
55943 19984171 20794076 21646694 22543842 23487242 24477697 25514049 26591595 27700488 28825701
55934 28825701 29949383 31054791 32130052 33170621 34180101 35169506 36155204 37156294
55926 37156294 38192495 39283016 40445997 41698021 43053799 44526351 46127452 47867847
55918 47867847 49757403 51805748 54023367 56422322 59016262 61820384 64851891 68130425
55910 68130425 71677865 75517810 79675525 84178187 89054596 94334247 100046472 106219944
$$ packed form
55970H630228K19928K28516K37427K47056K57284K67921K79235K91476L04244
55961A0963315L16988L29966L44120L59984L77385L96211M16718M39002M62801
55952A4406490M88206N15930N46450N79321O13831O49921O87931P27668P68423
55943A9984171Q09905Q52618Q97148R43400R90455J036352J077546J108893J125213
55934B8825701J123682J105408J075261J040569J009480R89405R85698J001090
55926C7156294J036201J090521J162981J252024J355778J472552J601101J740395
55918D7867847J889556K048345K217619K398955K593940K804122L031507L278534
55910F8130425L547440L839945M157715M502662M876409N279651N712225O173472
$$ plain form
55902 106219944 112881878 120056461 127762994 136014172 144814228 154156534 164021037 174372302
55894 174372302 185158010 196307004 207726127 219295709 230863883 242240387 253191814
55887 253191814 263441666 272678660 280575011 286813502 291119063 293288408 293211544 290881526
55879 290881526 286392200 279925740 271732657 262107717 251366011 239822467 227775895
55872 227775895 215496818 203218782 191133759 179391893 168104367 157347713 147168746
55865 147168746 137589985 128615180 120234298 112427671 105169429 98430227 92179068 86384401
55857 86384401 81014937 76040407 71432048 67162623 63206214 59538155 56135276 52976281
55849 52976281 50041813 47314028 44776101 42412206 40208008 38150910 36229662 34433832
$$ packed form
55902A06219944O661934P174583P706533Q251178Q800056R342306R864503J0351265
55894A74372302J0785708J1148994J1419123J1569582J1568174J1376504J0951427
55887B53191814J0249852R236994P896351O238491M305561K169345p6864k330018
55879B90881526m489326o466460q193083r624940j0741706j1543544j2046572
55872B27775895j2279077j2278036j2085023j1741866j1287526j0756654j0178967
55865A47168746r578761q974805q380882p806627p258242o739202o251159n794667
55857H6384401n369464m974530m608359m269425l956409l668059l402879l158995
55849E2976281k934468k727785k537927k363895k204198k057098j921248j795830
$$ plain form
55841 34433832 32753770 31180830 29707139 28325077 27027285 25807290 24659799 23580039
55833 23580039 22562902 21602961 20695311 19836142 19022477 18251580 17520782 16827652 16169971
55824 16169971 15545402 14951421 14385831 13847238 13334770 12847296 12383217 11941089 11520169
55815 11520169 11120057 10739905 10378267 10033676 9705118 9391882 9093173 8808002 8535406
55806 8535406 8274698 8025489 7787473 7560200 7343133 7135862 6938046 6749048 6567878
55797 6567878 6393696 6226133 6064939 5909613 5759786 5615752 5478003 5346243 5219367
55788 5219367 5096572 4978016 4864124 4754690 4648973 4546358 4446586 4349567 4255342 4164145
55778 4164145 4076134 3991107 3908685 3828752 3751508 3677106 3605413 3536105 3468871 3403582 3340296
$$ packed form
55841C4433832j680062j572940j473691j382062j297792j219995j147491j079760
55833B3580039j017137r59941r07650q59169q13665p70897p30798o93130o57681
55824A6169971o24569n93981n65590n38593n12468m87474m64079m42128m20920
55815A1520169m00112l80152l61638l44591l28558l13236k98709k85171k72596
55806H535406k60708k49209k38016k27273k17067k07271j97816j88998j81170
55797F567878j74182j67563j61194j55326j49827j44034j37749j31760j26876
55788E219367j22795j18556j13892j09434j05717j02615r9772r7019r4225r1197
55778D164145q8011q5027q2422p9933p7244p4402p1693o9308o7234o5289o3286
$$ plain form
55767 3340296 3279075 3219709 3161726 3104741 3048645 2993431 2939093 2885865 2834319 2784929 2737562
55756 2737562 2691598 2646471 2601970 2558185 2515364 2473771 2433440 2394099 2355499 2317760 2281222
55745 2281222 2246010 2211932 2178801 2146686 2115788 2086094 2057149 2028219 1998893 1969633 1941506
55734 1941506 1915234 1890653 1867142 1844302 1821997 1800096 1778616 1757942 1738421 1719737 1701023
55723 1701023 1681591 1661246 1639989 1617848 1595105 1572276 1549625 1526959 1504071 1481200 1458895
55712 1458895 1437546 1417177 1397550 1378407 1359705 1341706 1324717 1308645 1292950 1277130 1261220
55701 1261220 1245732 1231161 1217515 1204345 1191221 1178200 1165699 1153905 1142497 1131037 1119398
55690 1119398 1107607 1095567 1083276 1071133 1059530 1048235 1036642 1024656 1012900 1001919 991633
$$ packed form
55767C340296o1221n9366n7983n6985n6096n5214n4338n3228n1546m9390m7367
55756B737562m5964m5127m4501m3785m2821m1593m0331l9341l8600l7739l6538
55745B281222l5212l4078l3131l2115l0898k9694k8945k8930k9326k9260k8127
55734A941506k6272k4581k3511k2840k2305k1901k1480k0674j9521j8684j8714
55723A701023j9432k0345k1257k2141k2743k2829k2651k2666k2888k2871k2305
55712A458895k1349k0369j9627j9143j8702j7999j6989j6072j5695j5820j5910
55701A261220j5488j4571j3646j3170j3124j3021j2501j1794j1408j1460j1639
55690A119398j1791j2040j2291j2143j1603j1295j1593j1986j1756j0981j0286
$$ plain form
55679 991633 981719 972102 962809 953661 944517 935574 927108 919077 911226 903514 896097 888985 881963 874882
55665 874882 867817 860886 854043 847100 839918 832563 825305 818409 811853 805309 798473 791376 784370 777813
55651 777813 771764 765949 760076 754261 749023 744705 740974 737065 732486 727307 721863 716394 710950 705331
55637 705331 699106 692008 684419 677177 670780 665027 659473 653959 648551 643264 638070 632975 627914 622792
55623 622792 617733 613041 608784 604697 600622 596735 593114 589460 585598 581929 578971 576579 574066 570976
55609 570976 567348 563294 558734 553649 548282 543009 538119 533732 529768 526064 522648 519749 517375 515047
55595 515047 512258 509040 505763 502542 499202 495765 492509 489509 486534 483476 480513 477718 474861 471739
55581 471739 468432 465083 461710 458427 455509 452981 450341 447073 443311 439709 436666 433952 431182 428400
$$ packed form
55679I91633r914r617r293r148r144q943q466q031p851p712p417p112p022p081
55665H74882p065o931o843o943p182p355p258o896o556o544o836p097p006o557
55651G77813o049n815n873n815n238m318l731l909m579n179n444n469n444n619
55637G05331o225p098p589p242o397n753n554n514n408n287n194n095n061n122
55623F22792n059m692m257m087m075l887l621l654l862l669k958k392k513l090
55609E70976l628m054m560n085n367n273m890m387l964l704l416k899k374k328
55595E15047k789l218l277l221l340l437l256l000k975l058k963k795k857l122
55581D71739l307l349l373l283k918k528k640l268l762l602l043k714k770k782
$$ plain form
55567 428400 426003 424162 422505 420470 417886 415079 412405 409866 407290 404706 402303 400071 397770 395296
55553 395296 392889 390836 389144 387579 385954 384254 382542 380860 379242 377739 376392 375147 373863 372444
55539 372444 371008 369751 368626 367283 365454 363293 361194 359411 358024 357100 356563 356011 354995 353481 351744
55524 351744 349821 347477 344796 342400 340791 339773 338798 337672 336589 335616 334549 333288 332028 330982 330103
55509 330103 329220 328265 327314 326469 325803 325308 324834 324116 322934 321273 319331 317458 316031 315241 314900 314577 314001
55492 314001 313278 312600 311827 310578 308785 306970 305826 305608 305980 306336 306197 305464 304491 303771 303339 302612 301054
55475 301054 298879 296755 294925 293066 291064 289340 288250 287592 287050 286682 286557 286325 285639 284764 284247 284108
55459 284108 283863 283250 282453 281664 280894 280169 279453 278462 277071 275852 275585 276139 276439 275737 274307 272676 270838
$$ packed form
55567D28400k397j841j657k035k584k807k674k539k576k584k403k232k301k474
55553C95296k407k053j692j565j625j700j712j682j618j503j347j245j284j419
55539C72444j436j257j125j343j829k161k099j783j387r24n37n52j016j514j737
55524C51744j923k344k681k396j609j018r75j126j083r73j067j261j260j046q79
55509C30103q83r55r51q45o66m95m74p18j182j661j942j873j427p90l41l23n76
55492C14001p23o78p73j249j793j815j144k18L72L56j39p33r73p20m32p27j558
55475C01054k175k124j830j859k002j724j090o58n42l68j25k32o86q75n17j39
55459B84108k45o13p97p89p70p25p16r91j391j219k67N54L00p02j430j631j838
$$ plain form
55442 270838 268674 266590 265109 264104 262936 261238 259256 257625 257045 257790 259136 259630 258464 256386 254772
55427 254772 254002 253354 252320 251238 250493 249828 248821 247591 246567 245781 244829 243502 242154 241371 241409 242006 242658
55410 242658 243013 242985 242554 241637 240282 238837 237732 237108 236769 236481 236166 235820 235387 234809 234156 233656 233519 233635
55392 233635 233467 232501 230809 228981 227467 226246 225246 224655 224538 224513 224232 223914 223953 224196 224159 223868 223884 224464
55374 224464 225213 225672 225763 225482 224672 223433 222339 221854 221775 221535 220885 220009 219158 218459 217981 217708 217477 217108 216537
55355 216537 215784 214917 214163 213807 213852 213957 213870 213704 213643 213644 213658 213881 214394 214763 214401 213333 212213 211558 211311 211208
55335 211208 211219 211422 211632 211450 210699 209694 208998 208854 208871 208381 207187 205805 204874 204509 204411 204439 204711 205140 205217
55316 205217 204465 202938 201184 199769 198925 198537 198373 198294 198241 198066 197569 196777 196002 195449 194959 194391 194039 194279
$$ packed form
55442B70838k164k084j481j005j168j698j982j631n80P45J346M94j166k078j614
55427B54772p70o48j034j082p45o65j007j230j024p86r52j327j348p83L8N97O52
55410B42658L55k8m31r17j355j445j105o24l39k88l15l46m33n78o53n00j37J16
55392B33635j68r66j692j828j514j221j000n91j17k5k81l18L9K43l7k91J6N80
55374B24464P49M59R1k81q10j239j094m85p9k40o50q76q51o99m78k73k31l69n71
55355B16537p53q67p54l56M5J05q7j66o1JJ4K23N13L69l62j068j120o55k47j03
55335B11208J1K03K10j82p51j005o96j44J7m90j194j382r31l65r8K8K72M29P7
55316B05217p52j527j754j415q44l88j64p9n3j75m97p92p75n53m90n68l52K40
$$ plain form
55298 194279 194916 195322 195274 195179 195375 195665 195790 195875 196055 195996 195315 194260 193507 193299 193254 193007 192688 192590 192744 192970
55278 192970 193127 193136 192871 192204 191161 190006 189161 188923 189131 189235 188904 188448 188385 188666 188691 188059 186930 185619 184308
55259 184308 183335 183233 184081 185148 185619 185464 185162 184791 183954 182589 181314 180791 181105 181888 182723 183282 183408 183284
55241 183284 183311 183604 183837 183745 183539 183538 183614 183315 182481 181464 180722 180420 180439 180587 180677 180540 180060 179215 178124 177037
55221 177037 176228 175800 175672 175743 175959 176155 176004 175283 174138 172980 172202 172018 172348 172713 172514 171719 171086 171336
55203 171336 172241 172928 173058 173145 173609 174073 173960 173367 172881 172705 172483 171955 171328 170916 170715 170522 170265 170040 169950
55184 169950 169969 169935 169689 169307 169146 169446 169830 169502 168093 166156 164659 164092 164229 164623 165012 165309 165480 165600
55166 165600 165826 166156 166348 166196 165733 165047 164025 162542 160835 159417 158545 157988 157395 156743 156290 156256 156737 157799
$$ packed form
55298A94279O37M06m8r5J96K90J25Q5J80n9o81j055p53k08m5k47l19r8J54K26
55278A92970J57Rk65o67j043j155q45k38K08J04l31m56o3K81K5o32j129j311j311
55259A84308r73j02Q48J067M71j55l02l71q37j365j275n23L14P83Q35N59J26j24
55241A83284K7K93K33r2k06jP6k99q34j017p42l02J9J48R0j37m80q45j091j087
55221A77037q09m28j28P1K16J96j51p21j145j158p78j84L30L65j99p95o33K50
55203A71336R05O87J30Q7M64M64j13n93m86j76k22n28o27m12k01j93k57k25r0
55184A69950J9l4k46l82j61L00L84l28j409j937j497n67J37L94L89K97J71J20
55166A65600K26L30J92j52m63o86j022j483j707j418q72n57n93o52m53l4M81J062
$$ plain form
55148 157799 159344 160906 161831 161842 161331 160933 160897 161013 161082 161213 161560 161974 162204 162376 163011 164376 166003 167020
55130 167020 166905 165808 164225 162635 161409 160771 160663 160752 160724 160499 160162 159870 159830 160161 160616 160662 160059 159217 158769
55111 158769 158866 159094 158973 158333 157302 156223 155530 155394 155446 155065 154011 152610 151338 150480 150148 150335 150832 151350
55093 151350 151846 152549 153538 154556 155338 155856 156090 155825 154974 153913 153191 152948 152865 152631 152228 151797 151431 151174
55075 151174 151005 150790 150368 149770 149295 149253 149710 150444 151125 151465 151261 150454 149265 148248 147958 148399 148933 148940 148500
55056 148500 148185 148290 148569 148699 148600 148275 147743 147297 147397 148038 148591 148542 148094 147709 147444 147148 147002 147289 147809
55037 147809 148093 148109 148196 148304 147960 147081 146251 145931 145847 145441 144552 143375 142124 141056 140541 140722 141284 141805 142189
55018 142189 142508 142659 142480 142050 141567 141014 140283 139547 139217 139515 140300 141290 142237 142912 143152 142987 142605 142196 141847
$$ packed form
55148A57799J545J562R25J1n11l98l6J16O9J31L47M14K30J72O35J365J627J017
55130A67020j15j097j583j590j226o38j08Q9k8k25l37k92m0L31M55M6o03q42m48
55111A58769R7K28j21o40j031j079o93j36N2l81j054j401j272q58l32J87M97N18
55093A51350M96P03R89J018P82N18K34k65q51j061p22k43q3k34m03m31l66k57
55075A51174j69k15m22n98m75m2M57P34O81L40k04q07j189j017k90M41N34Pm40
55056A48500l15J05K79J30r9l25n32m46J00O41N53m9m48l85k65k96j46K87N20
55037A47809K84J6Q7J08l44q79q30l20q4m06q89j177j251j068n15J81N62N21L84
55018A42189L19J51j79m30m83n53p31p36l30K98P85R90R47O75K40j65l82m09l49
$$ plain form
54999 141847 141552 141178 140525 139583 138666 138147 138106 138360 138745 139211 139691 140058 140182 139919 139179 138205 137618 137859 138596
54980 138596 139027 138811 138398 138354 138687 139010 139116 139079 138943 138615 138078 137502 137075 136838 136709 136596 136477 136433 136603 136984
54960 136984 137286 137093 136309 135390 134957 135161 135506 135407 134787 134009 133346 132779 132315 132176 132460 132799 132660 131931 131008
54941 131008 130350 130160 130501 131395 132666 133883 134649 134899 134801 134473 133900 133125 132338 131740 131360 131028 130512 129738
54923 129738 128932 128543 128921 130000 131285 132195 132491 132416 132416 132702 133041 133006 132448 131735 131468 131913 132695 133104 132740
54904 132740 131826 130908 130377 130326 130666 131129 131237 130618 129505 128653 128585 129050 129369 129196 128797 128685 129126 129874 130288
54885 130288 129850 128700 127557 126950 126767 126695 126793 127248 127783 127869 127491 127227 127452 127894 128158 128317 128692 129310 129854
54866 129854 130006 129639 128816 127816 127061 126883 127318 128116 128842 129027 128511 127663 126999 126568 126034 125437 125333 125901
$$ packed form
54999A41847k95l74o53r42r17n19m1K54L85M66M80L67J24k63p40r74n87K41P37
54980A38596M31k16m13m4L33L23J06l7j36l28n37n76m27k37j29j13j19m4J70L81
54960A36984L02j93p84r19m33K04L45r9o20p78o63n67m64j39K84L39j39p29r23
54941A31008o58j90L41Q94J271J217P66K50r8l28n73p75p87n98l80l32n16p74
54923A29738q06l89L78J079J285R10K96p5%K86L39l5n58p13k67M45P82M09l64
54904A32740r14r18n31n1L40M63J08o19j113q52o8M65L19j73l99j12M41P48M14
54885A30288m38j150j143o07j83p2R8M55N35Q6l78k64K25M42K64J59L75O18N44
54866A29854J52l67q23j000p55j78M35P98P26J85n16q48o64m31n34n97j04N68
$$ plain form
54848 125901 126424 126182 125555 125592 126558 127527 127527 126645 125731 125377 125472 125611 125638 125777 126309 127203 128059 128473 128403 128143 128059
54827 128059 128405 129206 130129 130605 130351 129682 129083 128591 127918 127086 126521 126445 126574 126596 126628 127018 127963 129510 131652
54808 131652 134124 136329 137806 138720 139663 141045 142851 144881 146886 148521 149471 149728 149504 148855 147614 145740
54792 145740 143529 141308 139149 137030 135096 133516 132188 130869 129562 128490 127655 126733 125514 124235 123261
54777 123261 122689 122478 122715 123342 123731 123087 121454 119899 119444 120011 120683 120790 120410 119987 119818 119907 120039 119928
54759 119928 119485 118958 118645 118468 118037 117185 116267 115861 116255 117206 118105 118432 118153 117720 117591 117795 118035 118078 117904
54740 117904 117615 117399 117485 117822 117936 117354 116148 114828 113778 113152 113153 113899 114928 115379 114911 114053 113432 113017
54722 113017 112444 111695 111089 110826 110908 111342 112013 112497 112404 111884 111518 111702 112343 113066 113494 113392 112842 112239 111889
$$ packed form
54848A25901N23k42o27L7R66R69%q82r14l54R5J39K7J39N32Q94Q56M14p0k60q4
54827A28059L46Q01R23M76k54o69n99m92o73q32n65p6J29K2L2L90R45J547K142
54808A31652K472K205J477R14R43J382J806K030K005J635R50K57k24o49j241j874
54792A45740k211k221k159k119j934j580j328j319j307j072q35r22j219j279r74
54777A23261n72k11K37O27L89o44j633j555m55N67O72J07l80m23j69Q9J32j11
54759A19928m43n27l13j77m31q52r18m06L94R51Q99L27k79m33j29K04K40M3j74
54740A17904k89k16Q6L37J14n82j206j320j050o26JP46J029M51m68q58o21m15
54722A13017n73p49o06k63Q2M34O71M84r3n20l66J84O41P23M28j02n50o03l50
$$ plain form
54703 111889 111679 111361 111030 110981 111151 111108 110684 110284 110415 111090 111838 112154 111859 111188 110584 110341 110423 110667 111068 111649
54683 111649 112169 112269 111876 111215 110425 109536 108816 108693 109117 109422 109114 108521 108286 108454 108514 108259 108054 108209 108467
54664 108467 108390 107959 107441 106848 105894 104525 103171 102322 101997 101827 101566 101344 101476 102191 103544 105387 107285
54647 107285 108650 109136 108886 108286 107565 106757 105982 105575 105829 106654 107532 107857 107384 106390 105336 104407 103550 102900
54629 102900 102866 103566 104445 104784 104465 104003 103887 104163 104596 104875 104691 103963 103072 102557 102502 102493 102268 102056 102085 102127 101832
54608 101832 101283 100888 100839 101025 101420 102191 103340 104459 104986 104695 103951 103492 103823 104697 105277 104963 103997 103084
54590 103084 102544 102056 101245 100218 99391 98998 98911 98879 98757 98551 98382 98404 98650 98922 98923 98571 98109 97835 97758 97630
54570 97630 97292 96854 96509 96334 96361 96665 97235 97847 98254 98436 98486 98350 97886 97197 96636 96445 96554 96814 97165 97516
$$ packed form
54703A11889k10l18l31m9J70m3m24m00J31O75P48L16k95o71o04k43Q2K44M01N81
54683A11649N20J00l93o61p90q89p20j23M24L05l08n93k35J68O0k55k05J55K58
54664A08467p7m31n18n93r54j369j354q49l25j70k61k22J32P15J353J843J898
54647A07285J365M86k50o00p21q08p75m07K54Q25Q78L25m73r94j054r29q57o50
54629A02900l4P00Q79L39l19m62j16K76M33K79j84p28q91n15n5rk25k12K9M2k95
54608A01832n49l95m9J86L95P71J149J119N27k91p44m59L31Q74N80l14r66r13
54590A03084n40m88q11j027q27l93q7l2j22k06j69K2K46K72Jl52m62k74p7j28
54570I7630l38m38l45j75K7L04N70O12M07J82N0j36m64o89n61j91J09K60L51L51
$$ plain form
54550 97516 97680 97632 97664 98046 98650 99115 99343 99631 100250 101027 101443 101163 100409 99736 99433 99309 99107 98923 98929 98858 98236
54529 98236 97150 96367 96461 97109 97534 97389 96907 96416 96091 96078 96500 97268 98051 98462 98208 97229 95912 94980 94868
54510 94868 95221 95273 94697 93874 93388 93534 94272 95308 96173 96513 96444 96378 96426 96260 95695 95129 95114 95671 96296 96580
54490 96580 96552 96415 96197 95764 95038 94046 92910 91882 91363 91586 92232 92548 92116 91386 91184 91733 92482 92951 93340
54471 93340 94075 95054 95751 95889 95641 95221 94674 94113 93791 93808 93943 93932 93754 93519 93269 92967 92612 92278 92095 92193
54451 92193 92587 93111 93566 93909 94192 94410 94575 94856 95397 95992 96123 95418 93936 92059 90256 88927 88234 88029
54433 88029 88072 88273 88593 88836 88854 88864 89194 89704 89834 89357 88712 88476 88760 89274 89684 89798 89665 89620 89978 90554
54413 90554 90808 90549 90127 89816 89483 89120 89214 90112 91385 92274 92539 92433 92116 91626 91247 91314 91654 91722 91297 90672
$$ packed form
54550I7516J64m8L2L82O04M65K28K88O19P77M16k80p54o73l03j24k02j84Op1o22
54529I8236j086p83R4O48M25j45m82m91l25j3M22P68P83M11k54r79j317r32j12
54510I4868L53N2n76q23m86J46P38J036Q65L40o9o6M8j66n65n66j5N57O25K84
54490I6580k8j37k18m33p26r92j136j028n19K23O46L16m32p30k02N49P49M69L89
54471I3340P35R79O97J38k48m20n47n61l22J7J35j1j78k35k50l02l55l34j83R8
54451I2193L94N24M55L43K83K18J65K81N41N95J31p05j482j877j803j329o93k05
54433H8029M3K01L20K43J8J0L30N10J30m77o45k36K84N14M10J14j33m5L58N76
54413I0554K54k59m22l11l33l63R4Q98J273Q89K65j06l17m90l79O7L40O8m25o25
$$ plain form
54393 90672 90192 90002 90206 90767 91251 91147 90528 89954 89615 89098 88191 87402 87312 87813 88346 88646 88859 89088 89224
54374 89224 89176 89014 88853 88767 88749 88679 88412 88008 87759 87854 88150 88384 88459 88401 88204 87922 87753 87807 87873 87661 87222 86931
54352 86931 87057 87509 88027 88433 88664 88653 88295 87541 86588 85894 85876 86473 87099 87162 86574 85724 85059 84810 85010 85539
54332 85539 86119 86421 86285 85890 85638 85803 86211 86330 85825 84969 84373 84329 84638 85066 85597 86132 86320 85975 85482
54313 85482 85468 86149 87207 88176 88706 88643 88142 87628 87353 87068 86449 85725 85495 85888 86335 86229 85509 84485 83532
54294 83532 83092 83567 84825 86030 86369 85852 85182 84924 85023 85069 84757 84106 83443 83188 83513 84165 84744 85127 85441
54275 85441 85682 85563 84838 83628 82317 81221 80464 80108 80193 80629 81180 81701 82297 83084 83847 84174 84019 83874
54257 83874 84170 84693 84867 84536 84126 84001 84029 83886 83544 83252 83231 83546 84128 84759 85165 85228 85065 84782 84326 83651
$$ packed form
54393I0672m80j90K04N61M84j04o19n74l39n17r07p89r0N01N33L00K13K29J36
54374H9224m8j62j61q6j8p0k67m04k49R5K96K34P5n8j97k82j69N4O6k12m39k91
54352H6931J26M52N18M06K31j1l58p54r53o94j8N97O26O3n88q50o65k49K00N29
54332H5539N80L02j36l95k52J65M08J19n05q56n96m4L09M28N31N35J88l45m93
54313H5482j4O81J058R69N30o3n01n14k75k85o19p24k30L93M47j06p20j024r53
54294H3532m40M75J258J205L39n17o70k58R9M6l12o51o63k55L25O52N79L83L14
54275H5441K41j19p25j210j311j096p57l56Q5M36N51N21N96P87P63L27j55j45
54257H3874K96N23J74l31m10j25K8j43l42k92k1L15N82O31M06O3j63k83m56o75
$$ plain form
54237 83651 82847 82009 81188 80621 80752 81759 83209 84363 84737 84233 83019 81576 80627 80570 81049 81376 81312 81090
54219 81090 80830 80371 79692 79040 78577 78285 78312 78975 80252 81630 82626 83166 83294 82913 82123 81464 81461 82019 82543
54200 82543 82546 81953 81042 80324 80277 80918 81715 82162 82335 82601 82938 82857 82009 80618 79287 78532 78461 78767 78994 78906
54180 78906 78564 78064 77429 76864 76790 77331 77970 78062 77609 77161 77049 77065 76932 76686 76503 76398 76292 76172 76101 76132 76204
54159 76204 76083 75556 74884 74862 76049 77996 79587 80167 79972 79440 78623 77477 76342 75735 75832 76350 76841 76956
54141 76956 76621 76135 75955 76244 76741 77123 77267 77097 76485 75489 74416 73453 72485 71525 70999 71267 72051 72731 73074
54122 73074 73344 73772 74348 75093 76137 77376 78362 78685 78342 77654 77008 76651 76533 76282 75508 74246 72974 72171
54104 72171 72002 72428 73321 74369 75105 75263 75052 74919 75098 75465 75754 75789 75580 75337 75378 75882 76696 77467 77975
$$ packed form
54237H3651q04q38q21n67J31J007J450J154L74n04j214j443r49n7M79L27o4k22
54219H1090k60m59o79o52m63k92K7O63J277J378R96N40J28l81p90o59lN58N24
54200H2543Ln93r11p18m7O41P97M47J73K66L37q1q48j391j331p55p1L06K27q8
54180G8906l42n00o35n65p4N41O39R2m53m48j12J6j33k46j83j05j06j20p1L1P2
54159G6204j21n27o72k2J187J947J591N80j95n32q17j146j135o07R7N18M91J15
54141G6956l35m86j80K89M97L82J44j70o12r96j073r63r68r60n26K68P84O80L43
54122G3074K70M28N76P45J044J239R86L23l43o88o46l57j18k51p74j262j272q03
54104G2171j69M26Q93J048P36J58k11j33J79L67K89L5k09k43M1N04Q14P71N08
$$ plain form
54085 77975 78221 78213 77822 76989 75961 75137 74667 74402 74267 74458 75091 75845 76254 76262 76206 76205 75940 75150 74079 73242 72885
54064 72885 72846 72763 72308 71442 70622 70557 71503 72926 74066 74691 75025 75144 74884 74301 73827 73822 74254 74861 75392 75633
54044 75633 75439 74892 74270 73788 73489 73410 73600 73984 74423 74894 75348 75407 74604 73091 71733 71218 71343 71463 71413
54025 71413 71598 72302 73302 74188 74737 74906 74682 74082 73234 72348 71658 71356 71464 71805 72169 72474 72698 72732 72523
54006 72523 72344 72666 73572 74455 74503 73650 72852 73193 74673 76072 76166 74922 73303 72081 71219 70358 69437 68620
53988 68620 67968 67509 67384 67648 68076 68457 68880 69410 69689 69291 68397 67635 67250 66909 66401 66038 66140 66591 67217
53969 67217 68174 69503 70601 70753 70126 69652 69816 70062 69641 68634 67777 67504 67637 67933 68500 69491 70662 71521
53951 71521 71812 71657 71225 70532 69610 68721 68195 68108 68248 68426 68625 68832 68877 68658 68423 68615 69333 70120 70430 70228
$$ packed form
54085G7975K46ql91q33j028q24m70k65j35J91O33P54M09Qn6jk65p90j071q37l57
54064G2885l9q3m55q66q20o5R46J423J140O25L34J19k60n83m74nM32O07N31K41
54044G5633j94n47o22m82k99p9J90L84M39M71M54N9q03j513j358n15J25J20n0
54025G1413J85P04J000Q86N49J69k24o00q48q86o90l02J08L41L64L05K24L4k09
54006G2523j79L22R06Q83M8q53p98L41J480J399R4j244j619j222q62q61r21q17
53988F8620o52m59j25K64M28L81M23N30K79l98q94p62l85l41n08l63J02M51O26
53969F7217R57J329J098J52o27m74J64K46m21j007q57k73J33K96N67R91J171Q59
53951G1521K91j55m32o93r22q89n26q7J40J78J99K07M5k19k35J92P18P87L10k02
$$ plain form
53931 70228 69930 69822 69772 69549 69194 68893 68640 68303 67963 67934 68352 68984 69531 70011 70637 71446 72193 72572 72425 71790
53911 71790 70907 70148 69742 69529 69134 68419 67635 67051 66615 66103 65558 65375 65897 66971 68011 68462 68233 67689
53893 67689 67257 67090 67072 66983 66614 65860 64907 64284 64499 65503 66703 67544 67983 68297 68647 69028 69508 70220 71092
53874 71092 71786 71959 71539 70713 69824 69205 69009 69148 69513 70205 71387 72893 74252 75149 75652 75889 75813 75437
53856 75437 75090 75082 75236 75043 74266 73120 71898 70712 69656 68948 68776 69137 69863 70660 71107 70946 70469 70318
53838 70318 70707 71111 70925 70177 69344 68691 68140 67657 67334 67119 66799 66334 65924 65683 65527 65426 65462 65552 65407 64905
53818 64905 64255 63686 63238 63011 63254 63931 64513 64598 64577 65192 66476 67573 67694 66923 65915 65138 64653 64438 64556
53799 64556 65047 65796 66596 67259 67673 67804 67643 67139 66269 65201 64299 63858 63849 64004 64079 63996 63758 63388 62974 62675
$$ packed form
53931G0228k98j08n0k23l55l01k53l37l40k9M18O32N47M80O26Q09P47L79j47o35
53911G1790q83p59m06k13l95p15p84n84m36n12n45j83N22J074J040M51k29n44
53893F7689m32j67j8q9l69p54r53o23K15J004J200Q41M39L14L50L81M80P12Q72
53874G1092O94J73m20q26q89o19j96J39L65O92J182J506J359Q97N03K37p6l76
53856G5437l47qJ54j93p77j146j222j186j056p08j72L61P26P97M47j61m77j51
53838G0318L89M04j86p48q33o53n51m83l23k15l20m65m10k41j56j01L6R0j45n02
53818F4905o50n69m48k27K43O77N82Q5k1O15J284J097J21p71j008p77m85k15J18
53799F4556M91P49Q00O63M14J31j61n04q70j068r02m41rJ55P5q3k38l70m14k99
$$ plain form
53779 62675 62575 62604 62676 62858 63298 63923 64388 64375 63919 63293 62717 62301 62231 62725 63703 64769 65644 66419 67161 67509
53759 67509 67027 65876 64798 64350 64486 64952 65724 66818 67929 68603 68668 68253 67469 66342 65070 64055 63587
53742 63587 63666 64193 65136 66361 67478 68063 68028 67619 67070 66397 65583 64852 64544 64725 65027 64974 64459 63805 63427
53723 63427 63479 63782 63987 63817 63351 63056 63352 64086 64652 64737 64661 64763 64716 63905 62368 60940 60413 60904 62118
53704 62118 63708 65176 65852 65462 64469 63507 62657 61696 60858 60753 61474 62312 62571 62285 61937 61849 62107 62747 63602
53685 63602 64198 64261 64197 64610 65393 65741 65205 64274 63721 63692 63771 63694 63586 63540 63335 62698 61674 60642 60073 60296
53665 60296 61280 62506 63191 62889 61952 61285 61543 62605 63803 64586 64862 64781 64397 63667 62695 61786 61246 61206 61638
53646 61638 62421 63308 63938 64040 63656 63037 62375 61712 61121 60779 60731 60712 60396 59854 59609 60123 61321 62680 63730
$$ packed form
53779F2675j00K9P2J82M40O25M65j3m56o26n76m16p0M94R78J066Q75P75P42L48
53759F7509m82j151j078m48J36M66P72J094J111O74O5m15p84j127j272j015m68
53742F3587P9N27R43J225J117N85l5m09n49o73q14p31l08J81L02n3n15o54l78
53723F3427N2L03K05j70m66k95K96P34N66Q5p6J02m7q11j537j428n27M91J214
53704F2118J590J468O76l90r93r62q50r61q38j05P21Q38K59k86l48q8K58O40Q55
53685F3602N96O3o4M13P83L48n36r31n53k9P9p7j08m6k05o37j024j032n69K23
53665F0296R84J226O85l02r37o67K58J062J198P83K76q1l84p30r72r09n40m0M32
53646F1638P83Q87O30J02l84o19o62o63n91l42m8j9l16n42k45N14J198J359J050
$$ plain form
53627 63730 64356 64652 64654 64345 63875 63650 64047 65049 66203 67001 67269 67174 66912 66556 66181 65963 66033 66300 66527 66523
53607 66523 66195 65551 64734 63939 63142 62065 60632 59305 58597 58329 57869 57172 57045 58020 59408 60003 59505 58703
53589 58703 58302 58201 58042 57942 58249 58918 59545 59922 60213 60561 60823 60787 60524 60346 60425 60545 60343 59808 59421 59626
53569 59626 60251 60627 60333 59675 59311 59581 60295 61066 61674 62125 62497 62736 62663 62191 61524 61013 60813 60791 60772 60699
53549 60699 60546 60287 60079 60223 60731 61080 60679 59548 58317 57564 57336 57321 57259 57092 56907 56818 56904 57187 57691 58455
53529 58455 59392 60191 60524 60392 60132 60020 60010 59875 59541 59210 59224 59817 60870 61873 62241 61805 60985 60383 60249
53510 60249 60381 60513 60659 61001 61527 61897 61770 61221 60661 60362 60181 59861 59439 59166 59093 58994 58766 58629 58818 59193
53490 59193 59348 59078 58595 58292 58355 58627 58763 58607 58410 58609 59305 60045 60321 60172 60094 60393 60860 61163 61257 61218
$$ packed form
53627F3730O26K96Kl09m70k25L97J002J154P98K68r5k62l56l75k18P0K67K27m
53607F6523l28o44q17p95p97j077j433j327p08k68m60o97j27R75J388N95m98q02
53589E8703m01j01j59j00L07O69O27L77K91L48K62l6k63j78P9J20k02n35l87K05
53569E9626O25L76k94o58l64K70P14P71O08M51L72K39p3m72o67n11k00k2j9p3
53549F0699j53k59k08J44N08L49m01j131j231p53k28j5o2j67j85q9Q6K83N04P64
53529E8455R37P99L33j32k60j12j0j35l34l31J4N93J053J003L68m36q20o02j34
53510F0249J32J32J46L42N26L70j27n49n60k99j81l20m22k73p3r9k28j37J89L75
53490E9193J55k70m83l03O3K72J36j56j97J99O96P40K76j49p8K99M67L03R4l9
$$ plain form
53470 61218 60917 60179 59210 58563 58621 59286 60221 61155 61890 62233 62115 61715 61340 61222 61441 61880 62201 62062 61503
53451 61503 60988 60899 61145 61406 61566 61715 61846 61898 61957 62112 62158 61779 60998 60185 59621 59376 59553 60187 60866 60969
53431 60969 60487 60117 60289 60533 60272 59801 59875 60532 61007 60816 60339 60153 60267 60322 60250 60355 60839 61530 62095 62395
53411 62395 62556 62786 63136 63503 63800 64034 64155 63946 63215 62084 61017 60503 60671 61088 61005 60038 58638 57693
53393 57693 57570 57865 58196 58826 60133 61800 63070 63654 63880 63974 63698 62820 61544 60311 59424 58955 58798 58776
53375 58776 58885 59377 60304 61107 61164 60709 60633 61247 61801 61539 60673 59943 59663 59668 59898 60443 61174 61783 62131 62185 61791
53354 61791 60937 60132 59998 60478 60916 60996 61157 61864 62880 63544 63561 63214 62950 63007 63431 64197 65174 66043 66381 65993
53334 65993 65190 64631 64741 65307 65758 65787 65581 65458 65444 65298 64836 64156 63550 63252 63252 63370 63485 63599 63663 63494 62966
$$ packed form
53470F1218l01p38r69o47N8O65R35R34P35L43j18m00l75j18K19M39L21j39n59
53451F1503n15q9K46K61J60J49J31N2N9J55M6l79p81q13n64k45J77O34O79J03
53431F0969m82l70J72K44k61m71P4O57M75j91m77j86J14N5p2J05M84O91N65L00
53411F2395J61K30L50L67K97K34J21k09p31j131j067n14J68M17q3r67j400r45
53393E7693j23K95L31O30J307J667J270N84K26R4k76q78j276j233q87m69j57k2
53375E8776J09M92R27Q03N7m55p6O14N54k62q66p30k80NK30N45P31O09L48N4l94
53354F1791q54q05j34M80M38Q0J61P07J016O64J7l47k64N7M24P66R77Q69L38l88
53334F5993q03n59J10N66M51K9k06j23j4j46m62o80o06k98%J18J15J14O4j69n28
$$ plain form
53313 62966 62239 61673 61530 61851 62495 63188 63616 63630 63399 63249 63370 63748 64287 64828 65098 64837 64032 62912 61714
53294 61714 60587 59729 59382 59587 60064 60456 60637 60691 60674 60532 60263 60021 59956 60007 59985 59866 59886 60193 60524 60440 59842
53273 59842 59041 58313 57605 56826 56138 55779 55755 55906 56149 56438 56620 56608 56566 56700 56888 56856 56659 56648 56897 57022 56742
53252 56742 56315 56181 56323 56271 55730 54972 54556 54733 55256 55743 56106 56495 56871 56923 56561 56225 56419 57076 57759 58357
53232 58357 59150 60141 60838 60928 60763 60837 61113 61217 61072 60874 60602 59983 59028 58211 57935 58081 58191 57949 57381 56719
53212 56719 56188 55841 55568 55334 55376 55953 56889 57570 57553 57060 56732 56990 57715 58465 58864 58845 58596 58277 57820 57119
53192 57119 56360 55917 55820 55646 55144 54686 54730 55055 55020 54527 54165 54310 54612 54671 54715 55147 55743 55890 55468 54985 54810
53171 54810 54769 54595 54326 54107 53952 53906 54140 54686 55299 55706 55777 55369 54372 53113 52272 52103 52084 51719 51308 51375
$$ packed form
53313F2966p27n66j43L21O44O93M28J4k31j50J21L78N39N41K70k61q05j120j198
53294F1714j127q58l47K05M77L92J81N4j7j42k69k42o5N1k2j19K0L07L31q4n98
53273E9842q01p28p08p79o88l59k4J51K43K89J82j2m2J34J88l2j97j1K49J25k80
53252E6742m27j34J42n2n41p58m16J77N23M87L63L89L76N2l62l36J94O57O83N98
53232E8357P93R91O97R0j65P4K76J04j45j98k72o19r55q17k76J46J10k42n68o62
53212E6719n31l47k73k34M2N77R36O81j7m93l28K58P25P50L99j9k49l19m57p01
53192E7119p59m43r7j74n02m58M4L25l5m93l62J45L02N9M4M32N96J47m22m83j75
53171E4810m1j74k69k19j55m6K34N46O13M07P1m08r97j259q41j69j9l65m11O7
$$ plain form
53151 51375 51617 51155 49819 48484 47971 48176 48612 49268 50439 51991 53300 53837 53540 52675 51662 50960 50844
53134 50844 51209 51733 52215 52605 52843 52904 52952 53140 53233 52744 51577 50296 49586 49567 49816 49907 49737 49393 48996 48710
53114 48710 48681 48850 48937 48709 48256 47875 47797 48064 48598 49258 49916 50579 51397 52371 53137 53227 52598 51702 50987 50443
53094 50443 49766 48820 47816 47104 46834 46801 46615 46125 45611 45391 45281 44788 43905 43327 43660 44690 45751 46531
53076 46531 47153 47726 48303 49135 50418 51764 52468 52423 52307 52658 53218 53424 53162 52680 52131 51549 51077 50847 50777
53057 50777 50765 50881 51079 50950 50212 49309 49008 49441 49952 49978 49612 49186 48815 48614 48939 49954 51144 51718 51465
53038 51465 50860 50363 49937 49368 48713 48234 48056 48067 48063 47865 47376 46723 46250 46252 46690 47290 47852 48335 48707 48901 48959
53017 48959 48985 48910 48564 48068 47939 48528 49531 50321 50694 50982 51380 51506 50819 49348 47799 46911 46819 47062 47192
$$ packed form
53151E1375K42m62j336j335n13K05M36O56J171J552J309N37k97q65j013p02j16
53134E0844L65N24M82L90K38O1M8J88R3m89j167j281p10j9K49R1j70l44l97k86
53114D8710k9J69Q7k28m53l81p8K67N34O60O58O63Q18R74P66R0o29q96p15n44
53094E0443o77r46j004p12k70l3j86m90n14k20j10m93q83n78L33J030J061P80
53076D6531O22N73N77Q32J283J346P04m5j16L51N60K06k62m82n49n82m72k30p0
53057E0777j2J16J98j29p38r03l01M33N11K6l66m26l71k01L25J015J190N74k53
53038E1465o05m97m26n69o55m79j78J1mj98m89o53m73KM38O00N62M83L72J94N8
53017D8959K6p5l46m96j29N89J003P90L73K88L98J26o87j471j549q88r2K43J30
$$ plain form
52998 47192 47277 47744 48754 49873 50480 50381 49883 49340 48787 48029 46969 45873 45306 45650 46579 47184 46862 45947
52980 45947 45204 44934 44937 45150 45707 46341 46426 45887 45500 45841 46450 46530 46128 45955 46280 46673 46802 46781 46601 45913 44711
52959 44711 43681 43387 43432 42966 41856 40862 40672 41220 42049 42939 43896 44791 45330 45364 45009 44436 43765 43187 42973
52940 42973 43225 43688 44003 44172 44599 45598 46946 48010 48295 47799 46862 45846 45017 44599 44704 45130 45401 45192
52922 45192 44654 44193 43976 43839 43672 43562 43466 43086 42345 41778 42034 43096 44336 45316 46123 46872 47312 47225 46879
52903 46879 46728 46793 46644 45982 45003 44144 43643 43414 43297 43325 43668 44269 44738 44754 44504 44430 44589 44594 44279 44006 44156
52882 44156 44628 45126 45606 46076 46225 45744 44957 44678 45327 46470 47298 47346 46708 45818 45148 44935 45033 45062 44745 44119
52862 44119 43481 43187 43391 43848 44090 43951 43785 43994 44406 44406 43647 42423 41358 40905 41111 41657 42123 42400 42773
$$ packed form
52998D7192Q5M67J010J119O07r9m98n43n53p58j060j096n67L44R29O05l22r15
52980D5947p43k70LK13N57O34Q5n39l87L41O09Q0m02j73L25L93J29k1j80o88j202
52959D4711j030k94M5m66j110r94j90N48Q29Q90R57Q95N39L4l55n73o71n78k14
52940D2973K52M63L15J69M27R99J348J064K85m96r37j016q29m18J05M26K71k09
52922D5192n38m61k17j37j67j10r6l80p41n67K56J062J240R80Q07P49M40q7l46
52903D6879j51O5j49o62r79q59n01k29j17K8L43O01M69J6k50p4J59Nl15k73J50
52882D4156M72M98M80M70J49m81p87k79O49J143Q28M8o38q90o70k13R8K9l17o26
52862D4119o38k94K04M57K42j39j66K09M12%p59j224j065m53K06N46M66K77L73
$$ plain form
52843 42773 43466 44242 44728 45013 45556 46525 47562 48260 48532 48463 48143 47789 47690 47877 48096 48166 48112 47803 46890 45331
52823 45331 43658 42429 41687 41223 41086 41416 42007 42461 42735 43085 43496 43575 43127 42475 42091 42180 42735 43691 44750
52804 44750 45353 45143 44435 43928 43979 44382 44837 45297 45723 45779 45111 43875 42716 42173 42272 42716 43246 43669 43742 43305
52784 43305 42511 41798 41635 42309 43797 45658 47224 48147 48700 49319 49890 49860 49039 47903 47002 46354 45730 45203
52766 45203 45066 45289 45471 45381 45278 45515 46024 46379 46335 46077 45904 45821 45573 45017 44246 43374 42431 41597 41236 41465
52746 41465 41870 41962 41814 41917 42447 43059 43449 43718 44038 44301 44310 44035 43495 42686 41894 41736 42536 43814 44769 45149
52726 45149 45323 45626 45974 46119 45913 45337 44567 44043 44146 44758 45390 45781 46062 46256 46010 45057 43749 42824 42726
52707 42726 43324 44198 45028 45685 46130 46287 46036 45389 44634 44141 43973 43851 43572 43317 43389 43801 44338 44929 45707
$$ packed form
52843D2773O93P76M86K85N43R69J037O98K72o9l20l54r9J87K19P0n4l09r13j559
52823D5331j673j229p42m64j37L30N91M54K74L50M11P9m48o52l84Q9N55R56J059
52804D4750O03k10p08n07N1M03M55M60M26N6o68j236j159n43R9M44N30M23P3m37
52784D3305p94p13j63O74J488J861J566R23N53O19N71l0q21j136r01o48o24n27
52766D5203j37K23J82r0j03K37N09L55m4k58j73q3k48n56p71q72r43q34l61K29
52746D1465M05R2j48J03N30O12L90K69L20K63Rk75n40q09p92j58Q00J278R55L80
52726D5149J74L03L48J45k06n76p70n24J03O12O32L91K81J94k46r53j308r25r8
52707D2726N98Q74Q30O57M45J57k51o47p55m93j68j22k79k55P2M12N37N91P78
$$ plain form
52688 45707 46687 47610 48211 48505 48682 48868 49087 49375 49739 50015 49957 49505 48855 48217 47616 47036 46572 46255 45817
52669 45817 44948 43825 43094 43174 43769 44238 44276 44010 43635 43290 43178 43388 43554 43092 41950 40819 40380 40598 40976
52650 40976 41254 41502 41752 41904 41968 42024 41935 41508 40957 40798 41147 41479 41314 40817 40468 40438 40641 41125 41948 42772
52630 42772 43097 42943 42870 43217 43669 43738 43355 42810 42363 42114 42091 42253 42553 43050 43817 44596 44885 44529 44005 43875
52610 43875 44153 44532 44994 45803 46926 47841 48008 47317 46070 44721 43630 42895 42400 42128 42280 42899 43556 43769
52592 43769 43647 43780 44469 45428 46238 46775 47093 47216 47150 46916 46505 46018 45820 46236 47060 47695 47820 47590 47208
52573 47208 46718 46310 46295 46598 46735 46553 46491 46864 47353 47585 47718 47952 47954 47423 46875 47117 48114 49114 49795 50505
52553 50505 51287 51479 50680 49535 49118 49844 51302 52883 54222 55247 56116 57025 57905 58435 58517 58542 59006 59944
$$ packed form
52688D5707R80R23O01K94J77J86K19K88L64K76n8m52o50o38o01n80m64l17m38
52669D5817q69j123p31Q0N95M69L8k66l75l45j12K10J66m62j142j131m39K18L78
52650D0976K78K48K50J52O4N6q9m27n51j59L49L32j65m97l49l0K03M84Q23Q24
52630D2772L25j54p3L47M52O9l83n45m47k49k3J62L00M97P67P79K89l56n24j30
52610D3875K78L79M62Q09J123R15J67o91j247j349j091p35m95k72J52O19O57K13
52592D3769j22J33O89R59Q10N37L18J23o6k34m11m87j98M16Q24O35J25k30l82
52573D7208m90m08j5L03J37j82o2L73M89K32J33K34Kn31n48K42R97J000O81P10
52553E0505P82J92p99j145m17P26J458J581J339J025Q69R09Q80N30Q2K5M64R38
$$ plain form
52535 59944 60911 61476 61619 61700 62056 62559 62623 61854 60643 59831 59766 60002 60004 59753 59475 59168 58762 58456 58465 58578 58324
52514 58324 57616 56867 56449 56310 56225 56169 56317 56827 57684 58666 59389 59520 59025 58213 57505 57227 57524 58301 59203 59812
52494 59812 59964 59839 59712 59731 59945 60335 60719 60739 60211 59445 59027 59182 59507 59443 58884 58202 57711 57380 57063 56837
52474 56837 56889 57187 57454 57518 57504 57576 57565 57038 55831 54390 53416 53182 53355 53572 53928 54627 55369 55441 54548 53174
52454 53174 52032 51443 51459 52164 53464 54808 55608 55888 56146 56543 56670 56182 55299 54519 54116 54105 54340 54450 53918
52435 53918 52595 51012 49899 49453 49295 49043 48710 48538 48717 49326 50359 51661 52937 53886 54372 54447 54267
52418 54267 53973 53613 53173 52698 52366 52420 53034 54195 55619 56788 57264 57084 56730 56619 56635 56332 55537 54612 54084
52399 54084 54120 54409 54538 54420 54318 54489 54866 55117 55006 54551 53891 53100 52174 51138 50141 49477 49436 50039 50966
$$ packed form
52535E9944R67N65J43Q1L56N03O4p69j211q12o5K36Kk51k78l07m06l06RJ13k54
52514E8324p08p49m18j39q5n6J48N10Q57R82P23J31m95q12p08k78K97P77R02O09
52494E9812J52j25j27J9K14L90L84K0n28p66m18J55L25o4n59o82m91l31l17k26
52474E6837N2K98K67O4j4P2j1n27j207j441r74k34J73K17L56O99P42P2q93j374
52454E3174j142n89J6P05J300J344Q00K80K58L97J27m88q83p80m03j1K35J10n32
52435E3918j323j583j113m46j58k52l33j72J79O09J033J302J276R49M86P5j80
52418E4267k94l60m40m75l32N4O14J161J424J169M76j80l54j11J6l03p95r25n28
52399E4084L6K89J29j18j02J71L77K51j11m55o60p91r26j036r97o64m1O03R27
$$ plain form
52380 50966 51935 53063 54565 56111 56910 56637 55979 55873 56444 57048 57228 57190 57297 57526 57594 57379 57059 56953 57304
52361 57304 58047 58736 58938 58747 58689 59034 59439 59449 59083 58695 58494 58439 58507 58709 58924 59004 59044 59248 59549 59632 59407
52340 59407 59137 59035 59024 59080 59503 60525 61816 62704 62878 62642 62493 62683 63207 64003 65008 66129 67252 68245
52322 68245 68970 69361 69499 69526 69498 69412 69342 69386 69456 69323 68931 68581 68698 69481 70820 72453 74112 75587 76740
52303 76740 77519 78019 78563 79622 81404 83515 85208 86085 86429 86780 87378 88161 89180 90789 93316 96622
52287 96622 100052 102988 105513 108434 112464 117466 122699 127651 132336 136884 141336 145903 150945 156438
52273 156438 161891 167009 172035 177163 182082 186513 190748 195086 199126 202273 204723 207226 209983 212516
52259 212516 214609 216577 218470 219799 220365 220741 221382 221813 221213 219521 217463 215675 214241 213002 211912
$$ packed form
52380E0966R69J128J502J546P99k73o58j06N71O04J80l8J07K29O8k15l20j06L51
52361E7304P43O89K02j91n8L45M05J0l66l88k01n5O8K02K15Q0M0K04L01Q3k25
52340E9407k70j02j1N6M23J022J291Q88J74k36j49J90N24P96J005J121J123R93
52322F8245P25L91J38K7k8q6p0M4P0j33l92l50J17P83J339J633J659J475J153
52303G6740P79N00N44J059J782K111J693Q77L44L51N98P83J019J609K527L306
52287I6622L430K936K525K921M030N002N233M952M685M548M452M567N042N493
52273A56438N453N118N026N128M919M431M235M338M040L147K450K503K757K533
52259B12516K093J968J893J329N66L76O41M31o00j692k058j788j434j239j090
$$ plain form
52244 211912 211022 210310 209555 208415 206797 205214 204491 204950 206105 207285 208317 209517 211303 213972 217546
52229 217546 221551 225271 228493 231752 235604 239949 244302 248420 252284 255758 258727 261371 263915 266194
52215 266194 267910 269193 270507 272052 273621 275006 276179 277068 277554 277769 278109 278896 280211 281980 283948
52200 283948 285658 286838 287921 289842 293240 298001 303603 309635 315956 322598 329631 337047 344738 352693
52186 352693 361077 369953 379032 387919 396460 404649 412360 419485 426174 432614 438724 444442 450127 456145
52172 456145 462176 467462 471783 475628 479372 482885 486112 489416 493032 496726 500298 503951 507754 511218
52158 511218 513940 516375 519392 523252 527515 531844 536396 541354 546574 551838 557217 562918 568863 574545
52144 574545 579368 583158 586286 589162 591680 593403 594225 594521 594556 594163 593165 591689 589777 587130 583596 579552
$$ packed form
52244B11912q90p12p55j140j618j583p23M59J155J180J032J200J786K669L574
52229B17546M005L720L222L259L852M345M353M118L864L474K969K644K544K279
52215B66194J716J283J314J545J569J385J173Q89M86K15L40P87J315J769J968
52200B83948J710J180J083J921L398M761N602O032O321O642P033P416P691P955
52186C52693Q384Q876R079Q887Q541Q189P711P125O689O440O110N718N685O018
52172D56145O031N286M321L845L744L513L227L304L616L694L572L653L803L464
52158E11218K722K435L017L860M263M329M552M958N220N264N379N701N945N682
52144E74545M823L790L128K876K518J723Q22K96L5l93r98j476j912k647l534m044
$$ plain form
52128 579552 575376 570840 565610 560055 554879 550042 544800 538917 533173 528384 524500 521007 517723 514763
52114 514763 512067 509509 507292 505768 504877 504142 503247 502296 501432 500508 499259 497579 495496 493034 490282 487463
52098 487463 484723 481833 478334 474064 469409 464862 460393 455444 449570 442976 436320 430077 424175 418178
52084 418178 411762 405089 398807 393606 389643 386399 383153 379631 376136 373173 371104 370145 370474 372183 375148
52069 375148 379058 383630 388757 394415 400464 406702 413177 420263 428218 436728 445176 453349 461480 469505
52055 469505 476701 482454 487093 491488 495938 499952 503103 505564 507622 509173 510044 510490 510928 511344 511335 510731
52039 510731 509821 508976 508313 507817 507551 507646 508247 509571 511825 514932 518518 522344 526680 531998 538328 545123
52023 545123 551834 558401 565053 571747 578087 583774 588941 593922 598780 603138 606483 608598 609723 610275
$$ packed form
52128E79552m176m536n230n555n176m837n242n883n744m789l884l493l284k960
52114E14763k696k558k217j524q91p35q95r51q64r24j249j680k083k462k752k819
52098D87463k740k890l499m270m655m547m469m949n874o594o656o243n902n997
52084D18178o416o673o282n201l963l244l246l522l495k963k069r59L29J709K965
52069C75148L910M572N127N658O049O238O475P086P955Q510Q448Q173Q131Q025
52055D69505P196N753M639M395M450M014L151K461K058J551Q71M46M38M16ro04
52039E10731r10q45o63m96k66R5O01J324K254L107L586L826M336N318O330O795
52023E45123O711O567O652O694O340N687N167M981M858M358L345K115J125N52
$$ plain form
52009 610275 610397 609846 608361 606033 603048 599130 593592 586167 577625 569202 561456 553920 545856 537133 528257
51994 528257 519743 511641 503641 495538 487584 480379 474457 469987 466875 464989 464134 463883 463733 463497 463427 463825
51978 463825 464656 465600 466371 466854 467016 466850 466411 465740 464689 462858 459795 455322 449650 443144 435966 428045
51962 428045 419430 410500 401626 392675 383082 372469 361012 349026 336407 322724 307878 292472
51950 292472 277366 262990 249238 236019 223696 212720 202966 193753 184666 176027 168275 161146 153972
51937 153972 146720 140174 134877 130379 125877 121296 117290 114324 112143 110107 107711 104801 101597 98592
51923 98592 96199 94444 93132 92268 92036 92360 92777 92841 92453 91710 90638 89252 87693 86202 85013 84286 83981
$$ packed form
52009F10275J22n51j485k328k985l918n538p425q542q423p746p536q064q723q876
51994E28257q514q102q000q103p954p205n922m470l112j886q55k51j50k36p0L98
51978D63825Q31R44P71M83J62j66m39o71j051j831l063m473n672o506p178p921
51962D28045q615q930q874q951r593j0613j1457j1986j2619j3683j4846j5406
51950B92472j5106j4376j3752j3219j2323j0976r754r213r087q639p752p129p174
51937A53972p252o546n297m498m502m581m006k966k181k036k396k910l204l005
51923I8592k393j755j312q64k32L24M17O4l88p43j072j386j559j491j189p27l05
$$ [...]
##END NTUPLES=NMR SPECTRUM
##END=
