
##TITLE=UV1100_M1_1161-1249_7180255_cBvFuq06ZW
##JCAMPDX= 6.0         $$ Bruker NMR JCAMP-DX V2.0
##DATA TYPE= NMR SPECTRUM
##DATA CLASS= NTUPLES
##ORIGIN= BRUKER
##OWNER= Administrator
$$ 1.72 TOPSPIN		Version 2.1
$$ 2012-12-05 02:05:47.681 -0500  Administrator@X
$$ Compression mode = diff/dup
##.OBSERVE FREQUENCY= 400.02188249412
##.OBSERVE NUCLEUS= ^1H
##.ACQUISITION MODE= SIMULTANEOUS (DQD)
##.ACQUISITION SCHEME= undefined
##.AVERAGES= 64
##.DIGITISER RES= 22
##SPECTROMETER/DATA SYSTEM= spect
##.PULSE SEQUENCE= noesygpps1d.comp
##.SOLVENT NAME= COFFEE_meoh
##.SHIFT REFERENCE= INTERNAL, COFFEE_meoh, 1, 14.96102
##AUDIT TRAIL= $$ (NUMBER, WHEN, WHO, WHERE, PROCESS, VERSION, WHAT)
$$ ##TITLE= Audit trail, TOPSPIN		Version 2.1
$$ ##JCAMPDX= 5.01
$$ ##ORIGIN= Bruker BioSpin GmbH
$$ ##OWNER= Administrator
$$ $$ E:\/data/COFFEE/nmr/UV1100_M1_1161-1249_7180255_cBvFuq06ZW/12/pdata/1/auditp.txt
$$ ##AUDIT TRAIL=  $$ (NUMBER, WHEN, WHO, WHERE, PROCESS, VERSION, WHAT)
(   1,<2012-12-05 02:05:41.696 -0500>,<Administrator>,<X>,<go>,<TOPSPIN 2.1>,
      <created by zg
	started at 2012-12-05 01:54:11.899 -0500,
	POWCHK enabled, PULCHK disabled,
       configuration hash MD5:
       86 BA 57 50 F2 9D 5C 9B 26 00 A9 28 5F 66 2E 89
       data hash MD5: 64K
       53 E2 17 85 2E 04 B3 4C A0 6A DB 54 31 5E 52 5F>)
(   2,<2012-12-05 02:05:44.852 -0500>,<Administrator>,<X>,<proc1d>,<TOPSPIN 2.1>,
      <Start of raw data processing
       efp LB = 0.3 FT_mod = 6 PKNL = 1 PHC0 = 0 PHC1 = 0 SI = 128K 
       data hash MD5: 128K
       AE EF F3 19 BE DB FE 1E 7F 61 B6 D3 FD AE 80 77>)
(   3,<2012-12-05 02:05:45.899 -0500>,<Administrator>,<X>,<proc1d>,<TOPSPIN 2.1>,
      <pk PHC0 = -80.06836 PHC1 = 0 
       data hash MD5: 128K
       5D DB 50 FA 00 B9 BC 1C CB BD E0 01 81 A7 73 4C>)
(   4,<2012-12-05 02:05:46.587 -0500>,<Administrator>,<X>,<proc1d>,<TOPSPIN 2.1>,
      <abs ABSG = 1 
       data hash MD5: 128K
       A6 96 30 C1 CD 85 16 6E E3 43 78 DE C7 84 1B C5>)
(   5,<2012-12-05 02:05:46.759 -0500>,<Administrator>,<X>,<proc1d>,<TOPSPIN 2.1>,
      <abs ABSG = 2 
       data hash MD5: 128K
       E8 86 FD 87 DC F0 6F BE 9B 3A 3F 5B 0F 4E 5C 0A>)
(   6,<2012-12-05 02:05:46.946 -0500>,<Administrator>,<X>,<proc1d>,<TOPSPIN 2.1>,
      <abs ABSG = 3 
       data hash MD5: 128K
       6B B0 E2 12 48 82 9C AE 6F 82 C7 79 A1 CB 56 13>)
(   7,<2012-12-05 02:05:47.134 -0500>,<Administrator>,<X>,<proc1d>,<TOPSPIN 2.1>,
      <abs ABSG = 4 
       data hash MD5: 128K
       9B C1 9A A7 3D 8D D1 15 49 52 E6 D6 C2 DD 49 85>)
(   8,<2012-12-05 02:05:47.321 -0500>,<Administrator>,<X>,<proc1d>,<TOPSPIN 2.1>,
      <abs ABSG = 5 
       data hash MD5: 128K
       D1 E3 B6 8F E8 01 1F 60 80 E8 9D 13 C0 AE 87 7F>)
$$ ##END=
$$ 
$$ $$ hash MD5
$$ $$ D9 C2 BD EF 41 88 19 75 80 88 78 82 44 C7 AC 84
##$RELAX= 
##$RELAX= 
##$RELAX= 
##$RELAX= 
##$RELAX= 
##$RELAX= 
##$RELAX= 
##$RELAX= 
$$ Bruker specific parameters
$$ --------------------------
##$DU= <E:\>
##$EXPNO= 12
$$ [...]
##$TP07= 0
##$TPNAME0= <>
##$TPNAME1= <>
##$TPNAME2= <>
##$TPNAME3= <>
##$TPNAME4= <>
##$TPNAME5= <>
##$TPNAME6= <>
##$TPNAME7= <>
##$TPOAL= (0..7)
0.5 0.5 0.5 0.5 0.5 0.5 0.5 0.5
##$TPOFFS= (0..7)
0 0 0 0 0 0 0 0
##$TUNHIN= 0
##$TUNHOUT= 0
##$TUNXOUT= 0
##$USERA1= <user>
##$USERA2= <user>
##$USERA3= <user>
##$USERA4= <user>
##$USERA5= <user>
##$V9= 5
##$VALIST= <valist>
##$VCLIST= <CCCCCCCCCCCCCCC>
##$VD= 0
##$VDLIST= <DDDDDDDDDDDDDDD>
##$VPLIST= <PPPPPPPPPPPPPPP>
##$VTLIST= <TTTTTTTTTTTTTTT>
##$WBST= 2048
##$WBSW= 25
##$XGAIN= (0..3)
0 0 0 0
##$XL= 0
##$YL= 0
##$YMAX_a= 6048768
##$YMIN_a= -12792542
##$ZGOPTNS= <>
##$ZL1= 120
##$ZL2= 120
##$ZL3= 120
##$ZL4= 120
##$ABSF1= 14.96102
##$ABSF2= -5.597161
##$ABSG= 5
##$ABSL= 3
##$ALPHA= 0
##$AQORDER= 0
##$ASSFAC= 0
##$ASSFACI= 0
##$ASSFACX= 0
##$ASSWID= 0
##$AUNMP= <proc_prof1d_extract.lims>
##$AXLEFT= 0
##$AXNAME= <>
##$AXNUC= <1H>
##$AXRIGHT= 0
##$AXTYPE= 0
##$AXUNIT= <>
##$AZFE= 0.1
##$AZFW= 0.1
##$BCFW= 0
##$BC_mod= 0
##$BYTORDP= 0
##$COROFFS= 0
##$CY= 15
##$DATMOD= 1
##$DC= 0
##$DFILT= <>
##$DTYPP= 0
##$F1P= 0
##$F2P= 0
##$FCOR= 0.5
##$FTSIZE= 131072
##$FT_mod= 6
##$GAMMA= 0
##$GB= 0
##$INTBC= 1
##$INTSCL= 1
##$ISEN= 128
##$LB= 0.3
##$LEV0= 0
##$LPBIN= 0
##$MAXI= 10000
##$MC2= 0
##$MEAN= 0
##$ME_mod= 0
##$MI= 0
##$NCOEF= 0
##$NC_proc= -2
##$NLEV= 6
##$NOISF1= 0
##$NOISF2= 0
##$NSP= 0
##$NTH_PI= 0
##$NZP= 0
##$OFFSET= 14.96102
##$PC= 1
##$PHC0= -80.06836
##$PHC1= 0
##$PH_mod= 1
##$PKNL= yes
##$PPARMOD= 0
##$PPDIAG= 0
##$PPIPTYP= 0
##$PPMPNUM= 2147483647
##$PPRESOL= 1
##$PSCAL= 4
##$PSIGN= 0
##$PYNMP= <proc.py>
##$REVERSE= no
##$SF= 400.020009630362
##$SI= 131072
##$SIGF1= 0
##$SIGF2= 0
##$SINO= 400
##$SIOLD= 131072
##$SPECTYP= <>
##$SREGLST= <1H.CDCl3>
##$SSB= 0
##$STSI= 131072
##$STSR= 0
##$SW_p= 8223.68421052631
##$SYMM= 0
##$S_DEV= 0
##$TDeff= 65536
##$TDoff= 0
##$TI= <>
##$TILT= no
##$TM1= 0
##$TM2= 0
##$TOPLEV= 0
##$USERP1= <user>
##$USERP2= <user>
##$USERP3= <user>
##$USERP4= <user>
##$USERP5= <user>
##$WDW= 1
##$XDIM= 131072
##$YMAX_p= 431603168
##$YMIN_p= -13752
##$CURPLOT= <Network HP LaserJet P1505>
##$CURPRIN= <$Network HP LaserJet P1505>
##$DFORMAT= <normdp>
##$LAYOUT= <+/1D_H.xwp>
##$LFORMAT= <normlp>
##$PFORMAT= <normpl>
##$SURQMSG= 1
$$ End of Bruker specific parameters
$$ ---------------------------------
##NTUPLES= NMR SPECTRUM
##VAR_NAME=  FREQUENCY,     SPECTRUM/REAL,   SPECTRUM/IMAG
##SYMBOL=    X,             R,               I
##VAR_TYPE=  INDEPENDENT,   DEPENDENT,       DEPENDENT
##VAR_FORM=  AFFN,          ASDF,            ASDF
##VAR_DIM=   131072,        131072,          131072
##UNITS=     HZ,            ARBITRARY UNITS, ARBITRARY UNITS
##FACTOR=    0.0627417313425164, 1,          1
##FIRST=     8223.62146879497, 252,          -65290
##LAST=      0,             2830,            -64935
##MIN=       0,             -13752,          0
##MAX=       8223.62146879497, 431603168,    0
$$ Real data points
##PAGE= N=1
##DATA TABLE= (X++(R..R)), XYDATA
$$ [...]
$$ plain form
63950 941223 1009990 1088174 1176737 1276713 1389235 1515125 1654734 1808368 1976507 2159139
63940 2159139 2354879 2561033 2774560 2992721 3212736 3431089 3643273 3844005 4027550
63931 4027550 4188227 4321270 4423652 4494112 4532253 4537599 4509472 4447693 4353291 4228604 4076929
63920 4076929 3902241 3709229 3503314 3290246 3075200 2862007 2653213 2450965 2257800
63911 2257800 2076484 1909203 1757102 1620509 1499189 1392211 1297986 1214877 1141751 1077733
63901 1077733 1021631 972070 928177 889754 856638 828182 803425 781475 761557 743054 725709
63890 725709 709573 694494 679882 665202 650517 636322 623080 611251 601498 594320 589547 586695
63878 586695 585834 587529 591801 597774 604824 613619 625416 640511 657886 676348 695478 715461 736570
$$ packed form
63950I41223O8767P8184Q8563R9976J12522J25890J39609J53634J68139J82632
63940B159139J95740K06154K13527K18161K20015K18353K12184K00732J83545
63931D027550J60677J33043J02382P0460L8141N346k8127o1779r4402j24687j51675
63920D076929j74688j93012k05915k13068k15046k13193k08794k02248j93165
63911B257800j81316j67281j52101j36593j21320j06978r4225q3109p3126o4018
63901A077733n6102m9561m3893l8423l3116k8456k4757k1950j9918j8503j7345
63890G25709j6136j5079j4612j4680j4685j4195j3242j1829r753p178m773k852
63878E86695q61J695M272N973P050Q795J1797J5095J7375J8462J9130J9983K1109
$$ plain form
63865 736570 759026 782813 807233 830926 852758 872517 890438 906331 919665 930319 938625 944540
63853 944540 947356 946511 942316 935517 926398 914564 899561 881474 861071 839406 817108 793925 769240
63840 769240 743114 716405 689684 662585 634667 606483 579082 552785 527212 502413 479107
63829 479107 457703 437846 419244 402213 387034 373393 360942 349855 340256 331568 323083 314862
63817 314862 307382 300476 293375 285839 278643 272757 268480 265470 263194 261225 259406 257899 256839 255973
63803 255973 254931 253785 252938 252391 251596 250162 248242 246036 243346 240009 236427 233252 230740 228742 227172
63788 227172 226063 225230 224236 222732 220677 218251 215794 213757 212401 211456 210295 208529 206406 204622 203782
63773 203782 203927 204454 204545 203919 203116 202887 203305 203663 203247 202034 200654 199844 199932 200614 201161 201071 200636 200675 201601
$$ packed form
63865G36570K2456K3787K4420K3693K1832J9759J7921J5893J3334J0654Q306N915
63853I44540K816q45m195o799r119j1834j5003j8087k0403k1665k2298k3183k4685
63840G69240k6126k6709k6721k7099k7918k8184k7401k6297k5573k4799k3306
63829D79107k1404j9857j8602j7031j5179j3641j2451j1087r599q688q485q221
63817C14862p480o906p101p536p196n886m277l010k276j969j819j507j060q66
63803B55973j042j146q47n47p95j434j920k206k690l337l582l175k512j998j570
63788B27172j109q33r94j504k055k426k457k037j356r45j161j766k123j784q40
63773B03782J45N27R1o26q03k29M18L58m16j213j380q10Q8O82N47r0m35L9R26
$$ plain form
63754 201601 202871 203492 202973 201727 200725 200827 202188 204108 205594 206271 206653 207403 208567 209789 211019 212542
63738 212542 214406 216294 218049 219914 222074 224368 226675 229211 232098 234874 236833 237788 238243 238976 240712
63723 240712 243977 248787 254428 259927 264824 269270 273430 277123 280079 282106 282948 282403 280823 279085 277705
63708 277705 276256 273969 270723 267117 263793 261099 259283 258535 258687 259222 259713 260116 260653 261571 263077 265238
63692 265238 267897 270830 274007 277485 281092 284533 287894 291642 295898 299964 302912 304461 304997 304860 304091
63677 304091 302938 302145 302317 303118 303471 302630 300871 299078 297871 297351 297456 298174 299342 300553 301485 302099 302325
63660 302325 301776 300115 297600 294882 292252 289445 286234 282807 279348 275681 271732 268060 265431 263898
63646 263898 262786 261644 260773 260627 261099 261728 262381 263346 264845 266758 268849 270983 273121 275337 277929 281318
$$ packed form
63754B01601J270O21n19j246j002J02J361J920J486O77L82P50J164J222J230J523
63738B12542J864J888J755J865K160K294K307K536K887K776J959R55M55P33J736
63723B40712L265M810N641N499M897M446M160L693K956K027Q42n45j580j738j380
63708B77705j449k287l246l606l324k694j816p48J52N35M91M03N37R18J506K161
63692B65238K659K933L177L478L607L441L361L748M256M066K948J549N36j37p69
63677C04091j153p93J72Q01L53q41j759j793j207n20J05P18J168J211R32O14K26
63660C02325n49j661k515k718k630k807l211l427l459l667l949l672k629j533
63646B63898j112j142q71j46M72O29O53R65J499J913K091K134K138K216K592L389
$$ plain form
63630 281318 285716 290992 296904 303331 310196 317343 324648 332180 340187 348989 358909 370173 382818 396851
63616 396851 412474 429924 449003 469095 489897 511881 535778 561883 590172 620727 653377
63605 653377 686977 719679 750044 777357 800732 818632 829827 834499 834003 829840 823225 815299 807067
63592 807067 798989 790894 782298 772580 761058 747277 731192 712837 691920 668124 641826 614289
63580 614289 587183 562055 539956 521058 504667 490014 477024 465968 456682 448776 442619 439245
63568 439245 438911 440398 442277 444440 447897 453418 460964 470215 480932 492661 504671 516441 528025
63555 528025 539845 552423 566436 582761 602140 624817 650641 679533 711780 747795 787505
63544 787505 829803 872317 911636 943997 966378 977573 978442 971180 958344 942488 926129 911219
$$ packed form
63630B81318M398N276N912O427O865P147P305P532Q007Q802R920J1264J2645J4033
63616C96851J5623J7450J9079K0092K0802K1984K3897K6105K8289L0555L2650
63605F53377L3600L2702L0365K7313K3375J7900J1195M672m96m163o615p926q232
63592H07067q078q095q596r718j1522j3781j6085j8355k0917k3796k6298k7537
63580F14289k7106k5128k2099j8898j6391j4653j2990j1056r286p906o157l374
63568D39245l34J487J879K163L457N521P546R251J0717J1729J2010J1770J1584
63555E28025J1820J2578J4013J6325J9379K2677K5824K8892L2247L6015L9710
63544G87505M2298M2514L9319L2361K2381J1195Q69p262j2836j5856j6359j4910
$$ plain form
63532 911219 898482 887595 878182 870168 863025 855197 844781 830598 812284 789674 762729 732103
63520 732103 699306 666051 633538 602312 572534 544276 517712 493086 470492 449804 430954
63509 430954 414123 399483 386865 375847 366033 357068 348601 340574 333423 327602 322933 318761 314745
63496 314745 311196 308596 307098 306513 306546 307016 308033 309808 312023 313630 313822 313124 312938 313933 315523 317097
63480 317097 318986 321770 325242 328773 332380 336667 341745 346766 350639 352827 353397 352700 351111 348822 345717
63465 345717 341588 336522 330956 325365 320015 315030 310606 307141 305118 304690 305292 305938 306099 306155 306829 308522
63449 308522 311473 316097 322504 329775 336513 342379 348563 356520 366653 378547 392006 407293 424615
63436 424615 444010 465826 490754 519002 549512 580171 608712 633337 652743 666138 673738 677235
$$ packed form
63532I11219j2737j0887r413q014p143p828j0416j4183j8314k2610k6945l0626
63520G32103l2797l3255l2513l1226k9778k8258k6564k4626k2594k0688j8850
63509D30954j6831j4640j2618j1018r814q965q467q027p151n821m669m172m016
63496C14745l549k600j498n85L3M70J017J775K215J607J92o98j86R95J590J574
63480C17097J889K784L472L531L607M287N078N021L873K188N70o97j589k289l105
63465C45717m129n066n566n591n350m985m424l465k023m28O02O46J61N6O74J693
63449C08522K951M624O407P271O738N866O184P957J0133J1894J3459J5287J7322
63436D24615J9395K1816K4928K8248L0510L0659K8541K4625J9406J3395P600L497
$$ plain form
63424 677235 679423 683028 689802 700610 715944 736036 760689 789448 822010 858133 897062 937239
63412 937239 976596 1012874 1043706 1066960 1081452 1087359 1085914 1078862 1068204 1055898 1043305 1030901
63400 1030901 1018649 1006349 993386 978411 959882 936990 909850 878906 844647 808009 770576
63389 770576 733989 699202 666448 635774 607404 581649 558696 538538 521052 506146 493860
63378 493860 484326 477537 473153 470602 469480 469868 472193 476691 483058 490777 499717 510202 522460 536315
63364 536315 551674 569097 589491 613252 639947 668890 699722 732363 766663 802331 839060
63353 839060 876441 913687 949515 982299 1010320 1031980 1046110 1052400 1051698 1045775 1036509 1025126
63341 1025126 1012204 998281 984146 970335 956480 941342 923474 901797 875864 845975 813069
$$ packed form
63424F77235K188L605O774J0808J5334K0092K4653K8759L2562L6123L8929M0177
63412I37239L9357L6278L0832K3254J4492N907j445p052j0658j2306j2593j2404
63400A030901j2252j2300j2963j4975j8529k2892k7140l0944l4259l6638l7433
63389G70576l6587l4787l2754l0674k8370k5755k2953k0158j7486j4906j2286
63378D93860r534o789m384k551j122L88K325M498O367P719Q940J0485J2258J3855
63364E36315J5359J7423K0394K3761K6695K8943L0832L2641L4300L5668L6729
63353H39060L7381L7246L5828L2784K8021K1660J4130O290p02n923r266j1383
63341A025126j2922j3923j4135j3811j3855j5138j7868k1677k5933k9889l2906
$$ plain form
63330 813069 778321 742852 707959 675246 645974 620277 597598 577999 562474 551637 544623 539811
63318 539811 536168 533118 529223 521994 509620 492667 473664 455097 437971 422070 407093 393214
63306 393214 380762 369769 360116 351949 345649 341257 338159 335521 332886 330247 327669 325171 322883 321009
63292 321009 319461 317740 315364 312370 309282 306592 304326 302164 299901 297683 295746 294082 292545 291222
63278 291222 290433 290317 290623 291009 291277 291240 290692 289839 289385 289798 290625 291075 291180 291845 293614 295926 297790 298868
63260 298868 299622 300735 302654 305432 308765 312320 316191 320709 325667 330158 333585 336499 339924 344200
63246 344200 349084 354738 361742 370061 378835 387549 396762 407246 419004 431735 445732 461522 478881
63233 478881 497083 516129 536871 559612 583281 606484 628905 651173 673678 696115 718012
$$ packed form
63330H13069l4748l5469l4893l2713k9272k5697k2679j9599j5525j0837p014m812
63318E39811l643l050l895p229j2374j6953j9003j8567j7126j5901j4977j3879
63306C93214j2452j0993r653q167o300m392l098k638k635k639k578k498k288j874
63292C21009j548j721k376k994l088k690k266k162k263k218j937j664j537j323
63278B91222p89j16L06L86K68l7n48q53m54M13Q27M50J05O65J769K312J864J078
63260B98868P54J113J919K778L333L555L871M518M958M491L427K914L425M276
63246C44200M884N654P004Q319Q774Q714R213J0484J1758J2731J3997J5790J7359
63233D78881J8202J9046K0742K2741K3669K3203K2421K2268K2505K2437K1897
$$ plain form
63222 718012 739185 759646 779536 799252 819270 839696 860195 880471 900526 920250 938989
63211 938989 955689 969380 979378 985144 986089 981578 971110 954778 933606 909224 882937 855218
63199 855218 826245 796782 768261 742100 719180 699887 684194 671609 661495 653806 649273 648511
63187 648511 651060 655744 661990 670413 681930 696692 714108 733575 754659 776695 798809 820517
63175 820517 841904 862983 883333 902719 921750 941380 961746 981825 1000191 1015784 1028046
63164 1028046 1036798 1042090 1043780 1041067 1032763 1018219 997764 972229 942522 909871 875925 841985
63152 841985 808272 774391 740478 707575 676965 649461 625191 603661 583982 565442 547989
63141 547989 532051 517949 505736 495508 487395 481102 475815 470715 465498 460333 455620 451830 449284
$$ packed form
63222G18012K1173K0461J9890J9716K0018K0426K0499K0276K0055J9724J8739
63211I38989J6700J3691R998N766R45m511j0468j6332k1172k4382k6287k7719
63199H55218k8973k9463k8521k6161k2920j9293j5693j2585j0114p689m533p62
63187F48511K549M684O246Q423J1517J4762J7416J9467K1084K2036K2114K1708
63175H20517K1387K1079K0350J9386J9031J9630K0366K0079J8366J5593J2262
63164A028046Q752N292J690k713q304j4544k0455k5535k9707l2651l3946l3940
63152H41985l3713l3881l3913l2903l0610k7504k4270k1530j9679j8540j7453
63141E47989j5938j4102j2213j0228q113o293n287n100n217n165m713l790k546
$$ plain form
63128 449284 447897 447318 447436 448503 450621 453347 456016 458332 460506 462975 466106 470009 474395 478707 482615
63113 482615 486304 490101 493881 497032 499083 500284 501530 503641 506643 509728 512026 513434 514580 516012
63099 516012 517597 518759 519101 518667 517805 516982 516559 516568 516672 516471 515839 514942 514135 513880 514573 516179 518144 519899
63081 519899 521438 523234 525638 528592 531942 535781 540306 545453 550861 556283 561976 568580 576565 585840
63067 585840 596000 606864 618554 631068 644068 657314 671179 686542 704218 724570 747527
63056 747527 772813 800292 830247 863259 899661 939281 981856 1027463 1076138 1127166 1179244
63045 1179244 1231531 1284207 1337768 1392031 1446064 1498932 1550209 1599931 1648446 1696438 1744714
63034 1744714 1793652 1842839 1891349 1938276 1982835 2024011 2060349 2090172 2111850 2123863 2124926
$$ packed form
63128D49284j387n79J18J067K118K726K669K316K174K469L131L903M386M312L908
63113D82615L689L797L780L151K051J201J246K111L002L085K298J408J146J432
63099E16012J585J162L42m34q62q23m23RJ04k01o32q97q07k55O93J606J965J755
63081E19899J539J796K404K954L350L839M525N147N408N422N693O604P985R275
63067E85840J0160J0864J1690J2514J3000J3246J3865J5363J7676K0352K2957
63056G47527K5286K7479K9955L3012L6402L9620M2575M5607M8675N1028N2078
63045A179244N2287N2676N3561N4263N4033N2868N1277M9722M8515M7992M8276
63034A744714M8938M9187M8510M6927M4559M1176L6338K9823K1678J2013J063
$$ plain form
63023 2124926 2114379 2092374 2059486 2016280 1963618 1903316 1838053 1770414 1702311 1635403 1571550
63012 1571550 1512386 1458727 1410916 1369695 1336161 1310824 1293152 1282282 1277828 1279771 1287913 1301779
63000 1301779 1320913 1344878 1373001 1404379 1438198 1473827 1510644 1548008 1585504 1623037 1660578
62989 1660578 1697933 1734801 1770817 1805404 1837765 1867212 1893289 1915248 1931514 1940102 1939731 1930258
62977 1930258 1911904 1884472 1847629 1801714 1747868 1687513 1622167 1553750 1484553 1416542 1350821
62966 1350821 1287875 1228077 1171786 1119219 1070539 1025988 985639 949096 915690 885069 857332
62955 857332 832472 809865 788578 768176 748952 731220 714541 697944 680897 663804 647483
62944 647483 632444 618825 606566 595256 584099 572603 561269 551082 542336 534446 526981 520216
$$ packed form
63023B124926j0547k2005l2888m3206n2662o0302o5263o7639o8103o6908o3853
63012A571550n9164n3659m7811m1221l3534k5337j7672j0870m454J943Q142J3866
63000A301779J9134K3965K8123L1378L3819L5629L6817L7364L7496L7533L7541
62989A660578L7355L6868L6016L4587L2361K9447K6077K1959J6266Q588l71r473
62977A930258j8354k7432l6843m5915n3846o0355o5346o8417o9197o8011o5721
62966A350821o2946n9798n6291n2567m8680m4551m0349l6543l3406l0621k7737
62955H57332k4860k2607k1287k0402j9224j7732j6679j6597j7047j7093j6321
62944F47483j5039j3619j2259j1310j1157j1496j1334j0187q746p890p465o765
$$ plain form
62932 520216 514420 509269 504393 500059 496720 494264 492279 490820 490192 490036 489342 487640 485634 484323 483776
62917 483776 483122 481615 479378 477077 475061 473058 470759 468513 467109 466777 466710 465824 463833 461360 459143
62902 459143 457421 456000 454556 452884 451054 449372 448063 447156 446789 447349 448947 450925 452340 452854 452745
62887 452745 452146 450842 448914 447064 445997 445792 446044 446354 446553 446743 447323 448691 450652 452356 453057 452779
62871 452779 452101 451485 450987 450430 449629 448527 447280 446108 444990 443664 442051 440436 439142 438250 437822 438134
62855 438134 439363 441203 443065 444582 445689 446302 446300 445857 445525 445799 446672 447675 448336 448597 448801 449243 449727
62838 449727 449703 448931 447890 447360 447670 448463 449140 449325 448912 447956 446703 445612 445056 444939 444824 444606 444874 446333
62820 446333 448898 451760 454439 457356 461114 465587 470127 474410 478504 482271 485373 488008 491015 495009
$$ packed form
62932E20216n796n151m876m334l339k456j985j459o28j56o94j702k006j311n47
62917D83776o54j507k237k301k016k003k299k246j404l32o7q86j991k473k217
62902D59143j722j421j444j672j830j682j309r07l67N60J598J978J415N14j09
62887D52745n99j304j928j850j067k05K52L10J99J90N80J368J961J704P01k78
62871D52779o78o16m98n57q01j102j247j172j118j326j613j615j294q92m28L12
62855D38134J229J840J862J517J107O13km43l32K74Q73J003O61K61K04M42M84
62838D49727k4p72j041n30L10P93O77J85m13r56j253j091n56j17j15k18K68J459
62820D46333K565K862K679K917L758M473M540M283M094L767L102K635L007L994
$$ plain form
62806 495009 499753 504623 509270 513653 517916 522619 528683 536564 545670 555069 564634 575085 586945 599923
62792 599923 613396 627267 642286 659728 680694 705463 733553 764553 798859 837455 881079
62781 881079 929899 983883 1043202 1108183 1179112 1256018 1338385 1424966 1514043 1603834 1692469
62770 1692469 1777658 1856770 1927421 1987841 2036575 2072091 2092926 2098250 2088265 2064095 2027230 1978973
62758 1978973 1920409 1852978 1778957 1701086 1621555 1541438 1461145 1381278 1302981 1227639 1156412
62747 1156412 1090019 1028771 972669 921470 874794 832323 793940 759591 728954 701390 676325
62736 676325 653568 633154 614991 598947 585188 574022 565229 557794 550692 543948 538603 535499 534290
62723 534290 533879 533716 534281 536236 539485 543419 547790 552899 558996 566058 574296 584398 596956 611919
$$ packed form
62806D95009M744M870M647M383M263M703O064P881R106R399R565J0451J1860J2978
62792E99923J3473J3871J5019J7442K0966K4769K8090L1000L4306L8596M3624
62781H81079M8820N3984N9319O4981P0929P6906Q2367Q6581Q9077Q9791Q8635
62770A692469Q5189P9112P0651O0420M8734L5516K0835N324r985k4170l6865m8257
62758A978973n8564o7431p4021p7871p9531q0117q0293p9867p8297p5342p1227
62747A156412o6393o1248n6102n1199m6676m2471l8383l4349l0637k7564k5065
62736F76325k2757k0414j8163j6044j3759j1166q793p435p102o744n345l104j209
62723E34290m11j63N65J955L249L934M371N109O097P062Q238J0102J2558J4963
$$ plain form
62709 611919 628885 647665 668336 691036 716144 744454 776779 813394 854167 899152 948754
62698 948754 1003442 1063572 1129307 1200230 1275113 1352598 1432135 1513645 1595976 1676166 1750586
62687 1750586 1816538 1872478 1917130 1948946 1966497 1969015 1956552 1929796 1889786 1837713 1775092
62676 1775092 1704193 1628045 1549596 1470748 1392321 1314856 1239251 1166680 1098217 1034601 976111
62665 976111 922481 873116 827575 785825 748002 714011 683440 655780 630704 608263 588814
62654 588814 572506 558686 546062 533773 522133 511917 502950 493930 483903 473501 464297 457132
62642 457132 451465 446304 441313 436889 433496 431262 430029 429555 429572 429770 429752 429096 427535 425151 422353 419618
62626 419618 417278 415480 414283 413747 413917 414682 415663 416449 417057 417987 419627 421819 424239 427008 430542 434944
$$ packed form
62709F11919J6966J8780K0671K2700K5108K8310L2325L6615M0773M4985M9602
62698I48754N4688O0130O5735P0923P4883P7485P9537Q1510Q2331Q0190P4420
62687A750586O5952N5940M4652L1816J7551K518j2463k6756m0010n2073o2621
62676A775092p0899p6148p8449p8848p8427p7465p5605p2571o8463o3616n8490
62665I76111n3630m9365m5541m1750l7823l3991l0571k7660k5076k2441j9449
62654E88814j6308j3820j2624j2289j1640j0216q967r020j0027j0402r204p165
62642D57132n667n161m991m424l393k234j233m74J7J98j8o56j561k384k798k735
62626D19618k340j798j197n36J70P65R81P86O08R30J640K192K420K769L534M402
$$ plain form
62610 434944 440019 445866 452861 460836 468824 476005 482692 490067 499166 510355 523588 538830 556316
62597 556316 576585 600129 626914 656487 688734 724164 763127 804945 848168 891476 933958
62586 933958 974693 1012514 1046179 1074426 1095897 1109460 1114724 1112041 1101927 1084733 1060875 1031184
62574 1031184 996916 959537 920492 880975 841809 803534 766517 731023 697333 665908 637196
62563 637196 611135 587106 564632 543986 525911 510847 498524 488032 478118 467893 457618 448516
62551 448516 441359 435557 430061 424798 420560 417739 415951 414900 414805 415781 417417 419234 421056 422739 424025
62536 424025 424908 425648 426228 426236 425622 425167 425811 427826 430974 435222 440913 448331 457399 467799 479294 491969
62520 491969 506239 522527 541055 562083 586178 613840 644919 678880 715589 755297 797713
$$ packed form
62610D34944N075N847O995P975P988P181O687P375R099J1189J3233J5242J7486
62597E56316K0269K3544K6785K9573L2247L5430L8963M1818M3223M3308M2482
62586I33958M0735L7821L3665K8247K1471J3563N264k683j0114j7194k3858k9691
62574A031184l4268l7379l9045l9517l9166l8275l7017l5494l3690l1425k8712
62563F37196k6061k4029k2474k0646j8075j5064j2323j0492r914j0225j0275r102
62551D48516p157n802n496n263m238k821j788j051r5R76J636J817J822J683J286
62536D24025Q83P40N80Qo14m55O44K015L148M248N691P418R068J0400J1495J2675
62520D91969J4270J6288J8528K1028K4095K7662L1079L3961L6709L9708M2416
$$ plain form
62509 797713 841740 886381 931361 976492 1020843 1062936 1101294 1134421 1160689 1178923 1188984
62498 1188984 1191314 1186065 1173210 1153455 1128587 1100770 1071706 1042505 1014124 987792 964906 946377
62486 946377 932119 921572 914849 912993 916834 926007 939421 956315 976291 998569 1021809 1044698
62474 1044698 1066200 1085156 1100119 1109853 1113773 1111756 1103680 1089337 1068736 1042352 1011056 975761
62462 975761 937243 896387 854519 813154 773387 735786 700855 669151 640718 614908 591174
62451 591174 569799 551478 536463 524462 515059 507694 501516 495975 491585 489472 489964 492111 494788
62438 494788 497818 501666 506382 511303 515734 519504 522735 525276 526645 526530 525144 522882 519703 515098
62424 515098 508663 500518 491134 481062 470905 461183 451999 443121 434619 427150 421320 416934 413167 409283
$$ packed form
62509G97713M4027M4641M4980M5131M4351M2093L8358L3127K6268J8234J0061
62498A188984K330n249j2855j9755k4868k7817k9064k9201k8381k6332k2886j8529
62486I46377j4258j0547o723j856L841R173J3414J6894J9976K2278K3240K2889
62474A044698K1502J8956J4963R734L920k017q076j4343k0601k6384l1296l5295
62462I75761l8518m0856m1868m1365l9767l7601l4931l1704k8433k5810k3734
62451E91174k1375j8321j5015j2001r403p365o178n541m390k113M92K147K677
62438D94788L030L848M716M921M431L770L231K541J369j15j386k262l179m605
62424E15098o435q145r384j0072j0157r722r184q878q502p469n830m386l767l884
$$ plain form
62410 409283 404993 400391 395880 391976 388899 386511 384830 384175 384469 384838 384548 384009 384156 385038 385812 386130
62394 386130 386657 387997 389861 391676 393454 395567 398073 400738 403467 406273 408999 411456 413863 416848
62380 416848 420996 426484 433114 440540 448477 456758 465278 473985 482964 492425 502463 513002 524121
62367 524121 536264 549887 565092 581921 600827 622441 646950 674163 704200 737730 775510
62356 775510 818030 865564 918050 974758 1034381 1095502 1156538 1215214 1268704 1314604 1351555
62345 1351555 1378968 1396762 1405574 1406556 1400432 1387126 1366685 1340117 1308802 1273410 1234029 1191240
62333 1191240 1146501 1101448 1057264 1014788 974873 938392 905982 877713 852911 830449 809506
62322 809506 790032 772307 756083 740362 723927 705979 686395 665717 644926 624973 606310
$$ packed form
62410D09283m290m602m511l904l077k388j681o55K94L69k90n39J47Q82P74L18
62394C86130N27J340J864J815J778K113K506K665K729K806K726K457K407K985
62380D16848M148N488O630P426P937Q281Q520Q707Q979R461J0038J0539J1119
62367E24121J2143J3623J5205J6829J8906K1614K4509K7213L0037L3530L7780
62356G75510M2520M7534N2486N6708N9623O1121O1036N8676N3490M5900L6951
62345A351555K7413J7794Q812R82o124j3306k0441k6568l1315l5392l9381m2789
62333A191240m4739m5053m4184m2476l9915l6481l2410k8269k4802k2462k0943
62322H09506j9474j7725j6224j5721j6435j7948j9584k0678k0791j9953j8663
$$ plain form
62311 606310 588796 572038 555808 540327 526224 514112 504051 495444 487522 479931 472895 466964
62299 466964 462586 459742 457929 456693 456117 456546 457865 459455 460965 462777 465418 468888 472821 477028 481593
62284 481593 486706 492680 499816 507922 516233 524283 532636 542232 553152 564552 575767 586982 598700
62271 598700 611010 623609 636244 649003 662368 677000 693200 710537 728282 746318 765435
62260 765435 786773 811290 839735 872613 909912 951232 996431 1045823 1099407 1156090 1213921
62249 1213921 1270842 1324829 1373592 1414781 1446815 1469267 1482436 1486781 1482844 1471259 1452445 1426357
62237 1426357 1392841 1352196 1305241 1252995 1196644 1137884 1078883 1021579 967093 915895 868311
62226 868311 824601 784780 748823 717002 689656 666501 646585 629095 613883 600961 589863
$$ packed form
62311F06310j7514j6758j6230j5481j4103j2112j0061q607p922p591p036n931
62299D66964m378k844j813j236n76M29J319J590J510J812K641L470L933M207M565
62284D81593N113N974P136Q106Q311Q050Q353R596J0920J1400J1215J1215J1718
62271E98700J2310J2599J2635J2759J3365J4632J6200J7337J7745J8036J9117
62260G65435K1338K4517K8445L2878L7299M1320M5199M9392N3584N6683N7831
62249A213921N6921N3987M8763M1189L2034K2452J3169M345l937j1585j8814k6088
62237A426357l3516m0645m6955n2246n6351n8760n9001n7304n4486n1198m7584
62226H68311m3710l9821l5957l1821k7346k3155j9916j7490j5212j2922j1098
$$ plain form
62215 589863 579871 570652 562212 554344 546674 539355 533199 528770 525632 522834 519976 517475 515775 514703
62201 514703 513747 512735 511981 511847 512475 513955 516482 520174 524872 530282 536240 542695 549627 557229 566034
62186 566034 576461 588145 600039 611341 622123 632939 644057 655179 665684 674954 682734 689466
62174 689466 696079 703214 710719 718228 726171 735959 749193 766861 789250 816234 847530 882868 922088
62161 922088 964969 1010777 1057953 1104301 1147549 1185808 1217608 1241752 1257447 1264744 1264684 1258709
62149 1258709 1247870 1232702 1213551 1190518 1163114 1130697 1093680 1054024 1014203 975981 940323
62138 940323 907867 878784 852532 828600 807523 790541 778125 769336 762711 757303 752766 748985
62126 748985 745941 743569 741578 739765 738650 739319 742334 747162 752919 759173 765556 771060 774416 775137 773738
$$ packed form
62215E89863r992r219q440p868p670p319o156m429l138k798k858k501j700j072
62201E14703r56j012p54j34O28J480K527L692M698N410N958O455O932P602Q805
62186E66034J0427J1684J1894J1302J0782J0816J1118J1122J0505R270P780O732
62174F89466O613P135P505P509P943R788J3234J7668K2389K6984L1296L5338L9220
62161I22088M2881M5808M7176M6348M3248L8259L1800K4144J5695P297o0n975
62149A258709j0839j5168j9151k3033k7404l2417l7017l9656l9821l8222l5658
62138I40323l2456k9083k6252k3932k1077j6982j2416q789o625n408m537l781
62126G48985l044k372j991j813j115O69L015M828N757O254O383N504L356P21j399
$$ plain form
62111 773738 771044 767745 764545 762015 759969 757258 752466 744725 733939 720658 706005 691454 678302
62098 678302 667268 658658 652721 649606 649044 650329 652705 655727 659309 663566 668676 674753 681693 689174
62084 689174 696916 704986 713756 723523 734221 745632 757843 771315 786427 803124 821156 840531
62072 840531 861462 883884 907311 931264 955640 980530 1005846 1031388 1057130 1083256 1109980
62061 1109980 1137552 1166224 1195812 1225172 1252426 1275813 1294151 1306615 1312689 1312734 1308122 1300179
62049 1300179 1289005 1273727 1253771 1229389 1200948 1168337 1131408 1090737 1047683 1003782 960194
62038 960194 917533 876085 836194 798350 762729 728924 696605 666448 639874 617696 599418
62027 599418 583991 570695 559047 548538 539044 531056 524831 519514 513714 506821 499226 491437 483633
$$ packed form
62111G73738k694l299l200k530k046k711m792p741j0786j3281j4653j4551j3152
62098F78302j1034q610n937l115n62J285K376L022L582M257N110O077O940P481
62084F89174P742Q070Q770R767J0698J1411J2211J3472J5112J6697J8032J9375
62072H40531K0931K2422K3427K3953K4376K4890K5316K5542K5742K6126K6724
62061A109980K7572K8672K9588K9360K7254K3387J8338J2464O074M5m612p943
62049A300179j1174j5278j9956k4382k8441l2611l6929m0671m3054m3901m3588
62038I60194m2661m1448l9891l7844l5621l3805l2319l0157k6574k2178j8278
62027E99418j5427j3296j1648j0509r494p988o225n317n800o893p595p789p804
$$ plain form
62014 483633 476056 469137 463039 457571 452718 448796 445924 443800 442268 441752 442792 445328 448661 452011
62000 452011 455029 457935 461208 464995 468831 472121 474742 476821 478094 478056 476841 475322 474064 472646 470310
61985 470310 466790 462139 456208 448901 440712 432489 424768 417727 411571 406430 401913 397374 392732 388639
61971 388639 385589 383236 380826 378061 375283 372988 371425 370598 370290 369983 369047 367310 365393 364179 363927
61956 363927 364186 364647 365661 367628 370241 372875 375541 378834 382923 387279 391652 396702 403308 411669 421540
61941 421540 432917 445947 460418 475934 492491 510420 529705 549767 569943 589881 609439
61930 609439 628500 646871 664124 679566 692633 703314 711954 718702 723385 725798 725786 723125 717787
61917 717787 710377 701977 693514 685562 678738 673748 670842 669670 670010 672400 677766 686523 698220 711845
$$ packed form
62014D83633p577o919o098n468m853l922k872k124j532n16J040K536L333L350
62000D52011L018K906L273L787L836L290K621K079J273l8j215j519j258j418k336
61985D70310l520m651n931p307q189q223p721p041o156n141m517m539m642m093
61971C88639l050k353k410k765k778k295j563q27l08l07r36j737j917j214k52
61956C63927K59M61J014J967K613K634K666L293M089M356M373N050O606Q361R871
61941D21540J1377J3030J4471J5516J6557J7929J9285K0062K0176J9938J9558
61930F09439J9061J8371J7253J5442J3067J0681Q640O748M683K413j2k661n338
61917G17787p410q400q463p952o824m990k906j172L40K390N366Q757J1697J3625
$$ plain form
61903 711845 726238 740371 753531 765301 775243 782654 786719 786902 783159 775888 765715 753257 739015
61890 739015 723487 707274 690890 674499 658068 641775 626101 611471 598059 585881 574763
61879 574763 564160 553448 542609 532309 523027 514462 506139 498261 491430 485724 480688 476301 473349
61866 473349 472484 473294 474675 476030 477762 480682 485192 491083 497930 505629 514665 525923 540061 556994
61852 556994 576100 597063 620321 646439 675125 705220 735720 766409 797224 827419 855807
61841 855807 881623 904573 924079 939123 949025 953888 953977 949249 939993 927614 914150 901123 889321
61828 889321 879523 872803 869965 871121 875991 884237 895311 908338 922401 936668 949979 960512 966298
61815 966298 966177 960164 948877 932724 911716 886135 857314 827460 798389 770478 743117 716146
$$ packed form
61903G11845J4393J4133J3160J1770R942P411M065J83l743p271j0173j2458j4242
61890G39015j5528j6213j6384j6391j6431j6293j5674j4630j3412j2178j1118
61879E74763j0603j0712j0839j0300r282q565q323p878o831n706n036m387k952
61866D73349q65Q10J381J355J732K920M510N891O847P699R036J1258J4138J6933
61852E56994J9106K0963K3258K6118K8686L0095L0500L0689L0815L0195K8388
61841H55807K5816K2950J9506J5044R902M863Q9m728r256j2379j3464j3027j1802
61828H89321r798o720k838J156M870Q246J1074J3027J4063J4267J3311J0533N786
61815I66298j21o013j1287j6153k1008k5581k8821k9854k9071k7911k7361k6971
$$ plain form
61803 716146 690441 667057 646216 627380 609952 593619 578309 564206 551663 540811 531337 522934
61791 522934 515697 509695 504400 499101 493853 489404 486004 482885 479250 475325 471907 469165 466493 463518
61777 463518 460629 458303 456335 454147 451622 449257 447509 446393 445772 445679 446095 446663 446961 446991 447049 447167 447054
61760 447054 446682 446508 446918 447774 448820 450193 452126 454330 456205 457569 458713 459720 460238 460063 459454 458648
61744 458648 457456 455650 453427 451112 448629 445643 442185 438898 436663 436110 437263 439449 441670 443346
61730 443346 444646 445951 447167 447847 447886 447777 448185 449455 451422 453479 454941 455671 456362 457920 460525 463485
61714 463485 465933 467465 468150 468327 468445 468838 469453 469899 469687 468272 465105 460131 454238 448699 443987 439520
61698 439520 434731 429902 425639 421959 418387 414682 410978 407333 403620 399875 396353 393171 390198 387345
$$ packed form
61803G16146k5705k3384k0841j8836j7428j6333j5310j4103j2543j0852r474q403
61791E22934p237o002n295n299n248m449l400l119l635l925l418k742k672k975
61777D63518k889k326j968k188k525k365j748j116o21r3M16N68K98L0N8J18j13
61760D47054l72j74M10Q56J046J373J933K204J875J364J144J007N18j75o09q06
61744D58648j192j806k223k315k483k986l458l287k235n53J153K186K221J676
61730D43346J300J305J216O80L9j09M08J270J967K057J462P30O91J558K605K960
61714D63485K448J532O85J77J18L93O15M46k12j415l167m974n893n539m712m467
61698D39520m789m829m263l680l572l705l704l645l713l745l522l182k973k853
$$ plain form
61684 387345 384699 382329 380214 378388 376837 375230 373094 370467 368039 366368 365122 363403 360771 357748
61670 357748 355356 354304 354515 355253 355718 355742 355936 357011 358978 361174 363017 364428 365480 366010 365868 365292
61654 365292 364688 364193 363781 363710 364419 365918 367656 369176 370569 372080 373626 375059 376690 379116 382554 386635
61638 386635 390875 395032 398927 402148 404092 404303 402824 400267 397348 394203 390303 385276 379659 374519
61624 374519 370432 367214 364552 362415 360752 359284 357881 356830 356432 356531 356638 356398 355733 354707 353388 351744
61608 351744 349589 346836 343888 341453 339705 337830 334726 330120 324853 320132 316578 313834 310995 307572
61594 307572 304107 301620 300350 299391 297773 295500 293232 291329 289713 288436 287765 287712 287945 288181 288305 288112
61578 288112 287407 286389 285523 284856 283871 282168 279990 277928 276444 275874 276485 278131 280014 281168 281205 280525
$$ packed form
61684C87345k646k370k115j826j551j607k136k627k428j671j246j719k632l023
61670C57748k392j052K11P38M65K4J94J075J967K196J843J411J052N30j42n76
61654C65292o04m95m12p1P09J499J738J520J393J511J546J433J631K426L438M081
61638C86635M240M157L895L221J944K11j479k557k919l145l900n027n617n140
61624C74519m087l218k662k137j663j468j403j051l98R9J07k40o65j026j319j644
61608C51744k155k753k948k435j748j875l104m606n267m721l554k744k839l423
61594C07572l465k487j270r59j618k273k268j903j616j277o71n3K33K36J24j93
61578B88112p05j018q66o67r85j703k178k062j484n70O11J646J883J154L7o80
$$ plain form
61562 280525 279923 280050 280988 282024 282084 280772 278986 278150 278782 280122 281232 282082 283286 285070 286961 288488
61546 288488 289776 291266 293122 295135 296997 298477 299473 300180 301087 302493 304086 305320 306141 306903 307573 307596
61530 307596 306801 305926 305824 306491 307325 308013 308582 308793 308198 306905 305745 305366 305491 305275 304187 302421 300601
61513 300601 299230 298315 297521 296737 296326 296616 297343 297981 298521 299404 300694 301817 302275 302147 301636 300559 298698
61496 298698 296430 294631 293947 294290 294969 295262 295069 295056 295920 297479 298802 299309 299331 299435 299710 300067 300763 302055
61478 302055 303659 305127 306619 308633 311012 312853 313565 313515 313361 313266 313036 312693 312446 312299 312110 311996 312310
61461 312310 313131 314029 314449 314208 313525 312739 312128 311898 312120 312612 313041 313217 313269 313439 313764 314061 314222 314428 315010
61442 315010 316123 317538 318777 319492 319783 320105 320833 322074 323908 326554 329980 333536 336388 338370 340065
$$ packed form
61562B80525o02J27R38J036O0j312j786q36O32J340J110Q50J204J784J891J527
61546B88488J288J490J856K013J862J480R96P07R07J406J593J234Q21P62O70K3
61530C07596p95q75j02O67Q34O88N69K11n95j293j160l79J25k16j088j766j820
61513C00601j371r15p94p84m11K90P27O38N40Q83J290J123M58j28n11j077j861
61496B98698k268j799o84L43O79K93j93j3Q64J559J323N07K2J04K75L57O96J292
61478C02055J604J468J492K014K379J841P12n0j54r5k30l43k47j47j89j14L14
61461C12310Q21Q98M20k41o83p86o11k30K22M92M29J76N2J70L25K97J61K06N82
61442C15010J113J415J239P15K91L22P28J241J834K646L426L556K852J982J695
$$ plain form
61427 340065 341987 344081 346177 348417 350795 352653 353257 352855 352631 353462 355177 357201 359434 362040 364635
61412 364635 366351 366823 366617 366439 366259 365640 364689 364064 363987 363792 362732 360821 358536 356065 353338 350591 348307
61395 348307 346604 345138 343652 342249 341148 340595 340950 342254 343647 343906 342871 341771 341786 342792 343992
61380 343992 345209 346846 348894 350777 352176 353407 354809 356253 357369 358019 358471 359288 360941 363277 365576
61365 365576 367449 369425 372196 375458 378173 379975 381644 384003 386975 390074 393315 397132 401708 406884
61351 406884 412641 419249 426876 435235 443641 451336 457870 463322 468108 472495 476350 479441 481820 483802
61337 483802 485658 487468 489161 490537 491266 491092 490170 489092 488349 487668 486064 482842 478465 474131 470491
61322 470491 467197 463835 460708 458315 456560 455178 454625 455723 458447 461848 465308 469174 473918 479431
$$ packed form
61427C40065J922K094K096K240K378J858O04m02k24Q31J715K024K233K606K595
61412C64635J716M72k06j78j80o19r51o25p7j95j060j911k285k471k727k747k284
61395C48307j703j466j486j403j101n53L55J304J393K59j035j100J5J006J200
61380C43992J217J637K048J883J399J231J402J444J116O50M52Q17J653K336K299
61365C65576J873J976K771L262K715J802J669K359K972L099L241L817M576N176
61351D06884N757O608P627Q359Q406P695O534N452M786M387L855L091K379J982
61337D83802J856J810J693J376P29j74r22j078p43o81j604l222m377m334l640
61322D70491l294l362l127k393j755j382n53J098K724L401L460L866M744N513
$$ plain form
61308 479431 485570 492817 501827 512697 525149 538983 553781 568436 581623 592619 601228 607153
61296 607153 610120 610607 609715 608100 605483 601494 596518 591339 586160 580445 573742 566368 559071 552165 545242
61281 545242 537879 530398 523676 518267 514114 511105 509428 509082 509534 510356 511949 515010 519312 523542 526445
61266 526445 527797 528238 528569 529383 531057 533792 537786 543324 550533 558977 567743 575987 583296 589599 595044
61251 595044 599891 604193 607537 609444 610025 609837 609027 607174 604191 600808 597749 594859 591505 587524 583217
61236 583217 578647 573574 568071 562695 557923 553863 550555 548201 546950 546774 547621 549428 551936 554895 558532
61221 558532 563362 569346 575619 581388 586749 592285 598187 604256 610561 617522 625213 633019 640159 646301
61207 646301 651550 656087 660012 663430 666520 669529 672727 676317 680419 685200 690991 698225 707310 718617
$$ packed form
61308D79431O139P247R010J0870J2452J3834J4798J4655J3187J0996Q609N925
61296F07153K967M87q92j615k617l989m976n179n179n715o703p374p297o906o923
61281E45242p363p481o722n409m153l009j677l46M52Q22J593L061M302M230K903
61266E26445J352M41L31Q14J674K735L994N538P209Q444Q766Q244P309O303N445
61251E95044M847M302L344J907N81j88q10j853k983l383l059k890l354l981m307
61236E83217m570n073n503n376m772m060l308k354j251j76Q47J807K508K959L637
61221E58532M830N984O273N769N361N536N902O069O305O961P691P806P140O142
61207F46301N249M537L925L418L090L009L198L590M102M781N791P234R085J1307
$$ plain form
61193 718617 732322 747962 764288 779923 794156 806787 817346 825139 830239 833778 836782 839104
61181 839104 840003 839395 837869 835628 832166 827126 820928 814287 807509 800491 793101 785316 777222 769034 760915
61166 760915 752652 743777 734169 724208 714085 703249 690952 677240 663136 649889 638238 628210
61154 628210 619322 611030 603285 596736 592194 589926 589579 590632 592582 594691 595948 595464 592795 587861 580890
61139 580890 572631 564307 556938 550691 545167 540344 536907 535500 535938 537490 539836 543325 548242 554255
61125 554255 560934 568535 577813 589131 602115 616256 631475 647995 665969 685371 705982 727336
61113 727336 748955 770850 793512 817190 841402 865379 888703 911232 932683 952785 971730
61102 971730 989908 1007017 1021711 1032338 1038041 1039184 1036888 1032158 1025303 1016098 1004370 990249 974014
$$ packed form
61193G18617J3705J5640J6326J5635J4233J2631J0559P793N100L539L004K322
61181H39104Q99o08j526k241l462n040o198o641o778p018p390p785q094q188q119
61166G60915q263q875r608r961j0123j0836j2297j3712j4104j3247j1651j0028
61154F28210q888q292p745o549m542k268l47J053J950K109J257m84k669m934o971
61139E80890q259q324p369o247n524m823l437j407M38J552K346L489M917O013
61125E54255O679P601R278J1318J2984J4141J5219J6520J7974J9402K0611K1354
61113G27336K1619K1895K2662K3678K4212K3977K3324K2529K1451K0102J8945
61102I71730J8178J7109J4694J0627N703J143k296m730o855r205j1728j4121j6235
$$ plain form
61089 974014 956173 937810 920248 903883 887770 870901 853587 837022 821831 807858 795187
61078 795187 784338 775272 767150 759513 753002 748394 745514 743724 742969 743663 745829 749046 753227 758851
61064 758851 766340 775627 786369 798274 811113 824724 839171 854716 871521 889393 907882 926713
61052 926713 946171 966976 989596 1013753 1038883 1065020 1092778 1122367 1153097 1184156 1215522
61041 1215522 1247755 1281177 1315622 1350814 1386652 1423156 1460410 1498442 1537069 1576052 1615513
61030 1615513 1655926 1697444 1739506 1781244 1822042 1861658 1900417 1939641 1981426 2027530 2078890
61019 2078890 2136519 2202222 2277746 2363689 2460004 2567475 2688503 2827483 2991590 3190878
61009 3190878 3436758 3740796 4115894 4577884 5144779 5835526 6671710 7679743 8887709
$$ packed form
61089I74014j7841j8363j7562j6365j6113j6869j7314j6565j5191j3973j2671
61078G95187j0849r066q122p637o511m608k880j790p55O94K166L217M181N624
61064G58851P489R287J0742J1905J2839J3611J4447J5545J6805J7872J8489J8831
61052I26713J9458K0805K2620K4157K5130K6137K7758K9589L0730L1059L1366
61041A215522L2233L3422L4445L5192L5838L6504L7254L8032L8627L8983L9461
61030A615513M0413M1518M2062M1738M0798L9616L8759L9224M1785M6104N1360
61019B078890N7629O5703P5524Q5943R6315J07471J21028J38980J64107J99288
61009C190878K45880L04038L75098M61990N66895O90747Q36184J008033J207966
$$ plain form
61000 8887709 10317077 11973599 13833855 15819737 17772986 19467828 20686461 21323711
60992 21323711 21444159 21245808 20963185 20782963 20807288 21041375 21379486 21610372 21481145
60983 21481145 20808470 19565539 17881685 15964539 14011157 12161178 10493402 9039553
60975 9039553 7798796 6751901 5873927 5140902 4530657 4022945 3600720 3250065 2958262
60966 2958262 2712963 2503416 2321375 2160639 2016808 1887625 1772218 1669386 1577244 1494554
60956 1494554 1421181 1356764 1299918 1249286 1204454 1165115 1129956 1097045 1064963 1033187 1001937
60945 1001937 972107 944817 920531 898919 879739 863081 848330 833742 817887 801013 784277
60934 784277 768064 751869 735468 719257 703613 688711 674931 662587 651186 639760 628202
$$ packed form
61000H887709J429368J656522J860256J985882J953249J694842J218633O37250
60992B1323711J20448j98351k82623j80222K4325K34087L38111K30886j29227
60983B1481145o72675j242931j683854j917146j953382j849979j667776j453849
60975I039553j240757j046895q77974p33025o10245n07712m22225l50655k91803
60966B958262k45299k09547j82041j60736j43831j29183j15407j02832r2142q2690
60956A494554p3373o4417n6846n0632m4832l9339l5159l2911l2082l1776l1250
60945A001937k9830k7290k4286k1612j9180j6658j4751j4588j5855j6874j6736
60934G84277j6213j6195j6401j6211j5644j4902j3780j2344j1401j1426j1558
$$ plain form
60923 628202 617658 609209 602577 596499 590068 583457 577528 572980 569793 567352 565151 563287 562061 561215
60909 561215 560034 558306 556734 556052 556030 555781 554971 554255 554420 555372 556269 556533 556467 556775 557627 558391 558217 556690
60891 556690 553889 550049 545400 540304 535273 530685 526458 522077 517030 511163 504613 497473 489726 481511
60877 481511 473218 465138 457300 449878 443523 438832 435586 432968 430590 428823 427975 427672 427394 427224 427668
60862 427668 428960 430957 433565 436802 440399 443743 446381 448436 450393 452470 454290 455305 455659 456416 458556
60847 458556 461755 464613 466202 466927 467682 468769 470046 471545 473158 473999 472973 470036 466234 462384 458349
60832 458349 453829 449208 445146 441691 438343 434840 431469 428559 425940 423065 419630 416012 412985 410906
60818 410906 409266 407236 404577 401807 399444 397410 395217 392455 388988 384947 380747 376869 373415 369991
$$ packed form
60923F28202j0544q449o632o078o431o611n929m548l187k441k201j864j226q46
60909E61215j181j728j572o82k2k49q10p16J65R52Q97K64o6L08Q52P64j74j527
60891E56690k801l840m649n096n031m588m227m381n047n867o550p140p747q215
60877D81511q293q080p838p422o355m691l246k618k378j767q48l03k78j70M44
60862D27668J292J997K608L237L597L344K638K055J957K077J820J015L54P57K140
60847D58556L199K858J589P25P55J087J277J499J613Q41j026k937l802l850m035
60832D58349m520m621m062l455l348l503l371k910k619k875l435l618l027k079
60818D10906j640k030k659k770k363k034k193k762l467m041m200l878l454l424
$$ plain form
60804 369991 366242 362410 359088 356498 354261 351974 349809 348376 347989 348206 348195 347502 346393 345437 344968 345003
60788 345003 345455 346169 346797 346948 346545 345912 345451 345379 345794 346761 348243 350036 351931 353895 356029 358396 360929
60771 360929 363428 365628 367315 368501 369470 370633 372286 374500 377115 379749 381787 382553 381799 380152 378793
60756 378793 378358 378226 377236 375095 372606 370467 368496 366384 364637 364040 364531 365302 366000 367101 368963 371090
60740 371090 372574 372800 371508 368668 364611 359908 354797 349049 342753 336871 332510 329808 328016 326589
60726 326589 325632 325239 324911 323998 322481 320998 320196 320251 320936 321840 322467 322415 321798 321449 322378 324848 328042 330739
60708 330739 332299 332928 333167 333344 333548 333979 335093 337270 340343 343637 346580 349137 351378 352858 352955 351876
60692 351876 350740 350397 350641 350899 351131 351538 351853 351652 351185 351179 351913 353031 354156 355050 355333 354820 354130 354182 355002
$$ packed form
60804C69991l749l832l322k590k237k287k165j433l87K17j1o93j109r56m69L5
60788C45003M52P14O28J51m03o33m61p2M15R67J482J793J895J964K134K367K533
60771C60929K499K200J687J186R69J163J653K214K615K634K038P66p54j647j359
60756C78793m35j32r90k141k489k139j971k112j747n97M91P71O98J101J862K127
60740C71090J484K26j292k840m057m703n111n748o296n882m361k702j792j427
60726C26589r57l93l28r13j517j483q02N5O85R04O27n2o17l49R29K470L194K697
60708C30739J560O29K39J77K04M31J114K177L073L294K943K557K241J480R7j079
60692C51876j136l43K44K58K32M07L15k01m67oP34J118J125Q94K83n13o90N2Q20
$$ plain form
60673 355002 355791 356266 357012 358270 359310 359504 359145 358599 357423 355130 352252 349751 347709 345419 342562 339587
60657 339587 337092 335475 335021 335665 336729 337508 338103 339214 341247 344105 347673 351851 356133 359795 362537
60642 362537 364475 365554 365525 364449 362619 360020 356557 352829 349904 348057 346429 344250 341802 339826 338532
60627 338532 337659 337135 337155 337811 338931 340163 341083 341523 341911 342879 344319 345274 345096 344311 343983 344559 345692 346817
60609 346817 347414 347048 345754 344317 343686 344086 344979 345756 346123 345979 345420 344946 345253 346690 349005 351548 353525
60592 353525 354307 353956 353375 353571 354720 356242 357651 358898 359910 360353 360108 359668 359793 360938 363037 365618
60576 365618 368080 370182 372311 375028 378404 382156 386367 391556 397965 405447 414256 425187 438383 452516
60562 452516 465793 477363 487145 494761 499586 501678 501715 499905 495838 489625 482414 475508 469603 465210
$$ packed form
60673C55002P89M75P46J258J040J94l59n46j176k293k878k501k042k290k857k975
60657C39587k495j617m54O44J064P79N95J111K033K858L568M178M282L662K742
60642C62537J938J079k9j076j830k599l463l728k925j847j628k179k448j976j294
60627C38532q73n24K0O56J120J232R20M40L88R68J440R55j78p85l28N76J133J125
60609C46817N97l66j294j437o31M00Q93P77L67j44n59m74L07J437K315K543J977
60592C53525P82l51n81J96J149J522J409J247J012M43k45m40J25J145K099K581
60576C65618K462K102K129K717L376L752M211N189O409P482Q809J0931J3196J4133
60562D52516J3277J1570R782P616M825K092L7j810m067o213p211o906n905m393
$$ plain form
60548 465210 462943 462773 463656 464668 466188 469317 474444 481101 489018 498547 510089 523789 539807 558255
60534 558255 578624 599709 620222 639100 655252 667664 675934 680265 680734 677201 670179 661161 651543
60521 651543 641615 631096 620305 610152 601127 592968 585429 578891 573979 570853 569118 568329 568422 569698
60507 569698 572450 576703 582394 589753 599291 611351 625981 643559 665314 692796 726641 766001
60495 766001 809236 855037 902825 952242 1002416 1051807 1098677 1141537 1179051 1209587 1231113
60484 1231113 1241611 1239646 1224807 1197913 1160821 1115770 1064817 1009982 953699 898564 846348
60473 846348 797480 751637 708670 668949 633175 601982 575450 552853 533151 515819 500905
60462 500905 488253 477222 467350 458785 451648 445474 439682 434163 428913 423520 417648 411732 406539 402223
$$ packed form
60548D65210k267j70Q83J012J520L129N127O657P917R529J1542J3700J6018J8448
60534E58255K0369K1085K0513J8878J6152J2412Q270M331M69l533p022r018r618
60521F51543r928j0519j0791j0153r025q159p539o538m912l126j735p89R3J276
60507E69698K752M253N691P359R538J2060J4630J7578K1755K7482L3845L9360
60495G66001M3235M5801M7788M9417N0174M9391M6870M2860L7514L0536K1526
60484A231113J0498j965j4839k6894l7092m5051n0953n4835n6283n5135n2216
60473H46348m8868m5843m2967l9721l5774l1193k6532k2597j9702j7332j4914
60462E00905j2652j1031r872q565p137o174n792n519n250n393n872n916n193m316
$$ plain form
60448 402223 398440 395185 392802 391216 389922 388799 388257 388347 388363 387621 386219 384772 383786 383482 383832 384490 384957
60431 384957 384987 384640 383937 382798 381391 380110 379044 377887 376594 375673 375505 375722 375582 374815 373833 373272 373536
60414 373536 374562 375807 376662 377085 377638 378698 379902 380631 380802 380855 381074 381345 381607 382190 383538 385743 388493
60397 388493 391438 394475 397626 400717 403339 405239 406629 407982 409583 411486 413841 416925 420650 424256
60383 424256 426750 427805 428179 429142 431341 434220 436685 438282 439516 441013 442796 444614 446548 448873 451548
60368 451548 454252 456780 459000 460651 461647 462435 463585 465141 466883 469087 472393 476984 482439 488396 494815
60353 494815 501634 508855 516951 526383 536620 546368 554910 562409 568700 572798 574044 572854 569731 564441
60339 564441 556956 548433 540254 532523 524462 515957 507779 500490 494101 488726 484680 481799 479410 477099
$$ packed form
60448D02223l783l255k383j586j294j123n42R0J6p42j402j447r86l04L50O58M67
60431C84957L0l47p03j139j407j281j066j157j293r21j68K17j40p67r82n61K64
60414C73536J026J245Q55M23N53J060J204P29J71N3K19K71K62N83J348K205K750
60397C88493K945L037L151L091K622J900J390J353J601J903K355L084L725L606
60383D24256K494J055L74R63K199K879K465J597J234J497J783J818J934K325K675
60368D51548K704K528K220J651R96P88J150J556J742K204L306M591N455N957O419
60353D94815O819P221Q096R432J0237R748Q542P499O291M098J246j190l123n290
60339E64441p485q523q179p731q061q505q178p289o389n375m046k881k389k311
$$ plain form
60325 477099 474910 472763 470304 467457 464525 461674 458941 456900 456609 458550 462143 466671 472247 479485
60311 479485 488579 499195 511052 524161 538495 553689 569102 584036 597959 610716 622515 633519
60299 633519 643321 650857 654966 655100 651422 644194 633230 618284 599930 579727 559392 540082 522538
60286 522538 507456 495317 486053 479170 474067 470092 466589 463249 460235 457691 455399 453159 451136 449420
60272 449420 447597 445279 442766 440555 438497 436113 433582 431564 430045 428226 425772 423390 421774 420694
60258 420694 419596 418574 418163 418524 419407 420660 422250 423904 425204 426068 426760 427470 428162 428870 429820 431181
60242 431181 432814 434357 435476 436061 436256 436353 436566 436920 437375 438008 438991 440410 442129 443818 445152 446009 446483
60225 446483 446716 446807 446912 447264 447956 448851 449895 451422 453888 457352 461395 465570 469733 473966 478412 483201
$$ packed form
60325D77099k189k147k459k847k932k851k733k041k91J941L593M528N576P238
60311D79485R094J0616J1857J3109J4334J5194J5413J4934J3923J2757J1799J1004
60299F33519R802P536M109J34l678p228j0964j4946j8354k0203k0335j9310j7544
60286E22538j5082j2139r264o883n103l975l503l340l014k544k292k240k023j716
60272D49420j823k318k513k211k058k384k531k018j519j819k454k382j616j080
60258D20694j098j022m11L61Q83J253J590J654J300Q64O92P10O92P08R50J361
60242D31181J633J543J119N85J95R7K13L54M55O33R83J419J719J689J334Q57M74
60225D46483K33R1J05L52O92Q95J044J527K466L464M043M175M163M233M446M789
$$ plain form
60209 483201 488365 493805 499474 505528 512088 518917 525571 531831 537759 543354 548443 552994 557297 561727
60195 561727 566410 571114 575271 578205 579589 579763 579413 578949 578342 577437 576124 574247 571684 568517 564814
60180 564814 560325 554869 549065 544073 540374 537285 534055 531001 529024 528212 527528 525892 523177 520069 517303
60165 517303 515215 513712 512391 510788 508805 506942 505879 505733 505861 505596 505075 505080 506037 507487 508720 509641
60149 509641 510672 511941 512985 513334 513103 512892 513193 514020 515114 516449 518424 521393 525083 528791 532270
60134 532270 536106 541021 547128 554025 561244 568252 574417 579481 583813 587689 590564 591703 591390 590861 591009
60119 591009 591699 592404 592918 593395 594195 595763 598201 600890 603044 604585 605904 606889 606991 606285 605498 604624 602508
60102 602508 598432 593413 589170 586284 584035 581605 578698 575248 571302 567261 563765 561314 560153 560226 560930
$$ packed form
60209D83201N164N440N669O054O560O829O654O260N928N595N089M551M303M430
60195E61727M683M704M157K934J384J74l50m64o07r05j313j877k563l167l703
60180E64814m489n456n804m992l699l089l230l054j977q12o84j636k715l108k766
60165E17303k088j503j321j603j983j863j063j46J28k65n21NR57J450J233R21
60149E09641J031J269J044L49k31k11L01Q27J094J335J975K969L690L708L479
60134E32270L836M915O107O897P219P008O165N064M332L876K875J139l13n29J48
60119E91009O90P05N14M77Q00J568K438K689K154J541J319R85J02p06p87q74k116
60102F02508m076n019m243k886k249k430k907l450l946m041l496k451j161P3P04
$$ plain form
60087 560930 561336 561122 561015 561836 563381 564745 565454 565670 565525 564985 564294 563862 563553 562638 560577 557392 553188
60070 553188 547878 541648 535272 529509 524352 519140 513410 507424 501841 496989 492599 488279 484039 480107
60056 480107 476378 472525 468736 465809 464206 463455 462826 462270 462215 462852 464147 466292 469480 473312 477051 480450
60040 480450 483820 487295 490652 493920 497543 501688 505866 509460 512246 514173 515061 514870 513956 512684 510916
60025 510916 508167 504207 499310 494021 488781 483644 478215 471986 464861 457301 449872 442792 436054 429809
60011 429809 424373 419841 415960 412542 409833 408226 407565 407049 406018 404693 403833 403748 404005 404106 403984 403756
59995 403756 403403 402998 402902 403400 404374 405574 406897 408135 408893 409224 410029 412229 415650 419206 422035 423954
59979 423954 425026 425349 425287 425224 424905 423614 421232 418597 416591 415307 414391 413735 413374 413007 412172 410859 409682
$$ packed form
60087E60930M06k14j07Q21J545J364P09K16j45n40o91m32l09r15k061l185m204
60070E53188n310o230o376n763n157n212n730n986n583m852m390m320m240l932
60056D80107l729l853l789k927j603p51o29n56n5O37J295K145L188L832L739L399
60040D80450L370L475L357L268L623M145M178L594K786J927Q88j91r14j272j768
60025E10916k749l960m897n289n240n137n429o229p125p560p429p080o738o245
60011D29809n436m532l881l418k709j607o61n16j031j325q60q5K57J01j22k28
59995D03756l53m05r6M98R74J200J323J238P58L31Q05K200L421L556K829J919
59979D23954J072L23o2o3l19j291k382k635k006j284r16o56l61l67q35j313j177
$$ plain form
59962 409682 409408 410406 412447 414860 416970 418544 419808 421000 422013 422589 422760 422977 423675 424734 425485 425472
59946 425472 425123 425284 426028 426416 425807 424838 424476 424443 423491 421142 418302 415941 414028 412175 410607 409804 409647
59929 409647 409614 409663 410306 411849 414054 416650 419833 424057 429378 435055 439770 442453 443068 442587 442113 442083 442323
59912 442323 442620 443044 443813 445024 446533 448078 449562 451146 452980 454939 456825 458731 460879 463158 465200
59897 465200 466971 468803 470722 472155 472648 472547 472716 473808 476075 479562 484070 489074 494049 498901 503908
59882 503908 509307 515080 521014 526818 532288 537543 542930 548558 554079 559042 563274 566746 569295 570659
59868 570659 570674 569301 566707 563443 560244 557427 554733 551964 549394 547289 545491 543949 543275 544174 546462
59853 546462 549317 552382 556033 560630 566197 572864 580742 588938 595382 598331 597868 595519 592741 590290
$$ packed form
59962D09682k74R98K041K413K110J574J264J192J013N76J71K17O98J059P51j3
59946D25472l49J61P44L88o09r69l62l3r52k349k840k361j913j853j568q03j57
59929D09647l3M9O43J543K205K596L183M224N321N677M715K683O15m81m74l0K40
59912D42323K97M24P69J211J509J545J484J584J834J959J886J906K148K279K042
59897D65200J771J832J919J433M93j01J69J092K267L487M508N004M975M852N007
59882E03908N399N773N934N804N470N255N387N628N521M963M232L472K549J364
59868E70659J5j373k594l264l199k817k694k769k570k105j798j542o74Q99K288
59853E46462K855L065L651M597N567O667P878Q196O444K949m63k349k778k451
$$ plain form
59839 590290 588786 588957 590868 593301 594401 593037 589377 584299 578559 572656 567108 562425 558767 555951
59825 555951 553906 552825 552686 552902 552735 551902 550422 548085 544551 540005 535288 531145 527626 524355 521093
59810 521093 517787 514287 510294 505613 500365 495059 490459 487123 484941 483297 481801 480546 479511 478157
59796 478157 476094 473852 472280 471224 469536 466614 463248 460493 458255 455714 452842 450659 449972 450551 451769
59781 451769 453379 455261 456926 457854 458158 458451 459167 460360 462036 464252 466862 469470 471706 473464 474959
59766 474959 476713 479216 482265 484863 486260 486971 488352 491244 495500 500666 506316 511670 515736 518333
59752 518333 520410 522938 526007 529455 533727 539328 545804 552038 557441 562174 566381 570005 573394 577277
59738 577277 581788 586119 589456 591781 593476 594638 595257 595702 596500 597716 598920 599695 599954 599859 599703 599762 600029
$$ packed form
59839E90290j504J71J911K433J100j364l660n078n740n903n548m683l658k816
59825E55951k045j081j39K16j67q33j480k337l534m546m717m143l519l271l262
59810E21093l306l500l993m681n248n306m600l336k182j644j496j255j035j354
59796D78157k063k242j572j056j688k922l366k755k238k541k872k183o87N79J218
59781D51769J610J882J665R28L04K93P16J193J676K216K610K608K236J758J495
59766D74959J754K503L049K598J397P11J381K892M256N166N650N354M066K597
59752E18333K077K528L069L448M272N601O476O234N403M733M207L624L389L883
59738E77277M511M331L337K325J695J162O19M45P98J216J204P75K59r5j56N9K67
$$ plain form
59721 600029 600147 599804 599075 598134 596839 594987 592946 591590 591408 591977 592422 592153 591002 589027 586528 584096
59705 584096 582188 580641 578927 576944 575221 574193 573580 572771 571604 570454 569612 568983 568416 568031 568069 568615
59689 568615 569586 570733 571486 571072 569159 566362 563800 562093 560979 559929 558789 557638 556310 554476 552153
59674 552153 549695 547116 543790 539187 533704 528342 523568 518972 514162 509535 505784 502987 500652 498487
59660 498487 496635 495201 494102 493516 493933 495413 497171 498289 498728 499325 500882 503572 507087 510920 514385
59645 514385 516705 517449 516833 515428 513546 511076 507934 504489 501333 498721 496494 494560 493100 492141 491299
59630 491299 490325 489595 489526 489645 488898 486961 484634 482721 481127 479374 477406 475297 472619 468890 464556 460809
59614 460809 458320 456682 455179 453622 452223 451129 450435 450329 450834 451524 451864 451870 452141 453184 454821 456386
$$ packed form
59721F00029J18l43p29r41j295j852k041j356j82N69M45k69j151j975k499k432
59705E84096j908j547j714j983j723j028o13q09j167j150q42o29n67l85L8N46
59689E68615R71J147P53m14j913k797k562j707j114j050j140j151j328j834k323
59674E52153k458k579l326m603n483n362m774m596m810m627l751k797k335k165
59660D98487j852j434j099n86M17J480J758J118M39N97J557K690L515L833L465
59645E14385K320P44o16j405j882k470l142l445l156k612k227j934j460r59q42
59630D91299r74p30o9J19p47j937k327j913j594j753j968k109k678l729m334l747
59614D60809k489j638j503j557j399j094o94j06N05O90L40OK71J043J637J565
$$ plain form
59598 456386 457425 458114 459035 460671 463139 466236 469559 472618 475031 476767 478122 479437 480800 481964 482497
59583 482497 482115 481055 479946 479019 477598 474867 471194 468109 466695 466426 465986 464778 463185 461703 460524
59568 460524 459782 459526 459387 458870 458107 457749 457981 458195 457958 457771 458369 459608 460604 460848 460652 460443 460138 459473
59550 459473 458650 458291 458823 460145 461974 464264 467211 471036 476022 482638 491305 501868 513569 525851
59536 525851 539187 554802 573199 592667 609314 619024 620005 613735 603498 592159 581348 572106
59524 572106 565293 561145 559194 559019 560553 563300 565956 567470 568017 568182 567638 565571 562171 558585 555259
59509 555259 551328 545949 539383 532328 525001 517517 510524 504599 499337 493827 487965 482669 478686 475725
59495 475725 472952 470029 467380 465510 464258 462929 461204 459730 459464 460562 462398 464656 467729 471692
$$ packed form
59598D56386J039O89R21J636K468L097L323L059K413J736J355J315J363J164N33
59583D82497l82j060j109r27j421k731l673l085j414k69m40j208j593j482j179
59568D60524p42k56j39n17p63l58K32K14k37j87N98J239R96K44j96k09l05o65
59550D59473q23l59N32J322J829K290K947L825M986O616Q667J0563J1701J2282
59536E25851J3336J5615J8397J9468J6647R710R81o270j0237j1339j0811r242
59524E72106o813m148j951j75J534K747K656J514N47J65n44k067l400l586l326
59509E55259l931n379o566p055p327p484o993n925n262n510n862n296l983k961
59495D75725k773k923k649j870j252j329j725j474k66J098J836K258L073L963
$$ plain form
59481 471692 475554 478226 479923 481902 484925 488591 492178 495511 498872 502553 506767 511554 516501 520835
59467 520835 524080 526478 528556 530452 531882 532722 533432 534822 537335 540517 543345 545281 546936 549453 553347
59452 553347 558303 564013 570616 578066 585638 592554 598803 604751 610112 613863 615269 614483 612036 608246
59438 608246 603393 598074 592886 587890 582720 577243 571883 567263 563668 560905 558596 556704 555773 556504 559009
59423 559009 562692 567067 572465 579696 589217 601035 615299 632466 652665 675230 699132 723857
59411 723857 749827 777845 807578 835977 857504 867059 863462 850065 832023 813458 797090 785169
59399 785169 779426 780282 786798 797125 808177 815266 813679 801593 781230 756838 731896 708248 686958
59386 686958 668865 654239 642515 632749 624301 617055 611104 606373 602624 599770 598002 597457 597943 599165
$$ packed form
59481D71692L862K672J697J979L023L666L587L333L361L681M214M787M947M334
59467E20835L245K398K078J896J430Q40P10J390K513L182K828J936J655K517L894
59452E53347M956N710O603P450P572O916O249N948N361L751J406p86k447l790
59438F08246m853n319n188m996n170n477n360m620l595k763k309j892r31P31K505
59423E59009L683M375N398P231R521J1818J4264J7167K0199K2565K3902K4725
59411G23857K5970K8018K9733K8399K1527R555l597j3397j8042j8565j6368j1921
59399G85169n743Q56O516J0327J1052P089j587j2086k0363k4392k4942k3648k1290
59386F86958j8093j4626j1724r766q448p246n951m731l749k854j768n45M86J222
$$ plain form
59372 599165 600965 602960 604211 603845 602112 600316 599520 599725 600444 601532 603131 605213 607633 610357 613386
59357 613386 616733 620829 626546 634256 643084 651667 659681 668162 678329 690555 704471 719494 734971
59344 734971 750180 764622 778181 790850 802419 812601 821270 828327 833434 836149 836323 834214 830193
59331 830193 824491 817174 808181 797302 784394 769777 754299 738779 723457 708211 693220 679093
59319 679093 666244 654483 643425 633094 623821 615735 608626 602278 596679 591943 588287 585998 585153
59306 585153 585474 586886 590138 596374 605868 617544 629875 641746 652130 659376 661545 657517 647637
59293 647637 633489 617377 601686 587933 576147 565463 555508 546927 540510 536292 533833 532979 533795
59280 533795 535849 538198 540307 542634 546068 551041 557449 565106 573810 583076 592390 601942 612669 625287
$$ packed form
59372E99165J800J995J251l66j733j796p96K05P19J088J599K082K420K724L029
59357F13386L347M096N717P710Q828Q583Q014Q481J0167J2226J3916J5023J5477
59344G34971J5209J4442J3559J2669J1569J0182Q669P057N107K715J74k109m021
59331H30193n702p317q993j0879j2908j4617j5478j5520j5322j5246j4991j4127
59319F79093j2849j1761j1058j0331r273q086p109o348n599m736l656k289q45
59306E85153L21J412L252O236R494J1676J2331J1871J0384P246K169m028r880
59293F47637j4148j6112j5691j3753j1786j0684r955q581o417m218k459q54Q16
59280E33795K054K349K109K327L434M973O408P657Q704R266R314R552J0727J2618
$$ plain form
59266 625287 639456 654057 667950 680225 690110 697239 702022 705260 707240 707482 705527 701702 696917
59253 696917 691819 686382 680358 674019 668267 663843 660498 657302 653863 650885 649311 649248 650117 651558 653648
59238 653648 656415 659700 663475 667771 672243 676283 679665 682567 684855 685828 684892 682063 677653 671893 665056
59223 665056 657477 649217 640135 630585 621485 613287 605329 596784 587993 580211 574082 568958 563824 558549
59209 558549 553977 550957 549421 548414 546974 544896 542622 540596 539019 538048 537737 537746 537629 537527 538056 539312
59193 539312 540595 541465 542487 544392 546916 549176 550900 552611 554665 556798 558723 560681 563117 566098
59179 566098 569175 571746 573493 574577 575408 576247 577198 578562 580787 583868 587140 589940 592216 594252 596219
59164 596219 598308 600857 603854 606638 608655 610208 611857 613329 613775 613024 611784 610490 608565 605104 599858
$$ packed form
59266F25287J4169J4601J3893J2275R885P129M783L238J980K42j955l825m785
59253F96917n098n437o024o339n752m424l345l196l439k978j574o3Q69J441K090
59238F53648K767L285L775M296M472M040L382K902K288R73r36k829m410n760o837
59223F65056p579q260r082r550r100q198p958q545q791p782o129n124n134n275
59209E58549m572l020j536j007j440k078k274k026j577r71l11Rj17j02N29J256
59193E39312J283Q70J022J905K524K260J724J711K054K133J925J958K436K981
59179E66098L077K571J747J084Q31Q39R51J364K225L081L272K800K276K036J967
59164E96219K089K549K997K784K017J553J649J472M46p51j240j294j925l461n246
$$ plain form
59149 599858 593388 586589 580148 574089 567765 560602 552978 545987 540279 535481 530780 525723 520358 515045
59135 515045 510297 506469 503369 500439 497431 494698 492719 491665 491484 492152 493629 495746 498245 500918 503791
59120 503791 507345 512363 519152 526962 534566 541487 548365 556111 565098 575180 586022 597147 607969
59107 607969 618011 627041 634989 641898 647908 653066 657302 660857 664446 668387 671696 672782 671273 668513
59093 668513 666023 664052 661976 659580 657413 656140 655988 656624 657237 656931 655339 652796 649783 646398 642490
59078 642490 637933 632557 626158 618916 611557 604804 598831 593439 588421 583529 578417 573078 568075 563900
59064 563900 560287 556587 552728 549321 546769 544679 542281 539217 535839 532849 530645 528914 526940 524446
59050 524446 521975 520288 519571 519466 519666 520067 520471 520594 520473 520460 520634 520534 519697 518236 516719 515648 515327
$$ packed form
59149E99858o470o799o441o059o324p163p624o991n708m798m701n057n365n313
59135E15045m748l828l100k930l008k733j979j054j81O68J477K117K499K673K873
59120E03791L554N018O789P810P604O921O878P746Q987J0082J0842J1125J0822
59107F07969J0042R030P948O909O010N158M236L555L589L941L309J086j509k760
59093F68513k490j971k076k396k167j273j52O36O13l06j592k543l013l385l908
59078F42490m557n376o399p242p359o753n973n392n018m892n112n339n003m175
59064E63900l613l700l859l407k552k090k398l064l378k990k204j731j974k494
59050E24446k471j687p17j05K00M01M04J23j21j3J74j00q37j461j517j071l21
$$ plain form
59033 515327 516013 517727 519899 521631 522670 523904 526525 530787 535974 541617 548222 556489 566264 576766
59019 576766 587644 599187 611461 623840 635580 646369 655920 663385 667706 668553 666624 663023 658537
59006 658537 653538 648364 643634 640122 638304 638102 639170 641373 644786 649162 653654 657255 659534 660915
58992 660915 662278 664248 666653 668652 669537 669443 669140 669163 669316 669008 667827 665764 663189 660759 659115 658513
58976 658513 658898 660428 663671 669072 676362 684682 693267 701986 711309 721808 733530 745816 757821
58963 757821 769206 780157 790841 801179 811184 821043 830606 839042 845270 848588 848751 845711 839531
58950 839531 830397 818515 804172 788087 771476 755451 740392 726100 712441 699603 687833 677194
58938 677194 667635 659134 651746 645606 640843 637391 634866 632770 630834 629154 627978 627373 627139 627079 627247
$$ packed form
59033E15327O86J714K172J732J039J234K621M262N187N643O605Q267R775J0502
59019E76766J0878J1543J2274J2379J1740J0789R551P465M321Q47j929l601m486
59006F58537m999n174m730l512j818k02J068K203L413M376M492L601K279J381
58992F60915J363J970K405J999Q85r4l03K3J53l08j181k063k575k430j644o02
58976F58513L85J530L243N401P290Q320Q585Q719R323J0499J1722J2286J2005
58963G57821J1385J0951J0684J0338J0005R859R563Q436O228L318J63l040o180
58950H39531r134j1882j4343j6085j6611j6025j5059j4292j3659j2838j1770j0639
58938F77194r559q501p388o140m763l452k525k096j936j680j176o05k34o0J68
$$ plain form
58923 627247 627713 628090 627682 626364 624947 624235 623958 623155 621504 619638 618164 617069 616260 615976 616307 616847 617333
58906 617333 618294 620659 624996 631381 639627 649276 659760 670975 683312 696666 709857 721692 732308
58893 732308 742812 753839 765236 777099 790195 805067 821337 838300 855695 873495 891317
58882 891317 908476 924435 938821 951145 960844 967558 971127 971379 968202 961819 952730 941353 928034
58869 928034 913513 899012 885478 872951 861056 850037 840800 833798 828416 823664 818993 814007 807913
58856 807913 800007 790569 780645 770921 761311 751563 741664 731638 721535 711705 702526 693845 685287 677133
58842 677133 670041 663771 657099 649442 641751 635180 629611 624121 618291 612261 606054 599709 593733 588615
58828 588615 584118 579794 575915 573149 571562 570772 570940 572646 575730 579120 582054 584858 588311 592761 597954
$$ packed form
58923F27247M66L77m08j318j417p12k77q03j651j866j474j095q09k84L31N40M86
58906F17333R61K365M337O385Q246R649J0484J1215J2337J3354J3191J1835J0616
58893G32308J0504J1027J1397J1863J3096J4872J6270J6963J7395J7800J7822
58882H91317J7159J5959J4386J2324R699O714L569K52l177o383r089j1377j3319
58869I28034j4521j4501j3534j2527j1895j1019r237p002n382m752m671m986o094
58856H07913p906r438r924r724r610r748r899j0026j0103r830r179q681q558q154
58842F77133p092o270o672p657p691o571n569n490n830o030o207o345n976n118
58828E88615m497m324l879k766j587p90J68J706L084L390K934K804L453M450N193
$$ plain form
58813 597954 603231 607843 611621 615280 619494 623707 626594 627738 628059 628370 628351 627289 625103 622122 618481
58798 618481 614335 610176 606371 602677 598663 594265 589547 584380 578840 573540 568931 564598 559883 555026
58784 555026 550997 548252 546467 545560 546251 549123 553507 557797 560811 562652 564326 566680 569649 572375 573929
58769 573929 573824 571867 567903 562113 555411 549018 543514 538632 534039 529799 525929 522097 518339 515634
58755 515634 515072 516556 518912 521178 523180 524929 526339 527801 530164 533611 537164 539911 542206 544956
58741 544956 548259 551562 554889 558920 563881 569272 574789 580725 587207 593801 600144 606346 612507 618431
58727 618431 624138 630035 636236 642294 647866 653050 657710 661241 663552 665671 668701 672731 677442 683202
58713 683202 690585 699077 707266 714366 720783 727046 732802 737091 739155 738764 736086 731340 724413 714891
$$ packed form
58813E97954N277M612L778L659M214M213K887J144L21L11j9j062k186k981l641
58798F18481m146m159l805l694m014m398m718n167n540n300m609m333m715m857
58784E55026m029k745j785r07O91K872M384M290L014J841J674K354K969K726J554
58769E73929j05j957l964n790o702o393n504m882m593m240l870l832l758k705
58755E15634n62J484K356K266K002J749J410J462K363L447L553K747K295K750
58741E44956L303L303L327M031M961N391N517N936O482O594O343O202O161N924
58727F18431N707N897O201O058N572N184M660L531K311K119L030M030M711N760
58713F83202P383Q492Q189P100O417O263N756M289K064l91k678m746o927r522
$$ plain form
58699 714891 702720 688735 674162 659607 644801 629235 612836 596188 580348 566342 554506
58688 554506 544413 535555 527798 520975 514523 508046 501930 496834 492815 489499 486835 485006 483626 481831
58674 481831 479380 477192 476553 478024 481198 485223 489514 494181 499847 506983 515514 525157 535801 547279
58660 547279 559049 570403 580726 589228 594852 596979 596019 592874 588112 582122 575664 569540 563843 558225
58646 558225 552784 548006 543870 539690 535035 530303 526225 523118 520693 518422 516182 514644 514638 515857 516731
58631 516731 516126 514654 513601 513112 512311 510928 509636 508851 508288 507886 508234 509733 511999 514450 516972 519818
58615 519818 523302 527690 532932 538462 543712 548816 554323 560274 566085 571227 575463 578578 580510 581623
58601 581623 582206 581893 580282 577893 575637 573578 571188 568714 567158 566759 566608 566041 565436 565399 566126 567902
$$ packed form
58699G14891j2171j3985j4573j4555j4806j5566j6399j6648j5840j4006j1836
58688E54506j0093q858p757o823o452o477o116n096m019l316k664j829j380j795
58674D81831k451k188o39J471L174M025M291M667N666P136Q531R643J0644J1478
58660E47279J1770J1354J0323Q502N624K127r60l145m762n990o458o124n697n618
58646E58225n441m778m136m180m655m732m078l107k425k271k240j538oJ219Q74
58631E16731o05j472j053m89q01j383j292p85n63m02L48J499K266K451K522K846
58615E19818L484M388N242N530N250N104N507N951N811N142M236L115J932J113
58601E81623N83l13j611k389k256k059k390k474j556l99j51n67o05l7P27J776
$$ plain form
58585 567902 571322 576583 583287 591257 600709 611357 622175 632401 641992 650803 658240 664173 669367
58572 669367 674543 679734 684965 690792 697724 705813 715236 726521 739797 754607 770901 789423 810546
58559 810546 833423 856834 880193 903198 925126 945022 961998 974960 982819 985563 984598 981540
58547 981540 977126 971555 965052 957718 949605 941348 933877 926941 918847 908246 895359 880850 864544
58534 864544 846260 827103 808788 792109 776947 763318 751479 741331 732588 725337 719800 715771
58522 715771 712862 710933 709708 708374 706193 703254 700124 697067 694093 691404 689243 687532 686015 684484
58508 684484 682633 680157 677262 674570 672299 670078 667719 665505 663542 661716 660421 660278 660772 660361 658493
58493 658493 656414 655394 655292 655628 656795 659158 662025 664664 667505 671316 676004 681255 687496 695109 703593
$$ packed form
58585E67902L420N261O704P970R452J0648J0818J0226R591Q811P437N933N194
58572F69367N176N191N231N827O932Q089R423J1285J3276J4810J6294J8522K1123
58559H10546K2877K3411K3359K3005K1928J9896J6976J2962P859K744r65l058
58547I81540m414n571o503p334q113q257p471o936q094j0601j2887j4509j6306
58534H64544j8284j9157j8315j6679j5162j3629j1839j0148q743p251n537m029
58522G15771k909j929j225j334k181k939l130l057k974k689k161j711j517j531
58508F84484j851k476k895k692k271k221k359k214j963j826j295j43M94m11j868
58493F58493k079j020j02L36J167K363K867K639K841L811M688N251O241P613Q484
$$ plain form
58478 703593 712637 723213 736310 751281 766575 781362 795135 806548 814185 818041 819000 817328 812986
58465 812986 806838 800064 792800 784733 776677 770114 765481 762276 760553 760900 763224 766989 772463 780273
58451 780273 789822 799528 808531 816779 823602 827792 829201 828820 827115 823599 818208 811779 804933 797771
58437 797771 790895 785460 781867 779510 778062 777954 779283 781305 783414 785780 788794 792656 797618 803800
58423 803800 810692 817641 824747 832373 839942 846257 850920 854317 856284 856050 853580 849739 845008 839211
58409 839211 832664 826294 820330 814075 807315 800837 795194 790045 785198 781291 778982 778263 778961 781080 784359
58394 784359 788285 792837 798405 804749 810814 815850 820006 823622 826705 829288 831638 833940 836300 839001
58380 839001 842093 845005 847375 849960 853765 858533 863237 867822 873198 879594 886328 893276 901177 910161
$$ packed form
58478G03593R044J0576J3097J4971J5294J4787J3773J1413P637L856R59j672m342
58465H12986o148o774p264q067q056o563m633l205j723L47K324L765N474P810
58451G80273R549R706R003Q248O823M190J409l81j705l516n391o429o846p162
58437G97771o876n435l593k357j448j08J329K022K109K366L014L862M962O182
58423H03800O892O949P106P626P569O315M663L397J967k34k470l841m731n797
58409H39211o547o370n964o255o760o478n643n149m847l907k309p19O98K119L279
58394G84359L926M552N568O344O065N036M156L616L083K583K350K302K360K701
58380H39001L092K912K370K585L805M768M704M585N376O396O734O948P901Q984
$$ plain form
58366 910161 919203 927509 935444 943789 952957 963075 973973 984939 995402 1005780 1016736 1027791
58354 1027791 1037805 1046680 1055138 1062898 1068654 1072161 1074914 1078297 1082272 1086329 1090559 1095277 1100577 1106677
58340 1106677 1113931 1122236 1131205 1140961 1151938 1164017 1176798 1190516 1205599 1221548 1237493 1253541
58328 1253541 1270223 1286852 1301935 1315027 1326675 1336724 1344453 1350307 1355721 1361132 1365926 1370384
58316 1370384 1375836 1382594 1389594 1396436 1404087 1413228 1423565 1435036 1448021 1462080 1476204 1490589
58304 1490589 1506440 1523848 1541658 1559566 1578367 1597841 1616543 1634110 1651804 1670305 1688955
58293 1688955 1707549 1726853 1746892 1766817 1786906 1808638 1832329 1856817 1881816 1908309 1936289
58282 1936289 1964596 1993428 2024349 2057234 2090002 2122205 2156086 2192994 2231441 2269896 2308924
$$ packed form
58366I10161R042Q306P935Q345R168J0118J0898J0966J0463J0378J0956J1055
58354A027791J0014Q875Q458P760N756L507K753L383L975M057M230M718N300O100
58340A106677P254Q305Q969R756J0977J2079J2781J3718J5083J5949J5945J6048
58328A253541J6682J6629J5083J3092J1648J0049P729N854N414N411M794M458
58316A370384N452O758P000O842P651R141J0337J1471J2985J4059J4124J4385
58304A490589J5851J7408J7810J7908J8801J9474J8702J7567J7694J8501J8650
58293A688955J8594J9304K0039J9925K0089K1732K3691K4488K4999K6493K7980
58282A936289K8307K8832L0921L2885L2768L2203L3881L6908L8447L8455L9028
$$ plain form
58271 2308924 2349351 2390848 2433542 2478618 2526146 2574738 2624376 2676957 2733058 2790992 2850306
58260 2850306 2913216 2981136 3052627 3126237 3202455 3281346 3361219 3441351 3523231 3607533 3692865
58249 3692865 3779142 3869065 3964447 4064136 4167394 4276023 4391184 4511504 4636569 4769044
58239 4769044 4910915 5060799 5217350 5382280 5557695 5743487 5939583 6147595 6368097
58230 6368097 6599642 6842642 7100812 7376808 7670282 7982269 8317211 8678364 9065766
58221 9065766 9481243 9930668 10418593 10945701 11514530 12132555 12806742 13540873 14341684
58212 14341684 15221732 16192775 17263023 18445286 19761469 21235059 22886708 24742450
58204 24742450 26839852 29223158 31943542 35072967 38712666 42986296 48038929 54053494
$$ packed form
58271B308924M0427M1497M2694M5076M7528M8592M9638N2581N6101N7934N9314
58260B850306O2910O7920P1491P3610P6218P8891P9873Q0132Q1880Q4302Q5332
58249C692865Q6277Q9923R5382R9689J03258J08629J15161J20320J25065J32475
58239D769044J41871J49884J56551J64930J75415J85792J96096K08012K20502
58230F368097K31545K43000K58170K75996K93474L11987L34942L61153L87402
58221I065766M15477M49425M87925N27108N68829O18025O74187P34131Q00811
58212A4341684Q80048R71043J070248J182263J316183J473590J651649J855742
58204B4742450K097402K383306K720384L129425L639699M273630N052633O014565
$$ plain form
58196 54053494 61262029 69938776 80397765 93004722 108175922 126357352 148016930
58189 148016930 173637213 203621847 238069552 276468793 317352625 357925017 393890006
58182 393890006 420002872 431603168 426493080 405908351 373866969 335437542 295135011
58175 295135011 256175918 220469009 188891375 161604173 138356640 118724201 102232124
58168 102232124 88404334 76802390 67054094 58847265 51910757 46015212 40979777 36659898
58160 36659898 32930745 29688939 26858813 24382262 22204920 20278494 18568308 17047964
58152 17047964 15690678 14473022 13381408 12406291 11533480 10747502 10039019 9402108 8827874
58143 8827874 8306798 7833700 7404374 7010417 6642822 6297827 5974508 5669937 5381613
$$ packed form
58196E4053494P208535Q676747J0458989J2606957J5171200J8181430K1659578
58189A48016930K5620283K9984634L4447705L8399241M0883832M0572392L5964989
58182C93890006K6112866J1600296n110088k0584729l2041382l8429427m0302531
58175B95135011l8959093l5706909l1577634k7287202k3247533j9632439j6492077
58168A02232124j3827790j1601944r748296q206829o936508n895545n035435m319879
58160C6659898l729153l241806k830126k476551k177342j926426j710186j520344
58152A7047964j357286j217656j091614r75117q72811p85978p08483o36911n74234
58143H827874n21076m73098m29326l93957l67595l44995l23319l04571k88324
$$ plain form
58134 5381613 5111464 4862236 4632241 4417856 4218469 4034620 3863898 3703081 3552078
58125 3552078 3411790 3280396 3155581 3038066 2929077 2826535 2727576 2632803 2544338 2461633
58115 2461633 2382823 2308310 2239322 2174558 2111799 2051381 1994778 1941256 1889170 1839132 1792679
58104 1792679 1749005 1706050 1663642 1622753 1582865 1542851 1503300 1465313 1428178 1390814 1354317
58093 1354317 1320454 1288794 1257835 1227868 1200210 1174710 1150485 1128068 1108396 1090594 1073042
58082 1073042 1055639 1038870 1021804 1003329 984283 966067 948229 929670 911116 893951 877565
58071 877565 860274 842042 824109 806803 789962 774534 761475 749844 738225 727160 717930 709881
58059 709881 701434 692891 685682 679406 672207 663707 655138 646832 637952 628547 619602 611158 602537 594350
$$ packed form
58134E381613k70149k49228k29995k14385j99387j83849j70722j60817j51003
58125C552078j40288j31394j24815j17515j08989j02542r8959r4773q8465q2705
58115B461633p8810p4513o8988o4764o2759o0418n6603n3522n2086n0038m6453
58104A792679m3674m2955m2408m0889l9888m0014l9551l7987l7135l7364l6497
58093A354317l3863l1660l0959k9967k7658k5500k4225k2417j9672j7802j7552
58082A073042j7403j6769j7066j8475j9046j8216j7838j8559j8554j7165j6386
58071H77565j7291j8232j7933j7306j6841j5428j3059j1631j1619j1065r230q049
58059G09881q447q543p209o276p199q500q569q306q880r405q945q444q621q187
$$ plain form
58045 594350 588122 583816 579692 574665 568993 562670 555094 546547 538225 530585 523150 516065 510310 506141
58031 506141 502650 498974 494768 489579 483081 475893 468938 462054 454410 446145 438399 431813 426085 420837
58017 420837 415880 410832 405535 400620 396759 393737 391008 388612 386644 384702 382874 382309 383552 385326
58003 385326 386331 387237 389219 391610 392953 393598 395114 397627 399885 401625 403664 405679 405950 403599 399413
57988 399413 394282 388439 382284 376429 370754 364828 359167 354639 350799 346443 341675 337687 334515 330877
57974 330877 326411 322243 319041 316241 313678 312250 312299 312823 312983 313164 313885 314836 315574 316180 316716 317001 317317
57957 317317 318359 320079 321449 321701 320972 319534 317352 314689 312216 310238 308511 306941 305654 304383 302771
57942 302771 301373 301433 303517 307208 312104 318183 325124 332239 339220 346248 353490 361254 370229 380376
$$ packed form
58045E94350o228m306m124n027n672o323p576q547q322p640p435p085n755m169
58031E06141l491l676m206n189o498p188o955o884p644q265p746o586n728n248
58017D20837m957n048n297m915l861l022k729k396j968j942j828n65J243J774
58003C85326J005R06J982K391J343O45J516K513K258J740K039K015K71k351m186
57988C99413n131n843o155n855n675n926n661m528l840m356m768l988l172l638
57974C30877m466m168l202k800k563j428M9N24J60J81P21R51P38O06N36K85L16
57957C17317J042J720J370K52p29j438k182k663k473j978j727j570j287j271j612
57942C02771j398O0K084L691M896O079O941P115O981P028P242P764Q975J0147
$$ plain form
57928 380376 389858 396367 399417 400066 398669 394498 387707 379897 372242 364402 355860 347021 338394 329810
57914 329810 321223 313411 307263 302965 300221 298574 297281 295660 293864 292677 292449 292943 294130 296113 298258
57899 298258 299458 299495 299195 299123 299071 298943 299135 299838 300887 302489 305227 309197 313899 318897 323698 327298 329129
57882 329129 330301 332538 335817 338462 339613 340033 340287 339800 338297 336584 335104 332990 329406 324812 320201
57867 320201 316008 312334 309266 306432 303194 299765 297233 296074 295702 295855 297212 300063 303588 307148 311182
57852 311182 316016 320820 324661 327813 331227 335314 339817 344167 347479 348950 348783 348035 347228 345981 344181
57837 344181 342420 340896 339107 337187 336258 336698 337237 336578 334937 333205 331699 330593 330458 331326 332155 332249
57821 332249 332341 333245 334366 334681 334472 334843 336032 337258 337722 336696 333087 326142 316495 305742 295158
$$ packed form
57928C80376R482O509L050O49j397m171o791p810p655p840q542q839q627q584
57914C29810q587p812o148m298k744j647j293j621j796j187k28M94J187J983K145
57899B98258J200L7l00p2n2j28J92P03J049J602K738L970M702M998M801L600J831
57882C29129J172K237L279K645J151M20K54m87j503j713j480k114l584m594m611
57867C20201m193l674l068k834l238l429k532j159l72J53J357K851L525L560M034
57852C11182M834M804L841L152L414M087M503M350L312J471j67p48q07j247j800
57837C44181j761j524j789j920r29M40N39o59j641j732j506j106j35Q68Q29R4
57821C32249R2R04J121L15k09L71J189J226M64j026l609o945r647j0753j0584
$$ plain form
57806 295158 285343 276598 268863 261646 254802 249035 244934 241914 238878 235621 232877 231245 230713 230995 231766
57791 231766 232752 233974 235640 237526 238920 239567 240124 241315 243177 245521 248419 251777 255123 258442 262570
57776 262570 268089 274386 280381 285717 290682 295463 300028 304261 307803 310218 311654 312635 312952 311614 308409
57761 308409 304561 301357 299011 297472 297224 298392 299985 301008 301643 302514 303562 304472 305429 306488 306901 306037
57745 306037 304271 302146 299416 295886 292389 289896 288342 287344 287232 288260 289589 290335 290910 292011 292970
57730 292970 292556 290895 289072 287286 284992 282600 281439 281949 283324 284934 286758 288328 288636 287463 285771
57715 285771 284547 284063 284320 285200 286085 286298 286058 286196 286880 287472 287575 287337 286696 285313 283372 281614 280516
57698 280516 280122 280565 281847 283133 283212 281755 279350 276414 272955 269271 265859 262558 258777 254723 251463
$$ packed form
57806B95158r815q745p735p217o844n767m101l020l036l257k744j632n32K82P71
57791B31766R86J222J666J886J394O47N57J191J862K344K898L358L346L319M128
57776B62570N519O297N995N336M965M781M565M233L542K415J436R81L17j338l205
57761C08409l848l204k346j539k48J168J593J023O35Q71J048R10R57J059M13q64
57745C06037j766k125k730l530l497k493j554r98j12J028J329P46N75J101R59
57730B92970m14j661j823j786k294k392j161N10J375J610J824J570L08j173j692
57715B85771j224m84K57Q80Q85K13k40J38O84N92J03k38o41j383j941j758j098
57698B80516l94M43J282J286P9j457k405k936l459l684l412l301l781m054l260
$$ plain form
57683 251463 249559 248482 247586 246963 247219 249058 253084 259330 267070 275875 286695 301076 319592 342147
57669 342147 369596 403652 444978 492455 544381 598759 651588 696017 724441 731689 716708 682596
57657 682596 635618 583065 530675 481651 437609 399437 367047 339435 315856 296510 281661
57646 281661 270642 262182 255315 249590 244802 240867 237697 235026 232622 230693 229678 229617 230154 231104 232523
57631 232523 234252 235887 237144 237764 237295 235646 233650 232310 231606 230784 229607 228420 227196 225579 223794
57616 223794 222423 221334 219945 218492 217748 217384 216096 213711 211723 211154 211201 210716 209733 208741 207637 206374
57600 206374 205649 205885 206352 206275 206024 206179 206187 205049 202796 200134 197151 193533 189757 186853 184964 183125 180587
57583 180587 177564 174572 171726 168923 166254 164024 162575 162062 162175 162254 161820 160831 159355 157441 155477 154093
$$ packed form
57683B51463j904j077q96o23K56J839M026O246P740Q805J0820J4381J8516K2555
57669C42147K7449L4056M1326M7477N1926N4378N2829M4429K8424P248j4981l4112
57657F82596m6978n2553n2390m9024m4042l8172l2390k7612k3579j9346j4849
57646B81661j1019q460o867n725m788l935l170k671k404j929j015o1N37R50J419
57631B32523J729J635J257O20m69j649j996j340p04q22j177j187j224j617j785
57616B23794j371j089j389j453p44l64j288k385j988n69M7m85r83r92j104j263
57600B06374p25K36M67p7k51J55Qj138k253k662k983l618l776k904j889j839k538
57583A80587l023k992k846k803k669k230j449n13J13P9m34r89j476j914j964j384
$$ plain form
57567 154093 153343 152499 151133 149833 149328 149384 149259 148816 148413 147998 147093 145609 144049 142896 142365 142655 143891
57550 143891 145770 147766 149722 151842 154038 155774 156682 157096 157801 159351 161615 163909 165588 166654 167638
57535 167638 168861 169999 170468 169942 168355 165703 162225 158587 155509 153143 150926 148039 144091 139521 135345
57520 135345 132295 130130 127963 125162 121660 117550 112969 108450 104818 102434 100889 99665 98699 98136 97966
57505 97966 98215 99135 100862 103088 105293 107151 108605 109784 110885 111880 112347 111958 111073 110402 110078 109643 108952
57488 108952 108495 108716 109617 111167 113400 115940 118102 119749 121372 123047 124082 124083 123657 123522 123602 123597 123852 124924
57470 124924 126674 128416 129742 130731 131588 132495 133557 134562 135070 134903 134236 133162 131744 130563 130387 131040
57454 131040 131473 131319 131429 132343 133243 133242 132763 132647 132670 132049 130880 129912 129330 128836 128674 129486 131241 133253 135123
$$ packed form
57567A54093p50q44j366j300n05N6j25m43m03m15r05j484j560j153n31K90J236
57550A43891J879J996J956K120K196J736R08M14P05J550K264K294J679J066R84
57535A67638J223J138M69n26j587k652l478l638l078k366k217k887l948m570m176
57520A35345l050k165k167k801l502m110m581m519l632k384j545j224r66n63j70
57505I7966K49R20J727K226K205J858J454J179J101R95M67l89q85o71l24m35o91
57488A08952m57K21R01J550K233K540K162J647J623J675J035Jm26j35Q0nK55J072
57470A24924J750J742J326R89Q57R07J062J005N08j67o67j074j418j181j76O53
57454A31040M33j54J10R14R00jm79j16K3o21j169r68n82m94j62Q12J755K012J870
$$ plain form
57435 135123 136885 138469 139854 141541 143903 146230 147368 147224 146743 146519 146398 146381 146762 147262 147134 146479 146506
57418 146506 148019 150362 152241 152938 152389 150836 148909 147532 147243 147836 148902 150277 151754 152894 153528
57403 153528 154097 155084 156367 157424 157976 158189 158458 159132 160263 161477 162240 162372 162196 162170 162565 163407 164457
57386 164457 165279 165642 165928 166891 168966 171961 175331 178500 181040 182867 184265 185537 186752 188012 189678
57371 189678 191827 193743 194563 194395 194220 194560 194851 194400 193508 193225 194188 195997 197697 198688 199179 199833 201100
57354 201100 202989 205404 208375 211789 215171 217972 219952 221165 221909 222848 224768 227784 230993 233277 234276
57339 234276 234394 234258 234505 235700 237890 240458 242821 244982 247032 248629 249599 250620 252465 254809 256623
57324 256623 257653 258677 260335 262481 264809 267358 270211 273248 276371 279462 282102 283898 285212 286973
$$ packed form
57435A35123J762J584J385J687K362K327J138j44m81k24j21j7L81N00j28o55K7
57418A46506J513K343J879O97n49j553j927j377k89N93J066J375J477J140O34
57403A53528N69R87J283J057N52K13K69O74J131J214P63J32j76k6L95Q42J050
57386A64457Q22L63K86R63K075K995L370L169K540J827J398J272J215J260J666
57371A89678K149J916Q20j68j75L40K91m51q92k83R63J809J700R91M91O54J267
57354B01100J889K415K971L414L382K801J980J213P44R39J920L016L209K284R99
57339B34276J18j36K47J195K190K568K363K161K050J597R70J021J845K344J814
57324B56623J030J024J658K146K328K549K853L037L123L091K640J796J314J761
$$ plain form
57310 286973 289619 292685 295501 297799 299556 300868 302243 304553 308360 313435 318998 324232 328719 332727
57296 332727 336959 341633 346028 349403 352126 355245 359136 363307 367460 371954 377121 382792 388632 394382
57282 394382 399804 405046 410995 418502 427173 435688 443361 450625 457928 465153 472364 480187 489034 498642
57268 498642 508742 519424 530535 541541 552377 563695 575818 588249 600635 613357 626532
57257 626532 639323 651010 662105 673589 685538 697305 708635 719868 731383 743534 756703
57246 756703 770748 784769 798168 811597 826090 841568 857082 872359 888171 905144 923006
57235 923006 941198 959605 978440 997894 1018112 1039174 1060944 1083121 1105439 1127636 1149449
57224 1149449 1170966 1192799 1215411 1238443 1261209 1283820 1307266 1332304 1358802 1386310 1414821
$$ packed form
57310B86973K646L066K816K298J757J312J375K310L807N075N563N234M487M008
57296C32727M232M674M395L375K723L119L891M171M153M494N167N671N840N750
57282C94382N422N242N949P507Q671Q515P673P264P303P225P211P823Q847R608
57268D98642J0100J0682J1111J1006J0836J1318J2123J2431J2386J2722J3175
57257F26532J2791J1687J1095J1484J1949J1767J1330J1233J1515J2151J3169
57246G56703J4045J4021J3399J3429J4493J5478J5514J5277J5812J6973J7862
57235I23006J8192J8407J8835J9454K0218K1062K1770K2177K2318K2197K1813
57224A149449K1517K1833K2612K3032K2766K2611K3446K5038K6498K7508K8511
$$ plain form
57213 1414821 1444653 1475898 1508296 1541589 1575812 1611255 1648142 1686254 1724833 1762938 1799921
57202 1799921 1835630 1870346 1904629 1939010 1973536 2007705 2041098 2074025 2107283 2141320 2175874
57191 2175874 2210534 2245438 2281258 2318528 2357173 2396834 2437601 2480171 2525100 2572047 2620051
57180 2620051 2668435 2717082 2765913 2814608 2863040 2911577 2960643 3010209 3059906 3109385 3158331
57169 3158331 3206360 3253163 3298624 3342628 3385016 3425848 3465454 3503988 3541198 3576933 3611584
57158 3611584 3645679 3679164 3711395 3741739 3769809 3795170 3817261 3835826 3851366 3864957 3877545
57147 3877545 3889369 3900090 3909504 3917986 3926145 3934325 3942885 3952948 3966458 3985320 4010470 4041458
57135 4041458 4076268 4111503 4143584 4170447 4192156 4209930 4224956 4238159 4250447 4262620 4275261
$$ packed form
57213A414821K9832L1245L2398L3293L4223L5443L6887L8112L8579L8105L6983
57202A799921L5709L4716L4283L4381L4526L4169L3393L2927L3258L4037L4554
57191B175874L4660L4904L5820L7270L8645L9661M0767M2570M4929M6947M8004
57180B620051M8384M8647M8831M8695M8432M8537M9066M9566M9697M9479M8946
57169C158331M8029M6803M5461M4004M2388M0832L9606L8534L7210L5735L4651
57158C611584L4095L3485L2231L0344K8070K5361K2091J8565J5540J3591J2588
57147C877545J1824J0721R414Q482Q159Q180Q560J0063J3510J8862K5150L0988
57135D041458L4810L5235L2081K6863K1709J7774J5026J3203J2288J2173J2641
$$ plain form
57124 4275261 4289060 4305129 4324814 4349341 4379660 4416254 4458923 4507061 4560325 4618926 4683482
57113 4683482 4755249 4836556 4930293 5038544 5162103 5301485 5457952 5633660 5831997 6058572
57103 6058572 6321472 6630217 6995204 7428745 7946166 8565693 9308433 10199434 11267977
57094 11267977 12545562 14063437 15851389 17935805 20334932 23054002 26083792 29400571
57086 29400571 32963273 36710345 40563780 44441494 48268887 51980291 55510137 58780407
57078 58780407 61691321 64121387 65941272 67038137 67337609 66811858 65475501 63380550
57070 63380550 60615784 57304421 53592639 49631176 45559085 41495384 37537082 33759808
57062 33759808 30219287 26953389 23984023 21318287 18949705 16860799 15026869 13419789
$$ packed form
57124D275261J3799J6069J9685K4527L0319L6594M2669M8138N3264N8601O4556
57113D683482P1767Q1307R3737J08251J23559J39382J56467J75708J98337K26575
57103F058572K62900L08745L64987M33541N17421O19527P42740Q91001J068543
57094A1267977J277585J517875J787952K084416K399127K719070L029790L316779
57086B9400571L562702L747072L853435L877714L827393L711404L529846L270270
57078E8780407K910914K430066J819885J096865K99472n25751j336357k094951
57070F3380550k764766l311363l711782l961463m072091m063701l958302l777274
57062C3759808l540521l265898k969366k665736k368582k088906j833930j607080
$$ plain form
57054 13419789 12011039 10773908 9684679 8722479 7868486 7105925 6421138 5804423 5249453
57045 5249453 4751833 4307895 3914033 3566250 3260020 2990693 2754072 2546680 2365770
57036 2365770 2209250 2075312 1961966 1867298 1790459 1731862 1691779 1668889 1660469 1663048 1671195
57025 1671195 1675491 1663535 1625170 1557704 1466489 1361098 1251146 1144242 1045369 956630 877776
57014 877776 807814 746330 693218 647563 607546 571647 539497 511264 486602 464624 444692
57003 444692 426667 410397 395435 381435 368371 356163 344438 333000 322285 313010 305464 299430
56991 299430 294628 291016 288773 288289 290057 294259 300506 308280 317590 328802 341629 354441 364705
56978 364705 370068 369199 361976 349285 332721 314259 295766 278425 262576 248285 236085 226931
$$ packed form
57054A3419789j408750j237131j089229r62200q53993p62561o84787o16715n54970
57045E249453m97620m43938l93862l47783l06230k69327k36621k07392j80910
57036B365770j56520j33938j13346r4668p6839n8597m0083k2890q420K579Q147
57025A671195M296j1956l8365o7466r1215j05391j09952j06904r8873q8739p8854
57014H77776o9962o1484n3112m5655m0017l5899l2150k8233k4662k1978j9932
57003D44692j8025j6270j4962j4000j3064j2208j1725j1438j0715r275p546o034
56991B99430m802l612k243m84J768M202O247P774R310J1212J2827J2812J0264
56978C64705N363q69p223j2691j6564j8462j8493j7341j5849j4291j2200r154
$$ plain form
56966 226931 221367 219037 219141 221168 225139 231510 241105 254828 272922 294488 317893 341544 363990
56953 363990 383340 396945 402005 396847 382052 360502 336012 311568 288730 268394 251472 238532
56941 238532 229301 223019 219210 217873 219301 224133 233309 247432 266251 289109 315714 345943 378810
56928 378810 411819 441120 462119 470598 464525 445293 416938 383907 349573 316332 285993 259505
56916 259505 236774 217255 200626 186715 175102 165185 156540 148920 142027 135640 130003 125776 123375
56903 123375 122482 122367 122654 123566 125401 128069 131390 135614 141316 148818 158067 169008 181698 196001
56889 196001 211682 228979 248563 270609 294212 317971 340721 361223 377447 386799 387335 378855
56877 378855 363140 343255 322236 302087 284002 269311 259387 254416 253162 254681 259768 270006
$$ packed form
56966B26931n564k330J04K027L971O371R595J3723J8094K1566K3405K3651K2446
56953C63990J9350J3605N060n158j4795k1550k4490k4444k2838k0336j6922j2940
56941B38532r231o282l809j337J428M832R176J4123J8819K2858K6605L0229L2867
56928C78810L3009K9301K0999Q479o073j9232k8355l3031l4334l3241l0339k6488
56916B59505k2731j9519j6629j3911j1613r917q645p620o893o387n637m227k401
56903A23375q93j15K87R12J835K668L321M224N702P502R249J0941J2690J4303
56889A96001J5681J7297J9584K2046K3603K3759K2750K0502J6224R352N36q480
56877C78855j5715j9885k1019k0149j8085j4691r924m971j254J519N087J0238
$$ plain form
56865 270006 285946 307183 333953 367569 409152 458649 515023 576285 638710 696475 742697
56854 742697 771244 778390 764048 732057 688863 641121 593982 550885 514037 484745 463595 450677
56842 450677 445766 448591 459299 478660 507668 547173 598123 661703 738463 827221 924831 1026164
56830 1026164 1123170 1204263 1256649 1271295 1246864 1189731 1110802 1021587 931265 845565 767575
56819 767575 699231 641857 595815 560665 536107 522308 519193 526079 542410 568422 604692 651330
56807 651330 707807 772880 843683 914419 976156 1018665 1033776 1018520 976056 913816 840508
56796 840508 764039 690620 624239 566532 517597 477084 444403 418534 398665 385110 378812 379928
56784 379928 387680 401645 422175 449153 481114 515852 550824 582227 604563 612516 603708 579596
$$ packed form
56865B70006J5940K1237K6770L3616M1583M9497N6374O1262O2425N7765M6222
56854G42697K8547P146j4342l1991m3194m7742m7139m3097l6848k9292k1150j2918
56842D50677m911K825J0708J9361K9008L9505N0950O3580P6760Q8758R7610J01333
56830A026164R7006Q1093N2386J4646k4431n7133p8929q9215r0322q5700p7990
56819G67575o8344n7374m6042l5150k4558j3799l115O886J6331K6012L6270M6638
56807F51330N6477O5073P0803P0736O1737M2509J5111j5256m2464o2240p3308
56796H40508p6469p3419o6381n7707m8935m0513l2681k5869j9869j3555o298J116
56784C79928P752J3965K0530K6978L1961L4738L4972L1403K2336P953q808k4112
$$ plain form
56772 579596 544164 502104 457566 413572 372034 334156 300586 271247 245661 223707 205603
56761 205603 190945 178424 166933 156448 147369 139563 132661 126784 122115 118004 113331 107777 102131
56748 102131 97271 93407 90321 87808 85647 83604 81732 80466 80163 80638 81252 81364 80685 79334 77756
56733 77756 76530 76105 76521 77328 77966 78298 78700 79539 80744 82008 83072 83613 83253 82177 81460 82118 83941
56716 83941 85839 87225 88407 89709 90998 92192 93436 94557 95133 95336 95890 96841 97206 96431 95397 95233
56700 95233 95799 96128 95938 95736 95757 95743 95779 96513 98335 100858 103404 105621 107561 109470 111623 114124 116808
56683 116808 119474 122166 125036 128049 131031 133895 136662 139349 142032 144885 148020 151353 154703 157894
56669 157894 160740 163232 165706 168507 171376 173640 175172 176751 179171 182448 186222 190522 195653 201510
$$ packed form
56772E79596l5432m2060m4538m3994m1538l7878l3570k9339k5586k1954j8104
56761B05603j4658j2521j1491j0485r079p806o902n877m669m111m673n554n646
56748A02131m860l864l086k513k161k043j872j266l03M75O14J12o79j351j578
56733G7756j226m25M16Q07O38L32M02Q39J205J264J064N41l60j076p17O58J823
56716H3941J898J386J182J302J289J194J244J121N76K03N54R51L65p75j034j64
56700I5233N66L29j90k02K1j4L6P34J822K523K546K217J940J909K153K501K684
56683A16808K666K692K870L013K982K864K767K687K683K853L135L333L350L191
56669A57894K846K492K474K801K869K264J532J579K420L277L774M300N131N857
$$ plain form
56655 201510 207441 212692 216757 219530 221374 222882 224310 225317 225307 223712 220003 213991 206383 198530 191143
56640 191143 183572 174646 163962 152144 140276 129423 120214 112324 104677 96604 88606 81612 75829
56627 75829 70769 66150 62218 59305 57370 55922 54190 51692 48904 46984 46523 46880 47099 47045 47261 48097
56611 48097 49482 51222 53037 54551 55593 56264 56461 55875 54829 54448 55377 56889 58056 59249 61500 64742
56595 64742 67756 69811 71348 72965 74703 76526 78647 81000 83091 84740 86441 88586 90747 92152
56581 92152 92529 92198 91595 91017 90676 90665 90936 91435 92221 93322 94543 95566 96370 97445 99396 102185 104985
56564 104985 107150 109187 112347 117244 123387 130104 137273 144849 152267 158832 164268 168457 171040 171828
56550 171828 171353 170567 170144 170311 170966 171556 171259 169810 167871 166163 164566 162590 160386 158663 157736 157119
$$ packed form
56655B01510N931N251M065K773J844J508J428J007j0j595l709o012p608p853p387
56640A91143p571q926j0684j1818j1868j0853r209p890p647q073p998o994n783
56627G5829n060m619l932k913j935j448j732k498k788j920m61L57K19n4K16Q36
56611D8097J385J740J815J514J042O71J97n86j046l81R29J512J167J193K251L242
56595F4742L014K055J537J617J738J823K121K353K091J649J701K145K161J405
56581I2152L77l31o03n78l41j1K71M99P86J101J221J023Q04J075J951K789K800
56564A04985K165K037L160M897O143O717P169P576P418O565N436M189K583P88
56550A71828m75p86m23J67O55N90k97j449j939j708j597j976k204j723r27o17
$$ plain form
56534 157119 156003 153867 150859 147886 145959 145160 144606 143692 142758 142223 141788 141136 140746 141157 141997 142561 142866
56517 142866 143260 143465 142976 142039 141198 140203 138514 136673 135892 136256 136527 135977 135332 135576 136797 138586 140623
56500 140623 142342 142833 141869 140586 140492 141916 143811 145002 145328 145595 146494 147723 148346 148012 147332 146856 146274
56483 146274 145186 144056 143643 143802 143709 143066 142286 141573 140693 139678 138962 138614 138122 137126 135965 135403 136104 138201
56465 138201 140964 143166 144250 144853 145712 146559 146828 146906 147645 148987 150099 150681 151013 150893 149789 148125 147207
56448 147207 147577 148461 149151 149926 151280 153094 154907 156282 156678 155802 154328 153504 153769 154473 155072 155718 156481
56431 156481 156925 156839 156624 156660 157013 157917 159692 161936 163709 164826 166092 167957 169809 170980 171541 171679 171225
56414 171225 170321 169739 169914 170285 170149 169632 169391 169913 171390 173631 175740 176612 176136 175338 175048 175186 175581 176558
$$ packed form
56534A57119j116k136l008k973j927p99n54r14r34n35m35o52l90M11Q40N64L05
56517A42866L94K05m89r37q41r95j689j841p81L64K71n50o45K44J221J789K037
56500A40623J719M91r64j283r4J424J895J191L26K67Q99J229O23l34o80m76n82
56483A46274j088j130m13J59r3o43p80p13q80j015p16l48m92r96j161n62P01K097
56465A38201K763K202J084O03Q59Q47K69P8P39J342J112N82L32j20j104j664r18
56448A47207L70Q84O90P75J354J814J813J375L96q76j474q24K65P04N99O46P63
56431A56481M44q6k15L6L53R04J775K244J773J117J266J865J852J171N61J38m54
56414A71225r04n82J75L71j36n17k41N22J477K241K109Q72m76p98k90J38L95R77
$$ plain form
56396 176558 178212 179920 181122 181912 182406 182278 181495 180758 180639 180841 180853 180712 180633 180464 179993 179242 178047 176003
56378 176003 173261 170787 169396 169116 169717 171103 172818 174093 174903 176145 178255 180548 182468 184460 186836
56363 186836 188772 189518 189865 191272 193958 196840 199015 200426 201310 201847 202229 202486 202435 202214 202522 203825 205730
56346 205730 207557 209098 210389 211341 212178 213672 216252 219299 221890 223808 225315 226451 227215 227974 229093
56331 229093 230539 232353 234967 238469 242058 244896 247060 249077 251046 252873 254897 257552 260727 263915
56317 263915 266643 268330 268449 267432 266792 267558 269093 270144 270505 270863 271513 272215 273024 274458 276957 280721
56301 280721 285741 291462 296831 301322 305550 310331 315615 320955 326422 332218 337822 342443 346112 349592
56287 349592 353428 357765 362784 368632 375081 381851 389105 397119 405741 414624 423715 433085 442669 452557
$$ packed form
56396A76558J654J708J202P90M94j28p83p37j19K02J2j41p9j69m71p51j195k044
56378A76003k742k474j391k80O01J386J715J275Q10J242K110K293J920J992K376
56363A86836J936P46L47J407K686K882K175J411Q84N37L82K57n1k21L08J303J905
56346B05730J827J541J291R52Q37J494K580L047K591J918J507J136P64P59J119
56331B29093J446J814K614L502L589K838K164K017J969J827K024K655L175L188
56317B63915K728J687J19j017o40P66J535J051L61L58O50P02Q09J434K499L764
56301B80721N020N721N369M491M228M781N284N340N467N796N604M621L669L480
56287C49592L836M337N019N848O449O770P254Q014Q622Q883R091R370R584R888
$$ plain form
56273 452557 463119 474489 486463 499260 513616 529616 546272 562963 580551 600254 622092
56262 622092 645395 670244 697453 727558 760770 797604 838774 884799 936445 995109 1062016
56251 1062016 1137382 1221011 1313260 1414787 1525899 1646759 1777533 1917548 2064900 2217581
56241 2217581 2374168 2532511 2688574 2837737 2976590 3102351 3211259 3298996 3362476 3400200
56231 3400200 3411336 3395737 3354715 3290745 3206568 3105294 2990748 2866548 2735135 2598644
56221 2598644 2460120 2322682 2187980 2056722 1930354 1810876 1699216 1595091 1498337 1409155
56211 1409155 1327142 1251330 1181319 1117337 1059205 1006111 957388 912715 871739 834264 800477
56200 800477 770218 742479 716547 693097 673079 656058 640799 626982 615003 604535 594725 585575
$$ packed form
56273D52557J0562J1370J1974J2797J4356J6000J6656J6691J7588J9703K1838
56262F22092K3303K4849K7209L0105L3212L6834M1170M6025N1646N8664O6907
56251A062016P5366Q3629R2249J01527J11112J20860J30774J40015J47352J52681
56241B217581J56587J58343J56063J49163J38853J25761J08908Q7737O3480L7724
56231C400200J1136j5599m1022o3970q4177j01274j14546j24200j31413j36491
56221B598644j38524j37438j34702j31258j26368j19478j11660j04125r6754q9182
56211A409155q2013p5812p0011o3982n8132n3094m8723m4673m0976l7475l3787
56200H00477l0259k7739k5932k3450k0018j7021j5259j3817j1979j0468r810r150
$$ plain form
56188 585575 577769 571285 565474 560302 556183 552761 549186 545431 542046 538816 535160 531776 530314 531224
56174 531224 533264 535351 537572 540152 542660 544651 546193 547552 549106 551515 555133 559375 563600 568343
56160 568343 574668 582604 591352 600695 611055 622385 634337 647243 661652 677176 693162 710311
56148 710311 730225 753577 780202 810905 847688 892174 945094 1007126 1078761 1159362 1247676
56137 1247676 1342938 1443848 1546592 1645538 1736123 1815949 1883793 1939771 1986613 2028626 2068572
56126 2068572 2106537 2141486 2171959 2195235 2208046 2209215 2200526 2184836 2164436 2140747 2113371 2078970
56114 2078970 2032902 1972708 1899048 1813698 1718808 1618383 1518274 1423612 1337261 1260785 1195108
56103 1195108 1139830 1093553 1055373 1024735 999943 978717 960410 945845 934864 926100 919324 915684
$$ packed form
56188E85575p806o484n811n172m119l422l575l755l385l230l656l384j462R10
56174E31224K040K087K221K580K508J991J542J359J554K409L618M242M225M743
56160E68343O325P936Q748R343J0360J1330J1952J2906J4409J5524J5986J7149
56148G10311J9914K3352K6625L0703L6783M4486N2920O2032P1635Q0601Q8314
56137A247676R5262J00910J02744R8946R0585P9826O7844N5978M6842M2013L9946
56126B068572L7965L4949L0473K3276J2811J169q689j5690k0400k3689k7376l4401
56114B078970m6068o0194p3660q5350r4890j00425j00109r4662q6351p6476o5677
56103A195108n5278m6277l8180l0638k4792k1226j8307j4565j0981q764o776l640
$$ plain form
56091 915684 915097 915625 916121 917375 919886 922663 925191 928512 933283 938569 943676 949513 957073 966015 975669
56076 975669 986064 997163 1008512 1020257 1033075 1046613 1059537 1071636 1084311 1098564 1114140
56065 1114140 1130890 1149073 1167976 1186256 1204114 1223133 1243512 1263615 1282690 1301784 1321382
56054 1321382 1340459 1358547 1376419 1394063 1410398 1425803 1442417 1461075 1480320 1499390 1519654
56043 1519654 1542088 1565823 1590236 1616041 1643194 1670265 1697111 1725721 1757182 1790183 1823653
56032 1823653 1858372 1894835 1932088 1969961 2009957 2052685 2096890 2142094 2189552 2239568 2290687
56021 2290687 2342632 2397089 2454465 2513101 2572957 2636691 2705542 2777561 2851488 2928929 3010931
56010 3010931 3096015 3183550 3275547 3373009 3473988 3577387 3685330 3799710 3919957 4046163
$$ packed form
56091I15684n87N28M96J254K511K777K528L321M771N286N107N837P560Q942R654
56076I75669J0395J1099J1349J1745J2818J3538J2924J2099J2675J4253J5576
56065A114140J6750J8183J8903J8280J7858J9019K0379K0103J9075J9094J9598
56054A321382J9077J8088J7872J7644J6335J5405J6614J8658J9245J9070K0264
56043A519654K2434K3735K4413K5805K7153K7071K6846K8610L1461L3001L3470
56032A823653L4719L6463L7253L7873L9996M2728M4205M5204M7458N0016N1119
56021B290687N1945N4457N7376N8636N9856O3734O8851P2019P3927P7441Q2002
56010C010931Q5084Q7535R1997R7462J00979J03399J07943J14380J20247J26206
$$ plain form
56000 4046163 4180578 4323817 4473523 4629094 4793599 4968635 5151611 5340862 5539104
55991 5539104 5748958 5969549 6200665 6445743 6707410 6984611 7277635 7591555 7931180
55982 7931180 8297112 8690118 9114555 9574023 10068993 10602565 11183309 11818658 12511290
55973 12511290 13265928 14093591 15005154 16007878 17113378 18342446 19717652 21259468
55965 21259468 22995659 24967176 27220506 29805322 32788507 36263933 40345513 45166046
55957 45166046 50895521 57754270 66005799 75954445 87959785 102436059 119826025 140588505
55949 140588505 165198547 194076745 227396611 264815255 305145631 345939909 383189249
55942 383189249 411705857 426561299 425031731 407768205 378352184 341665847 302264355
$$ packed form
56000D046163J34415J43239J49706J55571J64505J75036J82976J89251J98242
55991E539104K09854K20591K31116K45078K61667K77201K93024L13920L39625
55982G931180L65932L93006M24437M59468M94970N33572N80744O35349O92632
55973A2511290P54638Q27663R11563J002724J105500J229068J375206J541816
55965B1259468J736191J971517K253330K584816K983185L475426M081580M820533
55957D5166046N729475O858749Q251529R948646J2005340J4476274J7389966K0762480
55949A40588505K4610042K8878198L3319866L7418644M0330376M0794278L7249340
55942C83189249K8516608J4855442j529568j7263526k9416021l6686337l9401492
$$ plain form
55935 302264355 263537897 227606351 195533627 167620226 143709128 123433789 106350651
55928 106350651 91996004 79933454 69788572 61244028 54020293 47878235 42628941
55921 42628941 38122633 34231012 30847932 27895500 25314019 23048198 21049524 19283237
55913 19283237 17721789 16335580 15097463 13990308 13001670 12115372 11315180 10591703 9938312
55904 9938312 9344421 8799413 8299101 7841757 7421261 7030205 6666376 6330303 6019276
55895 6019276 5729141 5459226 5210404 4980778 4767724 4571472 4392309 4226966 4072061
55886 4072061 3928407 3797690 3677456 3563431 3454089 3348836 3244438 3137934 3031227
55877 3031227 2928673 2831798 2739895 2653591 2573694 2498109 2423791 2350553 2279792 2211125 2143588
$$ packed form
55935C02264355l8726458l5931546l2072724k7913401k3911098k0275339j7083138
55928A06350651j4354647j2062550j0144882q544544p223735o142058n249294
55921D2628941m506308l891621l383080k952432k581481k265821j998674j766287
55913A9283237j561448j386209j238117j107155r88638q86298q00192p23477o53391
55904I938312n93891n45008n00312m57344m20496l91056l63829l36073l11027
55895F019276k90135k69915k48822k29626k13054j96252j79163j65343j54905
55886D072061j43654j30717j20234j14025j09342j05253j04398j06504j06707
55877C031227j02554r6875r1903q6304p9897p5585p4318p3238p0761o8667o7537
$$ plain form
55866 2143588 2078458 2017440 1959477 1902694 1848134 1798195 1752540 1708739 1665914 1624591 1583970
55855 1583970 1542489 1500623 1460406 1422638 1386825 1353092 1321905 1292595 1264210 1236986 1211189
55844 1211189 1185640 1159333 1133276 1108799 1085331 1061780 1038744 1017253 996818 976848 958470
55833 958470 942573 927462 910926 893438 876887 861455 846309 832219 820665 811135 801820 792276
55821 792276 783020 773357 762122 749959 738373 727098 714819 701898 689984 679346 669061 659460
55809 659460 651916 646383 641448 636782 633365 631271 629389 627483 626620 627408 629521 632987 638155 644286 649817
55794 649817 654099 657405 659359 658993 656444 653023 649460 645385 640596 635531 630433 625108 619382 612744
55780 612744 603935 592116 578227 564179 551201 540165 532759 530678 533918 541290 552226 566541
$$ packed form
55866B143588o5130o1018n7963n6783n4560m9939m5655m3801m2825m1323m0621
55855A583970m1481m1866m0217l7768l5813l3733l1187k9310k8385k7224k5797
55844A211189k5549k6307k6057k4477k3468k3551k3036k1491k0435j9970j8378
55833I58470j5897j5111j6536j7488j6551j5432j5146j4090j1554r530r315r544
55821G92276r256r663j1235j2163j1586j1275j2279j2921j1914j0638j0285r601
55809F59460p544n533m935m666l417k094j882j906q63P88K113L466N168O131N531
55794F49817M282L306J954l66k549l421l563m075m789n065n098n325n726o638
55780F12744q809j1819j3889j4048j2978j1036p406k081L240P372J0936J4315
$$ plain form
55768 566541 582613 597179 606827 608802 601356 585189 564232 543151 524000 506432 490493 477224
55756 477224 466771 457942 449929 442811 436146 428695 419922 410437 400659 390313 379447 368740 358591
55743 358591 349060 340786 334735 330834 328079 326110 325511 326238 326928 326154 323532 319453 314628 310075 306648
55728 306648 304271 302158 299730 296759 293014 288587 284224 280455 276794 272742 269015 266609 265241 264080
55714 264080 263535 264736 267553 270890 274802 280472 287797 294664 299145 301043 300936 299169 296322 293287 290154
55699 290154 286016 280484 274329 268166 261524 253860 245656 237864 231018 225403 221394 219024 217717 216861
55685 216861 216271 215980 216050 216741 218274 220379 222638 225256 228806 233253 237882 242130 245711 248037 248525 247516
55669 247516 246012 244388 242201 239339 236394 233774 231337 229178 227859 227575 227857 228389 229471 231370 233815
$$ packed form
55768E66541J6072J4566R648J975p446j6167k0957k1081j9151j7568j5939j3269
55756D77224j0453q829q013p118o665p451q773r485r778j0346j0866j0707j0149
55743C58591r531q274o051l901k755j969n99P27O90p74k622m079m825m553l427
55728C06648k377k113k428k971l745m427m363l769l661m052l727k406j368j161
55714B64080n45J201K817L337L912N670P325O867M481J898j07j767k847l035l133
55699B90154m138n532o155o163o642p664q204p792o846n615m009k370j307q56
55685B16861n90k91P0O91J533K105K259K618L550M447M629M248L581K326M88j009
55669B47516j504j624k187k862k945k620k437k159j319k84K82N32J082J899K445
$$ plain form
55654 233815 236332 238581 240319 241586 242879 244591 246409 247888 249315 251141 252839 253312 252381 250785 248796
55639 248796 245914 241979 237440 232350 226211 219115 212066 205833 200359 195478 191276 187513 183672 179887
55625 179887 176890 174769 172773 170635 169048 168366 167850 166763 165320 163932 162246 159671 156302 152786 149675
55610 149675 147295 145744 144641 143318 141577 139860 138504 137311 136037 134789 133788 133138 132924 133004 132805
55595 132805 131882 130645 129836 129390 128587 127278 126085 125393 125040 125017 125535 126277 126583 126542 126959 128105 129458 130807
55577 130807 132529 134610 136485 138132 140211 142836 145495 148545 153418 160528 168149 174234 178412 181382
55563 181382 183292 183781 182974 181429 179387 176725 173299 168941 163645 158050 153130 149061 145185 141384 138517
55548 138517 136953 135689 133752 131611 130342 130054 130002 129672 128974 127862 126550 125652 125452 125498 125480 125919 127328
$$ packed form
55654B33815K517K249J738J267J293J712J818J479J427J826J698M73r31j596j989
55639B48796k882l935m539n090o139p096p049o233n474m881m202l763l841l785
55625A79887k997k121j996k138j587o82n16j087j443j388j686k575l369l516l111
55610A49675k380j551j103j323j741j717j356j193j274j248j001o50k14Q0j99
55595A32805r23j237q09m46q03j309j193o92l53k3N18P42L06m1M17J146J353J349
55577A30807J722K081J875J647K079K625K659L050M873P110P621O085M178K970
55563A81382J910M89q07j545k042k662l426m358n296n595m920m069l876l801k867
55548A38517j564j264j937k141j269k88n2l30o98j112j312q98k00M6j8M39J409
$$ plain form
55531 127328 129255 130845 131818 132244 131973 131063 130249 130145 130348 130025 128987 127527 125712 123590 121710 120595
55515 120595 119988 119246 118206 117086 115880 114471 113008 111552 109723 107292 104715 102509 100590 98892 98102
55500 98102 98928 100959 103061 104632 105726 106311 106231 105692 104984 103912 102277 100638 99708 99167 97972 95872
55484 95872 93754 92408 91724 91245 90798 90377 90037 90115 91028 92551 93749 93915 93289 92604 92174 91679 90751 89574
55466 89574 88768 88630 88645 88092 87140 86898 88115 90251 92100 92970 92917 92222 91137 89966 88966 88222 87822 87984
55448 87984 88808 90073 91446 92585 93051 92566 91534 90728 90239 89328 87672 86097 85570 86015 86672 87103 87307
55431 87307 87335 87413 88020 89195 90159 90243 89859 89954 90851 92143 93337 94051 94026 93683 94222 96353 99272 101709 103653
55412 103653 106078 109159 111827 113130 113104 112094 110109 107299 104431 102361 101246 100544 99647 98366 96916
$$ packed form
55531A27328J927J590R73M26k71r10q14j04K03l23j038j460j815k122j880j115
55515A20595o07p42j040j120j206j409j463j456j829k431k577k206j919j698p90
55500I8102Q26K031K102J571J094N85q0n39p08j072j635j639r30n41j195k100
55484I5872k118j346o84m79m47m21l40P8R13J523J198J66o26o85m30m95r28j177
55466H9574q06j38J5n53r52k42J217K136J849Q70n3o95j085j171j000p44m00J62
55448H7984Q24J265J373J139M66m85j032q06m89r11j656j575n27M45O57M31K04
55431H7307K8P8O07J175R64Q4l84R5Q97J292J194P14k5l43N39K131K919K437J944
55412A03653K425L081K668J303k6j010j985k810k868k070j115p02q97j281j450
$$ plain form
55397 96916 95542 94272 93120 92347 92092 91811 90787 89318 88629 89220 90134 90402 90354 90709 91189 91116 90788 91018
55379 91018 91674 91907 91718 92045 93139 94014 93857 93048 92399 92113 91954 91829 91751 91561 91052 90183 89075 87932
55361 87932 86910 85934 84795 83716 83410 84155 85183 85494 84973 84153 83310 82494 82084 82446 83296 84188 85345
55344 85345 87071 88600 88647 87116 85187 83656 82253 80806 79923 80078 80849 81578 82086 82363 82235 81760 81410
55327 81410 81394 81310 80757 79884 79104 78690 78815 79500 80410 81234 82238 83756 85166 85334 84341 83736 84547 85942
55309 85942 86547 86288 86064 86124 85783 84559 82820 81243 80257 80074 80779 82163 83688 84796 85287 85476 85935
55292 85935 86993 88454 89943 91389 92949 94577 95938 96672 96430 94939 92511 90273 89195 88928 88230
55277 88230 86572 84641 83209 82311 81750 81638 81950 82136 81762 81202 81304 82543 84709 87120 88985 89859 89889
$$ packed form
55397I6916j374j270j152p73k55k81j024j469o89N91R14K68m8L55M80p3l28K30
55379I1018O56K33j89L27J094Q75j57q09o49k86j59j25p8j90n09q69j108j143
55361H7932j022r76j139j079l06P45J028L11n21q20q43q16m10L62Q50Q92J157
55344H5345J726J529M7j531j929j531j403j447q83J55P71P29N08K77j28m75l50
55327H1410j6q4n53q73p80m14J25O85R10Q24J004J518J410J68r93o05Q11J395
55309H5942O05k59k24O0l41j224j739j577r86j83P05J384J525J108M91J89M59
55292H5935J058J461J489J446J560J628J361P34k42j491k428k238j078k67o98
55277H8230j658j931j432q98n61j12L12J86l74n60J02J239K166K411J865Q74L0
$$ plain form
55260 89889 89431 88550 87350 86576 87106 88756 90345 91131 91418 91603 91459 90823 90154 89842 89622 89272 89248 89932
55242 89932 90793 91038 90761 90634 90696 90241 88909 87295 86315 86273 86668 86762 86300 85677 85314 85050 84529 84083 84579
55223 84579 86214 88117 89422 90139 90633 90881 90758 90481 90193 89576 88459 87386 86972 87064 87218 87631 88784
55206 88784 90336 91159 90590 89065 87424 86108 85190 84732 84834 85449 86319 87051 87354 87267 87023 86698 86231 85817
55188 85817 85861 86318 86484 85823 84674 83850 83791 84402 85383 86308 86676 86342 85746 85420 85425 85539 85654 85656 85256 84387 83537
55167 83537 83218 83343 83514 83729 84339 85445 86770 88036 89112 89938 90622 91476 92620 93688 94261 94427 94586
55150 94586 94931 95456 96249 97367 98590 99689 100668 101364 101108 99408 96829 94634 93481 92947 92303 91308 90178
55133 90178 89147 88271 87492 86852 86643 87187 88385 89766 91124 92657 94223 94995 94358 92806 91387 90570
$$ packed form
55260H9889m58q81j200p74N30J650J589P86K87J85j44o36o69l12k20l50k4O84
55242H9932Q61K45k77j27O2m55j332j614r80m2L95R4m62o23l63k64n21m46M96
55223H4579J635J903J305P17M94K48j23k77k88o17j117j073m14R2J54M13J153
55206H8784J552Q23n69j525j641j316r18m58J02O15Q70P32L03q7k44l25m67m14
55188H5817M4M57J66o61j149q24n9O11R81R25L68l34n96l26NJ14J15Km00q69q50
55167H3537l19J25J71K15O10J106J325J266J076Q26O84Q54J144J068N73J66J59
55150I4586L45N25P93J118J223J099R79O96k56j700k579k195j153n34o44r95j130
55133I0178j031q76p79o40k09N44J198J381J358J533J566P72o37j552j419q17
$$ plain form
55117 90570 90176 90121 90512 91124 91474 91406 91198 91137 91407 92188 93373 94399 94865 95121 95696 96415 96744 96728 96811 96958
55097 96958 96820 96644 97020 97783 98183 98259 98938 100396 101477 101304 100564 100439 100967 101288 100972 100351 99868 99810 100444
55078 100444 101735 103099 103904 104123 104118 104051 103925 103893 104022 103967 103372 102427 101555 100786 99958 99323 99285 99613 99569 98916
55058 98916 98181 97802 97558 97050 96251 95255 93982 92540 91496 91280 91491 91316 90644 90296 90994 92444 93622
55041 93622 93816 93211 92578 92642 93649 95331 97172 98768 99992 100873 101419 101633 101566 101239 100595 99681 98739 97904
55023 97904 96929 95608 94408 94230 95292 96664 97265 96999 96516 96136 95564 94633 93762 93423 93549 93745 93898 94267
55005 94267 95007 95863 96430 96664 96976 97743 98819 99702 100165 100453 100751 100840 100494 99961 99670 99672 99814 100349 101790
54986 101790 104012 105943 106498 105647 104324 103406 102945 102337 101109 99493 98227 97750 97689 97314 96456 95759 95962
$$ packed form
55117I0570l94n5L91O12L50o8k08o1K70P81J185J026M66K56N75P19L29j6Q3J47
55097I6958j38j76L76P63M00P6O79J458J081j73p40j25N28L21l16o21m83n8O34
55078A00444J291J364Q05K19no7j26l2J29n5n95r45q72p69q28o35l8L28m4o53
55058I8916p35l79k44n08p99r96j273j442j044k16K11j75o72l48O98J450J178
55041I3622J94o05o33O4J007J682J841J596J224Q81N46K14o7l27o44r14r42q35
55023I7904r75j321j200j78J062J372O01k66m83l80n72r31q71l39J26J96J53L69
55005I4267P40Q56N67K34L12P67J076Q83M63K88K98Q9l46n33k91KJ42N35J441
54986A01790K222J931N55q51j323r18m61o08j228j616j266m77o1l75q58o97K03
$$ plain form
54969 95962 97131 98703 100134 101322 102394 103300 103801 103896 104028 104639 105619 106523 107332 108543 110407 112472 114152
54952 114152 115316 115999 115976 115160 114083 113341 112722 111591 110054 109000 108880 109143 109153 109017 109151 109537 109838 109861
54934 109861 109517 108700 107636 107100 107712 109188 110693 111853 113007 114488 116135 117673 119256 121449 124863
54919 124863 129924 136749 144922 153391 160910 166823 171360 174933 177234 177373 175089 171404 167677 164165
54905 164165 160058 154919 149483 144804 141053 137594 134023 130692 128185 126542 125164 123398 121222 119315
54891 119315 118391 118490 119041 119536 119897 120186 120303 120160 119963 120129 121042 123022 126290 130707 135630 140286 144368
54874 144368 148207 152363 157155 162461 167816 172657 176543 179206 180446 180098 178106 174603 169887 164385
54860 164385 158611 153005 147822 143200 139303 136206 133699 131373 128933 126309 123501 120548 117684 115255
$$ packed form
54969I5962J169J572J431J188J072R06N01R5J32O11R80R04Q09J211J864K065J680
54952A14152J164O83k3q16j077p42o19j131j537j054j20K63J0j36J34L86L01K3
54934A09861l44q17j064n36O12J476J505J160J154J481J647J538J583K193L414
54919A24863N061O825Q173Q469P519N913M537L573K301J39k284l685l727l512
54905A64165m107n139n436m679l751l459l571l331k507j643j378j766k176j907
54891A19315r24R9N51M95L61K89J17j43j97J66R13J980L268M417M923M656M082
54874A44368L839M156M792N306N355M841L886K663J240l48j992l503m716n502
54860A64385n774n606n183m622l897l097k507k326k440k624k808k953k864k429
$$ plain form
54846 115255 113386 111911 110705 109808 109053 107862 105751 103010 100595 99314 99249 99947 100906 101744 102122 101858
54830 101858 101184 100666 100652 100926 101129 101373 102104 103317 104367 104744 104666 104675 104938 105310 105781 106376 106782 106536 105647
54811 105647 104698 104381 105088 106726 108589 109715 109872 109964 110895 112289 113059 113056 113200 113879 114280 113752 112904 112701
54793 112701 113106 113354 113123 112699 112316 112047 112155 112890 114020 115071 116022 117265 118875 120319 120971 120658 119750
54776 119750 118932 118827 119575 120879 122504 124498 126759 128855 130707 133060 136678 141307 146049 150669 155894
54761 155894 162358 169829 177487 184422 189683 192447 192520 190396 186643 181532 175417 169087 163336 158287 153410
54746 153410 148206 142778 137823 134078 131677 130026 128391 126625 125172 124404 124165 123972 123504 122853 122399 122444
54730 122444 122877 123283 123516 123978 125121 126893 128977 131422 134584 138487 142717 147008 151542 156550 161951
$$ packed form
54846A15255j869j475j206q97p55j191k111k741k415j281o5O98R59Q38L78k64
54830A01858o74n18j4K74K03K44P31J213J050L77p8RK63L72M71N95M06k46q89
54811A05647r49l17P07J638J863J126J57R2R31J394P70lJ44O79M01n28q48k03
54793A12701M05K48k31m24l83k69J08P35J130J051R51J243J610J444O52l13r08
54776A19750q18j05P48J304J625J994K261K096J852K353L618M629M742M620N225
54761A55894O464P471P658O935N261K764P3k124l753n111o115o330n751n049m877
54746A53410n204n428m955l745k401j651j635j766j453p68k39j93m68o51m54M5
54730A22444M33M06K33M62J143J772K084K445L162L903M230M291M534N008N401
$$ plain form
54715 161951 167469 172708 176997 179563 180070 178724 175785 171382 165948 160302 154927 149550 143842 138202
54701 138202 133480 130123 127982 126696 125837 124896 123660 122525 121996 121971 121938 121775 121754 121749 121055 119321 117217 115804
54683 115804 115404 115321 114535 112608 110154 108480 108475 109715 110935 111465 111783 112510 113426 113918 113971 114083 114397 114556
54665 114556 114410 114265 114347 114456 114289 113738 112796 111551 110441 110062 110485 111114 111403 111410 111445 111620 112117 113435 115754
54646 115754 118216 119481 119079 117802 116645 115762 114680 113236 111961 111543 112113 113137 113983 114470 114806 115012
54630 115012 114687 113477 111688 110239 109956 110867 112130 112731 112449 112096 112528 113522 114064 113767 113400 113749 114526
54613 114526 114894 114581 113912 113131 112388 112106 112631 113614 114394 114897 115432 115750 115203 113953 113127 113334 113787 113353
54595 113353 111982 110599 110002 110300 111119 111925 112346 112484 112774 113377 113987 114362 114663 115063 115370 115274 114655 113523
$$ packed form
54715A61951N518N239M289K566N07j346k939m403n434n646n375n377n708n640
54701A38202m722l357k141j286q59r41j236j135n29k5l3j63k1no94j734k104j413
54683A15804m00q3p86j927k454j674nJ240J220N30L18P27R16M92N3J12L14J59
54665A14556j46j45Q2J09j67n51r42j245j110l79M23O29K89PL5J75M97J318K319
54646A15754K462J265m02j277j157q83j082j444j275m18N70J024Q46M87L36K06
54630A15012l25j210j789j449k83R11J263O01k82l53M32R94N42k97l67L49P77
54613A14526L68l13o69p81p43k82N25R83P80N03N35L18n47j250q26K07M53m34
54595A13353j371j383n97K98Q19Q06M21J38K90O03O10L75L01M00L07r6o19j132
$$ plain form
54577 113523 112054 110845 110643 111528 112722 113446 113532 113062 112110 111245 111566 113520 116064 117651 117853 117448 117208
54560 117208 117193 117144 116998 116985 117491 118683 120082 120852 120807 120717 121240 122071 122631 123072 123868 124845 125520 126163 127625
54541 127625 130061 132604 134392 135295 135617 135708 135864 136051 135666 134161 131887 129743 128070 126565 125287 124865
54525 124865 125488 126407 126797 126561 126013 125324 124594 124010 123559 122962 122130 121370 120913 120608 120284 120012 119872 119759 119620
54506 119620 119490 119217 118585 117819 117494 117787 118308 118848 119688 120887 121774 121588 120298 118485 116789 115731 115667
54489 115667 116509 117806 119324 121186 123226 124729 125273 125390 125857 126596 126826 126130 124934 124015 123888 124588 125685
54472 125685 126545 126793 126551 126196 126106 126665 128112 130140 131969 133099 133669 134001 134247 134744 136044 138036 139508
54455 139508 139331 137853 136475 135978 135897 135420 134278 132721 131211 130213 129806 129386 128248 126524 125131 124659
$$ packed form
54577A13523j469j209k02Q85J194P24Q6m70r52q65L21J954K544J587K02m05k40
54560A17208j5m9j46j3N06J192J399P70m5r0N23Q31N60M41P96R77O75O43J462
54541A27625K436K543J788R03L22R1J56J87l85j505k274k144j673j505j278m22
54525A24865O23R19L90k36n48o89p30n84m51n97q32p60m57l05l24k72j40j13j39
54506A19620j30k73o32p66l25K93N21N40Q40J199Q87j86j290j813j696j058o4
54489A15667Q42J297J518J862K040J503N44J17M67P39K30o96j196r19j27P00J097
54472A25685Q60K48k42l55r0N59J447K028J829J130N70L32K46M97J300J992J472
54455A39508j77j478j378m97q1m77j142j557j510r98m07m20j138j724j393m72
$$ plain form
54439 124659 124786 124951 125115 125524 126105 126520 126664 126767 127046 127506 128080 128774 129628 130655 131872 133283 134815
54422 134815 136278 137484 138386 139059 139505 139559 139130 138493 138175 138432 138950 139155 138814 138307 138274 138959 139901 140403 140329
54403 140329 140199 140375 140556 140406 140279 140706 141367 141380 140657 140152 140478 141077 141213 141097 141385 142052 142518 142613 142710 143023
54383 143023 143383 143694 144066 144491 144809 145023 145277 145576 145898 146456 147438 148543 149274 149757 150813 153067 156278
54366 156278 159637 162505 164831 167118 170002 173606 177275 180141 181913 182876 183194 182624 181021 178800 176687
54351 176687 175070 173671 171763 168791 164895 160778 157089 154061 151770 150321 149525 148745 147513 146045 144830
54336 144830 143918 143036 142157 141400 140556 139284 137733 136459 135717 135368 135376 135791 136254 136183 135653 135474 136107 137134
54318 137134 138058 139069 140501 141978 142683 142348 141484 140700 140154 139709 139378 139431 140074 141053 141693 141505 140695 139864
$$ packed form
54439A24659J27J65J64M09N81M15J44J03K79M60N74O94Q54J027J217J411J532
54422A34815J463J206R02O73M46N4m29o37l18K57N18K05l41n07l3O85R42N02p4
54403A40329j30J76J81j50j27M27O61J3p23n05L26N99J36j16K88O67M66R5R7L13
54383A43023L60L11L72M25L18K14K54K99L22N58R82J105P31M83J056K254L211
54366A56278L359K868K326K287K884L604L669K866J772R63L18n70j603k221k113
54351A76687j617j399j908k972l896m117l689l028k291j449p96p80j232j468j215
54336A44830r12q82q79p57q44j272j551j274p42l49QM15M63p1n30j79O33J027
54318A37134R24J011J432J477P05l35q64p84n46m45l31N3O43R79O40j88q10q31
$$ plain form
54300 139864 139244 138546 137564 136635 136366 137052 138482 140168 141714 143071 144337 145278 145333 144438 143504 143464 144032 144106
54282 144106 143359 142688 142865 143541 143984 144121 144237 144178 143533 142378 141251 140533 140360 140964 142514 144580 146311
54265 146311 147298 147922 148715 149696 150577 151349 152355 153798 155400 156716 157639 158414 159162 159692 159880 159900 159811 159209
54247 159209 157736 155768 154124 153155 152583 152165 151919 151603 150682 149093 147515 146557 146112 145840 145824 146297 147109
54230 147109 147957 148871 150014 151160 151824 151819 151368 150732 150000 149155 148178 147134 146226 145575 144983 144249 143739 144069
54212 144069 145058 145585 144831 143145 141316 139641 138240 137651 138225 139296 139816 139684 139706 140300 141032 141460 141758
54195 141758 142293 143101 143988 144737 145152 145182 145076 145161 145566 146343 147560 148875 149404 148665 147368 146594 146407 146119
54177 146119 145759 146213 147731 149284 149803 149296 148357 147389 146791 147151 148501 149849 150187 149732 149568 150280 151394
$$ packed form
54300A39864o20o98r82r29k69O86J430J686J546J357J266R41N5q95r34m0N68P4
54282A44106p47o71J77O76M43J37J16n9o45j155j127p18j73O04J550K066J731
54265A46311R87O24P93R81Q81P72J006J443J602J316R23P75P48N30J88K0q9o02
54247A59209j473j968j644r69n72m18k46l16r21j589j578r58m45k72j6M73Q12
54230A47109Q48R14J143J146O64nm51o36p32q45r77j044r08o51n92p34n10L30
54212A44069R89N27p54j686j829j675j401n89N74J071N20j32K2N94P32M28K98
54195A41758N35Q08Q87P49M15L0j06Q5M05P77J217J315N29p39j297p74j87k88
54177A46119l60M54J518J553N19n07r39r68n98L60J350J348L38m55j64P12J114
$$ plain form
54160 151394 152047 151795 150874 149949 149498 149288 148682 147583 146662 146405 146406 146040 145363 144869 144674 144521 144331 144164 143802
54141 143802 143004 142091 141739 142108 142695 143095 143475 144175 145227 146431 147597 148592 149397 150135 150826 151118 150654 149744
54123 149744 149256 149632 150370 150693 150451 150034 149684 149356 149205 149698 151015 152687 154071 155091 156211 157752 159570
54106 159570 161413 163283 165220 167057 168725 170649 173448 177253 181687 186483 191713 197332 202923 208107
54092 208107 212838 216989 219868 220476 218198 213179 206273 198793 191996 186506 182196 178739 176102 174459
54078 174459 173919 174499 176090 178297 180595 182851 185412 188488 191851 195331 199095 203035 206309 208078 208362
54063 208362 207642 205942 203045 199430 196161 193759 191741 189431 186742 184118 182201 181585 182392 184002 185605
54048 185605 187066 188864 191248 194011 197007 200257 203524 206511 209592 213622 218834 224598 230478 236675
$$ packed form
54160A51394O53k52r21r25m51k10o06j099r21k57Jl66o77m94j95j53j90j67l62
54141A43802p98r13l52L69N87M00L80P00J052J204J166R95Q05P38O91K92m64r10
54123A49744m88L76P38L23k42m17l50l28j51M93J317J672J384J020J120J541J818
54106A59570J843J870J937J837J668J924K799L805M434M796N230N619N591N184
54092B08107M731M151K879O08k278n019o906p480o797n490m310l457k637j643
54078A74459n40N80J591K207K298K256K561L076L363L480L764L940L274J769K84
54063B08362p20j700k897l615l269k402k018k310k689k624j917o16Q07J610J603
54048A85605J461J798K384K763K996L250L267K987L081M030N212N764N880O197
$$ plain form
54034 236675 243119 249061 254207 259441 265619 272217 277985 282479 286139 289234 291668 293639 295522 297176
54020 297176 298113 298411 298674 299017 298758 297316 294846 291898 288943 286297 283857 280799 276168 270035 263589
54005 263589 257851 252833 248196 244081 240729 237629 233713 228463 222594 217595 214578 213413 212932 212139 211094
53990 211094 210362 209852 208853 207204 205621 204571 203563 202045 200399 199381 198997 198648 198156 197926 198109 198306
53974 198306 198202 198021 198209 199008 200409 202159 203797 205065 206379 208574 212035 216432 221419 227260 234490
53959 234490 243214 253029 263401 273720 282914 289386 291766 289880 284879 278339 271264 264084 257353 251918
53945 251918 248202 245738 243870 242704 242932 244739 247306 249554 251113 252483 254452 257417 261075 264745
53931 264745 268171 271933 276791 282607 288319 293109 297201 301276 305491 309537 313486 318018 323655 330090
$$ packed form
54034B36675O444N942N146N234O178O598N768M494L660L095K434J971J883J654
54020B97176R37K98K63L43k59j442k470k948k955k646k440l058m631o133o446
54005B63589n738n018m637m115l352l100l916n250n869m999l017j165m81p93j045
53990B11094p32n10r99j649j583j050j008j518j646j018l84l49m92k30J83J97
53974A98306j04j81J88P99J401J750J638J268J314K195L461M397M987N841P230
53959B34490Q724R815J0372J0319R194O472K380j886n001o540p075p180o731n435
53945B51918l716k464j868j166K28J807K567K248J559J370J969K965L658L670
53931B64745L426L762M858N816N712M790M092M075M215M046L949M532N637O435
$$ plain form
53917 330090 336575 342862 349528 357304 366219 375578 384691 393408 401835 409753 416502 421337 423764 423703 421678
53902 421678 418772 416010 413641 411205 408288 404889 401079 396705 391654 386015 379814 372882 365327 357733
53888 357733 350475 343108 334957 326234 318015 310978 304687 298312 291683 285274 279431 274012 268788 263846
53874 263846 259497 255964 253236 251136 249346 247419 244937 241770 238160 234480 230929 227573 224636 222522
53860 222522 221343 220518 219110 216704 213807 211231 209184 207181 204923 202950 202080 202303 202643 202284 201470 201000
53844 201000 201149 201531 201868 202282 202751 202835 202314 201694 201683 202332 202999 203091 202522 201587 200706 200319 200728 201884 203382
53825 203382 204679 205367 205363 204957 204575 204469 204692 205339 206504 207927 209062 209701 210278 211361 213171 215756 219143
53808 219143 222930 226271 228928 231965 236611 242576 248348 253099 257442 262131 267003 271645 276334 281566
$$ packed form
53917C30090O485O287O666P776Q915R359R113Q717Q427P918O749M835K427o1k025
53902D21678k906k762k369k436k917l399l810m374n051n639o201o932p555p594
53888C57733p258p367q151q723q219p037o291o375o629o409n843n419n224m942
53874B63846m349l533k728k100j790j927k482l167l610l680l551l356k937k114
53860B22522j179q25j408k406k897k576k047k003k258j973q70K23L40l59q14m70
53844B01000J49L82L37M14M69Q4n21o20j1O49O67R2n69r35q81l87M09J156J498
53825B03382J297O88mm06l82j06K23O47J165J423J135O39N77J083J810K585L387
53808B19143L787L341K657L037M646N965N772M751M343M689M872M642M689N232
$$ plain form
53794 281566 287140 292345 296818 300684 304103 307196 310275 313589 316873 319474 320856 320786 319233 316472 313106
53779 313106 309564 305693 301141 295919 290239 284039 277288 270637 265067 260760 256894 252737 248423 244374
53765 244374 240531 236614 232856 229871 227856 226344 224788 223076 221373 219709 218000 216369 215179 214587
53751 214587 214205 213452 212242 211071 210288 209557 208336 206717 205367 204635 204126 203370 202640 202750 204065 205973
53735 205973 207495 208338 209128 210497 212210 213510 214213 214911 215894 216508 216116 215302 215357 216672 218390 219733 220910
53718 220910 222399 224044 225460 226896 228956 231632 234207 236234 238086 240336 242931 245325 247251 249028
53704 249028 250992 252923 254346 255397 256958 259668 263079 266176 268623 270997 273828 276957 280063 283303
53690 283303 286990 290890 294261 296463 297280 296762 295182 293158 291548 290947 291231 291559 290994 289384 287603 286649
$$ packed form
53794B81566N574N205M473L866L419L093L079L314L284K601J382p0j553k761l366
53779C13106l542l871m552n222n680o200o751o651n570m307l866m157m314m049
53765B44374l843l917l758k985k015j512j556j712j703j664j709j631j190n92
53751B14587l82p53j210j171p83p31j221j619j350p32n09p56p30J10J315J908
53735B05973J522Q43P90J369J713J300P03O98R83O14l92q14N5J315J718J343J177
53718B20910J489J645J416J436K060K676K575K027J852K250K595K394J926J777
53704B49028J964J931J423J051J561K710L411L097K447K374K831L129L106L240
53690B83303L687L900L371K202Q17n18j580k024j610o01K84L28n65j610j781r54
$$ plain form
53674 286649 286514 286291 285474 284617 284468 284893 285086 284508 283285 281980 281378 282164 284191 286200 286820 285854 284183
53657 284183 282603 281259 280178 279685 280076 281188 282450 283188 282996 282149 281581 282005 283091 283892 283994 283820 283928
53640 283928 284578 285962 288128 290546 292416 293674 295054 296928 298754 300096 301538 303989 307560 311728
53626 311728 316249 321212 326440 331458 335940 339719 342554 344447 346044 348085 350411 352130 352820 353115 354007
53611 354007 356047 359328 363719 368777 373741 377995 381454 384402 387142 389919 392926 396142 399240 401814
53597 401814 403686 404932 405733 406226 406452 406416 406268 406317 406714 407135 407047 406350 405541 405138 405070 404761 403748 402145 400488
53578 400488 399126 397766 395725 392756 389445 386631 384532 382741 380951 379278 377800 376208 374219 372096
53564 372096 370432 369552 369344 369592 370200 371089 372101 373029 373612 373578 372886 371976 371549 371958 372937 374026 375146 376560
$$ packed form
53674B86649j35k23q17q57j49M25J93n78j223j305o02P86K027K009O20r66j671
53657B84183j580j344j081m93L91J112J262P38j92q47n68M24J086Q01J02j74J08
53640B83928O50J384K166K418J870J258J380J874J826J342J442K451L571M168
53626C11728M521M963N228N018M482L779K835J893J597K041K326J719O90K95Q92
53611C54007K040L281M391N058M964M254L459K948K740K777L007L216L098K574
53597D01814J872J246Q01M93K26l6j48M9L97M21q8o97q09m03o8l09j013j603j657
53578D00488j362j360k041k969l311k814k099j791j790j673j478j592j989k123
53564C72096j664q80k08K48O08Q89J012R28N83l4o92r10m27M09R79J089J120J414
$$ plain form
53546 376560 378380 380329 382086 383663 385363 387417 389823 392484 395414 398801 402866 407637 412830 418158
53532 418158 423808 430373 438122 446535 454899 463218 472181 482238 493140 504436 516006 527939 540294
53519 540294 553220 567035 581863 597409 613359 629851 647331 666133 686390 708144 731288
53508 731288 755512 780514 806127 832143 858253 884324 910439 936456 961856 986271 1009792
53497 1009792 1032471 1053980 1074181 1093617 1112868 1131822 1150199 1168434 1187207 1206338 1225061
53486 1225061 1243348 1262061 1281644 1301467 1320736 1339275 1357185 1374443 1391249 1408062 1424873
53475 1424873 1440938 1455558 1468476 1479197 1486781 1490965 1492807 1493330 1491993 1487318 1478829 1467531 1454666
53462 1454666 1440805 1426142 1410903 1395245 1379287 1363339 1347640 1331781 1314835 1296167 1275794
$$ packed form
53546C76560J820J949J757J577J700K054K406K661K930L387M065M771N193N328
53532D18158N650O565P749Q413Q364Q319Q963J0057J0902J1296J1570J1933J2355
53519E40294J2926J3815J4828J5546J5950J6492J7480J8802K0257K1754K3144
53508G31288K4224K5002K5613K6016K6110K6071K6115K6017K5400K4415K3521
53497A009792K2679K1509K0201J9436J9251J8954J8377J8235J8773J9131J8723
53486A225061J8287J8713J9583J9823J9269J8539J7910J7258J6806J6813J6811
53475A424873J6065J4620J2918J0721P584M184J842N23j337m675q489j1298j2865
53462A454666j3861j4663j5239j5658j5958j5948j5699j5859j6946j8668k0373
$$ plain form
53451 1275794 1254034 1231291 1208243 1185698 1163998 1142916 1122255 1102227 1083159 1065247 1048811
53440 1048811 1034361 1022127 1011731 1002638 994737 988282 983386 979807 977148 975155 973936 973960 975720 979225
53426 979225 983984 989625 996385 1004843 1015244 1027229 1040195 1053752 1067936 1083102 1099631 1117658
53414 1117658 1137074 1157850 1180291 1204834 1231560 1260027 1289676 1320365 1352460 1386413 1422286
53403 1422286 1459744 1498470 1538581 1580630 1625211 1672498 1722089 1773337 1825935 1880131 1936320
53392 1936320 1994444 2053870 2113719 2173247 2232007 2289841 2346680 2402172 2455650 2506717 2555739
53381 2555739 2603336 2649361 2692804 2732838 2769543 2803318 2833919 2860451 2882079 2898416 2909277
53370 2909277 2914383 2913394 2906173 2893009 2874400 2850336 2819907 2782212 2737857 2689086 2638141 2585881
$$ packed form
53451A275794k1760k2743k3048k2545k1700k1082k0661k0028j9068j7912j6436
53440A048811j4450j2234j0396r093p901o455m896l579k659j993j219K4J760L505
53426I79225M759N641O760Q458J0401J1985J2966J3557J4184J5166J6529J8027
53414A117658J9416K0776K2441K4543K6726K8467K9649L0689L2095L3953L5873
53403A422286L7458L8726M0111M2049M4581M7287M9591N1248N2598N4196N6189
53392A936320N8124N9426N9849N9528N8760N7834N6839N5492N3478N1067M9022
53381B555739M7597M6025M3443M0034L6705L3775L0601K6532K1628J6337J0861
53370B909277N106r89p221j3164j8609k4064l0429l7695m4355m8771n0945n2260
$$ plain form
53358 2585881 2532219 2477240 2421281 2364470 2307075 2250206 2195417 2143532 2094392 2047677 2003296
53347 2003296 1960821 1919184 1877322 1834845 1791950 1748961 1706164 1663929 1622898 1584057 1548331
53336 1548331 1515799 1485523 1456632 1429404 1404833 1383366 1364709 1348662 1335170 1323397 1311702
53325 1311702 1299052 1285790 1272541 1258978 1244347 1228779 1213396 1199254 1186754 1175858 1166288
53314 1166288 1157474 1148844 1140453 1133160 1128089 1125895 1126358 1128546 1131490 1134881 1139041 1144245 1150463 1157912
53300 1157912 1167365 1179417 1193690 1209311 1226078 1244625 1265431 1288222 1312573 1338564 1366361
53289 1366361 1395357 1424280 1452275 1479500 1506377 1532511 1556771 1578418 1597727 1615323 1631293
53278 1631293 1645205 1656614 1665055 1669818 1670397 1667173 1661147 1652926 1642402 1629395 1614034 1596350 1576136
$$ packed form
53358B585881n3662n4979n5959n6811n7395n6869n4789n1885m9140m6715m4381
53347B003296m2475m1637m1862m2477m2895m2989m2797m2235m1031l8841l5726
53336A548331l2532l0276k8891k7228k4571k1467j8657j6047j3492j1773j1695
53325A311702j2650j3262j3249j3563j4631j5568j5383j4142j2500j0896r570
53314A166288q814q630q391p293n071k194M63K188K944L391M160N204O218P449
53300A157912R453J2052J4273J5621J6767J8547K0806K2791K4351K5991K7797
53289A366361K8996K8923K7995K7225K6877K6134K4260K1647J9309J7596J5970
53278A631293J3912J1409Q441M763N79l224o026q221j0524j3007j5361j7684k0214
$$ plain form
53265 1576136 1553484 1529015 1503272 1476354 1448429 1420012 1391345 1361995 1331659 1300902 1270488
53254 1270488 1240326 1209797 1179009 1149034 1120822 1094386 1069053 1044027 1018725 993081 967629
53243 967629 942903 918737 894550 870282 846538 823703 801485 779599 758494 739041 721707
53232 721707 706340 692571 680149 668911 658620 648897 639322 629737 620398 611633 603321 594903 585918
53219 585918 576303 566104 555117 542992 529541 514849 499296 483682 469174 456805 446877 438856
53207 438856 431841 425114 418362 411575 404893 398498 392479 386653 380573 373862 366503 358687 350485 341988
53193 341988 333785 326822 321453 316884 311983 306535 301348 297150 293827 290801 287805 285019 282588 280295
53179 280295 277702 274555 271044 267701 264979 262905 261096 259131 256940 254896 253484 252789 252333 251552 250316
$$ packed form
53265A576136k2652k4469k5743k6918k7925k8417k8667k9350l0336l0757l0414
53254A270488l0162l0529l0788k9975k8212k6436k5333k5026k5302k5644k5452
53243I67629k4726k4166k4187k4268k3744k2835k2218k1886k1105j9453j7334
53232G21707j5367j3769j2422j1238j0291r723r575r585r339q765q312q418q985
53219E85918r615j0199j0987j2125j3451j4692j5553j5614j4508j2369r928q021
53207D38856p015o727o752o787o682o395o019n826o080o711p359p816q202q497
53193C41988q203o963n369m569m901n448n187m198l323l026k996k786k431k293
53179B80295k593l147l511l343k722k074j809j965k191k044j412o95m56p81j236
$$ plain form
53164 250316 248831 247159 245256 243412 242151 241515 240933 240029 239098 238493 238073 237726 237873 238756 239609 239378 238112
53147 238112 236852 236218 235960 235946 236601 237955 239062 239037 238203 237677 238125 239372 240876 242076 242441 241810 240716
53130 240716 240058 240347 241455 243007 244771 246667 248609 250413 251850 252830 253545 254280 255046 255546 255562 255198 254699
53113 254699 254225 253840 253527 253179 252828 252890 253773 255086 255668 254699 252514 250032 247773 245821 244416 243875 243958
53096 243958 243843 242910 241273 239424 237691 236171 234931 234040 233514 233337 233487 233877 234317 234583 234500 234067 233567
53079 233567 233464 233985 234840 235499 235672 235340 234397 232697 230518 228615 227476 226722 225615 224091 222901 222647
53063 222647 222983 223068 222598 222091 222179 222916 223846 224504 224715 224580 224384 224454 224894 225507 226057 226518 226988 227481 228008 228714
53043 228714 229659 230509 230754 230308 229652 229275 229149 228861 228137 227158 226425 226361 226924 227598 227880 227772 227652 227732 227908
$$ packed form
53164B50316j485j672j903j844j261o36n82r04r31o05m20l47J47Q83Q53k31j266
53147B38112j260o34k58j4O55J354J107k5q34n26M48J247J504J200L65o31j094
53130B40716o58K89J108J552J764J896J942J804J437R80P15P35P66N00J6l64m99
53113B54699m74l85l13l48l51O2Q83J313N82r69k185k482k259j952j405n41Q3
53096B43958j15r33j637j849j733j520j240q91n26j77J50L90M40K66q3m33n00
53079B33567j03N21Q55O59J73l32r43j700k179j903j139p54j107j524j190k54
53063B22647L36Q5m70n07Q8P37R30O58K11j35j96P0M40O13N50M61M70M93N27P06
53043B28714R45Q50K45m46o56l77j26k88p24r79p33o4N63O74K82j08j20Q0J76
$$ plain form
53024 227908 228173 228853 230185 231857 233220 233881 233977 233919 234060 234553 235263 235764 235619 234847 234083 234038 234728 235406 235387
53005 235387 234772 234117 233551 232764 231803 231296 231555 232031 232143 232196 232812 233795 234306 234088 233759 233886 234468 235363 236484
52986 236484 237396 237505 237012 236970 237966 239300 239999 240057 240138 240529 241067 241746 242692 243733 244582 245333 246268 247334 248259
52967 248259 249076 249970 250764 251125 251263 251900 253426 255484 257416 258741 259254 259075 258579 257901 256538 253929 250401
52950 250401 246993 244317 242138 240179 238749 238230 238413 238752 238963 239013 238811 238305 237753 237535 237684 237866 237797 237456
52932 237456 236901 236088 235019 233954 233310 233240 233409 233346 233053 233001 233387 233705 233340 232435 231704 231451 231202 230406 229110
52913 229110 227774 226744 226124 225883 225780 225411 224619 223813 223618 224220 225251 226330 227482 228881 230349 231347
52897 231347 231523 231087 230503 229953 229363 228833 228648 228828 229095 229487 230503 232245 233885 234597 234774 235563 237168
$$ packed form
53024B27908K65O80J332J672J363O61R6n8J41M93P10N01j45p72p64m5O90O78j9
53005B35387o15o55n66p87r61n07K59M76J12N3O16R83N11k18l29J27N82Q95J121
52986B36484R12J09m93m2R96J334O99N8Q1L91N38O79R46J041Q49P51R35J066R25
52967B48259Q17Q94P94L61J38O37J526K058J932J325N13j79m96o78j363k609l528
52950B50401l408k676k179j959j430n19J83L39K11N0k02n06n52k18J49J82o9l41
52932B37456n55q13j069j065o44p0J69o3k93n2L86L18l65r05p31k53k49p96j296
52913B29110j336j030o20k41j03l69p92q06j95O02J031J079J152J399J468R98
52897B31347J76m36n84n50n90n30j85J80K67L92J016J742J640P12J77P89J605
$$ plain form
52880 237168 238401 238157 236778 235569 235358 235978 236815 237438 237754 237943 238306 238960 239710 240313 240829 241547 242551
52863 242551 243475 243799 243504 243348 244253 246163 247806 247906 246534 244817 243455 242067 240053 237492 234840 232246
52847 232246 229635 227179 225247 223967 223116 222323 221261 219830 218395 217544 217271 216674 214897 212246 209945
52832 209945 208856 208905 209712 211129 212888 214245 214581 214250 214281 215157 216214 216529 216056 215537 215436 215505 215459 215516 215913
52813 215913 216359 216569 217080 218816 221809 224941 227074 227907 227580 226130 223784 221243 219089 217186 215135
52798 215135 213080 211568 210748 210253 209805 209523 209621 210164 211120 212260 213085 213220 212949 212944 213424 213954 214213 214530 215416
52779 215416 216819 218144 218853 218869 218530 218344 218666 219394 219999 220001 219403 218534 217578 216445 215091 213728 212610 211803
52761 211803 211328 211398 212180 213334 214141 214275 214151 214228 214290 213906 213429 213878 215635 217830 219396 220326 221492 223522
$$ packed form
52880B37168J233k44j379j209k11O20Q37O23L16J89L63O54P50O03N16P18J004
52863B42551R24L24k95j56R05J910J643J00j372j717j362j388k014k561k652k594
52847B32246k611k456j932j280q51p93j062j431j435q51k73n97j777k651k301
52832B09945j089M9Q07J417J759J357L36l31L1Q76J057L15m73n19j01O9m6N7L97
52813B15913M46K10N11J736K993L132K133Q33l27j450k346k541k154j903k051
52798B15135k055j512q20m95m48k82R8N43R56J140Q25J35k71nM80N30K59L17Q86
52779B15416J403J325P09J6l39j86L22P28O05Kn98q69r56j133j354j363j118q07
52761B11803m75P0P82J154Q07J34j24P7O2l84m77M49J757K195J566R30J166K030
$$ plain form
52743 223522 226236 228989 231150 232445 233214 234295 236261 238794 241052 242558 243435 243974 244408 245026 246027
52728 246027 247229 248273 249123 249937 250496 250285 249234 247831 246295 244231 241464 238704 236819 235705 234458
52713 234458 232629 230799 229825 229912 230584 231335 231970 232434 232563 232249 231813 232021 233446 235784 237942 238910 238512
52696 238512 237321 236019 234924 234023 233307 232961 233110 233365 232858 231072 228624 226881 226682 227673 228968 230063
52680 230063 230900 231364 231227 230528 229655 228920 228326 227808 227543 227852 228802 230015 230939 231309 231268 231035 230631 230109 229949
52661 229949 230845 233025 235999 239053 241784 244112 246138 248225 250880 254223 257700 260590 262608 263745
52647 263745 263793 262513 260199 257543 254877 251930 248512 245086 242456 241093 240877 241274 241637 241545 241075 240684
52631 240684 240807 241668 243413 246064 249232 252161 254285 255513 255861 255136 253297 250866 248597 246794 245265
$$ packed form
52743B23522K714K753K161J295P69J081J966K533K258J506Q77N39M34O18J001
52728B46027J202J044Q50Q14N59k11j051j403j536k064k767k760j885j114j247
52713B34458j829j830r74Q7O72P51O35M64J29l14m36K08J425K338K158R68l98
52696B38512j191j302j095r01p16l46J49K55n07j786k448j743j99R91J295J095
52680B30063Q37M64j37o99q73p35n94n18k65L09R50J213R24L70m1k33m04n22j60
52661B29949Q96K180K974L054K731K328K026K087K655L343L477K890K018J137
52647B63745M8j280k314k656k666k947l418l426k630j363k16L97L63r2m70l91
52631B40684J23Q61J745K651L168K929K124J228L48p25j839k431k269j803j529
$$ plain form
52616 245265 243879 242784 242115 241793 241688 241681 241513 240895 239899 239011 238636 238723 239008 239443 240147 241039 241745 241891 241421
52597 241421 240648 240025 239827 239989 240331 240893 241918 243464 245203 246651 247514 247738 247485 247146 247192 247740 248388 248671
52579 248671 248611 248628 249046 249838 250785 251627 252146 252333 252391 252374 251975 251013 250046 249938 250749 251503 251339 250504 249853 249689
52559 249689 249582 249150 248555 248171 248136 248345 248638 248845 248857 248766 248776 248885 248829 248442 247900 247443 246999 246358 245653 245352
52539 245352 245602 245900 245733 245410 245850 247415 249310 250371 250220 249391 248585 248176 248314 249008 249978 250802 251272 251370
52521 251370 250914 249701 248118 247058 246953 247309 247607 248199 249768 252228 254784 256988 259098 261408 263797
52506 263797 266100 268422 270842 273167 275144 276591 277176 276452 274382 271588 268810 266321 264023 261862 259837
52491 259837 257824 255747 253876 252631 252060 251718 251160 250400 249808 249598 249617 249698 250101 251318 253316 255252 256256
$$ packed form
52616B45265j386j095o69l22j05pj68o18r96q88l75Q7K85M35P04Q92P06J46m70
52597B41421p73o23j98J62L42N62J025J546J739J448Q63K24k53l39M6N48O48K83
52579B48671o0J7M18P92R47Q42N19J87N8j7l99r62r67j08Q11P54j64q35o51j64
52559B49689j07m32n95l84l5K09K93K07J2r1J0J09n6l87n42m57m44o41p05l01
52539B45352K50K98j67l23M40J565J895J061j51q29q06m09J38O94R70Q24M70R8
52521B51370m56j213j583j060j05L56K98N92J569K460K556K204K110K310K389
52506B63797K303K322K420K325J977J447N85p24k070k794k778k489k298k161k025
52491B59837k013k077j871j245n71l42n58p60n92k10J9Q1M03J217J998J936J004
$$ plain form
52474 256256 256384 256459 257067 258053 259024 259883 260690 261370 261840 262171 262414 262533 262656 263170 264302 265837 267454 269114
52456 269114 270785 272067 272419 271704 270234 268404 266546 264952 263666 262280 260281 257620 254736 252127 250133
52441 250133 249064 249140 250168 251473 252292 252231 251495 250815 250929 251855 252793 252992 252587 252257 252269 252329 252252 252192 252136 251759
52421 251759 251041 250569 250944 252157 253813 255609 257356 258885 260281 262072 264859 268859 273989 280196 287487
52406 287487 295794 305014 315046 325536 335661 344270 350114 352022 349369 342747 333902 324642 315877
52393 315877 307861 300870 295178 290680 287126 284614 283346 283013 282956 282888 282918 282951 282727 282512 283043 284493 286100
52376 286100 287169 287968 289284 291518 294671 298744 303578 308556 313045 317036 320954 324924 328636 331750
52362 331750 334017 335092 334769 333429 331871 330598 329657 329170 329559 331037 333195 335326 336972 338038 338670
$$ packed form
52474B56256J28P5O08R86R71Q59Q07O80M70L31K43J19J23N14J132J535J617J660
52456B69114J671J282L52p15j470j830j858j594j286j386j999k661k884k609j994
52441B50133j069P6J028J305Q19o1p36o80J14R26R38J99m05l30J2O0p7o0n6l77
52421B51759p18m72L75J213J656J796J747J529J396J791K787M000N130O207P291
52406B87487Q307R220J0032J0490J0125Q609N844J908k653o622q845r260q765
52393C15877q016o991n692m498l554k512j268l33n7o8L0L3k24k15N31J450J607
52376B86100J069P99J316K234L153M073M834M978M489L991L918L970L712L114
52362C31750K267J075l23j340j558j273r41m87L89J478K158K131J646J066O32
$$ plain form
52347 338670 339184 339995 341455 343756 346913 350648 354373 357677 360821 364471 368943 374139 380230 387721 396512
52332 396512 405501 413771 421893 431399 443069 456315 470239 484659 499845 515828 532421 549674
52320 549674 567878 587192 607501 628586 650099 671318 691273 709432 726250 742810 759858
52309 759858 777268 794476 811175 827319 842648 856680 869305 881050 892511 903731 914321
52298 914321 923979 932580 939924 945773 950083 952919 954101 953232 950142 945113 938642 931177 923096 914688
52284 914688 906112 897515 889272 881948 876006 871692 869160 868499 869629 872361 876603 882308 889290 897388
52270 897388 906779 917733 929936 942455 954630 966693 979257 992432 1005756 1018805 1031513 1044020
52258 1044020 1056515 1069172 1081903 1094157 1105237 1114923 1123624 1131907 1139977 1147565 1154060 1158659 1160567
$$ packed form
52347C38670N14Q11J460K301L157L735L725L304L144L650M472N196O091P491Q791
52332C96512Q989Q270Q122R506J1670J3246J3924J4420J5186J5983J6593J7253
52320E49674J8204J9314K0309K1085K1513K1219J9955J8159J6818J6560J7048
52309G59858J7410J7208J6699J6144J5329J4032J2625J1745J1461J1220J0590
52298I14321R658Q601P344N849M310K836J182q69l090n029o471p465q081q408
52284I14688q576q597q243p324n942m314k532o61J130K732M242N705O982Q098
52270H97388R391J0954J2203J2519J2175J2063J2564J3175J3324J3049J2708J2507
52258A044020J2495J2657J2731J2254J1080R686Q701Q283Q070P588O495M599J908
$$ plain form
52245 1160567 1159303 1154975 1148346 1140533 1132402 1124082 1115128 1105215 1094588 1083802 1073289 1063297 1053978
52232 1053978 1045186 1036435 1027455 1018759 1011211 1004982 999303 993417 987439 982052 977594 973774 970255 967270
52218 967270 965584 965815 967812 970744 973845 977045 980774 985302 990466 995994 1001715 1007423 1012839 1017893
52204 1017893 1022828 1027826 1032729 1037259 1041355 1045095 1048513 1051686 1054882 1058350 1062105 1066163 1070809 1076218
52190 1076218 1081845 1086603 1089835 1091838 1093303 1094513 1095293 1095438 1094777 1092924 1089351 1083920 1077086 1069434 1061119
52175 1061119 1051995 1042273 1032840 1024790 1018677 1014297 1011087 1008558 1006425 1004642 1003489 1003449 1004701 1006760
52161 1006760 1008848 1010648 1012440 1014434 1016329 1017728 1018782 1020026 1021621 1023144 1024246 1025156 1026273 1027407
52147 1027407 1027832 1027225 1026316 1026347 1027891 1030367 1032715 1034359 1035308 1035588 1035050 1033924 1033123 1033534 1035143 1037344
$$ packed form
52245A160567j264m328o629p813q131q320q954r913j0627j0786j0513r992r319
52232A053978q792q751q980q696p548o229n679n886n978n387m458l820l519k985
52218I67270j686K31J997K932L101L200L729M528N164N528N721N708N416N054
52204A017893M935M998M903M530M096L740L418L173L196L468L755M058M646N409
52190A076218N627M758L232K003J465J210P80J45o61j853l573n431o834p652q315
52175A061119r124r722r433q050o113m380l210k529k133j783j153m0J252K059
52161A006760K088J800J792J994J895J399J054J244J595J523J102R10J117J134
52147A027407M25o07r09L1J544K476K348J644R49K80n38j126q01M11J609K201
$$ plain form
52131 1037344 1040113 1044354 1050941 1059899 1070929 1084231 1100216 1118606 1138522 1159600 1182404 1207493
52119 1207493 1234474 1262300 1290148 1317606 1344323 1369963 1394451 1417874 1440135 1461029 1480602
52108 1480602 1499029 1515952 1530387 1541588 1549876 1556267 1561364 1564873 1566317 1565913 1564470 1562426 1559320
52095 1559320 1554397 1547596 1539634 1531077 1521628 1510450 1496985 1481337 1464161 1446510 1429543 1413923
52083 1413923 1399485 1385866 1373456 1363295 1355937 1350911 1347593 1346201 1347554 1352007 1359070 1367925 1377916
$$ packed form
52131A037344K769M241O587Q958J1030J3302J5985J8390J9916K1078K2804K5089
52119A207493K6981K7826K7848K7458K6717K5640K4488K3423K2261K0894J9573
52108A480602J8427J6923J4435J1201Q288O391N097L509J444m04j443k044l106
52095A559320m923o801p962q557r449j1178j3465j5648j7176j7651j6967j5620
52083A413923j4438j3619j2410j0161p358n026l318j392J353M453P063Q855R991
$$ [...]
##END NTUPLES=NMR SPECTRUM
##END=
