
##TITLE=UV1107_M2_1290-1353_7180591_HSQ8OUJR6w
##JCAMPDX= 6.0         $$ Bruker NMR JCAMP-DX V2.0
##DATA TYPE= NMR SPECTRUM
##DATA CLASS= NTUPLES
##ORIGIN= BRUKER
##OWNER= Administrator
$$ 1.72 TOPSPIN		Version 2.1
$$ 2012-12-04 23:02:56.879 -0500  Administrator@X
$$ Compression mode = diff/dup
##.OBSERVE FREQUENCY= 400.02188249412
##.OBSERVE NUCLEUS= ^1H
##.ACQUISITION MODE= SIMULTANEOUS (DQD)
##.ACQUISITION SCHEME= undefined
##.AVERAGES= 64
##.DIGITISER RES= 22
##SPECTROMETER/DATA SYSTEM= spect
##.PULSE SEQUENCE= noesygpps1d.comp
##.SOLVENT NAME= COFFEE_meoh
##.SHIFT REFERENCE= INTERNAL, COFFEE_meoh, 1, 14.96103
##AUDIT TRAIL= $$ (NUMBER, WHEN, WHO, WHERE, PROCESS, VERSION, WHAT)
$$ ##TITLE= Audit trail, TOPSPIN		Version 2.1
$$ ##JCAMPDX= 5.01
$$ ##ORIGIN= Bruker BioSpin GmbH
$$ ##OWNER= Administrator
$$ $$ E:\/data/COFFEE/nmr/UV1107_M2_1290-1353_7180591_HSQ8OUJR6w/12/pdata/1/auditp.txt
$$ ##AUDIT TRAIL=  $$ (NUMBER, WHEN, WHO, WHERE, PROCESS, VERSION, WHAT)
(   1,<2012-12-04 23:02:50.972 -0500>,<Administrator>,<X>,<go>,<TOPSPIN 2.1>,
      <created by zg
	started at 2012-12-04 22:51:21.238 -0500,
	POWCHK enabled, PULCHK disabled,
       configuration hash MD5:
       86 BA 57 50 F2 9D 5C 9B 26 00 A9 28 5F 66 2E 89
       data hash MD5: 64K
       D3 67 26 6C 8C E4 D0 F0 D3 0A ED 07 CC DE B9 9B>)
(   2,<2012-12-04 23:02:54.050 -0500>,<Administrator>,<X>,<proc1d>,<TOPSPIN 2.1>,
      <Start of raw data processing
       efp LB = 0.3 FT_mod = 6 PKNL = 1 PHC0 = 0 PHC1 = 0 SI = 128K 
       data hash MD5: 128K
       7E 79 AB 62 AE FF 6F 83 0D 18 64 07 8A 5B 29 60>)
(   3,<2012-12-04 23:02:55.097 -0500>,<Administrator>,<X>,<proc1d>,<TOPSPIN 2.1>,
      <pk PHC0 = -81.68884 PHC1 = 0 
       data hash MD5: 128K
       A3 CC 01 82 D7 99 CD 81 8D C6 42 F5 98 0C D4 7C>)
(   4,<2012-12-04 23:02:55.800 -0500>,<Administrator>,<X>,<proc1d>,<TOPSPIN 2.1>,
      <abs ABSG = 1 
       data hash MD5: 128K
       CB 03 D6 AB C4 48 F6 22 40 13 1B 46 1A C7 2E 7B>)
(   5,<2012-12-04 23:02:55.972 -0500>,<Administrator>,<X>,<proc1d>,<TOPSPIN 2.1>,
      <abs ABSG = 2 
       data hash MD5: 128K
       E6 65 37 AE F3 07 7D 95 BA E7 70 B0 1B 94 A6 3B>)
(   6,<2012-12-04 23:02:56.160 -0500>,<Administrator>,<X>,<proc1d>,<TOPSPIN 2.1>,
      <abs ABSG = 3 
       data hash MD5: 128K
       B8 D8 BD FE 0F 31 79 2B 8A 6F 35 D4 1D B1 D8 BA>)
(   7,<2012-12-04 23:02:56.347 -0500>,<Administrator>,<X>,<proc1d>,<TOPSPIN 2.1>,
      <abs ABSG = 4 
       data hash MD5: 128K
       77 DE B2 35 F1 4B 87 BB 93 01 0A D9 3D 86 83 ED>)
(   8,<2012-12-04 23:02:56.535 -0500>,<Administrator>,<X>,<proc1d>,<TOPSPIN 2.1>,
      <abs ABSG = 5 
       data hash MD5: 128K
       29 50 5D 35 23 D6 7B 54 AB A6 4D 6D 60 17 F9 A9>)
$$ ##END=
$$ 
$$ $$ hash MD5
$$ $$ E2 84 0C C2 D1 3D A7 22 96 AF C8 7C D2 9C F3 C6
##$RELAX= 
##$RELAX= 
##$RELAX= 
##$RELAX= 
##$RELAX= 
##$RELAX= 
##$RELAX= 
##$RELAX= 
$$ Bruker specific parameters
$$ --------------------------
##$DU= <E:\>
##$EXPNO= 12
$$ [...]
##$TP07= 0
##$TPNAME0= <>
##$TPNAME1= <>
##$TPNAME2= <>
##$TPNAME3= <>
##$TPNAME4= <>
##$TPNAME5= <>
##$TPNAME6= <>
##$TPNAME7= <>
##$TPOAL= (0..7)
0.5 0.5 0.5 0.5 0.5 0.5 0.5 0.5
##$TPOFFS= (0..7)
0 0 0 0 0 0 0 0
##$TUNHIN= 0
##$TUNHOUT= 0
##$TUNXOUT= 0
##$USERA1= <user>
##$USERA2= <user>
##$USERA3= <user>
##$USERA4= <user>
##$USERA5= <user>
##$V9= 5
##$VALIST= <valist>
##$VCLIST= <CCCCCCCCCCCCCCC>
##$VD= 0
##$VDLIST= <DDDDDDDDDDDDDDD>
##$VPLIST= <PPPPPPPPPPPPPPP>
##$VTLIST= <TTTTTTTTTTTTTTT>
##$WBST= 2048
##$WBSW= 25
##$XGAIN= (0..3)
0 0 0 0
##$XL= 0
##$YL= 0
##$YMAX_a= 5856364
##$YMIN_a= -11838601
##$ZGOPTNS= <>
##$ZL1= 120
##$ZL2= 120
##$ZL3= 120
##$ZL4= 120
##$ABSF1= 14.96103
##$ABSF2= -5.597152
##$ABSG= 5
##$ABSL= 3
##$ALPHA= 0
##$AQORDER= 0
##$ASSFAC= 0
##$ASSFACI= 0
##$ASSFACX= 0
##$ASSWID= 0
##$AUNMP= <proc_prof1d_extract.lims>
##$AXLEFT= 0
##$AXNAME= <>
##$AXNUC= <1H>
##$AXRIGHT= 0
##$AXTYPE= 0
##$AXUNIT= <>
##$AZFE= 0.1
##$AZFW= 0.1
##$BCFW= 0
##$BC_mod= 0
##$BYTORDP= 0
##$COROFFS= 0
##$CY= 15
##$DATMOD= 1
##$DC= 0
##$DFILT= <>
##$DTYPP= 0
##$F1P= 0
##$F2P= 0
##$FCOR= 0.5
##$FTSIZE= 131072
##$FT_mod= 6
##$GAMMA= 0
##$GB= 0
##$INTBC= 1
##$INTSCL= 1
##$ISEN= 128
##$LB= 0.3
##$LEV0= 0
##$LPBIN= 0
##$MAXI= 10000
##$MC2= 0
##$MEAN= 0
##$ME_mod= 0
##$MI= 0
##$NCOEF= 0
##$NC_proc= -2
##$NLEV= 6
##$NOISF1= 0
##$NOISF2= 0
##$NSP= 0
##$NTH_PI= 0
##$NZP= 0
##$OFFSET= 14.96103
##$PC= 1
##$PHC0= -81.68884
##$PHC1= 0
##$PH_mod= 1
##$PKNL= yes
##$PPARMOD= 0
##$PPDIAG= 0
##$PPIPTYP= 0
##$PPMPNUM= 2147483647
##$PPRESOL= 1
##$PSCAL= 4
##$PSIGN= 0
##$PYNMP= <proc.py>
##$REVERSE= no
##$SF= 400.02000962595
##$SI= 131072
##$SIGF1= 0
##$SIGF2= 0
##$SINO= 400
##$SIOLD= 131072
##$SPECTYP= <>
##$SREGLST= <1H.CDCl3>
##$SSB= 0
##$STSI= 131072
##$STSR= 0
##$SW_p= 8223.68421052631
##$SYMM= 0
##$S_DEV= 0
##$TDeff= 65536
##$TDoff= 0
##$TI= <>
##$TILT= no
##$TM1= 0
##$TM2= 0
##$TOPLEV= 0
##$USERP1= <user>
##$USERP2= <user>
##$USERP3= <user>
##$USERP4= <user>
##$USERP5= <user>
##$WDW= 1
##$XDIM= 131072
##$YMAX_p= 471329702
##$YMIN_p= -12415
##$CURPLOT= <Network HP LaserJet P1505>
##$CURPRIN= <$Network HP LaserJet P1505>
##$DFORMAT= <normdp>
##$LAYOUT= <+/1D_H.xwp>
##$LFORMAT= <normlp>
##$PFORMAT= <normpl>
##$SURQMSG= 1
$$ End of Bruker specific parameters
$$ ---------------------------------
##NTUPLES= NMR SPECTRUM
##VAR_NAME=  FREQUENCY,     SPECTRUM/REAL,   SPECTRUM/IMAG
##SYMBOL=    X,             R,               I
##VAR_TYPE=  INDEPENDENT,   DEPENDENT,       DEPENDENT
##VAR_FORM=  AFFN,          ASDF,            ASDF
##VAR_DIM=   131072,        131072,          131072
##UNITS=     HZ,            ARBITRARY UNITS, ARBITRARY UNITS
##FACTOR=    0.0627417313425164, 1,          1
##FIRST=     8223.62146879497, -712,         -55284
##LAST=      0,             1491,            -55895
##MIN=       0,             -12415,          0
##MAX=       8223.62146879497, 471329702,    0
$$ Real data points
##PAGE= N=1
##DATA TABLE= (X++(R..R)), XYDATA
$$ [...]
63975C98303P387P931Q243Q112Q345R612J1379J2599J3038J3369J4254J5840J7821
63962E46233J9680K1070K2309K4232K7241L0815L4301L7924M2589M8905N6797
63951I12096O5949P6290Q8042J01421J16287J32089J48312J64920J81967J98720
63941B186093K13655K25543K34226K40085K43031K42097K35766K22722K02752
63932D245970J77120J47741J15854Q1811M5987R099k8404o6333j03662j38146
63922D487037j67690j91656k10356k23899k32190k35580k34728k29984k21581
63913B539373k10166j96535j81042j63950j46200j29170j13595r9306q6093p4283
63903A139033o4238n5794m8398m1688l5669l0532k6373k3089k0514j8595j7346
$$ plain form
63975 398303 405690 413621 421864 429976 438321 447933 459312 471911 484949 498318 512572 528412 546233
63962 546233 565913 586983 609292 633524 660765 691580 725881 763805 806394 855299 912096
63951 912096 978045 1054335 1142377 1243798 1360085 1492174 1640486 1805406 1987373 2186093
63941 2186093 2399748 2625291 2859517 3099602 3342633 3584730 3820496 4043218 4245970
63932 4245970 4423090 4570831 4686685 4768496 4814483 4823582 4795178 4728845 4625183 4487037
63922 4487037 4319347 4127691 3917335 3693436 3461246 3225666 2990938 2760954 2539373
63913 2539373 2329207 2132672 1951630 1787680 1641480 1512310 1398715 1299409 1213316 1139033
63903 1139033 1074795 1019001 970603 928915 893246 862714 836341 813252 792738 774143 756797
63892G56797j6643j6295j6295j6703j7253j7472j7246j6890j6457j5513j3892
63881E76138j2093j0481q571n735k301P14K826M455O066P632Q979J0245J1704
63868E89578J3432J5211J6632J7337J7366J7187J7164J7132J6694J5815J4744
63857G68292J3468J1639R101O227L596J465m59k719n504q341j0594j2287j4075
63844G59809j6236j8143j9095j9308j9663k0627k1942k3125k3819k3767k2971
63833E31113k1897k1089k0519j9672j8309j6753j5396j4295j3343j2521j1803
63822C45516j1052j0177r277q519p952p514p126o735o254n543m435k960j443k51
63808B56278N14R11Q18J13p99j123o12O5J91k02p03j277k093k929l344l346l319
$$ plain form
63892 756797 740154 723859 707564 690861 673608 656136 638890 622000 605543 590030 576138
63881 576138 564045 553564 544993 539258 536957 537671 540497 544952 551018 558650 567629 577874 589578
63868 589578 603010 618221 634853 652190 669556 686743 703907 721039 737733 753548 768292
63857 768292 781760 793399 802500 808727 812323 813788 813329 810610 805106 796765 786171 773884 759809
63844 759809 743573 725430 706335 687027 667364 646737 624795 601670 577851 554084 531113
63833 531113 509216 488127 467608 447936 429627 412874 397478 383183 369840 357319 345516
63822 345516 334464 324287 315010 306491 298539 291025 283899 277164 270910 265367 260932 257972 256529 256278
63808 256278 256792 257703 258521 258634 257835 256712 256100 256165 256356 256154 255451 254174 252081 249152 245808 242462 239143
63791B39143l374l222k709k093j732j797k252k828l085k788k167j597j175p77
63777B07547l33K47J044J650J220m02j896j724m9J416J523Q53N10O59P04L35k25
63760B13079o70q54p83p11r60j407j438p38J77O09N77O41J028J448J711J975K281
63743B15965K294J824J279J303K005K806L073K735K216J914J854J792J538J128
63729B43726P75O33O34O00N71R47K012L383M233M159L585L106K704K012J156Q09
63713B75045J264J854J615L65j167k198k606k675k499j968j204o29m31l51j33
63698B64282P5P4N6L44Q64J394K072L136M202M482L808K860K257K010J987K188
63682B96091K318J780N78m42p27p85j209j609j315o15l05l69p7O70J098Q09L54
$$ plain form
63791 239143 235769 232547 229838 227745 226013 224216 221964 219136 216051 213263 211096 209499 208324 207547
63777 207547 207214 207461 208505 210155 211375 210973 209077 207353 207304 208720 210243 211096 211606 212265 212969 213304 213079
63760 213079 212409 211555 210772 210061 209101 207694 206256 205518 205695 206304 206881 207522 208550 209998 211709 213684 215965
63743 215965 218259 220083 221362 222665 224670 227476 230549 233284 235500 237414 239268 241060 242598 243726
63729 243726 244501 245134 245768 246368 246939 247886 249898 253281 257514 261673 265258 268364 271068 273080 274236 275045
63713 275045 276309 278163 279778 280143 278976 276778 274172 271497 268998 267030 265826 265197 264766 264415 264282
63698 264282 264357 264431 264487 264831 265695 267089 269161 272297 276499 280981 284789 287649 289906 291916 293903 296091
63682 296091 298409 300189 300767 300325 299598 298813 297604 295995 294680 294065 293760 293391 293314 293984 295082 295891 296245
63665B96245L20N58O67N98M68J80l97j178k033k925l711m078l791k851j476k02
63649B76394K12n33j726k322k093j613j168n06K76N68K87L35J351K661L165K833
63633B78121K590L026L932N018O263P461Q046P726O959O565O956P898Q926R900
63619C69387J1192J3222J5807J8146J9623K0507K1624K3459K5814K8248L0442
63608E97471L2173L3241L3626L3434L2448K9974K5369J8774J1161L831k106n974
63596H43422p780q282q466q769q995r152r900j1871j4727j7496j9751k1907k4228
63583F72098k6105k6682k5867k4315k2601k0732j8404j5506j2407r885q555q170
63571D52869p603n805k744O31L214M517M918N329O371P751Q719R179R811J0941
$$ plain form
63665 296245 296565 297123 297790 298388 298856 299036 298639 297461 295428 292503 288792 284714 280923 278072 276596 276394
63649 276394 276606 276073 274347 272025 269932 268319 267151 266645 266921 267489 267776 268111 269462 272123 275288 278121
63633 278121 280711 283737 287669 292687 298950 306411 314457 322183 329142 335707 342663 350561 359487 369387
63619 369387 380579 393801 409608 427754 447377 467884 489508 512967 538781 567029 597471
63608 597471 629644 662885 696511 729945 762393 792367 817736 836510 847671 851502 849396 843422
63596 843422 835642 827360 818894 810125 801130 791978 782078 770207 755480 737984 718233 696326 672098
63583 672098 645993 619311 593444 569129 546528 525796 507392 491886 479479 469594 461039 452869
63571 452869 445266 439461 436717 437348 440562 445079 449997 455326 461697 469448 478167 487346 497157 508098
63557E08098J2004J2583J3355J5217J7906K0424K2585K5190K8678L2576L6464
63546G45080M0483M4257M5994M3455L5788K4246J1315n49r740j5665j8394j8298
63534I27972j6038j2664r304o736n452n872q059j1389j5090j9044k3465k7845
63522G67014l1067l2719l3494l3974l3736l2155k9419k6156k2734j9525j7267
63511D54768j6249j5561j4027j1731r790q748q048p180o366n833n286m591m230
63498C37128m449m476l411j619l86k29l84j41J22k92j131j509j104l70L80J239
63482C19368J964J860Q58M3L77J415K002J920J953K405K532J704L68o00r50j045
63466C36174j242j675k377l113l428l169k771k650k594k134j289m27L80J320K260
$$ plain form
63557 508098 520102 532685 546040 561257 579163 599587 622172 647362 676040 708616 745080
63546 745080 785563 829820 875814 919269 955057 979303 990618 990069 980329 964664 946270 927972
63534 927972 911934 899270 889966 883230 877778 871906 863847 852458 837368 818324 794859 767014
63522 767014 735947 703228 669734 635760 602024 569869 540450 514294 491560 472035 454768
63511 454768 438519 422958 408931 397200 387410 378662 370614 363434 357068 351235 345949 341358 337128
63498 337128 332679 328203 324792 323173 322787 322558 322174 322033 322155 321863 320732 319223 318119 317749 318129 319368
63482 319368 321332 323192 324050 324093 324470 325885 327887 329807 331760 334165 336697 338401 338769 338169 337219 336174
63466 336174 334932 333257 330880 327767 324339 321170 318399 315749 313155 311021 309732 309305 309685 311005 313265
63451C13265K873L324M234N670O783O872O429O591P782R464J1079J2683J4465
63438D11514J6282J8038K0220K3459K7572L1290L2959L1387K6448J9361J2317
63427F70847P190M431L450M028O649J1236J6453K0980K5021K9745L5334M0363
63415H75727M3193M3342M1272L7376L1567K3736J4406M895l230r103j2836j4792
63403A075553j4904j3225j0875r719j0890j4049j8217k2816k7658l2345l6179
63392H64676l8541l9185l8299l6356l3812l0917k7898k5065k2412j9404j5812
63381E36975j2587j1031j0921j0340p906m387j475M60K460N163P923R850J0910
63368E15094J1716J2782J4355J6511J8992K1203K2791K4139K5989K8606L1578
$$ plain form
63451 313265 316138 319462 323696 329366 336149 343021 349450 356041 363823 373287 384366 397049 411514
63438 411514 427796 445834 466054 489513 517085 548375 581334 612721 639169 658530 670847
63427 670847 678037 682468 685918 689946 696595 707831 724284 745264 770285 800030 835364 875727
63415 875727 918920 962262 1003534 1040910 1072477 1096213 1110619 1115514 1112284 1103181 1090345 1075553
63403 1075553 1060649 1047424 1036549 1026830 1015940 1001891 983674 960858 933200 900855 864676
63392 864676 826135 786950 748651 712295 678483 647566 619668 594603 572191 552787 536975
63381 536975 524388 513357 502436 492096 484190 479803 478328 478788 481248 486411 494334 504184 515094
63368 515094 526810 539592 553947 570458 589450 610653 633444 657583 683572 712178 743756
63357G43756L4435L7070L9370M0709M0222L7577L3141K7369K0327J2095L459m173
63345A065357r591j2480j3423j3382j3082j2699j2161j1865j2824j5855k0665
63334I17330k5982l0546l3736l5414l5546l4216l1761k8770k5818k3092k0186
63323E92263j6509j2005p333l340p35l32k846p803j3219j7077j8897j9330j8706
63310D54131j6982j4726j2918j1654j0141q218o783o273n828m626l123k251k075
63297C48533k085k204k608k988k877k471k350k509k428k011j751j943k290k417
63283C15601k336k284k428k696k709k030q26Lk10j023j470j317j082r56m31P61
63267B94567K011K475J993J080L56K18P36J560K112K179K146K463L023L381L453
$$ plain form
63357 743756 778191 815261 854631 895340 935562 973139 1006280 1033649 1053976 1066071 1069530 1065357
63345 1065357 1055766 1043286 1029863 1016481 1003399 990700 978539 966674 953850 937995 917330
63334 917330 891348 860802 827066 791652 756106 721890 690129 661359 635541 612449 592263
63323 592263 575754 563749 556416 553076 552341 552009 549163 541360 528141 511064 492167 472837 454131
63310 454131 437149 422423 409505 397851 387710 379492 372709 366436 360608 355982 352859 350608 348533
63297 348533 346448 344244 341636 338648 335771 333300 330950 328441 326013 324002 322251 320308 318018 315601
63283 315601 313265 310981 308553 305857 303148 301118 300292 300295 300085 299062 297592 296275 295193 294237 293806 294567
63267 294567 296578 299053 301046 302126 302482 302700 303436 304996 307108 309287 311433 313896 316919 320300 323753
63252C23753L599M011M335M166L685L553M156N261O409P426Q353R163R800J0435
63238D08105J1396J2808J4499J6243J7918J9400K0518K1236K1720K2191K2715
63227F08749K3127K3055K2218K0839J9642J9222J9490J9928K0254K0565K1019
63216H38108K1652K2421K3012K2700K0817J7398J3075Q385L425j849p338j2826
63204I68980j7916k2134k5286k7589k9183k9805k9365k8404k7390k5865k3172
63193F82871j9694j6458j3698j0846p893n520l734j652R34L022L995M686O005
63180F22018P567Q553R138R985J0989J1557J1718J1953J2222J2073J1549J1131
63168G50453J0889J0344R145P342N107K669L21k029n024r036j3421j7050j9480
$$ plain form
63252 323753 327352 331363 335698 339864 343549 347102 351258 356519 362928 370354 378707 387870 397670 408105
63238 408105 419501 432309 446808 463051 480969 500369 520887 542123 563843 586034 608749
63227 608749 631876 654931 677149 697988 717630 736852 756342 776270 796524 817089 838108
63216 838108 859760 882181 905193 927893 948710 966108 979183 987568 990993 989144 981806 968980
63204 968980 951064 928930 903644 876055 846872 817067 787702 759298 731908 706043 682871
63193 682871 663177 646719 633021 622175 614282 608762 605028 603376 604310 607332 611327 616013 622018
63180 622018 629585 638138 647276 657261 668250 679807 691525 703478 715700 727773 739322 750453
63168 750453 761342 771686 780831 788173 793280 795949 796270 794241 789217 780181 766760 749710 730230
63155G30230k1075k2230k2908k2858k1878k0068j8056j6571j5592j4303j2284
63144E22407j0095q380o996n679m812m825n320n577n412m857l659j904n20j63
63130D54208r6P72K176K962K936L029L719M494M877M971M937M815M922N448N773
63115E09943N070L570K318J745J446J272J527K065K297K221K394K713K381J292
63101E42254L26J0l9p0K51Q26Q79K82J9O62J385J196K59o66j240j296n03Q81J735
63082E47151J456R29J261K166K641K643K987L908M794N276N661O237O911P622
63068F01643Q463R351J0034J0518J1037J1684J2455J3584J5381J7679J9932K1899
63056G63660K4017K6910L0673L4666L8016M0475M2711M5457M8455N0677N1692
$$ plain form
63155 730230 709155 686925 664017 641159 619281 599213 581157 564586 548994 534691 522407
63144 522407 512312 503932 496936 491257 486445 481620 476300 470723 465311 460454 456795 454891 454371 454208
63130 454208 454112 454884 457060 460022 462958 465987 469706 474200 479077 484048 488985 493800 498722 504170 509943
63115 509943 515013 518583 520901 522646 524092 525364 526891 528956 531253 533474 535868 538581 540962 542254
63101 542254 542580 542590 542551 542481 542732 543558 544437 544719 544738 545400 546785 547981 548240 547574 546334 545038 544535 545416 547151
63082 547151 548607 549536 550797 552963 555604 558247 561234 565142 569936 575212 580873 587110 594021 601643
63068 601643 610106 619457 629491 640009 651046 662730 675185 688769 704150 721829 741761 763660
63056 763660 787677 814587 845260 879926 917942 958417 1001128 1046585 1095040 1145717 1197409
63045A197409N2179N2768N3028N2129N0167M8196M7164M7237M8040M9043M9739
63034A747099M9875M9541M8912M7881M6005M2642L7114K9069J8908P567m351j6770
63022B103492k9397m1244n1355n9575o6143p0890p3310p3252p1062o7234o2348
63011A437682n7131n2019m6715m0645l3859k7141k1160j5827j0577n089K74M713
62999A132506P773R849J1693J3450J4662J5330J6235J7799J9246J9593J9091J8831
62987A316058J9162J9322J8642J7194J5081J1897P418K233k877p917j3448j9559
62975A383206k5571l0768l4974l8252m0443m1298m0889l9610l7857l5907l4015
62964I83622l2294l0424k7888k4672k1473j8995j7337j6248j5651j5514j5512
$$ plain form
63045 1197409 1249588 1302356 1355384 1407513 1457680 1505876 1553040 1600277 1648317 1697360 1747099
63034 1747099 1796974 1846515 1895427 1943308 1989313 2031955 2069069 2098138 2117046 2124613 2120262 2103492
63022 2103492 2074095 2032851 1981496 1921921 1855778 1784888 1711578 1638326 1567264 1500030 1437682
63011 1437682 1380551 1328532 1281817 1241172 1207313 1180172 1159012 1143185 1132608 1127519 1127793 1132506
62999 1132506 1140279 1150128 1161821 1175271 1189933 1205263 1221498 1239297 1258543 1278136 1297227 1316058
62987 1316058 1335220 1354542 1373184 1390378 1405459 1417356 1424774 1427007 1424130 1416213 1402765 1383206
62975 1383206 1357635 1326867 1291893 1253641 1213198 1171900 1131011 1091401 1053544 1017637 983622
62964 983622 951328 920904 893016 868344 846871 827876 810539 794291 778640 763126 747614
62953G47614j5310j4985j4740j4360j3524j2444j1682j1338j1144j1139j1544
62942F05404j1923j1424j0037q747q062p257n684m007l355l723m134m028l719
62929E19304l521l211k440j222O7Q92Q65J45n96r12j109j677k433k684k157j347
62913D97964r03r96j330j494j336j188j621k790m102m703m244l043j712q00m94
62898D67208n18m28j77q9j48J50R57J582J284L13m10l96R1N67P01L59k14m18K0
62879D70434N37M63J6p6K30K44k79p71r49j393k487l427l059j492m3L73J63J70
62861D58654M10K88l14p40m70J98P24J120J670K107J771O63l03l37M09J318K087
62844D69255K586K441J439J29n85n10l27o43j308j787j863j761j745j829j774
$$ plain form
62953 747614 732304 717319 702579 688219 674695 662251 650569 639231 628087 616948 605404
62942 605404 593481 582057 572020 563273 555211 547954 542270 538263 534908 531185 527051 523023 519304
62929 519304 515783 512572 510132 508910 508977 509869 510734 510879 510283 509371 508262 506585 504152 501468 499311 497964
62913 497964 497061 496065 494735 493241 491905 490717 489096 486306 482204 477501 473257 470214 468502 467702 467208
62898 467208 466690 466262 466085 465996 465848 465998 466955 468537 469821 470134 469724 469328 469419 469986 470687 471046 470832 470414 470434
62879 470434 470971 471434 471450 471374 471604 471848 471569 470798 469849 468456 465969 462542 459483 457991 457948 458321 458484 458654
62861 458654 459064 459352 459038 458298 457828 458026 458750 459870 461540 463647 465418 466081 465778 465441 465850 467168 469255
62844 469255 471841 474282 475721 475850 475265 474755 474428 473785 472477 470690 468827 467066 465321 463492 461718
62829D61718j381p58k30O4L54Q89J555J991J991J694J485J753K536L312L480L156
62813D83609L147L816M430M096L096K626L279M363M890M699M384M450M921N651
62799E41457O570P563Q327Q644Q799R497J1137J3324J5356J7132J9235K2031K5205
62786G14277K8323L1516L5235L9596M4359M9410N4872O0753O6809P2762P8509
62775A276421Q3930Q8580R1569R1903Q9121Q3606P6061O6764N5532M2356K7668
62764B073511J1997m097j9656l3544m5400n5919o5637p3861p9351q1894q2586
62753A543563q2515q1716p9530p5709p0869o5947o1363n6823n2011m7249m3176
62742H26655l9863l6673l3093k9271k5709k2771k0599j8968j7166j4584j1665
$$ plain form
62829 461718 460337 459579 459349 459413 459767 460656 462211 464202 466193 467887 469372 471125 473661 476973 480453 483609
62813 483609 486756 490572 495002 499098 502194 504820 508099 512462 517352 522051 526435 530885 535806 541457
62799 541457 548027 555590 563917 572561 581360 590857 601994 615318 630674 647806 667041 689072 714277
62786 714277 742600 774116 809351 848947 893306 942716 997588 1058341 1125150 1197912 1276421
62775 1276421 1360351 1448931 1540500 1632403 1721524 1805130 1881191 1947955 2003487 2045843 2073511
62764 2073511 2085508 2081411 2061755 2028211 1982811 1926892 1861255 1787394 1708043 1626149 1543563
62753 1543563 1461048 1379332 1299802 1224093 1153224 1087277 1025914 969091 917080 869831 826655
62742 826655 786792 750119 717026 687755 662046 639275 618676 599708 582542 567958 556293
62731E56293r607q854q504p598o318n376m867m431l943l329k196m81R24J125N36
62716D93374L80J074K064L059M407O170P838R241J0867J2938J4957J6613J8440
62703F01422K1035K4120K6992K9497L2028L4767L7478M0008M2517M5115M7533
62692I82512M9311N0148M9908M8345M5018L9663L2588K4458J5688O273l710j3679
62680A326523k2816l0556l6720m1420m4941m7464m8821m8753m7540m5890m4112
62669H67490m1943l9334l6799l4543l2000k8789k5545k3054k1113j9057j7014
62658E48299j5584j4592j3189j1231r541q687q326p988p709p534p112o140m856
62645D25810l783l249l258l462l275k468j574j262j358j141n21j26j49j1M83N96
$$ plain form
62731 556293 546686 537832 529328 521730 515412 510036 505169 500738 496795 493466 491270 490789 491713 492838 493374
62716 493374 493754 494828 496892 499951 504358 510528 518366 527607 538474 551412 566369 582982 601422
62703 601422 622457 646577 673569 703066 735094 769861 807339 847347 889864 934979 982512
62692 982512 1031823 1081971 1131879 1180224 1225242 1264905 1297493 1321951 1337639 1343912 1340202 1326523
62680 1326523 1303707 1273151 1236431 1195011 1150070 1102606 1053785 1005032 957492 911602 867490
62669 867490 825547 786213 749414 714871 682871 654082 628537 605483 584370 565313 548299
62658 548299 532715 518123 504934 493703 484162 475475 467149 459161 451452 443918 436806 430666 425810
62645 425810 422027 418778 415520 412058 408783 406315 404741 403479 402121 400980 400459 400333 400184 400173 400656 401252
62629D01252j47r13n52P00J399P40n33j205r77m26Q9Q71K190L635M486M598M511
62612D19718M734N300O013O691P046O864O597P207Q982J0993J2218J2821J3772
62599E28956J5524J7751K0174K2956K6306L0136L4127L7822M0763M2847M4283
62588H61645M4928M4098M1343L6949L1295K4362J6421Q443J015o445j4407k1890
62576A067757k7539l1551l5092l8172l9679l9418l8526l7648l6220l3953l1561
62565F78398k9425k6838k3409k0143j8232j7545j6967j5669j3448j0609q055o828
62553D71230o906p062o326m965l668k555j556r15p11n16j78j84o87r55m97j8l57
62536D33174j098j226p11m78r27j419j167p6J342K456K972L261M033N488P091
$$ plain form
62629 401252 401105 400192 399640 400340 401739 402479 401946 400741 399764 399338 399427 400298 402488 406123 410609 415207 419718
62612 419718 424452 429752 435765 442456 449502 456366 462963 470170 479152 490145 502363 515184 528956
62599 528956 544480 562231 582405 605361 631667 661803 695930 733752 774515 817362 861645
62588 861645 906573 950671 992014 1028963 1060258 1084620 1101041 1109484 1110499 1104054 1089647 1067757
62576 1067757 1040218 1008667 973575 935403 895724 856306 817780 780132 743912 709959 678398
62565 678398 648973 622135 598726 578583 560351 542806 525839 510170 496722 486113 478058 471230
62553 471230 464324 457262 450936 445971 442303 439748 438192 437277 436566 436050 435872 435688 435001 434046 433549 433531 433174
62536 433174 432076 430850 430139 429661 428734 427315 426148 426072 427414 429870 432842 436103 440136 445624 452715
62521D52715Q379R515J0807J2197J3684J5639J8242K1056K3575K5762K7628K8952
62509F68151K9845L0880L2007L2087L0232K7084K3867K0804J7344J3470R603N627
62497I41001J129l446o962q931r713r369p398l880R8L660P131J1305J6281K1487
62483I52393K6489L1275L5909M0249M3985M6694M7808M6647M2649L5813K7014
62472A376925J7668Q842O94p272j5655k4813l4542m3751n0847n4958n6645n7120
62460A058526n7015n6183n4378n1588m7842m3192l7980l2773k7948k3497j9285
62449F06845j5405j2244j0093q596o851m392j840l6J285L069N297O815P078P004
62435E77936P469P980P624O503N218L597J033k284n453p897r567j0391j0447j0375
$$ plain form
62521 452715 461094 470609 481416 493613 507297 522936 541178 562234 585809 611571 639199 668151
62509 668151 697996 728876 760883 792970 823202 850286 874153 894957 912301 925771 935374 941001
62497 941001 942130 938684 931722 922791 913078 903709 896311 892431 892529 896189 903320 914625 930906 952393
62483 952393 978882 1010157 1046066 1086315 1130300 1176994 1224802 1271449 1314098 1349911 1376925
62472 1376925 1394593 1403435 1404129 1396857 1381202 1356389 1321847 1278096 1227249 1172291 1115646 1058526
62460 1058526 1001511 945328 890950 839362 791520 748328 710348 677575 649627 626130 606845
62449 606845 591440 579196 569103 560507 553656 549264 547424 547388 548673 551742 557039 563854 570932 577936
62435 577936 585405 593385 601009 607512 612730 616327 617360 615076 609623 601726 592159 581768 571321 560946
62421E60946j0740j1178j0991j0286r618q853p527o107n660o163o376n688m971
62408D56788n061n424n028l813k614k017j909j860j551j006n97o03o83j93Q63
62393D25292J720J874J682J673J780J696J609K045L086M137M519M150L615L634
62379D62512M405N486O374P045P752Q460Q877Q947Q957R126R446R956J0830J2132
62365E80305J3804J5930J8676K1953K5483K9256L3568L8480M3570M8343N2684
62354I22052N6718O0336O2875O3305O0867N5676M8528M0020L0249J9633R462R69
62342A430690n861j1922j7681k3012k8109l3485l8774m2502m3615m2618m0739
62331A102372l8383l5084l0629k5666k1150j7551j4674j2165j0134r172r619j0976
$$ plain form
62421 560946 550206 539028 528037 517751 508133 499280 491753 485646 479986 473823 467447 461759 456788
62408 456788 451727 446303 441275 437462 434848 432831 430922 429062 427511 426505 425908 425305 424622 424429 425292
62393 425292 427012 428886 430568 432241 434021 435717 437326 439371 442457 446594 451113 455263 458878 462512
62379 462512 466917 472403 478777 485822 493574 502034 510911 519858 528815 537941 547387 557343 568173 580305
62365 580305 594109 610039 628715 650668 676151 705407 738975 777455 821025 869368 922052
62354 922052 978770 1039106 1101981 1165286 1226153 1281829 1330357 1370377 1400626 1420259 1429721 1430690
62342 1430690 1424829 1412907 1395226 1372214 1344105 1310620 1271846 1229344 1185729 1143111 1102372
62331 1102372 1063989 1028905 998276 972610 951460 933909 919235 907070 896936 887764 878145 867169
62319H67169j2484j4159j6648k0032k3288k5264k5686k4962k3557k1916k0549
62308F38624j9540j8322j6410j4227j2618j1715j0836r508q010o813n936n150
62296D99539m384l645k781j672n31K82O79Q55R51J029J289J940K762L233L292
62281E02838L570M484N473N679N172M870N285N973O343O457O741P423Q561J0182
62267E89051J2017J3544J4643J5927J8012K0801K3824K7051L0852L5380M0420
62256H41522M5733N1186N6554O1452O5314O7288O6551O2992N7303N0062M1171
62245A467128L0701J9809J0061J894n528j3072k0877k8754l6591m4041n0424n5238
62233A275068n8448o0056n9769n7384n3344m8591m3944l9606l5270l0672k6097
$$ plain form
62319 867169 854685 840526 823878 803846 780558 755294 729608 704646 681089 659173 638624
62308 638624 619084 600762 584352 570125 557507 545792 534956 525448 517438 510625 504689 499539
62296 499539 495155 491510 488729 487057 486526 486808 487487 488342 489293 490322 491611 493551 496313 499546 502838
62281 502838 506408 510892 516365 522044 527216 532086 537371 543344 549687 556144 562885 570308 578869 589051
62267 589051 601068 614612 629255 645182 663194 683995 707819 734870 765722 801102 841522
62256 841522 887255 938441 994995 1056447 1121761 1189049 1255600 1318592 1375895 1425957 1467128
62245 1467128 1497829 1517638 1527699 1529593 1524065 1510993 1490116 1461362 1424771 1380730 1330306 1275068
62233 1275068 1216620 1156564 1096795 1039411 986067 937476 893532 853926 818656 787984 761887
62222G61887k2174j9142j6649j4365j2489j1234j0209q819p119n791n230n188
62210F23478n214n066m591l723k662j793j300j102j125j347j540j319n26O24J820
62195E94614K878L733M393M944N480O077O784P543Q044P996P631P636Q355R380
62181F85488J0124J0377J0130R322Q177P328P125P207P196P439Q541J0536J3092
62168H02082J6180J9966K4306K8917L3742L8595M2783M5640M7016M6620M3493
62157A189340L7123K8739K0459J3253O660K68n613j0796j5640k0387k4901k9150
62145A189355l3183l6493l8244l8295l7283l5558l2867k9217k5213k1295j7452
62134H44255j3894j1151r260p620n997m919m811n410o271p058p138n843l528j497
$$ plain form
62222 761887 739713 720571 703922 689557 677068 665834 655625 646806 639687 633896 628666 623478
62210 623478 618264 613198 608607 604884 602222 600429 599129 598027 596902 595555 594015 592696 592170 592794 594614
62195 594614 597492 601225 605618 610562 616042 622119 628903 636446 644490 652486 660117 667753 676108 685488
62181 685488 695612 705989 716119 725441 733618 740946 748071 755278 762474 769913 778454 788990 802082
62168 802082 818262 838228 862534 891451 925193 963788 1006571 1052211 1099227 1145847 1189340
62157 1189340 1226463 1255202 1275661 1288914 1295574 1295842 1290229 1279433 1263793 1243406 1218505 1189355
62145 1189355 1156172 1119679 1081435 1043140 1005857 970299 937432 908215 883002 861707 844255
62134 844255 830361 819210 809950 802330 796333 791414 786603 781193 774922 767864 760726 754883 751355 749858
62120G49858l81N35J751K269P62k491n733p439p305n904m176l033k892l569m934
62105G07318p254j0465j3541j5214j5187j4115j2521j0395p752n102l073j840
62093E90859j042j88R44K207L371M403N342O059O368O383O548P180Q146Q977R232
62078F64789R000R056J0252J2485J4641J5953J6957J8564K0696K2529K3776K4866
62066H63564K6090K7425K9100L1352L3688L5249L5789L5414L3495K9116K2650
62055A202932J5697R141K531m285j0233j4478j7686k0972k4510k7974l1544l5440
62043A043179l9085m1618m2862m3075m2238m0378l8101l5997l3801l0877k7323
62032F27824k3929k1213j9051j7156j5395j3761j2330j1114r809q073o226n152
$$ plain form
62120 749858 749477 750012 751763 754032 754794 752303 746570 739131 731826 725922 721746 718713 715821 712252 707318
62105 707318 700064 689599 676058 660844 645657 631542 619021 608626 600874 595772 592699 590859
62093 590859 589817 589629 590573 592780 596151 600554 605896 611955 618323 624706 631254 638434 646580 655557 664789
62078 664789 673789 682845 693097 705582 720223 736176 753133 771697 792393 814922 838698 863564
62066 863564 889654 917079 946179 977531 1011219 1046468 1082257 1117671 1151166 1180282 1202932
62055 1202932 1218629 1227770 1230301 1226016 1215783 1201305 1183619 1162647 1138137 1110163 1078619 1043179
62043 1043179 1004094 962476 919614 876539 834301 793923 755822 719825 686024 655147 627824
62032 627824 603895 582682 563631 546475 531080 517319 504989 493875 484066 475993 469767 464615
62020D64615n224n792o079o022n885n621n178m931n155n424n051l935k526j246
62006C96546k82L26P03J090J560K183L348N382P615Q655P916O262M805L829L183
61991D53121K841K564J751L40q43j282j634k758m491o074p163p709p515o711o132
61976D08305o356o794o506n476m366l516l007l130l847m217l330j625l65mM9K55
61960C56070M39M52M76N82N96M35J63j81m72m00O6N15Q11J566L277N423O982P583
61942C84383P626P676Q259R671J1418J2351J2139J1952J2870J4233J4623J3930
61930E21131J3188J2705J1778J0161Q606P594O634N098L034Q50j152k837m300
61917E92490n870p487q262p401n419l572k157k77K626N855Q370R910J0903J1825
$$ plain form
62020 464615 459391 453599 447520 441498 435613 429992 424814 419883 414728 409304 404253 400318 397792 396546
62006 396546 396264 396590 397293 398383 399943 402126 405474 410856 418471 427126 435042 441304 446109 449938 453121
61991 453121 455962 458526 460277 460617 459774 458492 456858 454100 449609 443535 436372 428663 421148 414437 408305
61976 408305 401949 395155 388649 383173 378807 375291 372284 369154 365307 361090 357760 356135 355770 355766 355815 356070
61960 356070 356509 356961 357437 358019 358615 359050 359213 359032 358560 358160 358226 358741 359552 361118 364395 369818 376800 384383
61942 384383 392009 399685 407944 417615 429033 441384 453523 465475 478345 492578 507201 521131
61930 521131 534319 547024 558802 568963 577569 585163 591797 596895 599929 600779 599627 596790 592490
61917 592490 586620 579133 570871 563470 558051 554479 552322 552045 554671 560526 568896 578806 589709 601534
61903F01534J2839J3624J3419J1616Q421M638R75k152m422n843o967q287r554
61890F29841j0239j0412j0581j0809j0697j0085r169q089p032o469o604o805o381
61877E16469n710n753o611p436p663p438o848n698m170k855j976j255n67j2O64
61862D53141J892L420M477M910N400O418P783R364J1406J3863J6164J7950J9419
61849E75607K0717K1674K2377K3303K4492K5137K4454K2545K0087J7482J4569
61838H12444J0933O435J574k675n674p641r093j0010r959q826o828m060o29K988
61824G68979O243R007J1249J2479J2255J0870Q882O280K885q10m177p472j1230
61811H25440j4901j7304j8391j9259k0320k0690j9796j8380j7424j6945j6407
$$ plain form
61903 601534 614373 627997 641416 653032 661453 666091 667066 664914 660492 654649 647682 639395 629841
61890 629841 619602 609190 598609 587800 577103 567018 557849 549760 542728 536259 529655 522850 516469
61877 516469 510759 505006 498395 490959 483296 475858 469010 463312 459142 456287 454311 453056 452489 452477 453141
61862 453141 455033 458453 462930 467840 473240 479658 487441 496805 508211 522074 538238 556188 575607
61849 575607 596324 617998 640375 663678 688170 713307 737761 760306 780393 797875 812444
61838 812444 823377 829812 831386 828711 823037 815396 806303 796293 786334 777508 770680 766620 765991 768979
61824 768979 775222 784229 795478 807957 820212 831082 839964 846244 849129 848319 844142 836670 825440
61811 825440 810539 793235 774844 755585 735265 714575 694779 676399 658975 642030 625623
61800F25623j5557j4408j3015j1577j0341r260q254p707p871p974o812m444k290
61787E06113j421j601k136k710l072k857k057j049n7P46P60m34j992k513j901
61772D83819j382j545j644j142o03n41o17m61k40J16J009K047K101J111N68J363
61756D83959K514K935L141L998M898M594L098J434J14r90j756k031k343l209m088
61741D96268m069l397l195l802m333m006l019k030j334p85j52M94O53r9j266j615
61725D64313n96Q79J509J146P08R21J615K088J823R58K36J88L79l5j010j565j225
61708D72332n99l52n01j046k270l822m573m142l668m174n006m850l663k548k200
61693D28918k474l037l548l482k724k055k285l138l708l698l441l014k164j036
$$ plain form
61800 625623 610066 595658 582643 571066 560725 551465 543211 535504 527633 519659 512847 508403 506113
61787 506113 504692 503091 500955 498245 495173 492316 490259 489210 489153 489899 490659 490225 488233 485720 483819
61772 483819 482437 480892 479248 478106 477503 476962 476345 475884 475644 475760 476769 478816 480917 482028 482596 483959
61756 483959 486473 489408 492549 496547 501445 506039 509137 510571 510685 509695 507939 505908 503565 500356 496268
61741 496268 492199 488802 485607 481805 477472 473466 470447 468417 467083 466298 466146 466640 467293 467194 465928 464313
61725 464313 463717 464596 466105 467251 467959 468880 470495 472583 474406 475364 475600 475788 476167 476132 475122 473557 472332
61708 472332 471733 471381 470880 469834 467564 463742 459169 455027 451359 447185 442179 437329 433666 431118 428918
61693 428918 426444 423407 419859 416377 413653 411598 409313 406175 402467 398769 395328 392314 390150 389114
61679C89114k43j93q28j773k437k304j519q79q73j253j731k353k753k059l11R58
61663C68563O17l69k73R75J976K009J677J596J722J893K031J720O40n77q68j79
61647C83153M91N34L85O31J349K424L758M966N506N243M399L075J405Q2j86K94
61631D17509M20l09j338k112k746l427l863l791l579l802m471m965m705l763k789
61616C72269k274j991j416o42k80m42n04k76n00j601k753l119l225l918m629m066
61600C40633k453j460j824k415k172j621j724k218k140j427r93j367k035k253
61586C14531k002j836k022k179j856j222q73r83j139j056r83j115j114o57PM69
61570B95970P40R54Q71L09l06m28j69l0n3Q8M04O03P04R56J298J371J044N27P5
$$ plain form
61679 389114 388871 388678 387850 386077 383640 381336 379817 378938 378065 376812 375081 372728 369975 367916 367605 368563
61663 368563 369180 368811 368538 369513 371489 373498 375175 376771 378493 380386 382417 384137 384777 384200 383332 383153
61647 383153 383644 384178 384563 385194 386543 388967 392725 397691 403197 408440 412839 415914 417319 417401 417215 417509
61631 417509 417929 417620 416282 414170 411424 407997 404134 400343 396764 392962 388491 383526 378821 375058 372269
61616 372269 369995 368004 366588 365946 365666 365224 364720 364444 363944 362343 359590 356471 353246 349328 344699 340633
61600 340633 338180 336720 334896 332481 330309 328688 326964 324746 322606 321179 320186 318819 316784 314531
61586 314531 312529 310693 308671 306492 304636 303414 302541 301558 300419 299363 298380 297265 296151 295494 295501 295970
61570 295970 296710 297664 298535 298844 298538 298110 297941 297911 297858 297946 298350 298953 299657 300613 301911 303282 304326 304853 304928
61551C04928o5K66Q04R36N96N42J190J737J257J69l48q5J39m3j31J56L83K15m9
61532C12597q1K9J87O03J400K305K852K675J686K96p42j116j284j643j772j173
61516C16819k96l6m18p07o01m16k35K41Q88J196J112J069J074O40k06o28j21P97
61498C20172J250R10N9q05j232j091p33n07k70K51P94Q27L73NQ4N48J270K109
61480C24014K725K895K851K735K111O70q99j585j329q89o57m89m15o40r39r87
61464C29172j013j296j355o64K00L04l2K59J043J124K80l20l5L93L28J83L29M00
61446C29300J82R7K24O3k71K16J802L372L959L841L481K669J515J029J635K223
61430C55337J762R26Q98J491J714J602K019L023L727L725L535L575L644L519L379
$$ plain form
61551 304928 304863 305129 305933 306869 307465 308007 309197 310934 312191 312360 312012 311927 312066 312023 311892 312048 312431 312646 312597
61532 312597 312516 312545 312732 313335 314735 317040 319892 322567 324253 324549 323807 322691 321407 319764 317992 316819
61516 316819 316523 316487 316069 315362 314761 314345 314110 314351 315239 316435 317547 318616 319690 320330 320124 319496 319375 320172
61498 320172 321422 322332 322391 321586 320354 319263 318530 318023 317753 318004 318798 319625 319998 320003 320087 320635 321905 324014
61480 324014 326739 329634 332485 335220 337331 338001 337102 335517 334188 333299 332642 332153 331738 331098 330159 329172
61464 329172 328159 326863 325508 324844 325044 325348 325316 325575 326618 327742 328022 327702 327667 328060 328388 328571 328900 329300
61446 329300 329482 329579 329803 329866 329595 329811 331613 334985 338944 342785 346266 348935 350450 351479 353114 355337
61430 355337 357099 358025 358923 360414 362128 363730 365749 368772 372499 376224 379759 383334 386978 390497 393876
61415C93876L436L588L500K781J314l69j320j156n33l28p52j511k294k708k280
61400C95244j129j69j36p52j387k005k821l464l268k276j250o82l46J40O98Q61
61384C77258K90q12j748j991j751j627j750j681j182m96J85R61J759K242K334
61369C71991K284K000J091k07q99m26O18J421J916K391K798K970L008L014K893
61354C96863K816L274M249N018N204N399O158P008P113O360N207L957K835K251
61340D63712K336K620K712K835L180L339K974K474K279K066J355M34j43n46j322
61325D90305k336k928k883k530k070j453p77j66O10J757K908L558L803M095M538
61310D96431N069O007P667R583J0944J1784J2906J4465J5382J4539J2171R694
$$ plain form
61415 393876 397312 400900 404400 407181 408495 408126 406806 405650 405117 404789 404037 402526 400232 397524 395244
61400 395244 394115 393946 393810 393058 391671 389666 386845 383381 380113 377837 376587 375905 375559 375699 376397 377258
61384 377258 377548 376736 374988 372997 371246 369619 367869 366188 365006 364510 364695 365656 367415 369657 371991
61369 371991 374275 376275 377366 377159 376260 375834 376452 377873 379789 382180 384978 387948 390956 393970 396863
61354 396863 399679 402953 407202 412220 417424 422823 428981 435989 443102 449462 454669 458626 461461 463712
61340 463712 466048 468668 471380 474215 477395 480734 483708 486182 488461 490527 491882 492316 492173 491627 490305
61325 490305 487969 485041 482158 479628 477558 476105 475328 475162 475772 477529 480437 483995 487798 491893 496431
61310 496431 501500 507507 515174 524757 535701 547485 560391 574856 590238 604777 616948 626642
61298F26642Q227P519O352L974R90j389k791l866n078o065o493o800p561q613
61284F05048r380r693r750r608r161q386p276n865m560l953l960l659k391n49
61270E16857J092K231K797K595J790J135J064J206J331K064L809N731O777P105
61256E57584P399P356O112L922K152J599J815K107K251K112J514P10K49J59m0
61241E97001n04q09o57k36J75L99K17l87r59j044p96m81L56K356M953O543O315
61224F12442N199M672N206O257P151P617P697P657P822Q296Q852R134Q931Q291
61210G15224P520O909O404N711M863M376M569N072N362N477N854O666P735Q908
61196H00650J0201J1631J3155J4585J5496J5490J4709J3597J2102R749O694L950
$$ plain form
61298 626642 634869 642388 648740 652714 653704 652315 649524 645658 640580 634515 628022 621222 613661 605048
61284 605048 595668 585975 576225 566617 557456 549070 541794 535929 531369 527416 523456 519797 517406 516857
61270 516857 517949 520180 522977 525572 527362 528497 529561 530767 532098 534162 537971 543702 550479 557584
61256 557584 564983 572339 578451 582373 584525 586124 587939 590046 592297 594409 595923 596633 596882 597041 597001
61241 597001 596497 595688 595031 594795 594970 595369 595586 595199 594240 593196 592400 591919 592275 594631 599584 606127 612442
61224 612442 617641 622313 627519 633776 640927 648544 656241 663898 671720 680016 688868 698002 706933 715224
61210 715224 722744 729653 736057 741768 746631 751007 755576 760648 766010 771487 777341 784007 791742 800650
61196 800650 810851 822482 835637 850222 865718 881208 895917 909514 921616 931365 938059 942009
61184I42009K157Q81m05j444j904k188k770l396l720m056m711n208n117n031n746
61169H99351o989p929q408q693q617q054p697q142q633q074o834o197o253n852
61155G92979m595l284k276q38J530M270O694Q603R740R707Q778P840P145O010
61141H52303M085K092J015J271K794N155P416Q770R434J0231J1289J2108J2745
61128I40708J3782J5054J5742J5917J6705J8470K0084K0557K0336K0335K0752
61117A138442K1479K2688K4202K5146K4959K4156K3471K2870K1970K0769J9353
61106A389505J7499J5103J2533J0037P391M449J396j877n883j0524j4787j8030
61094A406812k0812k3811k6616k8433k9343k9996l0468l0384k9881k9582k9565
$$ plain form
61184 942009 944166 945047 944642 943198 941294 939106 936336 932940 929220 925164 920453 915245 910128 905097 899351
61169 899351 892362 884433 876025 867332 858715 850661 842964 834822 826189 818115 811281 805084 798831 792979
61155 792979 788384 785100 782824 781986 783516 787786 794480 803083 812823 822530 831308 839148 846293 852303
61141 852303 856388 858480 859495 860766 863560 868715 876131 884901 894335 904566 915855 927963 940708
61128 940708 954490 969544 985286 1001203 1017908 1036378 1056462 1077019 1097355 1117690 1138442
61117 1138442 1159921 1182609 1206811 1231957 1256916 1281072 1304543 1327413 1349383 1370152 1389505
61106 1389505 1407004 1422107 1434640 1444677 1452068 1456517 1457913 1456036 1450153 1439629 1424842 1406812
61094 1406812 1386000 1362189 1335573 1307140 1277797 1247801 1217333 1186949 1157068 1127486 1097921
61083A097921k9099k7597k5430k3524k2364k1561k0453j8969j7596j6466j5055
61072H59807j3152j1521j0855j0560r502p704o210n465m903m135l319k324p25
61059G69432J127K145K005J605J767K471L540M954O268O969P607R256J1582J3061
61045H43789J3464J4407J6696J8946J9942K0634K2432K4922K6762K7715K8374
61034A078083K8969K9862L2176L6347M0849M3767M4790M4583M3364M1712M1519
61023A506021M4275M9257N5048O1849P0335P9466Q7716R5635J04884J15839J28980
61012B399305J47624J75909K14654K62878L22892L99412M93920O05760P39761
61003E762115R05697J107352J339472J597319J870318K103837K175555J952482
$$ plain form
61083 1097921 1068822 1041225 1015795 992271 969907 948346 927893 908924 891328 874862 859807
61072 859807 846655 835134 824279 813719 804217 796513 790303 784838 779935 775800 772481 770157 769432
61059 769432 770559 772704 774709 776314 778081 780552 784092 789046 795314 802283 809890 819146 830728 843789
61045 843789 857253 871660 888356 907302 927244 947878 970310 995232 1021994 1049709 1078083
61034 1078083 1107052 1136914 1169090 1205437 1246286 1290053 1334843 1379426 1422790 1464502 1506021
61023 1506021 1550296 1599553 1654601 1716450 1786785 1866251 1953967 2049602 2154486 2270325 2399305
61012 2399305 2546929 2722838 2937492 3200370 3523262 3922674 4416594 5022354 5762115
61003 5762115 6667812 7775164 9114636 10711955 12582273 14686110 16861665 18814147
60995A8814147J410206O97288N7898l25155m16381k81793m861L23687N63352N41865
60985B1380253J66527m80713j179866j715272j990156k029782j912554j712683
60977A0525754j484114j262025j063117q89641p39605o12862n08539m22516l50664
60968C192671k91937k46229k11301j83776j61532j43438j28074j14334j02333
60959A609717r2252q3074p3552o3766n4592m6327l8947l3089k9561k8087k7522
60948A038948k7078k6553k5615k3866k1528j9283j7403j5677j4085j2894j2201
60937H22765j1979j2412j3528j4676j5170j5334j5960j6775j6479j4662j2619
60926F63171j1717j1708j1357j0164q700p643p150p067p146p100o825o466o077
$$ plain form
60995 18814147 20224353 20921641 20979539 20654384 20238003 19956210 19951349 20275036 20838388 21380253
60985 21380253 21546780 21066067 19886201 18170929 16180773 14150991 12238437 10525754
60977 10525754 9041640 7779615 6716498 5826857 5087252 4474390 3965851 3543335 3192671
60968 3192671 2900734 2654505 2443204 2259428 2097896 1954458 1826384 1712050 1609717
60959 1609717 1517465 1434391 1360839 1297073 1242481 1196154 1157207 1124118 1094557 1066470 1038948
60948 1038948 1011870 985317 959702 935836 914308 895025 877622 861945 847860 834966 822765
60937 822765 810786 798374 784846 770170 755000 739666 723706 706931 690452 675790 663171
60926 663171 651454 639746 628389 618225 609525 601882 594732 587665 580519 573419 566594 560128 554051
60913E54051n404m362l428l160l444l627l291k596j963j639j513j207m69M08Q44
60898E19200O56J42n53j459k108j703m74j5j410l630m799m529l961l829l821l739
60882D83968m020m739n133m669l759l105k896k972l111k920k049q84l40o21q73
60867D41877l63O11J451K140K952L779M348M664M696M082K703J187K98L1j67m68
60851D73821m37K54J300J884J325k92k032k928k912k627k419k127j889k304l463
60836D55154m580n127n567o416p174p066o301n764n676n470m842m100l465k801
60822C80805k163j970k365k814k685j918r75l25j74m58r84j558k029k236k077
60807C56074j706j446j417j403j222r62o83j36R06K219L222L449K828J646M34
$$ plain form
60913 554051 548647 544285 540857 537697 534253 530626 527335 524739 522776 521137 519624 518417 517948 518356 519200
60898 519200 519856 519998 519445 517986 515878 514175 513701 513686 512276 508646 503847 499318 495357 491528 487707 483968
60882 483968 479948 475209 470076 465407 461648 458543 455647 452675 449564 446644 444595 443711 443371 442750 441877
60867 441877 441514 442125 443576 445716 448668 452447 456795 461459 466155 470237 472940 474127 474425 474456 474289 473821
60851 473821 473384 473638 474938 476822 478147 477855 475823 472895 469983 467356 464937 462810 460921 458617 455154
60836 455154 450574 445447 439880 433464 426290 419224 412923 407159 401483 396013 391171 387071 383606 380805
60822 380805 378642 376672 374307 371493 368808 366890 365915 365590 365416 364958 363974 362416 360387 358151 356074
60807 356074 354368 352922 351505 350102 348880 347918 347235 347099 348005 350224 353446 356895 359723 361369 361803
60792C61803l37n50m29k00M1J84J35j5j64m81j070j488j214n81m90j044j344r00
60774C51856l98m92p32m30P2p2q94j701k090k077j479k19J008J287P19K67L08
60757C44933K34l42q59o40J10O07M61J7r0M92J590K726L628M393N006M993L976
60740C71235K283N83r75k626m127m741m231l269k548k042j472j045j215j873k305
60725C41632j985j150m40j62p7J25L55L29J12J43O09J079J048N54O7j66l24o27
60707C41122j034j352j476j429j330j284j305j331j352j443j628j816j862j656
60693C20824j189o45l37l37l28m3K72J97j72k97P5P33J513K451L372L895L960
60676C33944L772L242K178J100J063K160L054K489P22j013j881j791j006j35l1
$$ plain form
60792 361803 361466 360916 360487 360287 360328 360512 360647 360632 360468 359987 358917 357429 356215 355634 355144 354100 352756 351856
60774 351856 351458 350966 350234 349804 349876 349804 348910 347209 345119 343042 341563 341344 342352 343639 344358 344625 344933
60757 344933 345167 344825 343966 343326 343436 344043 344504 344521 344431 344923 346513 349239 352867 357260 362266 367259 371235
60740 371235 373518 374101 373126 370500 366373 361632 357401 354132 351584 349542 348070 347025 345810 343937 341632
60725 341632 339647 338497 338057 337895 337818 337943 338298 338627 338739 338882 339491 340570 341618 342172 342239 342073 341749 341122
60707 341122 340088 338736 337260 335831 334501 333217 331912 330581 329229 327786 326158 324342 322480 320824
60693 320824 319635 318990 318653 318316 317988 317945 318217 318414 318242 317945 318020 318753 320266 322717 326089 329984 333944
60676 333944 337716 340958 343136 344236 345299 347459 350513 353002 353724 352711 350830 349039 348033 347898 347867
60661C47867r58k107k449j801o30O53J693J988J450Q59J030J824K564L042L466
60646C58491L715L442K760K116J564Q02j79j150k181l465m662n064m452l299k108
60631C46330j088l97k00l90o33p75q68r32r32r02q09m69J28O91J045J322J503
60614C42624J222M33j94j53J10j14o92q54k90O24J439J971K205K263K247J856
60598C54697O59r24j690j239o48q36j140n62L92N26K5J66J195K001K002J878K100
60581C58602K083J358N36M62J082J741K108K381K860L560M114M202M147M817O517
60566D00570Q489R970J1081J1944J1778R942P254M969K923J61l017n228o101o461
60552D58274o447n247l064j479j197r77L99K444M134N441O742P789Q362R080J0608
$$ plain form
60661 347867 346909 344802 342353 340552 339922 340575 342268 344256 345706 346565 347595 349419 351983 355025 358491
60646 358491 362206 365648 368408 370524 372088 372890 372711 371561 369380 365915 361253 356189 351737 348438 346330
60631 346330 345242 344845 344645 344255 343622 342847 341979 341047 340115 339213 338404 337935 338063 338754 339799 341121 342624
60614 342624 343846 344279 344085 343932 344042 343928 343236 342382 342092 342716 344155 346126 348331 350594 352841 354697
60598 354697 355356 354432 352742 351503 350855 350019 348879 348317 348709 349235 349260 349426 350621 352622 354624 356502 358602
60581 358602 360685 362043 362579 363041 364123 365864 367972 370353 373213 376773 380887 385089 389236 394053 400570
60566 400570 409059 419029 430110 442054 453832 463774 471028 475997 478920 479081 476064 470836 464735 458274
60552 458274 451827 446580 443516 442037 440840 439863 440262 442706 446840 452281 459023 466812 475174 484254 494862
60537D94862J2677J4664J6456J7935J8466J7724J6359J5008J3217J0154N917J343
60525F54782k997o851r766j1266j1361j0528r410q753q905r110q086n753l525
60512E48471k374j572j82J231J566J194J662L684O543R361J2005J4808J8222K2667
60498F37286K7981L3065L6830L9446M1917M4435M5952M5499M3213L9840L5679
60487A071143L0366K3335J4318L609p991j9518l0193l9371m6417n0829n2472n1657
60475H44323m9136m5968m2933l9926l6260l1743k7049k2901j9410j6510j4419
60464D98068j3131j1923j0034p650n749m996n198n653n715n210m592m511m951
60451D08755n080m299l146k655l029l486l308k572j763j153p54n80o95r44r33
$$ plain form
60537 494862 507539 522203 538659 556594 575060 592784 609143 624151 637368 647522 653439 654782
60525 654782 651785 644934 635168 623902 612541 602013 592603 583850 574945 565835 557749 551996 548471
60512 548471 546097 544525 544343 545574 547140 548334 549996 553680 560223 569584 581589 596397 614619 637286
60498 637286 665267 698332 735162 774608 816525 860960 906912 952411 995624 1035464 1071143
60487 1071143 1101509 1124844 1139162 1142771 1134780 1115262 1085069 1045698 999281 948452 895980 844323
60475 844323 795187 749219 706286 666360 630100 598357 571308 548407 528997 512487 498068
60464 498068 484937 473014 462980 455330 449581 444585 439387 433734 428019 422809 418217 413706 408755
60451 408755 403675 399376 396230 393575 390546 387060 383752 381180 379417 378264 377510 376930 376235 375291 374358
60436C74358m26K84O64O05M92M20j29j370k418k221j050k31m02q68q41m25p5J78
60418C66545M77P56J021J490K064K180J619R56Q14J054J153R54O81N23N90R91
60402C83868J558J879J762J432J081P07M55O11J019J149R65J103J827K468K345
60387D04229J725J310J276J321J281J211J128J078J199J476J741K026K479K753
60373D26233K151O73o85j058n87J42R05J624J941J606R50N45O35J150J855K407
60357D40487K687L145M158N167N292M826M987N939O381N529M193L159J880k04
60343D97626k294l365l688l985l965l110k143k213l024l252k567j926k001k515
60329D57578l033l322l042k134j409j709k543k619j623m38L65J161K306L524M511
$$ plain form
60436 374358 373932 374216 374880 375485 375977 376397 376268 374898 372480 370259 369209 368978 368576 367708 366867 366442 366367 366545
60418 366545 367022 367778 368799 370289 372353 374533 376152 377108 377922 378976 380129 381083 381764 382287 382877 383868
60402 383868 385426 387305 389067 390499 391580 392287 392742 393353 394372 395521 396486 397589 399416 401884 404229
60387 404229 405954 407264 408540 409861 411142 412353 413481 414559 415758 417234 418975 421001 423480 426233
60373 426233 428384 429057 428372 427314 426727 426869 427774 429398 431339 432945 433895 434440 435075 436225 438080 440487
60357 440487 443174 446319 450477 455644 460936 465762 470749 476688 483069 488598 492791 495950 497830 497626
60343 497626 495332 491967 488279 484294 480329 477219 475076 472863 469839 466587 464020 462094 460093 457578
60329 457578 454545 451223 448181 446047 444638 442929 440386 437767 436144 435706 436071 437232 439538 443062 447573
60314D47573N331O036O560P003P459P575P027O226N854N834N670N651O615Q430
60300E38844R767R609Q230O330M000Q87l120p610j1655j4031j4074j2366j0176
60287E04635q240o617n413m804m396l445j936o77k23m31j105k276l564m092l452
60272D53964k266j454j393j904k570k878k574k069k029k470k820k862k929k947
60258D20799k184m05J356J898J382J091J764K716K777J734N82L65J072J832K012
60243D38791J770J506J243Q16L17Om1L6Jl63r37j089l57O56Q90N31J010K792M251
60224D51829L758J972Q32R84J521J837K220K804L296L846M932O221O733O368O148
60209E05301O652P266P357P159P090P039O842O700O605O076M991M097M105M728
$$ plain form
60314 447573 452904 458940 465500 472503 479962 487537 494564 500790 506644 512478 518148 523799 530414 538844
60300 538844 548611 558220 566450 572780 576780 577667 574547 566937 555282 541251 527177 514811 504635
60287 504635 496395 489778 484365 479561 475165 471720 469784 469107 468884 468453 467348 465072 461508 457416 453964
60272 453964 451698 450244 448851 446947 444377 441499 438925 436856 434827 432357 429537 426675 423746 420799
60258 420799 418615 418210 419566 421464 422846 423937 425701 428417 431194 432928 433510 433875 434947 436779 438791
60243 438791 440561 442067 443310 444126 444443 444449 444408 444444 444445 444082 443145 442056 441699 442355 443245 443776 444786 447578 451829
60224 451829 455587 457559 458391 459375 460896 462733 464953 467757 471053 474899 479831 486052 492785 499153 505301
60209 505301 511953 519219 526576 533735 540825 547864 554706 561406 568011 574087 579078 583175 587280 592008
60195E92008N018M443L239K085J513J395Q27r39l406n159n485n109n154n872o711
60180E72693p205p324p204o835o088n006m037l726l980m015l375k624k498k746
60166E06030k482j480m21j1m04j280j894j393K15J690J901J197O26K93l47r57
60150E01283n48P47J566J224N44M40Q70J528K362L011K880K364K777M465O130
60135E31643O736O907P539Q181P968P298P181P494P168N894M474L564L033K610
60121F17690K290K047J787J717K053K409K076J060K14J39N15P71R10J183J297
60106F38158N94r18k272k597k165k025k709l774m626n177n546n581n125m362l538
60091E88337k644j732j159j131j359j555j761j844j303j76N49K72j66K50R64O84
$$ plain form
60195 592008 597026 601469 604708 606793 608306 609701 610528 609589 606183 601024 595539 590430 585276 579404 572693
60180 572693 565488 558164 550960 544125 538037 533031 528994 525268 521288 517273 513898 511274 508776 506030
60166 506030 503548 502068 501647 501636 501232 499952 498058 496665 496880 498570 500471 501668 502294 502587 502240 501283
60150 501283 500735 501482 503048 504272 504816 505256 506126 507654 510016 513027 515907 518271 521048 525513 531643
60135 531643 538379 545286 552825 561006 568974 576272 583453 590947 598115 604009 608483 612047 615080 617690
60121 617690 619980 622027 623814 625531 627584 629993 632069 633129 633343 633482 633997 634768 635678 636861 638158
60106 638158 638752 637834 635562 632965 630800 628775 626066 622292 617666 612489 606943 601362 596237 591875 588337
60091 588337 585693 583961 582802 581671 580312 578757 576996 575152 573849 573673 574222 574494 574328 574578 575542 576226
60075E76226n00j338j508j979l152m242m855n660o862p440o776n864n848o286
60061E13916n992m918m061l805l532k792k036j919k382k672k094o41J081K476
60047D80629L359L745L619L211L158L840M837N539N966O389O555O156N632N545
60033E48180N447M470K874J740J227M33r44k248l320m889p092q988j0084j0967
60019E15839j1788j1534r751p714o833o807o485n657m882m234l382k493k094k262
60005D29923k640k931k891k341j636j521j950j832n43J017J636J353J013R63J089
59990D18709J598K704L900M409M179L696L195K683K411K534K594K033R75q9j122
59975D54409k312l320l467k633j448o43n20q80j131p38J40P36O41K87K68O54J173
$$ plain form
60075 576226 575726 574388 572880 570901 567749 563507 558652 552992 546130 538690 531914 526050 520202 513916
60061 513916 507924 503006 498945 495140 491608 488816 486780 484861 482479 479807 477713 477072 478153 480629
60047 480629 483988 487733 491352 494563 497721 501561 506398 511937 517903 524292 530847 537003 542635 548180
60033 548180 553627 558097 560971 562711 563938 564371 563427 561179 557859 552970 545878 536890 526806 515839
60019 515839 504051 492517 482766 475052 468219 461412 454927 449270 444388 440154 436772 434279 432185 429923
60005 429923 427283 424352 421461 419120 417484 415963 414013 412181 411638 412655 414291 415644 416657 417620 418709
59990 418709 420307 423011 426911 431320 435499 439195 442390 445073 447484 450018 452612 454645 455620 455531 454409
59975 454409 452097 448777 445310 442677 441229 440586 440066 439186 438055 437317 437457 438193 438834 439121 439389 440043 441216
59958D41216J580J630J277J050J499K159J938Q00m1%J5o80j242p37K22N66N16
59941D51768Q71J231N56q66j529q79L4K59J93O80J768K870L617M099M449M529
59925D73650M023K821J208n01k306m063m961m283k710j845k153k440j788q11k78
59910D53563K79J569L061L788L867M065M327L966K952J977J405J126J091J173
59896D88209Q85O4n67l97O9J15K73J614L888N572N718M797L780L266L393L883
59880E24562M216M393N054O216O597N210L039J820J607R75o09k183l026l478l747
59865E50646l398k469j912k193k500j966r33k73r8J84R45K026L223M586O264Q170
59849E60302R842J0681J0395R017O537L091l57k194j746q4J321K145K695K576
$$ plain form
59958 441216 442796 444426 445703 446753 448252 450411 452349 453149 453108 453108 453123 452443 451201 450464 450686 451252 451768
59941 451768 452639 453870 454426 453560 452031 451152 451186 451445 451638 452318 454086 456956 460573 464672 469121 473650
59925 473650 477673 480494 481702 481201 478895 474832 469871 465588 462878 461033 458880 456440 454652 453841 453563
59910 453563 453842 455411 458472 462260 466127 470192 474519 478485 481437 483414 484819 485945 487036 488209
59896 488209 489094 489158 488591 488194 488263 488378 488651 490265 494153 499725 505443 510240 514020 517286 520679 524562
59880 524562 528778 533171 538225 544441 551038 556248 559287 561107 562714 563689 563080 560897 557871 554393 550646
59865 550646 547248 544779 542867 540674 538174 536208 535275 535002 534904 535088 536033 538059 541282 545868 552132 560302
59849 560302 570144 580825 591220 600237 606774 609865 609508 607314 605568 605484 606805 608950 611645 614221
59835F14221J084j350l342m134m063l422k047j41J439K060J814R27o30k673m603
59820E95140n946o759p300p694p966q010p494o164m320k766k212k786l853m316
59806E17554l535k130j325j287r73N8P04Kj274j686j118n17l05k10k70p36j252
59789E01700j221p81m39j01N06Q47K84n30l29Q63J747J666J185P84K61l54m73
59772E05615M6N46N38K53P1M9J33J83p3n30m39N54J567J623J172J325K031K425
59754E17089K637L675N526O970P415P469P491P056O201N778O064O303O039N717
59740F01430N542M997L948L085K688K153J211N72P31J180J306J130P09j46j060
59725F29476j074m4Q77P35j45j034j818k532k888k841k843k993k777k122j776
$$ plain form
59835 614221 615305 613955 610613 606479 602416 598994 596947 596806 598245 600305 602119 603046 602416 599743 595140
59820 595140 589194 582435 575135 567441 559475 551465 543971 537807 533487 530721 528509 525723 521870 517554
59806 517554 514019 511889 510564 509277 508304 508362 509066 509068 507794 506108 504990 504473 504168 503958 503688 502952 501700
59789 501700 500479 499698 499259 499158 499664 500511 500795 500265 499936 500799 502546 504212 505397 506181 506442 506088 505615
59772 505615 505661 506207 506745 506998 507069 507118 507251 507434 507361 506831 506392 506946 508513 510136 511308 512633 514664 517089
59754 517089 519726 523401 528927 535897 543312 550781 558272 565328 571529 577307 583371 589674 595713 601430
59740 601430 606972 611969 615917 619002 621690 623843 625054 625626 626357 627537 628843 629973 630682 630536 629476
59725 629476 628402 628358 629235 629970 629825 628791 626973 624441 621553 618712 615869 612876 610099 607977 606201
59710F06201k073k288j813j077o80n09k94j94j69L30J403K208K143J730J688J965
59694F08571K285K851L678M119L801L276K999K515J525Q93J442K418K440J542
59680F44355J020J376J579O04j219k744l370l507l911m763n450n326m552l881
59666F10211l715l848m097m554n037m973m127l002k212j850j625j110J09J970
59652E72140L537L823L086K571K780K946K414J579R48K06j137k799m149n028n623
59637E77294n964n990n738n094l847k259j068o38n71m62m61q81j755k976m291
59622E35299n111m954m245l885m035m101l902l894m072l877l371l286l555l068
59608D79943j492J1N79R88K135L372L432K302J049L91M34J232K532L397L073K012
$$ plain form
59710 606201 604128 601840 600027 598950 598270 597761 597467 597273 597104 597434 598837 601045 603188 604918 606606 608571
59694 608571 610856 613707 617385 621504 625305 628581 631580 634095 635620 636513 637955 640373 642813 644355
59680 644355 645375 646751 648330 648934 647715 644971 641601 638094 634183 629420 623970 618644 614092 610211
59666 610211 606496 602648 598551 593997 588960 583987 579860 576858 574646 572796 571171 570061 570170 572140
59652 572140 575677 579500 582586 585157 587937 590883 593297 594876 595824 596030 594893 592094 587945 582917 577294
59637 577294 571330 565340 559602 554508 550661 548402 547334 546696 546125 545663 545202 544321 542566 539590 535299
59622 535299 530188 525234 520989 517104 513069 508968 505066 501172 497100 493223 489852 486566 483011 479943
59608 479943 478451 478462 479041 480029 482164 485536 488968 491270 492319 492710 493144 494376 496908 500305 503378 505390
59592E05390J325J429J859K086J882J225M00n4K5J67q1o27j218j771k063j727
59576E08247r97p60j461k451k860k543j844j115o71n87l27O13J521J068o37j823
59560D93373j433m13pJ5L58P41N19p7n17q80j205p74P57K339K841K700L057M008
59542E05402M930N917P417R059J0456J2750J7406K3114K5610K1466J1488m8q831
59529F46136j3022j3344j1597r145o481l817j529J98J604K797L360K958K002J209
59515F01329P68L01o68k401m639o431o899o446o502p634q714q528p322o130n295
59500E24789m551l888l476l143k706k403k359k070j168j72K08J34K50O75J067
59485E01187J366J754K183K534K938L439L638L181K312J628J597K415L823M924
$$ plain form
59592 505390 506715 508144 510003 512089 513971 515196 515596 515542 515567 515734 515653 515026 513808 512037 509974 508247
59576 508247 507250 506490 505029 502578 499718 497175 495331 494216 493545 492958 492631 493244 494765 495833 495196 493373
59560 493373 491940 491527 491520 491535 491893 492634 493153 493076 492559 491679 490474 489700 490457 492796 495637 498337 501394 505402
59542 505402 510332 516249 523666 532725 543181 555931 573337 596451 622061 643527 655015 654967 646136
59529 646136 633114 619770 608173 599028 592547 588730 587201 587399 589003 591800 595160 598118 600120 601329
59515 601329 602097 602398 601730 599329 594690 588259 581360 574914 568412 560778 552064 543536 536214 530084 524789
59500 524789 520238 516350 512874 509731 507025 504622 502263 500193 499025 498853 499061 499195 499445 500120 501187
59485 501187 502553 504307 506490 509024 511962 515401 519039 522220 524532 526160 527757 530172 533995 538919
59471E38919M935M250L883L809L013J437M19O45J088Q57O64J330K166K175J805
59456E71395K078K852L395L916N077O489P087O635N748M866M173L996M193L757
59442F35657K102R5j190k010l144m309m737m675m793m715l647k088j359j648j877
59427E97662j441o83J91J441K996M532O257Q667J1521J4112J6434J9043K1863
59414G02595K4152K5816K7875L1230L5093L6587L2139K0417M558r403j7161j8740
59402H95158j6548j2396p168j555M383J0781J5554J4124M026j1035k4022l0896
59390H40406l2314l0229k5850k0756j6950j4859j3068j0647q162o164m403k981
59378F54023k542k855k685j634o83n45p78r70j369j868j592k13J322J952J658
$$ plain form
59471 538919 543854 548104 551987 555796 558809 560246 560665 561310 562398 563255 563919 565249 567415 569590 571395
59456 571395 573473 576325 579720 583636 588713 595202 602289 608924 614672 619538 623711 627707 631900 635657
59442 635657 637759 637854 636664 634654 631510 627201 622464 617789 612996 608281 604634 602546 601187 599539 597662
59427 597662 596221 595538 595729 597170 600166 604698 610955 619622 631143 645255 661689 680732 702595
59414 702595 726747 752563 780438 811668 846761 883348 915487 935904 940462 931059 913898 895158
59402 895158 878610 866214 859046 857491 861874 872655 888209 902333 906359 895324 871302 840406
59390 840406 808092 777863 752013 731257 714307 699448 686380 675733 667571 661407 657004 654023
59378 654023 651481 648626 645941 644307 643624 643079 642301 641331 639962 638094 636502 636289 637611 639563 641221
59363F41221J163J167J987L291M196M336M502N398O353O402O110O792Q331R466
59349G10715J0062J1267J3249J4595J4445J3710J3523J3731J3497J2466J0813
59338H52073Q964P400N989L680k29m739q172j0220j1732j2899j3294j3435j4464
59325G88922j6143j6914j6279j5403j4982j4219j2547j0807r906r491q736p451
59313F36044n892m357l329l176l380k927j577R0J847M079O905J0043J3229J5557
59299F63156J4870R562J037p137j2579j5367j6229j5501j3926j2609j1571r882
59287E73824p482n371l821k081j93P64O80Q92K077L347M033M751N958P098P924
59272E92400R138J0921J2241J2429J2169J2254J2516J2596J2572J2312J1375R901
$$ plain form
59363 641221 642384 643551 645538 648829 653025 657361 661863 667261 673614 680016 686126 692918 701249 710715
59349 710715 720777 732044 745293 759888 774333 788043 801566 815297 828794 841260 852073
59338 852073 861037 868437 874426 878106 877877 873138 864966 854746 843014 830115 816821 803386 788922
59325 788922 772779 755865 739586 724183 709201 694982 682435 671628 661722 652231 643495 636044
59313 636044 630152 625795 622466 619290 615910 612983 611406 611496 613343 617422 624327 634370 647599 663156
59299 663156 678026 687588 688625 681488 668909 653542 637313 621812 607886 595277 583706 573824
59287 573824 566342 560971 557150 555069 554876 555640 556320 557212 559289 562636 566669 571420 577378 584476 592400
59272 592400 601538 612459 624700 637129 649298 661552 674068 686664 699236 711548 722923 732824
59260G32824Q384O474L472J43j765k095k529l847m930n037m984n308n239m478
59246G11085m034m288m149l233k926l988m925m201k533j447j064p12m47n29n49
59231F72060l04m28j120j541j446j996l753n447n971o141p066q208q512q199p894
59216F04034p250n916m697m223l673k344j224j416k125j961j251j206j659j456
59202E63633m54M75R51J056M66r39k081j860q34m13q57j359j564j685j614j191
59186E51730r18j176j293n33M76O60K74M68J440K296K514K372K110J779J677K027
59170E65903K346J951R47P5j16N10J779L044L491L114K741K705K408J526N31m77
59154E92478k224m718o656p191p084p153o938o039n321n487n684n000m119l990
$$ plain form
59260 732824 741208 747682 751154 751297 749532 747437 744908 741061 736131 731094 726110 720802 715563 711085
59246 711085 707051 702763 698614 695381 692455 688467 683542 679341 676808 675361 674297 673585 673138 672609 672060
59231 672060 671756 671328 670208 668667 667221 665225 661472 656025 650054 643913 636847 628639 620127 611928 604034
59216 604034 596784 590868 586171 581948 578275 575931 574707 573291 571166 569205 567954 566748 565089 563633
59202 563633 563179 563654 564605 565661 566127 565188 563107 561247 560413 560000 559143 557784 556220 554535 552921 551730
59186 551730 550812 549636 548343 547810 548286 548946 549220 549688 551128 553424 555938 558310 560420 562199 563876 565903
59170 565903 568249 570200 571147 571222 571106 571616 573395 576439 579930 583044 585785 588490 590898 592424 592955 592478
59154 592478 590254 585536 578880 571689 564605 557452 550514 544475 539154 533667 527983 522983 518864 514874
59140E14874m043l354k590k986m155m678m270l785l538l133k550k001j223r6O41
59125D73113N59O39J834L294L610L157L554N184O871P777Q116Q203Q081Q021Q271
59110E50284Q476Q296Q106Q165P807O592N460N444N850N239L627K253J547Q57
59096F28003j13r94j721k551l220l188k560j834j070k30J56l78j345k022k460
59081F04473k959l274l293l672m707n469n224m777n045n345m595l359k916l066
59067E46772k644j683j270j532j545j090q57r93r36o35o53j085j480j676j798
59052E26895j737j563j873k672k740j280N51J184Q84R62J463J406P33K49l1p49
59036E21682j665j814j131m34N0P37J520J840J814K089K771L608M816O628Q503
$$ plain form
59140 514874 510831 507477 504887 501901 497746 493068 488798 485013 481475 478342 475792 473791 472568 472472 473113
59125 473113 473672 474311 476145 479439 483049 486206 489760 494944 501815 509592 517708 525911 533992 542013 550284
59110 550284 558760 567056 575162 583327 591134 597726 603186 608630 614480 619719 623346 625599 627146 628003
59096 628003 627890 626896 625175 622624 619404 616216 613656 611822 610752 610522 610678 610300 608955 606933 604473
59081 604473 601514 598240 594947 591275 586568 581099 575875 571098 566053 560708 556113 552754 549838 546772
59067 546772 544128 542445 541175 539643 538098 537008 536151 535158 534222 533587 532934 531849 530369 528693 526895
59052 526895 525158 523595 521722 519050 516310 515030 515581 516765 517649 518611 520074 521480 522213 522462 522431 521682
59036 521682 520017 518203 517072 516638 516688 517425 518945 520785 522599 524688 527459 531067 535883 542511 551014
59021E51014R809J0793J1763J2148J1514J0634J0218R571P849N622L621J194k161
59008F53589m986n702n265n626o402n644l288j175N5J513L504M919N401N740N950
58993F42583N084L325K204K308K633K544K567K889K758J764L47j085k255k351
58979F65315q53J174K226K563L615N523P098Q051R232J0796J1965J2624J3279
58966G52608J3627J3003J2085J2124J2723J2414J1210J0322R603P746M992L031
58954H75488J897l90m500q539j0944j2403j4000j5521j6417j6794j6618j5530
58942G45729j3932j2695j1550r536p162o040o065n291l147j485j556k104j569
58929F63597l50L38L04N5q7K32J311K514K642J548K18q90k105l088k914j794j072
$$ plain form
59021 551014 560823 571616 583379 595527 607041 617675 627893 637464 645313 650935 654556 655750 653589
59008 653589 648603 642901 637636 632010 625608 619964 616676 615501 615556 617069 620573 625492 630893 636633 642583
58993 642583 647667 650992 653196 655504 658137 660681 663248 666137 668895 670659 671006 669921 667666 665315
58979 665315 664462 665636 667862 670425 674040 679563 686661 694712 703944 714740 726705 739329 752608
58966 752608 766235 779238 791323 803447 816170 828584 839794 850116 859719 867465 872457 875488
58954 875488 877385 876995 872495 863956 853012 840609 826609 811088 794671 777877 761259 745729
58942 745729 731797 719102 707552 698016 690854 684814 678749 673458 670311 668826 667270 665166 663597
58929 663597 663247 663585 663889 663944 663857 664089 665400 667914 670556 672104 672322 671432 669327 666239 663325 661531 660459
58912F60459j204j392j284j250r21N81K767M147M683N834P893R501J0139J0884
58898G10837J2110J2711J2211J1565J1253J0694J0071J0632J2447J4013J4746
58887H43290J5756J7564J9194K0104K0805K0918J9028J5245J1590Q911N928K118
58875A020451r86k586m193o985r917j1798j3059j4007j3633j1689r889r345q734
58862I03630o636l985k566k682l741n476p245p786p134p183q976j1067j1785j1457
58848H05911j1036j0325r037q039p963q047p687p635q446r213r202r170r753j0098
58834F80260r423q471q084p679o435m658k920j226Q9K06n14m32Q98K011K135K497
58818F38254L896N160N293N099N264M877L436K227K229K484K045J586J575R17
$$ plain form
58912 660459 659255 657863 656579 655329 654408 654989 657756 661903 666586 672420 680313 689814 699953 710837
58898 710837 722947 735658 747869 759434 770687 781381 791452 802084 814531 828544 843290
58887 843290 859046 876610 895804 915908 936713 957631 976659 991904 1003494 1012405 1018333 1020451
58875 1020451 1019465 1016879 1012686 1005701 995784 983986 970927 956920 943287 931598 921709 912364 903630
58862 903630 896994 893009 890443 887761 884020 878544 871299 863513 856379 849196 840220 829153 817368 805911
58848 805911 794875 784550 775513 767474 759511 751464 743777 736142 727696 718483 709281 700111 690358 680260
58834 680260 670837 662366 654282 646603 640168 635510 632590 631364 631453 631659 631145 630713 631611 633622 635757 638254
58818 638254 642150 647310 652603 657702 662966 667843 671279 673506 675735 678219 680264 681850 683425 684342
58804F84342r13k435k646k805l960m787m054l208m216o421p894q431q967r264
58790F14341q456o904n643m802m071l649l410k473q37J72K97J263L749N623N040
58775E90240L358K857L336L192K133P47j158l592n282n506n494o193o359m978
58761E67301l626m014m967m404k780j917j785j118nO68J251K286K640J222m43
58746E50309o4J859K895K308J401R58P46J071K403L860M072L235K549K266K032
58731E81900K234L262M310M659N136O481P488O785N327M898N263N005M280M457
58717F51485N731P150Q377R535J0146R968J0014J0996J1755J0950R039O910M027
58704G66083ql659n483o653r108j2414j4810j6110j7173j7725j7181j6473j6634
$$ plain form
58804 684342 683429 680994 678348 675543 671583 666796 662742 659534 655318 648897 641003 632572 623605 614341
58790 614341 605885 598981 593338 588536 584465 580816 577406 574933 574096 574268 574565 575828 579577 585200 590240
58775 590240 593598 596455 599791 602983 605116 605863 604705 601113 595831 590325 584831 578638 572279 567301
58761 567301 563675 559661 554694 550290 547510 545593 543808 542690 542685 543353 544604 546890 549530 550752 550309
58746 550309 550245 552104 554999 557307 558708 559666 560412 561483 563886 567746 571818 575053 577602 579868 581900
58731 581900 584134 587396 591706 596365 601501 607982 615470 622255 627582 632480 637743 642748 647028 651485
58717 651485 657216 664366 672743 682278 692424 702392 712406 723402 735157 746107 755146 762056 766083
58704 766083 766075 762416 756933 750280 741172 728758 713948 697838 680665 662940 645759 629286 612652
58691F12652j6604j4834j2058j0035q741p227o050o231o859o353n220m965n301
58678E02174m937m140l943l767k428n46N54J242K420L208K582K017L568O390Q211
58663E12605R187J1107J3675J4814J4051J2473R944N599N29l012m851o447p857
58650E81817p991p304p229p407o447m924m655n450n580m950m748m496k672J7J242
58635E09223P52M71J014J197Q91J349K581L155K714K159J605N89o5O96J794J411
58619E31536J51k9O87N29l39r1J387K504K978L786M547M031K915K909L582L142
58603E64225J833J386J649J098P4M6K84r83k777k608j168j508l692m456k574l96
58587E50433N48J519L392N093O092P194Q233Q084P407Q156J0052J0749R733Q826
$$ plain form
58691 612652 596048 581214 569156 559121 550380 543153 537103 530872 524013 517660 512440 507475 502174
58678 502174 497237 493097 489154 485387 482959 482413 482967 484209 486629 489837 492419 494436 498004 504394 512605
58663 512605 521792 532899 546574 561388 575439 587912 597856 603455 603984 600972 596121 589674 581817
58650 581817 573826 566522 559293 551886 545439 540515 535860 530410 524830 519880 515132 510636 507964 507981 509223
58635 509223 509975 510446 511460 512657 513548 514897 517478 520633 523347 525506 527111 527700 527635 528331 530125 531536
58619 531536 531687 531658 532345 532874 532535 532444 533831 536335 539313 543099 547646 551677 554592 557501 561083 564225
58603 564225 566058 567444 569093 570191 570265 570311 570595 569612 566835 564227 563059 561551 557859 553403 550829 550433
58587 550433 550981 552500 555892 560985 567077 574271 582504 590588 597995 606151 616203 626952 636685 645511
58573F45511Q665Q111P265P630Q988R560R520J0858J3664J6096J8047K1180K5169
58560H10264K7752K8686K9830L1113L0381K7457K4201K0423J4116O179L54k320
58548A048436m570p623r392q913q086p775o546m668n007q333j1866j4035j6622
58535I35000k0555k3619k4257k3856k3495k2018j9078j6511j5012j2850r428o745
58523G17576n878n415m634m685n436m886l014k430l854m773l954l343l985m046
58509F57243k552j254j176j019n36j542l940m724k726n60j42j11O58R12J24m0
58493F38615R06J244Q23J773M045M637K972K426M623O785O986P346R480J1348
58479G04009J1478J2062J4780J7544J8286J8280J8791J8025J4305R043M037r92
$$ plain form
58573 645511 654176 662287 669552 677182 686170 695730 705250 716108 729772 745868 763915 785095 810264
58560 810264 838016 866702 896532 927645 958026 985483 1009684 1030107 1044223 1050402 1050756 1048436
58548 1048436 1043866 1036243 1026851 1017938 1009852 1002077 995531 990863 985856 977523 965657 951622 935000
58535 935000 914445 890826 866569 842713 819218 797200 778122 761611 746599 733749 724321 717576
58523 717576 711698 706283 701649 696964 691528 686642 683628 681198 677344 672571 668617 665274 661289 657243
58509 657243 654691 653437 652261 651242 650706 649164 645224 640500 637774 637214 637072 636961 637619 638531 638655 638615
58493 638615 639521 640765 641588 643361 647406 652043 655015 657441 662064 668849 675835 683181 692661 704009
58479 704009 715487 727549 742329 759873 778159 796439 815230 833255 847560 856603 860640 859648
58467H59648o045r392j0628j1639j2794j1872q595n977n270l820j12L501N379
58454G82384P412J0756J3283J3774J4245J5470J4657J0367N332J616k501q094
58442H78701j2571j4008j4200j4607j3707j0997q983q503o874l326j153j631j323
58429G66818J497L446K563K335N216P918P528O751Q293R512P563M826M053L084
58415H41403m34l813m171l925o123q566q040o292o447p365o769o050o887o982
58401G59539m228j211o73n68J477L167K234J592M244P299O846M769M863O059N426
58386H00835M162M774N709M615L448M707O103M552J950J436J609M7j164Q00L835
58371H47418M636M530N969P173N988N097P430J0287J0031Q650R583J1150J0392
$$ plain form
58467 859648 853603 844211 833583 821944 809150 797278 788683 782706 777436 773616 773504 777005 782384
58454 782384 789796 800552 813835 827609 841854 857324 871981 882348 887680 889296 886795 878701
58442 878701 866130 852122 837922 823315 809608 798611 789628 781125 774251 770925 769772 768141 766818
58429 766818 768315 771761 774324 776659 781875 789793 797321 804072 812365 821877 829440 834266 838319 841403
58415 841403 840969 837156 832985 829060 822937 814371 806331 800039 793592 786227 779458 773408 766521 759539
58401 759539 755311 754100 753427 752859 754336 757503 759737 761329 765573 772872 779718 784487 789350 795409 800835
58386 800835 804997 809771 815480 820095 823543 828250 834353 838905 840855 842291 843900 843947 842783 843583 847418
58371 847418 852054 856584 862553 869726 875714 880811 888241 898528 908559 917209 926792 937942 948334
58358I48334R446J1449J4022J3303J0860J0110R714O988M032L831M126J769q06
58345A047178l6J982J773J328L722O379N784M615O876J0297J0970J1006J3945
58332A125819J7101J6452J4679J6205J8711J7786J5466J5653J5667J1222N372
58321A290133L509L781J681m42J971N906N692L597N465R560J0092Q336R802J3504
58307A372587J4310J3041J4202J6643J6269J4874J6593J9048J7753J5494J7320
58296A548134K0388J9117J6082J7024J9646J8515J6412J9033K3093K1949J8561
58285A757954K0188K4599K4608K2088K4048K8762K9451K7883L0434L4563L3385
58274B057963K9870L1941L7301L7965L6003L9380M5862M7041M4828M7730N4034
$$ plain form
58358 948334 957780 969229 983251 996554 1007414 1017524 1027238 1034226 1038258 1042089 1046215 1047984 1047178
58345 1047178 1047142 1049124 1050897 1052225 1055947 1062326 1068110 1072725 1079601 1089898 1100868 1111874 1125819
58332 1125819 1142920 1159372 1174051 1190256 1208967 1226753 1242219 1257872 1273539 1284761 1290133
58321 1290133 1293642 1297423 1299104 1298662 1300633 1306539 1312231 1315828 1321293 1330853 1340945 1349281 1359083 1372587
58307 1372587 1386897 1399938 1414140 1430783 1447052 1461926 1478519 1497567 1515320 1530814 1548134
58296 1548134 1568522 1587639 1603721 1620745 1640391 1658906 1675318 1694351 1717444 1739393 1757954
58285 1757954 1778142 1802741 1827349 1849437 1873485 1902247 1931698 1959581 1990015 2024578 2057963
58274 2057963 2087833 2119774 2157075 2195040 2231043 2270423 2316285 2363326 2408154 2455884 2509918
58263B509918N5304N3411N7050O4414O6571O5130O8841P5550P5637P0741P0609
58252C233176P4220P2834O8908P2362Q0795Q3480Q2310Q8229R9636J05556J07485
58241D168991J16076J28916J34428J35167J43691J57942J65095J67124J77183
58232E494613J93356K02434K07010K21293K42734K56625K66038K86899L16225
58223G687227L37279L53488L83412M24509M57709M85822N29572N87310O38587
58214A1884915O86346P53462Q38723R20999J005846J119964J260456J401075J548084
58205B1419870J734750J962248K207742K490875K865414L345691L915993M613239
58197D4555822N518217O667617Q071840R818219J2041108J4788550J8054187K1936760
$$ plain form
58263 2509918 2565222 2618633 2675683 2740097 2806668 2871798 2940639 3016189 3091826 3162567 3233176
58252 3233176 3307396 3380230 3449138 3521500 3602295 3685775 3768085 3856314 3955950 4061506 4168991
58241 4168991 4285067 4413983 4548411 4683578 4827269 4985211 5150306 5317430 5494613
58232 5494613 5687969 5890403 6097413 6318706 6561440 6818065 7084103 7371002 7687227
58223 7687227 8024506 8377994 8761406 9185915 9643624 10129446 10659018 11246328 11884915
58214 11884915 12571261 13324723 14163446 15084445 16090291 17210255 18470711 19871786 21419870
58205 21419870 23154620 25116868 27324610 29815485 32680899 36026590 39942583 44555822
58197 44555822 50074039 56741656 64813496 74631715 86672823 101461373 119515560 141452320
58189A41452320K6580643L1926220L7694176M3508080M8471559N0346093M5832109
58182D25811200L2797947J2720555r411629k8022338l9976279m5228337m5431832
58175C03259287m2470769l7898852l2854834k7999052k3582411j9691992j6394795
58168A02366582j3683132j1452173r604865q103595o899339n901345n048668m339486
58160C7333979l764798l277707k848561k489324k201812j954856j730302j541757
58152A7524862j391069j252351j114384r95699r03191q16443p26397o50523n96059
58143I078746n44876m88290m42358m15273l91662l61992l37284l22560l04496
58134E469955k77334k53958k40238k24194k00882j82770j75267j66303j50058
$$ plain form
58189 141452320 168032963 199959183 237653359 281161439 329632998 379979091 425811200
58182 425811200 458609147 471329702 461918073 433895735 393919456 348691119 303259287
58175 303259287 260788518 222889666 190034832 162035780 138453369 118761377 102366582
58168 102366582 88683450 77231277 67626412 59522817 52623478 46722133 41673465 37333979
58160 37333979 33569181 30291474 27442913 24953589 22751777 20796921 19066619 17524862
58152 17524862 16133793 14881442 13767058 12771359 11868168 11051725 10325328 9674805 9078746
58143 9078746 8533870 8045580 7603222 7187949 6796287 6434295 6097011 5774451 5469955
58134 5469955 5192621 4938663 4698425 4474231 4273349 4090579 3915312 3749009 3598951
58125C598951j37537j33906j28200j15250j05780j05014j02539r2953q6026q6771
58115B504975q5390p6555o9564o9785o8530o0806n5258n6921n7269n0876m5594
58104A808427m6804m7314m2165l8289m0441m1970l8366l5965l8655l9590l4481
58093A364387k9982l0743l1019k6889k4116k6067k6260k0877j6558j7965j9346
58082A094565j6146j3653j6330j9484j9002j8871k1825k2949j9575j7360j9697
58071H89673k1135j7974j5342j7066j8486j5984j3875j5200j5356j1502q681j0004
58059G09068j0269o017k527m024o216n322n362r403j2503j0611q076r138j0215
58046F09385p691n282o497p662n469l837o211q486o747m697o317q173o240l599
$$ plain form
58125 3598951 3461414 3327508 3199308 3084058 2978278 2873264 2770725 2677772 2591746 2504975
58115 2504975 2419585 2343030 2273466 2203681 2135151 2074345 2019087 1962166 1904897 1854021 1808427
58104 1808427 1761623 1714309 1672144 1633855 1593414 1551444 1513078 1477113 1438458 1398868 1364387
58093 1364387 1334405 1303662 1272643 1245754 1221638 1195571 1169311 1148434 1131876 1113911 1094565
58082 1094565 1078419 1064766 1048436 1028952 1009950 991079 969254 946305 926730 909370 889673
58071 889673 868538 850564 835222 818156 799670 783686 769811 754611 739255 727753 719072 709068
58059 709068 698799 692782 690255 686231 680015 674693 669331 659928 647425 636814 628738 619600 609385
58046 609385 601694 596412 589915 582253 576784 572947 566736 558250 551503 546806 540489 532316 526076 522477
58032E22477m219n525m225l218n741q673q437p744r850j1854j0363q152q645r254
58018D16577o728l729l732m489k865j111k141l577k530j407k959m514l065j154
58004C72576j827k685q67R74l14k097q08J501J464P18K006L386K291J100K691
57989C80109M601L518J479J681K289L86j870j252K05j057l475l498k130k446l686
57974C74854l506l064m372n546m146k169k436l137j319J276J384K02P56K059J413
57959C52249j17J27J213O44p95j106j373l252m828l814k160k644l700k543o26
57944C27275q93k178j551K20O13M18J883M017M628M748O361Q088P835P209Q445
57929C77118R506P290L286R23l87l259o701p848p463q397j0158j0158q846q560
$$ plain form
58032 522477 518258 512733 508508 505290 499549 490876 482439 474695 464845 452991 442628 434476 425831 416577
58018 416577 409849 406120 402388 397899 395034 393923 391782 388205 385675 384268 381309 376795 373730 372576
58004 372576 370749 368064 367197 368171 367857 365760 364952 366453 367917 368635 370641 374027 376318 377418 380109
57989 380109 384710 388228 389707 391388 393677 394063 392193 390941 391146 390089 386614 383116 380986 378540 374854
57974 374854 371348 368284 363912 358366 354220 352051 349615 346478 345159 346435 347819 348021 348777 350836 352249
57959 352249 352132 352259 353472 354116 353321 352215 350842 347590 342762 338948 336788 334144 330444 327901 327275
57944 327275 326382 324204 322653 322873 323486 323904 325787 329804 334432 339180 345541 353629 361464 368673 377118
57929 377118 386624 393914 397200 398123 397736 394477 387776 379928 372465 364068 353910 343752 334906 326346
57915C26346q767p341n186m795n558n036l535k941k610q68J057J099N19J494K456
57900B86334O85k298k981j863k090l575l712k706k876l624k326L82J261qo96q
57884B59899L74K72J076K192J692J52k50J46o52k043j671P8O34j56j63Q04R65
57867B63349L78Q00K028K286J848K572M252N058N106N925P038O751N683N818O716
57852C25608O332M876M222M171L075J370P78Q23j33j361j097m08j652l953m473
57837C38178l407l468m984n751n255m922m605k950q44l84q84jJ719J717L46M24
57821C04929K138K871K125K173L580M333L703K947J970o54m095n714n352n367
57807C09587o251o138m770l918l762k771j369j591k900k554n08K67j095k087j408
$$ plain form
57915 326346 317579 310238 305052 300257 294699 289663 286128 283187 280577 279709 280766 281865 282384 283878 286334
57900 286334 287019 284721 281740 279877 277787 274212 270500 267794 264918 261294 258968 259350 260611 260603 259907 259899
57884 259899 260273 260545 261621 263813 265505 265657 265407 265553 264901 262858 261187 261265 261899 261743 261580 262384 263349
57867 263349 263727 264527 266555 268841 270689 273261 277513 282571 287677 293602 300640 307391 313074 318892 325608
57852 325608 331940 336816 341038 345209 348284 349654 350432 351255 351122 349761 348664 348256 346604 342651 338178
57837 338178 334771 331303 326319 320568 315313 310391 305786 302836 301992 301608 300724 300723 302442 304159 304505 304929
57821 304929 307067 309938 312063 314236 317816 322149 325852 328799 330769 330115 326020 320306 314954 309587
57807 309587 303336 297198 292428 288510 284748 281977 280608 279017 276117 273563 273055 273322 272227 270140 268732
57792B68732p17j012j108o81j137k507k916j936j150r19J9J338J221M5K37J971
57776B59480K760J928J541K289K400J454J309K265K133K64j297j755k874n142
57762B66755o403n667m770m818m478l127k307k509j902K03J755J357L54J20J18
57747B34681q4K69J007O63p35j286m80J30K26J469L962N395M833M102M297M176
57731B62625L280L236M470M927L629K421K622K893K057J107Q95N99p8N2J061J159
57715B96955j42j029p31q68k160k942k423k283l429m245l754l430m181m504l433
57700B57401k446k541k281o46Q77R45N34O34M33n28j022o07p98k124k789j933
57684B43109j291j846j802M1J874K102K083L377M942N583O631R579J3271J5968
$$ plain form
57792 268732 268015 267003 265895 265214 264077 261570 258654 256718 255568 254649 254668 256006 257227 257272 257509 259480
57776 259480 262240 264168 265709 267998 270398 271852 273161 275426 277559 277823 276526 274771 271897 266755
57762 266755 260352 254685 249915 245097 240619 237492 235185 232676 230774 230977 232732 234089 234443 234563 234681
57747 234681 234597 234866 235873 236536 235801 234515 234035 234165 234391 235860 239822 245217 250050 254152 258449 262625
57731 262625 265905 269141 273611 278538 282167 284588 287210 290103 292160 293267 294162 294761 294683 294735 295796 296955
57715 296955 296813 295784 295053 294185 292025 289083 286660 284377 280948 276703 272949 269519 265338 260834 257401
57700 257401 254955 252414 250133 249487 250364 251309 251843 252477 252910 252382 251360 250753 249955 247831 245042 243109
57684 243109 241818 239972 238170 238211 240085 242187 244270 247647 252589 258172 264803 274382 287653 303621
57670C03621J8232K1529K5879L0995L7505M4726M9108M7089L7998K2928L319j7487
57658F25442l4053m2990m5581m4619m0961l5165k9577k5909k2841j8701j4534
57647B70511j1980j0215p721n292m400m192l022j558j553k598k786j767p65k82
57633B12380N3J06m55j145j419j620j959j767r70q17j879k868k801k530k815k813
57617A86681k008j672k656l680l500k934k997l025k409k131k706k742j506p50
57603A51965j799k988k346p37N5L72J214J650M92j055j218o62j077k110k358k150
57587A37248k711l594l476k563j957j558p06O4l0m75o41j258k822l944l398k262
57571A05917k048k221j640q96r67j150n83k01q46j228j49R47L12r38p66K77M37
$$ plain form
57670 303621 321853 343382 369261 400256 437761 482487 531595 578684 616682 639610 642929 625442
57658 625442 591389 548399 502818 458199 417238 382073 352496 326587 303746 285045 270511
57647 270511 258531 248316 240595 235303 230903 226711 223689 222131 220578 217980 215194 213427 212662 212380
57633 212380 212433 212539 212084 210939 209520 207900 205941 204174 203204 202387 200508 197640 194839 192309 189494 186681
57617 186681 184673 183001 180345 176665 173165 170231 167234 164209 161800 159669 156963 154221 152715 151965
57603 151965 150166 147178 144832 144095 144150 144522 145736 147386 147878 146823 145605 144943 143866 141756 139398 137248
57587 137248 134537 130943 127467 124904 122947 121389 120683 120747 120717 120242 119601 118343 115521 111577 108179 105917
57571 105917 103869 101648 100008 99112 98145 96995 96412 96211 95365 94137 93988 94935 95247 94309 93543 93820 94257
57554I4257L3L50O65l69j612j051M49L74j234k046j404q13q02k78J010K067K580
57537I2176K940K756J621O55R56J290j24k332k912j751p47l38O88K366L462M042
57521A04748N361P344Q719R436J0346J0884R751P709O864P286O988N297L631K819
57507B07183K177J353P00j36j703l021k757j893k618m787o148n971n680n807n241
57492A65651l893l290l895m339l903l402l116k204q08l87j219j728j028j62r3
57477A32184k75l0M08Q03J343J689J101o5n34o6J95l95j183j496j374j002o62
57460A30641j030k277l215k792j835j732k075j545m57j96o13l12O95R86K74k97
57444A14220l78o90j144q19N9L04r5J3P14R91P42P98R80L25q25j129n89l22k74
$$ plain form
57554 94257 94290 94640 95305 94936 93324 92273 92722 93096 91862 89816 88412 87599 86797 86519 87529 89596 92176
57537 92176 95116 97872 99493 100148 101104 102394 102270 99938 97026 95275 94528 94190 94878 97244 100706 104748
57521 104748 110109 117453 126172 135608 145954 156838 166589 174298 181162 188448 195436 200733 204364 207183
57507 207183 209360 210713 211413 211277 209574 206553 203796 201903 199285 194498 188350 182379 176699 170892 165651
57492 165651 161758 158468 154573 150234 146331 142929 139813 137609 136801 136414 135195 133467 132439 132277 132184
57477 132184 131909 131879 132287 133090 134433 136122 137223 137158 136624 136558 136753 136358 135175 133679 132305 131303 130641
57460 130641 129611 127334 124119 121327 119492 117760 115685 114140 113683 113487 112874 112562 113257 114243 114517 114220
57444 114220 113842 113152 112008 111189 111248 111552 111457 111470 112184 113175 113917 114715 115695 116020 115195 114066 113477 113155 112881
57425A12881N03J465J062l76q62L5P52O40O95J091P20l61o35K12P86O44R37J871
57407A22060K106J251N15K31p14k314k906k049j403j851k158j511r35j072q29
57392A08421M70J693J839J516J438J239P16N02O62M51M5O33K105K739J868Q68
57376A27205P99J082J137J161Q18o02k213k174q74p29k143k658j180J15l35q06
57360A18603M85K194K267J229P01N45j63q72n48L71R51J513K558L220K576J415
57344A37045R35P67r4j315j809j471r45l57M40J123J301J075N22m43j279j066
57328A34429n9M42J83K49Q19O14o56j382o73K36L73P09J954K773J935N36K59Q84
57310A43625J278J414J701J597O83q1K56J064J393J638K363K713J703J18n24q4
$$ plain form
57425 112881 113384 114849 115911 115535 114673 114708 115460 116100 116795 117886 118606 118245 117610 117822 118608 119252 120189 122060
57407 122060 124166 125417 125932 126163 125449 123135 120229 118180 116777 114926 112768 111257 110322 109250 108421
57392 108421 108891 110584 112423 113939 115377 116616 117332 117834 118496 118947 118992 119625 121730 124469 126337 127205
57376 127205 128004 129086 130223 131384 132202 131600 129387 127213 126339 125610 123467 120809 119629 119744 119409 118603
57360 118603 119088 121282 123549 124778 125479 126024 125861 124989 124441 124812 125763 127276 129834 133054 135630 137045
57344 137045 137980 138747 138653 137338 135529 134058 133113 132756 133196 134319 135620 136695 137217 136774 135495 134429
57328 134429 134370 134812 134995 135244 136063 136677 136021 134639 133966 134202 134575 135284 137238 140011 141946 142482 142741 143625
57310 143625 144903 146317 148018 149615 150298 150217 150473 151537 152930 154568 156931 159644 161347 161465 160941 160857
57294A60857N73J202K012K600K460J947J640J425J087J040J549K085K214K218
57280A84909K241J907J403J597K428K619J737R97J222J631J512J357J426J008
57266B07994J74L36J874L148L148L095L888M193K854J209R07J281J073J097K696
57251B38967M929N818N392N187N459N189M216L369K909K606K758L624M422M393
57237B99238M177M690N511N816N950O476O674N627M015L226L458M144N252O687
57223C70941P355O589N539N622O399O638O439O657P065O935O609O824P189P026
57209D63827O914P747R020R663R841J0314J0809J0689J0456J0897J1547J1551
57197E83275J1310J1599J1994J1786J1607J2325J3265J3425J3585J5157J7525
$$ plain form
57294 160857 161430 162632 164644 167244 169704 171651 173291 174716 175803 176843 178392 180477 182691 184909
57280 184909 187150 189057 190460 192057 194485 197104 198841 199838 201060 202691 204203 205560 206986 207994
57266 207994 208168 208504 210378 213526 216674 219769 223657 227850 230704 231913 232820 234101 235174 236271 238967
57251 238967 243896 249714 255106 260293 265752 270941 275157 278526 281435 284041 286799 290423 294845 299238
57237 299238 303415 308105 313616 319432 325382 331858 338532 344159 348174 351400 354858 359002 364254 370941
57223 370941 378296 384885 390424 396046 402445 409083 415522 422179 429244 436179 442788 449612 456801 463827
57209 463827 470741 478488 487508 497171 507012 517326 528135 538824 549280 560177 571724 583275
57197 583275 594585 606184 618178 629964 641571 653896 667161 680586 694171 709328 726853
57186G26853J8694J8153J7196J6750J6679J6891J7411J7578J6827J5947J6124
57175I15103J7152J8050J8805J9917K0839K0617J9687J9340J9745K0009J9826
57164A129090J9607J9394J8974J8655J8725J8755J8684J9577K1903K4075K4405
57153A351844K3624K3635K4632K5379K5669K6494K8126K9811L1057L1715L1348
57142A653334L0045K9209K9906L1149L1389L0906L0946L1456L1649L1990L3491
57131A995470L5550L6610L6604L6728L7235L7408L7396L8063L9260M0091M0753
57120B411168M2400M5353M9038N3434N9003O5588P2806Q1097R0942J01580J12049
57109C184458J22910J35532J50355J67445J87991K13630K44922K82055L26424
$$ plain form
57186 726853 745547 763700 780896 797646 814325 831216 848627 866205 883032 898979 915103
57175 915103 932255 950305 969110 989027 1009866 1030483 1050170 1069510 1089255 1109264 1129090
57164 1129090 1148697 1168091 1187065 1205720 1224445 1243200 1261884 1281461 1303364 1327439 1351844
57153 1351844 1375468 1399103 1423735 1449114 1474783 1501277 1529403 1559214 1590271 1621986 1653334
57142 1653334 1683379 1712588 1742494 1773643 1805032 1835938 1866884 1898340 1929989 1961979 1995470
57131 1995470 2031020 2067630 2104234 2140962 2178197 2215605 2253001 2291064 2330324 2370415 2411168
57120 2411168 2453568 2498921 2547959 2601393 2660396 2725984 2798790 2879887 2970829 3072409 3184458
57109 3184458 3307368 3442900 3593255 3760700 3948691 4162321 4407243 4689298 5015722
57100E015722L80286M45759N25575O23669P43500Q86594J053632J245145J459446
57091A2379328J691041J931919K172333K399447K598239K755276K858761K894736
57083C1681080K849956K722367K522129K255545J913748J486699R85896M43246
57075D6860666j11845o63773j197798j687426k102318k423570k646430k773364
57067C3254142k810975k771032k668492k517983k333910k131344j923442j718833
57059A4378131j523324j342197j178890j033509r04972p93234o97854o16430n46292
57050E741429m86261m35229l90978l51947l18337k89956k64810k41256k19551
57041B743104j99922j81129j62437j44920j29247j14194r8898q4366p1126n7520
$$ plain form
57100 5015722 5396008 5841767 6367342 6991011 7734511 8621105 9674737 10919882 12379328
57091 12379328 14070369 16002288 18174621 20574068 23172307 25927583 28786344 31681080
57083 31681080 34531036 37253403 39775532 42031077 43944825 45431524 46417420 46860666
57075 46860666 46748821 46085048 44887250 43199824 41097506 38673936 36027506 33254142
57067 33254142 30443167 27672135 25003643 22485660 20151750 18020406 16096964 14378131
57059 14378131 12854807 11512610 10333720 9300211 8395239 7602005 6904151 6287721 5741429
57050 5741429 5255168 4819939 4428961 4077014 3758677 3468721 3203911 2962655 2743104
57041 2743104 2543182 2362053 2199616 2054696 1925449 1811255 1712357 1627991 1556865 1499345
57031A499345m2309k6952j3542k730M120L096q721k8717n0108o7131p7420q0781
57019A108150p8355p2562o5749n8716n1469m4678l9237l5124l1767k8859k6043
57008E75591k2812j9468j7076j5750j4321j2395j1177j1328j1703j1296j0773
56997D17492j0849j0741r684q450p932p550o525n413m875m146k198O09L353N986
56983C49077Q771J1284J2975J3626J2386P862L24p532j3220j6616j8550j8912
56971C41475j7512j5301j3174j0775p772n010l063j061J643M084N516P232J0818
56958B97100J5694K0106K3471K5918K6342K2888J5181M766o259j6025k2932k6159
56946C80091k6045k3462j9376j5192j2299j0621q745n975l003j31L437P831J1800
$$ plain form
57031 1499345 1457036 1430084 1416542 1413812 1417932 1421028 1412307 1383590 1333482 1266351 1188931 1108150
57019 1108150 1029795 957233 891484 832768 781299 736621 697384 662260 630493 601634 575591
57008 575591 552779 533311 516235 500485 486164 473769 462592 451264 439561 428265 417492
56997 417492 406643 395902 386218 377768 369836 362286 355761 350348 345473 341327 339129 339738 343091 349077
56983 349077 357848 369132 382107 395733 408119 415981 416305 408773 395553 378937 360387 341475
56971 341475 323963 308662 295488 284713 276941 271931 268868 267807 269450 273534 279050 286282 297100
56958 297100 312794 332900 356371 382289 408631 431519 446700 451466 445207 429182 406250 380091
56946 380091 354046 330584 311208 296016 283717 273096 264351 258376 255373 255242 258679 266510 278310
56933B78310J4857J8434K3695K9592L4018L5411L2337K3516R812n304j8506k8553
56921D47619l4827l6313l3554k9493k6428k3708k0083j6478j4367j3115j1205
56910A88048q888p420o730n854m860m352l894k660r62L56J346K431L398M176N549
56895A59684P838R995J1308J2757J5381J8703K1993K5594K9603L2863L4830L6552
56883D17101L7974L6227K8888J7600O168l489j1405j7062j9638j9834j9046j7277
56871D36207j3926r823o389l463Q4M354Q904J4322K1354K9280L7072M5310N4829
56858F18115O3974O8952O6291N3989L2070M260k2228m1306n1980n6392n5626m9933
56846F30186m1408l3090k5630j7514q256R96R725J8628K8186L8608N0666O4698
$$ plain form
56933 278310 293167 311601 335296 364888 398906 434317 466654 490170 499982 494678 476172 447619
56921 447619 412792 376479 342925 313432 287004 263296 243213 226735 212368 199253 188048
56910 188048 179160 171740 165010 159156 154296 149944 146050 143390 142428 142784 144130 146561 149959 154135 159684
56895 159684 167522 177517 188825 201582 216963 235666 257659 283253 312856 345719 380549 417101
56883 417101 455075 491302 520190 537790 543958 540469 529064 512002 492364 472530 453484 436207
56871 436207 422281 412458 406069 402606 402690 407044 415948 430270 451624 480904 517976 563286 618115
56858 618115 682089 751041 817332 871321 903391 907651 885423 844117 792137 735745 680119 630186
56846 630186 588778 555688 530058 512544 504288 505284 515009 533637 561823 600431 651097 715795
56834G15795P9345R3159J06012J16192J17105J00661O4992J7264l1032p0014r4260
56823A215219j03598j02220r5251q5442p3714o1501n0287l9627k8159j6301n622
56812E53497M048J4519K6293L8021M8954N9804P0765P9909Q3324P5947N4049J9568
56800A128698j8637n0406p1094q1693q4107p9578p0691o1018n2072m3136l4154
56789D82112k6303j9688j3088o230Q6O100J2951K0387K7091L3113L9196M3437
56777E99164M1500L1008J3804o245k5387m0084m8006m9926m8724m6050m1702l6083
56765C43269l0738k6226k1809j7576j4589j2744j0813q802p879p805p040n579
56753A71669n073n706n686m329l065k707k356j706j827k809l150k389j922k337
$$ plain form
56834 715795 795140 888299 994311 1110503 1227608 1328269 1393261 1410525 1379493 1309479 1215219
56823 1215219 1111621 1009401 914150 828708 754994 693493 643206 603579 575420 559119 553497
56812 553497 557545 572064 598357 636378 685332 745136 815901 895810 979134 1055081 1109130 1128698
56800 1128698 1110061 1059655 988561 906868 822761 743183 672492 611474 559402 516266 482112
56789 482112 455809 436121 423033 416803 416889 422989 435940 456327 483418 516531 555727 599164
56777 599164 640664 671672 685476 679231 653844 613760 565754 515828 467104 421054 379352 343269
56765 343269 312531 286305 264496 246920 232331 219587 208774 199972 192093 184288 177248 171669
56753 171669 166596 160890 155204 150875 147810 145103 142747 141041 139214 136405 133255 130866 128944 126607
56739A26607k343j351p05j211j740j393r14q70n36K95M59m82j236r78o09q04p60
56722A11429mM56k6m32J48J088J610K005K546K626J978J285Q62K18m94l00P26
56705A25721J193P08N83J518K384K177J461J013O90M28P68J591J941J727J924
56690A45827K629K684J725P85L36k52q51l54J037J569P38J09L97J64j449k911
56674A52183k698j590j088j239j324j268j142p19l56r61k281k899k491k355l045
56659A26727l434k932k586l093l605l459l213l131k583j714j699k483k412r91
56645H9392J99K62L57J260J927J752J927L156M152L865L171L009K798K115J869
56630A21211K471K825K457K542L460L596K054M09J41M38J89M1O96J214P93M05
$$ plain form
56739 126607 124264 122913 122208 120997 119257 117864 116950 116080 115544 115839 116298 115816 114580 113602 112993 112189 111429
56722 111429 111425 111881 111855 111423 111571 112659 114269 116274 118820 121446 123424 124709 125571 125789 125295 124995 125721
56705 125721 126914 127622 128205 129723 132107 134284 135745 136758 137448 137876 138644 140235 142176 143903 145827
56690 145827 148456 151140 152865 153650 153986 153734 152883 152529 153566 155135 155873 155982 156379 156543 155094 152183
56674 152183 149485 147895 146807 145568 144244 142976 141834 141115 140759 139798 137517 134618 132127 129772 126727
56659 126727 123293 120361 117775 114682 111077 107618 104405 101274 98691 96977 95278 92795 90383 89392
56645 89392 89591 89853 90210 91470 93397 95149 97076 100232 104384 108249 111420 114429 117227 119342 121211
56630 121211 123682 126507 128964 131506 134966 138562 140616 141025 141166 141604 141793 141834 142530 143744 144537 144942
56614A44942Q75J207N57K1O74J623J687J298J061L70q49j062L72J528P88n55n63
56597A53974K41K77k44j24M04K92l41o69o52n65j08O65Q35J61k39J27K29l51m03
56578A53509N28R80K49r9R55J900J433Q12J366J955J225L37R72K491L457M137
56562A76207N193N721N040M634N874P461P506O431N423L883R98j843k947l048
56548B26533l596l914k787j248r94j384r21k86j007k340k385j325p57p48k76L27
56532B02892L4o17m34J13j65q10o56o7mL6Q59J570J135N78J112J583L58j529k027
56513B03961j479j529j879j163M7K18j32N48J709J633O87N50J035O61k99l94J6
56496B04190n42j611j431j57N28M67P46R60j98k051k616j824j228r80o9R88P04
$$ plain form
56614 144942 145817 147024 147581 147602 148276 149899 151586 152884 153945 154315 153466 152404 152776 154304 155092 154537 153974
56597 153974 154215 154492 154248 154124 154528 154820 154479 153810 153158 152593 152485 153150 153985 154146 153907 154034 154263 153912 153509
56578 153509 154037 155017 155266 155167 156122 158022 159455 160267 161633 163588 164813 165150 166122 168613 172070 176207
56562 176207 181400 187121 192161 196795 202669 210130 217636 224067 229490 233373 234371 232528 229581 226533
56548 226533 222937 219023 216236 214988 213994 212610 211689 211403 210396 208056 205671 204346 203589 202841 202565 202892
56532 202892 202926 202309 201875 201988 201823 201013 200357 200290 200286 200322 201181 202751 203886 204464 205576 207159 207517 205988 203961
56513 203961 202482 200953 199074 197911 197958 198176 198044 198592 200301 201934 202621 203171 204206 204867 204568 204174 204190
56496 204190 203648 202037 200606 200449 200977 201444 202190 203150 202952 200901 198285 196461 195233 194253 194184 195172 195876
56479A95876m22n71J05j73j409j872j315j168j637j478o67l76m62K92J503J593
56463A87819P12M73R58Q45K98P54J930K054J066P04J327J503Q51M41L47l68j161
56446B00553m52J304J869P54k64l12l34o35k94O20Q59L52K99P79P04J13K8J87
56428B06130m85j318o08J184J862J095O71J186J350P69M96O30J87m91k6J200J366
56411B15198M62L21J254J638J018P27J096R26J00p8N42P55M55O93J245R63L94
56394B27709J182K871L417K762K692L339L108K160K423L884M359L254K221J692
56380B67073K30k264l993m375m526m366k691k86N07l43o37jj48r74m61J182J546
56363B45473O40J130L212L768J793J05L01M46n44o63J088K481K105J747K612K895
$$ plain form
56479 195876 195454 194883 194988 194815 193406 191534 190219 189051 187414 185936 185269 184893 184431 184723 186226 187819
56463 187819 188531 189004 189962 190807 191105 191859 193789 195843 196909 197613 198940 200443 201294 201735 202082 201714 200553
56446 200553 200101 201405 203274 204028 203764 203452 203118 202483 202189 202809 203668 204020 204319 205098 205802 205915 205943 206130
56428 206130 205645 204327 203719 204903 206765 207860 208531 209717 211067 211836 212332 212962 213149 212658 212632 213832 215198
56411 215198 215660 215981 217235 218873 219891 220618 221714 222640 222740 222662 223204 223959 224414 225107 226352 227315 227709
56394 227709 228891 231762 235179 237941 240633 243972 247080 249240 251663 255547 259906 263160 265381 267073
56380 267073 267303 265039 261046 256671 252145 247779 245088 244802 245309 244966 244329 244328 244180 243206 242745 243927 245473
56363 245473 246113 247243 250455 254223 256016 256121 256422 256868 256324 255661 256749 259230 261335 263082 265694 268589
56347B68589J454K53P87J415O36j97L01R58O55N75J650K488K021J577K316L153
56331B88631L103L137L916M211L322K515K549K331J456J362K506L186K558J993
56317C26776K124J583N8n39N40J429J052Q19J502J711J017J200K723L383K249
56302C47627J573K903M691N469O108P034O782N226M755O203P105O000M877N239
56288D21592N521M684M627O472Q055P771P427Q605R633Q948Q160Q967J0183J0496
56274E31141J1061J2735J3964J3964J4744J7393J9725K0283K1111K3770K6229
56263G26120K6831K7762L1300L5860L9205M2432M7449N3477N9378O6491P5908
56252A232213Q5765R4500J03902J15846J28905J41227J53678J66921J78527J86304
$$ plain form
56347 268589 270043 270296 271083 272498 273134 272937 273238 274196 274851 275426 277076 279564 281585 283162 285478 288631
56331 288631 291734 294871 298787 302998 306320 308835 311384 313715 315171 316533 319039 322225 324783 326776
56317 326776 328900 330483 330541 330002 330542 331971 333023 333842 335344 337055 338072 339272 341995 345378 347627
56302 347627 349200 352103 356794 362263 368371 375405 382187 387413 392168 398371 405476 411476 416353 421592
56288 421592 427113 431797 436424 442896 450951 458722 466149 474754 484387 493335 501495 510462 520645 531141
56274 531141 542202 554937 568901 582865 597609 615002 634727 655010 676121 699891 726120
56263 726120 752951 780713 812013 847873 887078 929510 976959 1030436 1089814 1156305 1232213
56252 1232213 1317978 1412478 1516380 1632226 1761131 1902358 2056036 2222957 2401484 2587788
56242B587788J91509J95417J95828J90322J79946J66256J47789J23083R4161O3536
56232D135635L0811m138l7786o6641r1505j14325j33748j47646j57223j64616
56222C248818j69058j69194j66600j63211j57911j49423j39903j31882j24340
56213A877296j15485j06520r8999r1425q2428p4261o9042o4513n7874n0832m6451
56202A019466m3695l9738l5159l2233l0347k7481k4176k1922j9855j6928j4816
56191G13116j4833j4675j2228r651r499r935q253n984n764o153m608k654k916
56178F05963l764k240K36M12q54n58P11L58q80m56R63R97L30J206K978L745M337
56161F13484O165P450O269M934O433R098R770R543J1140J3297J3298J2616J4392
$$ plain form
56242 2587788 2779297 2974714 3170542 3360864 3540810 3707066 3854855 3977938 4072099 4135635
56232 4135635 4166446 4162308 4124522 4057881 3966376 3852051 3718303 3570657 3413434 3248818
56222 3248818 3079760 2910566 2743966 2580755 2422844 2273421 2133518 2001636 1877296
56213 1877296 1761811 1655291 1556292 1464867 1382439 1308178 1239136 1174623 1116749 1065917 1019466
56202 1019466 975771 936033 900874 868641 838294 810813 786637 764715 744860 727932 713116
56191 713116 698283 683608 671380 661729 652230 642295 634042 628058 622294 616141 611533 608879 605963
56178 605963 602199 599959 600195 600607 599753 599195 599906 600264 599384 598928 599891 600888 601218 602424 605402 609147 613484
56161 613484 619649 627099 633368 638302 644735 653833 663603 673146 684286 697583 710881 723497 737889
56148G37889J7676J9668K1447K5840L1899L7113M2795N1588O1912P0568P8462
56137A196857Q7728R5538R6935R1927Q4051P4183O1805N0060M3216M0671L9062
56126A962033L7953L7777L5069K6346J4392M474l205j1078j7570k0196k2584l0786
56114B012625m4401n8248p0623q2617r1656r3557q9565q4208p7897o8535n8153
56103A193165n0483m4102l5499k6635k1882j9718j5486j0060p638p202m583q70
56091I49007j90j213M20L310K860N89J658N015N438L631M655P841Q110O071O843
56076A004045R916J0202Q245R311J3057J4167J2653J3484J6534J7020J5286J6135
56064A160055J8978J8873J6554J7207K0067J9777J7111J7617K0487J9898J6508
$$ plain form
56148 737889 755565 775233 796680 822520 854419 891532 934327 985915 1047827 1118395 1196857
56137 1196857 1284585 1380123 1477058 1568985 1653036 1727219 1789024 1839084 1882300 1922971 1962033
56126 1962033 1999986 2037763 2072832 2099178 2113570 2118044 2114839 2103761 2086191 2065995 2043411 2012625
56114 2012625 1968224 1909976 1839353 1756736 1665080 1571523 1481958 1397750 1319853 1251318 1193165
56103 1193165 1142682 1098580 1063081 1036446 1014564 994846 979360 969300 961662 954460 949877 949007
56091 949007 948817 947604 948024 951334 954194 954783 956441 961456 966894 970525 975180 983021 991131 997202 1004045
56076 1004045 1013961 1024163 1032408 1041719 1054776 1068943 1081596 1095080 1111614 1128634 1143920 1160055
56064 1160055 1179033 1197906 1214460 1231667 1251734 1271511 1288622 1306239 1326726 1346624 1363132
56053A363132J6261J8649J7835J4554J4879J7947J7333J3944J4805J9462K0722
56042A549523J8543J9775K4244K4945K2230K3598K8960L0466K7716K8537L3640
56031A832177L5420L3168L4454L9907M1831L9515M0634M5782M7206M4567M6044
56020B280705N2056N4235N2259N4844O2176O4779O1932O3359P0305P3376P1695
56009B961721P5090Q4321Q8755Q7010Q9833R9018J04124J03927J09714J22959
55999C926472J31633J33363J39743J52798J60495J60904J66829J80773J90020
55990E343030J92574K02248K21650K36837K45438K62251K89782L12460L27709
55981G633979L52234L89307M21933M47271M83919N35560N83223O24057O79860
$$ plain form
56053 1363132 1379393 1398042 1415877 1430431 1445310 1463257 1480590 1494534 1509339 1528801 1549523
56042 1549523 1568066 1587841 1612085 1637030 1659260 1682858 1711818 1742284 1770000 1798537 1832177
56031 1832177 1867597 1900765 1935219 1975126 2016957 2056472 2097106 2142888 2190094 2234661 2280705
56020 2280705 2332761 2386996 2439255 2494099 2556275 2621054 2682986 2746345 2816650 2890026 2961721
56009 2961721 3036811 3121132 3209887 3296897 3386730 3485748 3589872 3693799 3803513 3926472
55999 3926472 4058105 4191468 4331211 4484009 4644504 4805408 4972237 5153010 5343030
55990 5343030 5535604 5737852 5959502 6196339 6441777 6704028 6993810 7306270 7633979
55981 7633979 7986213 8375520 8797453 9244724 9728643 10264203 10847426 11471483 12151343
55972A2151343P55818Q31157R02984R96420J117854J244572J375676J543542J758637
55963B2678003J997462K263765K603214L038048L553439M171652M967471N986926
55955E1259980P236351Q779817J0745630J3200152J6134609J9617171K3796502
55948A50770212K8673570L4026818L9557163M4630804M7475207M5069610L4888404
55941D25091788J7398308l347590k1988136l4909509m1424631m2788967m0747613
55934B57283650l6832022l2213796k7626805k3386925j9603774j6353884j3656675
55927H7609769j1432577r586268q077084o867123n874612n029979m321544l745028
55919C2675554l259788k830832k464846k169343j918361j688979j491659j335474
$$ plain form
55972 12151343 12907161 13738318 14641302 15637722 16755576 18000148 19375824 20919366 22678003
55963 22678003 24675465 26939230 29542444 32580492 36133931 40305583 45273054 51259980
55955 51259980 58496331 67276148 78021778 91221930 107356539 126973710 150770212
55948 150770212 179443782 213470600 253027763 297658567 345133774 390203384 425091788
55941 425091788 442490096 439142506 417154370 382244861 340820230 298031263 257283650
55934 257283650 220451628 188237832 160611027 137224102 117620328 101266444 87609769
55927 87609769 76177192 66590924 58513840 51646717 45772105 40742126 36420582 32675554
55919 32675554 29415766 26584934 24120088 21950745 20032384 18343405 16851746 15516272
55911A5516272j199887j067648r51266q61826p83617p03111o32741n83116n40055
55902H193005m90709m45799m15331l87679l52582l20888l02109k84978k58819
55893D934111k33031k17484k03854j83475j64465j54522j45025j28271j13109
55884C390875j08228j06542j00680r7382j02146j05567r9402r1133q8865q6510
55874B404420p7637o9630p0164p2871o9862o5872o6999o7640o1492n4079n2037
55863A676137n0783m4637l8535l8281l9398l6571l4113l6422l8125l4162k9803
55852A255307l0438l1182k6857k2587k4153k7036k5369k2872k4798k7558k6282
55841I66175k4440k6220k7434k3560j8997j8970j9973j7296j4358j5412j6646
$$ plain form
55911 15516272 14316385 13248737 12297471 11435645 10652028 9948917 9316176 8733060 8193005
55902 8193005 7702296 7256497 6841166 6453487 6100905 5780017 5477908 5192930 4934111
55893 4934111 4701080 4483596 4279742 4096267 3931802 3777280 3632255 3503984 3390875
55884 3390875 3282647 3176105 3075425 2978043 2875897 2770330 2670928 2579795 2490930 2404420
55874 2404420 2326783 2257153 2186989 2114118 2044256 1978384 1911385 1843745 1782253 1728174 1676137
55863 1676137 1625354 1580717 1542182 1503901 1464503 1427932 1393819 1357397 1319272 1285110 1255307
55852 1255307 1224869 1193687 1166830 1144243 1120090 1093054 1067685 1044813 1020015 992457 966175
55841 966175 941735 915515 888081 864521 845524 826554 806581 789285 774927 759515 742869
55830G42869j3695j0551j1878j3709j1007p276p564q802o472m065o557j0610j0678
55817F20005q957j0206j2317j1029q661r289j0355p725m163m232n599l797r49
55804E22726j393l010j245K366L628L612N497P503O517M822N737O568L318j469
55790E65177l029k753m809p968q213o247n387n196m063m650r806j6076j8108j6516
55776D52356j4955j2771p340n81L785O842J1702J6650J7266J3044O294k535j2718
55763D77039j9782k0426j7968j7101j6527j2851q147o852q121q053o923p561r065
55750C17662q674p626q694j0105q339m818l533m026k985q45m51r83N24L063L126
55735B63296Q37r76k199m316n691l811o78k31j878k163j268k077m240m940m322
$$ plain form
55830 742869 729174 718623 706745 693036 682029 674753 667189 658387 651915 647850 641293 630683 620005
55817 620005 611048 600842 588525 577496 568835 559546 549191 541466 537303 533071 527472 523675 522726
55804 522726 521333 518323 517078 519444 523072 526684 532181 539684 546201 551023 556760 563328 566646 565177
55790 565177 562148 559395 554586 546618 538405 532158 526771 521575 517512 512862 503056 486980 468872 452356
55776 452356 437401 424630 417290 416709 420494 427336 439038 455688 472954 485998 492292 489757 477039
55763 477039 457257 436831 418863 401762 385235 372384 364237 357385 349264 341211 334288 326727 317662
55750 317662 308988 301362 292668 282563 274224 269406 265873 261847 258862 258017 257566 256583 257107 260170 263296
55735 263296 264133 263157 260958 256642 250951 247140 246462 246231 244353 242190 240922 238845 234605 229665 225343
55720B25343m621n169l629j016j57l93R17L031L269K465L543N903O472N135M052
55705B45145K929K36k343k082n17j287l924n221n240o412p985p230n143n084o543
55690A89299o065l706k768l608l413j793j074j231p0J887K010Q86J544L706M268
55675A79872L264L634N083M045K09k574k699k658l688l805k357j564k231k359
55661A72172j193m44n45J83J779K155J071P44J820K534K427L014M337M683M080
55646A98817M217M681L273L19j433j470k027l671m563m490n303o905o994n446
55632A69005m770n588n747m619m016m149k919k45J096R4r92q44r02j790j768k27
55616A31619P54j23j462j960k234k780k923k568k461k254j049J17o10k347k428
$$ plain form
55720 225343 220722 215553 211924 210908 210751 210358 211275 214306 217575 220040 223583 229486 235958 241093 245145
55705 245145 248074 248310 245967 243885 243368 242081 238157 232936 227696 221284 213299 206069 200926 195842 189299
55690 189299 183234 179528 176760 173152 169739 167946 166872 165641 165571 167458 169468 170354 171898 175604 179872
55675 179872 183136 186770 191853 195898 196107 193533 190834 188176 184488 180683 178326 176762 174531 172172
55661 172172 170979 170535 169990 170173 171952 174107 175178 175922 177742 180276 182703 185717 190054 194737 198817
55646 198817 203034 207715 210988 211307 209874 208404 206377 202706 198143 193653 188350 181445 174451 169005
55632 169005 164235 158647 152900 148281 144265 140116 137197 136952 138048 138142 137150 136306 135404 133614 131846 131619
55616 131619 132373 132250 130788 128828 126594 123814 120891 118323 115862 113608 112559 112676 112066 109719 107291
55601A07291p96M1n53p68k95p44j888j540K50R16j07o29J2K9p36k05J567J785
55583A03630r8j111J51J349Q69M00J241J968J679J875L257M112L751M063N874
55568A33010P055O135M516L328J398j760m219m829n037n734n444l564k272l039
55554A19544m202m062l579l876l839k500j183j197j614j306r14j018o69N34J173
55539I1292M47l54k72k37p36m49J226K689K711K152J774Q41o88j242l80L9r83
55522I7830j933j663j238j381r60K87M63j096k049p34J084J352R76J559K369K034
55506I6900J158Q35M90n75j364j023o25j136j468n41O02O86L66O15P82J69k78
55489I5593K29O62R4m94j51K07l39r01o47n39j336j765p43M33J52r42j345j083
$$ plain form
55601 107291 106495 106536 105983 105215 104920 104176 102288 100748 100998 101914 101807 101178 101190 101219 100483 100278 101845 103630
55583 103630 103532 102421 102572 103921 104790 105190 106431 108399 110078 111953 115210 119322 123073 127136 133010
55568 133010 140065 146200 150716 154044 155442 153682 149463 144634 139597 133863 128419 124855 122583 119544
55554 119544 115342 111280 107701 103825 99986 97486 96303 95106 93492 92186 91272 90254 89585 90119 91292
55539 91292 91739 91385 91113 90876 90140 89691 90917 93606 96317 98469 100243 101084 100396 99154 98774 98813 97830
55522 97830 95897 94234 92996 91615 90655 90942 91405 90309 88260 87526 88610 89962 90938 92497 94866 96900
55506 96900 98058 98893 99383 98808 97444 96421 95796 94660 93192 92651 93253 93939 94305 94920 95702 95871 95593
55489 95593 95822 96484 96578 96084 95933 96140 95801 94900 94253 93714 92378 90613 89870 90303 90455 89513 88168 87085
55471H7085q78n26J28K52l19k31R55J426oj718j801r25o27o35n5N04J27n51o22
55452H1583n50q13n59O39J356N41n95o80l81o61p12K71J139P28K4L08Q31M48j26
55433H2791J20M16j35n15L26J232P99r4p0J64n39j180l16J079J142K06k28l33
55415H4865j061j612n82J272K045J626J229Q38k90j385j024L07Q71K96m43j026
55399H5926j615j540l21P87L75p52q99k56j85o64p12m98o59m83Q32J922R68j061
55381H1165j493R0J550J561P58k22j378k092j510k72J01m92r16r66j356j877j633
55364G1018q53n29m89J79J059R27Q0OQ41J233P83M95P26O57J08n8L72N50J57r4
55344G7168J49L68K26n4l50o29m94J45M05l49j164p60M38J022P65M91K89l31r33
$$ plain form
55471 87085 86207 85681 85809 86061 85742 85511 86466 87892 87886 86168 84367 83442 82815 82180 82125 82629 82756 82205 81583
55452 81583 81033 80220 79661 80300 81656 82197 81602 80922 80541 79880 79168 79439 80578 81306 81330 81638 82469 82917 82791
55433 82791 82911 83327 83192 82677 83003 84235 85034 84940 84870 85034 84495 83315 82999 84078 85220 85426 85198 84865
55415 84865 83804 82192 81610 82882 84927 86553 87782 88620 88330 86945 85921 86228 87099 87395 86952 85926
55399 85926 84311 82771 82450 83237 83612 82860 81961 81705 81520 80856 80144 79646 78987 78504 79336 81258 82226 81165
55381 81165 79672 79762 81312 82873 83631 83409 82031 79939 78429 78157 78258 77766 76850 75884 74528 72651 71018
55364 71018 70165 69636 69147 69326 70385 71312 71392 71398 72239 73472 74255 74750 75476 76133 76241 76183 76555 77105 77262 77168
55344 77168 77317 77685 77911 77857 77507 76878 76384 76529 76934 76585 75421 74661 75099 76121 76886 77377 77666 77335 76402
55325G6402n92L62P08K63l8J60L33K43P6k88q81r86j71O31L96l92p38q56j276
55306G3356j263k4J327J185O9k28M51P53L67K09L87K05m8N68J620J774J084P49
55288H2541P63N3j110j143J40J026N67k53l89k5L76P33P33M7o66m59K46K42m14
55269H3008n74j27r5o22p03p4M09L80L36L30o7n33l20J93k2p81r93o46o04o77
55249G7818N4J146J213M22L17R81Q26m16r31J64J315J010j35p80p33m55n8L22
55231H2080L32J11J94M70M16K89P08J123M70p65j002j37L96K09L88J032O78r86
55213H6006k158j618m58q1l07n28j023j903k251j477l34L57P89J253J402J154
55197G8823J060J087M28q64j502q98n4K06M00R67J195N87k4K17Q38R52M82k40
$$ plain form
55325 76402 75810 76172 76880 77143 77105 77265 77598 77841 77917 77629 76748 75762 75591 76222 76618 76226 75488 74632 73356
55306 73356 72093 72069 73396 74581 74650 74422 74873 75626 75993 76202 76589 76794 76746 77314 78934 80708 81792 82541
55288 82541 83304 83357 82247 81104 81244 82270 82837 82584 82195 82170 82546 83279 84012 84059 83393 82934 83180 83422 83008
55269 83008 82434 82307 82212 81590 80887 80813 81222 81602 81938 82268 82201 81668 81348 81541 81519 80738 79745 79099 78495 77818
55249 77818 77872 79018 80231 80653 80970 81951 82777 82361 81430 81594 82909 83919 83784 83004 82271 81816 81758 82080
55231 82080 82412 82523 82717 83187 83603 83892 84600 85723 86193 85428 84426 84289 84685 84894 85282 86314 86992 86006
55213 86006 83848 82230 81772 81691 81384 80856 79833 77930 75679 74202 73868 74225 75014 76267 77669 78823
55197 78823 79883 80970 81398 80534 79032 78134 78080 78286 78686 79653 80848 81435 81411 81628 82466 83418 83900 83660
55179H3660j083j606j112Q1N85j15q65o34Q4M29N34Q58J194J243J197J112O20
55162H6182j20k15N33J067N88l55r36j136j162q09j42J45k11n27k77J19J62M7
55144H2953Q1J63K40M33M68J0l38M21J901K482J597M60J07O3l42p74p26m00p6
55125H8723L37N58k8j155j698j386j189j527j508o29J98J39l12l58J7O57J668
55108H2507K544K161M74r82j017j77M31N60M27J42J39R77K140K259J120R2N9L98
55090I4254N60R56J600J551O45J32N80Q44J54m42l0M75j7q37q10j98Q1R0L21N33
55070A00442M49O10J313J643Q22m44j059j030q12l50K19J11p29j074m16o7r38
55053I8690j757j118P1O3r09j293p72k72q2K18M95L50K00N60Q53L38l97l34K61
$$ plain form
55179 83660 82577 80971 79859 79940 80525 80410 79545 78911 78995 79424 79958 80816 82010 83253 84450 85562 86182
55162 86182 86062 85847 86380 87447 88035 87680 86744 85608 84446 83637 83495 83640 83429 82902 82625 82744 82906 82953
55144 82953 83034 83197 83437 83870 84338 84348 84010 84431 86332 88814 90411 90871 90978 91041 90699 89925 89199 88799 88723
55125 88723 89060 89618 89590 88435 86737 85351 84162 82635 81127 80498 80696 80835 80523 80165 80182 80839 82507
55108 82507 85051 87212 87686 86704 85687 85510 85941 86501 86928 87070 87209 88186 90326 92585 93705 93797 93856 94254
55090 94254 94814 95770 97370 98921 99566 99698 100278 101122 101276 100834 100804 101279 101262 100425 99615 99417 99498 99588 99909 100442
55070 100442 100891 101501 102814 104457 105279 104835 103776 102746 101934 101584 101803 101914 101185 100111 99695 99628 98690
55053 98690 96933 95815 95886 95949 95040 93747 92975 92703 92621 92839 93334 93684 93884 94444 95297 95635 95238 94904 95165
55034I5165M94M77P40P66j68j258j142j16K92k65p49o31l81k24M4J35l40p78l59
55015I1702M08M32M0M14J209P92r06j854q72O29Q12j11o96n23l50n26l83P48K517
54996I3482L778L643K290P32j40j49M24J176J563J182L28k29k84l77o88n92J69
54979A06308P81N40m8j25K11K71j43p29j202j195k89J143J877J328L67L4K09L41
54961A09679N27R07R43L54l6M41J021O20m24r69q12n85m90l17k67n97q91o96l93
54942A08015m62n48k58j43o93j141n58N61J157J383K008K641K271J181O68R84
54926A17066J134O82L30N92J160J722K325K831L043L287L978M697M626L684K415
54911A53572J102j68j079j670k705m424n617n191l922l221k883j811l74p5j029
$$ plain form
55034 95165 95659 96136 96876 97642 97474 96216 95074 94958 95250 94985 94236 93605 93224 93000 93044 93179 92839 92061 91702
55015 91702 92110 92542 92582 92996 94205 94997 94091 92237 91365 91994 92806 92695 91999 91476 91126 90600 90217 90965 93482
54996 93482 97260 100903 103193 103925 103785 103636 104060 105236 106799 107981 108309 108080 107796 107419 106731 106139 106308
54979 106308 107089 107629 107581 107456 107667 107938 107795 107066 105864 104669 104380 105523 107400 108728 109095 109129 109338 109679
54961 109679 110206 111113 112056 112410 112374 112815 113836 114456 114032 113063 112251 111666 111176 110859 110592 109995 109104 108408 108015
54942 108015 107553 107005 106747 106604 105911 104770 104212 104773 105930 107313 109321 111962 114233 115414 116082 117066
54926 117066 118200 118882 119212 119804 120964 122686 125011 127842 130885 134172 138150 142847 147473 151157 153572
54911 153572 154674 154506 153427 151757 149052 144628 139011 133820 129898 126677 123794 121983 121609 121534 120505
54896A20505j692j236m78k24l03m59q00j031o19Q8J39l36j53J027K085K124J543
54879A20180J111J083J595K787M191M914M803M554M531M346L729K807J427p33
54865A61325l209m858n182m688l960l200k684k671k805k525k063k085k395k120
54851A16880j158l46j73l32n54q75j069q75p41j248j934j778q78k99k95m5P22
54834A05002J183Q50L41L32P28J153J353J002K4q60q80m55n60j077j054n21n10
54817A06051j190j483q56l9L57N87P48M19k23k60M93J051Q15L94L59L18j52p35
54799A06654r63p32N3J304K096J444m1o02K20J070J025P88R98R55J1j113j435
54782A11732j086o20k7O78Q53K82r2N76J765K466K633K835L096K962K366J741
$$ plain form
54896 120505 118813 117577 117099 116875 116572 116113 115313 114282 113663 113751 113890 113554 113401 114428 116513 118637 120180
54879 120180 121291 122374 123969 126756 130947 135861 140664 145218 149749 154095 157824 160631 162058 161325
54865 161325 158116 153258 148076 143388 139428 136228 133544 130873 128068 125543 123480 121395 119000 116880
54851 116880 115722 115376 115203 114871 114317 113442 112373 111498 110757 109509 107575 105797 104919 104620 104325 104280 105002
54834 105002 106185 107035 107376 107708 108436 109589 110942 111944 111968 111108 110228 109773 109213 108136 107082 106561 106051
54817 106051 104861 103378 102522 102483 102840 103427 104175 104594 104371 104111 104604 105655 106470 106864 107223 107541 107389 106654
54799 106654 105691 104959 105012 106316 108412 109856 109815 109213 109433 110503 111528 112316 113314 114269 114280 113167 111732
54782 111732 110646 110026 109999 110677 111530 111812 111720 112296 114061 116527 119160 121995 125091 128053 130419 132160
54766A32160J553K122L358M415M303L193K386K602L102K855J766K99j268k700
54752A60146l647m131m480m522l698k249j256j164j260j075j170j885k450k121
54738A25038j343r44r29q39o33m75k82k2N4j0K17P51R89P65P57J470K582L588
54720A30734M298M411L622K496K134K585K694J904R31K06q68k449l487l416l194
54705A42601l588l778k899j766j587j941j603o50k26o61j221j484j730k076k199
54690A15192j857j036J19J019Q57k46j012o17J78K95o0m8K81K14l24p27o92l75
54672A11161M8K96o7r10j325q36j34Q7K27Q11J283Q94J12q8K31L01O0K4P0l41
54652A11904r14o90N16J803K317J904Q20m28j083p92q3L60O16R80J097N36j90
$$ plain form
54766 132160 133713 135835 139193 143608 147911 151104 153490 156092 159194 162049 163815 164114 162846 160146
54752 160146 156499 152368 147888 143366 139668 137419 136163 134999 133739 132664 131494 129609 127159 125038
54738 125038 123695 122751 121822 120983 120350 119875 119593 119571 119625 119615 119832 120583 121572 122337 123094 124564 127146 130734
54720 130734 135032 139443 143065 145561 147695 150280 152974 154878 155809 156015 155147 152698 149211 145795 142601
54705 142601 139013 135235 132336 130570 128983 127042 125439 124789 124563 123902 122681 121197 119467 117391 115192
54690 115192 113335 112299 112418 113437 114294 114048 113036 112419 112597 112892 112832 112784 113065 113279 112955 112228 111536 111161
54672 111161 111209 111505 111438 110528 109203 108367 108233 108320 108547 109358 110641 111535 111647 111559 111790 112091 112151 112175 112245 111904
54652 111904 110990 110300 110816 112619 114936 116840 117660 117232 116149 115357 115274 115634 116250 117230 118327 118863 118673
54635A18673k30J80J1q92j452q35M80J277P95o61j903j855p21J32j59r23j084
54618A10833o36l06k99k69j14L8K72O06O76L53J87M79N63q5p32m30M25P96P15
54599A13072R50J328Q92l10j057o99J15O99J120J425J177K11q58j313j018l24
54583A15410K12J1r04j614j237j29O22P06P16Q99Q60N42M42O21M76j35n18k85
54565A16695m1l46p39m93K22O42N60M86O67O53M4p34p84J62J321J773J453R32
54547A22473M59j07n40k35P54J498J419J025R46R36N07j11m24n12n86l46M17R80
54529A28553M75p32j421j145o39o10r63j229j165q17l76j4M24J198J930J689K79
54512A25437j181j660j490j452j280k75J121J642J014K74K86Q32J276J256O84
$$ plain form
54635 118673 118443 118623 118634 117742 116290 115455 115935 117212 118007 117346 115443 113588 112867 112999 112840 111917 110833
54618 110833 110197 109891 109592 109323 109209 109247 109519 110125 110801 111154 111341 111820 112383 112298 111566 111136 111561 112357 113072
54599 113072 114022 115350 116242 115932 114875 114176 114291 114990 116110 117535 118712 118923 118065 116752 115734 115410
54583 115410 115622 115633 114729 113115 111878 111749 112371 113077 113793 114692 115552 116094 116536 117157 117633 117498 116980 116695
54565 116695 116654 116308 115569 115076 115298 115940 116500 116986 117653 118306 118350 117616 116832 116994 118315 120088 121541 122473
54547 122473 122932 122825 122285 122050 122804 124302 125721 126746 127692 128628 129135 129024 128600 128088 127502 127156 127573 128553
54529 128553 129028 128296 126875 125730 125091 124481 123518 122289 121124 120307 119931 119917 120341 121539 123469 125158 125437
54512 125437 124256 122596 121106 119654 118374 118099 119220 120862 121876 122150 122436 123268 124544 125800 126484
54497A26484k05p68n74o5j9n26j032j168q94j96O80J039O50L12P47J397J365R54
54479A28181J048J336P28o88j529j155l65J24N87J302J846J886J748J694J509
54464A38252J119Q16O02J06o01q85n49j51n1N2L52N24L34j5l97r31j393j222m30
54445A35532J84O2m63p40n66k21k14r41k056k347j035R46J875J365N59L06K63
54428A32509j4k37j17J42M00Q06J150Q46J2l98M3N53L01m84j065j193j072r03
54410A31279q03p03k11Q78J920K031J380R45R66P37J23QP76J529J463R93Q33Q85
54392A45029Q02P92J086J300J074O87M41P8n04o91q4O76P48K38j92l54m16k18
54374A50492N27J642K673L412L784L743L599L912M578M613L415J639K01q68j937
$$ plain form
54497 126484 126279 125511 124937 124872 124853 124327 123295 122127 121233 121037 121717 122756 123406 123718 124465 125862 127227 128181
54479 128181 129229 130565 131293 130605 129076 127921 127556 127680 128267 129569 131415 133301 135049 136743 138252
54464 138252 139371 140187 140789 140895 140294 139409 138860 138709 138658 138710 139062 139586 139920 139905 139508 138577 137184 135962 135532
54445 135532 135716 135778 135315 134575 134009 133788 133574 132633 130577 128230 127195 128141 130016 131381 131940 132246 132509
54428 132509 132495 132258 132141 132283 132683 133489 134639 135485 135497 135099 135142 135695 135996 135512 134447 133254 132182 131279
54410 131279 130476 129773 129562 130440 132360 134391 135771 136716 137682 138419 138542 138550 139326 140855 142318 143311 144144 145029
54392 145029 145831 146623 147709 149009 150083 150770 151211 151289 150785 150094 150010 150686 151434 151672 151480 151126 150710 150492
54374 150492 151019 152661 155334 158746 162530 166273 169872 173784 178362 182975 186390 188029 188230 187362 185425
54359A85425k709k625j876j209r29q47r25j270j701j944k057k169k061j599j235
54344A60269j398j739j592j027p52j084j627j893j674r53L0O49M05m76j265j535
54328A44338j371r95n59k08O7M83J028J174M85o52j331j139m32K22N21M54K47
54311A42332K72N99P10J9j310k417k639k055j146k58L97N62R5o31q58k39O29Q05
54293A34867K18j76L07J102J203N80J03K47O19P74Q24R61J066J052J104J280J280
54276A47411Q44J17n80j018j079q08m58j73K97J127J857J874J335R06P78O58O14
54259A53702R57J367J133M41L03R48J392R73K07l55r55j665j761q94L0J67L6N38
54241A56564J369J495O82m13j248j615j316n38q5l86p42m22P2j31o50m19M07N68
$$ plain form
54359 185425 182716 180091 178215 177006 176077 175230 174305 173035 171334 169390 167333 165164 163103 161504 160269
54344 160269 158871 157132 155540 154513 153761 152677 151050 149157 147483 146530 146560 147209 147614 147138 145873 144338
54328 144338 142967 141972 141413 141205 141272 141755 142783 143957 144442 143790 142459 141320 140888 141110 141631 142085 142332
54311 142332 142604 143203 143913 143932 142622 140205 137566 135511 134365 134107 134504 135066 135161 134530 133672 133433 134062 134867
54293 134867 135085 134909 135216 136318 137521 138101 138204 138451 139070 139844 140668 141629 142695 143747 144851 146131 147411
54276 147411 148255 148372 147792 146774 145695 144887 144429 144256 144553 145680 147537 149411 150746 151652 152430 153088 153702
54259 153702 154659 156026 157159 157600 157903 158851 160243 161216 161423 161068 160113 158448 156687 155793 155823 155990 156026 156564
54241 156564 157933 159428 160110 159697 158449 156834 155518 154980 154895 154509 153767 153345 153417 153286 152636 152217 152624 153192
54223A53192k45q53m39K87L55k2j3M43O19J33n71q44n66k20k81o73q89o48k46
54204A48519j40m09q58j328j647j513q44l6M87P76J068J254J065O25K88P8k62
54187A47123o55o94l16nj44m69m40Q3P85J327J648J725J346M36m17k79R52K086
54169A54092J911P40l1J63M05k71j541k350k234j568q47k32K81O28N65j13j114
54152A48484j608j095j70J96k2r3P9j62p82p18M59J579J432M70J07Q40J900K396
54134A53292K102J371Q15Q28J006N68m37r25k30R90J887K591L550M475M830M807
54118A81520M806M599L893L306L686M649M951M070K538Q12j219l478n360o345
54104B02428o430n884n010m129l405k755k231k150k474k555j995j297j066j055
$$ plain form
54223 153192 152947 152094 151655 151942 152297 152275 152262 152705 153324 153457 152886 152042 151476 151256 150975 150302 149413 148765 148519
54204 148519 148379 147970 147112 145784 144137 142624 141780 141744 142231 143007 144075 145329 146394 147019 147307 147385 147123
54187 147123 146468 145774 145458 145453 145309 144840 144400 144483 145268 146595 148243 149968 151314 151750 151333 151054 152006 154092
54169 154092 156003 156743 156712 156875 157280 157009 155468 153118 150884 149316 148469 148237 148518 149146 149711 149598 148484
54152 148484 146876 145781 145611 145807 145785 145692 145771 145609 144827 144109 144568 146147 147579 148049 148156 148996 150896 153292
54134 153292 155394 156765 157580 158408 159414 159982 159545 158620 158390 159380 161267 163858 167408 171883 176713 181520
54118 181520 186326 190925 194818 198124 201810 206459 211410 215480 218018 218830 217611 214133 208773 202428
54104 202428 195998 190114 185104 180975 177570 174815 172584 170434 167960 165405 163410 162113 161047 159992
54090A59992o68J2N20Q09R77O54l93j396j394o35j67j75J87J251K147K007R96
54073A64724n7n46l27L62J023J290J157P55Q9o62r99p25l25j82M9P22J347J264
54055A68959O66K11M1m4J34P58J407J720K188L225M017L537K294J739K180K745
54039A95777L180M098N410O085N828N568N812N823N018L971L408L157K790K413
54025B58338K214J993J646J492J640J662J237N78n5o48j101j348j836l074m554
54010B58184n119m589m021m077m244m024l789l902m009l866l881m116l736k293
53996B02518p76m02r71j321r83m80l03l14j45M11J283K139K704L238M233N582
53980B16413O589O917O814O131M149Q50k473m660n981p213q125p880o553n176
$$ plain form
54090 159992 159324 159336 159856 160665 161642 162296 161903 160507 159113 158478 158311 158136 158323 159574 161721 163728 164724
54073 164724 164667 164121 163794 164156 165179 166469 167626 168381 168470 167808 166809 166084 165759 165577 165626 166348 167695 168959
54055 168959 169625 169836 169877 169833 169967 170725 172132 173852 176040 179265 183282 186819 189113 190852 193032 195777
54039 195777 198957 203055 208465 214550 220378 225946 231758 237581 242599 246570 249978 253135 255925 258338
54025 258338 260552 262545 264191 265683 267323 268985 270222 270800 270745 270097 268996 267648 265812 262738 258184
54010 258184 253065 248476 244455 240378 236134 232110 228321 224419 220410 216544 212663 208547 204811 202518
53996 202518 201742 201340 200369 199048 198065 197585 197282 196968 196823 197234 198517 200656 203360 206598 210831 216413
53980 216413 223002 229919 236733 242864 247013 247863 245390 240730 234749 227536 219411 211531 204978 199802
53966A99802m313l541k349r61QK91J66J74N55R91R83N71L83Q37J639K177K094
53949A99507J408N18J79R09K232L023K858K440K479K770K789K514K244K064J970
53934B29904K093K365K437K311K589L614M802N313N055M586M377M512M768M686
53920B83412M003L261L410M544N655O050O241O832P355O984N871M829M064L169
53906C55680K103J255O38j31j032j601j755k021k713l456l709l442l063k991l395
53891C30367m243n420o789q054q677q277p207o307n940n664n074m415m012l640
53877B46648k984k319k127k288k298k147k347l082l778l753k966j985j418j363
53863B11793j396j188j000j332k140k757k735k290j790j248n90RL18L12%n32q55
$$ plain form
53966 199802 195489 191948 189599 188638 188646 188937 189103 189277 189832 190823 191806 192377 192760 193597 195236 197413 199507
53949 199507 200915 201433 201612 202521 204753 207776 210634 213074 215553 218323 221112 223626 225870 227934 229904
53934 229904 231997 234362 236799 239110 241699 245313 250115 255428 260483 265069 269446 273958 278726 283412
53920 283412 287415 290676 294086 298630 304285 310335 316576 323408 330763 337747 343618 348447 352511 355680
53906 355680 357783 359038 359676 359545 358513 356912 355157 353136 350423 346967 343258 339816 336753 333762 330367
53891 330367 326124 320704 313915 305861 297184 288907 281700 275393 269453 263789 258715 254300 250288 246648
53877 246648 243664 241345 239218 236930 234632 232485 230138 227056 223278 219525 216559 214574 213156 211793
53863 211793 210397 209209 208209 206877 204737 201980 199245 196955 195165 193917 193327 193336 193654 193966 193966 193434 192579
53846A92579m45N19J215J238J052J083J097Q43O05N36K13m81p36O9J176J297L25
53829B02185o72r14n15J15O83Q21K99n35j034r39m08L63J071J177N56k2K71J175
53811B03677J814J994K247K724L071L340M066N185N727N055L772L051L438M491
53797B53652N283N119M171L448L707M482M641L823K709J932J456J083Q47O22P3
53782B97048p24j287j633k491m142n665n972n157m227l841l877m012m070l886
53768B46064l386k916k927l287l285k622j951k089k844l115k284j064o80j357
53754B12257k119k065j381q61q10q48n72mN60P81M07m81j299j362o25K59O64N98
53736B03099N18P73J371K064K500K385J707Q28K12P2K77O18J052J632K217K479
$$ plain form
53846 192579 192134 192653 193868 195106 196158 197241 198338 199181 199786 200322 200535 200054 199318 199387 200563 201860 202185
53829 202185 201513 200599 200084 200199 200882 201703 202002 201467 200433 199494 199086 199449 200520 201697 202253 202231 202502 203677
53811 203677 205491 207485 209732 212456 215527 218867 222933 228118 233845 238900 242672 245723 249161 253652
53797 253652 258935 264054 268225 271673 275380 279862 284503 288326 291035 292967 294423 295506 296353 296975 297048
53782 297048 296324 295037 293404 290913 286771 281106 275134 269977 265750 261909 258032 254020 249950 246064
53768 246064 242678 239762 236835 233548 230263 227641 225690 223601 220757 217642 215358 214294 213614 212257
53754 212257 210138 208073 206692 205831 205021 204173 203601 203597 204157 204938 205345 204864 203565 202203 201578 201837 202501 203099
53736 203099 203617 204390 205761 207825 210325 212710 214417 215245 215457 215529 215806 216424 217476 219108 221325 223804
53720B23804K249J753J357J200J233J451J867K308K571K651K641K466K100J868
53706B51519K078K404K191J460J052J598K786L897M561M829M907N066N345N132
53692B98825L720J532R6K83J129J035l33j951k844k827k162j222n13l90p61j316
53676B92301j879k253k086j416r29j091j342r10l1M24L75N54J113J220L65p37
53660B83678j058n45M2J73J3m5R6J99Q0k4L60J228J878J760J316J465K236K611
53642B95463J923Q23M74J124K003K475K765L360L964L607J914j25j106q04k74
53627C17586l44o32l27O75J830K690L045K776K133J815K175K659K629K440K865
53612C44015L733M051L504K912L008L498L759L748L798L912L768L227K522K042
$$ plain form
53720 223804 226053 227806 229163 230363 231596 233047 234914 237222 239793 242444 245085 247551 249651 251519
53706 251519 253597 256001 258192 259652 260704 262302 265088 268985 273546 278375 283282 288348 293693 298825
53692 298825 302545 304077 304173 304456 305585 306620 306287 304336 301492 298665 296503 295281 294768 294378 293617 292301
53676 292301 290422 288169 286083 284667 283738 282647 281305 280395 280364 280788 281163 281717 282830 284050 284415 283678
53660 283678 282620 282075 282117 282290 282303 282258 282354 282553 282633 282609 282969 284197 286075 287835 289151 290616 292852 295463
53642 295463 297386 298209 298683 299807 301810 304285 307050 310410 314374 317981 319895 319770 318664 317860 317586
53627 317586 317242 316610 316283 316958 318788 321478 324523 327299 329432 331247 333422 336081 338710 341150 344015
53612 344015 347748 351799 355303 358215 361223 364721 368480 372228 376026 379938 383706 386933 389455 391497
53598C91497K000K172J951R60l47j076r51o19p72j325j714j681j501j531j769
53583C85294j894j721j522j796k563l113k752j667p30m70n92n28j64J64J54j63
53567C65937n09o89p68r31j142j143p82k56M5j83j038k257l159l072j980n06P21
53550C48288J428J531J207J120J867K992L323K629K071K550L484L934M051M446
53536C84921M838M578M042M247N274O234O758P376Q356R180R486R615J0033J0778
53522D85716J1687J2503J2824J2617J2693J3891J5822J7302J7968J8547J9519
53511F51089K0581K1568K2816K4229K5051K5019K4858K5144K5490K5307K4571
53500I15723K3356K1554J9564J8426J8512J8824J8353J7412J6901J6854J6725
$$ plain form
53598 391497 393497 395669 397620 398580 398233 397157 396206 395587 394815 393490 391776 390095 388594 387063 385294
53583 385294 383400 381679 380157 378361 375798 372685 369933 368266 367536 367066 366474 365946 365782 365946 366100 365937
53567 365937 365428 364739 363971 363040 361898 360755 359973 359717 359762 359579 358541 356284 353125 350053 348073 347567 348288
53550 348288 349716 351247 352454 353574 355441 358433 361756 364385 366456 369006 372490 376424 380475 384921
53536 384921 389759 394337 398379 402626 407900 414134 420892 428268 436624 445804 455290 464905 474938 485716
53522 485716 497403 509906 522730 535347 548040 561931 577753 595055 613023 631570 651089
53511 651089 671670 693238 716054 740283 765334 790353 815211 840355 865845 891152 915723
53500 915723 939079 960633 980197 998623 1017135 1035959 1054312 1071724 1088625 1105479 1122204
53489A122204J6529J6738J7257J7498J7387J7438J7815J8022J7677J7014J6465
53478A312044J6163J5898J5241J3683J1057P925N199L311J917L57j784m544p624
53465A388843j0427j2384j3397j3945j4582j5419j6160j6571j6739j6852j6925
53454A225442j6998j7495j8903k0953k2498k2540k1265j9674j8501j7819j7480
53443A011316j7341j7065j6185j4479j2100r360o647m441l003k105j307m28M71
53430I07326J386K347L344M512O065P735Q783R072R561J0986J2711J3756J4494
53417A012078J6075J8455K0365K1242K1893K2981K4183K5250K6718K8873L1007
53406A269120L2404L3278L4226L5468L7133L9469M2151M4183M5232M6315M8443
$$ plain form
53489 1122204 1138733 1155471 1172728 1190226 1207613 1225051 1242866 1260888 1278565 1295579 1312044
53478 1312044 1328207 1344105 1359346 1373029 1384086 1392011 1397210 1400521 1402438 1402795 1401011 1396467 1388843
53465 1388843 1378416 1366032 1352635 1338690 1324108 1308689 1292529 1275958 1259219 1242367 1225442
53454 1225442 1208444 1190949 1172046 1151093 1128595 1106055 1084790 1065116 1046615 1028796 1011316
53443 1011316 993975 976910 960725 946246 934146 924786 918139 913698 910695 908590 907283 906855 907326
53430 907326 908712 911059 914403 918915 924980 932715 941498 950570 960131 971117 983828 997584 1012078
53417 1012078 1028153 1046608 1066973 1088215 1110108 1133089 1157272 1182522 1209240 1238113 1269120
53406 1269120 1301524 1334802 1369028 1404496 1441629 1481098 1523249 1567432 1612664 1658979 1707422
53395A707422N1187N3366N4553N5151N5382N5182N4792N4614N4522N3910N2469
53384B302550N0441M8218M6038M4018M2103M0041L7558L4473L0574K5727K0159
53373B721900J4381Q737L339j653o245j1023j6668k2995k9143l4762m0187m5332
53361B540349m9484n2490n5094n7528n8881n8541n7337n6324n5346n3755n1812
53350A933757n0174m8558m6187m3333m1274m0656m0746m0498l9571l8247l6824
53339A467689l5318l3496l1170k8531k6033k3823k1717j9716j8038j6415j4176
53328A199256j1374r080q033p856q101r115j1009j2626j2684j1411j0002q894
53316A079071p708o452n579m970l962k390p10Q44K405L786M570M908N462O466
$$ plain form
53395 1707422 1758609 1811975 1866528 1921679 1977061 2032243 2087035 2141649 2196171 2250081 2302550
53384 2302550 2352991 2401209 2447247 2491265 2533368 2573409 2610967 2645440 2676014 2701741 2721900
53373 2721900 2736281 2745018 2748357 2746704 2740459 2729436 2712768 2689773 2660630 2625868 2585681 2540349
53361 2540349 2490865 2438375 2383281 2325753 2266872 2208331 2150994 2094670 2039324 1985569 1933757
53350 1933757 1883583 1835025 1788838 1745505 1704231 1663575 1622829 1582331 1542760 1504513 1467689
53339 1467689 1432371 1398875 1367705 1339174 1313141 1289318 1267601 1247885 1229847 1213432 1199256
53328 1199256 1187882 1178802 1170769 1162913 1154812 1145697 1134688 1122062 1109378 1097967 1087965 1079071
53316 1079071 1071363 1064911 1059332 1054362 1050400 1048010 1047300 1048144 1050549 1054335 1058905 1063813 1069275 1075741
53302A075741P527Q462R620J1326J3461J5700J7744J9406K0873K2652K4825K6675
53290A274012K7558K7802K8058K8166K7459K5897K4055K2224K0304J8404J6676
53279A540615J4695J1908Q563N351K289j178m996q403j1076j3496j6071j8651
53267A509550k0954k2799k3948k4493k5252k6855k8527k8944k8325k8400k9955
53256A221098l1622l1734l0443k9213k8897k9053k8773k7608k5972k4952k5367
53245I07464k6732k7519k6709k4721k2662k1159k0148j9339j8484j7498j6468
53234F66025j5473j4361j2984j1491j0046q488o808n640n497n785n519m943n308
53221E53682o907q470q958q869r159r796j0119r971r653r258q750q346q176p864
$$ plain form
53302 1075741 1083268 1091730 1101350 1112676 1126137 1141837 1159581 1178987 1199860 1222512 1247337 1274012
53290 1274012 1301570 1329372 1357430 1385596 1413055 1438952 1463007 1485231 1505535 1523939 1540615
53279 1540615 1555310 1567218 1575781 1581132 1583421 1582243 1577247 1568844 1557768 1544272 1528201 1509550
53267 1509550 1488596 1465797 1441849 1417356 1392104 1365249 1336722 1307778 1279453 1251053 1221098
53256 1221098 1189476 1157742 1127299 1098086 1069189 1040136 1011363 983755 957783 932831 907464
53245 907464 880732 853213 826504 801783 779121 757962 737814 718475 699991 682493 666025
53234 666025 650552 636191 623207 611716 601670 593182 586374 580734 575237 569452 563933 558990 553682
53221 553682 546775 538305 529347 520478 511319 501523 491404 481433 471780 462522 453772 445426 437250 429386
53207D29386o985n747m799m567n046n978o902p423p693q220q976r157q267o910
53193C32716o009n639n241m681m449m882n611n962n563m587l549k820k356k002
53179B69365j935k441l177l299k499j492j114j361j701j921k183k460k440j977
53165B39365j285o70k44O3L23M54K70k17o39o74m90m81o49o55m29k89l39k62J33
53146B33285N60O54L95rl49m84m51m88o65n65J15Q69R58O20Q25J706K212J655
53128B40843O62R7j08l70m31J52J030J448J357J369J745K092K005J455O87J20
53112B54153J73P57J133P50J6l03j53j64o26j200j586j810j852j499q24l14k88
53095B46363n14o14n14l74k39p0M7j03o43j450k214k664k784k748k614k140j066
$$ plain form
53207 429386 422401 416654 411855 407288 402242 396264 389362 381939 374246 366026 357050 347893 339626 332716
53193 332716 326707 321068 315827 311146 306697 301815 296204 290242 284679 280092 276543 273723 271367 269365
53179 269365 267430 264989 261812 258513 256014 254522 253408 252047 250346 248425 246242 243782 241342 239365
53165 239365 238080 237410 237166 237229 237552 238006 238276 238059 237420 236746 236256 235775 235126 234471 234042 233753 233414 233152 233285
53146 233285 233845 234499 234894 234885 234536 234052 233601 233113 232448 231883 231998 232867 233825 234445 235270 236976 239188 240843
53128 240843 241505 241602 241494 241124 240693 240845 241875 243323 244680 246049 247794 249886 251891 253346 254033 254153
53112 254153 254326 255083 256216 256966 256982 256679 256526 256362 255736 254536 252950 251140 249288 247789 246965 246651 246363
53095 246363 245849 245235 244721 244347 244108 244038 244085 243982 243339 241889 239675 237011 234227 231479 228865 226725 225659
53078B25659M46J723K041J231j22j149j394j090p11n17n68r44j552j896j531o83
53062B18943o8l9k83l81k34Q7M81O63L33l54q77r79q97p71l47N06J360J619J146
53043B19908L09l73n38k47K7o6k38MM88N61J28k00j65k78q39j335j249q26m82
53024B14589j13M31P98P48P30J100J293O97j28j29O17R62M34j94j98J02M6l77
53006B21408o93n97p9O84J260J177M62k45m18j48K21N93R51J021O17J13J34P33
52988B27194J244J103N02M4l9O1K95Q96J774K225J685N55k16k78p8J04N84J461
52970B39116K032J637O74J59L70O03L58J00N59J578K201J803P56j19n14q10j385
52953B49118k094k495k423k113j905j929k034j850j145k21K05j65p50p79l30j55
$$ plain form
53078 225659 226105 227828 229869 231100 230978 229829 228435 227345 226634 226117 225549 224605 223053 221157 219626 218943
53062 218943 218875 218836 218553 218172 217938 218025 218506 219169 219502 219148 218271 217292 216395 215624 215277 215783 217143 218762 219908
53043 219908 220217 219844 219306 219059 219086 219020 218782 218786 219274 219835 219963 219763 219598 219320 218481 217146 215897 215071 214589
53024 214589 214476 214907 215705 216453 217183 218283 219576 220273 220145 220016 220633 221595 222029 221835 221637 221739 221785 221408
53006 221408 220715 220118 220039 220723 221983 223160 223622 223377 222959 222811 223032 223625 224576 225597 226214 226327 226461 227194
52988 227194 228438 229541 230043 230087 230048 230109 230404 231300 233074 235299 236984 237539 237323 237045 236967 237071 237655 239116
52970 239116 241148 242785 243459 243618 243988 244591 244949 245049 245608 247186 249387 251190 251946 251827 251313 250503 249118
52953 249118 247024 244529 242106 239993 238088 236159 234125 232275 231130 230909 231114 230949 230199 229420 229090 228935
52937B28935n96j147j179o82j19J78K71M60Q86J273J155M88k31o20p99q47l95
52920B27031O12J360J131M25K20M10J51n31p42m06m80j180j448p42k7j70n32j82
52902B24900M87N23M7q9K27M09L07K97M38M87N46Q72J195J022N03K38L88O00P07
52883B34104P62N74m2o31m36N60J580J976J745J181O06M14Q83J805K661L106L056
52866B53904K520J720J085P34K30o94j564j771j507j438j695j856j773j788k164
52851B43943k786l415l797l721l277k834k493j893r74l41l62m08J97R90R55N2
52835B19836p53q61n67l20j77m3J64N65J107J433J377J242J143N66o77j656j347
52818B21032r0Q34Q03J79n25q27j02J629L055K945J867J290J254M89j248k587
$$ plain form
52937 228935 228339 227192 226013 225331 225212 225390 225661 226121 227007 228280 229435 229923 229692 229072 228273 227426 227031
52920 227031 227643 229003 230134 230559 230779 231189 231340 230809 230067 229661 229181 228001 226553 225811 225784 225614 225082 224900
52902 224900 225387 225910 225957 225868 226095 226504 226811 227108 227546 228033 228579 229451 230646 231668 232171 232409 232797 233397 234104
52883 234104 234866 235440 235398 234767 234331 234891 236471 238447 240192 241373 241979 242393 243276 245081 247742 250848 253904
52866 253904 256424 258144 259229 259963 260193 259499 257935 256164 254657 253219 251524 249668 247895 246107 243943
52851 243943 241157 237742 233945 230224 226947 224113 221620 219727 218753 218412 218050 217642 217839 218829 219784 219836
52835 219836 219083 218222 217655 217335 217158 217115 217279 217844 218951 220384 221761 223003 224146 224712 224035 222379 221032
52818 221032 220942 221776 222579 222758 222233 221406 221304 222933 225988 228933 230800 232090 233344 233833 232585 229998
52802B29998k608j954j442j019o39q15j543j886j390r15j236j797j682j003m77
52787B09592k72j09P2K04M20O93P20N15N63R36J008M90rJ7J99J38J82O28Q90L46
52767B17223n66j006r16p97p43n68m46o12p32l61K65O10O99Q43Q68M56lK26J077
52748B15517J731J839J884K220K482K190J503R33O70M66J23j04K16J001J456R99
52732B35126J22j12N20J153J127P09L27j82r94j700j887j763j662j436r81p62
52716B27605j043j155l85P38R99J49q32j116q42n43m23m10l63j07L66P37P54O11
52698B24740O20O65L69k37o70n30J64J045J470R71j12p44l66M00O57L93J88L02
52680B29325N80R38J183Q47j07q12n77j9j62q20r40l72L4L0L73J377K285K458
$$ plain form
52802 229998 227390 225436 223994 222975 222336 221521 219978 218092 216702 215787 214551 212754 211072 210069 209592
52787 209592 209320 209211 209283 209487 209907 210600 211320 211835 212398 213334 214342 214832 214823 214840 215039 215177 215359 215987 216877 217223
52767 217223 216657 215651 214735 213938 213195 212627 212181 211569 210837 210476 210741 211351 212050 212893 213761 214217 214214 214440 215517
52748 215517 217248 219087 220971 223191 225673 227863 229366 230299 230969 231435 231558 231454 231670 232671 234127 235126
52732 235126 235248 235136 235656 236809 237936 238645 238972 238790 237796 236096 234209 232446 230784 229348 228367 227605
52716 227605 226562 225407 225022 225760 226759 226908 226076 224960 224118 223575 223152 222742 222379 222272 222638 223375 224129 224740
52698 224740 225360 226025 226394 226157 225487 224957 225121 226166 227636 228607 228495 227751 227385 227785 228442 228835 229023 229325
52680 229325 229905 230843 232026 232873 232766 231954 231377 231358 231196 230376 229436 229064 229098 229128 229501 230878 233163 235621
52662B35621K130J563N89m93n94O56K040K266J741J824K740L306K584R51o17j610
52646B54697k101k327k409k310j976j548j348j497j703j581j061l82J87N12N74
52631B35727M45K29L5J30Q38J977K602J909L97n57m33j06l88p95l90P42J695K018
52613B46075K016J923J571Q82L0q79j780k313k068j235m60J9M94J048J283J033
52597B47639O94N29K87j25j96L34P16R0j094j422l10J308K207K141J619J008L59
52580B55784k46o22o76m51r0J29k1l76n18m03m03n55l35L69O98r2j376j874j390
52561B47552r14j030j268j167r14n75K76J493J799L70j672k393j414j11L47J92
52545B40571J58M48R46J609K178K050J030k04q64r27q25n85M6Q37J096N98%O1
$$ plain form
52662 235621 237751 239314 239903 239410 238816 239472 241512 243778 245519 247343 250083 253389 255973 256924 256307 254697
52646 254697 252596 250269 247860 245550 243574 242026 240678 239181 237478 235897 234836 234454 234641 235153 235727
52631 235727 236172 236401 236436 236566 237404 239381 241983 243892 244289 243732 243299 243193 242805 242010 241620 242362 244057 246075
52613 246075 248091 250014 251585 252467 252497 251618 249838 247525 245457 244222 243762 243781 244275 245323 246606 247639
52597 247639 248333 248862 249149 249024 248828 249162 249878 249968 248874 247452 247142 248450 250657 252798 254417 255425 255784
52580 255784 255538 254916 254240 253789 253699 253828 253807 253431 252913 252510 252107 251552 251217 251586 252284 252192 250816 248942 247552
52561 247552 246638 245608 244340 243173 242259 241684 241960 243453 245252 245622 243950 241557 240143 240032 240379 240571
52545 240571 240729 241177 242123 243732 245910 247960 248990 248786 247922 246995 246170 245585 245631 246468 247564 248162 248162 248223
52527B48223P17J207R80K91j00K36R33J223Q19K36J20M82Q94J167J399J402Q01
52510B61030r8j98J077K824L686L455K956K575J913Q76Qn48j457k925l978l751
52494B67445k797k204j990j420m99k6k51n93p10q44r83p17j08K03O0J3K63L11
52476B55153P0K74J180J868J551Q10O76J166J568J627J502J113M44J07O58J631
52460B71398K193K366K705L010K536J326K04o03j709l207m172l951l061k252j545
52445B65238p77l98r28k047k872k960k563k081j659j215o04J75P82Q13M13K72
52429B49589P88J510J718J272O26K02L1j10m06p41o89N3J137J852K001K087K513
52412B63433L065L493M070N045O078O842P825R617J1481J1558Q819M197n36m376
$$ plain form
52527 248223 248940 250147 251127 251418 251318 251554 252487 253710 254529 254765 254885 255367 256261 257428 258827 260229 261030
52510 261030 260932 260734 261811 264635 268321 271776 274732 277307 279220 280096 280104 279556 278099 275174 271196 267445
52494 267445 264648 262444 260454 259034 258535 258509 258258 257665 256955 256111 255128 254411 254303 254506 254566 254579 254842 255153
52476 255153 255223 255497 256677 258545 260096 260906 261582 262748 264316 265943 267445 268558 269002 269109 269767 271398
52460 271398 273591 275957 278662 281672 284208 285534 285738 285135 283426 280219 276047 272096 269035 266783 265238
52445 265238 264461 264063 263135 261088 258216 255256 252693 250612 248953 247738 247134 247309 248091 248904 249317 249589
52429 249589 250377 251887 253605 254877 255503 255705 255736 255626 255220 254479 253790 253843 254980 256832 258833 260920 263433
52412 263433 266498 269991 274061 279106 285184 292026 299851 309468 320949 332507 341326 345523 344987 340611
52398C40611p093q429q184p002o079n840n506m370k932k229k360k368j529j89
52384B76501Q34J207J140Q76N19K82M61J191K213K951K880K009J079J033K089
52369B97265L580M753N432N697N335M114K396R62K05j42m23o74q68j168j588j732
52353C23144j121K41J694K412K047J120O66J242K246K547J862J169J406K233K577
52338C45485K292K510M063O162P316P231P048P685Q754R445R802J0450J1523J2577
52324D52343J3431J4325J5294J6040J6573J7271J8097J8347J7533J6104J4876
52313F30234J4205J3983J4055J4246J4278J4085J3893J3831J3627J3075J2401
52302G81913J1871J1398J0813J0160R393Q181O489M927L961L160J770k62k456
$$ plain form
52398 340611 333518 325089 316905 309903 303824 297984 292478 288108 285176 282947 280587 278219 276690 276501
52384 276501 277335 278542 279682 280558 281077 281359 281820 283011 285224 288175 291055 293064 294143 295176 297265
52369 297265 300845 305598 311030 316727 322062 326176 328572 329534 329739 329597 329174 328500 327632 326464 324876 323144
52353 323144 322023 322264 323958 326370 328417 329537 330203 331445 333691 336238 338100 339269 340675 342908 345485
52338 345485 347777 350287 354350 360512 367828 375059 382107 389792 398546 407991 417793 428243 439766 452343
52324 452343 465774 480099 495393 511433 528006 545277 563374 581721 599254 615358 630234
52313 630234 644439 658422 672477 686723 701001 715086 728979 742810 756437 769512 781913
52302 781913 793784 805182 815995 826155 835548 843729 850218 855145 859106 862266 864036 863774 861318
52289H61318m675p089r360j0695j0791j0149r327q348p025n449l923k617j371
52276G70499K13K367M706O396P058P165P317P581P880Q491R503J0216R970R294
52262H68656R346J0307J1239J1555J1679J1999J2104J1543J0647J0021R641Q935
52250I97672P538N587L484J517l76k587n300q023r965j0953j1552j2312j3269
52237I41461j4208j4970j5365j5220j4634j3957j3377j2839j2249j1525j0480
52226G92637r146q049p670p640p061n631l934k623j867j634j804j862j184J66
52212G32698J414K060K363K696L041L334L654L832L428K454J622J532J970K323
52198G68421K288J999J804K109K959L748L802L281K997L268L618L701L662L430
$$ plain form
52289 861318 856643 849554 840194 829499 818708 808559 799232 790884 783859 778410 774487 771870 770499
52276 770499 770712 773079 777785 784181 791239 798404 805721 813302 821182 829673 839176 849392 859362 868656
52262 868656 878002 888309 899548 911103 922782 934781 946885 958428 969075 979096 988737 997672
52250 997672 1005210 1010797 1014281 1015798 1015422 1012835 1007535 999512 989547 978594 967042 954730 941461
52237 941461 927253 912283 896918 881698 867064 853107 839730 826891 814642 803117 792637
52226 792637 783491 775442 767772 760132 753071 747440 743506 740883 739016 737382 735578 733716 732532 732698
52212 732698 734112 736172 738535 741231 744272 747606 751260 755092 758520 760974 762596 764128 766098 768421
52198 768421 770709 772708 774512 776621 779580 783328 787130 790411 793408 796676 800294 803995 807657 811087
52184H11087K491P76j047k525l952n533o835p525p847p872p094n479m008l410
52170G51227l098k260j320j190j657j593n59Q54K113L173L971M336M395M349L978
52155G66719L082K233K191K724K853K311J771J582J329Q82R67K068L481M108L680
52140H01981K713J658O54n0o9O71J768K745L506M333N578P395R755J2524J5399
52125H70561J7900J9715K1099K2608K4364K5875K6760K7219K7518K7419K6530
52114A137568K4909K2958K0914J8893J7104J5558J3745J1166Q084N330L375J983
52102A301587P79k91j118j760k525l781n545p215q072q312r157j1512j4827j7737
52088A210514j9517k0395k0672k0227j8886j6739j4114j1506r377p660n753l395
$$ plain form
52184 811087 813578 814354 813307 810782 806830 801297 794462 786937 779090 771218 764124 758645 754637 751227
52170 751227 748129 745869 744549 743359 741702 740109 739550 740404 742517 745690 749661 753997 758392 762741 766719
52155 766719 769801 772034 774225 776949 779802 782113 783884 785466 786795 787677 788644 790712 794193 798301 801981
52140 801981 804694 806352 807006 806956 806887 807558 809326 812071 815577 819910 825488 832883 842638 855162 870561
52125 870561 888461 908176 929275 951883 976247 1002122 1028882 1056101 1083619 1111038 1137568
52114 1137568 1162477 1185435 1206349 1225242 1242346 1257904 1271649 1282815 1290899 1296229 1299604 1301587
52102 1301587 1302366 1302075 1300957 1299197 1296672 1292891 1287346 1280131 1272059 1263747 1254590 1243078 1228251 1210514
52088 1210514 1190997 1170602 1149930 1129703 1110817 1094078 1079964 1068458 1059081 1051421 1045668 1042273
52076A042273j258o6N51J613L439N521P555R706J1756J2975J3164J3090J3469
52063A133788J4095J4327J3943J3175J2276J1395J0639J0002R427Q953Q484P469
52051A267973N316K260o95k871m611o679r402j2494j5347j7338j8248j8526j8783
$$ plain form
52076 1042273 1041015 1040949 1041500 1043113 1046552 1052073 1059628 1069334 1081090 1094065 1107229 1120319 1133788
52063 1133788 1147883 1162210 1176153 1189328 1201604 1212999 1223638 1233640 1243067 1252020 1260504 1267973
52051 1267973 1273289 1275549 1274854 1271983 1267372 1260693 1251291 1238797 1223450 1206112 1187864 1169338 1150555
$$ [...]