
##TITLE=UV1109_M2_1290-1353_7185017_J2KtF1rInP
##JCAMPDX= 6.0         $$ Bruker NMR JCAMP-DX V2.0
##DATA TYPE= NMR SPECTRUM
##DATA CLASS= NTUPLES
##ORIGIN= BRUKER
##OWNER= Administrator
$$ 1.72 TOPSPIN		Version 2.1
$$ 2012-12-05 19:51:18.126 -0500  Administrator@X
$$ Compression mode = diff/dup
##.OBSERVE FREQUENCY= 400.02188249412
##.OBSERVE NUCLEUS= ^1H
##.ACQUISITION MODE= SIMULTANEOUS (DQD)
##.ACQUISITION SCHEME= undefined
##.AVERAGES= 64
##.DIGITISER RES= 22
##SPECTROMETER/DATA SYSTEM= spect
##.PULSE SEQUENCE= noesygpps1d.comp
##.SOLVENT NAME= COFFEE_meoh
##.SHIFT REFERENCE= INTERNAL, COFFEE_meoh, 1, 14.96117
##AUDIT TRAIL= $$ (NUMBER, WHEN, WHO, WHERE, PROCESS, VERSION, WHAT)
$$ ##TITLE= Audit trail, TOPSPIN		Version 2.1
$$ ##JCAMPDX= 5.01
$$ ##ORIGIN= Bruker BioSpin GmbH
$$ ##OWNER= Administrator
$$ $$ E:\/data/COFFEE/nmr/UV1109_M2_1290-1353_7185017_J2KtF1rInP/12/pdata/1/auditp.txt
$$ ##AUDIT TRAIL=  $$ (NUMBER, WHEN, WHO, WHERE, PROCESS, VERSION, WHAT)
(   1,<2012-12-05 19:51:12.157 -0500>,<Administrator>,<X>,<go>,<TOPSPIN 2.1>,
      <created by zg
	started at 2012-12-05 19:39:40.726 -0500,
	POWCHK enabled, PULCHK disabled,
       configuration hash MD5:
       86 BA 57 50 F2 9D 5C 9B 26 00 A9 28 5F 66 2E 89
       data hash MD5: 64K
       A1 B0 84 C2 FE A9 6C 69 98 25 41 EA 52 A9 33 C2>)
(   2,<2012-12-05 19:51:15.360 -0500>,<Administrator>,<X>,<proc1d>,<TOPSPIN 2.1>,
      <Start of raw data processing
       efp LB = 0.3 FT_mod = 6 PKNL = 1 PHC0 = 0 PHC1 = 0 SI = 128K 
       data hash MD5: 128K
       6E D3 72 ED 30 7B B2 68 F8 29 0E 80 E4 3D 3B BF>)
(   3,<2012-12-05 19:51:16.423 -0500>,<Administrator>,<X>,<proc1d>,<TOPSPIN 2.1>,
      <pk PHC0 = -76.51978 PHC1 = 0 
       data hash MD5: 128K
       60 E5 60 8B 73 20 EC 05 B9 D1 05 B7 62 AC 21 13>)
(   4,<2012-12-05 19:51:17.048 -0500>,<Administrator>,<X>,<proc1d>,<TOPSPIN 2.1>,
      <abs ABSG = 1 
       data hash MD5: 128K
       90 92 22 3A 7A AD DD A5 3C FE 6A E0 14 14 08 7C>)
(   5,<2012-12-05 19:51:17.235 -0500>,<Administrator>,<X>,<proc1d>,<TOPSPIN 2.1>,
      <abs ABSG = 2 
       data hash MD5: 128K
       3B 16 A9 0A F1 2D 5E 93 57 DC A3 83 C0 33 2A 8A>)
(   6,<2012-12-05 19:51:17.407 -0500>,<Administrator>,<X>,<proc1d>,<TOPSPIN 2.1>,
      <abs ABSG = 3 
       data hash MD5: 128K
       63 A5 BF 58 60 2B 42 05 7A F6 CF CF A5 36 1B 06>)
(   7,<2012-12-05 19:51:17.610 -0500>,<Administrator>,<X>,<proc1d>,<TOPSPIN 2.1>,
      <abs ABSG = 4 
       data hash MD5: 128K
       71 B8 C3 A9 AB 82 CF 20 BC BC D5 96 47 C9 4A 3B>)
(   8,<2012-12-05 19:51:17.782 -0500>,<Administrator>,<X>,<proc1d>,<TOPSPIN 2.1>,
      <abs ABSG = 5 
       data hash MD5: 128K
       F7 14 FC 9B 77 55 3C A1 69 64 24 A5 19 11 BE EB>)
$$ ##END=
$$ 
$$ $$ hash MD5
$$ $$ 7D 99 A6 70 6B 64 D1 8E 15 B0 B9 91 B6 F4 8C 45
##$RELAX= 
##$RELAX= 
##$RELAX= 
##$RELAX= 
##$RELAX= 
##$RELAX= 
##$RELAX= 
##$RELAX= 
$$ Bruker specific parameters
$$ --------------------------
##$DU= <E:\>
##$EXPNO= 12
$$ [...]
##$TP07= 0
##$TPNAME0= <>
##$TPNAME1= <>
##$TPNAME2= <>
##$TPNAME3= <>
##$TPNAME4= <>
##$TPNAME5= <>
##$TPNAME6= <>
##$TPNAME7= <>
##$TPOAL= (0..7)
0.5 0.5 0.5 0.5 0.5 0.5 0.5 0.5
##$TPOFFS= (0..7)
0 0 0 0 0 0 0 0
##$TUNHIN= 0
##$TUNHOUT= 0
##$TUNXOUT= 0
##$USERA1= <user>
##$USERA2= <user>
##$USERA3= <user>
##$USERA4= <user>
##$USERA5= <user>
##$V9= 5
##$VALIST= <valist>
##$VCLIST= <CCCCCCCCCCCCCCC>
##$VD= 0
##$VDLIST= <DDDDDDDDDDDDDDD>
##$VPLIST= <PPPPPPPPPPPPPPP>
##$VTLIST= <TTTTTTTTTTTTTTT>
##$WBST= 1024
##$WBSW= 4
##$XGAIN= (0..3)
0 0 0 0
##$XL= 0
##$YL= 0
##$YMAX_a= 6056921
##$YMIN_a= -11254178
##$ZGOPTNS= <>
##$ZL1= 120
##$ZL2= 120
##$ZL3= 120
##$ZL4= 120
##$ABSF1= 14.96117
##$ABSF2= -5.597012
##$ABSG= 5
##$ABSL= 3
##$ALPHA= 0
##$AQORDER= 0
##$ASSFAC= 0
##$ASSFACI= 0
##$ASSFACX= 0
##$ASSWID= 0
##$AUNMP= <proc_prof1d_extract.lims>
##$AXLEFT= 0
##$AXNAME= <>
##$AXNUC= <1H>
##$AXRIGHT= 0
##$AXTYPE= 0
##$AXUNIT= <>
##$AZFE= 0.1
##$AZFW= 0.1
##$BCFW= 0
##$BC_mod= 0
##$BYTORDP= 0
##$COROFFS= 0
##$CY= 15
##$DATMOD= 1
##$DC= 0
##$DFILT= <>
##$DTYPP= 0
##$F1P= 0
##$F2P= 0
##$FCOR= 0.5
##$FTSIZE= 131072
##$FT_mod= 6
##$GAMMA= 0
##$GB= 0
##$INTBC= 1
##$INTSCL= 1
##$ISEN= 128
##$LB= 0.3
##$LEV0= 0
##$LPBIN= 0
##$MAXI= 10000
##$MC2= 0
##$MEAN= 0
##$ME_mod= 0
##$MI= 0
##$NCOEF= 0
##$NC_proc= -2
##$NLEV= 6
##$NOISF1= 0
##$NOISF2= 0
##$NSP= 0
##$NTH_PI= 0
##$NZP= 0
##$OFFSET= 14.96117
##$PC= 1
##$PHC0= -76.51978
##$PHC1= 0
##$PH_mod= 1
##$PKNL= yes
##$PPARMOD= 0
##$PPDIAG= 0
##$PPIPTYP= 0
##$PPMPNUM= 2147483647
##$PPRESOL= 1
##$PSCAL= 4
##$PSIGN= 0
##$PYNMP= <proc.py>
##$REVERSE= no
##$SF= 400.02000956713
##$SI= 131072
##$SIGF1= 0
##$SIGF2= 0
##$SINO= 400
##$SIOLD= 131072
##$SPECTYP= <>
##$SREGLST= <1H.CDCl3>
##$SSB= 0
##$STSI= 131072
##$STSR= 0
##$SW_p= 8223.68421052631
##$SYMM= 0
##$S_DEV= 0
##$TDeff= 65536
##$TDoff= 0
##$TI= <>
##$TILT= no
##$TM1= 0
##$TM2= 0
##$TOPLEV= 0
##$USERP1= <user>
##$USERP2= <user>
##$USERP3= <user>
##$USERP4= <user>
##$USERP5= <user>
##$WDW= 1
##$XDIM= 131072
##$YMAX_p= 412877621
##$YMIN_p= -36363105
##$CURPLOT= <Network HP LaserJet P1505>
##$CURPRIN= <$Network HP LaserJet P1505>
##$DFORMAT= <normdp>
##$LAYOUT= <+/1D_H.xwp>
##$LFORMAT= <normlp>
##$PFORMAT= <normpl>
##$SURQMSG= 1
$$ End of Bruker specific parameters
$$ ---------------------------------
##NTUPLES= NMR SPECTRUM
##VAR_NAME=  FREQUENCY,     SPECTRUM/REAL,   SPECTRUM/IMAG
##SYMBOL=    X,             R,               I
##VAR_TYPE=  INDEPENDENT,   DEPENDENT,       DEPENDENT
##VAR_FORM=  AFFN,          ASDF,            ASDF
##VAR_DIM=   131072,        131072,          131072
##UNITS=     HZ,            ARBITRARY UNITS, ARBITRARY UNITS
##FACTOR=    0.0627417313425164, 1,          1
##FIRST=     8223.62146879497, -1285,        -50810
##LAST=      0,             -246,            -51276
##MIN=       0,             -36363105,       0
##MAX=       8223.62146879497, 412877621,    0
$$ Real data points
##PAGE= N=1
##DATA TABLE= (X++(R..R)), XYDATA
$$ [...]
$$ plain form
63942 1502370 1643176 1798701 1968628 2151844 2345882 2547643 2754674 2965160 3176553
63933 3176553 3384768 3584920 3772327 3942538 4090999 4213371 4306240 4367379 4395659 4391053
63923 4391053 4354496 4287281 4190595 4065891 3915695 3743902 3555335 3355148 3148356 2939488
63913 2939488 2732404 2530320 2335840 2150959 1977324 1816624 1670438 1539416 1422829
63904 1422829 1319290 1227802 1147881 1078860 1019498 968337 924192 886217 853712 825868 801576
63893 801576 779540 758784 739029 720452 703066 686504 670340 654464 639046 624241 609970
63882 609970 596096 582939 571508 562861 557105 553348 550845 549872 551242 555325 561949 570934 582214
63869 582214 595528 610495 626974 644922 663992 683715 704047 725200 746871 768159 788467
$$ packed form
63942A502370J40806J55525J69927J83216J94038K01761K07031K10486K11393
63933C176553K08215K00152J87407J70211J48461J22372R2869O1139K8280m606
63923D391053l6557o7215r6686j24704j50196j71793j88567k00187k06792k08868
63913B939488k07084k02084j94480j84881j73635j60700j46186j31022j16587
63904A422829j03539r1488p9921o9021n9362n1161m4145l7975l2505k7844k4292
63893H01576k2036k0756j9755j8577j7386j6562j6164j5876j5418j4805j4271
63882F09970j3874j3157j1431q647n756l757k503r73J370M083O624Q985J1280
63869E82214J3314J4967J6479J7948J9070J9723K0332K1153K1671K1288K0308
$$ plain form
63858 788467 808024 827266 845984 863335 878421 890661 899862 906168 909761 910492 907970 902146 893538
63845 893538 882728 869891 854975 838030 819043 797702 773718 747352 719340 690332 660759
63834 660759 631279 602924 576449 551618 527528 503714 480722 459369 439733 421195 403369
63823 403369 386474 370797 356375 343454 332568 323656 315587 307317 299207 292442 287321 282987 278827
63810 278827 275188 272451 270231 267976 265717 263730 262003 260544 259701 259575 259453 258425 256366 253843 251294
63795 251294 248839 246590 244507 242056 238688 234750 231356 229181 227788 226312 224404 222325 220441 218922
63781 218922 217704 216508 214998 213099 211155 209626 208678 208145 207873 207914 208311 208766 208776 208190 207464 207157 207299
63764 207299 207445 207227 206561 205480 204235 203488 203803 204787 205293 204783 203938 203579 203519 203058 202159 201415 201074 200870
$$ packed form
63858G88467J9557J9242J8718J7351J5086J2240R201O306L593P31k522n824q608
63845H93538j0810j2837j4916j6945j8987k1341k3984k6366k8012k9008k9573
63834F60759k9480k8355k6475k4831k4090k3814k2992k1353j9636j8538j7826
63823D03369j6895j5677j4422j2921j0886q912q069q270q110o765n121m334m160
63810B78827l639k737k220k255k259j987j727j459q43j26j22j028k059k523k549
63795B51294k455k249k083k451l368l938l394k175j393j476j908k079j884j519
63781B18922j218j196j510j899j944j529r48n33k72M1L97M55J0n86p26l07J42
63764B07299J46k18o66j081j245p47L15R84N06n10q45l59o0m61q99p44l41k04
$$ plain form
63746 200870 200834 201567 203467 206137 208796 211006 212834 214570 216457 218526 220640 222715 224835 227002 228914
63731 228914 230247 231057 231617 232015 232252 232645 233742 235790 238626 242045 245926 250014 253996 257849 261757
63716 261757 265600 268938 271613 273956 276116 277517 277287 275092 271411 267178 263341 260524 258776 257651
63702 257651 256626 255476 254298 253392 253160 253874 255361 257018 258267 258985 259514 260412 262180 264949 268332 271675
63686 271675 274570 277021 279259 281641 284620 288389 292367 295437 296907 297042 296488 295550 294325 293133 292281
63671 292281 291540 290436 289146 288646 289720 292081 294659 296577 297700 298447 299297 300350 301069 300510 298055 293999
63655 293999 289283 284616 280052 275444 270964 266944 263410 260069 256732 253516 250701 248602 247497 247387
63641 247387 247878 248617 249817 251936 254797 257539 259640 261536 263910 266808 269873 273101 276849 281265 286191
$$ packed form
63746B00870l6P33J900K670K659K210J828J736J887K069K114K075K120K167J912
63731B28914J333Q10N60L98K37L93J097K048K836L419L881M088L982L853L908
63716B61757L843L338K675K343K160J401k30k195l681m233l837k817j748j125
63702B57651j025j150j178r06k32P14J487J657J249P18N29Q98J768K769L383L343
63686B71675K895K451K238K382K979L769L978L070J470J35n54r38j225j192q52
63671B92281p41j104j290n00J074K361K578J918J123P47Q50J053P19n59k455m056
63655B93999m716m667m564m608m480m020l534l341l337l216k815k099j105j10
63641B47387M91P39J200K119K861K742K101J896K374K898L065L228L748M416M926
$$ plain form
63626 286191 291557 297414 303722 310511 318130 326873 336475 346518 357277 369517 383371 398115 413330
63613 413330 429625 447662 466958 486408 505927 527015 551394 579318 609306 639291 667813
63602 667813 694121 717546 737148 752109 762210 767763 769312 767657 763909 759024 753203 746030 737255
63589 737255 727167 716196 704419 691482 676803 659927 640995 620843 600289 579382 557827
63578 557827 536155 515900 498384 483748 471397 460858 451841 443926 436833 430856 426635 424548 424588
63565 424588 426604 430257 434891 439993 445809 453084 462098 472290 482949 493983 505812 518799 533039
63552 533039 548557 565427 583788 604021 626932 653394 683527 716364 750545 785115 819299
63541 819299 851463 878854 898749 909851 912589 908442 899297 887153 873839 860770 848887 838582
$$ packed form
63626B86191N366N857O308O789P619Q743R602J0043J0759J2240J3854J4744J5215
63613D13330J6295J8037J9296J9450J9519K1088K4379K7924K9988K9985K8522
63602F67813K6308K3425J9602J4961J0101N553J549j655l748m885n821p173q775
63589G37255j0088j0971j1777j2937j4679j6876j8932k0152k0554k0907k1555
63578E57827k1672k0255j7516j4636j2351j0539r017p915p093n977m221k087M0
63565D24588K016L653M634N102N816P275R014J0192J0659J1034J1829J2987J4240
63552E33039J5518J6870J8361K0233K2911K6462L0133L2837L4181L4570L4184
63541H19299L2164K7391J9895J1102K738m147r145j2144j3314j3069j1883j0305
$$ plain form
63529 838582 829494 820683 811341 801187 789867 776281 759112 737930 713387 686487 658190 629599
63517 629599 601748 574943 548821 523241 498736 476000 455470 437484 422212 409150 397227
63506 397227 385844 375382 366392 358726 351854 345623 340190 335493 331254 327370 323977 321286 319582 319057
63492 319057 319337 319473 318867 318000 317819 318508 319257 319226 318371 317334 316784 316933 317580 318517 319818 321628 323875 326429
63474 326429 329397 332766 335876 337905 338990 340123 341615 342356 341103 338000 334283 330918 328068 325496
63460 325496 322861 319859 316564 313474 310899 308688 306937 306372 307389 309195 310783 312451 315493 320482
63446 320482 326664 333048 339339 345785 352823 361047 370951 382595 395954 411457 429542 449769 471152
63433 471152 493451 517373 543215 569910 595573 618371 636729 649608 657240 661207 663430 665421
$$ packed form
63529H38582r088q811r342j0154j1320j3586j7169k1182k4543k6900k8297k8591
63517F29599k7851k6805k6122k5580k4505k2736k0530j7986j5272j3062j1923
63506C97227j1383j0462q990p666o872o231n433m697m239l884l393k691j704n25
63492C19057K80J36o06q67j81O89P49l1q55j037n50J49O47R37J301J810K247K554
63474C26429K968L369L110K029J085J133J492P41j253l103l717l365k850k572
63460C25496k635l002l295l090k575k211j751n65J017J806J588J668L042M989
63446C20482O182O384O291O446P038Q224R904J1644J3359J5503J8085K0227K1383
63433D71152K2299K3922K5842K6695K5663K2798J8358J2879P632L967K223J991
$$ plain form
63421 665421 668744 675474 687390 704766 726431 751079 778226 807917 839699 872032 902797 930372
63409 930372 954027 973162 986640 993441 993853 989421 981733 971779 960443 948839 937705 926843 915343
63396 915343 902069 885902 866098 842667 816083 786613 754453 720639 687095 655434 626165
63385 626165 599315 575139 553764 534717 517485 502235 489448 479114 470837 464511 460388 458519
63373 458519 458508 459765 461814 464623 468875 475598 485121 496608 508964 522005 536428 552958 571963
63360 571963 593634 617912 644297 672209 701579 732671 765316 798616 831410 862740 891917
63349 891917 918385 941484 960097 972718 978338 977344 971345 962132 950996 938814 926223 913499
63337 913499 900503 886875 872167 855857 837428 816541 793073 767117 739110 709891 680518
$$ packed form
63421F65421L323O730J1916J7376K1665K4648K7147K9691L1782L2333L0765K7575
63409I30372K3655J9135J3478O801M12m432p688r954j1336j1604j1134j0862j1500
63396I15343j3274j6167j9804k3431k6584k9470l2160l3814l3544l1661k9269
63385F26165k6850k4176k1375j9047j7232j5250j2787j0334q277o326m123j869
63373D58519j1J257K049K809M252O723R523J1487J2356J3041J4423J6530J9005
63360E71963K1671K4278K6385K7912K9370L1092L2645L3300L2794L1330K9177
63349H91917K6468K3099J8613J2621N620r94n999r213j1136j2182j2591j2724
63337I13499j2996j3628j4708j6310j8429k0887k3468k5956k8007k9219k9373
$$ plain form
63326 680518 652181 626299 604247 586516 572323 560464 550484 542680 537133 533203 529869 525969 520097
63313 520097 510910 497976 482095 464642 446810 429533 413672 399828 388030 377820 368656 360236
63301 360236 352602 346029 340733 336677 333720 331759 330433 328822 326024 322189 318544 316090 314597 313131
63287 313131 311177 308818 306118 303029 299910 297534 296261 295553 294588 293202 291928 291233 290993 290688 289944 288857
63271 288857 287986 288051 289409 291668 293915 295400 295969 295852 295282 294502 293935 294045 294977 296493 298267 300127 302118
63254 302118 304532 307812 312119 316937 321366 324910 327819 330714 334160 338649 344492 351474 358906 366365
63240 366365 374165 382831 392365 402413 412989 424666 438090 453607 471221 490487 510522 530520
63228 530520 550332 570190 589949 609109 627652 646242 665210 683875 701406 718106 735233
$$ packed form
63326F80518k8337k5882k2052j7731j4193j1859r980p804n547l930l334l900n872
63313E20097r187j2934j5881j7453j7832j7277j5861j3844j1798j0210r164q420
63301C60236p634o573n296m056k957j961j326j611k798l835l645k454j493j466
63287C13131j954k359k700l089l119k376j273p08r65j386j274o95k40l05p44j087
63271B88857q71O5J358K259K247J485N69j17n70p80n67J10R32J516J774J860J991
63254C02118K414L280M307M818M429L544K909K895L446M489N843O982P432P459
63240C66365P800Q666R534J0048J0576J1677J3424J5517J7614J9266K0035J9998
63228E30520J9812J9858J9759J9160J8543J8590J8968J8665J7531J6700J7127
$$ plain form
63217 735233 753583 772764 791979 810975 829830 848126 864858 879150 890683 899239 904129 904354
63205 904354 899307 889175 874722 856796 835987 812602 787009 760083 733176 707411 683133 660359
63193 660359 639600 621680 606738 594067 583305 575220 570757 569624 570494 572412 575429 579959 586166
63180 586166 594026 603279 613168 622843 632332 642588 654238 666745 679167 691211 703020 714379
63168 714379 724808 734241 742953 750897 757657 762932 766419 767291 764606 758451 749967 739911 727792 712864
63154 712864 695333 676003 655276 633332 611040 589761 570171 551966 534899 519474 506349
63143 506349 495562 486621 478880 471599 464131 456593 449966 445064 441550 438408 435167 432148 429680 427703
63129 427703 426311 426146 427853 431287 435458 439234 442088 444343 446828 450190 454455 459176 463872 468236
$$ packed form
63217G35233J8350J9181J9215J8996J8855J8296J6732J4292J1533Q556M890K25
63205I04354n047j0132j4453j7926k0809k3385k5593k6926k6907k5765k4278k2774
63193F60359k0759j7920j4942j2671j0762q085m463j133Q70J918L017M530O207
63180E86166P860R253R889R675R489J0256J1650J2507J2422J2044J1809J1359
63168G14379J0429R433Q712P944O760N275L487Q72k685o155q484j0056j2119j4928
63154G12864j7531j9330k0727k1944k2292k1279j9590j8205j7067j5425j3125
63143E06349j0787q941p741p281p468p538o627m902l514l142l241l019k468j977
63129D27703j392j65J707L434M171L776K854K255K485L362M265M721M696M364
$$ plain form
63115 468236 472072 475262 477857 480144 482651 485983 490336 495035 498944 501643 503945 506921 510668 514477
63101 514477 517931 521175 524196 526592 528246 529603 531000 532201 532915 533377 534025 534858 535475 535607 535408 535342
63085 535342 535896 537174 538663 539635 539908 539981 540379 541190 542385 544138 546598 549628 553009 556642 560422 564307
63069 564307 568704 574350 581486 589525 597827 606493 616072 626907 639175 653195 669170 686884 706138
63056 706138 727211 750454 775656 802392 830824 861649 895336 931933 971514 1014163 1059394
63045 1059394 1106077 1153153 1200245 1247538 1295290 1343403 1391283 1438205 1484000 1529186 1574171
63034 1574171 1618619 1661952 1704123 1745373 1785412 1823353 1858242 1889066 1914278 1931958 1940489
63023 1940489 1938749 1925940 1901967 1867987 1825888 1777125 1722570 1663442 1601635 1539004 1477005
$$ packed form
63115D68236L836L190K595K287K507L332M353M699L909K699K302K976L747L809
63101E14477L454L244L021K396J654J357J397J201P14M62O48Q33O17J32j99o6
63085E35342N54J278J489R72K73P3L98Q11J195J753K460L030L381L633L780L885
63069E64307M397N646P136Q039Q302Q666R579J0835J2268J4020J5975J7714J9254
63056G06138K1073K3243K5202K6736K8432L0825L3687L6597L9581M2649M5231
63045A059394M6683M7076M7092M7293M7752M8113M7880M6922M5795M5186M4985
63034A574171M4448M3333M2171M1250M0039L7941L4889L0824K5212J7680Q531
63023A940489j740j2809k3973l3980m2099m8763n4555n9128o1807o2631o1999
$$ plain form
63012 1477005 1417139 1361024 1309694 1263373 1222169 1186377 1155957 1130438 1109738 1094405 1084692
63001 1084692 1079970 1079487 1083078 1090649 1101545 1114982 1130580 1147849 1165670 1183024 1199937 1217065
62989 1217065 1234680 1252697 1271276 1290500 1309571 1327207 1342836 1356629 1368222 1376215 1379279 1377090
62977 1377090 1369779 1357053 1338534 1314726 1286987 1256356 1222759 1185664 1145453 1103928 1063318
62966 1063318 1024851 988456 953766 921060 891022 863919 839354 816768 795880 776634 758941
62955 758941 742514 726917 711869 697584 684595 673027 662244 651452 640452 629463 618378
62944 618378 606700 594297 581814 570147 559707 550337 541713 533616 525949 518722 512072 506167 500969
62931 500969 496192 491658 487762 485259 484334 484036 483107 481314 479465 478060 476624 474688 472781 471779 471688
$$ packed form
63012A477005n9866n6115n1330m6321m1204l5792l0420k5519k0700j5333r713
63001A084692m722m83L591P571J0896J3437J5598J7269J7821J7354J6913J7128
62989A217065J7615J8017J8579J9224J9071J7636J5629J3793J1593P993L064k189
62977A377090p311j2726j8519k3808k7739l0631l3597l7095m0211m1525m0610
62966A063318l8467l6395l4690l2706l0038k7103k4565k2586k0888j9246j7693
62955G58941j6427j5597j5048j4285j2989j1568j0783j0792j1000j0989j1085
62944F18378j1678j2403j2483j1667j0440r370q624q097p667p227o650n905n198
62931E00969m777m534l896k503r25k98r29j793j849j405j436j936j907j002r1
$$ plain form
62916 471688 471773 471675 471635 471663 471228 469981 468188 466253 464246 462148 460123 458244 456254 453900 451334 448995
62900 448995 447325 446656 447090 448234 449283 449636 449370 449010 449032 449646 450861 452511 454305 455945 457153 457690
62884 457690 457553 457119 456736 456154 454783 452671 450777 449980 450207 450809 451329 451450 450621 448542 445958 444218 443886
62867 443886 444273 444475 444281 443748 442537 440282 437326 434458 431977 429589 427260 425568 424945 425015 425133 425269
62851 425269 425891 427103 428417 429418 430210 430962 431466 431504 431420 431857 432943 434082 434606 434312 433333 431825 430051
62834 430051 428512 427703 427651 427890 427851 427229 426108 424927 424306 424641 425776 427150 428377 429595 431177 433181
62818 433181 435262 437123 438876 440883 443346 446196 449342 452831 456743 461006 465434 469887 474372 479047
62804 479047 484094 489511 495025 500368 505745 511869 519348 528120 537673 547748 558567 570340 582819
$$ packed form
62916D71688Q5r8m0K8m35j247j793j935k007k098k025j879j990k354k566k339
62900D48995j670o69M34J144J049L53k66l60K2O14J215J650J794J640J208N37
62884D57690j37m34l83n82j371k112j894p97K27O02N20J21q29k079k584j740l32
62867D43886L87K02j94n33j211k255k956k868k481k388k329j692o23P0J18J36
62851D25269O22J212J314J001P92P52N04L8q4M37J086J139N24k94r79j508j774
62834D30051j539q09n2K39l9o22j121j181o21L35J135J374J227J218J582K004
62818D33181K081J861J753K007K463K850L146L489L912M263M428M453M485M675
62804D79047N047N417N514N343N377O124P479Q772R553J0075J0819J1773J2479
$$ plain form
62791 582819 595561 608548 622411 638082 656397 678011 703415 732774 765826 802235 842194
62780 842194 886529 935997 990626 1049953 1113812 1182452 1255680 1332180 1409880 1486850 1561688
62769 1561688 1633190 1699948 1760178 1811749 1852483 1880676 1895456 1896663 1884663 1860426 1825452
62758 1825452 1781158 1728446 1668208 1602159 1532620 1461432 1389537 1317697 1247056 1178711 1113159
62747 1113159 1050645 991799 937469 887940 842652 800692 761451 724907 691492 661640 635335
62736 635335 612140 591687 573907 558658 545388 533440 522462 512357 503116 495012 488582 483943
62724 483943 480370 477108 474388 472990 472860 473002 472902 473281 474997 477915 481419 485498 490591 496671 503309
62709 503309 510614 519409 530330 543269 557864 574103 592225 612429 634909 659954 687778 718419
$$ packed form
62791E82819J2742J2987J3863J5671J8315K1614K5404K9359L3052L6409L9959
62780H42194M4335M9468N4629N9327O3859O8640P3228P6500P7700P6970P4838
62769A561688P1502O6758O0230N1571M0734K8193J4780J207j2000k4237l4974
62758A825452m4294n2712o0238o6049o9539p1188p1895p1840p0641o8345o5552
62747A113159o2514n8846n4330m9529m5288m1960l9241l6544l3415k9852k6305
62736F35335k3195k0453j7780j5249j3270j1948j0978j0105r241q104o430m639
62724D83943l573l262k720j398j30J42j00L79J716K918L504M079N093O080O638
62709E03309P305Q795J0921J2939J4595J6239J8122K0204K2480K5045K7824L0641
$$ plain form
62697 718419 751890 788226 827229 868401 911301 955871 1002202 1049921 1097780 1143782 1185900
62686 1185900 1222932 1254628 1280719 1299947 1310554 1311803 1304516 1289838 1267999 1238756 1202726 1161701
62674 1161701 1117701 1072130 1025792 979263 933130 888083 844850 803896 765301 729125 695797
62663 695797 665807 639055 614826 592462 571805 552977 535982 520672 506893 494556 483602
62652 483602 473827 464738 455814 447113 439320 432821 426984 420842 414339 408317 403376 399405 396290 394295
62638 394295 393390 392893 392215 391466 390890 390199 389067 387810 386940 386306 385366 384116 383038 382165 380960 379252 377732
62621 377732 377207 377796 379037 380407 381511 382222 382993 384735 387990 392359 397007 401577 406308 411379 416624
62606 416624 421999 427976 435154 443584 452839 462814 474217 487940 504075 521889 540921 561781 585600
$$ packed form
62697G18419L3471L6336L9003M1172M2900M4570M6331M7719M7859M6002M2118
62686A185900L7032L1696K6091J9228J0607J249p287j4678k1839k9243l6030m1025
62674A161701m4000m5571m6338m6529m6133m5047m3233m0954l8595l6176l3328
62663F95797k9990k6752k4229k2364k0657j8828j6995j5310j3779j2337j0954
62652D83602r775r089q924q701p793o499n837o142o503o022m941l971l115j995
62638C94295r05m97o78p49n76o91j132j257q70o34r40j250j078q73j205j708j520
62621C77732n25N89J241J370J104P11P71J742L255M369M648M570M731N071N245
62606D16624N375N977P178Q430R255R975J1403J3723J6135J7814J9032K0860K3819
$$ plain form
62593 585600 612832 642892 674966 708834 744724 782414 820636 857432 891223 921531 948500
62582 948500 971630 989295 999757 1002548 998547 988842 973890 953791 928925 900087 868286 834676
62570 834676 800480 766683 733780 701977 671532 642762 615765 590508 567224 546473 528522
62559 528522 512850 498622 485647 474396 464920 456236 447301 438347 430618 424820 420460 416766 413488
62546 413488 410465 407160 403379 400009 398193 397884 397872 397303 396584 396663 397919 399854 401470 401861 400811 399041
62530 399041 397607 397013 397117 397733 398931 400829 403577 407550 413060 419884 427581 436300 446687 458944
62516 458944 472701 487964 505393 525302 547161 570571 595954 623546 652372 681077 709351
62505 709351 737587 765392 791440 814762 835222 852601 866163 875498 881138 883875 883983 881492 876760
$$ packed form
62593E85600K7232L0060L2074L3868L5890L7690L8222L6796L3791L0308K6969
62582I48500K3130J7665J0462K791m001r705j4952k0099k4866k8838l1801l3610
62570H34676l4196l3797l2903l1803l0445k8770k6997k5257k3284k0751j7951
62559E28522j5672j4228j2975j1251r476q684q935q954p729n798m360l694l278
62546D13488l023l305l781l370j816l09j2n69p19P9J256J935J616L91j050j770
62530C99041j434n94J04O16J198J898K748L973N510O824P697Q719J0387J2257
62516D58944J3757J5263J7429J9909K1859K3410K5383K7592K8826K8705K8274
62505G09351K8236K7805K6048K3322K0460J7379J3562R335N640K737J08k491m732
$$ plain form
62492 876760 870310 862512 853995 846189 840876 839104 840904 846131 855286 869275 888490 912347 939758
62479 939758 969917 1002456 1036910 1072295 1107294 1140655 1171193 1197528 1218084 1231447 1236767 1234053
62467 1234053 1224131 1207966 1185704 1156651 1120559 1078720 1033369 986221 938122 889959 843042
62456 843042 798322 755892 715717 678483 645305 616844 593010 573292 557027 543529 532292
62445 532292 523073 515724 510116 506296 504407 504297 505539 507967 511794 516935 522645 528195 533513 538692
62431 538692 543274 546613 548661 549780 549872 548389 545113 540256 533753 525215 514802 503559 492562 482167
62417 482167 472341 463216 454972 447564 440900 434975 429553 424101 418369 412671 407284 402025 396880 392590
62403 392590 389965 388811 388146 387423 386904 386902 387266 387785 388550 389672 390981 392241 393455 394768 396263 397876
$$ packed form
62492H76760o450p798q517p806n313j772J800N227R155J3989J9215K3857K7411
62479I39758L0159L2539L4454L5385L4999L3361L0538K6335K0556J3363N320k714
62467A234053r922j6165k2262k9053l6092m1839m5351m7148m8099m8163m6917
62456H43042m4720m2430m0175l7234l3178k8461k3834j9718j6265j3498j1237
62445E32292r219p349n608l820j889j10J242K428L827N141N710N550N318N179
62431E38692M582L339K048J119R2j483l276m857o503q538j0413j1243j0997j0395
62417D82167r826r125q244p408o664n925n422n452n732n698n387n259n145m290
62403C92590k625j154o65p23n19kL64N19P65J122J309J260J214J313J495J613
$$ plain form
62387 397876 399369 400441 401123 402013 403786 406510 409829 413699 418403 423809 429276 434602 440485 447595 455638
62372 455638 463855 472151 481153 491320 502496 514347 526774 539875 553896 569357 586968 607301
62360 607301 630608 656927 686234 718670 754775 795329 840535 889387 940185 991694 1043457
62349 1043457 1094898 1144427 1189595 1227994 1258044 1279262 1292098 1297387 1295747 1287473 1272966 1253100
62337 1253100 1228970 1201313 1170285 1135863 1098485 1059329 1019974 981819 945839 912765 883180
62326 883180 857310 834904 815475 798507 783336 769146 755382 741968 728783 715155 700307
62315 700307 684261 667769 651348 634787 617737 600348 583108 566405 550534 535905 522958
62304 522958 511906 502610 494571 487103 479878 473382 468496 465456 463519 461859 460442 459802 460229 461568
$$ packed form
62387C97876J493J072O82Q90J773K724L319L870M704N406N467N326N883P110Q043
62372D55638Q217Q296R002J0167J1176J1851J2427J3101J4021J5461J7611K0333
62360F07301K3307K6319K9307L2436L6105M0554M5206M8852N0798N1509N1763
62349A043457N1441M9529M5168L8399L0050K1218J2836N289j640q274j4507j9866
62337A253100k4130k7657l1028l4422l7378l9156l9355l8155l5980l3074k9585
62326H83180k5870k2406j9429j6968j5171j4190j3764j3414j3185j3628j4848
62315G00307j6046j6492j6421j6561j7050j7389j7240j6703j5871j4629j2947
62304E22958j1052r296q039p468p225o496m886l040j937j660j417o40M27J339
$$ plain form
62290 461568 463602 466285 469677 473893 479011 484816 490842 496987 503903 512345 522135 532200 541768 551185
62276 551185 561314 572358 583572 594099 603773 612959 621828 630187 638073 646087 654774 663984 673374
62263 673374 683385 695086 709003 724850 742679 763552 788564 817807 850932 888227 930227
62252 930227 976555 1025926 1077139 1129124 1180105 1227682 1270063 1306423 1335920 1357318 1370065
62241 1370065 1374907 1372779 1363714 1347485 1324644 1296030 1261629 1220968 1174572 1124265 1072045 1019382
62229 1019382 967619 918199 872089 829515 790526 755419 724396 697234 673549 652965 634842
62218 634842 618282 602793 588642 576262 565600 556313 548252 541340 535251 529613 524398 519825 516046
62205 516046 513186 511388 510435 509618 508500 507651 508077 509997 512721 515666 518900 522623 526759 531264 536337
$$ packed form
62290D61568K034K683L392M216N118N805O026O145O916Q442R790J0065R568R417
62276E51185J0129J1044J1214J0527R674R186Q869Q359P886Q014Q687R210R390
62263F73374J0011J1701J3917J5847J7829K0873K5012K9243L3125L7295M2000
62252I30227M6328M9371N1213N1985N0981M7577M2381L6360K9497K1398J2747
62241A370065M842k128r065j6229k2841k8614l4401m0661m6396n0307n2220n2663
62229A019382n1763m9420m6110m2574l8989l5107l1023k7162k3685k0584j8123
62218F34842j6560j5489j4151j2380j0662r287q061o912o089n638n215m573l779
62205E16046k860j798r53q17j118q49M26J920K724K945L234L723M136M505N073
$$ plain form
62190 536337 542025 548069 554384 561260 568822 576741 584860 593663 603646 614518 625540 636415 647335
62177 647335 658290 668837 678515 687105 694580 701289 708184 716396 726465 738359 752332 769342 790435
62164 790435 815986 845695 879048 915484 954234 994213 1034074 1072292 1107194 1137025 1160254
62153 1160254 1176210 1185518 1189542 1189067 1183806 1173428 1158580 1140265 1118557 1092865 1063477 1031929
62141 1031929 999629 967027 934580 903668 875708 850862 828474 808516 791795 778764 768864
62130 768864 761095 754676 749061 743922 739387 735851 733348 731451 729930 729079 729115 729664 730234 730925 732166 733865
62114 733865 735218 735395 734076 731293 727212 722332 717589 713786 710867 707879 703657 697420 688864 678165
62100 678165 666090 653858 642537 632551 623855 616475 610707 606882 605115 605198 606600 608663 611024 613776
$$ packed form
62190E36337N688O044O315O876P562P919Q119Q803R983J0872J1022J0875J0920
62177F47335J0955J0547R678Q590P475O709O895Q212J0069J1894J3973J7010K1093
62164G90435K5551K9709L3353L6436L8750L9979L9861L8218L4902K9831K3229
62153A160254J5956R308M024m75n261j0378j4848j8315k1708k5692k9388l1548
62141A031929l2300l2602l2447l0912k7960k4846k2388j9958j6721j3031r900
62130G68864p769o419n615n139m535l536k503j897j521q51L6N49N70O91J241J699
62114G33865J353J77j319k783m081m880m743l803k919k988m222o237q556j0699
62100F78165j2075j2232j1321r986q696p380n768l825j767Q3J402K063K361K752
$$ plain form
62086 613776 617087 620861 625010 629842 635785 642808 650587 659133 668775 679529 691107 703732 718235
62073 718235 734951 753056 771452 789950 809036 828859 849126 869852 891510 914381 938298
62062 938298 963150 989088 1015947 1042821 1068587 1092660 1114882 1134708 1150807 1161664 1166541 1165760
62050 1165760 1160090 1150109 1136261 1119180 1099456 1076993 1051011 1020892 986850 949798 910994 871993
62038 871993 834360 798917 765464 733587 703562 676153 651796 630331 611306 594216 578649
62027 578649 564653 552679 542805 534257 526206 518692 512165 506398 500696 495022 489984 485588 480920 475364
62013 475364 469331 463437 457761 452450 448331 446096 445296 444835 444159 443361 442438 441280 440319 440433 442064 444902
61997 444902 448510 452701 457136 461074 463874 465492 466287 466562 466469 466027 464925 462551 458618 453712 448863
$$ packed form
62086F13776L311L774M149M832N943P023P779Q546R642J0754J1578J2625J4503
62073G18235J6716J8105J8396J8498J9086J9823K0267K0726K1658K2871K3917
62062I38298K4852K5938K6859K6874K5766K4073K2222J9826J6099J0857M877p81
62050A165760n670r981j3848j7081j9724k2463k5982l0119l4042l7052l8804l9001
62038H71993l7633l5443l3453l1877l0025k7409k4357k1465j9025j7090j5567
62027E78649j3996j1974r874q548q051p514o527n767n702n674n038m396m668n556
62013D75364o033n894n676n311m119k235q00m61o76p98r23j158r61J14J631K838
61997D44902L608M191M435L938K800J618P95K75r3m42j102k374l933m906m849
$$ plain form
61982 448863 444397 439470 432961 424796 416184 408497 402148 396656 391642 387278 383698 380397 376697 372726
61968 372726 369448 367546 366540 365263 363085 360425 358142 356694 355955 355565 355240 354837 354372 354068 354305 355439
61952 355439 357660 360946 365047 369595 374313 379153 384169 389356 394831 401107 408861 418321 429145 441052
61938 441052 454255 468970 484711 500512 515847 530995 546465 562385 578526 594525 609850
61927 609850 623807 635899 646147 654872 662242 668202 672667 675499 676299 674565 670256 664007 656595 648400
61913 648400 639666 631213 624450 620492 619509 621100 624986 631037 638909 648130 658550 670200 682607 694637
61899 694637 705143 713466 719182 721817 721110 717331 711027 702713 692953 682436 671569 660158 647799
61886 647799 634525 620871 607484 594827 583002 571708 560669 550312 541553 534537 528048 520757
$$ packed form
61982D48863m466m927o509q165q612p687o349n492n014m364l580l301l700l971
61968C72726l278j902j006j277k178k660k283j448p39l90l25m03m65l04K37J134
61952C55439K221L286M101M548M718M840N016N187N475O276P754R460J0824J1907
61938D41052J3203J4715J5741J5801J5335J5148J5470J5920J6141J5999J5325
61927F09850J3957J2092J0248Q725P370N960M465K832Q00j734m309o249p412q195
61913F48400q734q453o763l958r83J591L886O051P872R221J0420J1650J2407J2030
61899F94637J0506Q323N716K635p07l779o304q314r760j0517j0867j1411j2359
61886F47799j3274j3654j3387j2657j1825j1294j1039j0357q759p016o489p291
$$ plain form
61874 520757 512711 505002 498238 492094 486186 480521 475049 469576 464374 460288 457923 457202 457904 460086 463771
61859 463771 468646 474388 480946 488368 496772 506655 518740 533230 549604 567399 586789 608173 631590
61846 631590 656787 683425 710846 737975 763826 787885 809786 828958 844889 857340 866004 870331
61834 870331 870131 866133 859601 851586 842798 833817 825060 816827 809869 805666 805552 809566 816487 825002 834500
61819 834500 844819 855561 865780 874204 879741 881800 880063 874048 863256 847820 828701 807104
61807 807104 784078 760707 738051 716453 695378 674406 654077 635302 618338 602858 588648
61796 588648 575652 563577 552174 541802 533045 525831 519497 513748 508937 505273 502269 499188 495747
61783 495747 492268 489387 487552 486508 485304 483130 480119 477069 474538 472615 471304 470529 469779 468381 466326
$$ packed form
61874E20757q046p709o764o144n908n665n472n473n202m086k365p21P02K182L685
61859D63771M875N742O558P422Q404R883J2085J4490J6374J7795J9390K1384K3417
61846F31590K5197K6638K7421K7129K5851K4059K1901J9172J5931J2451Q664M327
61834H70331k00l998o532q015q788q981q757q233o958m203j14M014O921Q515R498
61819H34500J0319J0742J0219Q424N537K059j737o015j0792j5436j9119k1597
61807H07104k3026k3371k2656k1598k1075k0972k0329j8775j6964j5480j4210
61796E88648j2996j2075j1403j0372q757p214o334n749m811l664l004l081l441
61783D95747l479k881j835j044j204k174l011l050k531j923j311p75p50j398k055
$$ plain form
61768 466326 464363 463153 462716 462776 463165 463691 464056 464130 464092 464173 464535 465395 466955 469129 471646 474389 477317 480091
61750 480091 482267 483855 485213 486329 486793 486555 486050 485289 483510 480222 476119 472430 469653 467341 464891
61735 464891 462064 458958 455901 453393 451895 451663 452747 454805 456868 457816 457507 457086 457757 459530 461507
61720 461507 463039 464135 465109 466408 468551 471547 474490 476362 477228 478010 479022 479514 478827 477372 476016
61705 476016 475036 474112 472945 471267 468511 464116 458275 452028 446448 441956 438403 435476 432860 430286 427692
61690 427692 425310 423385 421759 419838 417098 413612 410016 406899 404335 402070 400053 398463 397167 395425
61676 395425 392492 388434 384145 380535 377919 376155 375021 374247 373492 372679 372256 372721 373811 374561 374369 373724
61660 373724 373522 373820 373710 372543 370890 370010 370532 371967 373489 374857 376415 378451 380876 383485 386200
$$ packed form
61768D66326j963j210m37O0L89N26L65P4l8Q1L62Q60J560K174K517K743K928K774
61750D80091K176J588J358J116M64k38n05p61j779l288m103l689k777k312k450
61735D64891k827l106l057k508j498k32J084K058K063R48l09m21O71J773J977
61720D61507J532J096R74J299K143K996K943J872Q66P82J012M92o87j455j356
61705D76016r80r24j167j678k756m395n841o247n580m492l553k927k616k574k594
61690D27692k382j925j626j921k740l486l596l117k564k265k017j590j296j742
61676C95425k933m058m289l610k616j764j134p74p55q13m23M65J090P50j92o45
61660C73724k02K98j10j167j653q80N22J435J522J368J558K036K425K609K715
$$ plain form
61645 386200 388917 391352 393346 395235 397536 400152 402189 402912 402787 403097 404416 405804 405945 404854 403842
61630 403842 403705 403609 402288 399824 397485 395938 394507 392354 389571 386606 383404 379861 376634 374604 373642
61615 373642 372767 371474 370174 369235 368386 367306 366124 364918 363273 360728 357276 353153 348587 344064 340321
61600 340321 337632 335415 332912 329986 326952 324037 321433 319417 317915 316246 313753 310497 306946 303346
61586 303346 299902 297163 295557 294722 293911 292927 292140 291758 291652 291752 291987 291989 291481 290848 290651 290671 290188 289207 288605
61567 288605 288907 289692 290476 291417 292720 293950 294481 294285 293842 293528 293376 293215 292825 292171 291636 291788 292793 294346
61549 294346 296148 298005 299514 300229 300425 301056 302602 304403 305509 305777 305694 305559 305329 305073 305050 305406 306153
61532 306153 307426 309477 312368 315727 318748 320566 320988 320866 321335 322575 323682 323854 323149 321892 320027
$$ packed form
61645C86200K717K435J994J889K301K616K037P23j25L10J319J388J41j091j012
61630D03842j37r6j321k464k339j547j431k153k783k965l202l543l227k030r62
61615C73642q75j293j300r39q49j080j182j206j645k545l452m123m566m523l743
61600C40321k689k217k503k926l034k915k604k016j502j669k493l256l551l600
61586C03346l444k739j606q35q11r84p87l82j06J00K35Kn08o33j97K0m83r81o02
61567B88605L02P85P84R41J303J230N31j96m43l14j52j61l90o54n35J52J005J553
61549B94346J802J857J509P15J96O31J546J801J106K68q3j35k30k56k3L56P47
61532C06153J273K051K891L359L021J818M22j22M69J240J107J72p05j257j865
$$ plain form
61517 320027 317522 314877 312631 310689 308743 307071 306242 306147 305967 305218 304320 303987 304366 304958 305223 305146 305197 305677
61499 305677 306145 305799 304564 303447 303494 304612 305719 305887 305063 303856 303005 302947 303559 304307 304861 305525 306895
61482 306895 309173 311986 314712 316811 318043 318598 318934 319329 319740 320172 320889 322074 323526 324930 326136 327052
61466 327052 327584 327923 328453 329060 329019 328017 326832 326426 326722 326866 326398 325453 324126 322489 321190 321088 322071
61449 322071 322917 322700 321772 321109 321160 321729 322546 323497 324461 325278 325897 326409 326989 327798 328795 329647 330024 330082 330461
61430 330461 331739 333920 336436 338575 340034 341155 342512 344187 345720 346914 348267 350228 352406 354068
61416 354068 355183 356377 357980 359721 361377 363085 364947 366830 368683 370543 372105 372733 372151 370759 369156
61401 369156 367645 366257 364843 363066 360716 358163 356175 355192 355064 355424 355878 355936 355368 354641 354428 354621 354535
$$ packed form
61517C20027k505k645k246j942j946j672q29r5j80p49q98l33L79N92K65p7N1M80
61499C05677M68l46j235j117M7J118J107J68q24j207q51n8O12P48N54O64J370
61482C06895K278K813K726K099J232N55L36L95M11M32P17J185J452J404J206R16
61466C27052N32L39N30O07m1j002j185m06K96J44m68r45j327j637j299j02R83
61449C22071Q46k17r28o63N1N69Q17R51R64Q17O19N12N80Q09R97Q52L77N8L79
61430C30461J278K181K516K139J459J121J357J675J533J194J353J961K178J662
61416C54068J115J194J603J741J656J708J862J883J853J860J562O28n82j392j603
61401C69156j511j388j414j777k350k553j988r83j28L60M54N8n68p27k13J93q6
$$ plain form
61384 354535 354144 354260 355180 356048 356128 356003 356799 358684 360824 362459 363433 364011 364851 366844 370227 373963 376663
61367 376663 378156 379533 381640 384114 386078 387308 388405 390018 392123 394039 395185 395830 396943 399208
61353 399208 402408 405930 409594 413723 418638 424422 430929 437752 444316 450293 455715 460480 464114 466371
61339 466371 467704 468747 469709 470767 472532 475327 478293 480085 480428 480134 479658 478581 476706 474699 473125
61324 473125 471610 469503 466817 464011 461314 458846 457053 456501 457399 459636 462958 466847 470707 474653 479649
61309 479649 486329 494131 502276 511140 521694 533796 546177 558231 570775 584505 598637 611723
61297 611723 623146 632944 640613 645174 646497 645732 644080 641647 637830 632396 625759 618417 610562 602210
61283 602210 593369 584058 574412 564889 556163 548698 542547 537580 533694 530615 527815 525038 522858 522227
$$ packed form
61384C54535l91J16R20Q68Q0j25P96J885K140J635R74N78Q40J993L383L736K700
61367C76663J493J377K107K474J964J230J097J613K105J916J146O45J113K265
61353C99208L200L522L664M129M915N784O507O823O564N977N422M765L634K257
61339D66371J333J043R62J058J765K795K966J792L43k94m76j077j875k007j574
61324D73125j515k107k686k806k697k468j793n52Q98K237L322L889L860L946M996
61309D79649O680P802Q145Q864J0554J2102J2381J2054J2544J3730J4132J3086
61297F11723J1423R798P669M561J323p65j652k433l817n434o637p342p855q352
61283F02210q841r311r646r523q726p465o151m967l886l079k800k777k180o31
$$ plain form
61269 522227 523250 524789 525632 525838 526541 528565 531685 535212 538789 542487 546549 551312 557016 563387 569709
61254 569709 575598 581390 587383 593110 597943 602130 606390 610493 613101 613371 611988 610122 608007 605160
61240 605160 601544 597682 593833 589867 585963 582681 580194 578078 576103 574594 573679 572737 571156 569305 568244
61225 568244 568643 570476 573567 577918 583463 589984 597298 605128 612780 619524 625547 632044 639916 648687
61211 648687 657137 664801 672283 680064 687610 693941 698741 702508 705792 708665 711051 713277 716174 720630
61197 720630 727052 735125 744103 753468 763386 774477 787133 801145 815930 830855 845180 857917
61185 857917 868086 875249 879748 882331 883596 883711 882573 880176 876791 872806 868461 863784 858743 853284
61171 853284 847200 840187 832132 823245 813733 803520 792476 780841 769140 757624 745989 733732
$$ packed form
61269E22227J023J539Q43K06P03K024L120L527L577L698M062M763N704O371O322
61254E69709N889N792N993N727M833M187M260M103K608K70j383j866k115k847
61240F05160l616l862l849l966l904l282k487k116j975j509r15r42j581j851j061
61225E68244L99J833L091M351N545O521P314P830P652O744O023O497P872Q771
61211F48687Q450P664P482P781P546O331M800L767L284K873K386K226K897M456
61197G20630O422Q073Q978R365R918J1091J2656J4012J4785J4925J4325J2737
61185H57917J0169P163M499K583J265J15j138k397l385l985m345m677n041n459
61171H53284o084p013q055q887r512j0213j1044j1635j1701j1516j1635j2257
$$ plain form
61159 733732 720733 707444 694566 682493 671075 660003 649455 640159 632676 626791 621863 617615
61147 617615 614255 612002 610903 611038 612256 613564 613335 610671 606246 601458 597002 592688 588391 584494 581371
61132 581371 578960 577141 576163 576473 578317 581717 586616 592814 599954 607875 616987 628018 641295 656423
61118 656423 672758 690142 709081 730168 753377 777940 802902 827774 852689 878007 903828
61107 903828 929789 955226 979540 1002519 1024334 1045140 1064719 1082577 1098308 1111670 1122321
61096 1122321 1129748 1133580 1133792 1130509 1123791 1113734 1100691 1085272 1068290 1050762 1033649 1017287
61084 1017287 1001241 985014 968770 953075 938203 924169 911389 900669 892371 886017 880937 876923
61072 876923 874031 872246 871708 872887 876072 880889 886714 893418 901323 910577 920965 932269 944413 957319
$$ packed form
61159G33732j2999j3289j2878j2073j1418j1072j0548r296p483n885m928m248
61147F17615l360k253j099J35J218J308k29k664m425m788m456m314m297l897l123
61132E81371k411j819r78L10J844L400M899O198P140P921R112J1031J3277J5128
61118F56423J6335J7384J8939K1087K3209K4563K4962K4872K4915K5318K5821
61107I03828K5961K5437K4314K2979K1815K0806J9579J7858J5731J3362J0651
61096A122321P427L832K12l283o718j0057j3043j5419j6982j7528j7113j6362
61084A017287j6046j6227j6244j5695j4872j4034j2780j0720q298o354n080m014
61072H76923k892j785n38J179L185M817N825O704P905R254J0388J1304J2144J2906
$$ plain form
61058 957319 970983 985704 1001851 1019356 1037632 1055991 1074014 1091669 1109358 1127746 1147252
61047 1147252 1167805 1189319 1212089 1236296 1261376 1286411 1311078 1335733 1360730 1386259 1412691
61036 1412691 1440339 1468844 1497508 1526369 1556290 1587871 1620981 1655477 1691594 1729310 1768044
61025 1768044 1807362 1847417 1888429 1930529 1974551 2022354 2075940 2136767 2206198 2285791 2376839
61014 2376839 2480456 2598716 2735116 2894006 3081073 3305262 3579262 3917712 4336429
61005 4336429 4853788 5490273 6264721 7192180 8284986 9549752 10978057 12544384 14219977
60996 14219977 15980993 17780874 19502776 20957315 21963559 22458830 22536539 22378770 22155240
60987 22155240 21975387 21895951 21920974 21968653 21858553 21376053 20387247 18913218 17107518
$$ packed form
61058I57319J3664J4721J6147J7505J8276J8359J8023J7655J7689J8388J9506
61047A147252K0553K1514K2770K4207K5080K5035K4667K4655K4997K5529K6432
61036A412691K7648K8505K8664K8861K9921L1581L3110L4496L6117L7716L8734
61025A768044L9318M0055M1012M2100M4022M7803N3586O0827O9431P9593R1048
61014B376839J03617J18260J36400J58890J87067K24189K74000L38450M18717
61005D336429N17359O36485P74448R27459J092806J264766J428305J566327J675593
60996A4219977J761016J799881J721902J454539J006244M95271P7709j57769k23530
60987B2155240j79853p9436K5023M7679j10100m82500r88806j474029j805700
$$ plain form
60978 17107518 15169209 13265366 11502210 9932271 8570765 7409978 6431197 5612470
60970 5612470 4931073 4364301 3891717 3496911 3166509 2888425 2651920 2448373 2270914
60961 2270914 2113947 1973749 1848534 1736903 1636752 1546383 1465684 1394997 1333340 1278780
60951 1278780 1230098 1186975 1148775 1114075 1081344 1049454 1017919 987310 959013 933724 910534
60940 910534 888258 867184 848483 832231 817157 802229 787315 772255 756459 739842 723304
60929 723304 707822 693561 680127 667118 654230 641374 628899 617354 606911 597445 589119 582346
60917 582346 577106 572814 568895 565078 561205 557328 553961 551590 549923 548287 546779 546243 546913 547898 548400
60902 548400 548779 549892 551909 554309 556694 558971 560880 561837 561385 559617 557064 554200 551054 547363 543058
$$ packed form
60978A7107518j938309j903843j763156j569939j361506j160787r78781q18727
60970E612470o81397n66772m72584l94806l30402k78084k36505k03547j77459
60961B270914j56967j40198j25215j11631j00151r0369q0699p0687o1657n4560
60951A278780m8682m3123l8200l4700l2731l1890l1535l0609k8297k5289k3190
60940I10534k2276k1074j8701j6252j5074j4928j4914j5060j5796j6617j6538
60929G23304j5482j4261j3434j3009j2888j2856j2475j1545j0443r466q326o773
60917E82346n240m292l919l817l873l877l367k371j667j636j508n36O70R85N02
60902E48400L79J113K017K400K385K277J909R57m52j768k553k864l146l691m305
$$ plain form
60887 543058 538367 533326 527666 521465 515433 509999 504496 497994 490703 483654 477133 470440 463341 456750
60873 456750 451540 447489 443931 440776 438342 436703 435803 435833 436949 438811 440766 442336 443397 444212 445475
60858 445475 447864 451251 454674 457280 458961 459995 460664 461437 462844 464751 466346 467308 468379 470254 472476
60843 472476 474067 474715 474641 473748 471818 469269 466854 464658 462128 458971 455332 451185 446309 440932 435659
60828 435659 430704 425894 421533 418438 416799 415660 413964 411590 408942 406029 402581 398778 395253 392380
60814 392380 389966 387691 385511 383506 381534 379207 376221 372748 369450 366929 365111 363268 360817 358008
60800 358008 355722 354589 354379 354217 353334 351648 349744 348337 347753 347804 348024 347948 347275 346016 344576 343621 343676
60783 343676 344761 346399 348038 349465 350767 351933 352692 352890 352849 353091 353756 354599 355515 356679 358040 359077
$$ packed form
60887E43058m691n041n660o201o032n434n503o502p291p049o521o693p099o591
60873D56750n210m051l558l155k434j639r00L0J116J862J955J570J061Q15J263
60858D45475K389L387L423K606J681J034O69P73J407J907J595R62J071J875K222
60843D72476J591O48p4q93j930k549k415k196k530l157l639m147m876n377n273
60828D35659m955m810m361l095j639j139j696k374k648k913l448l803l525k873
60814C92380k414k275k180k005j972k327k986l473l298k521j818j843k451k809
60800C58008k286j133k10j62q83j686j904j407n84N1K20p6o73j259j440r55N5
60783C43676J085J638J639J427J302J166P59J98m1K42O65Q43R16J164J361J037
$$ plain form
60767 359077 359355 359070 358789 358855 359347 360385 361980 363685 364857 365355 365625 365997 366253 366043 365421 364632 363598
60750 363598 361948 359667 357456 356314 356747 358400 360385 361986 363170 364499 366494 368918 370682 370645 368630
60735 368630 365532 362289 358930 354846 349855 344579 339764 335680 332334 329888 328455 327652 326706 325074 322821
60720 322821 320467 318585 317499 317241 317796 319268 321593 324135 326020 327038 327857 329089 330541 331749 332831
60705 332831 334196 335639 336445 336452 336361 336825 337765 338873 340276 342240 344476 346209 346962 347006 347000 347365 348008 348577
60687 348577 348941 349333 349959 350613 350966 351230 352124 353918 355815 356619 355948 354556 353540 353472 354199 355127 355600 355354
60669 355354 354801 354708 355305 355848 355332 353636 351651 350226 349278 348153 346538 344658 342800 341165 340191 340401
60653 340401 341679 343190 344379 345628 347483 349621 351281 352526 354285 357022 360067 362520 364198 365253
$$ packed form
60767C59077K78k85k81O6M92J038J595J705J172M98K70L72K56k10o22p89j034
60750C63598j650k281k211j142M33J653J985J601J184J329J995K424J764l7k015
60735C68630l098l243l359m084m991n276m815m084l346k446j433q03r46j632k253
60720C22821k354j882j086k58N55J472K325K542J885J018Q19J232J452J208J082
60705C32831J365J443Q06Pr1M64R40J108J403J964K236J733P53M4oL65O43N69
60687C48577L64L92O26O54L53K64Q94J794J897Q04o71j392j016o8P27R28M73k46
60669C55354n53r3N97N43n16j696j985j425r48j125j615j880j858j635r74K10
60653C40401J278J511J189J249J855K138J660J245J759K737L045K453J678J055
$$ plain form
60639 365253 365372 363999 361184 357647 354041 350555 347306 344679 343066 342410 342156 341654 340658 339507 338782 338725
60623 338725 339064 339449 339906 340688 341872 343304 344789 346111 347020 347541 348189 349469 351157 352461 352993 353213
60607 353213 353702 354347 354523 353960 353127 352839 353608 355252 356992 358006 358071 357663 357397 357479 357693 357701 357264 356463 355841
60588 355841 356084 357234 358453 358853 358452 358009 358043 358410 358756 358986 359227 359706 360715 362425 364635 367023 369715
60571 369715 373306 378171 384103 390818 398512 407630 418233 429832 441713 453244 463966 473597 481890
60558 481890 488412 492585 494088 493109 490110 485477 479611 473234 467322 462614 459209 456754 455090 454758 456651
60543 456651 461018 467026 473625 480693 488940 498897 510559 523923 539018 555223 571381 587057 602913
60530 602913 619226 634598 646859 654788 658315 657627 653125 646024 637853 629234 619958 610258 601125 593237
$$ packed form
60639C65253J19j373k815l537l606l486l249k627j613o56k54n02r96j151p25n7
60623C38725L39L85M57P82J184J432J485J322R09N21O48J280J688J304N32K20
60607C53213M89O45J76n63q33k88P69J644J740J014O5m08k66Q2K14Qm37q01o22
60588C55841K43J150J219M00m01m43L4L67L46K30K41M79J009J710K210K388K692
60571C69715L591M865N932O715P694R118J0603J1599J1881J1531J0722R631Q293
60558D81890O522M173J503r79k999m633n866o377n912m708l405k455j664l32J893
60543D56651M367O008O599P068Q247R957J1662J3364J5095J6205J6158J5676J5856
60530F02913J6313J5372J2261P929L527o88m502p101q171q619r276r700r133p888
$$ plain form
60516 593237 586414 580416 575451 571577 568396 565874 564813 565905 568694 571997 575125 578419 582988 590237
60502 590237 601185 615824 633428 653786 677722 706094 738765 775000 814363 856631 901132
60491 901132 946748 992285 1036294 1076792 1111854 1140356 1161546 1174026 1175957 1166461 1146357 1117391
60479 1117391 1081137 1038743 991281 940109 887081 834438 784174 737456 694797 656595 623073
60468 623073 593839 568130 545620 526489 510555 496893 484696 474032 465311 458209 451571 444308
60456 444308 436135 427593 419730 413625 409675 407089 404332 400369 395512 390989 387751 385724 384120 382278
60442 382278 380177 378192 376530 375023 373470 372016 371020 370522 370082 369293 368323 367639 367221 366419 364801 362849
60426 362849 361480 360980 360807 360364 359554 358573 357588 356858 356767 357397 358227 358583 358373 358181 358701 360215 362531 365222
$$ packed form
60516E93237o823n998m965l874l181k522j061J092K789L303L128L294M569P249
60502E90237J0948J4639J7604K0358K3936K8372L2671L6235L9363M2268M4501
60491I01132M5616M5537M4009M0498L5062K8502K1190J2480J931r496k0104k8966
60479A117391l6254m2394m7462n1172n3028n2643n0264m6718m2659l8202l3522
60468F23073k9234k5709k2510j9131j5934j3662j2197j0664q721p102o638p263
60456D44308q173q542p863o105l950k586k757l963m857m523l238k027j604j842
60442C82278k101j985j662j507j553j454r96m98m40p89r70o84m18q02j618j952
60426C62849j369n00j73m43q10r81r85p30r1O30Q30L56k10j92N20J514K316K691
$$ plain form
60408 365222 367853 370095 371674 372359 372143 371446 370933 371004 371581 372428 373474 374691 375920 376976 377903 378912
60392 378912 380144 381572 383118 384799 386779 389210 391933 394474 396535 398388 400470 402684 404533 405939
60378 405939 407424 409326 411321 412958 414234 415339 416256 416984 417849 419189 420933 422759 424396 425562 426028
60363 426028 426149 426860 428630 430767 432346 433537 435335 438196 441691 445435 449546 454009 458309 462020 465282
60348 465282 468414 471495 474567 477821 481197 484029 485442 485000 482837 479431 475496 471887 469202 467401
60334 467401 465917 464205 462157 460072 458242 456568 454634 452261 449799 447684 445806 443663 441101 438512
60320 438512 436174 433813 431165 428785 427856 429093 432089 435900 440117 445140 451455 459030 467626 477359
60306 477359 488519 500858 513586 526199 538927 552125 565480 578050 588791 596885 601880 603821
$$ packed form
60408C65222K631K242J579O85k16o97n13P1N77Q47J046J217J229J056R27J009
60392C78912J232J428J546J681J980K431K723K541K061J853K082K214J849J406
60378D05939J485J902J995J637J276J105R17P28Q65J340J744J826J637J166M66
60363D26028J21P11J770K137J579J191J798K861L495L744M111M463M300L711L262
60348D65282L132L081L072L254L376K832J413m42k163l406l935l609k685j801
60334D67401j484j712k048k085j830j674j934k373k462k115j878k143k562k589
60320D38512k338k361k648k380r29J237K996L811M217N023O315P575Q596R733
60306D77359J1160J2339J2728J2613J2728J3198J3355J2570J0741Q094M995J941
$$ plain form
60294 603821 603006 599335 592099 580758 565819 548823 531722 516321 503728 493788 485390 477847 471729
60281 471729 467886 465995 464712 463045 460924 458600 456221 454007 452125 450187 447509 444047 440551 437560
60267 437560 434771 431709 428623 426281 425073 424553 423838 422392 420525 419097 418625 418770 418830 418482 417785 416830
60251 416830 415833 415304 415532 416058 416269 416393 417240 419017 421124 423127 425184 427385 429382 430958 432239 433108
60235 433108 433082 432110 430917 430135 429678 429391 429721 431168 433400 435522 437041 438160 439319 440776 442547 444474
60219 444474 446497 448938 452258 456406 460731 464722 468499 472408 476542 480916 485733 491106 496819 502661
60205 502661 508760 515339 522342 529532 536708 543681 550267 556429 562181 567303 571524 575042 578385 581653
60191 581653 584339 586022 586720 586499 585366 583718 582123 580315 577162 572102 565951 559831 554000 548347 543231
$$ packed form
60294F03821q15l671p236j1341j4939j6996j7101j5401j2593r940q398p543o118
60281D71729l843j891j283j667k121k324k379k214j882j938k678l462l496k991
60267D37560k789l062l086k342j208n20p15j446j867j428m72J45O0l48o97r55
60251D16830r97n29K28N26K11J24Q47J777K107K003K057K201J997J576J281Q69
60235D33108k6r72j193p82m57k87L30J447K232K122J519J119J159J457J771J927
60219D44474K023K441L320M148M325L991L777L909M134M374M817N373N713N842
60205E02661O099O579P003P190P176O973O586O162N752N122M221L518L343L268
60191E81653K686J683O98k21j133j648j595j808l153n060o151o120n831n653n116
$$ plain form
60176 543231 538990 535128 530881 526269 521818 517620 513451 509557 506434 504012 501852 499964 498710 498014
60162 498014 497449 496990 496824 496553 495441 493539 491768 490827 490745 491495 493101 494962 496034 496141 496317 497379 498871
60145 498871 499937 500631 501704 503512 505814 508352 511055 513837 516769 520424 525542 532246 539821 547347
60131 547347 554326 560760 566862 572772 578417 583529 587834 591207 593713 595583 597141 598626 600064 601436
60117 601436 602957 604952 607380 609676 611248 612071 612710 613839 615782 618344 620917 622753 623282 622364 620320
60102 620320 617711 614969 612162 609127 605802 602329 598861 595499 592483 590180 588675 587522 586141 584415
60088 584415 582769 581758 581685 582432 583397 583736 582938 581212 579204 577428 576025 574873 573715 572335 570798 569347
60072 569347 567874 565721 562352 558035 553507 549119 544666 539906 534744 528934 522165 514633 507161 500524
$$ packed form
60176E43231m241l862m247m612m451m198m169l894l123k422k160j888j254o96
60162D98014n65m59j66k71j112j902j771r41q2P50J606J861J072J07J76J062J492
60145D98871J066O94J073J808K302K538K703K782K932L655N118O704P575P526
60131E47347O979O434O102N910N645N112M305L373K506J870J558J485J438J372
60117F01436J521J995K428K296J572Q23O39J129J943K562K573J836N29r18k044
60102F20320k609k742k807l035l325l473l468l362l016k303j505j153j381j726
60088E84415j646j011p3P47R65L39p98j726k008j776j403j152j158j380j537j451
60072E69347j473k153l369m317m528m388m453m760n162n810o769p532p472o637
$$ plain form
60058 500524 494884 490026 485830 482291 479230 476251 473019 469583 466476 464435 463866 464583 466187 468582 471863
60043 471863 475755 479605 483075 486553 490582 495052 499243 502637 505440 508223 511227 514187 516773 518965
60029 518965 520945 522768 524323 525462 525963 525424 523501 520175 515570 509576 502097 493658 485217 477094 468607
60014 468607 459191 449562 441230 434959 430162 425797 421478 417617 414766 412951 411587 409992 407927 405584
60000 405584 403177 400873 399118 398527 399158 400229 400860 400874 400691 400754 401385 402850 405218 408285 411833 415724
59984 415724 419605 422988 425890 428950 432471 435801 438061 439041 438940 437825 436006 434383 433528 432717 430818
59969 430818 427857 424847 422293 419933 417881 416830 416864 417110 416999 417028 417837 419298 420999 422972 425337 427727
59953 427727 429682 431293 433050 435286 437996 440785 442795 443227 442313 441317 441082 441032 440114 438359 436879 436479
$$ packed form
60058E00524n640m858m196l539l061k979l232l436l107k041n69P17J604K395L281
60043D71863L892L850L470L478M029M470M191L394K803K783L004K960K586K192
60029E18965J980J823J555J139N01n39j923l326m605n994p479q439q441q123q487
60014D68607r416r629q332o271m797m365m319l861k851j815j364j595k065k343
60000D05584k407k304j755n91O31J071O31J4j83O3O31J465K368L067L548L891
59984D15724L881L383K902L060L521L330K260R80j01j115j819j623q55q11j899
59969D30818k961l010k554k360k052j051L4K46j11K9Q09J461J701J973K365K390
59953D27727J955J611J757K236K710K789K010M32r14r96k35n0r18j755j480m00
$$ plain form
59937 436479 436880 437233 436924 435813 434115 432270 430770 429973 430097 431304 433590 436570 439511 441787 443489
59922 443489 445527 448896 453594 458433 462142 464428 465714 466217 465878 465020 464338 464044 463663 462896 462187 462143 462837
59905 462837 463998 465478 467189 468911 470540 472336 474597 477242 479944 482465 484621 486153 486984 487587 488842
59890 488842 491356 494919 498581 501413 503390 505449 508582 512973 518200 523914 529859 535577 540848 546341
59876 546341 553027 560751 568078 573837 578180 581776 584631 586297 586750 586495 585968 585293 584368 582842 580249
59861 580249 576625 572870 570154 568993 569078 569783 570624 571470 572634 574647 577727 581579 585796 590262 594982
59846 594982 599782 604314 608164 610828 611912 611510 610119 608059 605352 602398 600250 599738 600412 600723 599267
59831 599267 595827 591403 587324 584157 581421 578501 575647 573619 572505 571614 570583 569738 569066 567646 564721
$$ packed form
59937D36479M01L53l09j111j698j845j500p97J24J207K286K980K941K276J702
59922D43489K038L369M698M839L709K286J286N03l39q58o82k94l81p67p09m4O94
59905D62837J161J480J711J722J629J796K261K645K702K521K156J532Q31O03J255
59890D88842K514L563L662K832J977K059L133M391N227N714N945N718N271N493
59876E46341O686P724P327N759M343L596K855J666M53k55n27o75r25j526k593
59861E80249l624l755k716j161Q5P05Q41Q46J164K013L080L852M217M466M720
59846E94982M800M532L850K664J084m02j391k060k707k954k148n12O74L11j456
59831E99267l440m424m079l167k736k920k854k028j114q91j031q45o72j420k925
$$ plain form
59816 564721 560742 556648 552606 548177 543413 538960 535182 531826 528557 525321 522105 518809 515443 512202
59802 512202 509259 506601 504031 501256 498176 495123 492570 490525 488558 486500 484611 482918 480988 478717
59788 478717 476712 475401 474308 472832 471276 470359 470048 469656 468919 468259 467967 467814 467533 467206 467036 467095 467334
59771 467334 467600 467762 468125 469481 472336 476248 480333 484212 488021 491729 495075 498131 501299 504651 507720
59756 507720 510108 512046 514264 517454 521736 526457 530672 534086 537327 541137 545595 550437 555624 561106
59742 561106 566432 571249 575888 580803 585622 589439 591901 593371 594192 594564 595015 596130 597655 598534 598041
59727 598041 596377 594179 592060 590623 590167 590155 589633 588412 587293 586983 587411 588288 589561 590945 591676 591279
59711 591279 590119 588730 587026 584712 582119 580008 578704 577877 577081 576132 575034 573883 572888 572236 571900 571719
$$ packed form
59816E64721l979m094m042m429m764m453l778l356l269l236l216l296l366l241
59802E12202k943k658k570k775l080l053k553k045j967k058j889j693j930k271
59788D78717k005j311j093j476j556r17l11l92p37o60k92j53k81l27j70N9K39
59771D67334K66J62L63J356K855L912M085L879L809L708L346L056L168L352L069
59756E07720K388J938K218L190M282M721M215L414L241L810M458M842N187N482
59742E61106N326M817M639M915M819L817K462J470Q21L72M51J115J525Q79m93
59727E98041j664k198k119j437m56j2n22j221j119l10M28Q77J273J384P31l97
59711E91279j160j389j704k314k593k111j304q27p96r49j098j151r95o52l36j81
$$ plain form
59695 571719 571596 571516 571459 571452 571688 572453 573840 575509 576728 576865 575999 574963 574546 574727 574918 574812 574609 574439 573988
59676 573988 572898 571190 569079 566525 563216 558965 554057 549142 544693 540542 536134 531369 526928 523495
59662 523495 520866 518289 515519 513126 511799 511821 513195 515769 519045 522305 525194 527916 530734 533592 536480
59647 536480 539808 544016 548817 553097 555690 556233 555239 553350 550642 546790 541834 536439 531333 526774 522714
59632 522714 519088 515764 512608 509896 508181 507401 506604 505136 503593 502869 502619 501546 499075 495793 492294
59617 492294 488520 484399 480263 476301 472340 468470 465249 462944 461159 459547 458396 458144 458844 460372 462644
59602 462644 465266 467487 468920 469914 470893 471794 472517 473428 474920 476784 478456 479601 480168 480265 480405 481443
59586 481443 483667 486148 487531 487393 486448 485604 485274 485387 485506 484886 482967 480026 477106 475107 474059 473367
$$ packed form
59695E71719j23q0n7pK36P65J387J669J219J37q66j036m17J81J91j06k03j70m51
59676E73988j090j708k111k554l309m251m908m915m449m151m408m765m441l433
59662E23495k629k577k770k393j327K2J374K574L276L260K889K722K818K858K888
59647E36480L328M208M801M280K593N43r94j889k708l852m956n395n106m559m060
59632E22714l626l324l156k712j715p80p97j468j543p24k50j073k471l282l499
59617D92294l774m121m136l962l961l870l221k305j785j612j151k52P00J528K272
59602D62644K622K221J433R94R79R01P23R11J492J864J672J145N67R7J40J038
59586D81443K224K481J383j38r45q44l30J13J19o20j919k941k920j999j048o92
$$ plain form
59570 473367 472634 472077 472060 472364 472153 470904 469133 467867 467455 467327 466962 466572 466613 467024 467322 467176 466630 465891
59552 465891 465172 464673 464524 464813 465679 467274 469636 472818 477049 482405 488373 494227 500040 506881 515725
59537 515725 526527 538630 551836 566601 583110 600118 614660 623149 623498 616625 605799 594390
59525 594390 584261 575956 569594 565255 562966 562716 564241 566704 569017 570741 572252 573808 574868 574627
59511 574627 572801 569582 565178 559754 553534 546689 539397 532152 525579 519723 514009 508170 502689 498008
59497 498008 493883 489979 486549 483935 481874 479878 477901 476104 474448 473111 472774 473677 474846 475164 474919
59482 474919 475321 476717 478340 479837 481866 484901 488450 491973 495703 499927 504030 507092 509137 511206
59468 511206 514205 518012 521652 524140 525262 525771 526728 528542 530765 532841 534729 536645 538551 540294 542108
$$ packed form
59570D73367p33n57j7L04k11j249j771j266m12j28l65l90M1M11K98j46n46p39
59552D65891p19m99j49K89Q66J595K362L182M231N356N968N854N813O841Q844
59537E15725J0802J2103J3206J4765J6509J7008J4542Q489L49o873j0826j1409
59525E94390j0129q305o362m339k289k50J525K463K313J724J511J556J060k41
59511E74627j826l219m404n424o220o845p292p245o573n856n714n839n481m681
59497D98008m125l904l430k614k061j996j977j797j656j337l37R03J169L18k45
59482D74919M02J396J623J497K029L035L549L523L730M224M103L062K045K069
59468E11206K999L807L640K488J122N09R57J814K223K076J888J916J906J743J814
$$ plain form
59453 542108 544607 548268 553077 558710 564921 571708 579081 586669 593591 598960 602557 604834 606136 606170 604440
59438 604440 601031 596553 591407 585515 578905 572208 566255 561436 557780 555461 554639 554776 554695 553812 553019 553954
59422 553954 557498 563297 570605 579211 589505 602005 617001 634497 654439 676853 701508 727426
59410 727426 753201 778080 802119 824616 842857 853429 854954 848978 838423 826059 814359 805353
59398 805353 799733 796811 795973 797436 800724 802981 800034 789365 771691 749907 727208 706064 687914
59385 687914 673065 660914 650586 641487 633430 626468 620706 616187 612880 610615 608944 607264 605375
59372 605375 603830 603374 604042 605155 606141 606855 607199 607059 606753 606872 607482 608135 608823 610173 612391 614869 617291
59355 617291 620324 624592 629774 635486 642360 651234 661746 672717 683667 695085 707453 720885 735484
$$ packed form
59453E42108K499L661M809N633O211O787P373P588O922N369L597K277J302L4j730
59438F04440l409m478n146n892o610o697n953m819l656k319q22J37q1q83p93R35
59422E53954L544N799P308Q606J0294J2500J4996J7496J9942K2414K4655K5918
59410G27426K5775K4879K4039K2497J8241J0572J525n976j0555j2364j1700r006
59398H05353n620k922q38J463L288K257k947j0669j7674k1784k2699k1144j8150
59385F87914j4849j2151j0328r099q057o962n762m519l307k265j671j680j889
59372F05375j545m56O68J113R86P14L44j40l06J19O10O53O88J350K218K478K422
59355F17291L033M268N182N712O874Q874J0512J0971J0950J1418J2368J3432J4599
$$ plain form
59342 735484 751114 766863 781582 794960 807295 818375 827494 834622 840571 845686 849116 849721 847125
59329 847125 841603 833535 823330 811431 798064 783206 767054 750273 733736 718219 704278 692056
59317 692056 681192 671179 661743 652666 643587 634492 626124 619190 613368 607854 602913 599998 600204 603279
59303 603279 608350 614850 622341 630197 638044 646059 654190 661157 664584 662232 653266 638871 621833 605090
59289 605090 590194 577076 565160 554385 545182 537957 532823 529561 527685 526766 526724 527641 529399 531896
59275 531896 535455 540485 546688 553214 559749 566959 575664 586036 597757 610397 623318 635671 646941
59262 646941 657280 666968 675788 683142 688553 691805 692804 691589 688437 683888 678689 673576 668810 664035
59248 664035 658955 654112 650548 648642 647741 647012 646185 645363 644656 644324 644862 646673 649819 654166 659348 664551
$$ packed form
59342G35484J5630J5749J4719J3378J2335J1080R119P128N949N115L430O05k596
59329H47125n522q068j0205j1899j3367j4858j6152j6781j6537j5517j3941j2222
59317F92056j0864j0013r436r077r079r095q368o934n822n514m941k915K06L075
59303F03279N071O500P491P856P847Q015Q131O967L427k352q966j4395j7038j6743
59289F05090j4896j3118j1916j0775r203p225n134l262j876r19m2R17J758K497
59275E31896L559N030O203O526O535P210Q705J0372J1721J2640J2921J2353J1270
59262F46941J0339R688Q820P354N411L252R99j215l152m549n199n113m766m775
59248F64035n080m843l564j906r01p29q27q22p07l32N38J811L146M347N182N203
$$ plain form
59232 664551 668908 672372 675668 679073 681754 682747 682090 680401 677659 673113 666374 658084 649358 640874 632593
59217 632593 624127 615203 605843 596259 586728 577686 569774 563451 558520 554279 550197 546223 542461 538929
59203 538929 535790 533449 532145 531631 531425 531237 531019 530760 530487 530417 530981 532609 535347 538612 541511 543689
59187 543689 545672 548112 550887 553387 555523 557903 560973 564540 568306 572309 576578 580722 584191 586741
59173 586741 588501 589815 591133 592791 594756 596740 598616 600474 602317 604005 605516 606986 608481 609967
59159 609967 611363 612317 612137 610467 607829 604935 601634 597255 591790 585851 579450 571901 563204 554528 546829
59144 546829 539831 532902 526151 520008 514410 509083 504053 499238 494163 488841 484369 481739 480445 479108
59130 479108 477171 475099 473111 470839 468372 466743 467000 469216 472677 476657 480911 485698 491404 497911
$$ packed form
59232F64551M357L464L296L405K681R93o57j689k742m546o739q290q726q484q281
59217F32593q466q924r360r584r531r042p912o323m931m241m082l974l762l532
59203E38929l139k341j304n14k06j88k18k59k73p0N64J628K738L265K899K178
59187E43689J983K440K775K500K136K380L070L567L766M003M269M144L469K550
59173E86741J760J314J318J658J965J984J876J858J843J688J511J470J495J486
59159F09967J396R54j80j670k638k894l301m379n465n939o401p549q697q676p699
59144E46829o998o929o751o143n598n327n030m815n075n322m472k630j294j337
59130D79108j937k072j988k272k467j629K57K216L461L980M254M787N706O507
$$ plain form
59116 497911 504485 510647 516931 524199 532316 540129 546944 553397 560584 568796 577437 585760 593213 599330
59102 599330 603898 607363 610653 614350 618111 621054 622615 622920 622483 621833 621390 621248 620901 619548 617027 614214
59086 614214 612096 610633 609035 606952 604787 602781 600492 597446 593800 590025 586241 582154 577423 571892
59072 571892 565735 559521 553875 548955 544512 540483 537109 534396 531942 529498 527266 525415 523746 522078
59058 522078 520539 519166 517563 515326 512604 510019 508263 507711 508007 508003 506719 504583 503061 502818 502989 502666
59042 502666 502268 502714 503897 504910 505433 505972 506865 507828 508535 508980 509150 508844 508020 507034 506513 507107 509196 512614
59024 512614 516860 521792 527857 535400 544101 553491 563642 574800 586578 598030 608443 617545 625071
59011 625071 630586 633853 635106 634969 634196 633298 632159 630315 627807 625424 623816 622812 622083 622067 623613 626869
$$ packed form
59116D97911O574O162O284P268Q117P813O815O453P187Q212Q641Q323P453O117
59102E99330M568L465L290L697L761K943J561L05m37o50m43j42l47j353k521k813
59086F14214k118j463j598k083k165k006k289l046l646l775l784m087m731n531
59072E71892o157o214n646m920m443m029l374k713k454k444k232j851j669j668
59058E22078j539j373j603k237k722k585j756n52K96mj284k136j522k43J71l23
59042E02666l98M46J183J013N23N39Q93R63P07M45J70l06q24r86n21N94K089L418
59024E12614M246M932O065P543Q701R390J0151J1158J1778J1452J0413R102P526
59011F25071N515L267J253j37p73q98j139j844k508k383j608j004p29j6J546L256
$$ plain form
58995 626869 631136 635745 640513 645330 649760 653246 655527 656805 657596 658292 658825 658928 658756 658772 658965 658710
58979 658710 657715 656560 655997 656303 657725 660846 665833 671858 678050 684651 692481 701674 711724 722462
58965 722462 734081 746346 758652 770831 783133 795454 807316 818554 829200 838612 845527 849302
58953 849302 850536 850218 848649 845351 839703 831500 821100 808998 795239 779606 762677 746128 731337
58940 731337 718123 705579 693773 683700 675746 669193 663294 657947 653236 649140 645857 643635 642138
58927 642138 640709 639416 639019 639695 640597 640963 640878 640561 639673 637966 636017 634680 634128 633894 633567 633032 632280
58910 632280 631389 630593 630109 630069 630709 632373 635225 639282 644827 652333 661710 672000 682211 692292 702999
58895 702999 714860 727485 739942 751755 763456 775970 789444 803089 816479 830598 846953
$$ packed form
58995F26869M267M609M768M817M430L486K281J278P91O96N33J03j72J6J93k55
58979F58710r95j155n63L06J422L121M987O025O192O601P830R193J0050J0738
58965G22462J1619J2265J2306J2179J2302J2321J1862J1238J0646R412O915L775
58953H49302J234l18j569l298n648q203j0400j2102j3759j5633j6929j6549j4791
58940G31337j3214j2544j1806j0073p954o553n899n347m711m096l283k222j497
58927F42138j429j293l97O76R02L66q5l17q88j707j949j337n52k34l27n35p52
58910F32280q91p96m84m0O40J664K852M057N545P506R377J0290J0211J0081J0707
58895G02999J1861J2625J2457J1813J1701J2514J3474J3645J3390J4119J6355
$$ plain form
58884 846953 865798 885859 905753 925062 943847 961705 977563 990189 998874 1003951 1006550 1007408
58872 1007408 1005920 1000913 992266 981168 968740 955182 940568 925746 911901 899602 888729 879070
58860 879070 870543 862942 855853 848833 841575 833909 825709 816825 807152 796834 786264 775730 765240
58847 765240 754814 744690 734982 725512 716325 708014 701008 694786 688367 681297 673636 665302 656295 647412
58833 647412 639806 633643 627858 621424 614268 606928 599988 594055 589654 586812 585119 584282 584264 584990 586428
58818 586428 588927 592853 597889 603272 608656 614090 619238 623489 626934 630377 634206 637958 641131 643595
58804 643595 645040 644970 643582 641800 640000 637484 633645 628890 623902 618747 613340 608065 603179 598092 592004
58789 592004 585012 577978 571529 565687 560338 555655 552167 550509 550870 552538 554410 556114 558157 560817
$$ packed form
58884H46953J8845K0061J9894J9309J8785J7858J5858J2626Q685N077K599Q58
58872A007408j488n007q647j1098j2428j3558j4614j4822j3845j2299j0873r659
58860H79070q527p601p089p020p258p666q200q884r673j0318j0570j0534j0490
58847G65240j0426j0124r708r470r187q311p006o222o419p070p661q334r007q883
58833F47412p606o163n785o434p156p340o940n933m401k842j693q37j8P26J438
58818E86428K499L926N036N383N384N434N148M251L445L443L829L752L173K464
58804F43595J445p0j388j782j800k516l839m755m988n155n407n275m886n087o088
58789E92004o992p034o449n842n349m683l488j658L61J668J872J704K043K660
$$ plain form
58775 560817 563510 565590 567201 568850 570530 571749 572067 571179 568757 564681 559308 553269 547071 540968 535014
58760 535014 529190 523762 519387 516475 514513 512643 510824 509789 509878 510722 512176 514607 517910 521094 523332
58745 523332 524771 525897 526843 527763 529206 531492 534278 537295 540971 545762 551291 556667 561336 565304 568959
58730 568959 573032 578236 584566 591269 597725 603853 609583 614664 619303 624217 629685 635250 640662 646250
58716 646250 652017 657350 662200 667620 674477 682511 691314 701189 712045 722383 730510 736123 739660 740796
58702 740796 738841 734077 727395 718867 707946 694905 680835 666184 650362 632999 614791 596918
58690 596918 580260 565182 551507 538799 527176 517526 510275 504301 498021 491332 485473 481073 477419
58677 477419 473805 470589 468430 467236 466379 465517 464822 464689 465486 467362 470134 473531 477569 482629 489224
$$ packed form
58775E60817K693K080J611J649J680J219L18q88k422m076n373o039o198o103n954
58760E35014n824n428m375k912j962j870j819j035Q9Q44J454K431L303L184K238
58745E23332J439J126R46R20J443K286K786L017L676M791N529N376M669L968L655
58730E68959M073N204O330O703O456O128N730N081M639M914N468N565N412N588
58716F46250N767N333M850N420O857Q034Q803R875J0856J0338Q127N613L537J136
58702G40796j955m764o682q528j0921j3041j4070j4651j5822j7363j8208j7873
58690E96918j6658j5078j3675j2708j1623r650p251n974o280o689n859m400l654
58677D77419l614l216k159j194q57q62o95j33P97J876K772L397M038N060O595
$$ plain form
58662 489224 497721 507977 519090 529834 539576 548314 555640 560345 561609 560043 556920 552868 548027
58649 548027 542927 538172 533454 527859 521246 514623 509123 505152 502505 500680 499062 497366 495920 495162
58635 495162 495000 495109 495553 496502 497568 498126 498195 498349 498766 498992 498618 497614 496009 493759 490964 487803 484431
58618 484431 481369 479719 480277 482529 485235 487993 491612 496933 503938 512071 520726 529170 536499 542104
58604 542104 545999 548578 550201 551009 550999 550283 549296 548512 547798 546409 543843 540398 536652 532836 529098 525943
58588 525943 523958 523404 524352 526789 530277 534121 538367 543974 551443 559932 568475 577400 587540 598533
58574 598533 608948 617930 625764 632963 639738 646363 653309 660893 669333 679071 690615 704291 720526
58561 720526 739872 762090 785674 809116 832297 855905 879877 903250 925113 944690 960758
$$ packed form
58662D89224Q497J0256J1113J0744R742Q738P326M705J264j566l123m052m841
58649E48027n100m755m718n595o613o623n500l971k647j825j618j696j446p58
58635D95162j62J09M44R49J066N58O9J54M17K26l74j004j605k250k795l161l372
58618D84431l062j650N58K252K706K758L619N321P005Q133Q655Q444P329N605
58604E42104L895K579J623Q08j0p16r87p84p14j389k566l445l746l816l738l155
58588E25943j985n54R48K437L488L844M246N607P469Q489Q543Q925J0140J0993
58574E98533J0415Q982P834P199O775O625O946P584Q440R738J1544J3676J6235
58561G20526J9346K2218K3584K3442K3181K3608K3972K3373K1863J9577J6068
$$ plain form
58550 960758 972081 978442 980529 979026 974605 968485 961907 955115 947646 939468 930945 921895 911692 900204
58536 900204 887743 874160 858907 841942 823738 804574 784726 765211 747339 731595 717829
58525 717829 706336 697681 691479 686423 681582 676822 672075 667293 663065 660166 658385 656722 654770 652875
58511 652875 650996 648538 645439 642335 639511 636686 633931 631719 629953 628008 625877 624175 622817 620870
58497 620870 618048 615328 613720 613277 613549 614086 614297 613776 613026 612984 613755 614770 616239 619208 623954 629569
58481 629569 635485 642261 650407 659550 669340 680155 692349 705615 719556 733999 748271 760983
58469 760983 770958 777711 780845 780025 775912 770145 763878 757102 749720 742329 735553 729572 724797 722131
58455 722131 722093 724437 729006 736059 745339 755694 766100 776288 785923 794026 799670 802610 802846 800311
$$ packed form
58550I60758J1323O361K087j503m421o120o578o792p469q178q523r050j0203j1488
58536I00204j2461j3583j5253j6965j8204j9164j9848j9515j7872j5744j3766
58525G17829j1493q655o202n056m841m760m747m782m228k899j781j663j952j895
58511F52875j879k458l099l104k824k825k755k212j766j945k131j702j358j947
58497F20870k822k720j608m43K72N37K11n21p50m2P71J015J469K969M746N615
58481F29569N916O776Q146R143R790J0815J2194J3266J3941J4443J4272J2712
58469G60983R975O753L134q20m113n767o267o776p382p391o776n981m775k666
58455G22131l8K344M569P053R280J0355J0406J0188R635Q103N644K940K36k535
$$ plain form
58441 800311 795282 788434 780245 771064 761787 753531 746487 740123 734592 730776 728689 727163 725608 724883
58427 724883 725828 728080 731074 735157 740901 748038 755830 763855 771835 779267 785626 790439 793011 792819 790364
58412 790364 786795 782511 777005 770183 762841 755657 748724 742262 736646 731451 725646 719102 712933 708054
58398 708054 704424 701865 700477 700030 700110 701042 703469 706898 710024 712594 715465 718656 720960 721842 722057 722060
58382 722060 721558 721100 722291 725600 729665 733542 738070 744219 751691 759925 768886 778022 786051 792739 799369
58367 799369 806714 814111 821300 829371 838942 849150 859410 870349 881973 892872 902546 912650 924421
58354 924421 936611 947481 957127 966197 973940 979391 983279 986959 990478 993179 995269 997398 999677 1002298
58340 1002298 1006072 1011247 1016944 1022764 1029602 1037975 1047123 1056790 1068086 1081348 1094963 1107743 1120700
$$ packed form
58441H00311n029o848q189r181r277q256p044o364n531l816k087j526j555p25
58427G24883R45K252K994M083N744P137P792Q025P980P432O359M813K572j92k455
58412G90364l569m284n506o822p342p184o933o462n616n195n805o544o169m879
58398G08054l630k559j388m47Q0R32K427L429L126K570K871L191K304Q82K15L
58382G22060n02m58J191L309M065L877M528O149P472Q234Q961R136Q029O688O630
58367G99369P345P397P189Q071R571J0208J0260J0939J1624J0899R674J0104J1771
58354I24421J2190J0870R646R070P743N451L888L680L519K701K090K129K279K621
58340A002298L774N175N697N820O838Q373R148R667J1296J3262J3615J2780J2957
$$ plain form
58327 1120700 1134936 1149600 1163539 1177189 1191003 1203678 1213781 1221697 1228324 1233440 1237043 1240572
58315 1240572 1244980 1249273 1252777 1257027 1263473 1271138 1278700 1287102 1297768 1309900 1321877 1333880 1346846
58302 1346846 1360348 1373790 1388167 1404294 1420844 1436486 1452323 1469688 1487166 1502610 1516767
58291 1516767 1532135 1549434 1567852 1587524 1608995 1631280 1653111 1675129 1698471 1722445 1746042
58280 1746042 1770389 1797036 1825179 1853373 1882627 1914878 1949527 1984380 2019135 2055233 2093344
58269 2093344 2133483 2176404 2222246 2269064 2315280 2362250 2412050 2464505 2519024 2577318 2641112
58258 2641112 2708906 2778094 2848524 2920901 2993715 3065132 3136061 3208021 3280038 3351045 3423111
58247 3423111 3498669 3576893 3656683 3740660 3831977 3929683 4031700 4139915 4257663 4384616
$$ packed form
58327A120700J4236J4664J3939J3650J3814J2675J0103P916O627N116L603L529
58315A240572M408M293L504M250O446P665P562Q402J0666J2132J1977J2003J2966
58302A346846J3502J3442J4377J6127J6550J5642J5837J7365J7478J5444J4157
58291A516767J5368J7299J8418J9672K1471K2285K1831K2018K3342K3974K3597
58280A746042K4347K6647K8143K8194K9254L2251L4649L4853L4755L6098L8111
58269B093344M0139M2921M5842M6818M6216M6970M9800N2455N4519N8294O3794
58258B641112O7794O9188P0430P2377P2814P1417P0929P1960P2017P1007P2066
58247C423111P5558P8224P9790Q3977R1317R7706J02017J08215J17748J26953
$$ plain form
58237 4384616 4519106 4662981 4818998 4985738 5160441 5344636 5541729 5751523 5972587
58228 5972587 6207308 6458862 6726134 7007760 7308154 7633149 7983044 8356850 8759830
58219 8759830 9199291 9676573 10191480 10751017 11365029 12036971 12768633 13570605 14458251
58210 14458251 15441299 16528291 17737854 19094789 20619881 22336659 24284873 26515689
58202 26515689 29080841 32043950 35500039 39571023 44392305 50127933 56999722 65289213
58194 65289213 75324892 87490096 102222120 119951521 141013438 165584484 193596731
58187 193596731 224587485 257641781 291593359 325247203 357131556 384817631 404678952
58180 404678952 412877621 407162129 388093196 358765971 323416721 286010306 249496960
$$ packed form
58237D384616J34490J43875J56017J66740J74703J84195J97093K09794K21064
58228E972587K34721K51554K67272K81626L00394L24995L49895L73806M02980
58219H759830M39461M77282N14907N59537O14012O71942P31662Q01972Q87646
58210A4458251R83048J086992J209563J356935J525092J716778J948214K230816
58202B6515689K565152K963109L456089M070984M821282N735628O871789Q289491
58194F5289213J0035679J2165204J4732024J7729401K1061917K4571046K8012247
58187A93596731L0990754L3054296L3951578L3653844L1884353K7686075J9861321
58180D04678952Q198669n715492j9068933k9327225l5349250l7406415l6513346
$$ plain form
58173 249496960 215698357 185505705 159173725 136592710 117462241 101375761 87885877
58166 87885877 76571117 67066662 59055627 52264279 46473052 41513005 37243648 33543193
58158 33543193 30316470 27493122 25012118 22817548 20868066 19135825 17592974 16209366
58150 16209366 14963801 13845603 12842962 11939539 11123581 10389946 9730859 9133587 8589219
58141 8589219 8095278 7647597 7237295 6857574 6506228 6179781 5872148 5580971 5308918
58132 5308918 5057031 4822434 4603512 4401341 4214827 4040120 3875855 3723546 3582094
58123 3582094 3447501 3318830 3198738 3087125 2979842 2874946 2774848 2680970 2591367 2505110
58113 2505110 2424144 2349196 2278310 2210761 2148104 2090174 2034388 1980151 1929662 1883142 1837581
$$ packed form
58173B49496960l3798603l0192652k6331980k2581015j9130469j6086480j3489884
58166H7885877j1314760r504455q011035o791348n791227m960047m269357l700455
58158C3543193l226723k823348k481004k194570j949482j732241j542851j383608
58150A6209366j245565j118198j002641r03423q15958p33635o59087n97272n44368
58141H589219m93941m47681m10302l79721l51346l26447l07633k91177k72053
58132E308918k51887k34597k18922k02171j86514j74707j64265j52309j41452
58123C582094j34593j28671j20092j11613j07283j04896j00098r3878q9603q6257
58113B505110q0966p4948p0886o7549o2657n7930n5786n4237n0489m6520m5561
$$ plain form
58102 1837581 1791501 1746779 1704407 1662643 1620851 1581107 1544285 1508369 1472329 1438051 1406696
58091 1406696 1376621 1346698 1318480 1293271 1270035 1247759 1227040 1207823 1188471 1168534 1149660
58080 1149660 1132340 1114505 1094792 1074570 1055330 1036599 1017776 999469 981706 963230 943847
58069 943847 925184 908011 891207 874370 858883 845251 831963 818232 805397 794414 784392
58058 784392 774785 766517 759603 752137 743009 733275 723517 712403 699397 686472 675350 665262 655105
58045 655105 645630 637676 630283 622533 615513 610472 606541 602032 596675 591021 585021 578700 572878 567738
58031 567738 561994 554789 547146 540160 533132 524863 515577 506183 496760 487091 477603 468678 460045 451867
58017 451867 445157 440099 435258 429587 423979 419723 416621 413733 410778 407682 403989 399863 396541 394600
$$ packed form
58102A837581m6080m4722m2372m1764m1792l9744l6822l5916l6040l4278l1355
58091A406696l0075k9923k8218k5209k3236k2276k0719j9217j9352j9937j8874
58080A149660j7320j7835j9713k0222j9240j8731j8823j8307j7763j8476j9383
58069I43847j8663j7173j6804j6837j5487j3632j3288j3731j2835j0983j0022
58058G84392r607q268o914p466r128r734r758j1114j3006j2925j1122j0088j0157
58045F55105r475p954p393p750p020n041l931m509n357n654o000o321n822n140
58031E67738n744p205p643o986p028q269r286r394r423r669r488q925q633q178
58017D51867o710n058m841n671n608m256l102k888k955l096l693m126l322j941
$$ plain form
58003 394600 392907 390421 387897 386596 386305 385768 384241 381626 378089 374531 372489 372557 373747 375118 376933
57988 376933 379429 381736 383069 383876 384799 385502 385498 385067 384436 383145 381095 379074 377305 374700 370585 365945
57972 365945 361913 358320 354815 352111 350678 349406 347056 344164 342139 341332 341300 342110 343890 345806 346909
57957 346909 347525 348568 349934 350683 350334 349023 346871 344166 341624 339603 337578 335133 332769 331033 329691
57942 329691 328539 328063 328414 328752 328709 329513 332478 337201 342449 348010 354374 361315 368135 374793 381515 387677
57926 387677 392209 394795 395731 395049 392650 388812 383761 377338 369843 362403 355581 348415 339917 330745 322328
57911 322328 315116 308873 303954 300963 299622 299135 299215 299789 300340 300633 301383 303014 304479 304567 303713 303147 302879
57894 302879 302067 300884 300392 300779 301250 301573 302390 303968 305914 308139 310997 314435 317971 321432 324856 327879
$$ packed form
58003C94600j693k486k524j301k91n37j527k615l537l558k042O8J190J371J815
57988C76933K496K307J333Q07R23P03mm31o31j291k050k021j769k605m115m640
57972C65945m032l593l505k704j433j272k350k892k025q07l2Q10J780J916J103
57957C46909O16J043J366P49l49j311k152k705k542k021k025k445k364j736j342
57942C29691j152m76L51L38m3Q04K965M723N248N561O364O941O820O658O722O162
57926C87677M532K586R36o82k399l838n051o423p495p440o822p166q498r172q417
57911C22328p212o243m919k991j341m87Q0N74N51K93P50J631J465Q8q54n66k68
57894C02879q12j183m92L87M71L23Q17J578J946K225K858L438L536L461L424L023
$$ plain form
57878 327879 330122 331867 333451 334422 334348 333934 334060 334126 332768 329957 326963 324352 321479 317992 314423 311140
57862 311140 308007 305257 303533 302768 302170 301490 301217 301419 301593 302006 303896 307783 312540 316706 319920 322573
57846 322573 324870 326835 328657 330446 331960 332909 333259 333095 332612 332235 332255 332309 331744 330587 329571 329116 328848
57829 328848 328297 327604 327320 327826 329082 330715 332302 333734 335223 336848 338431 340017 341985 344282 346030
57814 346030 346365 345233 342881 339083 333529 326529 318644 310063 300964 292041 283907 276376 269025 262011
57800 262011 255608 249512 243459 238013 233751 230228 226776 223805 222088 221156 219732 217612 215797 214811 214128
57785 214128 213387 212988 213249 213980 215061 216620 218508 220450 222763 226104 230459 235192 240058 245309 250857
57770 250857 256250 261439 266677 271651 275571 278076 279274 279129 277771 276178 275367 275073 274365 273468 273610 275076
$$ packed form
57878C27879K243J745J584R71p4m14J26O6j358k811k994k611k873l487l569l283
57862C11140l133k750j724p65n98o80k73K02J74M13J890L887M757M166L214K653
57846C22573K297J965J822J789J514R49L50j64m83l77K0N4n65j157j016m55k68
57829C28848n51o93k84N06J256J633J587J432J489J625J583J586J968K297J748
57814C46030L35j132k352l798n554p000p885q581r099q923q134p531p351p014
57800B62011o403o096o053n446m262l523l452k971j717r32j424k120j815r86o83
57785B14128p41l99K61P31J081J559J888J942K313L341M355M733M866N251N548
57770B50857N393N189N238M974L920K505J198j45j358j593q11k94p08q97J42J466
$$ plain form
57754 275076 276883 278612 281060 284599 288207 290795 292407 293515 294118 294224 294324 294692 294851 294227 292759 290527
57738 290527 287478 283854 280211 276720 273083 269310 265830 262710 259606 256652 254479 253166 252169 251493 251850
57723 251850 253289 254752 255443 255634 255627 255050 253817 252790 252679 253078 253284 253321 253443 253375 252832 252185 251860 251622 251080
57704 251080 250477 250282 250430 250518 250387 250047 249386 248369 247180 245862 244239 242376 240643 239149 237654 236183
57688 236183 235007 233863 232052 229555 227225 225479 223771 221771 220142 219575 219887 220758 222571 225870 230715
57673 230715 237288 246518 259347 275936 296200 320544 349372 382318 418556 457323 497338 535878
57661 535878 568705 590740 597200 585691 558263 520782 479436 438080 398776 363265 332596 306276
57649 306276 283252 263499 247601 235209 225015 216123 208491 202148 196899 192753 189874 187966 186282
$$ packed form
57754B75076J807J729K448L539L608K588J612J108O03J06J00L68J59o24j468k232
57738B90527l049l624l643l491l637l773l480l120l104k954k173j313r97o76L57
57723B51850J439J463O91J91pn77j233j027j11L99K06L7J22o8n43o47l25k38n42
57704B51080o03j95J48Q8j31l40o61j017j189j318j623j863j733j494j495j471
57688B36183j176j144j811k497k330j746j708k000j629n67L12Q71J813L299M845
57673B30715O573R230J2829J6589K0264K4344K8828L2946L6238L8767M0015L8540
57661E35878L2827K2035O460j1509k7428l7481m1346m1356l9304l5511l0669k6320
57649C06276k3024j9753j5898j2392j0194q892p632o343n249m146k879j908j684
$$ plain form
57636 186282 184306 182066 179859 178013 176744 175942 175328 174949 175086 175507 175428 174540 173424 172553 171641 170499 169689
57619 169689 169550 169270 167843 165450 163062 161102 159360 157847 156820 156126 155209 153697 151545 148978 146725
57604 146725 145717 145987 146364 145858 144758 143759 142788 141568 140585 140407 140507 139926 138706 137575 136471 134572
57588 134572 131656 128438 125587 123265 121492 120089 118445 116222 114141 113130 112896 112299 111008 109744 108922
57573 108922 108100 106870 105359 103754 102144 100893 100333 100026 99100 97340 95202 92875 90285 87928 86627
57558 86627 86303 85942 84996 83870 82834 81452 79443 77266 75461 74105 73251 73199 73998 75262 76714 78313
57542 78313 79735 80478 80707 81345 83048 85676 88851 92273 95356 97399 98447 99270 100244 100995 101381 101910
57526 101910 102770 103329 103158 102828 103093 103939 104994 106221 107556 108423 108366 107761 107263 106899 106306 105565 105088 104837
$$ packed form
57636A86282j976k240k207j846j269q02o14l79J37M21p9q88j116q71r12j142q10
57619A69689j39k80j427k393k388j960j742j513j027o94r17j512k152k567k253
57604A46725j008K70L77n06j100r99r71j220r83j78J00n81j220j131j104j899
57588A34572k916l218k851k322j773j403j644k223k081j011k34n97j291j264q22
57573A08922q22j230j511j605j610j251n60l07r26j760k138k327k590k357j301
57558H6627l24l61r46j126j036j382k009k177j805j356q54n2P99J264J452J599
57542G8313J422P43K29O38J703K628L175L422L083K043J048Q23R74P51L86N29
57526A01910Q60N59j71l30K65Q46J055J227J335Q67n7o05m98l64n93p41m77k51
$$ plain form
57508 104837 104252 102983 101270 99648 98517 97919 97499 96772 95561 93981 91964 89172 85609 81959 79053
57493 79053 77200 76181 75561 74805 73524 71954 70932 71059 72048 73056 73409 72863 71502 69699 67921 66345
57477 66345 64868 63634 63159 63674 64649 65280 65199 64451 63078 61149 59062 57452 56759 56967 57655 58244 58412
57460 58412 58402 58770 59753 61083 62427 63673 64678 65135 64945 64433 64048 64040 64505 65375 66180 66205 65230 63892 63035
57441 63035 62896 63054 62940 62207 60937 59753 59470 60306 61585 62407 62389 61589 60139 58423 57322 57622 59108
57424 59108 60740 61925 63189 65206 67475 68464 67216 64397 61463 59181 57442 56325 56454 57988 59931
57409 59931 61067 61226 61080 61029 60937 60755 60624 60415 59816 58869 57804 56433 54444 52335 51148 51067 51073 50362 49344
57390 49344 48740 48487 48175 47981 48360 49153 49775 50160 50825 52035 53486 54839 56026 56904 57144 56737 56281 56398
$$ packed form
57508A04837n85j269j713j622j131n98m20p27j211j580k017k792l563l650k906
57493G9053j853j019o20p56j281j570j022J27R89J008L53n46j361j803j778j576
57477F6345j477j234m75N15R75O31q1p48j373j929k087j610o93K08O88N89J68
57460E8412j0L68R83J330J344J246J005M57j90n12l85qM65Q70Q05K5r75j338q57
57441F3035j39J58j14p33j270j184k83Q36J279Q22j8q00j450j716j101L00J486
57424E9108J632J185J264K017K269R89j248k819k934k282j739j117J29J534J943
57409E9931J136J59j46n1r2j82j31k09n99r47j065j371j989k109j187q1Op11j018
57390D9344o04k53l12j94L79P93O22L85O65J210J451J353J187Q78K40m07m56J17
$$ plain form
57372 56398 56964 57260 56902 56385 56453 57081 57403 56721 55260 53750 52597 51840 51570 51869 52445 52865 53171 53761
57354 53761 54631 55219 55118 54557 54067 54123 55122 57186 59763 61884 63044 63488 63495 62884 61573 60160 59506 59849
57336 59849 60631 61110 60985 60526 60137 59773 58917 57425 56101 55944 56916 58012 58466 58255 57479 56063 54313
57319 54313 52996 52467 52329 52265 52567 53384 54106 54077 53501 53076 53010 52917 52432 51532 50451 49547 49058 48753 48179 47337
57299 47337 46724 46530 46393 46207 46429 47154 47607 47231 46745 47356 49244 51558 53655 55650 57855 60296 62772
57282 62772 65024 66985 69120 72175 76174 80061 82897 85020 87399 90172 92629 94428 95975 97524
57268 97524 98652 98875 98302 97461 96830 96595 96539 96113 94945 93306 91824 90747 89777 88584 87139 85567 83937
57251 83937 82289 80720 79444 78806 78984 79581 79800 79297 78577 78302 78531 78943 79479 80349 81660 83457 85836
$$ packed form
57372E6398N66K96l58n17O8O28L22o82j461j510j153p57k70K99N76M20L06N90
57354E3761Q70N88j01n61m90N6R99K064K577K121J160M44Po11j311j413o54L43
57336E9849P82M79j25m59l89l64q56j492j324j57R72J096M54k11p76j416j750
57319E4313j317n29j38o4L02Q17P22k9n76m25o6r3m85r00j081r04m89l05n74q42
57299D7337o13j94j37j86K22P25M53l76m86O11J888K314K097J995K205K441K476
57282F2772K252J961K135L055L999L887K836K123K379K773K457J799J547J549
57268I7524J128K23n73q41o31k35n6m26j168j639j482j077r70j193j445j572j630
57251H3937j648j569j276o38J78N97K19n03p20k75K29M12N36Q70J311J797K379
$$ plain form
57234 85836 88584 90970 92447 93420 94867 97324 100602 104286 108003 111371 114251 117073 120450 124451 128487
57219 128487 131863 134196 135604 136851 139113 143088 148393 154098 159571 164518 168640 171941 175190 179407
57205 179407 184882 191109 197548 203959 210213 216327 222606 229289 236217 243345 251281 260597 270704 280137
57191 280137 288015 294614 300537 306045 311326 316773 322657 328903 335358 342082 349425 358030 368564 381049
57177 381049 394736 409152 424874 442597 461724 480812 499346 518183 538116 558802 579185
57166 579185 598195 614866 628681 640215 650863 661598 672419 683074 693621 704068 714180
57155 714180 723980 733893 744142 754587 765339 776866 789124 801166 811983 821281 829191 835754
57143 835754 840994 845028 847847 849492 850670 852628 856120 860894 866279 871664 876356 879783 882154 884219
$$ packed form
57234H5836K748K386J477R73J447K457L278L684L717L368K880K822L377M001M036
57219A28487L376K333J408J247K262L975N305N705N473M947M122L301L249M217
57205A79407N475O227O439O411O254O114O279O683O928P128P936R316J0107R433
57191B80137P878O599N923N508N281N447N884O246O455O724P343Q605J0534J2485
57177C81049J3687J4416J5722J7723J9127J9088J8534J8837J9933K0686K0383
57166E79185J9010J6671J3815J1534J0648J0735J0821J0655J0547J0447J0112
57155G14180R800R913J0249J0445J0752J1527J2258J2042J0817R298P910O563
57143H35754N240M034K819J645J178J958L492M774N385N385M692L427K371K065
$$ plain form
57129 884219 886190 887643 888624 889739 890676 889674 885179 877168 866235 852354 835417 816070 794817
57116 794817 770792 742297 708099 667498 619855 565077 503930 436795 362574 279731 187721
57105 187721 86276 -26045 -151238 -290232 -443277 -611508 -796946 -1001776 -1229677 -1487821
57095 -1487821 -1786121 -2135142 -2547119 -3039222 -3634189 -4358628 -5244407 -6333275 -7678788
57086 -7678788 -9344402 -11401287 -13919406 -16935597 -20399627 -24132541 -27837513 -31167087
57078 -31167087 -33811141 -35565562 -36363105 -36264488 -35415645 -33989537 -32141157 -29993362 -27645049
57069 -27645049 -25181338 -22676834 -20196364 -17796179 -15522939 -13410452 -11478829 -9737613
57061 -9737613 -8188868 -6827919 -5644312 -4624564 -3754284 -3018206 -2400348 -1885690 -1461087
$$ packed form
57129H84219J971J453R81J115R37j002m495q011j0933j3881j6937j9347k1253
57116G94817k4025k8495l4198m0601m7643n4778o1147o7135p4221q2843r2010
57105A87721H6276b6045j25193j38994j53045j68231j85438k04830k27901k58144
57095a487821k98300l49021m11977m92103n94967p24439q85779j088868j345513
57086g678788j665614k056885k518119l016191l464030l732914l704972l329574
57078c1167087k644054j754421p97543R8617Q48843J426108J848380K147795K348313
57069b7645049K463711K504504K480470K400185K273240K112487J931623J741216
57061i737613J548745J360949J183607J019748Q70280P36078O17858N14658M24603
$$ plain form
57052 -1461087 -1114010 -831730 -603067 -420406 -278812 -173370 -98084 -46779 -13937 5310
57041 15069 18218 16551 11437 4152 -4206 -12674 -20263 -26308 -30803 -33995 -35629 -34938 -31469 -25655 -18445
57026 -18445 -10400 -1171 9977 22931 36135 47633 56622 63564 68877 72206 73129 71815 68629 63757
57012 63757 57760 51908 47334 44164 41884 40083 38395 36315 33781 31560 30370 29920 29412 28675 28162
56997 28162 28167 28685 29701 30990 32045 32939 34829 38738 44211 50095 56303 63656 72251 81283 90597 101154
56981 101154 113583 127269 141119 154210 165330 172978 176487 176546 174227 170273 165606 161435 158165
56968 158165 155035 151620 148915 148163 149241 151130 153485 156808 161478 167569 175427 185434 197162 209583
56954 209583 222087 234451 245581 253243 255642 252874 246384 237387 226395 214077 201819 191026
$$ packed form
57052a461087L47077K82280K28663J82661J41594J05442P5286d6779a3937E310
57041A5069L149j667n114D152d206q468p589o045m495l192j634O91L469N814P210
57026a8445Q045a171I977J2954J3204J1498Q989O942N313L329R23j314l186m872
57012F3757n997n852m574l170k280j801j688k080k534k221j190m50n08p37n13
56997B8162NN18J016J289J055Q94J890L909N473N884O208P353Q595R032R314J0557
56981A01154J2429J3686J3850J3091J1120P648L509N9k319l954m667m171l270
56968A58165l130l415k705p52J078J889K355L323M670O091P858J0007J1728J2421
56954B09583J2504J2364J1130P662K399k768o490q997j0992j2318j2258j0793
$$ plain form
56942 191026 182202 175153 169976 167359 167705 170385 174402 179712 187428 198527 212607 228154 243964
56929 243964 260126 277503 296132 314084 328112 335549 335592 328979 317100 301679 284623 267342
56917 267342 250269 233487 217608 203559 191770 182200 174864 169591 165493 161615 158072 155663 154314
56904 154314 152965 151166 149704 149189 149031 148467 147755 147595 147971 148372 148728 149446 150860 153323 157511 163966
56888 163966 172500 182539 193806 206126 218898 231471 243923 256658 268984 278615 283011 281299
56876 281299 274925 266571 258421 251327 245438 241198 239303 239908 242637 247566 255668 267900 284258 304063
56862 304063 326862 352748 382138 415477 452789 492971 533533 571038 601634 621508 627909 620533
56850 620533 601740 575197 544548 513269 484617 460766 442192 428568 420117 417787 422464 434570
$$ packed form
56942A91026q824p049n177k617L46K680M017N310P716J1099J4080J5547J5810
56929B43964J6162J7377J8629J7952J4028P437M3o613j1879j5421j7056j7281
56917B67342j7073j6782j5879j4049j1789r570p336n273m098l878l543k409j349
56904A54314j349j799j462n15j58n64p12j60L76M01L56P18J414K463M188O455
56888A63966Q534J0039J1267J2320J2772J2573J2452J2735J2326R631M396j712
56876B81299o374q354q150p094n889m240j895O05K729M929Q102J2232J6358J9805
56862C04063K2799K5886K9390L3339L7312M0182M0562L7505L0596J9874O401p376
56850F20533j8793k6543l0649l1279k8652k3851j8574j3624q451k330M677J2106
$$ plain form
56838 434570 454290 481782 517296 561194 613439 672753 736677 802638 868191 929474 979973
56827 979973 1011984 1019925 1002619 963317 908302 844939 779701 717130 660214 611059 570749 539110
56815 539110 515485 499842 492729 494352 504212 521592 545902 576534 612706 653430 697375 742663
56803 742663 786556 824782 851218 859483 846255 813391 766705 712882 657419 604153 555265 511581
56791 511581 473582 442126 417810 400114 388032 381381 380669 385694 395143 407709 422937 440808
56779 440808 461021 482810 504756 524409 538421 543506 537564 520409 494000 461904 427878 394511
56767 394511 363051 334061 307817 284330 263567 245672 230630 217879 206719 197001 188961 182474
56755 182474 176990 172130 167815 163788 159546 154924 150392 146595 143782 141721 140021 138519 137450 137063
$$ packed form
56838D34570J9720K7492L5514M3898N2245N9314O3924O5961O5553O1283N0499
56827I79973L2011P941j7306l9302n5015o3363o5238o2571n6916m9155m0310l1639
56815E39110k3625j5643p113J623R860J7380K4310L0632L6172M0724M3945M5288
56803G42663M3893L8226K6436Q265j3228l2864m6686n3823n5463n3266m8888m3684
56791E11581l7999l1456k4316j7696j2082o651p12N025R449J2566J5228J7871
56779D40808K0213K1789K1946J9653J4012N085n942j7155k6409l2096l4026l3367
56767C94511l1460k8990k6244k3487k0763j7895j5042j2751j1160r718q040o487
56755A82474n484m860m315m027m242m622m532l797k813k061j700j502j069l87
$$ plain form
56741 137063 137060 136722 135710 134299 132680 130705 128652 127491 127668 128236 128017 127155 126598 126447 125991 125240 125260 126651
56723 126651 128619 129939 130233 130007 129977 130698 132421 134940 137767 140413 142344 142928 141982 140306 139127 138973
56707 138973 139485 140230 141187 142467 144061 145891 147732 149147 149894 150243 150492 150467 150013 149638 149949 150709 151163
56690 151163 151162 151150 151216 151027 150674 150721 151323 152064 152708 153346 153829 153899 153901 154417 155097 154889 153710 152872 153380 154654 155461
56669 155461 155334 154497 153123 151409 149973 149437 149759 150361 150816 151216 152055 153778 156117 157942 158329 157775 157693
56652 157693 158631 159696 159876 159127 157868 156283 154648 153670 153859 154945 156322 157616 158446 158232 156852 155087
56636 155087 153830 153075 152127 150585 148703 146996 145904 145628 145965 146380 146454 146196 145806 145388 145007 144786 144858 145436
56618 145436 146821 148935 150892 151612 151012 150036 149372 148663 147296 145462 144060 143875 145026 146864 148256 148428
$$ packed form
56741A37063ll38j012j411j619j975k053j161J77N68k19q62n57j51m56p51K0J391
56723A26651J968J320K94k26l0P21J723K519K827K646J931N84r46j676j179j54
56707A38973N12P45R57J280J594J830J841J415P47L49K49k5m54l75L11P60M54
56690A51163jj2O6j89l53M7O02P41O44O38M83P0KN16O80k08j179q38N08J274Q07
56669A55461j27q37j374j714j436n36L22O02M55M00Q39J723K339J825L87n54q2
56652A57693R38J065J80p49j259j585j635r78J89J086J377J294Q30k14j380j765
56636A55087j257p55r48j542j882j707j092k76L37M15P4k58l90m18l81k21P2N78
56618A45436J385K114J957P20o00r76o64p09j367j834j402j85J151J838J392J72
$$ plain form
56602 148428 147788 147555 148352 149575 150279 150189 149632 148964 148423 148175 148178 148270 148586 149486 150903 152097 152327 151538 150346
56583 150346 149668 150267 152078 153892 154357 153524 152791 153088 153746 153559 152400 151303 151291 152577 154620 156611 158111
56566 158111 159490 161558 164671 168436 172332 176265 180447 185144 190595 196744 202994 208664 213702 218426
56552 218426 222557 225138 225572 224229 221948 219530 217697 216802 216340 215415 213885 212454 211561 210904 210159 209339
56536 209339 208225 206358 203908 201723 200147 198678 197133 196196 196216 196373 195795 194809 194356 194750 195679 196871
56520 196871 198024 198515 197888 196381 194525 192569 190639 189012 187870 187248 187424 188710 190524 191472 190869 189479
56504 189479 188283 187292 186168 185201 184808 184737 184594 184695 185508 186652 187239 186994 186404 186036 186233 187139 188438 189359
56486 189359 189431 188991 188638 188584 188817 189309 189701 189409 188475 187717 187619 187817 188121 189123 191072 193033 194068 194523
$$ packed form
56602A48428o40k33P97J223P04r0n57o68n41k48LR2L16R00J417J194K30p89j192
56583A50346o78N99J811J814M65q33p33K97O58j87j159j097j2J286K043J991J500
56566A58111J379K068L113L765L896L933M182M697N451O149O250N670N038M724
56552B18426M131K581M34j343k281k418j833q95m62r25j530j431q93o57p45q20
56536B09339j114j867k450k185j576j469j545r37K0J57n78r86m53L94R29J192
56520A96871J153M91o27j507j856j956j930j627j142o22J76J286J814R48o03j390
56504A89479j196r91j124r67l93p1j43J01Q13J144N87k45n90l68J97R06J299R21
56486A89359P2m40l53n4K33M92L92k92r34p58r8J98L04J002J949J961J035M55
$$ plain form
56468 194523 195207 195996 196258 196153 196341 196692 196336 194948 193190 191992 192000 193422 195794 198115 199799 201229 202978
56451 202978 204936 206696 208135 208991 208539 206576 204217 202859 202743 203185 203699 204093 204098 203826 204114 205466 207100
56434 207100 207983 208319 209002 210008 210483 210158 209616 209281 209119 209223 209729 210219 210052 209279 208562 208316 208522 209086
56416 209086 209730 209920 209625 209741 210980 212797 214214 215212 216362 217649 218750 219994 221789 223452 223905 223408
56400 223408 223339 224325 225727 226891 227702 227950 227406 226696 226909 228065 229019 229093 228787 228579 228056 226728 224919 223334
56382 223334 222200 221175 219798 217923 216024 214975 215169 216105 217249 218874 221402 224422 227246 230078 233620
56367 233620 237696 241190 243330 244249 244423 244367 244691 245614 246535 246837 246857 247285 248029 248587 249206 250547 252467 254180
56349 254180 255497 256830 258178 259170 259977 261090 262296 262973 263225 263686 264423 265187 266535 269275 272839 275612
$$ packed form
56468A94523O84P89K62j05J88L51l56j388j758j198QJ422K372K321J684J430J749
56451B02978J958J760J439Q56m52j963k359j358j16M42N14L94Nk72K88J352J634
56434B07100Q83L36O83J006M75l25n42l35j62J04N06M90j67p73p17k46K06N64
56416B09086O44J90k95J16J239J817J417R98J150J287J101J244J795J663M53m97
56400B23408o9R86J402J164Q11K48n44p10K13J156R54P4l06k08n23j328j809j585
56382B23334j134j025j377j875j899j049J94R36J144J625K528L020K824K832L542
56367B33620M076L494K140R19J74n6L24R23R21L02K0M28P44N58O19J341J920J713
56349B54180J317J333J348R92Q07J113J206O77K52M61P37P64J348K740L564K773
$$ plain form
56333 275612 277013 278013 279464 281249 283197 285486 287767 289194 289756 290527 292190 294335 296517 298913 301547
56318 301547 303853 305466 306590 307281 307249 306694 306493 307190 308518 310126 312029 314208 316499 318990 321760 324344
56302 324344 326319 328357 331649 336270 341131 345518 349592 353387 356551 359285 362440 366420 370956 375966
56288 375966 381590 387364 392561 397466 403124 409737 416611 423788 432297 442445 453208 463782 474496
56275 474496 485777 497402 509313 521997 535454 548771 561297 573553 586602 601251 617983
56264 617983 636789 656980 678066 700798 726419 755076 786186 820235 858787 902759 952120
56253 952120 1007337 1069594 1139440 1216844 1302707 1398607 1504771 1620087 1744523 1879585 2025608
56242 2025608 2180231 2340288 2503569 2667897 2830121 2987089 3136324 3274706 3397686
$$ packed form
56333B75612J401J000J451J785J948K289K281J427N62P71J663K145K182K396K634
56318C01547K306J613J124O91l2n55k01O97J328J608J903K179K291K491K770K584
56302C24344J975K038L292M621M861M387M074L795L164K734L155L980M536N010
56288C75966N624N774N197M905N658O613O874P177Q509J0148J0763J0574J0714
56275D74496J1281J1625J1911J2684J3457J3317J2526J2256J3049J4649J6732
56264F17983J8806K0191K1086K2732K5621K8657L1110L4049L8552M3972M9361
56253I52120N5217O2257O9846P7404Q5863R5900J06164J15316J24436J35062J46023
56242B025608J54623J60057J63281J64328J62224J56968J49235J38382J22980
$$ plain form
56233 3397686 3500744 3580756 3635497 3663191 3663324 3636813 3584908 3509201 3413099 3301569 3178523
56222 3178523 3045794 2905312 2760681 2615633 2472306 2331988 2196151 2065759 1940831
56213 1940831 1821782 1710183 1607335 1513103 1426733 1347639 1274835 1207012 1143885 1086234 1034098
56202 1034098 986376 942652 903615 869091 837585 808570 783153 761423 741260 721178 702326
56191 702326 686108 671691 657735 644878 634453 626045 618325 611300 605865 601909 598494 595244 592148
56178 592148 588796 585128 582067 580214 578772 576960 575417 574957 575056 574951 575179 576547 578477 579847 580688 581769
56162 581769 583259 585025 587508 591151 595692 600991 607605 615591 623807 631422 639126 647903 657717 668394
56148 668394 680582 694813 710867 729072 750916 777393 808171 843447 885004 934181 990334
$$ packed form
56233C397686J03058Q0012N4741K7694J33k6511n1905p5707r6102j11530j23046
56222C178523j32729j40482j44631j45048j43327j40318j35837j30392j24928
56213A940831j19049j11599j02848r4232q6370p9094p2804o7823o3127n7651n2136
56202A034098m7722m3724l9037l4524l1506k9015k5417k1730k0163k0082j8852
56191G02326j6218j4417j3956j2857j0425q408p720p025n435l956l415l250l096
56178E92148l352l668l061j853j442j812j543m60R9j05K28J368J930J370Q41J081
56162E81769J490J766K483L643M541N299O614P986Q216P615P704Q777R814J0677
56148F68394J2188J4231J6054J8205K1844K6477L0778L5276M1557M9177N6153
$$ plain form
56137 990334 1052548 1121239 1196621 1277085 1360354 1444624 1527168 1603735 1671190 1729445 1779510
56126 1779510 1821545 1856420 1886973 1915319 1940260 1959264 1971423 1976645 1973831 1962377 1944154 1921661
56114 1921661 1895253 1863983 1827536 1785146 1734250 1673004 1603255 1529020 1453224 1377993 1306508
56103 1306508 1241756 1184305 1133581 1090305 1055395 1027561 1004410 985071 969622 957057 946191
56092 946191 937596 932341 929610 927665 926227 925974 926782 928394 931556 936532 941915 946851 952756 960737 969187
56077 969187 976375 983503 992467 1002454 1011730 1021136 1032667 1045963 1059232 1072322 1085933 1099300 1111704
56064 1111704 1124817 1140388 1157021 1172348 1186878 1202465 1218578 1233600 1248326 1264550 1281558
56053 1281558 1297632 1313623 1331318 1349591 1366103 1381595 1398595 1416988 1434805 1452300 1471236
$$ packed form
56137I90334O2214O8691P5382Q0464Q3269Q4270Q2544P6567O7455N8255N0065
56126A779510M2035L4875L0553K8346K4941J9004J2159N222k814j1454j8223k2493
56114A921661k6408l1270l6447m2390n0896o1246o9749p4235p5796p5231p1485
56103A306508o4752n7451n0724m3276l4910k7834k3151j9339j5449j2565j0866
56092I46191q595n255k731j945j438k53Q08J612L162M976N383M936N905P981Q450
56077I69187P188P128Q964R987R276R406J1531J3296J3269J3090J3611J3367J2404
56064A111704J3113J5571J6633J5327J4530J5587J6113J5022J4726J6224J7008
56053A281558J6074J5991J7695J8273J6512J5492J7000J8393J7817J7495J8936
$$ plain form
56042 1471236 1491161 1510378 1529642 1550997 1573952 1596732 1620172 1646299 1674314 1702099 1730490
56031 1730490 1761797 1795427 1829374 1864631 1903441 1944593 1985334 2026611 2071298 2118491 2164908
56020 2164908 2210927 2259869 2312246 2366089 2421932 2481852 2544522 2606915 2670048 2737244 2807772
56009 2807772 2878283 2949635 3025925 3107488 3191337 3277873 3370585 3469631 3572396 3679854 3795640
55998 3795640 3919436 4048289 4183758 4330470 4488242 4653078 4825257 5008764 5203549
55989 5203549 5406575 5619701 5848046 6091420 6346449 6616350 6909134 7226847 7566524
55980 7566524 7930971 8328042 8759938 9224483 9726555 10276728 10879206 11533525 12247789
55971 12247789 13037270 13910818 14873069 15939927 17137224 18485290 20002017 21721620
$$ packed form
56042A471236J9925J9217J9264K1355K2955K2780K3440K6127K8015K7785K8391
56031A730490L1307L3630L3947L5257L8810M1152M0741M1277M4687M7193M6417
56020B164908M6019M8942N2377N3843N5843N9920O2670O2393O3133O7196P0528
56009B807772P0511P1352P6290Q1563Q3849Q6536R2712R9046J02765J07458J15786
55998C795640J23796J28853J35469J46712J57772J64836J72179J83507J94785
55989E203549K03026K13126K28345K43374K55029K69901K92784L17713L39677
55980G566524L64447L97071M31896M64545N02072N50173O02478O54319P14264
55971A2247789P89481Q73548R62251J066858J197297J348066J516727J719603
$$ plain form
55963 21721620 23694073 25968652 28599878 31671228 35293743 39585342 44680701 50767356
55955 50767356 58092618 66942593 77645611 90583353 106140655 124618966 146199709
55948 146199709 170913897 198503466 228280388 259238088 290309112 320237127 346907490
55941 346907490 366934961 376474308 373037030 356885316 330867589 299005646 265039370
55934 265039370 231713454 200722456 172918283 148570105 127609704 109794686 94778350
55927 94778350 82160220 71554527 62630373 55101567 48714691 43262677 38588835 34564125
55919 34564125 31072988 28024230 25354918 23012535 20944911 19111171 17486260 16046883
55911 16046883 14764553 13616832 12592409 11679273 10858881 10116614 9446963 8843500 8293808
$$ packed form
55963B1721620J972453K274579K631226L071350L622515M291599N095359O086655
55955E0767356P325262Q849975J0703018J2937742J5557302J8478311K1580743
55948A46199709K4714188K7589569K9776922L0957700L1071024K9928015K6670363
55941C46907490K0027471R539347l437278j6151714k6017727l1861943l3966276
55934B65039370l3325916l0990998k7804173k4348178k0960401j7815018j5016336
55927I4778350j2618130j0605693q924154p528806o386876n452014m673842m024710
55919C4564125l491137l048758k669312k342383k067624j833740j624911j439377
55911A6046883j282330j147721j024423r13136q20392p42267o69651o03463n49692
$$ plain form
55902 8293808 7788868 7327851 6909083 6524987 6169906 5844295 5547056 5271744 5014224
55893 5014224 4776500 4559365 4358485 4171076 3999304 3843707 3700036 3565808 3443386
55884 3443386 3333454 3231790 3135460 3045835 2962450 2880176 2795885 2712281 2632051 2553729 2476196
55873 2476196 2401621 2330612 2259613 2186335 2113079 2041904 1971322 1900639 1832817 1769918 1710017
55862 1710017 1651453 1595964 1544892 1496417 1449275 1405276 1365546 1328133 1291869 1258689 1229551
55851 1229551 1201863 1173616 1146491 1122240 1099445 1076377 1053713 1031917 1009206 984636 960164
55840 960164 937286 914694 891462 869444 850184 832487 815237 799580 786048 772596 757914
55829 757914 743816 732030 721428 710749 701110 693344 685620 676346 666850 658522 649783 638612 625905
$$ packed form
55902H293808n04940m61017m18768l84096l55081l25611k97239k75312k57520
55893E014224k37724k17135k00880j87409j71772j55597j43671j34228j22422
55884C443386j09932j01664r6330q9625q3385q2274q4291q3604q0230p8322p7533
55873B476196p4575p1009p0999p3278p3256p1175p0582p0683o7822o2899n9901
55862A710017n8564n5489n1072m8475m7142m3999l9730l7413l6264l3180k9138
55851A229551k7688k8247k7125k4251k2795k3068k2664k1796k2711k4570k4472
55840I60164k2878k2592k3232k2018j9260j7697j7250j5657j3532j3452j4682
55829G57914j4098j1786j0602j0679r639p766p724r274r496q328q739j1171j2707
$$ plain form
55816 625905 613681 601972 590008 578618 568868 559937 550668 541758 534402 528316 522926 518901 516695
55803 516695 515206 513633 512980 514016 515619 516834 518769 522617 527548 532264 536859 541394 544517 545367 545081
55788 545081 544585 542669 538181 532360 527023 522051 516620 511130 505702 498297 486779 471883 456252 441565
55774 441565 428402 417644 409930 404577 400757 398918 399581 401722 403801 405247 405573 403283 397359 388818
55760 388818 379380 369659 359880 350940 343190 335577 327588 320726 316295 312978 308508 302689 296987 292155
55746 292155 288079 285088 283533 282692 281710 280945 280946 280848 279337 276527 273506 270703 268012 265739 264082 262372
55730 262372 260098 257937 256635 255736 254498 253090 251655 249327 245506 241111 237230 233571 229661 226446
55716 226446 225046 224854 224484 223810 223589 223871 224298 225263 227286 229934 232617 235578 238731 240616 240174 238630
$$ packed form
55816F25905j2224j1709j1964j1390r750q931r269q910p356o086n390m025k206
55803E16695j489j573o53J036J603J215J935L848M931M716M595M535L123Q50k86
55788E45081m96j916m488n821n337m972n431n490n428p405j1518j4896j5631j4687
55774D41565j3163j0758p714n353l820j839O63K141K079J446L26k290n924q541
55760C88818r438r721r779q940p750p613p989o862m431l317m470n819n702m832
55746B92155m076k991j555q41r82p65Jr8j511k810l021k803k691k273j657j710
55730B62372k274k161j302q99j238j408j435k328l821m395l881l659l910l215
55716B26446j400j92l70o74k21K82M27R65K023K648K683K961L153J885m42j544
$$ plain form
55700 238630 237854 237603 236143 232879 228593 223691 218079 212415 207692 203793 199945 196300 193613 191756 190019
55685 190019 188521 187877 187850 187827 188219 189843 192195 193891 194636 195330 196420 197584 198823 200385 201644 201495
55669 201495 199926 198010 196325 194470 192082 189285 186310 183642 182243 182538 183476 183759 183664 184479 186500 188900
55653 188900 191307 194141 197447 200649 203497 206151 208387 209763 210517 211278 212015 212208 211855 211336 210506 208905
55637 208905 206598 203794 199932 194288 187300 180252 173839 167992 162830 158668 155328 152514 150562 149825
55623 149825 149623 148909 147676 146583 145590 144213 142804 142226 142426 142545 142261 141803 140893 139086 137004 135824
55607 135824 135499 134758 132908 130405 127734 125037 122869 121899 121691 121094 120024 119586 120224 120984 120993 120515 120172
55590 120172 120168 120610 121564 122449 122291 121056 119929 119961 121064 122465 123422 123428 122508 121433 120982 121008 120937 120928 121676 123274
$$ packed form
55700B38630p76k51j460l264m286m902n612n664m723l899l848l645k687j857j737
55685A90019j498o44k7k3L92J624K352J696P45O94J090J164J239J562J259j49
55669B01495j569j916j685j855k388k797k975k668j399K95R38K83r5Q15K021K400
55653A88900K407K834L306L202K848K654K236J376P54P61P37J93l53n19q30j601
55637B08905k307k804l862n644o988p048o413n847n162m162l340k814j952p37
55623A49825k02p14j233j093r93j377j409n78K00J19k84m58r10j807k082j180
55607A35824l25p41j850k503k671k697k168r70k08n97j070m38O38P60Rm78l43
55590A20172mM42R54Q85j58j235j127L2J103J401R57Or20j075m51K6p1rP48J598
$$ plain form
55570 123274 125265 127572 130286 132742 134102 134798 136029 137770 138622 137854 136263 134683 132947 130794 128593
55555 128593 126560 124286 121562 118879 116637 114722 113118 112017 111047 109419 107271 105862 105919 106642 106840
55540 106840 106197 105047 103825 103245 104096 106148 107972 108475 108043 107724 107924 108441 109171 110177 111419 112772
55524 112772 113935 114221 113067 110950 109184 108538 108678 109112 109915 111216 112737 114286 116098 118283 120443
55509 120443 122104 123052 123048 121853 119702 117168 114342 110855 106870 103340 100999 99716 99021 98591 98022 96896
55493 96896 95341 93855 92452 90713 88765 87283 86333 85299 84291 84533 86723 89931 92728 94618 95810
55478 95810 96425 96633 96865 97197 97118 96460 95895 95911 96066 95870 95675 95912 96176 95947 95601 95692 95685 94488 92062 89594
55458 89594 88098 87569 87519 87621 87769 88015 88542 89369 90159 90605 90840 91073 91033 90259 88898 87737 87363 87600 87860
$$ packed form
55570A23274J991K307K714K456J360O96J231J741Q52p68j591j580j736k153k201
55555A28593k033k274k724k683k242j915j604j101r70j628k148j409N7P23J98
55540A06840o43j150j222n80Q51K052J824N03m32l19K00N17P30J006J242J353
55524A12772J163K86j154k117j766o46J40M34Q03J301J521J549J812K185K160
55509A20443J661R48mj195k151k534k826l487l985l530k341j283o95m30n69j126
55493I6896j555j486j403j739j948j482r50j034j008K42K190L208K797J890J192
55478I5810O15K08K32L32p9o58n65J6J55j96j95K37K64k29l46R1pj197k426k468
55458H9594j496n29n0J02J48K46N27Q27P90M46K35K33m0p74j361j161l74K37K60
$$ plain form
55439 87860 87841 87746 87875 88074 87797 86815 85644 84983 84861 84751 84421 84179 84344 84922 85789 86656 86953 86425 85874
55420 85874 86548 88614 90957 92686 94071 95634 97087 97738 97393 96341 94885 93339 92137 91476 91086 90585
55404 90585 89818 88825 87886 87626 88410 89514 89647 88575 87482 87368 87864 88140 88209 88659 89616 90660 91350 91366
55386 91366 90569 89410 88803 89024 89227 88536 87190 86060 85542 85522 85865 86273 86117 85191 84300 84353 85133 85720 85878
55367 85878 86175 86834 87313 87141 86506 85788 85042 84152 83191 82419 82077 82208 82612 83098 83865 85286 87166 88578
55349 88578 88780 87995 86983 86218 85892 86299 87591 89282 90505 90725 89922 88367 86659 85702 86009 87091 88020
55332 88020 88563 89270 90478 91772 92585 92911 93177 93591 93805 93219 91659 89801 88752 89046 90142 91003 91017
55315 91017 90287 89334 88745 88892 89622 90326 90545 90448 90552 91069 91710 91982 91539 90369 88879 87723 87402 87959
$$ packed form
55439H7860j9r5J29J99k77r82j171o61j22j10l30k42J65N78Q67Q67K97n28n51
55420H5874O74K066K343J729J385J563J453O51l45j052j456j546j202o61l90n01
55404I0585p67r93r39k60P84J104J33j072j093j14M96K76O9M50R57J044O90J6
55386I1366p97j159o07K21K03o91j346j130n18k0L43M08j56r26q91N3P80N87J58
55367H5878K97O59M79j72o35p18p46q90r61p72l42J31M04M86P67J421J880J412
55349H8578K02p85j012p65l26M07J292J691J223K20q03j555j708r57L07J082R29
55332H8020N43P07J208J294Q13L26K66M14K14n86j560j858j049K94J096Q61J4
55315I1017p30r53n89J47P30P04K19r7J04N17O41K72m43j170j490j156l21N57
$$ plain form
55297 87959 89042 90135 90840 91123 91316 91748 92458 93452 94912 96737 98138 98330 97564 96824 96481 95962 94831
55280 94831 93399 92024 90586 89081 88012 87634 87390 86665 85683 85119 85189 85663 86446 87671 89434 91721 94319
55263 94319 96507 97354 96739 95682 95211 95280 95227 94853 94484 94318 94292 94409 94698 94943 94882 94530 94091 93726 93615 93896
55243 93896 94320 94340 93787 93055 92413 91681 90859 90401 90413 90235 89402 88398 87842 87500 86921 86543 87237 89010 90973
55224 90973 92478 93566 94408 95023 95532 96105 96660 97022 97284 97566 97662 97333 96730 96075 95269 94293 93579 93360 93011
55205 93011 91765 89847 88195 87250 86747 86506 86669 87223 87992 89037 90461 91857 92586 92598 92457 92634 93273
55188 93273 94387 95671 96328 95769 94369 92926 91633 90355 89617 90315 92351 94477 95619 95630 94675 92845
55172 92845 90634 89012 88565 89079 90194 91861 93919 95785 96960 97465 97574 97508 97493 97717 98099 98488 99071
$$ packed form
55297H7959J083J093P05K83J93M32P10R94J460J825J401J92p66p40l43n19j131
55280I4831j432j375j438j505j069l78k44p25r82n64P0M74P83J225J763K287K598
55263I4319K188Q47o15j057m71O9n3l74l69j66k6J17K89K45o1l52m39l65j11K81
55243I3896M24K0n53p32o42p32q22m58J2j78q33j004n56l42n79l78O94J773J963
55224I0973J505J088Q42O15N09N73N55L62K62K82R6l29o03o55q06r76p14k19l49
55205I3011j246j918j652r45n03k41J63N54P69J045J424J396P29J2j41J77O39
55188I3273J114J284O57n59j400j443j293j278p38O98K036K126J142J1r55j830
55172I2845k211j622m47N14J115J667K058J866J175N05J09o6j5K24L82L89N83
$$ plain form
55155 99071 100081 101156 101631 101565 101773 102647 103612 103990 103831 103502 103055 102349 101421 100356 99175 98141 97790 98318
55137 98318 99214 99749 99568 98677 97258 95797 94974 95075 95669 96146 96404 96781 97442 98051 98030 97157 95939 95306
55119 95306 95718 96643 97142 96853 96128 95407 94890 94733 95055 95711 96410 97054 97635 97878 97442 96465 95484 94868 94682
55100 94682 94971 95620 96121 96105 96061 96807 98244 99369 99605 99406 99395 99727 100535 102172 104481 106499 107448 107558
55082 107558 107504 107501 107427 107375 107530 107840 108244 108867 109542 109570 108541 107135 106495 106945 107844 108642 109509 110840 112508
55063 112508 113824 114104 113308 112189 111672 111907 112107 111536 110477 109862 110041 110387 110172 109493 109020 109085 109402 109668
55045 109668 109946 110199 109900 108701 107338 107080 108031 108702 107777 105806 104466 104508 105116 105140 104279 103090 102424 102842
55027 102842 104087 105153 105350 105181 105621 106738 107737 108246 108664 109147 109136 108280 107110 106422 106503 107174 108086 108728
$$ packed form
55155I9071J010J075M75o6K08Q74R65L78j59l29m47p06r28j065j181j034l51N28
55137I8318Q96N35j81q91j419j461q23J01N94M77K58L77O61O09k1q73j218o33
55119I5306M12R25M99k89p25p21n17j57L22O56O99O44N81K43m36r77r81o16j86
55100I4682K89O49N01j6m4P46J437J125K36j99j1L32Q08J637K309K018R49J10
55082A07558n4lp4n2J55L10M04O23O75K8j029j406o40M50Q99P98Q67J331J668
55063A12508J316K80p96j119n17K35K00n71j059o15J79L46k15o79m73O5L17K66
55045A09668K78K53k99j199j363k58R51O71r25j971j340M2O08K4q61j189o66M18
55027A02842J245J066J97j69M40J117R99N09M18M83j1q56j170o88Q1O71R12O42
$$ plain form
55009 108728 108736 108411 108406 108680 108376 107049 105318 104018 103353 103354 104438 106811 109740 112092 113331 113582 113042 111906
54991 111906 110635 109768 109514 109747 110239 110714 111010 111433 112594 114615 116849 118606 119799 120621 121067 121086 120770
54974 120770 120073 118822 117353 116578 116912 117596 117601 116783 115657 114486 113290 112348 111975 111981 111967 111969 112243 112657 112857
54955 112857 112864 112930 113021 113015 113177 113776 114419 114506 114199 114142 114264 113725 112218 110524 109486 109188 109482 110608 112634 114776
54935 114776 115987 116092 115801 115686 115570 115009 113946 112789 112092 112361 113997 117100 121214 125443 129054 132068
54919 132068 135135 138767 142774 146506 149534 151930 153971 155789 157392 158909 160550 162188 163091 162364 159833
54904 159833 156287 152689 149296 145772 141922 137965 134236 131033 128714 127500 127133 127097 127170 127420 127735 127865
54888 127865 127889 128080 128263 127913 127019 126235 125997 126138 126565 127566 129095 130540 131721 133401 136153 139438 142550
$$ packed form
55009A08728Ql25nK74l04j327j731j300o65JJ084K373K929K352J239K51n40j136
54991A11906j271q67k54K33M92M75K96M23J161K021K234J757J193Q22M46J9l16
54974A20770o97j251j469p75L34O84Nq18j126j171j196r42l73Oj4KK74M14K00
54955A12857PO6R1oJ62N99O43Q7l07n7J22n39j507j694j038k98K94J126K026K142
54935A14776J211J05k91j15j16n61j063j157o97K69J636L103M114M229L611L014
54919A32068L067L632M007L732L028K396K041J818J603J517J641J638R03p27k531
54904A59833l546l598l393l524l850l957l729l203k319j214l67l6P3K50L15J30
54888A27865K4J91J83l50q94p84k38J41M27J001J529J445J181J680K752L285L112
$$ plain form
54871 142550 145873 150244 155440 160302 164137 167037 168825 168701 166201 161842 156585 151189 146213 142070
54857 142070 138811 136181 134017 132245 130490 128272 125678 123395 121923 121163 120878 121034 121409 121397 120603 119344
54841 119344 118200 117286 116355 115469 115086 115415 116025 116303 116107 115754 115450 115024 114281 113325 112334 111266 110103 109142
54823 109142 108636 108279 107628 107007 107347 108879 110604 111410 111244 110860 110836 111243 111853 112185 111737 110662 109868 109995
54805 109995 110640 111081 111384 112134 113427 114818 116126 117507 118820 119593 119669 119272 118497 117339 116266 116059 116900
54788 116900 118111 118938 119161 118865 118150 117269 116634 116490 116813 117514 118424 119140 119390 119502 120032 120989 121998 123203
54770 123203 125303 128513 132140 135464 138460 141414 144398 147475 150862 154447 157667 160356 163288 167275
54756 167275 171914 175734 177482 176925 174637 171492 168269 165241 162073 158417 154565 151148 148174 144874
$$ packed form
54871A42550L323M371N196M862L835K900J788j24k500m359n257n396m976m143
54857A42070l259k630k164j772j755k218k594k283j472p60k85J56L75j2p94j259
54841A19344j144r14r31q86l83L29O10K78j96l53l04m26p43r56r91j068j163r61
54823A09142n06l57o51o21L40J532J725Q06j66l84k4M07O10L32m48j075p94J27
54805A09995O45M41L03P50J293J391J308J381J313P73P6l97p75j158j073k07Q41
54788A16900J211Q27K23k96p15q81o35j44L23P01R10P16K50J12N30R57J009J205
54770A23203K100L210L627L324K996K954K984L077L387L585L220K689K932L987
54756A67275M639L820J748n57k288l145l223l028l168l656l852l417k974l300
$$ plain form
54742 144874 140783 136643 133814 132852 133011 133225 133211 133314 133596 133611 133117 132499 132245 132399 132851 133778 135305 136996
54724 136996 138205 138916 139743 141111 142919 145072 147848 151490 155795 160350 164915 169325 173149 175629 175991
54709 175991 173869 169698 164718 160298 156957 154087 150713 146545 142268 138828 136494 134660 132672 130661
54695 130661 129259 128547 127814 126596 125374 124799 124610 123950 122495 120741 119310 118575 118772 119796 120904 121293
54679 121293 121032 120875 121128 121360 121312 121373 121881 122542 122852 122644 121951 120851 119710 119070 118970 118877 118584 118630 119301
54660 119301 119772 118929 116859 114904 114289 115117 116647 118073 118920 119136 119080 119331 120251 121627 122720 122829 121942
54643 121942 120816 120285 120600 121534 122839 124179 124867 124338 122991 121999 122112 123050 124153 125081 125673 125712 125179
54626 125179 124335 123266 121836 120381 119793 120371 121128 120964 120178 120053 121097 122458 123124 122955 122382 121658 120844
$$ packed form
54742A44874m091m140k829r62J59K14j4J03K82J5m94o18k54J54M52R27J527J691
54724A36996J209P11Q27J368J808K153K776L642M305M555M565M410L824K480L62
54709A75991k122m171m980m420l341k870l374m168m277l440k334j834j988k011
54695A30661j402p12p33j218j222n75j89o60j455j754j431p35J97J024J108L89
54679A21293k61j57K53K32m8O1N08O61L10k08o93j100j141o40j00r3k93M6O71
54660A19301M71q43k070j955o15Q28J530J426Q47K16n6K51R20J376J093J09q87
54643A21942j126n31L15R34J305J340O88n29j347r92J13R38J103R28N92L9n33
54626A25179q44j069j430j455n88N78P57j64p86j25J044J361O66j69n73p24q14
$$ plain form
54609 120844 120164 119972 120381 121099 121634 121707 121533 121660 122397 123441 124170 124280 123986 123674 123510 123354 122956 122248 121473
54590 121473 120942 120640 120320 120053 120325 121322 122457 123007 123068 123360 124092 124502 123742 121891 119852 118466 117977 118206
54572 118206 118923 119904 120797 121142 120652 119528 118445 118146 118882 120226 121437 122136 122619 123458 124776 126033 126566
54555 126566 126220 125364 124491 123950 123931 124419 125137 125693 125848 125604 125158 124892 125300 126720 129110 132086 135010 137031
54537 137031 137496 136627 135534 135133 135230 135041 134367 133772 133757 134287 135051 135646 135590 134723 133604 132964 132782 132503 132109
54518 132109 132167 132720 133022 132728 132504 132940 133523 133311 132133 130553 129066 127936 127442 127635 128065 128256 128305 128569
54500 128569 129027 129413 129717 130019 130051 129478 128531 127795 127398 126906 126095 125456 125802 127541 130260 132898 134497 134999
54482 134999 135126 135337 135310 134719 134096 134315 135425 136616 137302 137751 138599 140122 142011 143584 144258 144120 143955
$$ packed form
54609A20844o80j92M09P18N35P3j74J27P37J044P29J10k94l12j64j56l98p08p75
54590A21473n31l02l20k67K72R97J135N50O1K92P32M10p60j851k039j386m89K29
54572A18206P17R81Q93L45m90j124j083k99P36J344J211O99M83Q39J318J257N33
54555A26566l46q56q73n41j9M88P18N56J55k44m46k66M08J420K390K976K924K021
54537A37031M65q69j093m01R7j89o74n95j5N30P64N95n6q67j119o40j82k79l94
54518A32109N8N53L02k94k24M36N83k12j178j580j487j130m94J93M30J91M9K64
54500A28569M58L86L04L02L2n73r47p36l97m92q11o39L46J739K719K638J599N02
54482A34999J27K11k7n91o23K19J110J191O86M49Q48J523J889J573O74j38j65
$$ plain form
54465 143955 144472 145649 147092 148710 150542 152123 152663 151970 150777 150021 150031 150388 150338 149454 148150 147400 147582
54448 147582 147783 146736 144330 141741 140057 139301 138848 138305 137812 137787 138537 139880 141165 141907 142309 142821 143301
54431 143301 143163 142370 141738 142019 143066 144090 144466 144138 143540 143295 143738 144586 145232 145431 145457 145637 146034 146627
54413 146627 147395 148119 148441 148293 147993 147779 147569 147296 147167 147388 147888 148445 148881 148988 148591 147856 147328 147460 148260
54394 148260 149483 150875 152054 152538 152269 151942 152434 153859 155406 156132 155784 154899 154222 154068 154231 154472 154936
54377 154936 155913 157263 158419 159029 159362 159903 160765 161637 162163 162216 161999 162071 163152 165629 169206 173137 176824
54360 176824 180109 183091 185791 188008 189460 190021 189809 188996 187631 185761 183651 181638 179744 177596 174869
54345 174869 171645 168320 165345 163075 161576 160396 158797 156572 154486 153500 153561 153611 152917 151991 151812 152370
$$ packed form
54465A43955N17J177J443J618J832J581N40o93j193p56J0L57n0q84j304p50J82
54448A47582K01j047k406k589j684p56m53n43m93k5P50J343J285P42M02N12M80
54431A43301j38p93o32K81J047J024L76l28n98k45M43Q48O46J99K6J80L97N93
54413A46627P68P24L22j48l00k14k10k73j29K21N00N57M36J07l97p35n28J32Q00
54394A48260J223J392J179M84k69l27M92J425J547P26l48q85o77j54J63K41M64
54377A54936R77J350J156O10L33N41Q62Q72N26N3k17P2J081K477L577L931L687
54360A76824L285K982K700K217J452N61k12q13j365j870k110k013j894k148k727
54345A74869l224l325k975k270j499j180j599k225k086r86O1N0o94r26j79N58
$$ plain form
54329 152370 152527 151391 149388 147757 147245 147597 148130 148433 148528 148653 148972 149341 149375 148970 148675 149207 150512 151676
54311 151676 151920 151373 150612 149796 148688 147414 146694 147085 148279 149362 149715 149440 148905 148113 146823 145260 144224
54294 144224 144189 144578 144384 143361 142192 141595 141807 142874 144696 146541 147235 146352 144857 144097 144455 145366 146254
54277 146254 146972 147531 147958 148359 148757 148939 148703 148123 147368 146491 145662 145345 145845 146878 147856 148411 148436 148007 147608
54258 147608 148044 149609 151642 153372 154879 156665 158571 159865 160260 160230 160311 160656 161240 161895 162132 161467 160057
54241 160057 158650 157846 157680 157790 157616 156650 154966 153417 152828 153131 153693 154196 154593 154574 153946 153419 154017 155578
54223 155578 156714 156535 155633 154984 154586 153741 152344 151330 151749 153532 155257 155452 154280 153426 153953 154912 154803
54206 154803 153706 152807 152287 151166 149256 147763 147559 148171 148919 149847 150915 151479 151318 151145 151330 151125 150076
$$ packed form
54329A52370J57j136k003j631n12L52N33L03R5J25L19L69L4m05k95N32J305J164
54311A51676K44n47p61q16j108j274p20L91J194J083L53k75n35p92j290j563j036
54294A44224l5L89j94j023j169n97K12J067J822J845O94q83j495p60L58R11Q88
54277A46254P18N59M27M01L98J82k36n80p55q77q29l17N00J033R78N55K5m29l99
54258A47608M36J565K033J730J507J786J906J294L95l0Q1L45N84O55K37o65j410
54241A60057j407q04j66J10j74r66j684j549n89L03N62N03L97j9o28n27N98J561
54223A55578J136j79r02o49l98q45j397j014M19J783J725J95j172q54N27R59j09
54206A54803j097q99n20j121j910j493k04O12P48R28J068N64j61j73J85k05j049
$$ plain form
54189 150076 149254 149975 151970 153933 155348 156685 158135 159250 159738 159812 159839 160199 161180 162376 162597 161161 158976
54172 158976 157581 157407 157762 158137 158549 158807 158523 157968 157996 158878 159931 160478 160496 160122 159186 157583 155678 153991
54154 153991 152728 151780 150950 150102 149262 148584 148121 147790 147735 148363 149672 150858 151105 150599 150273 150765 152062 153911
54136 153911 155906 157299 157404 156325 154856 153640 152825 152431 152533 153096 154019 155302 156814 158112 158911 159493
54120 159493 160162 160613 160478 160196 160471 161042 160996 160315 160089 160924 162115 162923 163825 165819 168966 172286 174815
54103 174815 176305 177089 177739 178815 180714 183757 188234 194082 200524 206533 211746 216500 220806 223781 224371
54088 224371 222316 218195 212817 206773 200394 194042 188527 184968 183769 183933 184079 184082 184927 186924 189093 190662
54072 190662 192192 194456 196979 198549 198721 198009 196894 195482 193960 192659 191638 190747 190021 189551 189112 188441
$$ packed form
54189A50076q22P21J995J963J415J337J450J115M88P4K7L60R81J196K21j436k185
54172A58976j395j74L55L75M12K58k84n55K8Q82J053N47J8l74r36j603j905j687
54154A53991j263r48q30q48q40o78m63l31n5O28J309J186K47n06l26M92J297J849
54136A53911J995J393J05j079j469j216q15l94J02N63R23J283J512J298P99N82
54120A59493O69M51j35k82K75N71m6o81k26Q35J191Q08R02J994L147L320K529
54103A74815J490P84O50J076J899L043M477N848O442O009N213M754M306K975N90
54088B24371k055m121n378o044o379o352n515l559j199J64J46LQ45J997K169J569
54072A90662J530K264K523J570J72p12j115j412j522j301j021q91p26m70m39o71
$$ plain form
54056 188441 187747 187405 187214 186600 185522 184584 184140 183897 183603 183591 184363 186037 188416 191241 194116 196604 198758
54039 198758 201290 204810 209038 213131 216738 220437 225084 230905 237280 243314 248558 253159 257325 260793
54025 260793 263082 264305 265369 267148 269610 272001 273680 274553 274868 274919 274853 274428 273047 270442 267252 264404
54009 264404 261818 258401 253605 248383 244043 240571 236819 232135 227043 222381 218475 215289 212752 210655
53995 210655 208707 206931 205598 204628 203616 202593 202118 202254 202166 201247 200089 199588 199518 198772 196830 194306 192107
53978 192107 190705 190169 190309 190675 190854 190788 190525 189955 189274 189364 190955 193570 196097 198335 201074 204748 209026
53961 209026 213920 220091 227498 234768 240769 246084 251932 258063 262661 264184 262540 258656 253638 248383
53947 248383 243302 238256 233223 229009 226759 226650 227625 228600 229520 230950 233057 235389 237490 239363 241291
$$ packed form
54056A88441o94l42j91o14j078r38m44k43k94j2P72J674K379K825K875K488K154
54039A98758K532L520M228M093L607L699M647N821O375O034N244M601M166L468
54025B60793K289J223J064J779K462K391J679Q73L15N1o6m25j381k605l190k848
54009B64404k586l417m796n222m340l472l752m684n092m662l906l186k537k097
53995B10655j948j776j333r70j012j023m75J36q8r19j158n01p0p46j942k524k199
53978A92107j402n36J40L66J79o6k63n70o81R0J591K615K527K238K739L674M278
53961B09026M894O171P407P270O001N315N848O131M598J523j644l884n018n255
53947B48383n081n046n033m214k250j09R75R75R20J430K107K332K101J873J928
$$ plain form
53932 241291 243466 245889 248534 251443 254602 257828 260978 264324 268428 273445 278687 283225 286853 290217
53918 290217 293952 298086 302418 307144 312697 319059 325619 331824 337698 343510 349168 354221 358342 361443
53904 361443 363283 363441 361918 359538 357416 356081 355186 353910 351532 347908 343671 339735 336309 332606 327795
53889 327795 321992 315881 309680 303104 296176 289366 282879 276512 270351 264943 260487 256490 252598 249210
53875 249210 246753 244814 242573 239828 237046 234552 232196 229773 227336 225029 222935 221126 219630 218265
53861 218265 216653 214470 211723 208885 206698 205633 205454 205469 205210 204655 203887 202949 202080 201582 201312 200755 199847
53844 199847 199190 199178 199425 199446 199341 199327 199139 198501 197761 197332 196899 195982 195025 194998 195986 197121 197999 199146 200808
53825 200808 202195 202553 202358 202730 203992 205349 205843 205154 203651 202113 201383 201913 203495 205529 207550 209467
$$ packed form
53932B41291K175K423K645K909L159L226L150L346M104N017N242M538L628L364
53918B90217L735M134M332M726N553O362O560O205N874N812N658N053M121L101
53904C61443J840J58j523k380k122j335q95j276k378l624m237l936l426l703m811
53889C27795n803o111o201o576o928o810o487o367o161n408m456l997l892l388
53875B49210k457j939k241k745k782k494k356k423k437k307k094j809j496j365
53861B18265j612k183k747k838k187j065j79J5k59n55p68r38q69m98k70n57r08
53844A99847o57j2K47K1j05j4j88o38p40m29m33r17r57k7R88J135Q78J147J662
53825B00808J387L58j95L72J262J357M94o89j503j538p30N30J582K034K021J917
$$ plain form
53809 209467 211466 213836 216777 220162 223538 226535 229267 232258 235951 240343 245064 249785 254505 259356
53795 259356 264202 268629 272457 275976 279458 282673 285315 287700 290452 293432 295566 296048 295313 294491 294145
53780 294145 293872 292861 290528 286768 282012 277041 272408 267971 263151 257653 251784 246106 240986 236507
53766 236507 232674 229583 227339 225793 224381 222451 219885 217316 215535 214698 214248 213544 212435 211224 210187
53751 210187 209141 207549 205157 202539 200756 200272 200444 200303 199709 199383 199901 201078 202341 203281 203685 203447
53735 203447 202816 202457 202887 203926 204969 205710 206396 207443 209104 211359 213777 215536 216016 215481 214868 214816 215242
53718 215242 215956 217199 219216 221626 223707 225238 226709 228674 231151 233643 235608 236964 238277 240343
53704 240343 243347 246594 249259 251219 252869 254412 255846 257501 259922 263058 266168 268743 271044 273472
$$ packed form
53809B09467J999K370K941L385L376K997K732K991L693M392M721M721M720M851
53795B59356M846M427L828L519L482L215K642K385K752K980K134M82p35q22l46
53780B94145k73j011k333l760m756m971m633m437m820n498n869n678n120m479
53766B36507l833l091k244j546j412j930k566k569j781q37m50p04j109j211j037
53751B10187j046j592k392k618j783m84J72j41n94l26N18J177J263R40M04k38
53735B03447o31l59M30J039J043P41O86J047J661K255K418J759M80n35o13n2M26
53718B15242P14J243K017K410K081J531J471J965K477K492J965J356J313K066
53704B40343L004L247K665J960J650J543J434J655K421L136L110K575K301K428
$$ plain form
53690 273472 275946 278288 280737 283481 285973 287389 287688 287649 287805 287894 287503 286658 285491 283764 281244 278370
53674 278370 276033 274639 273769 272909 272131 271760 271614 271012 269653 268067 266989 266514 266145 265594 265127 265082 265348
53657 265348 265571 265709 266136 267130 268423 269396 269706 269571 269380 269227 269102 269427 270858 273387 276026 277744 278447
53640 278447 278739 279050 279449 280067 281110 282581 284425 286809 289706 292414 294267 295769 298260 302239 306781
53625 306781 310825 314296 317573 320626 323254 325611 327962 330337 332838 335746 338849 341299 342809 344428
53611 344428 347298 351051 354373 356874 359411 362586 365900 368569 370421 371728 372758 373784 375038 376379
53597 376379 377376 377895 378257 378692 378995 378929 378623 378414 378466 378647 378603 377990 376875 375778 375030 374233 372755 370600
53579 370600 368286 365908 362970 359286 355474 352329 350100 348647 347903 347853 348261 348679 348672 348037 346990 346143 346008
$$ packed form
53690B73472K474K342K449K744K492J416K99l9J56Q9l91q45j167j727k520k874
53674B78370k337j394q70q60p78l71j46o02j359j586j078m75l69n51m67m5K66
53657B65348K23J38M27R94J293R73L10j35j91j53j25L25J431K529K639J718P03
53640B78447K92L11L99O18J043J471J844K384K897K708J853J502K491L979M542
53625C06781M044L471L277L053K628K357K351K375K501K908L103K450J510J619
53611C44428K870L753L322K501K537L175L314K669J852J307J030J026J254J341
53597C76379R97N19L62M35L03o6l06k09N2J81m4o13j115j097p48p97j478k155
53579C70600k314k378k938l684l812l145k229j453p44n0M08M18po35j047q47j35
$$ plain form
53562 346008 346486 347037 347297 347246 346903 346296 345717 345555 345809 346113 346307 346606 347170 347927 348862 350050 351343 352408
53544 352408 353146 353719 354231 354831 356101 358639 362184 365807 369190 373064 378147 384321 391172 398617 406489
53529 406489 414124 421033 427649 434816 442858 451622 461116 471441 482314 493279 504383 516172 529049
53516 529049 542990 557871 573710 590563 608372 626977 646198 666035 686778 708596 730957
53505 730957 752919 774245 795767 818271 841421 864257 886327 907762 928531 948299 967001
53494 967001 984994 1002613 1019976 1037194 1054312 1071048 1087000 1102175 1117088 1132287 1148006
53483 1148006 1164151 1180378 1196289 1211829 1227267 1242501 1256684 1269044 1279880 1290110 1299856
53472 1299856 1308072 1313698 1316656 1317549 1316853 1314706 1311017 1305360 1296997 1285539 1271648 1256818 1242210
$$ packed form
53562C46008M78N51K60n1l43o07n79j62K54L04J94K99N64P57R35J188J293J065
53544C52408P38N73N12O00J270K538L545L623L383L874N083O174O851P445P872
53529D06489P635O909O616P167Q042Q764R494J0325J0873J0965J1104J1789J2877
53516E29049J3941J4881J5839J6853J7809J8605J9221J9837K0743K1818K2361
53505G30957K1962K1326K1522K2504K3150K2836K2070K1435K0769J9768J8702
53494I67001J7993J7619J7363J7218J7118J6736J5952J5175J4913J5199J5719
53483A148006J6145J6227J5911J5540J5438J5234J4183J2360J0836J0230R746
53472A299856Q216N626K958Q93o96k147l689n657q363j1458j3891j4830j4608
$$ plain form
53459 1242210 1227786 1212674 1196388 1179456 1162684 1146007 1128521 1109691 1090109 1070823 1052314
53448 1052314 1034384 1016689 998984 981194 963683 947228 932286 918477 905265 892872 882002
53437 882002 872838 864991 858435 853732 851142 850056 849666 849843 851112 853966 858397 863947 870143 876943 884709
53422 884709 893584 903220 913435 924886 938524 954525 972288 991351 1011666 1032998 1054900 1077481
53410 1077481 1101512 1127471 1155023 1183663 1213270 1243776 1275045 1307506 1342210 1379575 1418682
53399 1418682 1458475 1499195 1541812 1586423 1632221 1678867 1726887 1776464 1826742 1876782 1926638
53388 1926638 1976990 2028054 2079326 2130100 2179735 2227405 2272085 2313094 2350644 2385659 2418898
53377 2418898 2450192 2478594 2503315 2524346 2541975 2555871 2564966 2568360 2566029 2558482 2545915 2527959
$$ packed form
53459A242210j4424j5112j6286j6932j6772j6677j7486j8830j9582j9286j8509
53448A052314j7930j7695j7705j7790j7511j6455j4942j3809j3212j2393j0870
53437H82002r164p847o556m703k590j086l90J77J269K854M431N550O196O800P766
53422H84709Q875R636J0215J1451J3638J6001J7763J9063K0315K1332K1902K2581
53410A077481K4031K5959K7552K8640K9607L0506L1269L2461L4704L7365L9107
53399A418682L9793M0720M2617M4611M5798M6646M8020M9577N0278N0040M9856
53388A926638N0352N1064N1272N0774M9635M7670M4680M1009L7550L5015L3239
53377B418898L1294K8402K4721K1031J7629J3896R095L394k331p547j2567j7956
$$ plain form
53365 2527959 2504242 2474891 2440425 2401370 2358210 2311651 2262696 2212355 2161363 2110174 2059011
53354 2059011 2007887 1956850 1906435 1857667 1811304 1767143 1724346 1682357 1641195 1600938 1561452
53343 1561452 1522691 1484880 1448169 1412467 1377879 1345018 1314537 1286541 1260688 1236711 1214604
53332 1214604 1194510 1176632 1161092 1147576 1135274 1123498 1112244 1101904 1092483 1083376 1073874 1063692
53320 1063692 1053122 1042916 1033902 1026398 1019993 1014086 1008550 1003660 999542 996073 993339 991865 992333 995213
53306 995213 1000475 1007290 1014160 1019870 1024519 1029427 1036065 1045354 1057716 1073072 1090627 1109315 1128869
53293 1128869 1149982 1173068 1197286 1221268 1244519 1267613 1291210 1315350 1339560 1363147 1385358
53282 1385358 1405687 1424092 1440684 1455182 1466976 1475697 1481495 1484758 1485803 1484715 1481192 1474607 1464604
$$ packed form
53365B527959k3717k9351l4466l9055m3160m6559m8955n0341n0992n1189n1163
53354B059011n1124n1037n0415m8768m6363m4161m2797m1989m1162m0257l9486
53343A561452l8761l7811l6711l5702l4588l2861l0481k7996k5853k3977k2107
53332A214604k0094j7878j5540j3516j2302j1776j1254j0340r421r107r502j0182
53320A063692j0570j0206r014p504o405n907n536m890m118l469k734j474M68K880
53306I95213N262O815O870N710M649M908O638R289J2362J5356J7555J8688J9554
53293A128869K1113K3086K4218K3982K3251K3094K3597K4140K4210K3587K2211
53282A385358K0329J8405J6592J4498J1794Q721N798L263J045j088l523o585j0003
$$ plain form
53269 1464604 1451671 1436815 1420618 1402911 1383323 1361790 1338444 1313441 1287101 1259898 1232090
53258 1232090 1203563 1174222 1144356 1114598 1085697 1058307 1032527 1007562 982307 956530 931094
53247 931094 906784 883345 860001 836416 812671 788798 765035 742307 721675 703235 686126
53236 686126 669628 653750 638771 624833 612114 600861 590965 581899 573285 565183 557776 551146 545412
53223 545412 540461 535279 528215 518470 507030 495682 485395 476013 467120 458501 449921 441148 432407
53210 432407 424322 417185 410557 403769 396616 389410 382520 376073 370073 364606 359716 355084 350004 343971
53196 343971 337274 330724 324741 319035 313342 308033 303636 299977 296343 292450 288817 286005 283836 281589
53182 281589 278862 275958 273408 271285 269214 267063 265268 264181 263278 261587 258961 256401 254836 254028 253060
$$ packed form
53269A464604j2933j4856j6197j7707j9588k1533k3346k5003k6340k7203k7808
53258A232090k8527k9341k9866k9758k8901k7390k5780k4965k5255k5777k5436
53247I31094k4310k3439k3344k3585k3745k3873k3763k2728k0632j8440j7109
53236F86126j6498j5878j4979j3938j2719j1253r896r066q614q102p407o630n734
53223E45412m951n182p064r745j1440j1348j0287r382q893q619q580q773q741
53210D32407q085p137o628o788p153p206o890o447o000n467m890m632n080o033
53196C43971o697o550n983n706n693n309m397l659l634l893l633k812k169k247
53182B81589k727k904k550k123k071k151j795j087r03j691k626k560j565q08r68
$$ plain form
53167 253060 251512 249681 247935 246448 245422 244957 244656 243855 242386 240801 239752 239422 239558 239707 239444 238737
53151 238737 238140 238254 238875 239086 238326 237051 236172 236109 236490 236532 235611 233809 232116 231740 232969 234866 236299
53134 236299 237000 237410 237794 237967 237784 237431 237131 236885 236707 236881 237713 239083 240497 241704 243029 244873 246991
53117 246991 248620 249356 249542 249680 249837 249905 250083 250596 251155 251221 250769 250267 249824 248905 247091 244699 242351 240240
53099 240240 238202 236307 234987 234562 234839 235264 235427 235353 235268 235098 234477 233338 232238 231745 231692 231438 230801 230284
53081 230284 230320 230768 231229 231470 231408 231122 230976 231370 232160 232724 232728 232383 231807 230732 229195 227929 227523 227563 227193
53062 227193 226226 225070 223791 222025 219873 218181 217628 218004 218657 219299 220018 220781 221310 221469 221490 221757 222430
53045 222430 223295 223883 223751 222854 221738 221228 221606 222093 221486 219482 217138 215768 215665 216166 216645 216868 216666
$$ packed form
53167B53060j548j831j746j487j026m65l01q01j469j585j049l30J36J49k63p07
53151B38737n97J14O21K11p60j275q79o3L81M2r21j802j693l76J229J897J433
53134B36299P01M10L84J73j83l53l00k46j78J74Q32J370J414J207J325J844K118
53117B46991J629P36J86J38J57O8J78N13N59O6m52n02m43r19j814k392k348k111
53099B40240k038j895j320m25K77M25J63p4q5j70o21j139j100m93n3k54o37n17
53081B30284L6M48M61K41o2k86j46L94P90N64Ml45n76j075j537j266m06M0l70
53062B27193r67j156j279j766k152j692n53L76O53O42P19P63N29J59K1K67O73
53045B22430Q65N88j32q97j116n10L78M87o07k004k344j370j03N01M79K23k02
$$ plain form
53028 216666 216005 215434 215690 216651 217356 217355 217349 218041 219091 219875 220660 222098 223864 224808 224484 223686 223230 222906 222059
53009 222059 220722 219676 219494 219892 220051 219501 218618 218162 218340 218542 218163 217362 216717 216386 216114 215936 216334 217578
52991 217578 219312 220908 221953 222314 222148 222009 222619 224200 226168 227689 228493 229029 229881 231124 232275 232892
52975 232892 233160 233715 234822 236069 237108 238336 240258 242309 243023 241702 239410 237937 238009 238888 239516 239552
52959 239552 239280 238986 238759 238728 239103 239869 240608 240807 240311 239375 238331 237391 236729 236442 236291 235723 234364 232390
52941 232390 230304 228475 226997 225817 224826 223959 223318 223050 223008 222787 222272 221883 222048 222684 223436 224172 224912 225506
52923 225506 225741 225682 225600 225699 226066 226623 226915 226371 225153 224314 224540 225132 224943 224047 223583 224034 224600 224473 223898
52904 223898 223614 223856 224317 224633 224512 223763 222577 221526 221087 221329 222134 223340 224615 225581 226243 226924 227695
$$ packed form
53028B16666o61n71K56R61P05joO92J050P84P85J438J766R44l24p98m56l24q47
53009B22059j337j046j82L98J59n50q83m56J78K02l79q01o45l31k72j78L98J244
52991B17578J734J596J045L61j66j39O10J581J968J521Q04N36Q52J243J151O17
52975B32892K68N55J107J247J039J228J922K051P14j321k292j473P2Q79O28L6
52959B39552k72k94k27l1L75P66P39J99m96r36j044r40o62k87j51n68j359j974
52941B32390k086j829j478j180r91q67o41k68m2k21n15l89J65O36P52P36P40N94
52923B25506K35n9q2R9L67N57K92n44j218q39K26N92j89q96m64M51N66j27n75
52904B23898k84K42M61L16j21p49j186j051m39K42Q05J206J275R66O62O81P71
$$ plain form
52887 227695 228288 228633 228994 229478 229969 230612 231636 232533 232257 230757 229506 229826 231258 232384 232756 233099 233902
52870 233902 234818 235615 236792 238870 241610 244335 246797 249344 252200 254796 256075 255632 254437 253967 254565
52855 254565 255088 254332 252233 249381 246004 242110 238217 235098 232902 231120 229333 227377 224941 221773 218420
52840 218420 216060 215306 215626 216115 216407 216569 216646 216646 216729 217061 217659 218520 219655 220826 221533 221546 221283 221336 221732 221871
52820 221871 221224 219877 218371 217161 216407 216241 216955 218666 220890 222817 224099 225082 226132 227209 228327
52805 228327 229935 232268 234614 235848 235561 234153 231968 229027 225586 222230 219229 216451 214018 212400
52791 212400 211560 210744 209581 208757 209034 210080 210894 211052 210817 210342 209557 208805 208843 209989 211769 213519 214908
52774 214908 215799 216108 215994 215777 215414 214448 212780 211113 210265 210237 210359 210190 209887 209720 209642 209476 209260 209269 209783
$$ packed form
52887B27695N93L45L61M84M91O43J024Q97k76j500j251L20J432J126L72L43Q03
52870B33902R16P97J177K078K740K725K462K547K856K596J279m43j195m70N98
52855B54565N23p56k099k852l377l894l893l119k196j782j787j956k436l168l353
52840B18420k360p54L20M89K92J62P7%Q3L32N98Q61J135J171P07J3k63N3L96J39
52820B21871o47j347j506j210p54j66P14J711K224J927J282R83J050J077J118
52805B28327J608K333K346J234k87j408k185k941l441l356l001k778k433j618
52791B12400q40q16j163q24K77J046Q14J58k35m75p85p52L8J146J780J750J389
52774B14908Q91L09j14k17l63r66j668j667q48k8J22j69l03j67p8j66k16RN14
$$ plain form
52755 209783 210881 212310 213504 213923 213520 212840 212560 212968 213906 215107 216470 218072 219986 222119 224210 226099
52739 226099 227974 230207 232813 235236 236869 237652 237937 237820 237026 235563 234126 233494 233680 233943 233606 232558
52723 232558 230954 228838 226323 223954 222499 222263 222797 223405 223735 223688 222970 221252 218942 217308 217336 218609
52707 218609 219826 220428 221094 222413 223628 223359 221445 219480 219312 221311 224243 226584 227683 227800 227448 226958
52691 226958 226574 226596 227185 228135 229022 229621 230058 230572 231251 231925 232163 231524 230082 228656 228087 228243 228210 227612 227181
52672 227181 227662 228638 229040 228543 227821 227481 227387 227149 226773 226599 226881 227643 228759 230043 231387 232819 234283
52655 234283 235516 236369 237255 238884 241527 244753 247803 249935 250485 249186 246595 243853 241760 240331 239287
52640 239287 238576 238159 237701 236881 235840 235066 234928 235437 236261 236824 236737 236315 236387 237322 238555 239424 240137 241371
$$ packed form
52755B09783J098J429J194M19m03o80k80M08R38J201J363J602J914K133K091J889
52739B26099J875K233K606K423J633P83K85j17p94j463j437o32J86K63l37j048
52723B32558j604k116k515k369j455k36N34O08L30m7p18j718k310j634K8J273
52707B18609J217O02O66J319J215k69j914j965j68J999K932K341J099J17l52m90
52691B26958l84K2N89R50Q87N99M37N14O79O74K38o39j442j426n69J56l3n98m31
52672B27181M81R76M02m97p22l40r4k38l76j74K82P62J116J284J344J432J464
52655B34283J233Q53Q86J629K643L226L050K132N50j299k591k742k093j429j044
52640B39287p11m17m58q20j041p74j38N09Q24N63q7m22P2R35J233Q69P13J234
$$ plain form
52622 241371 243087 244400 244628 243964 242956 241867 240856 240272 240235 240162 239314 237835 236748 236694 237078 236826 235737
52605 235737 234671 234463 235119 236121 237012 237445 237124 236169 235321 235306 236065 236989 237781 238643 239651 240510 241029 241414
52587 241414 241853 242196 242230 241953 241468 240944 240799 241455 242708 243773 244219 244401 244683 244784 244448 244196 244707 245682
52569 245682 246128 245647 244785 244069 243460 242864 242436 242070 241174 239452 237561 236495 236515 237059 237608 238259 239396 241048
52551 241048 242689 243679 243877 243769 243914 244331 244590 244416 243929 243273 242343 241055 239699 238790 238636 239117 239826 240414
52533 240414 240969 242039 244077 246792 249232 250546 250564 249697 248621 248088 248619 250090 251789 253032 253569 253367
52517 253367 252403 250956 249774 249575 250445 251962 253720 255555 257467 259650 262361 265427 268070 269660 270479
52502 270479 271297 272245 272655 272051 270737 269157 267200 264551 261422 258470 256084 254061 252025 249895 247905
$$ packed form
52622B41371J716J313K28o64j008j089j011n84l7p3q48j479j087n4L84k52j089
52605B35737j066k08O56J002Q91M33l21r55q48j5P59R24P92Q62J008Q59N19L85
52587B41414M39L43L4k77m85n24j45O56J253J065M46J82K82J01l36k52N11R75
52569B45682M46m81q62p16o09n96m28l66q96j722j891j066K0N44N49O51J137J652
52551B41048J641R90J98j08J45M17K59j74m87o56r30j288j356r09j54M81P09N88
52533B40414N55J070K038K715K440J314J8q67j076n33N31J471J699J243N37k02
52517B53367r64j447j182j99Q70J517J758J835J912K183K711L066K643J590Q19
52502B70479Q18R48M10o04j314j580j957k649l129k952k386k023k036k130j990
$$ plain form
52487 247905 246325 245260 244662 244497 244837 245730 247031 248457 249791 250938 251823 252426 252893 253412 253983 254575 255474
52470 255474 257078 259259 261335 262895 264256 265763 267046 267567 267640 268280 270000 272270 274267 275650 276496
52455 276496 276957 277205 277361 277152 275968 273543 270321 267002 263989 261533 259934 259094 258123 256094 253216 250784
52439 250784 249802 250003 250367 250271 249900 249773 250129 250741 251194 251301 251232 251193 251108 250801 250394 250231 250457 250913 251474 252167
52419 252167 252922 253565 254197 255218 256744 258313 259482 260524 262186 264878 268371 272256 276439 281203 286977
52404 286977 293952 301707 309265 315627 320186 322548 322332 319567 315102 310080 304972 299550 293890 288829
52390 288829 285137 282571 280200 277540 275082 273722 273881 275159 276725 277987 278937 279866 280860 281814 282835
52375 282835 284236 285993 287651 289070 290878 293694 297141 300238 302719 305364 308836 312779 316308 318921
$$ packed form
52487B47905j580j065n98j65L40Q93J301J426J334J147Q85O03M67N19N71N92Q99
52470B55474J604K181K076J560J361J507J283N21P3O40J720K270J997J383Q46
52455B76496M61K48J56k09j184k425l222l319l013k456j599q40r71k029k878k432
52439B50784r82K01L64r6l71j27L56O12M53J07o9l9q5l07m07j63K26M56N61O93
52419B52167P55O43O32J021J526J569J169J042J662K692L493L885M183M764N774
52404B86977O975P755P558O362M559K362k16k765m465n022n108n422n660n061
52390B88829l692k566k371k660k458j360J59J278J566J262R50R29R94R54J021
52375B82835J401J757J658J419J808K816L447L097K481K645L472L943L529K613
$$ plain form
52361 318921 320501 320824 319763 317894 316328 315718 315772 315855 315746 315599 315510 315447 315524 316036 317217 319076 321453 324099
52343 324099 326717 329073 331095 332873 334633 336807 339878 343930 348409 352662 356740 361431 367431 374768
52329 374768 383176 392635 403259 414825 426875 439218 452051 465472 479225 493084 507259 522216
52317 522216 538172 554866 571743 588215 603853 618511 632323 645547 658459 671399 684746
52306 684746 698575 712340 725099 736253 745995 755004 763755 772246 780303 787891 794967 801202 806142
52293 806142 809684 812150 813766 814258 813208 810628 806841 801876 795431 787629 779391 771695 764726 758184
52279 758184 752317 748092 746193 746243 747324 749014 751601 755450 760565 766768 773978 782129 790990 800218 809515
52264 809515 818692 827690 836618 845676 854935 864292 873786 883791 894671 906214 917626 928195 937764
$$ packed form
52361C18921J580L23j061j869j566o10N4Q3j09j47q9o3P7N12J181J859K377K646
52343C24099K618K356K022J778J760K174L071M052M479M253M078M691O000P337
52329C74768Q408R459J0624J1566J2050J2343J2833J3421J3753J3859J4175J4957
52317E22216J5956J6694J6877J6472J5638J4658J3812J3224J2912J2940J3347
52306F84746J3829J3765J2759J1154R742R009Q751Q491Q057P588P076O235M940
52293H06142L542K466J616M92j050k580l787m965o445p802q238p696o969o542
52279G58184n867m225j899N0J081J690K587L849N115O203P210Q151Q861R228R297
52264H09515R177Q998Q928R058R259R357R494J0005J0880J1543J1412J0569R569
$$ plain form
52251 937764 946515 954461 961329 966759 970384 971827 970978 968262 964318 959222 952366 943358 932812 921871
52237 921871 911063 900021 888319 876089 863659 851074 838374 826065 814808 804727 795473 786926
52225 786926 779311 772539 766005 759397 753247 748201 744076 740230 736712 734276 733194 732774 732475 732880 734921
52210 734921 738416 742094 745024 747474 750187 753311 756279 758446 759670 760494 761843 764240 767141 769404
52196 769404 770657 771893 774389 778341 782937 787406 791430 794719 797002 798620 800477 803056 805844 808036
52182 808036 809385 809995 809670 807957 804695 800132 794592 788399 782020 775842 769824 763703 757585 752030 747526
52167 747526 744235 742239 741629 742190 743340 744635 746122 748082 750623 753678 757115 760647 763838 766431 768543
52152 768543 770326 771638 772281 772456 772705 773437 774741 776644 779274 782665 786527 790365 793792 796734 799308
$$ packed form
52251I37764Q751P946O868N430L625J443q49k716l944n096o856r008j0546j0941
52237I21871j0808j1042j1702j2230j2430j2585j2700j2309j1257j0081r254q547
52225G86926p615o772o534o608o150n046m125l846l518k436j082m20k99M05K041
52210G34921L495L678K930K450K713L124K968K167J224Q24J349K397K901K263
52196G69404J253J236K496L952M596M469M024L289K283J618J857K579K788K192
52182H08036J349O10l25j713l262m563n540o193o379o178o018o121o118n555m504
52167G47526l291j996o10N61J150J295J487J960K541L055L437L532L191K593K112
52152G68543J783J312O43J75K49P32J304J903K630L391L862L838L427K942K574
$$ plain form
52137 799308 801519 803132 803978 804395 805205 807190 810732 815951 822936 831672 841947 853608 866813 881787
52123 881787 898425 916392 935639 956592 979649 1004516 1030097 1055145 1079063 1102024 1124277
52112 1124277 1145540 1165329 1183636 1200755 1216440 1229868 1240675 1249428 1256665 1262067 1265160 1266412
52100 1266412 1266829 1266683 1265405 1262735 1259180 1255271 1250965 1245968 1240068 1232997 1224436 1214307 1202587 1188879
52086 1188879 1172868 1155390 1138254 1122638 1108299 1094763 1082550 1072529 1064671 1058276 1053145 1049754
52074 1049754 1048433 1049120 1051855 1056752 1063366 1070730 1078340 1086673 1096472 1107775 1119835 1131770 1143107
52061 1143107 1153810 1163975 1173534 1182352 1190496 1198177 1205362 1211764 1217347 1222436 1227071 1230691 1232846
52048 1232846 1233763 1233625 1231683 1226873 1219130 1209260 1197610 1183771 1167819 1150897 1134118 1117550 1100875
$$ packed form
52137G99308K211J613Q46M17Q10J985L542N219O985Q736J0275J1661J3205J4974
52123H81787J6638J7967J9247K0953K3057K4867K5581K5048K3918K2961K2253
52112A124277K1263J9789J8307J7119J5685J3428J0807Q753P237N402L093J252
52100A266412M17j46j278k670l555l909m306m997n900p071q561j0129j1720j3708
52086A188879j6011j7478j7136j5616j4339j3536j2213j0021p858o395n131l391
52074A049754j321O87K735M897O614P364P610Q333R799J1303J2060J1935J1337
52061A143107J0703J0165R559Q818Q144P681P185O402N583N089M635L620K155
52048A232846R17j38j942m810p743r870j1650j3839j5952j6922j6779j6568j6675
$$ plain form
52035 1100875 1084519 1069456 1056111 1043972 1032228 1020458 1008841 997911 988002 978784 969590 960266
52023 960266 951268 942706 933828 923956 913543 903675 894741 886195 877561 869067 861205 854207 848049 842514
52009 842514 837050 830905 823656 815382 806272 796375 785928 775500 765526 755834 745848 735115 723440
51996 723440 710805 697546 684529 672748 662677 654217 647269 641973 638174 634929 630953 625577 619084
51983 619084 612071 604744 596959 588705 580195 571526 562497 552832 542458 531481 520129 508846 498308
51970 498308 489081 481321 474954 470169 467505 467391 469722 473902 479188 484975 490962 497191 503806 510617
51956 510617 516967 522182 526051 528619 529635 528584 525414 520897 516035 511337 506948 503301 501237 501500
51942 501500 504467 510350 519219 530704 544091 559048 576044 595792 618412 643257 669285 695255
$$ packed form
52035A100875j6356j5063j3345j2139j1744j1770j1617j0930r909r218r194r324
52023I60266q998q562q878r872j0413r868q934q546q634q494p862o998o158n535
52009H42514n464o145p249q274r110r897j0447j0428r974r692r986j0733j1675
51996G23440j2635j3259j3017j1781j0071q460o948n296l799l245l976n376o493
51983F19084p013p327p785q254q510q669r029r665j0374j0977j1352j1283j0538
51970D98308r227p760o367m785k664j14K331M180N286N787N987O229O615O811
51956E10617O350N215L869K568J016j051l170m517m862m698m389l647k064K63
51942E01500K967N883Q869J1485J3387J4957J6996J9748K2620K4845K6028K5970
$$ [...]
##END NTUPLES=NMR SPECTRUM
##END=
