
##TITLE=UV1112_M2_1290-1353_7180724_vbbVE3yvxo
##JCAMPDX= 6.0         $$ Bruker NMR JCAMP-DX V2.0
##DATA TYPE= NMR SPECTRUM
##DATA CLASS= NTUPLES
##ORIGIN= BRUKER
##OWNER= Administrator
$$ 1.72 TOPSPIN		Version 2.1
$$ 2012-12-05 01:29:22.243 -0500  Administrator@X
$$ Compression mode = diff/dup
##.OBSERVE FREQUENCY= 400.02188249412
##.OBSERVE NUCLEUS= ^1H
##.ACQUISITION MODE= SIMULTANEOUS (DQD)
##.ACQUISITION SCHEME= undefined
##.AVERAGES= 64
##.DIGITISER RES= 22
##SPECTROMETER/DATA SYSTEM= spect
##.PULSE SEQUENCE= noesygpps1d.comp
##.SOLVENT NAME= COFFEE_meoh
##.SHIFT REFERENCE= INTERNAL, COFFEE_meoh, 1, 14.96095
##AUDIT TRAIL= $$ (NUMBER, WHEN, WHO, WHERE, PROCESS, VERSION, WHAT)
$$ ##TITLE= Audit trail, TOPSPIN		Version 2.1
$$ ##JCAMPDX= 5.01
$$ ##ORIGIN= Bruker BioSpin GmbH
$$ ##OWNER= Administrator
$$ $$ E:\/data/COFFEE/nmr/UV1112_M2_1290-1353_7180724_vbbVE3yvxo/12/pdata/1/auditp.txt
$$ ##AUDIT TRAIL=  $$ (NUMBER, WHEN, WHO, WHERE, PROCESS, VERSION, WHAT)
(   1,<2012-12-05 01:29:16.290 -0500>,<Administrator>,<X>,<go>,<TOPSPIN 2.1>,
      <created by zg
	started at 2012-12-05 01:17:46.116 -0500,
	POWCHK enabled, PULCHK disabled,
       configuration hash MD5:
       86 BA 57 50 F2 9D 5C 9B 26 00 A9 28 5F 66 2E 89
       data hash MD5: 64K
       86 26 40 0C 63 CE B3 F3 A0 3B BF 8F 13 CB B6 8A>)
(   2,<2012-12-05 01:29:19.477 -0500>,<Administrator>,<X>,<proc1d>,<TOPSPIN 2.1>,
      <Start of raw data processing
       efp LB = 0.3 FT_mod = 6 PKNL = 1 PHC0 = 0 PHC1 = 0 SI = 128K 
       data hash MD5: 128K
       11 B2 A2 82 99 66 02 3C 82 13 DE A4 C5 58 5D 54>)
(   3,<2012-12-05 01:29:20.524 -0500>,<Administrator>,<X>,<proc1d>,<TOPSPIN 2.1>,
      <pk PHC0 = -80.94177 PHC1 = 0 
       data hash MD5: 128K
       94 F8 7E 4B E3 1A 35 AB E0 A7 D1 4F 3B 20 30 5C>)
(   4,<2012-12-05 01:29:21.196 -0500>,<Administrator>,<X>,<proc1d>,<TOPSPIN 2.1>,
      <abs ABSG = 1 
       data hash MD5: 128K
       AF 0C 84 D8 27 6E FB B5 90 85 C0 72 EB 6F 4D 1C>)
(   5,<2012-12-05 01:29:21.368 -0500>,<Administrator>,<X>,<proc1d>,<TOPSPIN 2.1>,
      <abs ABSG = 2 
       data hash MD5: 128K
       B9 56 A5 87 85 94 A5 C3 9B 07 89 55 EF 6B 7F 50>)
(   6,<2012-12-05 01:29:21.556 -0500>,<Administrator>,<X>,<proc1d>,<TOPSPIN 2.1>,
      <abs ABSG = 3 
       data hash MD5: 128K
       AC 00 A6 60 1F 2F E4 27 E0 10 51 22 34 67 5D 18>)
(   7,<2012-12-05 01:29:21.712 -0500>,<Administrator>,<X>,<proc1d>,<TOPSPIN 2.1>,
      <abs ABSG = 4 
       data hash MD5: 128K
       20 D3 5C 12 9D BE FE DA 03 92 6F FC 06 6B 10 D4>)
(   8,<2012-12-05 01:29:21.899 -0500>,<Administrator>,<X>,<proc1d>,<TOPSPIN 2.1>,
      <abs ABSG = 5 
       data hash MD5: 128K
       B2 3B 8E 8C 31 1E D8 C3 5E F3 43 CF 18 63 60 28>)
$$ ##END=
$$ 
$$ $$ hash MD5
$$ $$ 32 36 24 3D 3F 38 1A 47 F1 1C 24 5B 88 59 FD 87
##$RELAX= 
##$RELAX= 
##$RELAX= 
##$RELAX= 
##$RELAX= 
##$RELAX= 
##$RELAX= 
##$RELAX= 
$$ Bruker specific parameters
$$ --------------------------
##$DU= <E:\>
##$EXPNO= 12
$$ [...]
##$TP07= 0
##$TPNAME0= <>
##$TPNAME1= <>
##$TPNAME2= <>
##$TPNAME3= <>
##$TPNAME4= <>
##$TPNAME5= <>
##$TPNAME6= <>
##$TPNAME7= <>
##$TPOAL= (0..7)
0.5 0.5 0.5 0.5 0.5 0.5 0.5 0.5
##$TPOFFS= (0..7)
0 0 0 0 0 0 0 0
##$TUNHIN= 0
##$TUNHOUT= 0
##$TUNXOUT= 0
##$USERA1= <user>
##$USERA2= <user>
##$USERA3= <user>
##$USERA4= <user>
##$USERA5= <user>
##$V9= 5
##$VALIST= <valist>
##$VCLIST= <CCCCCCCCCCCCCCC>
##$VD= 0
##$VDLIST= <DDDDDDDDDDDDDDD>
##$VPLIST= <PPPPPPPPPPPPPPP>
##$VTLIST= <TTTTTTTTTTTTTTT>
##$WBST= 2048
##$WBSW= 25
##$XGAIN= (0..3)
0 0 0 0
##$XL= 0
##$YL= 0
##$YMAX_a= 5482621
##$YMIN_a= -11139268
##$ZGOPTNS= <>
##$ZL1= 120
##$ZL2= 120
##$ZL3= 120
##$ZL4= 120
##$ABSF1= 14.96095
##$ABSF2= -5.597232
##$ABSG= 5
##$ABSL= 3
##$ALPHA= 0
##$AQORDER= 0
##$ASSFAC= 0
##$ASSFACI= 0
##$ASSFACX= 0
##$ASSWID= 0
##$AUNMP= <proc_prof1d_extract.lims>
##$AXLEFT= 0
##$AXNAME= <>
##$AXNUC= <1H>
##$AXRIGHT= 0
##$AXTYPE= 0
##$AXUNIT= <>
##$AZFE= 0.1
##$AZFW= 0.1
##$BCFW= 0
##$BC_mod= 0
##$BYTORDP= 0
##$COROFFS= 0
##$CY= 15
##$DATMOD= 1
##$DC= 0
##$DFILT= <>
##$DTYPP= 0
##$F1P= 0
##$F2P= 0
##$FCOR= 0.5
##$FTSIZE= 131072
##$FT_mod= 6
##$GAMMA= 0
##$GB= 0
##$INTBC= 1
##$INTSCL= 1
##$ISEN= 128
##$LB= 0.3
##$LEV0= 0
##$LPBIN= 0
##$MAXI= 10000
##$MC2= 0
##$MEAN= 0
##$ME_mod= 0
##$MI= 0
##$NCOEF= 0
##$NC_proc= -2
##$NLEV= 6
##$NOISF1= 0
##$NOISF2= 0
##$NSP= 0
##$NTH_PI= 0
##$NZP= 0
##$OFFSET= 14.96095
##$PC= 1
##$PHC0= -80.94177
##$PHC1= 0
##$PH_mod= 1
##$PKNL= yes
##$PPARMOD= 0
##$PPDIAG= 0
##$PPIPTYP= 0
##$PPMPNUM= 2147483647
##$PPRESOL= 1
##$PSCAL= 4
##$PSIGN= 0
##$PYNMP= <proc.py>
##$REVERSE= no
##$SF= 400.020009658792
##$SI= 131072
##$SIGF1= 0
##$SIGF2= 0
##$SINO= 400
##$SIOLD= 131072
##$SPECTYP= <>
##$SREGLST= <1H.CDCl3>
##$SSB= 0
##$STSI= 131072
##$STSR= 0
##$SW_p= 8223.68421052631
##$SYMM= 0
##$S_DEV= 0
##$TDeff= 65536
##$TDoff= 0
##$TI= <>
##$TILT= no
##$TM1= 0
##$TM2= 0
##$TOPLEV= 0
##$USERP1= <user>
##$USERP2= <user>
##$USERP3= <user>
##$USERP4= <user>
##$USERP5= <user>
##$WDW= 1
##$XDIM= 131072
##$YMAX_p= 383867807
##$YMIN_p= -23121
##$CURPLOT= <Network HP LaserJet P1505>
##$CURPRIN= <$Network HP LaserJet P1505>
##$DFORMAT= <normdp>
##$LAYOUT= <+/1D_H.xwp>
##$LFORMAT= <normlp>
##$PFORMAT= <normpl>
##$SURQMSG= 1
$$ End of Bruker specific parameters
$$ ---------------------------------
##NTUPLES= NMR SPECTRUM
##VAR_NAME=  FREQUENCY,     SPECTRUM/REAL,   SPECTRUM/IMAG
##SYMBOL=    X,             R,               I
##VAR_TYPE=  INDEPENDENT,   DEPENDENT,       DEPENDENT
##VAR_FORM=  AFFN,          ASDF,            ASDF
##VAR_DIM=   131072,        131072,          131072
##UNITS=     HZ,            ARBITRARY UNITS, ARBITRARY UNITS
##FACTOR=    0.0627417313425164, 1,          1
##FIRST=     8223.62146879497, 800,          -50965
##LAST=      0,             2576,            -51059
##MIN=       0,             -23121,          0
##MAX=       8223.62146879497, 383867807,    0
$$ Real data points
##PAGE= N=1
##DATA TABLE= (X++(R..R)), XYDATA
$$ [...]
63920C322373p3298r5101j13487j29379j43295j54007j60193j62172j61143j57636
63910A972662j51693j43907j35240j26026j15939j04892r3402q2133p1580o2029
63900H85821n3474m5642l8421l2147k7210k3518k0626j8169j5951j3929j2425
63889E84309j1936j2291j2432j1557j0218r523r441q821p065m902l195j809k16
63876D80903J501K957M414O573R469J2259J4318J5982J7940K0327K2731K4897
63864F34271K6973K9160L1438L3688L5767L7373L8127L7950L7219L6287L5044
63853A013297L3134L0517K7486K4127K0052J4804Q373J319n436j0982j4921j7664
63841A124106k0114k2941k6287k9988l3747l6993l9055l9789l9750l9498l8994
$$ y = [3322373, 3249075, 3153974, 3040487, 2911108, 2767813, 2613806, 2453613, 2291441, 2130298, 1972662, 1820969, 1677062, 1541822, 1415796, 1299857, 1194965, 1101563, 1019430, 947850, 885821, 832347, 786705, 748284, 716137, 688927, 665409, 644783, 626614, 610663, 596734, 584309, 572373, 560082, 547650, 536093, 525875, 516352, 506911, 498090, 491025, 486123, 482928, 481119, 480903, 482404, 485361, 489775, 496348, 505817, 518076, 532394, 548376, 566316, 586643, 609374, 634271, 661244, 690404, 721842, 755530, 791297, 828670, 866797, 904747, 941966, 978253, 1013297, 1046431, 1076948, 1104434, 1128561, 1148613, 1163417, 1171790, 1173109, 1167673, 1156691, 1141770, 1124106, 1103992, 1081051, 1054764, 1024776, 991029, 954036, 914981, 875192, 835442, 795944, 756950]
63830G56950l7963l6544l5185l3963l2443l0207k7332k4413k2266k1344k1176
63819D34114k0595j8842j6294j3818j1722r826q240p372p187p108o762o199n398
63806B94751m231l119k925l738m401l882k570j701j801k386k907l257l420l277
63792B51136k948k816l015l213l062k605k076j598j207r82r96j243j679k247k788
63777B18661l075k961k398j378l4J179J676J280M29k81o51q78j078j083p77m08
63761B08223l79o81q61o22k44j52k75k38p2k38q27j189p10L80J305J592J300O41
63743B06953j38o58n61P1P59J145J283J420J647J805J745J630J896K669L411L466
63727B28543K993K806L176L542L608L938M824N372M686L425L001L530L765L052
$$ y = [756950, 718987, 682443, 647258, 613295, 580852, 550645, 523313, 498900, 476634, 455290, 434114, 413519, 394677, 378383, 364565, 352843, 343017, 334777, 327405, 320218, 313110, 306348, 300149, 294751, 290520, 287401, 284476, 280738, 276337, 272455, 269885, 268184, 266383, 263997, 261090, 257833, 254413, 251136, 248188, 245372, 242357, 239144, 236082, 233477, 231401, 229803, 228596, 227614, 226618, 225375, 223696, 221449, 218661, 215586, 212625, 210227, 208849, 208815, 209994, 211670, 212950, 213379, 213098, 212447, 211569, 210491, 209408, 208631, 208223, 207844, 207163, 206302, 205680, 205436, 205284, 205009, 204771, 204699, 204461, 203634, 202445, 201735, 202115, 203420, 205012, 206312, 206953, 206815, 206157, 205596, 205667, 206426, 207571, 208854, 210274, 211921, 213726, 215471, 217101, 218997, 221666, 225077, 228543, 231536, 234342, 237518, 241060, 244668, 248606, 253430, 258802, 263488, 266913, 269914, 273444, 277209, 280261]
63713B80261K073J441P67l69j561k307k807l368l694l427k806k235j660r40k92
63698B59076J35N53R10O67j98o59%R89J173Q48J251K599L903M559M857M862M048
63681B89573K502J294J105J262Q25o6n65l54J82O82J149J633K062K354K487K470
63665C08595K346K099J620R15K37k79r79k297l969n213n663n640n451n022m355
63650B76944l743l285k714k021j722k089k569k395j452j94R61J831K370K740L242
63635B65904L902M321M168L632L215L268L848M669N192N168N108N717O836P701
63621C32649Q297R449J1270J2590J2699J2720J4165J6813J9184K0695K2015K3576
63609E16122K4979K6018K7065K8147K8616K8158K7267K6157K4004J9951J4411
$$ y = [280261, 282334, 283775, 284542, 284173, 282612, 280305, 277498, 274130, 270436, 267009, 264203, 261968, 260308, 259368, 259076, 259211, 259764, 260674, 261341, 261143, 260484, 260484, 261473, 262646, 263494, 264745, 267344, 271247, 275806, 280663, 285525, 289573, 292075, 293369, 294474, 295736, 296561, 296495, 295930, 295576, 295758, 296440, 297589, 299222, 301284, 303638, 306125, 308595, 310941, 313040, 314660, 315575, 315812, 315533, 314554, 312257, 308288, 303075, 297412, 291772, 286321, 281299, 276944, 273201, 269916, 267202, 265181, 263459, 261370, 258801, 256406, 254954, 254760, 255721, 257552, 259922, 262662, 265904, 269806, 274127, 278295, 281927, 285142, 288410, 292258, 296927, 302119, 307287, 312395, 318112, 324948, 332649, 340946, 350395, 361665, 374255, 386954, 399674, 413839, 430652, 449836, 470531, 492546, 516122, 541101, 567119, 594184, 622331, 650947, 679105, 706372, 732529, 756533, 776484, 790895]
63598G90895Q723L732o71m702p903r515r498q870q899r965j1486j2953j4609j6846
63584F87433j9404k1588k2978k3484k2981k1511j9623j7865j6123j3969j1488
63573D76419r095o788m334k039m03R02K702M858O188O189N788N929O368O525O662
63558E05871P390Q588R701J0764J2328J4529J6885J8946K0647K2185K3969K6515
63546F98318K9902L3442L6158L7451L7075L4754L0172K3186J3932L192p160j4688
63534I55734j8108j8213j6787j4924j2905j1082j0049j0088j1089j2994j5758
63523H03737j8996k2228k5293k8088l0095l0720k9989k8379k6201k3673k1383
63512E18692j9909j9011j7882j6224j4426j2750j1023r228p736o807o307o022
$$ y = [790895, 799618, 803350, 802679, 797977, 790074, 780559, 771061, 762191, 753292, 743327, 731841, 718888, 704279, 687433, 668029, 646441, 623463, 599979, 576998, 555487, 535864, 517999, 501876, 487907, 476419, 467324, 460536, 456202, 454163, 453760, 454662, 457364, 462222, 468410, 474599, 480387, 486316, 492684, 499209, 505871, 513261, 521849, 531550, 542314, 554642, 569171, 586056, 605002, 625649, 647834, 671803, 698318, 728220, 761662, 797820, 835271, 872346, 907100, 937272, 960458, 974390, 977582, 970422, 955734, 937626, 919413, 902626, 887702, 874797, 863715, 853666, 843578, 832489, 819495, 803737, 784741, 762513, 737220, 709132, 679037, 648317, 618328, 589949, 563748, 540075, 518692, 498783, 479772, 461890, 445666, 431240, 418490, 407467, 398239, 390503, 383696, 377389, 371367]
63500C71367n737n139m174l439l457l657l000j675j039j585k111j542n09k06m70
63485C33627j93Q45J733J878J694J724J976K302K742L186L272K927K608K665K858
63470C65844K712K098J115k38j911l447m238m203l947m066m460m519l892k900
63456C33948k157j956k053j971j396m61L38O45P83J542L242N247O679P438Q121
63441C57989R177J0583J2282J4359J6715J9044K1277K3691K6374K8991L1119L2309
63429F03910L1727K8373K2228J4859Q443M299K467K347L394N463Q836J3691J9380
63416G69417K4533K8167L0338L1489L1553L0101K6946K2156J5959R071K704k449
63404A019985o801j0754j3581j4372j3830j3857j5292j7189j8641k0122k2429
$$ y = [371367, 365630, 360491, 356317, 352878, 349421, 345764, 342764, 341089, 340050, 338465, 336354, 334812, 334303, 334097, 333627, 333434, 334279, 336012, 337890, 339584, 341308, 343284, 345586, 348328, 351514, 354786, 357713, 360321, 362986, 365844, 368556, 370654, 371769, 371531, 369620, 366173, 361935, 357732, 353785, 349719, 345259, 340740, 336848, 333948, 331791, 329835, 327782, 325811, 324415, 323954, 324292, 324937, 325720, 327262, 330504, 335751, 342430, 349868, 357989, 367166, 377749, 390031, 404390, 421105, 440149, 461426, 485117, 511491, 540482, 571601, 603910, 635637, 664010, 686238, 701097, 709540, 713839, 716306, 718653, 722047, 727510, 736346, 750037, 769417, 793950, 822117, 852455, 883944, 915497, 945598, 972544, 994700, 1010659, 1019730, 1022434, 1019985, 1013184, 1002430, 988849, 974477, 960647, 946790, 931498, 914309, 895668, 875546, 853117]
63393H53117k5242k7594k9131l0104l0498l0053k8903k7414k5446k2534j8900
63382E57298j5636j3613j2583j1555r773p199m365j998n40K69J246K999N295P426
63368D97271R131J0914J3227J5631J7206J7767J8275J9724K1995K4173K5770K7145
63356G18229K8762L0541L2083L3052L3134L1961K9383K5658K1095J5711R510K955
63344A012074l037p595j0357j1580j1946j2139j2508j3178j4361j6292j8834k1538
63332H58709k4188k6888k9397l0868l0654k9064k6897k4487k1647j8322j4768
63321E81529j1133p419l935j286J44K96j087m523r895j5835k0357k2210k1467
63308D62822j9065j6036j3133j0800r200q249p687p256o799o197n362m451l961
$$ y = [853117, 827875, 800281, 771150, 741046, 710548, 680495, 651592, 624178, 598732, 576198, 557298, 541662, 528049, 515466, 503911, 494138, 486939, 482574, 480576, 480036, 480305, 481551, 484550, 489845, 497271, 506402, 517316, 530543, 546174, 563380, 581147, 599422, 619146, 641141, 665314, 691084, 718229, 746991, 777532, 809615, 842667, 875801, 907762, 937145, 962803, 983898, 999609, 1009119, 1012074, 1009037, 1001442, 991085, 979505, 967559, 955420, 942912, 929734, 915373, 899081, 880247, 858709, 834521, 807633, 778236, 747368, 716714, 687650, 660753, 636266, 614619, 596297, 581529, 570396, 562977, 559042, 557756, 557900, 558196, 557109, 552586, 542691, 526856, 506499, 484289, 462822, 443757, 427721, 414588, 403788, 394588, 386339, 378652, 371396, 364597, 358400, 353038, 348587, 344626]
63295C44626m250m877m833l731k400j883k247k830l396m179m886m626l203j712
63281B95573j201j357j195o13m19q91j262q79j14L05L38M15N12J25q20j645j754
63264B85118j340r28n37K19J314K130K209J798J426J288J283J388J607J763J753
63249C00491J803K144K525K507K152J993K361L168M237N340N931N581M796M700
63235C49729N681P037Q195R484J1167J2543J2854J2482J2320J2390J2111J1573
63223D77566J1418J1521J1073J0138R923J0992J2225J2339J1619J1216J1324J1006
63211F12360R582P340M894K572M55j598m074p331j0809j3267j4120j4137j4414
63198E57453j4966j4815j3410j1435r930q957p586n170k238J27J431K004K358
$$ y = [344626, 340376, 335499, 330666, 326935, 324535, 322652, 320405, 317575, 314179, 310000, 305114, 300488, 297285, 295573, 294372, 293015, 291820, 291207, 290788, 289897, 288635, 287756, 287642, 287947, 288285, 288700, 289212, 289337, 288517, 286872, 285118, 283778, 282850, 282313, 282532, 283846, 285976, 288185, 289983, 291409, 292697, 293980, 295368, 296975, 298738, 300491, 302294, 304438, 306963, 309470, 311622, 313615, 315976, 319144, 323381, 328721, 334652, 340233, 345029, 349729, 355410, 362447, 370642, 380126, 391293, 403836, 416690, 429172, 441492, 453882, 465993, 477566, 488984, 500505, 511578, 521716, 531639, 542631, 554856, 567195, 578814, 590030, 601354, 612360, 621942, 629282, 634176, 636748, 637203, 635605, 631531, 624200, 613391, 600124, 586004, 571867, 557453, 542487, 527672, 514262, 502827, 492897, 483940, 476354, 471184, 468946, 469073, 470504, 472508, 474866]
63185D74866K795L617N097P030Q742R835J0659J1681J2640J2769J1880J0803J0546
63172E92960J1147J1608J1093R932R125Q867Q204O422M191K562J250j070m778
63159F71513q724j1837j4245j6334j7729j8066j7904j7962j7975j7286j6067j4954
63147D82430j3894j2449j0947j0138r771q778p010n555n065m829m037k981k358
63134C84618k108j708j059m71j00J54M77J158K326L464L748L122K480K431K634
63119D01166K731L102M071N069N374N120M784M256L292K484K718L883N014N592
63105D58656N807N710N022L920L148L205L996N223O439O839N975M630M090M393
63091E27053M339L426K624K703K962K438J457R15O13m59k428m232n094n404n847
$$ y = [474866, 477661, 481278, 486375, 493405, 502147, 511982, 522641, 534322, 546962, 559731, 571611, 582414, 592960, 604107, 615715, 626808, 636740, 645865, 654732, 662936, 669358, 673549, 676111, 677361, 676291, 671513, 662789, 650952, 636707, 620373, 602644, 584578, 566674, 548712, 530737, 513451, 497384, 482430, 468536, 456087, 445140, 435002, 425231, 416453, 409443, 403888, 398823, 393994, 389957, 386976, 384618, 382510, 380802, 379743, 379272, 379172, 379326, 379803, 380961, 383287, 386751, 390499, 393621, 396101, 398532, 401166, 403897, 406999, 411070, 416139, 421513, 426633, 431417, 435673, 438965, 441449, 444167, 448050, 453064, 458656, 464463, 470173, 475195, 479115, 482263, 485468, 489464, 494687, 501126, 507965, 513940, 518570, 522660, 527053, 531392, 534818, 537442, 540145, 543107, 545545, 547002, 547917, 548530, 548071, 545643, 541411, 536317, 530913, 525066]
63076E25066o358o289n273l593j915p88k47J50Q34J772K674L407M010M390M513
63061E22353M804N898P818R827J1321J2587J4272J6408J8378J9867K1288K3084
63049F87905K4943K6155K6671K7284K8606L0200L1095L0921L0181K9473K8949
63038A002383K8603K8593K8954K9277K9099K8465K7798K7163K5998K3683K0178
63027A300194J5992J1556O798J325m975j1590j7755k3143k8051l2690l6529l8634
63015A142498l8754l7708l6439l4939l2447k8617k3991j9303j4832j0699p277
63004H57492m693k233R86M797Q114J0377J2151J4041J5816J7039J7880J8618J8910
62991I89295J8380J7510J7098J7077J6728J5931J5255J4838J4016J2269R658O205
$$ y = [525066, 518708, 512419, 507146, 503553, 501638, 500850, 500603, 500753, 501587, 503359, 506033, 509440, 513450, 517840, 522353, 527157, 533055, 540873, 550700, 562021, 574608, 588880, 605288, 623666, 643533, 664821, 687905, 712848, 739003, 765674, 792958, 821564, 851764, 882859, 913780, 943961, 973434, 1002383, 1030986, 1059579, 1088533, 1117810, 1146909, 1175374, 1203172, 1230335, 1256333, 1280016, 1300194, 1316186, 1327742, 1334540, 1335865, 1330890, 1319300, 1301545, 1278402, 1250351, 1217661, 1181132, 1142498, 1103744, 1066036, 1029597, 994658, 962211, 933594, 909603, 890300, 875468, 864769, 857492, 852799, 850566, 851552, 856349, 864463, 874840, 886991, 901032, 916848, 933887, 951767, 970385, 989295, 1007675, 1025185, 1042283, 1059360, 1076088, 1092019, 1107274, 1122112, 1136128, 1148397, 1158055, 1164260]
62979A164260J652l799r288j4309j9167k4006k8079l0608l1805l2443l2810l2709
62967I06889l2058l0896k9090k6668k4189k2245k0701j9010j7098j5485j4557
62956F54892j4182j3965j3550j2804j1936j1311j0967j0575j0048r735r754r706
62944E16359r418r303r492r275q189p033o811p172o980o086n309m845m032k817
62930D19597k178k596l259l279k816k355j774p91K94R60J112R21M64j8n5L83O63
62913D05273L83m5j81l03p78j235j065l75K49N99Q28R41R38J186J950K815L237
62896D14417L411L850M325M120L365L140M081N460O018N204L427J499Q0o86j212
62881D60499j908k588k720k252j782j810k163k395k431k634l319m284m841m501
$$ y = [1164260, 1165912, 1162113, 1152825, 1138516, 1119349, 1095343, 1067264, 1036656, 1004851, 972408, 939598, 906889, 874831, 843935, 814845, 788177, 763988, 741743, 721042, 702032, 684934, 669449, 654892, 640710, 626745, 613195, 600391, 588455, 577144, 566177, 555602, 545554, 535819, 526065, 516359, 506941, 497638, 488146, 478871, 470682, 463649, 456838, 449666, 442686, 436600, 431291, 426446, 422414, 419597, 417419, 414823, 411564, 408285, 405469, 403114, 401340, 400549, 400843, 401803, 402915, 403836, 404300, 404282, 404227, 404610, 405273, 405656, 405611, 405430, 405127, 404349, 403114, 402049, 401674, 401923, 402522, 403350, 404291, 405229, 406415, 408365, 411180, 414417, 417828, 421678, 426003, 430123, 433488, 436628, 440709, 446169, 452187, 457391, 460818, 462317, 462397, 461711, 460499, 458591, 456003, 453283, 451031, 449249, 447439, 445276, 442881, 440450, 437816, 434497, 430213, 425372, 420871]
62867D20871l693l441m068m618m034k608j595j640k251k674k571j881p77J23K30
62852C85373j78k97MM6m07o41j00P52J158J000M86l56j329j798j425p04j78L18
62834C81724R58J127K54r90j339o67j03m34j197j498r96R0J271J970J974J805
62818C83949K131K752K814K121J449J348J397J047O04P87J680K636L003K653K024
62803D12395J898K763M154M957M676M029L926M319M564M576M952O031P445Q673
62789D79358R611J0512J1712J3499J5884J8433K0542K2101K3696K6098K9604L3800
62777G14850L7879M1148M3437M5061M6309M7032M6822M5442M2918L9276L4411
62766A184585K8244K0948J2983M978k585r721j6794k3883l0420l5657l9389m1955
$$ y = [420871, 417178, 413737, 409669, 405051, 401017, 398409, 396814, 395174, 392923, 390249, 387678, 385797, 385020, 385143, 385373, 385195, 384898, 384902, 384948, 384541, 383900, 383800, 384552, 385710, 386710, 387196, 386840, 385511, 383713, 382288, 381584, 381406, 381724, 382682, 383809, 384063, 383073, 381734, 381067, 380964, 380530, 379333, 377835, 376839, 376929, 378200, 380170, 382144, 383949, 386080, 388832, 391646, 393767, 395216, 396564, 397961, 399008, 399612, 400399, 402079, 404715, 407718, 410371, 412395, 414293, 417056, 421210, 426167, 430843, 434872, 438798, 443117, 447681, 452257, 457209, 463240, 470685, 479358, 488969, 499481, 511193, 524692, 540576, 559009, 579551, 601652, 625348, 651446, 681050, 714850, 752729, 793877, 837314, 882375, 928684, 975716, 1022538, 1067980, 1110898, 1150174, 1184585, 1212829, 1233777, 1246760, 1251738, 1249153, 1239432, 1222638, 1198755, 1168335, 1132678, 1093289, 1051334]
62754A051334m3631m4400m4242m3384m2146m0758l9308l7653l5417l2412k9072
62743F18911k6186k4023k2053j9716j7164j4989j3420j2164j0866r454q001o602
62731D34273n443m756m507m264l661k848k303k166k003j338k29Q76J685K156K235
62716D07707J889J544K015L637N737P278Q013Q627R845J1637J3451J4925J6248
62703E12553J7869J9940K2065K3721K4934K6391K8671L1577L4393L6663L8391
62692H17168L9615M0243M0290L9845L8613L5886L1296K5346J8940J2492N759j479
62680A144014q912j5919k2160k7671l2515l6538l9643m2017m3760m4373m3131
62669G87375m0133l6600l3704l1439k9011k6096k3204k0896j9211j7897j6744
$$ y = [1051334, 1007703, 963303, 919061, 875677, 833531, 792773, 753465, 715812, 680395, 647983, 618911, 592725, 568702, 546649, 526933, 509769, 494780, 481360, 469196, 458330, 448876, 440875, 434273, 428830, 424074, 419567, 415303, 411642, 408794, 406491, 404325, 402322, 400984, 400755, 401631, 403316, 405472, 407707, 409596, 411140, 413155, 416792, 422529, 429807, 437820, 446447, 456292, 467929, 481380, 496305, 512553, 530422, 550362, 572427, 596148, 621082, 647473, 676144, 707721, 742114, 778777, 817168, 856783, 897026, 937316, 977161, 1015774, 1051660, 1082956, 1108302, 1127242, 1139734, 1145493, 1144014, 1135102, 1119183, 1097023, 1069352, 1036837, 1000299, 960656, 918639, 874879, 830506, 787375, 747242, 710642, 676938, 645499, 616488, 590392, 567188, 546292, 527081, 509184, 492440]
62658D92440j5583j4301j2946j1594j0133q485o897n669m722l936l686m350n338
62645C84800n503m680l942l995m171l589k482j619j053l47M32Q44R85J341J842
62630C58863J851J171K92m02j032j665k028j970j686j312p48q6L19M21O30J208
62614C53826J851K189K285K376K466K477K559K893L411L985M695N650O674P450
62600D04787P917Q325Q988J0120J1711J3425J4779J5742J6913J8829K1103K2638
62588E75277K2779K1910K0806J9664J8092J5778J2758R073M657k00m705q321j1385
62575F96183j4507j7440j9210j9471j9111j9179j9659j9728j8917j7515j6119
62564D95327j5162j4740j4443j3517j1607r316p592o660n980n166m444m107m025
$$ y = [492440, 476857, 462556, 449610, 438016, 427883, 419398, 412501, 406832, 402110, 398174, 394488, 390138, 384800, 379297, 374617, 370675, 366680, 362509, 358920, 356438, 354819, 353766, 353419, 353851, 354695, 355680, 357021, 358863, 360714, 361885, 362177, 361775, 360743, 359078, 357050, 355080, 353394, 352082, 351334, 351248, 351567, 351988, 352618, 353826, 355677, 357866, 360151, 362527, 364993, 367470, 370029, 372922, 376333, 380318, 385013, 390663, 397337, 404787, 412704, 421029, 430017, 440137, 451848, 465273, 480052, 495794, 512707, 531536, 552639, 575277, 598056, 619966, 640772, 660436, 678528, 694306, 707064, 716137, 720794, 720594, 715889, 707568, 696183, 681676, 664236, 645026, 625555, 606444, 587265, 567606, 547878, 528961, 511446, 495327, 480165, 465425, 450982, 437465, 425858, 416542, 408950, 402290, 396310, 391144, 386700, 382593, 378568]
62551C78568l905l673l414l097k586j781p43K21P18O48L74K98M11M99N62P22Q75
62534C64697Q23O65O34O32L73m9j47L67J344K456L405L977M281M826N999P625
62518D01908R426J1495J3793J5601J6385J6861J8197K0299K2062K3160K4289K5454
62506F18930K5554K4161K2362K1038J9567J7118J4025J0803O957K112k572n596
62494G74459p172q589r971j0268r223p725o131l736l10L223O158Q867J1823J4745
62480G56150J7392K0131K2997K4936K4883K3058K0464J7484J3665Q700L046k340
62468I50566o708j0239j4213j9835k6538l2052l4700l5112l5023l4982l4199l2309
62456F34656l0084k8189k6225k3550k0397j7551j5293j3256j1168r137p225n281
$$ y = [378568, 374663, 370990, 367576, 364479, 361893, 360112, 359369, 359590, 360308, 360956, 361330, 361628, 362039, 362538, 363100, 363822, 364697, 365520, 366185, 366819, 367451, 367824, 367775, 367628, 367995, 369339, 371795, 375200, 379177, 383458, 388284, 394283, 401908, 411334, 422829, 436622, 452223, 468608, 485469, 503666, 523965, 546027, 569187, 593476, 618930, 644484, 668645, 691007, 712045, 731612, 748730, 762755, 773558, 780515, 782627, 780055, 774459, 767287, 758698, 748727, 738459, 729236, 721511, 715380, 711644, 711334, 714557, 720715, 729582, 741405, 756150, 773542, 793673, 816670, 841606, 866489, 889547, 910011, 927495, 941160, 949860, 952906, 950566, 943858, 933619, 919406, 899571, 873033, 840981, 806281, 771169, 736146, 701164, 666965, 634656, 604572, 576383, 550158, 526608, 506211, 488660, 473367, 460111, 448943, 439806, 432581, 427300]
62444D27300l363j906j133o09K72J469K377K676K679K775K987L218L522L719L166
62429D49149J381j181l391m528m787m849n209n897o492o480n815n098m912n101
62415C86790n053m574m029l679l344k810k164j607j253j199j464j787j854j774
62401C50199k002k582k903k342r56O42J833K359K437K611L225L961M225L938L585
62386C68230L448L337L194L363L981M641N047N544O544P726Q380Q318Q020Q012
62372D47785Q499R461J0725J2031J3223J4309J5174J5579J5858J7138K0291K4703
62360F24776K8773L1720L4344L7817M2155M6269M9279N1311N2946N4141N3942
62349A107473N1302M6076L9030L1022K2483J3661M961l266j0900j7752k3350k7489
$$ y = [427300, 423937, 422031, 420898, 420289, 420561, 422030, 424407, 427083, 429762, 432537, 435524, 438742, 442264, 445983, 449149, 450530, 449349, 445958, 441430, 436643, 431794, 426585, 420688, 414196, 407716, 401901, 396803, 391891, 386790, 381737, 377163, 373134, 369455, 366111, 363301, 361137, 359530, 358277, 357078, 355614, 353827, 351973, 350199, 348197, 345615, 342712, 340370, 339414, 340056, 341889, 344248, 346685, 349296, 352521, 356482, 360707, 364645, 368230, 371678, 375015, 378209, 381572, 385553, 390194, 395241, 400785, 407329, 415055, 423435, 431753, 439773, 447785, 456284, 465745, 476470, 488501, 501724, 516033, 531207, 546786, 562644, 579782, 600073, 624776, 653549, 685269, 719613, 757430, 799585, 845854, 895133, 946444, 999390, 1053531, 1107473, 1158775, 1204851, 1243881, 1274903, 1297386, 1311047, 1316008, 1312742, 1301842, 1284090, 1260740, 1233251]
62337A233251l0766l4077l7554m0431m1968m2079m0965l8685l5421l1791k8534
62326H30980k5903k3670k1610j9756j8180j6845j5807j5380j5812j6843j7761
62315F23413j7991j7590j7001j6518j6120j5746j5408j4951j4017j2438j0555
62304D55078q920p692o507m985l249j846j228j328j699j962j974j596o12Q35K038
62289D14353K409K313K700L838M880M957M227L546L460L869M402M705M567M161
62275D68387M018M378M765M624M221M420N647P465R229J0682J1913J3248J5233
62262E68230J8267K1995K5605K8879L2502L6972M1694M5727M9063N2381N5673
62251I76988N7844N7962N6190N3039M8185M0808L1035K0361J0426J715o295j4079
$$ y = [1233251, 1202485, 1168408, 1130854, 1090423, 1048455, 1006376, 965411, 926726, 891305, 859514, 830980, 805077, 781407, 759797, 740041, 721861, 705016, 689209, 673829, 658017, 641174, 623413, 605422, 587832, 570831, 554313, 538193, 522447, 507039, 492088, 478071, 465633, 455078, 446158, 438466, 431959, 426974, 423725, 421879, 420651, 419323, 417624, 415662, 413688, 412092, 411480, 412315, 414353, 416762, 419075, 421775, 425613, 430493, 435450, 439677, 443223, 446683, 450552, 454954, 459659, 464226, 468387, 472405, 476783, 481548, 486172, 490393, 494813, 500460, 507925, 517154, 527836, 539749, 552997, 568230, 586497, 608492, 634097, 662976, 695478, 732450, 774144, 819871, 868934, 921315, 976988, 1034832, 1092794, 1148984, 1202023, 1250208, 1291016, 1322051, 1342412, 1352838, 1354553, 1348258, 1334179]
62239A334179k1583k8541l4855m0531m5475m9492n2347n3852n3935n2706n0385
62228H50477m7220m3477l9405l5140l0817k6783k3509k1112j9215j7459j5795
62217E30545j4157j2266j0263q935q676q592p570n956n090n218n161m305l584
62204D30772l717l766k598q67r7l00K3J560L251L965L975M207M907N722O539P553
62188D61129Q722R663J0088J0085J0040J0351J1107J2057J2930J3660J4061J3596
62176E97489J1946R787Q439Q660J0167J2362J4997J8027K1385K5141K9433L3988
62164H01821L8073M1213M3644M5702M7147M7305M5674M2043L6322K8724J9983
62153A237651J1083K684m955j1689j7340k1988k6124l0350l4798l8878m1741m3009
$$ y = [1334179, 1312596, 1284055, 1249200, 1208669, 1163194, 1113702, 1061355, 1007503, 953568, 900862, 850477, 803257, 759780, 720375, 685235, 654418, 627635, 604126, 583014, 563799, 546340, 530545, 516388, 504122, 493859, 484924, 476248, 467656, 460086, 454130, 449040, 443822, 438661, 434356, 430772, 427055, 423289, 420691, 419824, 419727, 419427, 419450, 421010, 424261, 428226, 432201, 436408, 441315, 447037, 453576, 461129, 469851, 479514, 489602, 499687, 509727, 520078, 531185, 543242, 556172, 569832, 583893, 597489, 609435, 619222, 627661, 636321, 646488, 658850, 673847, 691874, 713259, 738400, 767833, 801821, 839894, 881107, 924751, 970453, 1017600, 1064905, 1110579, 1152622, 1188944, 1217668, 1237651, 1248734, 1251418, 1246463, 1234774, 1217434, 1195446, 1169322, 1138972, 1104174, 1065296, 1023555, 980546]
62141I80546m2922m1725l9336l5881l2104k8673k5324k1455j7366j4086j1918
62130F69756j0064q048o520o067o034n332l878k366j077K28J417K120K652L951
62116F30738O260Q684J0239J0676J0026Q140N240K334L71o94j447j972j943j556
62102F85096j656k824m889p415j0036j2090j2604j1186q620o024l717j408P14
62089F03341J941K158K330L461N456P409Q700R425R993J0722J1750J3038J4467
62076G04191J6130J8296K0867K3132K4454K5022K5470K5971K6250K6365K6803
62065I62951K7691K8525K8901K9043K9233K9198K8382K6594K4050K0913J7082
62054A252563J2299O456j1o019j0483j3369j5832j9099k3399k8065l2345l5808
$$ y = [980546, 937624, 895899, 856563, 820682, 788578, 759905, 734581, 713126, 695760, 681674, 669756, 659692, 651644, 645124, 639057, 633023, 627691, 623813, 621447, 620370, 620598, 622015, 624135, 626787, 630738, 636998, 645682, 655921, 666597, 676623, 684763, 690003, 692337, 692708, 692014, 690567, 688595, 686652, 685096, 683440, 680616, 675727, 668312, 658276, 646186, 633582, 622396, 613776, 607752, 604035, 602627, 603341, 605282, 607440, 609770, 613231, 618687, 626096, 634796, 644221, 654214, 664936, 676686, 689724, 704191, 720321, 738617, 759484, 782616, 807070, 832092, 857562, 883533, 909783, 936148, 962951, 990642, 1019167, 1048068, 1077111, 1106344, 1135542, 1163924, 1190518, 1214568, 1235481, 1252563, 1264862, 1271318, 1271307, 1265288, 1254805, 1241436, 1225604, 1206505, 1183106, 1155041, 1122696, 1086888]
62042A086888l8262l9651m0033l9522l8354l6916l5417l3556l0985k8116k5848
62031G00228k4315k2589k0080j7459j5549j3990j1926r611q137p750p525o888
62019E34409o387o586p144p469p562p515o932n630m410m213m669m397k765n40
62005D58190J337K849M343N641O268O262O090N967N744N408N117M764L996K818
61991E24794J684P96j76j485k877m135n551p333q950r702r663r334q726p579o399
61976D45364o194o964p407o586n087l977l413k968k688k936l528l865l722l240
61962C82789k360j046J07K91m07j026r09k19P05J842L032L755L705L269L118L673
61946D00319N024O995R026J0400J0912J1158J1971J3750J6212J8575K0021K0413
$$ y = [1086888, 1048626, 1008975, 968942, 929420, 891066, 854150, 818733, 785177, 754192, 726076, 700228, 675913, 653324, 633244, 615785, 600236, 586246, 574320, 564709, 556572, 548822, 541297, 534409, 528022, 521436, 514292, 506823, 499261, 491746, 484814, 479184, 474774, 470561, 465892, 461495, 458730, 458190, 459527, 462376, 466719, 472360, 478628, 484890, 490980, 496947, 502691, 508099, 513216, 517980, 521976, 524794, 526478, 527274, 527098, 525613, 522736, 518601, 513050, 505717, 496767, 487065, 477402, 468068, 459342, 451763, 445364, 439170, 432206, 424799, 418213, 413126, 409149, 405736, 402768, 400080, 397144, 393616, 389751, 386029, 382789, 380429, 379383, 379490, 379781, 379374, 378348, 377439, 377220, 377925, 379767, 382799, 386554, 390259, 393528, 396646, 400319, 405343, 412338, 421364, 431764, 442676, 453834, 465805, 479555, 495767, 514342, 534363, 554776]
61934E54776K0497K0969K1440K0991J9721J8751J8429J7567J5119J1873R412P978
61922G57523O344L732O91j952m079n751o540o061m759l550k730j740Q9K875O250
61907G40342R645J2405J4055J4748J5241J5990J6287J4738J0821N661R09k862
61895H67980o286r914j3443j6282j8308j9677k0266j9858j8722j7570j6910j6573
61883F74171j5995j4815j3242j1897j1215j0985j0602r825q994q455q045p382
61871E42719o362n122l810k621j773j080P2J877L564M323M594N582P571R576J0906
61856E70016J2128J3997J6268J8329K0411K3233K6587K9330L0755L1270L1511
61845H23835L1532L1170L0558K9720K8090K4940K0161J4338Q277K764j625m955
$$ y = [554776, 575273, 596242, 617682, 638673, 658394, 677145, 695574, 713141, 728260, 740133, 749545, 757523, 763867, 767599, 768290, 766338, 762259, 756508, 749968, 743907, 739148, 735598, 732868, 731128, 731217, 734092, 740342, 749987, 762392, 776447, 791195, 806436, 822426, 838713, 853451, 864272, 869933, 870842, 867980, 861694, 851780, 838337, 822055, 803747, 784070, 763804, 743946, 725224, 707654, 690744, 674171, 658176, 643361, 630119, 618222, 607007, 596022, 585420, 575595, 566601, 558146, 550101, 542719, 536357, 531235, 527425, 524804, 523031, 521951, 522023, 523900, 527464, 531787, 536381, 541963, 549534, 559110, 570016, 582144, 596141, 612409, 630738, 651149, 674382, 700969, 730299, 761054, 792324, 823835, 855367, 886537, 917095, 946815, 974905, 999845, 1020006, 1034344, 1042621, 1045385, 1043760, 1038805]
61833A038805p941j1079j3791j4980j4259j2166r211n419r78L353O937R831J2221
61820I81323J3732J3761J2292R674N887O35n786j2342j8182k3163k7320l0382
61808I20129l2195l3148l3663l3492l2132k9819k7520k5772k4072k1693j8795
61797F07828j6293j4746j3799j2749j1291r583p879o350n111m178l431k814k434
61784D97170k258j894j044j9N96P68J025J530J764J402R50J028J447J590J409
61769E05464J393J618J561R69L41L30J005J949K671K878K582K086J727J549J456
61754E29579J476J520J097j25j485j786p75M28O82j7r99j883k573k858k672k431
61738E17178k471k466j997j377j271j562j424m74O94J302J194P76N42Q01J460
$$ y = [1038805, 1030864, 1019785, 1005994, 991014, 976755, 964589, 955378, 949959, 948981, 952334, 959271, 969102, 981323, 995055, 1008816, 1021108, 1030782, 1036669, 1037304, 1031518, 1019176, 1000994, 977831, 950511, 920129, 887934, 854786, 821123, 787631, 755499, 725680, 698160, 672388, 648316, 626623, 607828, 591535, 576789, 562990, 550241, 538950, 529367, 521488, 515138, 510027, 505849, 502418, 499604, 497170, 494912, 493018, 491974, 491955, 492551, 493319, 494344, 495874, 497638, 499040, 499990, 501018, 502465, 504055, 505464, 506857, 508475, 510036, 511005, 511346, 511676, 512681, 514630, 517301, 520179, 522761, 524847, 526574, 528123, 529579, 531055, 532575, 533672, 533547, 532062, 530276, 529501, 529929, 530611, 530594, 529595, 527712, 525139, 522281, 519609, 517178, 514707, 512241, 510244, 508867, 507596, 506034, 504610, 504136, 504830, 506132, 507326, 508102, 508644, 509445, 510905]
61723E10905K048K189K120K354K911L261L030K375J662J192J213J640J763Q13
61709E39476r77k378k562k014j776k309l402m703n834o287n770m656l710l422
61695D89676l743m241m306l523k202j297j417k102k409j962j110l38l1n29j720
61680D58746k705k559j485o08n43p62n84j04K22L40M13L11j39o45p42m89m20p88
61662D47459j302j600j572j197n50l3j61q05j049j79J325K268K170J758J881K391
61646D50804K474J911J426J650K264K584K631K990L673L775K629P58p37j422j643
61631D75767j689j521j355j804l054m328m656m007l248l071l303l302k752j870
61617D35807j065n78m36n19o19n92n70r73k119l780n285o160o481o519o287n687
$$ y = [510905, 512953, 515142, 517262, 519616, 522527, 525788, 528818, 531193, 532855, 534047, 535260, 536900, 538663, 539476, 538499, 536121, 533559, 531545, 529769, 527460, 524058, 519355, 513521, 507234, 501464, 496808, 493098, 489676, 485933, 481692, 477386, 473863, 471661, 470364, 468947, 466845, 464436, 462474, 461364, 461026, 460995, 460466, 458746, 456041, 453482, 451997, 451389, 450846, 450084, 449500, 449396, 449618, 449958, 450371, 450682, 450543, 449898, 449156, 448667, 448247, 447459, 446157, 444557, 442985, 441788, 441238, 441205, 441044, 440239, 439190, 439011, 440336, 442604, 444774, 446532, 448413, 450804, 453278, 455189, 456615, 458265, 460529, 463113, 465744, 468734, 472407, 476182, 478811, 479569, 478832, 477410, 475767, 474078, 472557, 471202, 469398, 466344, 462016, 457360, 453353, 450105, 447034, 443731, 440429, 437677, 435807, 434742, 434164, 433728, 433209, 432590, 431998, 431428, 430455, 428336, 424556, 419271, 413111, 406630, 400111, 393824, 388137]
61601C88137m913m349m098l917l637l393l364l585m049m652n020m718l850l065
61587C31527k774k663k294j787j578j709j837j753j578j471j478j620j799j759
61573C05427j437j216j485j997k109j559p23r9J07o8m34o55n12j92j8J2P6J09
61555B93227JK9M48P38J32r54j034M40K028K009N81n21k85O59J256J282J123R91
61537C02150Q35P36R33J501K143K390K032J332P38L97J06k63n96q62j245j735
61521C10592j936j605j090q42p86n88k61j49l39n87p00o70n60n37q24j340j590
61504B96188j360j129j345j638j398q03m28j45N90J415J264O5q98q03l87n49q71
61487B87768m74L57N73Km55j77N45J178J508J469J075O64O49R53J118J020R58
$$ y = [388137, 383224, 378875, 374777, 370860, 367223, 363830, 360466, 356881, 352832, 348180, 343160, 338442, 334592, 331527, 328753, 326090, 323796, 322009, 320431, 318722, 316885, 315132, 313554, 312083, 310605, 308985, 307186, 305427, 303990, 302774, 301289, 299292, 297183, 295624, 294901, 294802, 294909, 294841, 294407, 293752, 293240, 293048, 293030, 293042, 293118, 293227, 293228, 293257, 293705, 294443, 294575, 293621, 292587, 293027, 295055, 297064, 297645, 297124, 296839, 297498, 298754, 300036, 301159, 302150, 302985, 303721, 304654, 306155, 308298, 310688, 312720, 314052, 314790, 315187, 315293, 315030, 314434, 313572, 312327, 310592, 308656, 307051, 305961, 305119, 304333, 303745, 303484, 303335, 302996, 302409, 301709, 301039, 300479, 299942, 299118, 297778, 296188, 294828, 293699, 292354, 290716, 289318, 288515, 288087, 287942, 288532, 289947, 291211, 291276, 290378, 289575, 289188, 288639, 287768, 287294, 287651, 288224, 288226, 287771, 287594, 288139, 289317, 290825, 292294, 293369, 294033, 294682, 295635, 296753, 297773, 298731]
61470B98731J035J001P34L71j00q15j515j615r96k26K11L43K23l42j164j471q56
61453B93549K0L50L54P79J519J618P13l58o99m20j57n4K53R11J644K175K445K453
61435C07095K217J950J968K349K836L172L335L403L305K932K383J977J994K395
61421C43311K822K876K451J828J445J494J833K236K594K868K936K630J896Q32
61407C74052l62j425k112k407k585k896l173l018k433k021k305k958l046k097
61393C41214o72K77M22J98Q7J31J65J93K24J7o70j600k094j679n25P86J750K155
61375C40379K113J955J999K225K345K254K202K358K465K218J780J572J649J694
61361C69208J628J814K451L189L567L623L717L884L778L303L063L789N420P004
$$ y = [298731, 299766, 300767, 301501, 301872, 301772, 300957, 299442, 297827, 296831, 296605, 296816, 297159, 297382, 297040, 295876, 294405, 293549, 293569, 293919, 294273, 295052, 296571, 298189, 298902, 298544, 297845, 297425, 297268, 297214, 297467, 298378, 300022, 302197, 304642, 307095, 309312, 311262, 313230, 315579, 318415, 321587, 324922, 328325, 331630, 334562, 336945, 338922, 340916, 343311, 346133, 349009, 351460, 353288, 354733, 356227, 358060, 360296, 362890, 365758, 368694, 371324, 373220, 374052, 373690, 372265, 370153, 367746, 365161, 362265, 359092, 356074, 353641, 351620, 349315, 346357, 343311, 341214, 340542, 340819, 341241, 341439, 341526, 341657, 341822, 342015, 342239, 342256, 341586, 339986, 337892, 336213, 335688, 336474, 338224, 340379, 342492, 344447, 346446, 348671, 351016, 353270, 355472, 357830, 360295, 362513, 364293, 365865, 367514, 369208, 370836, 372650, 375101, 378290, 381857, 385480, 389197, 393081, 396859, 400162, 403225, 407014, 412434, 419438]
61347D19438P728P838Q223R125R741R264P899O500N493M707M072L816L925L898
61333E11667L335K382J430O75J24l51j135k572m278n145m508l048k084k133k579
61318D91780k629k091j211k15P30J423J753J891K186K836L685M417N028N971P586
61303E23140R428J0515J0444R847R531R459Q972P716N964M093K205K53j725l559
61289F06283m945n669n932o276o894p290o987o251n659n186m305k906j538o72
61275E35773k32J12O22J416K279K632K267K014K949M859O356O700O641P007P382
61260E88777O943N991N716O731Q565J0403J1654J1944J1258J0089Q930P636N756
61247G00393L412J213o23k472m517o300p327p628p546p314p103p109p324p404
$$ y = [419438, 427166, 435004, 443227, 452352, 462093, 471357, 479256, 485756, 491249, 495956, 500028, 503844, 507769, 511667, 515002, 517384, 518814, 519489, 519613, 519262, 518127, 515555, 511277, 506132, 501624, 498576, 496492, 494359, 491780, 489151, 487060, 485849, 485634, 486364, 487787, 489540, 491431, 493617, 496453, 500138, 504555, 509583, 515554, 523140, 532568, 543083, 553527, 563374, 572905, 582364, 591336, 599052, 605016, 609109, 611314, 611567, 609842, 606283, 601338, 595669, 589737, 583461, 576567, 569277, 562290, 556039, 550380, 545194, 540889, 537983, 536445, 535773, 535541, 535653, 536275, 537691, 539970, 542602, 544869, 546883, 549832, 554691, 561047, 567747, 574388, 581395, 588777, 595720, 601711, 607427, 614158, 622723, 633126, 644780, 656724, 667982, 678071, 687001, 694637, 700393, 703805, 705018, 704395, 701923, 697406, 691106, 683779, 676151, 668605, 661291, 654188, 647079, 639755, 632351]
61233F32351p024o250n392m622l876l011j940p00N08J489K277L121M153N135N660
61218F21879N568N075M537M086L695L498L834M706N398N111L980K984K701K710
61204F79762K445K085K084K372K648L169M480O492Q525J0177J1499J2461J2989
61191G61188J3562J4881J6761J8107J8287J7763J7009J5662J3317J0535Q286O803
61179I32161N627M517L615K918K223J519Q87P6j347l400n619p556r011r939j0565
61164I06106j1451j2983j4776j6049j6577j6864j7341j7854j7970j7394j6070
61153G30777j4280j2713j1905j1462j0322q085n648m168l696l288k245q57k2n23
61139F41563k534n379p750q537p768o480n604n048m109k488o61P70J736K684M034
$$ y = [632351, 625327, 619077, 613685, 609063, 605187, 602176, 600236, 599536, 600044, 601533, 603810, 606931, 611084, 616219, 621879, 627447, 632522, 637059, 641145, 644840, 648338, 652172, 656878, 662276, 667387, 671367, 674351, 677052, 679762, 682207, 684292, 686376, 688748, 691396, 694565, 699045, 705537, 714062, 724239, 735738, 748199, 761188, 774750, 789631, 806392, 824499, 842786, 860549, 877558, 893220, 906537, 917072, 925358, 932161, 937788, 942305, 945920, 948838, 951061, 952580, 953467, 953543, 952196, 948796, 943177, 935621, 926610, 916671, 906106, 894655, 881672, 866896, 850847, 834270, 817406, 800065, 782211, 764241, 746847, 730777, 716497, 703784, 691879, 680417, 670095, 662010, 656362, 652194, 648498, 645210, 642965, 642108, 642086, 641563, 639029, 633650, 625900, 617363, 609595, 603115, 597511, 592463, 588354, 585866, 585205, 585975, 587711, 590395, 594429]
61124E94429N844P858R744J1354J2867J4637J6832J9245K1487K3337K4805K6031
61112G88470K7208K8427K9434K9736K9161K8215K7505K6974K6036K4405K2300
61101A087871J9871J7001J3810J0814Q214N448J890k347o654j0690j4436j7745
61089A113047k0379k2466k4394k6192k7387k7638k7231k6738k6388k5918k5018
61078H33298k3716k2242k0578j8382j5565j2768j0924j0317j0317j0054r036p277
61066F62122n227l649k957k564j477K77J504J474J060J616L342N330O865P918
61052F75634Q712R437J0290J1250J2050J2755J3957J5824J7521J8382J9198K1310
61040H46320K4600K7460K8805K9224K9989L1700L4068L6329L7811L8613L9766
$$ y = [594429, 600273, 608131, 617875, 629229, 642096, 656733, 673565, 692810, 714297, 737634, 762439, 788470, 815678, 844105, 873539, 903275, 932436, 960651, 988156, 1015130, 1041166, 1065571, 1087871, 1107742, 1124743, 1138553, 1149367, 1157581, 1163029, 1164919, 1162572, 1155918, 1145228, 1130792, 1113047, 1092668, 1070202, 1045808, 1019616, 992229, 964591, 937360, 910622, 884234, 858316, 833298, 809582, 787340, 766762, 748380, 732815, 720047, 709123, 698806, 688489, 678435, 669399, 662122, 656895, 653246, 650289, 647725, 646248, 646525, 648029, 649503, 650563, 652179, 655521, 660851, 667716, 675634, 684346, 693783, 704073, 715323, 727373, 740128, 754085, 769909, 787430, 805812, 825010, 846320, 870920, 898380, 927185, 956409, 986398, 1018098, 1052166, 1088495, 1126306, 1164919, 1204685]
61029A204685M2040M4888M7237M9090N1292N3851N5656N6092N5886N6214N7844
61018A774775O1313O6859P4055Q2458R2677J05619J20793J36838J54134J75379
61008B844900K03489K40719K90417L57304M44588N52250O79194Q25319R90418
60999G428598J173005J370981J580120J789882J984190K147627K261253K281772
60991B2017428K133827J753163J162671N03153l3905l23226l66045k50682p8592
60982B6517792O0436O8263j52586o31837j273857j890130k308578k463391k396127
60973A5529985k192884j928429j651023j389555j158692r61070p93363o52801
60965D802168n37819m45398l71128l11401k63916k26583j97288j74208j55499
$$ y = [1204685, 1246725, 1291613, 1338850, 1387940, 1439232, 1493083, 1548739, 1604831, 1660717, 1716931, 1774775, 1836088, 1902947, 1977002, 2059460, 2152137, 2257756, 2378549, 2515387, 2669521, 2844900, 3048389, 3289108, 3579525, 3936829, 4381417, 4933667, 5612861, 6438180, 7428598, 8601603, 9972584, 11552704, 13342586, 15326776, 17474403, 19735656, 22017428, 24151255, 25904418, 27067089, 27570242, 27536337, 27213111, 26847066, 26596384, 26517792, 26578228, 26646491, 26493905, 25862068, 24588211, 22698081, 20389503, 17926112, 15529985, 13337101, 11408672, 9757649, 8368094, 7209402, 6248332, 5454969, 4802168, 4264349, 3818951, 3447823, 3136422, 2872506, 2645923, 2448635, 2274427, 2118928]
60956B118928j39199j24217j10661r8559q7096p5787o5450n6974n0014m3859l8916
60945A228196l6130l5366l5384l5215l4692l3832l2541l0875k9000k6972k4960
60934H73229k3427k2657k2367k2083k1628k0858j9485j7631j6062j5339j5047
60923F56645j4382j3078j1328r323p437o367o329o522o106n327m964m955m469
60910E56058l183j743q88p88j162j530j363n19M73R36P50K15m42j010j135q34
60894E43835q14j604k634l012k912l223l943m068l235k428k582l369l978m358
60880E01675m929n518n460m619l591k820k059q97M87J460J697J535J580K114L044
60865D83699M159N225N912O011N779N767O180O700P027P240P440P454P077O377
$$ y = [2118928, 1979729, 1855512, 1744851, 1646292, 1559196, 1483409, 1417959, 1360985, 1310971, 1267112, 1228196, 1192066, 1156700, 1121316, 1086101, 1051409, 1017577, 985036, 954161, 925161, 898189, 873229, 849802, 827145, 804778, 782695, 761067, 740209, 720724, 703093, 687031, 671692, 656645, 642263, 629185, 617857, 608534, 601097, 594730, 588401, 581879, 575773, 570446, 565482, 560527, 556058, 552875, 551132, 550244, 549456, 548294, 546764, 545401, 544882, 545355, 546291, 547041, 547256, 546814, 545804, 544669, 543835, 543021, 541417, 538783, 535771, 532859, 529636, 525693, 521625, 518390, 515962, 513380, 510011, 506033, 501675, 496746, 491228, 485768, 481149, 477558, 474738, 472679, 471782, 472269, 473729, 475426, 476961, 478541, 480655, 483699, 487858, 493083, 498995, 505006, 510785, 516552, 522732, 529432, 536459, 543699, 551139, 558593, 565670, 572047]
60851E72047N506M594L992M206N209O180O373N827M939L756K318J154P33O38N9
60836F27531j029j908k224k280k211j681o14M46J060J454K066K915L798M738N892
60821F37953P174Q198Q631Q535Q439Q966J0155J1231J1247J0070Q509P579P708
60808G54395Q525R209R139Q323P173N870M303K689J646J323J017R7j165k252l295
60793H06997m621n988p082q272r828j0796r974p956o807p508q902r583r578r588
60779F90514r665r561r573j0074j0631j0488r578q453p453o628o227o568p355
60766E78260p745p242o246n593n678o106o210n867n635n931o378o336n881n613
60752D91799n635n449m924m659n031n544n464m639l400k163j387j426k090k771
$$ y = [572047, 577553, 582147, 586139, 590345, 595554, 601734, 608107, 613934, 618873, 622629, 624947, 626101, 626834, 627472, 627531, 626502, 624594, 622370, 620090, 617879, 616198, 615584, 616030, 617090, 618544, 620610, 623525, 627323, 632061, 637953, 645127, 653325, 661956, 670491, 678930, 687896, 698051, 709282, 720529, 730599, 739108, 746687, 754395, 762920, 772129, 781268, 789591, 796764, 802634, 806937, 809626, 811272, 812595, 813612, 813709, 812544, 810292, 806997, 802376, 796388, 789306, 781034, 771206, 760410, 750436, 742480, 735673, 728165, 719263, 709680, 700102, 690514, 680849, 671288, 661715, 651641, 641010, 630522, 620944, 612491, 605038, 598410, 592183, 585615, 578260, 570515, 563273, 557027, 551434, 545756, 539650, 533440, 527573, 521938, 516007, 509629, 503293, 497412, 491799, 486164, 480715, 475791, 471132, 466101, 460557, 455093, 450454, 447054, 444891, 443504, 442078, 439988, 437217]
60738D37217l243l768m278m122l170k382k701l786m440l911k356m92P40O43m03
60723C99548j039l96Q70J545J355Q88M38j78r05j375j480j445j325j022o77o05
60707C94197r23j653k868m264m949m368l184k514k574k733k717k788k926k721
60693C53015k208j878j785j468q94n94o30l54M34R91Q12N04P97J306J153M41K25
60676C49867J100K494L492L822L782L575L062K213J499J461J916J957J119J54
60662C81513R6P65J003M01p8M48J492J970J717J593K254L432M367M553M113L693
60646D13332L913M655N084M559L343K138J194K32r47k165l074l380l033k421k189
60631D21241k598l279l860m421m915m681l252j394m70q32j641k202k528k505j653
$$ y = [437217, 433974, 430206, 425928, 421806, 418636, 416254, 413553, 409767, 405327, 401416, 399060, 398568, 399308, 399951, 399548, 398509, 398113, 398983, 400528, 401883, 402771, 403209, 403031, 402126, 400751, 399271, 397826, 396501, 395479, 394802, 394197, 393274, 391621, 388753, 384489, 379540, 375172, 371988, 369474, 366900, 364167, 361450, 358662, 355736, 353015, 350807, 348929, 347144, 345676, 344782, 344188, 343558, 343204, 343638, 344629, 345441, 345945, 346742, 348048, 349201, 349642, 349867, 350967, 353461, 356953, 360775, 364557, 368132, 371194, 373407, 374906, 376367, 378283, 380240, 381359, 381513, 381609, 382374, 383377, 383778, 383700, 384148, 385640, 387610, 389327, 390920, 393174, 396606, 400973, 405526, 409639, 413332, 417245, 421900, 426984, 431543, 434886, 437024, 438218, 438450, 437503, 435338, 432264, 428884, 425851, 423430, 421241, 418643, 415364, 411504, 407083, 402168, 397487, 394235, 392841, 392371, 391539, 389898, 387696, 385168, 382663, 381010]
60616C81010k23M99j28r68o07N83J042K68p51j253j515j714j270k3R99Q24p7m86
60598C76210j26K43P6l96p99j004r21m88P0M57P81J306J789J685J048O09Q29J424
60580C82793J928K197K169J760J264J321K159L314M431N756P474R103J0099J0710
60566D46478J1645J3103J4639J5761J6243J5950J4802J2795R868N997J700k036
60554E76945m701o774q712r916r506p773n951m605l151j053J470M134P093J0245
60540E37745J2812J4239J5077J6297J8056J9625K0265J9659J7742J4703J1100
60529G17320P410L548p45n021q237r814j0110r667q562o908n485n119n546n534
60515F47530m311k443r56q2P29J849L036L968M691N484O606Q242J0440J2985J5711
$$ y = [381010, 380787, 381286, 381158, 380190, 379583, 380166, 381208, 381476, 380725, 379472, 377957, 376243, 374973, 374950, 375949, 376773, 376696, 376210, 376084, 376327, 376403, 376007, 375208, 374204, 373283, 372795, 372865, 373322, 374103, 375409, 377198, 378883, 379931, 380540, 381369, 382793, 384721, 386918, 389087, 390847, 392111, 393432, 395591, 398905, 403336, 409092, 416566, 425669, 435768, 446478, 458123, 471226, 485865, 501626, 517869, 533819, 548621, 561416, 571284, 577281, 578981, 576945, 572244, 565470, 556758, 546842, 537336, 529563, 523612, 519007, 515856, 514803, 516273, 520407, 527500, 537745, 550557, 564796, 579873, 596170, 614226, 633851, 654116, 673775, 691517, 706220, 717320, 724730, 728278, 727533, 722512, 714275, 704461, 694351, 684684, 676122, 669214, 663729, 658610, 653064, 647530, 643219, 640776, 639820, 639738, 640467, 642316, 645352, 649320, 654011, 659495, 666101, 674343, 684783, 697768, 713479]
60500G13479J8940K3267K8769L4857M1037M7288N3486N8883O2675O4631O4753
60489A212065O2668N7928N0584M0849K8461J3175m091k1347l6966n0490o1848
60478A290988p0369p5050p5533p2554o7449o1423n5108m8761m2765l7735l3863
60467F50378l0483k6759k2702j8988j5911j3197j0883r584r489r744r361q328
60455D64949p361o835o471n914n107m217l505l202l211l101k668k290k326k383
60441D06358j760n45K83J09n61q84p76p79j087j297j132q62q14r08r90j221j708
60424C91426j988j533p14n49j312k020j738q10j96j1M49J372K030J897J446J418
60408C89167J757J810J334Q26Q52J348J689J371N49j92n54p97j168j328p63M17
$$ y = [713479, 732419, 755686, 784455, 819312, 860349, 907637, 961123, 1020006, 1082681, 1147312, 1212065, 1274733, 1332661, 1383245, 1424094, 1452555, 1465730, 1461639, 1440292, 1403326, 1352836, 1290988, 1220619, 1145569, 1070036, 997482, 930033, 868610, 813502, 764741, 721976, 684241, 650378, 619895, 593136, 570434, 551446, 535535, 522338, 511455, 501871, 492382, 482638, 473277, 464949, 457588, 450753, 444282, 438368, 433261, 429044, 425539, 422337, 419126, 416025, 413357, 411067, 408741, 406358, 404598, 404053, 404336, 404445, 403884, 403000, 402224, 401445, 400358, 399061, 397929, 397067, 396253, 395345, 394355, 393134, 391426, 389438, 387905, 387191, 386642, 385330, 383310, 381572, 380762, 380566, 380555, 381004, 382376, 384406, 386303, 387749, 389167, 390924, 392734, 394068, 394894, 395746, 397094, 398783, 400154, 400703, 400511, 399957, 399160, 397992, 396664, 395901, 396318]
60392C96318J535K161K336K043J130j6m11M01J564J856J141L72L10P65J144J184
60376D13833J008Q17P52R20J230J363J066N12K36N82J304J771J601R61K89j43
60360D28102k76j21K24N54P51R29J172J314J209J026R94J039J061J386K373L661
60344D45398M387M239L678L049K147R22q1m27m23n76q69j076j402k154l034l325
60328D50453k738j611m16N00Q53O55M11O04J098J477J815K440K988K567J166J56
60312D62418Q16K909N255P320R404J1556J3226J4344J5893J8762K2440K5484K7072
60299F36899K7406K6615K4110J9438J3185O444l61p538j5056k1950k6859k8942
60287F53391k8275k5692k2287j8793j5442j2451j0298r122q211o777n146m381
$$ y = [396318, 397853, 400014, 402350, 404393, 405523, 405507, 405096, 405497, 407061, 408917, 410058, 410430, 410740, 411505, 412649, 413833, 414841, 415658, 416410, 417330, 418560, 419923, 420989, 421501, 421737, 422319, 423623, 425394, 426995, 427956, 428245, 428102, 427826, 427705, 427929, 428483, 429234, 430163, 431335, 432649, 433858, 434884, 435878, 436917, 437978, 439364, 441737, 445398, 449785, 454024, 457702, 460751, 462898, 463820, 463739, 463312, 462889, 462313, 461444, 460368, 458966, 456812, 453778, 450453, 447715, 446104, 445688, 446188, 447041, 447696, 448107, 448711, 449809, 451286, 453101, 455541, 458529, 461096, 462262, 462418, 463234, 466143, 471398, 478718, 488122, 499678, 512904, 527248, 543141, 561903, 584343, 609827, 636899, 664305, 690920, 715030, 734468, 747653, 754097, 753736, 746198, 731142, 709192, 682333, 653391, 625116, 599424, 577137, 558344, 542902, 530451, 520153, 511031, 502820, 496043, 490897, 486516]
60275D86516m679m951m271l021k160k039k438l189l977m029k815j010K4k85j219
60260D46457j772j632j119o79n88q24j012p44o6N57Q21R68J417K199K859K948
60244D49790K467J798J184M67n02j368j582j180p49n57k11N10J077R64O17R15
60228D53640J869K533K271J564J264J506J668J286O69N63J331K518L341L524L481
60213D83028L659L949L940L507K962K685K821L238L682M011M291M515M341L504
60199E34133K491K241K993L881L981L258K186R82k52j122j333j204j175j154r16
60184E48990q13j363k322k977l247l642m185m297l884l632l851l834k946j704
60170E06293j129j384j715j574j195j018r87p03o0N09N36J06k24j07L05P74J310
$$ y = [486516, 481837, 476886, 472615, 469594, 467434, 465395, 462957, 459768, 455791, 451762, 448947, 447937, 447961, 447676, 446457, 444685, 443053, 441934, 441255, 440667, 439843, 438831, 438087, 438021, 438578, 439399, 440367, 441784, 443983, 446842, 449790, 452257, 454055, 455239, 455706, 455204, 453836, 452254, 451074, 450325, 449768, 449557, 450067, 451144, 452108, 452725, 453640, 455509, 458042, 460313, 461877, 463141, 464647, 466315, 467601, 468270, 468833, 470164, 472682, 476023, 479547, 483028, 486687, 490636, 494576, 498083, 501045, 503730, 506551, 509789, 513471, 517482, 521773, 526288, 530629, 534133, 536624, 538865, 541858, 545739, 549720, 552978, 555164, 556146, 555894, 554772, 553439, 552235, 551060, 549906, 548990, 548177, 546814, 544492, 541515, 538268, 534626, 530441, 526144, 522260, 518628, 514777, 510943, 507997, 506293, 505164, 503780, 502065, 500491, 499296, 498278, 497291, 496588, 496528, 497037, 497573, 497679, 497455, 497348, 497653, 498427, 499737]
60153D99737J831J945J551J308J886K983L661L653L608M083M914N664O076N980
60139E48880N409M994N563P053Q436Q976Q945Q696P851O059L905K284J130l11
60125F27870k130l477l732l257k730k297j747j170r01r69j014p74l87q3K31Q17
60109F04250J640K319K524K267J635N61r48k539l707m221m188l895l717l950m328
60094E83703l999k460m41P08O28M19J275L106M783N576N871O460P366P611O306
60079F26912L832J603N86M16J87m72j530l186n476p549q339p966p660q102q662
60064E74594q546p837p044o341n750n504n651n795n631n338n003m241k948j967
60050D96998k237l491m373l822j908M91K428L421L688L770L798L370K388J575
$$ y = [499737, 501568, 503513, 505064, 506372, 508258, 511241, 514902, 518555, 522163, 526246, 531160, 536824, 542900, 548880, 554289, 559283, 564846, 571899, 580335, 589311, 598256, 606952, 614803, 620862, 624767, 627051, 628181, 627870, 625740, 622263, 618531, 615274, 612544, 610247, 608500, 607330, 606429, 605460, 604446, 603672, 603285, 603202, 603433, 604250, 605890, 608209, 610733, 613000, 614635, 615196, 614248, 611709, 608002, 603781, 599593, 595698, 591981, 588031, 583703, 579704, 577244, 576803, 577511, 578139, 578558, 579833, 582939, 587722, 593298, 599169, 605629, 612995, 620606, 626912, 630744, 632347, 632933, 633349, 633536, 633064, 631534, 628348, 622872, 615323, 606984, 599018, 591358, 583256, 574594, 566048, 558211, 551167, 544826, 539076, 533572, 527921, 522126, 516495, 511157, 506154, 501913, 498965, 496998, 494761, 491270, 486897, 483075, 481167, 481658, 484086, 487507, 491195, 494965, 498763, 502133, 504521, 506096]
60036E06096J648K339K751K530K062J670J241O80J65k74r94k308m018n537o447
60021E01604o844p185p740q287q438q163p668o867n510l929k976k924k999k448
60007D19626j579j142j141r41k58O61J621K523K979K561J517N68M1k68l62Q7R93
59990D27486J643J609J407J833K981M189M770M535L729K780K075J838K055K404
59976D65334K384J765R53O20Q00P81J24o98r96q14n31n6Q79J875K196J890J732
59959D78238K043K315K122J595Q24l53j627k072j264K0P32O57J37o56j557j959
59943D79195j329p1P15L27r83k385l079k800k105j988k768l568l364k266j243
59928D52288p61m15J38N64N16L14N68J474K761M027M813M628L471K214J958K814
$$ y = [506096, 507744, 510083, 512834, 515364, 517426, 519096, 520337, 521017, 521182, 520908, 519914, 517606, 513588, 508051, 501604, 494760, 487575, 479835, 471548, 463110, 454947, 447279, 440412, 434902, 430973, 427997, 425073, 422074, 419626, 418047, 416905, 415764, 414823, 414565, 415226, 416847, 419370, 422349, 424910, 426427, 426995, 427036, 426768, 426406, 426493, 427486, 429129, 430738, 432145, 433978, 436959, 441148, 445918, 450453, 454182, 456962, 459037, 460875, 462930, 465334, 467718, 469483, 470436, 471056, 471856, 472637, 472761, 472063, 471067, 470253, 469722, 469666, 470545, 472420, 474616, 476506, 478238, 480281, 482596, 484718, 486313, 487137, 486784, 485157, 483085, 481821, 481841, 482573, 483230, 483367, 482711, 481154, 479195, 477866, 477795, 478510, 478837, 477854, 475469, 472390, 469590, 467485, 465497, 462729, 459161, 455797, 453531, 452288, 451527, 451112, 451250, 451814, 452330, 452644, 453212, 454686, 457447, 461474, 466287, 470915, 474386, 476600, 478558, 481372]
59912D81372L704L673L052K941L694M533M741M587M649M700M032K722J776J751
59898E31927J949J357o6j488k235k230j701j018o52p55q02p7J362K734L483L768
59882E35556L910L892L690L626L997M614N077N296N361N118M292L038J842Q47
59868E90156l13j834l240l884l781l599l821m219m248l783l194k755k228j218
59854E48039J56J268J749J955K448L245L940M483N385O969Q775R897R738Q297
59840F16344O037L652J707K15j158k241k183n83J474K221R83j413l913o112p759
59825F07271q349p824p038o831o971o637n766n153n278n676n672n236m814m567
59811E21459m137l146j823j020j457k873m086m081k919j445l29K96M40N6p27j534
$$ y = [481372, 485076, 488749, 491801, 494742, 498436, 502969, 507710, 512297, 516946, 521646, 525678, 528400, 530176, 531927, 533876, 535233, 535167, 533679, 531444, 529214, 527513, 526495, 525843, 525088, 524286, 524209, 525571, 528305, 531788, 535556, 539466, 543358, 547048, 550674, 554671, 559285, 564362, 569658, 575019, 580137, 584429, 587467, 589309, 590156, 589843, 588009, 584769, 580885, 577104, 573505, 569684, 565465, 561217, 557434, 554240, 551485, 549257, 548039, 548195, 549463, 551212, 553167, 555615, 558860, 562800, 567283, 572668, 579637, 588412, 598309, 608047, 616344, 622381, 626033, 627740, 627955, 626797, 624556, 622373, 621790, 623264, 625485, 626468, 625055, 621142, 615030, 607271, 598922, 591098, 584060, 577229, 570258, 563621, 557855, 552702, 547424, 541748, 536076, 530840, 526026, 521459, 517322, 514176, 512353, 511333, 509876, 507003, 502917, 498836, 495917, 494472, 494143, 494439, 494879, 494935, 494208, 492674]
59795D92674k136k709l526m503n154n039m230l341k931k928k811k454k282k465
59781D46165k434j802j258j695k680k770j560m07n68j471j584m67R35J779K158
59766D32341K376K281J738J149R54R94Q24N30O62J371K113K337K141J965J982
59751D55758K072K249K679L274L697L820L867L991M022L834L628L591L543L255
59737E03280K871K666K535K118J356N23k32r33j400j276n64K64P54Q47O40J70
59721E13619m29r45j403j998k546k459j563n49k07m55n93k94K03P04J310J950
59705E04345K175J731R97O08Q33J455K108K516K526K203J829J629J522J287R79
59690E28743R25J175J229N57o23j431j317p00l73m96n35j47L19L63j1m51q13j237
$$ y = [492674, 490538, 487829, 484303, 479800, 474646, 469607, 465377, 462036, 459105, 456177, 453366, 450912, 448630, 446165, 443731, 441929, 440671, 438976, 436296, 433526, 431966, 431559, 430991, 429520, 427936, 427469, 428404, 430183, 432341, 434717, 436998, 438736, 439885, 440839, 441833, 442657, 443187, 443849, 445220, 447333, 449670, 451811, 453776, 455758, 457830, 460079, 462758, 466032, 469729, 473549, 477416, 481407, 485429, 489263, 492891, 496482, 500025, 503280, 506151, 508817, 511352, 513470, 514826, 515349, 515117, 514184, 512784, 511508, 510944, 511208, 511962, 512809, 513449, 513619, 513190, 512245, 510842, 508844, 506298, 503839, 502276, 501727, 501520, 501065, 500472, 500178, 500381, 501085, 502395, 504345, 506520, 508251, 509248, 509856, 510689, 512144, 514252, 516768, 519294, 521497, 523326, 524955, 526477, 527764, 528743, 529668, 530843, 532072, 532629, 532006, 530575, 529258, 528558, 528185, 527689, 527154, 527007, 527326, 527689, 527678, 527227, 526414, 525177]
59672E25177j803k433l096l773m238m243l941l714l549k947j775p07m32o99p57
59657D87070n31o47j256j554q29O04J984L073M008M554M283L383K585K224J933
59642E10884J333M19q01k349l801m357l810k917k444k267j855j133l63L80J077
59627D87996J405J139O80N61N77O0j085k132k397j865r93m18p40k011l376l751
59611D73650k976j776o42N97J970K844K651J711R18Q60J435K053K019J095j75
59596D86234r66j099j044j001o35J03O01M97K81M28N90K59k81m86o66j545k911
59579D78359l681l391k698k252j948j629j666k239k703k399j683j384j507j263
59565D47916l70M26L43m26j018q59j23O17R11P42N56P94J374J783J745J550J557
$$ y = [525177, 523374, 520941, 517845, 514072, 509834, 505591, 501650, 497936, 494387, 491440, 489665, 488958, 488526, 487827, 487070, 486539, 485892, 484636, 483082, 482253, 482857, 484841, 487914, 491922, 496476, 500759, 504142, 506727, 508951, 510884, 512217, 512636, 511835, 509486, 505685, 501328, 497518, 494601, 492157, 489890, 488035, 486902, 486539, 486919, 487996, 489401, 490540, 491220, 491781, 492358, 492418, 491333, 489201, 486804, 484939, 483946, 483528, 482788, 480777, 477401, 473650, 470674, 468898, 468256, 468853, 470823, 473667, 476318, 478029, 478947, 479807, 481242, 483295, 485314, 486409, 486234, 485268, 484169, 483125, 482124, 481489, 481592, 482193, 482690, 482971, 483399, 483989, 484248, 483967, 483481, 482815, 481270, 478359, 474678, 471287, 468589, 466337, 464389, 462760, 461094, 458855, 456152, 453753, 452070, 450686, 449179, 447916, 447546, 447972, 448315, 447889, 446871, 446012, 445889, 446506, 447417, 448159, 448715, 449509, 450883, 452666, 454411, 455961, 457518]
59548D57518J723J874K176K885L812M520N048N918P345Q862R957J0713J1615J2984
59534E46950J4677J5951J5497J2177O217n51n998r116r988q978o517l422o07J607
59520E67899L435M862N485N177M404L621K817J794N75p85k481m649o858q304q599
59505E68393q243q087q373q489p852o784o115n966n625m755m067m194m545m042
59491D81256k679j502j103j037p31k06L27Q94J507K076K732L758M952N718N919
59476E01881O107O619P079P120O940O750O227N035L430J851L32j129k020j809
59462E54413p39M01J175J675K083K562L538N409P892J0108J1461J2168J2782J3527
59448F38455J4179J4407J4058J3131J1631R487O668L265n78m667q531j1430j2933
$$ y = [457518, 459241, 461115, 463291, 466176, 469988, 474508, 479556, 485474, 492819, 501681, 511638, 522351, 533966, 546950, 561627, 577578, 593075, 605252, 611469, 610918, 604920, 595804, 585816, 576838, 570321, 566899, 566292, 567899, 571334, 576196, 581681, 586858, 591262, 594883, 597700, 599494, 600069, 599284, 596803, 592154, 585296, 576992, 568393, 560150, 552063, 543690, 535201, 527349, 520565, 514450, 508484, 502859, 498104, 494037, 489843, 485298, 481256, 478577, 477075, 475972, 474935, 474204, 473998, 474325, 475219, 476726, 478802, 481534, 485292, 490244, 495962, 501881, 507988, 514607, 521686, 528806, 535746, 542496, 548723, 553758, 557188, 559039, 559371, 558242, 556222, 554413, 553674, 554075, 555250, 556925, 559008, 561570, 565108, 570517, 578409, 588517, 599978, 612146, 624928, 638455, 652634, 667041, 681099, 694230, 705861, 715348, 722016, 725281, 724703, 720036, 711505, 700075, 687142]
59435F87142j3402j3476j3246j2398j1057r798q825p803o661n732m902l413j035
59422E75394J339K913M155O070Q838J1916J5078J8478K1835K4349K5498K5434
59410G41297K4686K3708K2371J9465J3304L662p030j5221j8960j8751j6186j2600
59398G59745q873n448k391j05n1l852j1285j9793k6392k9670k9855k7705k3943
59385E70382j9405j4981j1258q339o081m371l243k664k256j491l00P73J286J477
59371D99529J847K449L035L562L991L896L005J908J564K115K950L791M872N943
59357E44457O170N420M856N656P654R712J0979J1422J1541J2069J3550J5763J7821
59344F77070J9118J9820K0227K0180J9526J8617J7745J6492J4338J1565Q817N927
$$ y = [687142, 673740, 660264, 647018, 634620, 623563, 613765, 604940, 597137, 590476, 584744, 579842, 576429, 575394, 576733, 579646, 583801, 589871, 598709, 610625, 625703, 644181, 666016, 690365, 715863, 741297, 765983, 789691, 812062, 831527, 844831, 848493, 841463, 826242, 807282, 788531, 772345, 759745, 750872, 745424, 743033, 742928, 742877, 739025, 727740, 707947, 681555, 651885, 622030, 594325, 570382, 550977, 535996, 524738, 516399, 510318, 505947, 502704, 500040, 497784, 496293, 495993, 496766, 498052, 499529, 501376, 503825, 506860, 510422, 514413, 518309, 521314, 523222, 524786, 526901, 529851, 533642, 538514, 544457, 550627, 556047, 560903, 566559, 574213, 583925, 594904, 606326, 617867, 629936, 643486, 659249, 677070, 696188, 716008, 736235, 756415, 775941, 794558, 812303, 828795, 843133, 854698, 863515, 869442]
59332H69442K120k560o842r704j1607j3717j6231j8105j8394j7374j6252j5958
59320G24818j6371j6578j5751j3901j1837j0370r542q709p396n832m558l682k886
59307E97405k010j234n68M45K277M840P618J0136J2135J3473J4169J4486J4720
59294F87892J4803J4254J2358Q430K303n100j1835j6128j7631j7312j6154j4329
59282F41551j1686q603o007m489l716k850j452K41J931L694N580P202Q230R070
59268F38696J0328J1702J2212J1617J0725J0007Q853O775M455K754J321q36l818
59255G24791o781r164j1048j2471j3246j3446j3373j3052j2370j1446j0269q321
59243E89804n439k685j313j050n44O10J547J918K568M009N468O179O515P024P238
$$ y = [869442, 871562, 869002, 862160, 852456, 840849, 827132, 810901, 792796, 774402, 757028, 740776, 724818, 708447, 691869, 676118, 662217, 650380, 640010, 630468, 621759, 614363, 608531, 603973, 600291, 597405, 595395, 594161, 593593, 594038, 596315, 601155, 608773, 618909, 631044, 644517, 658686, 673172, 687892, 702695, 716949, 729307, 737737, 740040, 734940, 723105, 706977, 689346, 672034, 655880, 641551, 629865, 621262, 615255, 610766, 607050, 604200, 602748, 602989, 604920, 608614, 614194, 621396, 629626, 638696, 649024, 660726, 672938, 684555, 695280, 705287, 714140, 720915, 725370, 728124, 729445, 728609, 724791, 718010, 708846, 697798, 685327, 672081, 658635, 645262, 632210, 619840, 608394, 598125, 589804, 584365, 581680, 580367, 579317, 578773, 579383, 580930, 582848, 585416, 589425, 594893, 601072, 607587, 614611, 621849]
59228F21849O355M515K528Q14p56k360m157o321q532r896r947r340q907q516p553
59213E59776o160n150m827m712m402m045l820l525k805j541L1J352J817J384Q21
59198E24194R80J828K544K563K187K041K236K296J832J166J062J820K821L232
59184E52802L012K885L310L970M348M355M233M130M017L751L156K350J913K381
59170F00613L444M273M636N107O012O868P255P581Q367R297R576Q910P602O004
59156F95545M373K971J844O46r00k665m489o495q565r988j0240r808r585r686
59142F32958r473q631p561o700o084n614n271m932m407l762l257k943k565j920
59128E59838j016K8J031J734K035K214K675L497M463N409O274O950P355P557P663
$$ y = [621849, 628204, 632719, 635247, 636061, 635305, 632945, 628788, 622467, 613935, 604039, 594092, 584752, 575845, 567329, 559776, 553616, 548466, 543639, 538927, 534525, 530480, 526660, 523135, 520330, 518789, 518820, 520172, 521989, 523373, 524194, 525174, 527002, 529546, 532109, 534296, 536337, 538573, 540869, 542701, 543867, 544929, 546749, 549570, 552802, 555814, 558699, 562009, 565979, 570327, 574682, 578915, 583045, 587062, 590813, 593969, 596319, 598232, 600613, 604057, 608330, 612966, 618073, 624085, 630953, 638208, 645789, 654156, 663453, 673029, 681939, 689541, 695545, 699918, 702889, 704733, 705379, 704479, 701814, 697325, 690830, 682265, 672277, 662037, 652229, 642644, 632958, 623485, 614854, 607293, 600593, 594509, 588895, 583624, 578692, 574285, 570523, 567266, 564323, 561758, 559838, 558822, 558850, 559881, 561615, 563650, 565864, 568539, 572036, 576499, 581908, 588182, 595132, 602487, 610044, 617707]
59113F17707P678P694Q024Q788R545R628Q829P452N936M676M001L919L928L473
59099G11278K532J468M57n91j643k521l279m155n034n303m510l044j962k060l118
59084F78515m096m234l877m016n042o311p022p122p097p216p407p557p592p391
59070E92535o977o641o575o444n677m211k736k094k460l075k871j568q5M21j62
59055E41380r35j232j226j233j179j059j232j704j755q74L04P31K87k13j61K83
59039E30182O23N93L16K66Q33J693J950J313O85J063K177K971L115L283M016N047
59023E60126N929O760P970R653J1266J2010J1581J0508R504Q498O856M602K632
59010F67895J439M08j001k205k418j987j791j813j296o1J372K707M003N019N399
$$ y = [617707, 625385, 633079, 641103, 649891, 659436, 669064, 677893, 685345, 691281, 695957, 699958, 703877, 707805, 711278, 713810, 715278, 715735, 715144, 713501, 710980, 707701, 703546, 698512, 693209, 688699, 685655, 683693, 681633, 678515, 674419, 670185, 666308, 662292, 657250, 650939, 643917, 636795, 629698, 622482, 615075, 607518, 599926, 592535, 585558, 578917, 572342, 565898, 560221, 556010, 553274, 551180, 548720, 545645, 542774, 541206, 541121, 541542, 541380, 540445, 539213, 537987, 536754, 535575, 534516, 533284, 531580, 529825, 528951, 529255, 529986, 530273, 530060, 529899, 530182, 530805, 531398, 531714, 531980, 532813, 534506, 536456, 537769, 538454, 539517, 541694, 544665, 547780, 551063, 555079, 560126, 566055, 572815, 580785, 590438, 601704, 613714, 625295, 635803, 645307, 653805, 660661, 665263, 667895, 669334, 669742, 668741, 666536, 664118, 662131, 660340, 658527, 657231, 657170, 658542, 661249, 665252, 670271, 675670]
58995F75670N469N893O610O887O476N805N101M172L065K033Q75q41k780m070m598
58980G15767n124n953o509o340n630m425k452j08J508K141K976N019P670R638
58966G08178J0562J0968J1249J1484J1811J2196J2212J1644J0943J0443R582P573
58954H38845M606J626r53l600o781j0266j3435j5822j7274j7849j7660j6727j5067
58941G09643j3040j1259r974q769p222n571m418l945l813l725l718l924m303m607
58927F21355m493l734k494j322o86n93p27q45q96r07j005j426k191k822k600j309
58911E93305M06J575J863J887K535M087O064P778Q805R146R284J0015J1657J3368
58897F81775J3865J3030J2177J2410J3382J4157J4672J5553J7000J8676K0429
$$ y = [675670, 681139, 687032, 693642, 700529, 707005, 712810, 717911, 722083, 725148, 727181, 728056, 727215, 724435, 720365, 715767, 710643, 704690, 698181, 691841, 686211, 681786, 679334, 679226, 680734, 682875, 685851, 690870, 698540, 708178, 718740, 729708, 740957, 752441, 764252, 776448, 788660, 800304, 811247, 821690, 831272, 838845, 843451, 845077, 844124, 840524, 833743, 823477, 810042, 794220, 776946, 759097, 741437, 724710, 709643, 696603, 685344, 675370, 666601, 659379, 653808, 649390, 645445, 641632, 637907, 634189, 630265, 625962, 621355, 616862, 613128, 610634, 609312, 608626, 608033, 607306, 606461, 605565, 604658, 603653, 602227, 600036, 597214, 594614, 593305, 593711, 595286, 597149, 599036, 601571, 605658, 611722, 619500, 628305, 637451, 646735, 656750, 668407, 681775, 695640, 708670, 720847, 733257, 746639, 760796, 775468, 791021, 808021, 826697, 847126]
58886H47126K2335K4216K5820K7188K8136K7716K5112K0882J6366J2091P694L241
58874A087923p00m293q467j3329j7737k0853k3038k4691k5322k4460k2569k0306
58862H82158j7698j4870j2800j2342j2978j3442j3275j2954j2732j2272j1416
58851G35379j0619j0398j0740j1162j1159j0577r670q789q013p230o468n865n358
58838F19331m874m662m996n539n693n567n805o361o290n105l526k520k257k450
58824E53686k890l184k636j116N93J850K879L896M307L688K922L269M575N502
58810E77341N373M811M438L901K637R11l72p47o22o81j120j637k099k829l991
58795E85314n028n267m903m735m904m720l831k776k144j869j718j665j362p7K234
$$ y = [847126, 869461, 893677, 919497, 946685, 974821, 1002537, 1027649, 1048531, 1064897, 1076988, 1084682, 1087923, 1087223, 1082930, 1074463, 1061134, 1043397, 1022544, 999506, 974815, 949493, 925033, 902464, 882158, 864460, 849590, 836790, 824448, 811470, 798028, 784753, 771799, 759067, 746795, 735379, 724760, 714362, 703622, 692460, 681301, 670724, 661054, 652265, 644252, 637022, 630554, 624689, 619331, 614457, 609795, 604799, 599260, 593567, 588000, 582195, 575834, 569544, 564439, 560913, 558393, 556136, 553686, 550796, 547612, 544976, 543860, 544453, 546303, 549182, 553078, 557385, 561073, 563995, 567264, 571839, 577341, 582714, 587525, 591963, 595864, 598501, 599412, 599040, 598293, 597671, 596990, 595870, 594233, 592134, 589305, 585314, 580286, 575019, 570116, 565381, 560477, 555757, 551926, 549150, 547006, 545137, 543419, 541754, 540392, 540315, 542549]
58780E42549M459N526N517N043M288L410L069L566L923K886O19j498k623l140
58766E77594l705m453n229n873o144n873n249m585l874k984k079j313l33J283
58752E27183L158M276M189L542L307L810M582M896M391L377K618K675L559M935
58738E80498O435P637Q138P911P362O830O375O077O121O435O693O855P182P566
58724F78115P459O841O439O600O646N918M866M387M686N382O285P255P851P866
58710G66596P774P936P741O361L990J572m91k543m915p624j0655j3749j6180j7466
58696G28347j8077j8734j9270j9011j8010j7052j6495j5931j4944j3506j1684
58685E45633r669q016p133o604n680m414l610l640l989m026l612k915k116j332
$$ y = [542549, 547008, 552534, 558051, 563094, 567382, 570792, 573861, 577427, 581350, 584236, 584855, 583357, 580734, 577594, 573889, 569436, 564207, 558334, 552190, 546317, 541068, 536483, 532609, 529625, 527546, 526233, 525900, 527183, 530341, 534617, 538806, 542348, 545655, 549465, 554047, 558943, 563334, 566711, 569329, 572004, 575563, 580498, 586933, 594570, 602708, 610619, 617981, 624811, 631186, 637263, 643384, 649819, 656512, 663367, 670549, 678115, 685574, 692415, 698854, 705454, 712100, 718018, 722884, 727271, 731957, 737339, 743624, 750879, 758730, 766596, 774370, 782306, 790047, 796408, 800398, 801970, 801479, 798936, 794021, 786397, 775742, 761993, 745813, 728347, 710270, 691536, 672266, 653255, 635245, 618193, 601698, 585767, 570823, 557317, 545633, 535964, 527948, 520815, 514211, 508531, 504117, 500507, 496867, 492878, 488852, 485240, 482325, 480209, 478877]
58671D78877m26R74K870M580N584O292P339Q458Q931Q869R084R762J0171R706
58657E71071Q314N928K464j353m095n034m844m608m660m703m540m314m275m487
58643E40864m646m249l231k241j913k044j903j108K07J816L360M246M265M089
58629E37512M391M723M130K782J973K427L483M177M275M000L522L140L337M195
58615E88067N181N788O102O496P124P852Q344Q133O913M865K484Q0k222m120n259
58600F45828n750o214p110q203q786q340p072n789n081m623l695k273r71P9J465
58585E73465L351N006N966O783P959R052R560R837J0278J0442R936R328R116Q647
58571F88726P235N621N017N399O053P115R051J1242J2778J4171J6563J9469K1209
$$ y = [478877, 478451, 479425, 482295, 486875, 492459, 498751, 506090, 514548, 523479, 532348, 541432, 551194, 561365, 571071, 579385, 585313, 587777, 586424, 582329, 577295, 572451, 567843, 563183, 558480, 553940, 549626, 545351, 540864, 536218, 531969, 528738, 526497, 524584, 522540, 520637, 519529, 519736, 521552, 524912, 529158, 533423, 537512, 541903, 546626, 550756, 553538, 555511, 557938, 561421, 565598, 569873, 573873, 577395, 580535, 583872, 588067, 593248, 599036, 605138, 611634, 618758, 626610, 634954, 643087, 650000, 654865, 657349, 657429, 655207, 651087, 645828, 640078, 633864, 626754, 618551, 609765, 601425, 594353, 588564, 583483, 578860, 575165, 572892, 571921, 572000, 573465, 576816, 581822, 587788, 594571, 602530, 611582, 621142, 630979, 641257, 651699, 661635, 670963, 680079, 688726, 695961, 701582, 706599, 711998, 718051, 725166, 734217, 745459, 758237, 772408, 788971, 808440, 829649]
58558H29649K1414K1298K1282K0235J7453J3763J0123O497K639j142m404o786
58546I52021p766p365o926p817r404r900r241r254j0816j2706j3839j4711j5841
58533H16435j6532j6190j5427j4840j3970j2314j0253q166n851l511j998j330
58521F96053l20J474K807K749K255K583L363L463K736J779Q51J68L13J209J575
58506G23058N55r64j750k057k801l785m123l913m027m622n043m984m721m372l888
58491F72563l567l670l754l187k100j149n00J70R92J867K953M462O187P696Q885
58476F87848R891J0703J1226J1406J1023R711P511N020K727N74j605l739n688
58463G56608p223p770o960n454m365l708k509n90R72J639K326L779N236N602N038
$$ y = [829649, 851063, 872361, 893643, 913878, 931331, 945094, 955217, 961714, 964353, 963211, 958807, 952021, 944255, 936890, 929964, 922147, 912743, 902843, 893602, 884348, 873532, 860826, 846987, 832276, 816435, 799903, 783713, 768286, 753446, 739476, 727162, 716909, 708743, 702892, 699381, 697383, 696053, 695733, 697207, 700014, 702763, 705018, 707601, 710964, 714427, 717163, 718942, 719793, 719961, 720274, 721483, 723058, 723613, 722649, 720899, 718842, 716041, 712256, 708133, 704220, 700193, 695571, 690528, 685544, 680823, 676451, 672563, 668996, 665326, 661572, 658385, 656285, 655136, 654636, 654806, 655798, 657665, 660618, 665080, 671267, 678963, 687848, 697739, 708442, 719668, 731074, 742097, 751808, 759319, 764339, 767066, 767640, 766035, 762296, 756608, 749385, 741615, 734655, 729201, 724836, 721128, 718619, 718029, 719001, 720640, 722966, 726745, 731981, 737583, 742621]
58448G42621M418M024L572K922J900J32k252m285n230n357n186m635l537k257
58434G26850j208l44M27J018J634K665L812M360M556N526P437R084R819J0442
58420G86078J1433J1831J0802Q939O976M609J740n24j434j959l199m603n165n342
58406H20182o159p296p670p254o846o578o014n232m565l731k409j102l30M13J737
58391G57146L008L147K249J316Q22N84N50O94O56L77N06J317J994J829J379J439
58375G79013J766J830J933K521L238L720M509O041P613Q406Q658Q830Q700Q308
58361H55086Q662J0216J1799J2307J2313J2612J2511J1220R669R106Q909P658
58349I82068N544L805K623J471Q16J459K751L407L610M509O051P148P689Q597
$$ y = [742621, 747039, 751063, 754635, 757557, 759457, 759589, 757337, 753052, 747822, 742465, 737279, 732644, 729107, 726850, 725642, 725298, 725725, 726743, 728377, 731042, 734854, 739214, 743770, 749296, 756733, 765817, 775636, 786078, 797511, 809342, 820144, 829083, 836059, 840668, 842408, 841884, 840450, 838491, 835292, 830689, 825524, 820182, 814023, 806727, 799057, 791803, 784957, 778379, 772365, 767133, 762568, 758837, 756428, 755326, 754996, 755409, 757146, 760154, 763301, 765550, 766866, 767688, 768272, 768822, 769516, 770172, 770549, 771055, 772372, 774366, 776195, 777574, 779013, 780779, 782609, 784542, 787063, 790301, 794021, 798530, 804571, 812184, 820590, 829248, 838078, 846778, 855086, 863748, 873964, 885763, 898070, 910383, 922995, 935506, 946726, 956395, 965501, 974410, 982068, 987612, 991417, 994040, 995511, 996327, 997786, 1000537, 1003944, 1007554, 1012063, 1018114, 1025262, 1032951, 1041548]
58335A041548J0093J1462J2403J3239J4001J4488J4892J5245J4901J3587J2194
58324A188053J1388J0461Q770P144O393N687M145K780K965M042M494M506N304
58311A266132O799P968Q868J0266J1896J2949J3652J4637J5553J5979J6687J8231
58299A419617J9419J9082J8168J8052J8143J7353J6591J7293J8671J8990J8499
58288A619878J8650J9417J9974K0907K3075K5373K6257K6467K7570K8989K9303
58277A885860K9188L0138L1487L1809L1984L3664L5897L6771L7218L9541M3168
58266B266725M5670M7078M9414N2648N4942N6291N8219O0449O1570O2276O4192
58255B879474O6338O6653O6130O7354O9846P1173P1714P3901P7624Q0991Q4781
$$ y = [1041548, 1051641, 1063103, 1075506, 1088745, 1102746, 1117234, 1132126, 1147371, 1162272, 1175859, 1188053, 1199441, 1209902, 1218672, 1225816, 1232209, 1237896, 1242041, 1244821, 1247786, 1251828, 1256322, 1260828, 1266132, 1272931, 1280899, 1289767, 1300033, 1311929, 1324878, 1338530, 1353167, 1368720, 1384699, 1401386, 1419617, 1439036, 1458118, 1476286, 1494338, 1512481, 1529834, 1546425, 1563718, 1582389, 1601379, 1619878, 1638528, 1657945, 1677919, 1698826, 1721901, 1747274, 1773531, 1799998, 1827568, 1856557, 1885860, 1915048, 1945186, 1976673, 2008482, 2040466, 2074130, 2110027, 2146798, 2184016, 2223557, 2266725, 2312395, 2359473, 2408887, 2461535, 2516477, 2572768, 2630987, 2691436, 2753006, 2815282, 2879474, 2945812, 3012465, 3078595, 3145949, 3215795, 3286968, 3358682, 3432583, 3510207, 3591198, 3675979]
58244C675979R1205R9031J04985J09347J15170J22665J29713J37021J47060J58485
58234D890661J67660J75366J85875J99643K13252K26333K41878K59794K77076
58225F837538K94553L16446L42800L69537L96487M28006M65152N04838N47383
58216A0502740N96969O53961P14947P81259Q59170R50945J054575J172889J313663
58207A8601118J480249J672402J897194K168726K496928K889049L363387L949891
58199C8518944M678198N580209O702780Q096140R782813J1753744J3996886J6506517
58191A15616231J9252237K2147300K5038191K7696356K9823157L1092880L1162928
58184C01829280K9557762K5567805J8509646Q403314l485319j4911265k3706516
$$ y = [3675979, 3767184, 3866215, 3971200, 4080547, 4195717, 4318382, 4448095, 4585116, 4732176, 4890661, 5058321, 5233687, 5419562, 5619205, 5832457, 6058790, 6300668, 6560462, 6837538, 7132091, 7448537, 7791337, 8160874, 8557361, 8985367, 9450519, 9955357, 10502740, 11099709, 11753670, 12468617, 13249876, 14109046, 15059991, 16114566, 17287455, 18601118, 20081367, 21753769, 23650963, 25819689, 28316617, 31205666, 34569053, 38518944, 43197142, 48777351, 55480131, 63576271, 73359084, 85112828, 99109714, 115616231, 134868468, 157015768, 182053959, 209750315, 239573472, 270666352, 301829280, 331387042, 356954847, 375464493, 383867807, 380382488, 365471223, 341764707]
58177C41764707k8825396l0603540l0195861k8768442k6999016k5047968k2834822
58170A48489662k0339172j7710283j5168558j2865243j0850245r126441p684050
58163E4745670o492468n504330m682364m005806l451093k987327k593523k262535
58155B2766224j985027j745204j534829j356390j208641j081655r69124q73361
58147A2011993p94534p25541o61041o02180n49455m99728m52723m12181l78120
58138F936490l45731l13813k86656k65810k47730k31426k20552k15431k10290
58129D599051k01251j90623j80783j70138j57801j46324j37035j27908j18347
58120C168841j11013j06690j02349r6378r0922q7105q2794p7101p2412o9868o7260
$$ y = [341764707, 312939311, 282335771, 252139910, 223371468, 196372452, 171324484, 148489662, 128150490, 110440207, 95271649, 82406406, 71556161, 62429720, 54745670, 48253202, 42748872, 38066508, 34060702, 30609609, 27622282, 25028759, 22766224, 20781197, 19035993, 17501164, 16144774, 14936133, 13854478, 12885354, 12011993, 11217459, 10491918, 9830877, 9228697, 8679242, 8179514, 7726791, 7314610, 6936490, 6590759, 6276946, 5990290, 5724480, 5476750, 5245324, 5024772, 4809341, 4599051, 4397800, 4207177, 4026394, 3856256, 3698455, 3552131, 3415096, 3287188, 3168841, 3057828, 2951138, 2848789, 2752411, 2661489, 2574384, 2491590, 2414489, 2342077, 2272209, 2204949]
58109B204949o3401o0200n8463n5994n1914m8638m7577m6778m4857m3274m2783
58098A641070m1525l8746l6569l6084l5297l3049l1228l0931l0077k7189k4211
58087A276164k3027k2386k0703j8981j8481j8230j7251j6749j7709j8709j8406
58076A065532j7949j8718j9736j9522j8580j8037j7601j6747j6148j6167j5667
58065H70660j3930j2109j1241j0595r428q568q764r205r066q866r028q865q316
58052G42679q671j0269j1384j0871r921r747r474q092o571o160o223n628m914
58039F34754n194o100o509o335o081n681n085m985n705o414o509o690p586q568
58025E47312q969r245r799r996r371q626q288p702o453n479n549n889n519m822
$$ y = [2204949, 2141548, 2081348, 2022885, 1966891, 1914977, 1866339, 1818762, 1771984, 1727127, 1683853, 1641070, 1599545, 1560799, 1524230, 1488146, 1452849, 1419800, 1388572, 1357641, 1327564, 1300375, 1276164, 1253137, 1230751, 1210048, 1191067, 1172586, 1154356, 1137105, 1120356, 1102647, 1083938, 1065532, 1047583, 1028865, 1009129, 989607, 971027, 952990, 935389, 918642, 902494, 886327, 870660, 856730, 844621, 833380, 822785, 813357, 804789, 796025, 786820, 777754, 768888, 759860, 750995, 742679, 734008, 723739, 712355, 701484, 691563, 681816, 672342, 664250, 657679, 651519, 645296, 639668, 634754, 629560, 623460, 616951, 610616, 604535, 598854, 593769, 588784, 583079, 576665, 570156, 563466, 555880, 547312, 538343, 529098, 519299, 509303, 499932, 491306, 483018, 475316, 468863, 463384, 457835, 451946, 446427, 441605]
58011D41605m577m559m225l773l436k797j776j227j556j895j566j181j347j472
57997D06218q83M8Q85J962L280L869L335K744K894L013K298J396J101Q37j21j115
57981D31761j229r52j297k101k508k443k356k290k246k701l706m294l747k660
57967C97231j850j210n12k18m47k52Q57J769J434O14O61J446J865J609J146O08
57951D04751n9n10n97q44j311r45Q40K861L673L497L413L488L153K694K873L529
57935D30506L939M079M440M967N360N792O283N990M302K016K90r70k486m000m735
57920D65773m930n538o693p687q203q411q201p489o942p224p749p327n861m317
57906C69201l194k158j084m41m30o74p83p67q42j217j955k666k762k212j609j250
$$ y = [441605, 437028, 432469, 428244, 424471, 421035, 418238, 416462, 415235, 413679, 411784, 410218, 409037, 407690, 406218, 405335, 405383, 406268, 408230, 411510, 415379, 418714, 421458, 424352, 427365, 429663, 431059, 432160, 432997, 432876, 431761, 430532, 429580, 428283, 426182, 423674, 421231, 418875, 416585, 414339, 411638, 407932, 403638, 399891, 397231, 395381, 394171, 393659, 393441, 392994, 392742, 393599, 395368, 396802, 397416, 398077, 399523, 401388, 402997, 404143, 404751, 404692, 404182, 403585, 402741, 401430, 400485, 401325, 404186, 407859, 411356, 414769, 418257, 421410, 424104, 426977, 430506, 434445, 438524, 442964, 447931, 453291, 459083, 465366, 471356, 475658, 477674, 477964, 476994, 474508, 470508, 465773, 460843, 455305, 448612, 440925, 432722, 424311, 416110, 408621, 401679, 394455, 386706, 379379, 373518, 369201, 366007, 363849, 362765, 362324, 361894, 361220, 360437, 359670, 358828, 357611, 355656, 352990, 350228, 348016, 346407, 345157]
57890C45157q44m05m25p86o32N4K9j207k241j725l79J86k55q61j403k230l188
57873C28845l885m546n414n917n592n141n379n832n620m986m586m050k735j298
57859B63864q64j135q79J25J088J801K634L372L573L742M583N413M986L650K939
57844B98892L107K925J945J143J070J025N34J11M8j86q00j174j018r25j251j465
57828C03981j124n23L6P85J907L084L970M439M312L533K675K447K659K475J774
57813C36430J323J490J613R04p24k850m958o583p638q508r353r680r223q674q562
57798B65007q063o130l398j579j173j192j033j075j417j460j098r62j161j005
57784B34261k97L03N44J027K101L322M351N295N872N466M352L745M171M850N039
$$ y = [345157, 344313, 343908, 343483, 342697, 342065, 342119, 342148, 340941, 338700, 336975, 336596, 336782, 336527, 335666, 334263, 332033, 328845, 324960, 320414, 315000, 309083, 303491, 298350, 292971, 287139, 281519, 276533, 271947, 267897, 265162, 263864, 263000, 261865, 260986, 261111, 262199, 264000, 266634, 270006, 273579, 277321, 281904, 287317, 292303, 295953, 298892, 301999, 304924, 306869, 308012, 309082, 310107, 310641, 310752, 310800, 310614, 309814, 308640, 307622, 306697, 305446, 303981, 302857, 302334, 302370, 303155, 305062, 308146, 312116, 316555, 320867, 324400, 327075, 329522, 332181, 334656, 336430, 337753, 339243, 340856, 341760, 341036, 338186, 333228, 326645, 319007, 310499, 301146, 291466, 282243, 273569, 265007, 256944, 250814, 247416, 245837, 244664, 243472, 242439, 241364, 239947, 238487, 237389, 236427, 235266, 234261, 233964, 234267, 234811, 235838, 237939, 241261, 245612, 250907, 256779, 262245, 266597, 270342, 274513, 279363, 284402]
57769B84402M908M619L675J825k98k028l367m508n386o160p272q669r738j0210
57755B41793j0316r909q517o458m744l492j684J107L924O000P764R554J0483R652
57741B45157P610N592M046K750J705R86K98n08q74l36N89R89O88J45l37p35r00
57724B66865p29m61m09n41o69p56q38r33j194j694k049j787j187j040j526k073
57708B48979k510l319m412m682l517j933j367j880k291j735m65P09J229J161J014
57693B24981J057Q77pj189j756j550j246j146q98m93m65o50O6K151M556O138P199
57676B37625Q835J1516J4923J8703K2671K6821L1598L7522M4083M9679N3221N4943
57664F12140N4929N1508M2008K5051K001k3028m4459n7830o2316o0500n5419m8599
$$ y = [284402, 289310, 293929, 297604, 299429, 299131, 297103, 293736, 289228, 283842, 277682, 270410, 261741, 252003, 241793, 231477, 221568, 213051, 206593, 201849, 198357, 196673, 197780, 201704, 207704, 215468, 225022, 235505, 245157, 252767, 258359, 262405, 265155, 266860, 267846, 268144, 267636, 266762, 266426, 267015, 268004, 268692, 268837, 268500, 267765, 266865, 266136, 265675, 265266, 264725, 264056, 263300, 262462, 261529, 260335, 258641, 256592, 254805, 253618, 252578, 251052, 248979, 246469, 243150, 238738, 234056, 230539, 228606, 227239, 225359, 223068, 221333, 220868, 221577, 222806, 223967, 224981, 226038, 226915, 226908, 225719, 223963, 222413, 221167, 220021, 219123, 218630, 218165, 217515, 217581, 219732, 224288, 230426, 237625, 246460, 257976, 272899, 291602, 314273, 341094, 372692, 410214, 454297, 503976, 557197, 612140, 667069, 718577, 760585, 785636, 787637, 764609, 720150, 662320, 600004, 539504, 484085, 435486]
57652D35486m0999l4116k8909k4658k0263j5943j2562j0001p588n524m518m343
57640B26062m092l580l294l106k320r76O9M51O08P19L60n27j253j300r13n32k97
57623B06079k62n29r39j157j208j453j918k103j660q69l29m06r88j556j587j123
57607A87992p73r16j186j033m87j4K8n71j897l435m023l080j474n34m27l37m3
57590A67790k71j404k713l277l055k671k485k301j874j430j483k034k222j249
57576A39321L40R85o7j902l215l632l350k356r35j68p72j855j955j057m09n69
57560A18404p86l98L58J100J793K187J731N84j59K32J250J992K289K396K259J712
57544A36944J066Q04Q53P40L85K42O12J217J678K108K839L648L715K663J308Q03
$$ y = [435486, 394487, 360371, 331462, 306804, 286541, 270598, 258036, 248035, 240447, 234923, 230405, 226062, 221970, 218390, 215096, 211990, 209670, 208694, 208763, 209214, 209822, 210541, 210901, 210374, 209121, 207821, 206908, 206376, 206079, 205817, 205288, 204349, 203192, 201984, 200531, 198613, 196510, 194850, 193981, 193652, 193246, 192258, 190702, 189115, 187992, 187219, 186303, 185117, 184084, 183597, 183583, 183611, 183040, 181143, 177708, 173685, 170605, 169131, 168597, 168170, 167833, 167790, 167519, 166115, 163402, 160125, 157070, 154399, 151914, 149613, 147739, 146309, 144826, 142792, 140570, 139321, 139661, 140646, 140579, 138677, 135462, 131830, 128480, 126124, 125189, 125021, 124249, 122394, 120439, 119382, 118973, 118404, 117618, 117220, 117578, 118678, 120471, 122658, 124389, 124973, 124814, 125046, 126296, 128288, 130577, 132973, 135232, 136944, 138010, 138814, 139667, 140407, 140792, 141034, 141646, 142863, 144541, 146649, 149488, 153136, 156851, 159514, 160822, 161625]
57528A61625J152J188J90j169j896j983k161k770l619m547n468o081o188o152
57514A22121o407o730o559n931n354m975m500l873l293k637j647o37k01j87J71
57499F9361R42J180K90j065j845j794j290o00J28N85N63L23K26K37J01j53k75
57482F6914k19j34p0J01M47Q42J022O85j95j069j086OJ336J697Q33k97o42j64
57464G0007L53L94K12K90O45R74J155J216R79K10q31j429j150k70O34J119R39
57447G5447R1r66j497j207m88J56N54P37P79R13J291J478Q15n00j381j229o45
57430G4348l39j21M45J098J378J435J519J200O9j218j611j088m67n4N17J174J306
57413G9591Q21L31J37l9k14M5O64Q33J64n87n66j0J58m05j114j280r63q53j359
$$ y = [161625, 162777, 163965, 164155, 162986, 161090, 159107, 156946, 154176, 150557, 146010, 140542, 134461, 128273, 122121, 115714, 108984, 102425, 96494, 91140, 86165, 81665, 77792, 74499, 71862, 70215, 69578, 69377, 69190, 69361, 70303, 71483, 71773, 70708, 68863, 67069, 65779, 65179, 65307, 65892, 66455, 66778, 67004, 67241, 67342, 67189, 66914, 66695, 66561, 66491, 66592, 67039, 67881, 68903, 69588, 69393, 68324, 67238, 67244, 68580, 70277, 71110, 70813, 70171, 70007, 70360, 70754, 70966, 71256, 71901, 72875, 74030, 75246, 76225, 76435, 75604, 74175, 73025, 72755, 73389, 74508, 75447, 75538, 74572, 73075, 71868, 71380, 71536, 72090, 72827, 73606, 74519, 75810, 77288, 78103, 77603, 76222, 74993, 74348, 74009, 73888, 74333, 75431, 76809, 78244, 79763, 80963, 81032, 79814, 78203, 77115, 76648, 76594, 77111, 78285, 79591, 80412, 80743, 80880, 80841, 80627, 80672, 81336, 82169, 82333, 81746, 81180, 81170, 81328, 80923, 79809, 78529, 77566, 76713, 75354]
57394G5354j927j568k33Q87Q19J38J97J272K286K238J256J78k88P3R07J467J281
57377H4337O42J99J90M31P76J032P73j28j034j263j023r19r01n28l7q7n81p36
57359H1143k90K54N97Q82J012O92K29K28M37L2q68j116k85P09J085J158J316J184
57341H8399M91k12m66o29r93j034k88P25J260J381J551J718J551J105O49K92J88
57324I5688N47R81O15n84j406j030k88l72j001r28J54J306J706J404Q13K87J20
57307I8012L38N32M31M27R31J554J566R79M34K14Q4jK65Q63J369J587J720J827
57289A13132J591Q42o1n71m63MK75j19j122k154k671k611k219j756j505j706k177
57272I6709k284j648o22J93N60M54k32j351k221k290j832j559j635j626j204m62
$$ y = [75354, 73427, 71859, 71626, 72513, 73332, 73470, 73667, 74939, 77225, 79463, 80719, 80897, 80609, 80682, 81589, 83056, 84337, 84979, 85178, 85368, 85799, 86575, 87607, 88380, 88252, 87218, 85955, 84932, 84013, 83112, 82584, 82547, 82460, 81879, 81143, 80853, 81107, 81704, 82586, 83598, 84290, 84519, 84747, 85184, 85216, 84348, 83232, 82947, 83656, 84741, 85899, 87215, 88399, 88890, 88678, 88212, 87583, 86590, 85556, 85268, 85993, 87253, 88634, 90185, 91903, 93454, 94559, 95208, 95500, 95688, 96235, 97216, 97831, 97247, 95841, 94811, 94523, 94151, 93150, 92222, 92376, 93682, 95388, 96792, 97605, 97892, 98012, 98350, 98882, 99313, 99740, 100671, 102225, 103791, 104770, 105204, 105418, 105502, 105501, 105766, 106629, 107998, 109585, 111305, 113132, 114723, 115565, 115504, 114933, 114470, 114474, 114749, 114630, 113508, 111354, 108683, 106072, 103853, 102097, 100592, 98886, 96709, 94425, 92777, 92155, 92348, 92908, 93362, 93130, 91779, 89558, 87268, 85436, 83877, 82242, 80616, 79412, 78950]
57256G8950M14J276J865J904J394N92k24p62o97j5Q36J366J531J481J138L98l83
57239I1064o20k02M04P72R94J454K204K671K100M88j079j396m66N59Q00M66J98
57222A00411K35N18R47J191Q38J54R9J027J982J913J073N17O47J047J429J863
57206A15891K172J966J361R67J044J225J242J385K058L125L972M064L435K659
57192A46566K290K334K391K321K365K612K820K906L020K965K221R98M66J280K473
57177A80028K617J688Q82R25J416J791K093K676L734N208O791P963Q410Q269P792
57162B42283P051O282O047O540P149P298P305P780Q598R311J0243J2201J5184
57149C53272J8290K0967K3516K6276K9079L1621L3724L5102L5554L5668L6767
$$ y = [78950, 79364, 80640, 82505, 84409, 85803, 86395, 86171, 85409, 84712, 84697, 85533, 86899, 88430, 89911, 91049, 91447, 91064, 90444, 90242, 90646, 91418, 92412, 93866, 96070, 98741, 100841, 101329, 100250, 98854, 98388, 98947, 99747, 100213, 100411, 100646, 101164, 102111, 103302, 104140, 104294, 104393, 105420, 107402, 109315, 110388, 110905, 111552, 112599, 114028, 115891, 118063, 120029, 121390, 122357, 123401, 124626, 125868, 127253, 129311, 132436, 136408, 140472, 143907, 146566, 148856, 151190, 153581, 155902, 158267, 160879, 163699, 166605, 169625, 172590, 174811, 175809, 176275, 177555, 180028, 182645, 184333, 185215, 186140, 187556, 189347, 191440, 194116, 197850, 203058, 209849, 217812, 226222, 234491, 242283, 249334, 255616, 261663, 268203, 275352, 282650, 289955, 297735, 306333, 315644, 325887, 338088, 353272, 371562, 392529, 416045, 442321, 471400, 503021, 536745, 571847, 607401, 643069, 679836]
57138F79836L9855M4801N0599N5955N9666O1080O0529N9083N7803N7268N7665
57127A284140N8900O0771O3265O6498P0045P2815P4200P5006P6550P9022Q1553
57116B062765Q3810Q6624R0878R6477J02762J09438J16823J25588J36442J49908
57106C161515J66304J86098K10111K39196K74026L15699L66307M28702N05853
57097E853811O00850P17013Q57367J023835J216492J432414J664338J900943K128781
57088A7395844K333906K503708K632293K726765K803203K867536K897373K847745
57080C9008373K681099K393731K013859J577049J105416O06390Q3822m53130r88451
57071D8028158j501148j967386k363538k670786k879029k987501l002469k934896
$$ y = [679836, 719691, 764492, 815091, 871046, 930712, 991792, 1052321, 1111404, 1169207, 1226475, 1284140, 1343040, 1403811, 1467076, 1533574, 1603619, 1676434, 1750634, 1825640, 1902190, 1981212, 2062765, 2146575, 2233199, 2324077, 2420554, 2523316, 2632754, 2749577, 2875165, 3011607, 3161515, 3327819, 3513917, 3724028, 3963224, 4237250, 4552949, 4919256, 5347958, 5853811, 6454661, 7171674, 8029041, 9052876, 10269368, 11701782, 13366120, 15267063, 17395844, 19729750, 22233458, 24865751, 27592516, 30395719, 33263255, 36160628, 39008373, 41689472, 44083203, 46097062, 47674111, 48779527, 49385917, 49469739, 49016609, 48028158, 46527010, 44559624, 42196086, 39525300, 36646271, 33658770, 30656301, 27721405]
57063B7721405k799696k615110k400382k172578j945008j727442j526471j345490
57055A1189228j185221j044781r22096q13929p16964o29529n51746m83800m24795
57046D416367l73491l29108k90816k57256k27296k00849j78165j58684j41196
57037B259506j24917j09927r6595q4892p4234o3749n2802m1211k8857j5300l96
57026A566626J4768K8259L8996M7703N5728O2612O4401N4540K8046j3233n9359
57015A889087r7751j20918j29139j26774j17923j05554r2280p9908o8784n8680
57005H91376m9893m2883l7412l2904k9134k6042k3414k1301k0112j9629j8726
56994E69926j6744j4508j3154j2558j1671r958p585m768j750Q99K827M460O195
$$ y = [27721405, 24921709, 22306599, 19906217, 17733639, 15788631, 14061189, 12534718, 11189228, 10004007, 8959226, 8037130, 7223201, 6506237, 5876708, 5324962, 4841162, 4416367, 4042876, 3713768, 3422952, 3165696, 2938400, 2737551, 2559386, 2400702, 2259506, 2134589, 2024662, 1928067, 1843175, 1768941, 1705192, 1652390, 1611179, 1582322, 1567022, 1566626, 1581394, 1609653, 1648649, 1696352, 1752080, 1814692, 1879093, 1933633, 1961679, 1948446, 1889087, 1791336, 1670418, 1541279, 1414505, 1296582, 1191028, 1098748, 1018840, 950056, 891376, 841483, 798600, 761188, 728284, 699150, 673108, 649694, 628393, 608281, 588652, 569926, 553182, 538674, 525520, 512962, 501291, 491333, 483748, 478980, 477230, 478129, 480956, 485416, 491611]
56981D91611P415P041M855J507k460o764j0779j3647j5088j5468j5087j3927j2016
56968D07193r623p111m899l245j736N25L747O944R192J0849J2801J4938J6350
56955D55925J6628J5936J3899R516K561n657j3127j8336k0744k0756j9410j7540
56943C98895j5093j1632p486l827j483k3J734M538Q114J1585J4444J6993J9662
56930D36421K1966K2703K1205J7756J2535N133m269j3978k1889k7051k9561k9589
56918D11382k7486k4371k1424j8731j5725j2548j0079q672p821p045o241n242
56906B45997l881k601k043j968j446k05J003J567J780K234L193M746O861R030
56892B64267J0596J1638J2937J4853J6887J8547J9957K1245K1972K1491J9348
$$ y = [491611, 499026, 506067, 510922, 512429, 509969, 503205, 492426, 478779, 463691, 448223, 433136, 419209, 407193, 397570, 390459, 385560, 382315, 380579, 381104, 384851, 391795, 400987, 411836, 424637, 439575, 455925, 472553, 488489, 502388, 511904, 514465, 508808, 495681, 477345, 456601, 435845, 416435, 398895, 383802, 372170, 364684, 360857, 359374, 359351, 361085, 365623, 373737, 385322, 399766, 416759, 436421, 458387, 481090, 502295, 520051, 532586, 537719, 533450, 519472, 497583, 470532, 440971, 411382, 383896, 359525, 338101, 319370, 303645, 291097, 281018, 272346, 264525, 257480, 251239, 245997, 242116, 239515, 237472, 235504, 234058, 233853, 234856, 236423, 238203, 240437, 243630, 248376, 255237, 264267, 274863, 286501, 299438, 314291, 331178, 349725, 369682, 390927, 412899, 434390, 453738]
56881D53738J5157Q792J141n941j0937j3675j4831j4931j4135j2467r795n978
56869C76138j367L236P464J1821J6873K2439K8026L3506L8744M2907M5012M5020
56857F69819M3506M0021L2688K0198L959j2409k5695l4743l9655m0409l7074l0864
56845E89342k3795j7004j0063k192O506J5398K4246L3229M2353N1358N9855O7191
56833H36424P2481P5099P4582O9515N7324L6357Q329k1851m8571o7744p7616p8966
56821I35363p4606o7546n9165m9478l8840k8380j8725r386J57R566J8300K6469
56809F43729L4445M1999M8291N2392N3452N0462M2263K8067Q390j4182l5529n1913
56797I01866o1662o5080o3332n7960n0801m3302l5793k8095k0612j4017q155k329
$$ y = [453738, 468895, 477687, 478828, 472887, 461950, 448275, 433444, 418513, 404378, 391911, 382116, 376138, 374771, 378007, 385471, 397292, 414165, 436604, 464630, 498136, 536880, 579787, 624799, 669819, 713325, 753346, 786034, 806232, 810191, 797782, 772087, 737344, 697689, 657280, 620206, 589342, 565547, 548543, 538480, 536288, 542794, 558192, 582438, 615667, 658020, 709378, 769233, 836424, 908905, 984004, 1058586, 1128101, 1185425, 1221782, 1230111, 1208260, 1159689, 1091945, 1014329, 935363, 860757, 793211, 734046, 684568, 645728, 617348, 598623, 589237, 589394, 598960, 617260, 643729, 678174, 720173, 768464, 820856, 874308, 924770, 967033, 995100, 1003490, 989308, 953779, 901866, 840204, 775124, 711792, 653832, 603031, 559729, 523936, 495841, 475229, 461212, 453057, 450728]
56785D50728L403Q315J2382J6417K0605K4039K5953K6134K3693J6967N691p638
56773F26689j9606k8471l4234l7143l7411l5894l3720l1226k8084k4404k0889
56762B95607j7938j5330j2829j0569q749p401o481n821n106m254l718l931m564
56749A88916m746m066k938j980j395j008o58m18n11j037j773k295k351k017j436
56734A60287p02K5M91O69P99J036J258J310J162Q28L73M2M4K04J76P7L60R91J374
56715A70804J248J088J264J408J052L74j46m38o72p77o52n58p16q52o28l57o70
56698A70772j598k529l034l204l136k692j884j106p36p53r16j111j342j496j382
56683A43853r88o32o53j043j431j488j227q18l85j04k12o58r54p61m63o13j059
$$ y = [450728, 454131, 462446, 474828, 491245, 511850, 535889, 561842, 587976, 611669, 628636, 634327, 626689, 607083, 578612, 544378, 507235, 469824, 433930, 400210, 368984, 340900, 316496, 295607, 277669, 262339, 249510, 238941, 230192, 222791, 216310, 210489, 205383, 201129, 197411, 193480, 188916, 184170, 180104, 177166, 175186, 173791, 172783, 172125, 171707, 171196, 170159, 168386, 166091, 163740, 161723, 160287, 159585, 159610, 160101, 160770, 161569, 162605, 163863, 165173, 166335, 167163, 167536, 167578, 167622, 167826, 168002, 168079, 168439, 169430, 170804, 172052, 173140, 174404, 175812, 176864, 177238, 177092, 176654, 175982, 175205, 174553, 173995, 173279, 172427, 171799, 171442, 170772, 169174, 166645, 163611, 160407, 157271, 154579, 152695, 151589, 150853, 150100, 149184, 148073, 146731, 145235, 143853, 142865, 142233, 141580, 140537, 139106, 137618, 136391, 135573, 135188, 135084, 134872, 134214, 133260, 132499, 132036, 131423, 130364]
56666A30364j144p42m14m65n01j34M60R99J539K167K671K904L104L529M127M808
56650A53272N692O713P312O985O013N304N446O010N917M584K705J523J244O98
56636B19418q98k568k858k009j604k184k712k533k408k919l196k239n53N99Q86
56621A92222Q50O80J13p08j232j266j065p94m45j42p1k33o53j476k484k916k294
56604A78086j131l27j81m06p46j109j394j584j723j509n31Q08J322N73l35k38
56588A69575N05P57L45k5j43m54r38q81P2J426K474K855K473J490M44p0Q1O46
56570A80632J347J862J836J356J125J622K484L150L656M220M622M725N118O243
56556B23998P368P400O450N525M881L831K177P12O8oK9J27K99L28P2l74r18j399
$$ y = [130364, 129220, 128478, 128064, 127599, 127098, 126964, 127424, 128423, 129962, 132129, 134800, 137704, 140808, 144337, 148464, 153272, 158964, 165677, 172989, 179974, 185987, 191291, 196737, 202747, 208664, 213248, 215953, 217476, 218720, 219418, 218520, 215952, 213094, 211085, 209481, 207297, 204585, 202052, 199644, 196725, 193529, 191290, 190737, 191336, 192222, 193072, 193752, 193865, 193157, 191925, 190659, 189594, 188800, 188355, 188213, 188142, 187909, 187256, 185780, 183296, 180380, 178086, 176955, 176628, 176447, 176041, 175295, 174186, 172792, 171208, 169485, 167976, 167445, 168253, 169575, 170148, 169813, 169575, 170080, 170837, 171182, 171157, 171014, 170560, 169622, 168741, 168813, 170239, 172713, 175568, 178041, 179531, 179975, 179905, 179986, 180632, 181979, 183841, 185677, 187033, 188158, 189780, 192264, 195414, 199070, 203290, 207912, 212637, 217755, 223998, 231366, 238766, 245216, 250741, 255622, 259453, 261630, 262342, 262410, 262404, 262433, 262560, 262859, 263187, 263259, 262885, 261967, 260568]
56538B60568j413p83j15k22j035j797k149k336k434k297k257k901m004m541m008
56523B28276l016k325k021j896j925k101k292k480k668k506j654n08R7m8m40q21
56507B01672j331j701j268j66N55L64J8L18R19J026N71P6k15m04n00m66m20l85
56489A98663j67K69N38L65l3l39n80q36q64m32L15J072J694K005J653O04m62o76
56471B02789R5J063J291N46m45o50J67J084J042J64m29j40M00L23l13p08k94Q18
56453B06803K079K815K553J395M0p71q68o25m42l66k15K9Q2j49j34P67K230K974
56435B18197K212O87k69k32K44O35Q03O11N2m10k79K47N84N98N03K51k37n29k40
56416B23428J65P5o6N64J509J437K38p25p37o46j089j372q67k77m17p77l91N75
$$ y = [260568, 259155, 258372, 258257, 258035, 257000, 255203, 253054, 250718, 248284, 245987, 243730, 240829, 236825, 232284, 228276, 225260, 222935, 220914, 219018, 217093, 214992, 212700, 210220, 207552, 205046, 203392, 202884, 202981, 202933, 202493, 201672, 200341, 198640, 197372, 197206, 197761, 198125, 198143, 198461, 199380, 200406, 200977, 201053, 200838, 200434, 199934, 199468, 199048, 198663, 198496, 198765, 199303, 199668, 199635, 199296, 198716, 197880, 197016, 196584, 196899, 197971, 199665, 201670, 203323, 203927, 203465, 202789, 202884, 203947, 205238, 205784, 205339, 204689, 204856, 205940, 206982, 207146, 206717, 206577, 206977, 207300, 206987, 206279, 205985, 206803, 208882, 211697, 214250, 215645, 215685, 214914, 214046, 213421, 212979, 212613, 212398, 212427, 212509, 212360, 212226, 212993, 215223, 218197, 220409, 221096, 220827, 220595, 220839, 221474, 222277, 222888, 222940, 222530, 222251, 222498, 223082, 223680, 224183, 224434, 224197, 223668, 223428, 223593, 223668, 223602, 224166, 225675, 227112, 227350, 226625, 225888, 225242, 224153, 222781, 221914, 221637, 221220, 220443, 220052, 220627]
56398B20627J241J398J422J286P03k3k53N3M47P74J166J478J519J683K567M066
56382B40154N565O907Q388R774J0164R106P190N230L419J604k0j088j642k077
56368C02674k493k542k062j483j282j294r64k02M30M92J30l28p93j161j152p74
56352B87196n17o20o38j75M18O41O80R31J173R54M62J54o6m65o47j41N37N30J48
56333B90555M66J499K111J855J624K134K971L540L844L931L489K552J716J264
56319C23551Q97N58O29J037J124P37M54N35O38P61J317J987J880J150J112K146
56303C40513L003K843K506K785K991K385J756K102K823K785K289K449L171L359
56289C77760K784K390K777L555M149M348M160L890M173N210O239O440O024N731
$$ y = [220627, 221868, 223266, 224688, 225974, 226677, 226654, 226401, 226454, 226901, 227675, 228841, 230319, 231838, 233521, 236088, 240154, 245719, 252626, 261014, 270788, 280952, 290058, 297248, 302478, 305897, 307501, 307481, 306393, 304751, 302674, 300181, 297639, 295577, 294094, 292812, 291518, 290554, 290352, 290782, 291274, 291404, 291076, 290283, 289122, 287970, 287196, 286679, 286059, 285421, 285246, 285664, 286305, 286985, 287916, 289089, 290043, 290505, 290659, 290593, 290128, 289481, 289340, 289877, 290407, 290555, 291021, 292520, 294631, 296486, 298110, 300244, 303215, 306755, 310599, 314530, 318019, 320571, 322287, 323551, 324448, 325006, 325635, 326672, 327796, 328533, 328987, 329522, 330160, 330921, 332238, 334225, 336105, 337255, 338367, 340513, 343516, 346359, 348865, 351650, 354641, 357026, 358782, 360884, 363707, 366492, 368781, 371230, 374401, 377760, 380544, 382934, 385711, 389266, 393415, 397763, 401923, 405813, 409986, 415196, 421435, 427875, 433899, 439630]
56275D39630N725N769O043O909Q135R167R951J0774J1513J1790J1727J1907J2662
56262E61702J3852J5243J6767J8594K1102K4423K7971L1057L3976L7678M2239
56251H44604M6794N1259N6827O4105P1990P9165Q5595R1631R6824J00698J03582
56240A693074J05557J05529J02628R7532R1107Q2655P0956N6315M0110K2970M921
56229B473354j3207l0046m5046n8253o9198p7390q3498q8641r2699r4622r4108
56218A726646r1782q8094q3365p8462p4130o9827o4634n8970n4000m9721m5190
56207I68471m0414l6426l3471l0730k7866k5339k3104k0483j7597j5453j4297
56196F83291j3177j1574j0075r099q096o636n239m546m509m786n147n219m544
$$ y = [439630, 445355, 451124, 457167, 464076, 472211, 481378, 491329, 502103, 513616, 525406, 537133, 549040, 561702, 575554, 590797, 607564, 626158, 647260, 671683, 699654, 730711, 764687, 802365, 844604, 891398, 942657, 999484, 1063589, 1135579, 1214744, 1300339, 1391970, 1488794, 1589492, 1693074, 1798631, 1904160, 2006788, 2104320, 2195427, 2278082, 2349038, 2405353, 2445463, 2468433, 2473354, 2460147, 2430101, 2385055, 2326802, 2257604, 2180214, 2096716, 2008075, 1915376, 1820754, 1726646, 1634864, 1546770, 1463405, 1384943, 1310813, 1240986, 1176352, 1117382, 1063382, 1013661, 968471, 928057, 891631, 858160, 827430, 799564, 774225, 751121, 730638, 713041, 697588, 683291, 670114, 658540, 648465, 639366, 631270, 624634, 619395, 614849, 610340, 605554, 600407, 595188, 590644]
56183E90644l271k117j470j150j109j527k060j829n03J185K244K320J729J060
56169E84146P51P74P71P66J233K207L014L340L825M875N719N650N347N880P100
56154F35398Q243R394J0969J2342J2540J2023J2275J3829J5993J8329K1076K4231
56142H06642K7551L1380L6321M2239M8622N5610O3534P1819P9512Q6414R2393
56131A442037R6140R6132R2376Q5878P6968O5895N4553M5554L9616L5437L1851
56120B162437K8262K3284J5220M327p073j7072k5266l1616l6077l9724m4498n1394
56108A980810n9970o9473p8903q6165q8990q6954q1272p2910o2547n1917m2976
56097A198733l5725k8850k2410j7723j4643j1384p386m033k047m78J140J907J556
$$ y = [590644, 587373, 585256, 583786, 582636, 581527, 580000, 577940, 576111, 575608, 576793, 579037, 581357, 583086, 584146, 584897, 585671, 586442, 587208, 588441, 590648, 593662, 597002, 600827, 605702, 611421, 617071, 622418, 628298, 635398, 643641, 653035, 664004, 676346, 688886, 700909, 713184, 727013, 743006, 761335, 782411, 806642, 834193, 865573, 901894, 944133, 992755, 1048365, 1111899, 1183718, 1263230, 1349644, 1442037, 1538177, 1634309, 1726685, 1812563, 1889531, 1955426, 2009979, 2055533, 2095149, 2130586, 2162437, 2190699, 2213983, 2229203, 2233530, 2226457, 2209385, 2184119, 2152503, 2116426, 2076702, 2032204, 1980810, 1920840, 1851367, 1772464, 1686299, 1597309, 1510355, 1429083, 1356173, 1293626, 1241709, 1198733, 1163008, 1134158, 1111748, 1094025, 1079382, 1067998, 1060612, 1056579, 1054532, 1054054, 1055194, 1057101, 1058657]
56084A058657J304J837K372K455K801L624L992L697L937N363P028Q063Q813R623
56070A123566J0150J0495J1440J2946J3957J4218J4719J5909J7039J7670J8247
56059A280356J8925J9347J9787K0757K1553K1021J9714J9186J9308J8603J7168
56048A495725J6672J7352J7672J7257J7483J8793K0157K1505K3860K6627K7778
56037A720881K7254K7210K8381K9292K9667L1227L4247L6722L7957L9641M2241
56026B084720M3876M4010M4757M6977M8616M8606M8943N1056N3357N4416N5433
56015B624767N7625O0121O2302O5350O9670P3668P6631P9941Q4158Q8049R1678
56004C433960R6892J03587J09236J13505J19116J26828J34033J39943J47369J57338
$$ y = [1058657, 1059961, 1061798, 1064170, 1066625, 1069426, 1073050, 1077042, 1080739, 1084676, 1090039, 1097067, 1105130, 1113943, 1123566, 1133716, 1144211, 1155651, 1168597, 1182554, 1196772, 1211491, 1227400, 1244439, 1262109, 1280356, 1299281, 1318628, 1338415, 1359172, 1380725, 1401746, 1421460, 1440646, 1459954, 1478557, 1495725, 1512397, 1529749, 1547421, 1564678, 1582161, 1600954, 1621111, 1642616, 1666476, 1693103, 1720881, 1748135, 1775345, 1803726, 1833018, 1862685, 1893912, 1928159, 1964881, 2002838, 2042479, 2084720, 2128596, 2172606, 2217363, 2264340, 2312956, 2361562, 2410505, 2461561, 2514918, 2569334, 2624767, 2682392, 2742513, 2804815, 2870165, 2939835, 3013503, 3090134, 3170075, 3254233, 3342282, 3433960, 3530852, 3634439, 3743675, 3857180, 3976296, 4103124, 4237157, 4377100, 4524469, 4681807]
55994D681807J66919J74735J83684J95604K08179K19851K32821K48458K64891
55985F576949K81913L02774L28084L53770L78435M06773M41997M81098N21611
55976A0073404N66773O19554O78063P41528Q14587R00876R98893J109042J237971
55967A7740691J391423J570504J780072K032906K340863K711460L159421L713008
55959C6440348M404923N269062O350366P699527R344705J1279451J3485310J5946317
55951A10220009J8623865K1425690K4201300K6742517K8781037L0013589L0115524
55944B90123531K8640209K4888612J8095795Q092500m041341j6095612k5744639
55937C23959055l1664429l3876753l3262629l0880068k7596274k4024737k0551191
$$ y = [4681807, 4848726, 5023461, 5207145, 5402749, 5610928, 5830779, 6063600, 6312058, 6576949, 6858862, 7161636, 7489720, 7843490, 8221925, 8628698, 9070695, 9551793, 10073404, 10640177, 11259731, 11937794, 12679322, 13493909, 14394785, 15393678, 16502720, 17740691, 19132114, 20702618, 22482690, 24515596, 26856459, 29567919, 32727340, 36440348, 40845271, 46114333, 52464699, 60164226, 69508931, 80788382, 94273692, 110220009, 128843874, 150269564, 174470864, 201213381, 229994418, 260008007, 290123531, 318763740, 343652352, 361748147, 369840647, 365799306, 349703694, 323959055, 292294626, 258417873, 225155244, 194275176, 166678902, 142654165, 122102974]
55930A22102974j7373422j4572720j2178954j0185009q544354p195675o090441
55923D5962399n188933m447525l828033l309984k880262k519311k208247j939940
55915A9640164j711705j514419j338434j182889j049795r34908q32433p42754
55907A0332827o67823o04193n47452m98260m57743m22078l87674l56634l31303
55898F059667l08418k84396k61465k42783k26192k08565j91905j79179j67997
55889C988767j54330j39123j25728j13727j00636q6969p4641o2780m9809l7323
55879C043701k7547j9478j1873p697j1025k1371l5111n0627o7956q5068r8687
55868B607261j07862j13490j15477j13373j08437j02289r4838q5957p7457p0781
$$ y = [122102974, 104729552, 90156832, 77977878, 67792869, 59248515, 52052840, 45962399, 40773466, 36325941, 32497908, 29187924, 26307662, 23788351, 21580104, 19640164, 17928459, 16414040, 15075606, 13892717, 12842922, 11908014, 11075581, 10332827, 9665004, 9060811, 8513359, 8015099, 7557356, 7135278, 6747604, 6390970, 6059667, 5751249, 5466853, 5205388, 4962605, 4736413, 4527848, 4335943, 4156764, 3988767, 3834437, 3695314, 3569586, 3455859, 3355223, 3268254, 3193613, 3130833, 3081024, 3043701, 3016154, 2996676, 2984803, 2977106, 2966081, 2944710, 2909599, 2858972, 2791016, 2705948, 2607261, 2499399, 2385909, 2270432, 2157059, 2048622, 1946333, 1851495, 1765538, 1688081, 1617300]
55858A617300o4677n7756n1451m7728m5732m3440m0881l8949l6886l3739l0683
55847A125378k9176k8377k6963k5735k5812k5919k4324k1891k0504j9891j8682
55836H58104j7228j6683j6589j5890j5077j4924j4485j2737j0770r999r648q538
55824F95536p653q346r543r563r214j0150j1475j1181r781r379r991r865q867
55811E70528q382q387p555o035n282n247m423k611j201o06K29J709L066M008M950
55796E34761N770O054O258O830O681M503J149j366k767m311o135p102p155p569
55782E35601q763r835j0426j1159j2133j2644j2435j1783j0430p985n096k738
55770D20174o59J852M162M916M039K388j4l524p104r148r761j0223j0522r641
$$ y = [1617300, 1552623, 1494867, 1443416, 1395688, 1349956, 1306516, 1265635, 1226686, 1189800, 1156061, 1125378, 1096202, 1067825, 1040862, 1015127, 989315, 963396, 939072, 917181, 896677, 876786, 858104, 840876, 824193, 807604, 791714, 776637, 761713, 747228, 734491, 723721, 713722, 704074, 695536, 687883, 679537, 669994, 660431, 651217, 641067, 629592, 618411, 608630, 599251, 589260, 579395, 570528, 562146, 553759, 546204, 540169, 534887, 529640, 525217, 522606, 521405, 520799, 521028, 522737, 525803, 529811, 534761, 540531, 546585, 552843, 559673, 566354, 570857, 572006, 570640, 567873, 563562, 557427, 550325, 543170, 535601, 526838, 517003, 506577, 495418, 483285, 470641, 458206, 446423, 435993, 428008, 422912, 420174, 419515, 421367, 425529, 430445, 434484, 436872, 436858, 433334, 426230, 417082, 407321, 397098, 386576, 376935]
55756C76935q014p292p602p425o412o006o761p312o725n862n644n697n540n383
55742B85260n095l966k267j499k195k893k254r58n13j181k084k538k499k195j939
55727B51184j962k165k391k943m121n386n813n326m669m234l737k970j971o18
55713B02878J067K435L044L536M610N542N086L510K193J434K94j370k498k740
55699B29021l044l966m828n157n446n965o071n399m617m368m350m011l282k282
55685A66235j113k07L0O3O89J650J915J489J478K129K285J312J86j36j63q51k130
55668A74861l263l843l742k893j712r71p49k64P76J603J653J427J520J764J965
55653A68132K541L589M225L759K836K532K891L205L212L127K874K149J031j60
$$ y = [376935, 368921, 361629, 354027, 346602, 340190, 334184, 327423, 320111, 313386, 307524, 301880, 296183, 290643, 285260, 280165, 276199, 273932, 272433, 270238, 267345, 265091, 264133, 263620, 262439, 260355, 257817, 255318, 253123, 251184, 249222, 247057, 244666, 241723, 237602, 232216, 226403, 221077, 216408, 212174, 208437, 205467, 203496, 202878, 203945, 206380, 209424, 212960, 217570, 223112, 228198, 231708, 233901, 235335, 235629, 234259, 231761, 229021, 225977, 222011, 217183, 212026, 206580, 200615, 194544, 189145, 184528, 180160, 175810, 171799, 168517, 166235, 165122, 164915, 164945, 165008, 165697, 167347, 169262, 170751, 172229, 174358, 176643, 177955, 178141, 178005, 177842, 176991, 174861, 171598, 167755, 164013, 161120, 159408, 158437, 157688, 157424, 158200, 159803, 161456, 162883, 164403, 166167, 168132, 170673, 174262, 178487, 182246, 185082, 187614, 190505, 193710, 196922, 200049, 202923, 205072, 206103, 205943]
55639B05943j445l015m629n722o051n917n781n898o151o127n551m630l715k748
55625A38563j552n58m67j051j146k17P43M48j020k364k580j830j004q10j227j698
55609A22230j785j613j527j587j617j594j550j300p34j56R3J88M33O25M21Qk23
55592A10312l97q10j173j086r35j314j789j383k23N39N00M66R29J323J234J150
55576A07343J527K021K209K280K522K982L877N478P140P433N859L593J948Q59
55562A57071m82k188l646m391m432m038l646l633l851l776l310k953k976l057
55548A10692k907k631k299j783j253j127j356j442j288j258j284q41q3N4p69j660
55532H8765j764j273p82n10n60j069j638j565j062j222k268l004k662k166k580
$$ y = [205943, 204498, 201483, 196854, 191132, 185081, 179164, 173383, 167485, 161334, 155207, 149656, 145026, 141311, 138563, 137011, 136453, 135986, 134935, 133789, 133572, 134315, 134763, 133743, 131379, 128799, 126969, 125965, 125155, 123928, 122230, 120445, 118832, 117305, 115718, 114101, 112507, 110957, 109657, 108923, 108767, 108860, 109048, 109481, 110106, 110527, 110535, 110312, 109915, 109105, 107932, 106846, 105911, 104597, 102808, 101425, 101202, 101741, 102241, 102707, 103636, 104959, 106193, 107343, 108870, 110891, 113100, 115380, 117902, 120884, 124761, 130239, 137379, 144812, 150671, 154264, 156212, 157071, 156589, 154401, 150755, 146364, 141932, 137894, 134248, 130615, 126764, 122988, 119678, 116725, 113749, 110692, 107785, 105154, 102855, 101072, 99819, 98692, 97336, 95894, 94606, 93348, 92064, 91223, 91140, 91194, 90425, 88765, 87001, 85728, 84946, 84436, 83876, 82807, 81169, 79604, 78542, 77320, 75052, 72048, 69386, 67220, 64640]
55517F4640l407l525k995k666k636k340j772j418j172l15J391L363M910N728N892
55502F3678N835O025O280N806M401L002K470K364J706N08l44m19j22Q8J37O1j30
55485A01346l63o21r50j088n34O51J579J605J099O60J53p96j821k176j817j303
55469I5624q80l82J09J80k99r65j400j411j089p83p84p70q7J168J967J680R40
55452I2818N75M05j33p52p13j05K75J64P5L63Q16J195J491J601J293N97j85p88
55434I8992r81n57K81P85M80j18j57L90P67N04j40o59p35k95L90P95P33P48J398
55415A02621K402K918K606J886J281Q70M22k41j003j459j370j107j258j758j950
55400A04860j611j247j125q46l27k88j136k112k324j901j386p12K79R74P30j3
$$ y = [64640, 61233, 57708, 54713, 52047, 49411, 47071, 45299, 43881, 42709, 42394, 43785, 47148, 52058, 57786, 63678, 69513, 75538, 81818, 87624, 92025, 95027, 97497, 99861, 101567, 102075, 101731, 101312, 101190, 101278, 101415, 101476, 101346, 100983, 100362, 99412, 98324, 97790, 98441, 100020, 101625, 102724, 103384, 103537, 102741, 100920, 98744, 96927, 95624, 94744, 94362, 94471, 94651, 94352, 93387, 91987, 90576, 89487, 88704, 87920, 87150, 87063, 88231, 90198, 91878, 92818, 93393, 93798, 93665, 92913, 92200, 92095, 92370, 92534, 92609, 92972, 93788, 94983, 96474, 98075, 99368, 99965, 99780, 98992, 98011, 97454, 97735, 98520, 99000, 98882, 98725, 99115, 99882, 100386, 100246, 99587, 98852, 98557, 98947, 99742, 100475, 101223, 102621, 105023, 107941, 110547, 112433, 113714, 114584, 115006, 114765, 113762, 112303, 110933, 109826, 108568, 106810, 104860, 103249, 102002, 100877, 100031, 99704, 99416, 98280, 96168, 93844, 91943, 90557, 89845, 90124, 91098, 91828, 91815]
55384I1815m12n22q61j173q23j04J09j09J02Q15J135P57N05R16J435J356P75J90
55366I5906j67k76k66n33j329k175k351k018j991k350k184j018M28J279J555J649
55350H4159J517R61K53j04oK04J71j71n13l82K72P94N83J1n1M42O40J52l79l75
55330H8178k03l95o58l49M43R55P84K42k47o34r97j151p86O1Q68J052N27k89r51
55311H6450j213q88M9J062J282N36k87l83j05l13r73j144l04R92J827J806J216
55294H9610P04P68J213J202K64r68j495j169o63m13k27J41O06R73R69K50j103
55277I0662k229k283j461o21j2Q45K040K866K741J864P94q1n15l97O1N15R14J296
55259I6999J354P88m8m56l56k20j78J04N74O51P0p33j240j320j003m43q2k19m21
$$ y = [91815, 91403, 90881, 90020, 88847, 88024, 87920, 88029, 87920, 88022, 88837, 89972, 90729, 91234, 92150, 93585, 94941, 95716, 95906, 95739, 95463, 95197, 94664, 93335, 91160, 88809, 86791, 84800, 82450, 80266, 79248, 79676, 80955, 82510, 84159, 85676, 86637, 86890, 86786, 86780, 86984, 87155, 86984, 86471, 86089, 86361, 87155, 87738, 87749, 87698, 88140, 88780, 88932, 88553, 88178, 87975, 87580, 86922, 86573, 87016, 87971, 88755, 88997, 88750, 88116, 87119, 85968, 85182, 85243, 86111, 87163, 87690, 87401, 86450, 85237, 84349, 84398, 85460, 86742, 87278, 86991, 86608, 86503, 86190, 85217, 84073, 83769, 84761, 86588, 88394, 89610, 90314, 91082, 92295, 93497, 93761, 92793, 91298, 90129, 89466, 89053, 88826, 88967, 89573, 90546, 91515, 91765, 90662, 88433, 86150, 84689, 84068, 84056, 84901, 86941, 89807, 92548, 94412, 95206, 95125, 94610, 94213, 94274, 94789, 95703, 96999, 98353, 99141, 99093, 98637, 98281, 98061, 97883, 97987, 98561, 99212, 99282, 98549, 97309, 95989, 94986, 94543, 94461, 94242, 93821]
55240I3821j21L71K90k15k55K66M21r8l84J13M82k24j398j671p37M55J031R19
55222I3066M85J42K11P35J367J706J675J404J039O70K66l90j307j931j707r09
55206I6522k73J13P63J550J602O84k47m71n11j075j729j552n84K51M00J56M4K72
55188I5915O58P42J77p13j130p74k50j67m12n92o42m55L23J542K119J292j06n25
55170I7002L04J140R94K83m7J92M28K68m5r4J52L14J64k6J48N99Q29N90K17J85
55150A03597N98J097J119K91j050j876j427j09R75J252R34K44p51j546j385l85
55134A01578L27K6p60j175j125r73q03m93j47J02L11M86N14N38Q63J274J160N21
55116A02224J48L84N84J97m35q57j224j660j718j159m92J5R24K346L044K029L79
$$ y = [93821, 93700, 94071, 94361, 94146, 93891, 94157, 94578, 94480, 94096, 94209, 94691, 94467, 93069, 91398, 90661, 91116, 92147, 93066, 93551, 93693, 93904, 94639, 96006, 97712, 99387, 100791, 101830, 102500, 102766, 102376, 101069, 99138, 97431, 96522, 96249, 96362, 97125, 98675, 100277, 100961, 100714, 100243, 99732, 98657, 96928, 95376, 94792, 95043, 95443, 95599, 95643, 95915, 96573, 97315, 97492, 96779, 95649, 94875, 94625, 94458, 94046, 93454, 92812, 92357, 92680, 94222, 96341, 97633, 97527, 97002, 97306, 98446, 99440, 99723, 99676, 99868, 100296, 100564, 100519, 100425, 100577, 100891, 101055, 101029, 101177, 101776, 102605, 103195, 103412, 103597, 104195, 105292, 106411, 106702, 105652, 103776, 102349, 102240, 103215, 104467, 105401, 105645, 104894, 103348, 101963, 101578, 101905, 101931, 101171, 99996, 98871, 97898, 97095, 96602, 96455, 96557, 96868, 97354, 97868, 98406, 99269, 100543, 101703, 102224, 102372, 102756, 103340, 103537, 103102, 102245, 101021, 99361, 97643, 96484, 95992, 96007, 96931, 99277, 102321, 104350, 104729]
55099A04729O3J326K542K492J546O29R9j39k77n18p91n85K95J067Q15k40j064
55082A11989j133o66J83J272J908J401K69k49L0O7o05j060m53O07Q60j8j227j792
55064A11383j353l33L66J57n76r59p13k95J7M75J098J334Q77K83K33N84O25Q2
55046A13285n36n87qO02O54K51L9K69L45l02j238j499r10k34n8j69j92j73k50
55027A09289k84j14J04J54Q0L3K7k8k01m84p26o76l19o9k49n42l73K25O10M22
55007A06879L6MM83J192J606J203m2j335j679r31J57Q97J255J419J398J240J225
54990A15007J493J762J657J109L97j00j22K28M42P8p14j364j529j267p17OO13
54973A16979P37L74r7l24k73j09k8o2K9M49Q14M25n70r38R2J583K078J557J167
$$ y = [104729, 104792, 106118, 108660, 111152, 112698, 113327, 113426, 113287, 113010, 112492, 111701, 111116, 111411, 112478, 113293, 113053, 111989, 110856, 110190, 110373, 111645, 113553, 114954, 115223, 114974, 115004, 115071, 114466, 113406, 112953, 113560, 114420, 114402, 113175, 111383, 110030, 109697, 110063, 110220, 109644, 108685, 107972, 107677, 107694, 108169, 109267, 110601, 111478, 111761, 111994, 112578, 113203, 113285, 112749, 112162, 112154, 112756, 113410, 113661, 113700, 113969, 114314, 114012, 112774, 111275, 110365, 110131, 110073, 109904, 109712, 109539, 109289, 109005, 108891, 108995, 109149, 109229, 109262, 109289, 109261, 109060, 108576, 107850, 107174, 106855, 106786, 106537, 105995, 105622, 105847, 106457, 106879, 106915, 106919, 107402, 108594, 110200, 111403, 111361, 110026, 108347, 107416, 107573, 108470, 109725, 111144, 112542, 113782, 115007, 116500, 118262, 119919, 121028, 121425, 121325, 121203, 121431, 121873, 121951, 121237, 119873, 118344, 117077, 116360, 116366, 116979, 117716, 118090, 117993, 117669, 117396, 117287, 117259, 117197, 117226, 117675, 118489, 118914, 118344, 117406, 117498, 119081, 121159, 122716, 123883]
54954A23883J289J161M03l54o11o66p69o10j06K16J36J50M85N27j17p89o82%N41
54935A24087P21P31N53J64q0P8L56N06Q52J634K308K292J970K183L009L875M587
54918A49826N398O173O430O154N791N371M396K760J064j81j120k103l251m604
54904A82104o082p080o747n133l524l151l840m411m093l049j816q20l90n76q36
54889A30556m76L57O86P4n16R2J587K434J912J011J044K083L295M251N141N989
54873A59520O451O406O143N855N382M491L069J077j216l110m105m601n375o369
54859A73618o699o014n064m609m461m031l264k508j899j403j166j264j380j196
54845A28660r47j105j641k006j766j018j82L77O14Q29J259J638J401N53j39p5
$$ y = [123883, 125172, 126333, 126736, 126382, 125771, 125105, 124336, 123726, 123620, 123836, 123972, 124122, 124607, 125134, 125017, 124228, 123546, 123546, 124087, 124808, 125539, 126092, 126256, 126176, 126254, 126610, 127116, 127968, 129602, 131910, 134202, 136172, 138355, 141364, 145239, 149826, 155224, 161397, 167827, 173981, 179772, 185143, 189539, 192299, 193363, 193182, 192062, 189959, 186708, 182104, 176022, 168942, 162195, 157062, 153538, 150387, 146547, 142136, 138043, 134994, 133178, 132358, 131968, 131392, 130556, 130080, 130437, 131123, 131197, 130681, 130773, 132360, 134794, 136706, 137717, 138761, 140844, 144139, 148390, 153531, 159520, 165971, 172377, 178520, 184375, 189757, 194248, 197317, 198394, 197178, 194068, 189963, 185362, 179987, 173618, 166919, 160905, 155841, 151232, 146771, 142740, 139476, 136968, 135069, 133666, 132500, 131236, 129856, 128660, 127713, 126608, 124967, 122961, 121195, 120177, 119995, 120372, 120986, 121815, 123074, 124712, 126113, 126666, 126527, 126452]
54829A26452M13O18M21K31K07J41L3J86O27Q64M10o44j710k211j997j372q30o63
54811A21176q16r88q68l36L69P27M92R7K25R08J475J453J080P40M17k2l92m42
54793A25295k53j5K95P28J064J088R11O91K65m96j217j302o21M22J395K104K446
54776A32800K358J984J574J312J248J439J945K786L953N248O221O540O486O630
54762A82524O968O819N826M447L221K049P11n46j484k493m027n775o965p332p166
54747A76777o684n930n070m190l049j636o60o75j074q74k55l13j238j995j906
54732A41228j450j079m06P46J534J341J038J856L447M271L857L442M123N333N801
54717A75082N337M847M823M629L421J279r84k726l881m608m995n176n342n463
$$ y = [126452, 126865, 127483, 127904, 128135, 128342, 128483, 128516, 128702, 129329, 130193, 130603, 129959, 128249, 126038, 124041, 122669, 121839, 121176, 120360, 119372, 118504, 118168, 118537, 119264, 119756, 119853, 120078, 120986, 122461, 123914, 124994, 125734, 126151, 126129, 125737, 125295, 125042, 125027, 125322, 126050, 127114, 128202, 129113, 129804, 130069, 129573, 128356, 127054, 126433, 126855, 128250, 130354, 132800, 135158, 137142, 138716, 140028, 141276, 142715, 144660, 147446, 151399, 156647, 162868, 169408, 175894, 182524, 189492, 196311, 202137, 206584, 209805, 211854, 212565, 212019, 210535, 208042, 204015, 198240, 191275, 183943, 176777, 170093, 164163, 159093, 154903, 151854, 150218, 149558, 148883, 147809, 146935, 146680, 146367, 145129, 143134, 141228, 139778, 138699, 138293, 139039, 140573, 141914, 142952, 144808, 148255, 152526, 156383, 159825, 163948, 169281, 175082, 180419, 185266, 190089, 194718, 198139, 199418, 198434, 195708, 191827, 187219, 182224, 177048, 171706, 166243]
54703A66243n266m665l924l230k439j519r12r73j366j467j277j343j798k050j609
54688A32405p37l8K39K39J11j10l34m08k99j82k67m85m35J80J022J332Q04k6n37
54669A32474p48q82o44L32J459J558L60r96j346p99l38n54j150j458j083k41L77
54652A26321K68k52l56K82J121J465J162N20m8j41L48Q32N31l87p78n7Q93Q97
54634A32621N2o81q85q74p01o9P35Q21q8j131j409r85m70r8K27L94J49m04q27
54615A26377q27m88n6J97K4n73j094q13M56J919K377J404q5o78J9R58R20l7p86
54596A29214o79j96k6j04J1K92M10M29O98J096J008K15p12j108r55o04j90L36
54578A29135P95Q52M99J15nL1o7l76o79o54j93M25P35N60K31J42K13P0k99m29
$$ y = [166243, 160977, 156312, 152388, 149158, 146719, 145200, 144288, 143315, 141949, 140482, 139205, 137862, 136064, 134014, 132405, 131668, 131630, 131869, 132108, 132219, 132109, 131775, 131367, 131068, 130886, 130619, 130134, 129699, 129879, 130901, 132233, 133037, 133011, 132474, 131726, 130844, 130200, 130532, 131991, 133549, 133909, 132913, 131567, 130768, 130430, 129876, 128726, 127268, 126185, 125944, 126321, 126589, 126337, 125981, 126263, 127384, 128849, 130011, 130531, 130483, 130342, 130690, 131522, 132053, 131666, 130888, 130831, 131724, 132621, 132673, 131992, 131107, 130233, 129532, 129463, 130198, 131019, 130931, 129800, 128391, 127406, 126936, 126838, 127065, 127459, 127608, 127204, 126377, 125550, 125062, 125006, 125203, 125227, 124654, 123560, 122747, 123203, 125122, 127499, 128903, 128818, 128140, 128159, 129117, 130037, 130000, 129214, 128535, 128339, 128313, 128209, 128220, 128512, 128922, 129351, 130049, 131145, 132153, 132368, 131656, 130548, 129593, 128989, 128799, 129135, 129930, 130782, 131281, 131396, 131391, 131422, 131355, 130979, 130300, 129646, 129453, 129878, 130613, 131173, 131404, 131546, 131759, 131829, 131530, 131101]
54558A31101q7K69O1n48p97k77O05J148J071N48o9l54P6J130K097K254J655R30
54540A40813L91j91q39r51q0J276K139K083J416N78j44m46k41k4l43q85p60J09
54522A43901P47N47J22J92L98N7n26m92J68O71P54Q87J150R57J46n34n05j10P3
54503A48603N1K5j38n64r36r80r39j103j222r61n51l61j97L93J247J709J516J008
54485A46600M92k2l83k44L83R06Q19L58K15O95J324J390P75K10M32J196J451O61
54467A57258m99r84n60L08J354K577L526L327J747k80j540j719j411j201j143
54452A60760j079j084j330j621j402m40P26J254R40L12j66n69r72r88l42M36N01
54435A54936j77p12m93M1M4o16j248j235p36l69l62l43L3N57P98P49P00O39K82
$$ y = [131101, 131014, 131283, 131344, 130796, 129999, 129722, 130327, 131475, 132546, 133094, 133025, 132671, 132747, 133877, 135974, 138228, 139883, 140813, 141204, 141013, 140174, 139223, 139143, 140419, 142558, 144641, 146057, 146635, 146491, 146045, 145804, 145780, 145437, 144552, 143792, 143901, 144648, 145195, 145317, 145509, 145907, 145964, 145438, 144946, 145114, 145785, 146539, 147426, 148576, 149533, 149679, 149145, 148640, 148530, 148603, 148654, 148679, 148541, 147977, 147041, 146061, 145122, 144019, 142797, 141836, 141285, 140924, 140727, 141120, 142367, 144076, 145592, 146600, 147092, 147070, 146687, 146443, 146826, 147732, 148551, 148909, 149124, 149819, 151143, 152533, 153308, 153518, 153950, 155146, 156597, 157258, 156759, 155775, 155215, 155523, 156877, 159454, 162980, 166307, 168054, 167774, 166234, 164515, 163104, 161903, 160760, 159681, 158597, 157267, 155646, 154244, 153804, 154530, 155784, 156724, 157036, 156870, 156301, 155329, 154341, 153999, 154435, 154936, 154759, 154047, 153554, 153595, 153639, 153023, 151775, 150540, 149804, 149435, 149073, 148730, 148763, 149320, 150118, 150867, 151567, 152206, 152488]
54416A52488k57m35j11J81Nl79n43n34n78o32o35o99o01L10K006L151K487N99
54398A55823o59l57P21J455J599J449J144P54N03N03O22P30P38M05l81j131j216
54381A62702q05p54j306j666j182k69K36J10l15p55j010p68K9Q56J115Q58O56
54364A57732Q20J183J453J489J226P07J48j95k73k53k47k22r1J47L40K91Mk18
54346A64041j39nk94j026j572j287k11J015J758J871J704J681J817J718J189O44
54330A72904O84J287J798J682J034L20j46m50r17j684k326k239j550j229j874
54315A67294k787k885k113j215n30J01L73k96j528k029j294k38K77N31R73J140
54299A55774M46o33j158j049r03q62n42N1L56M9n75j058j127o95J05Q49J176J096
$$ y = [152488, 152231, 151796, 151685, 151866, 151871, 151492, 150949, 150415, 149837, 149205, 148570, 147871, 147270, 147580, 149586, 152737, 155224, 155823, 155164, 154807, 155528, 156983, 158582, 160031, 161175, 161929, 162432, 162935, 163557, 164287, 165025, 165430, 165049, 163918, 162702, 161897, 161143, 159837, 158171, 156989, 156720, 156956, 157066, 156751, 155996, 154986, 154218, 154247, 155103, 156218, 157076, 157732, 158552, 159735, 161188, 162677, 163903, 164610, 164758, 164563, 164290, 164037, 163790, 163568, 163477, 163624, 163964, 164255, 164259, 164041, 163902, 163897, 163603, 162577, 161005, 159718, 159507, 160522, 162280, 164151, 165855, 167536, 169353, 171071, 172260, 172904, 173588, 174875, 176673, 178355, 179389, 179709, 179563, 179113, 178196, 176512, 174186, 171947, 170397, 169168, 167294, 164507, 161622, 159509, 158294, 157764, 157865, 158238, 157942, 156414, 154385, 153091, 152853, 153130, 153661, 154634, 155774, 156220, 155587, 154429, 153380, 152477, 151615, 151073, 151124, 151480, 151529, 150954, 149896, 148769, 148074, 148179, 149028, 150204, 151300]
54281A51300P61K02l86m40L09J218J345O20j51l44r0J99L39L67L57M50P37J109
54263A57902J362J385J126N53j65o04n25j85L4Q0K1k38o40o66R6J223J800J473
54245A64032O78q2o71j027j030p99o56o08l04L46Q28N59m25j510k110k084j657
54228A53480j114n45J8M08M36K84L66O68O04j18q55p82J8P15Q15N04L3n37r58
54209A53440q83m71l72p51r84o28j83l13p34n63L58J224J392J161J083J045N78
54192A54399j59m39j1M94M93K24J71J62k84r18r48k78K46J24m0M45J186J269N88
54173A56724j22l80m03m79n19l76j64q0k16o44j333j843j507j95J242J642P37
54156A52084n04q82k67M32N10K32O5k47j075j772j230L78J512J267M93L38O18
$$ y = [151300, 152061, 152263, 151877, 151437, 151746, 152964, 154309, 154929, 154778, 154434, 154344, 154543, 154882, 155249, 155606, 156056, 156793, 157902, 159264, 160649, 161775, 162328, 162163, 161559, 161034, 160849, 160883, 160963, 160984, 160746, 160106, 159440, 159536, 160759, 162559, 164032, 164710, 164628, 163957, 162930, 161900, 161101, 160445, 159837, 159533, 159879, 160707, 161266, 160841, 159331, 157221, 155137, 153480, 152366, 151821, 151839, 152247, 152683, 152967, 153333, 154001, 154605, 154487, 153632, 152850, 152868, 153583, 154398, 154902, 154935, 154398, 153440, 152557, 152086, 151714, 150963, 149979, 149351, 149168, 148855, 148121, 147558, 147916, 149140, 150532, 151693, 152776, 153821, 154399, 154240, 153801, 153790, 154284, 154777, 155001, 155172, 155334, 155050, 154132, 153184, 152906, 153152, 153276, 153236, 153681, 154867, 156136, 156724, 156602, 156222, 155819, 155340, 154821, 154445, 154281, 154201, 153985, 153341, 152008, 150165, 148658, 148463, 149705, 151347, 152084, 151580, 150698, 150431, 150863, 151373, 151605, 151670, 151423, 150348, 148576, 147346, 147724, 149236, 150503, 150996, 151334, 151952]
54139A51952M73j03m39l66k43q0L85R31J045P53N23M72M20M85Q05Q84J96p60j012
54120A56321o86p57j248r99L73J621J616Q58M47M69L47P0O8L46N90Q60J273J384
54102A62953O92l71q50n90l58o24r60q79n74m71n18l30J32M86L89q1m96m52J62
54083A57260J084J893K260K101J545Q48K53j27l01k91o7L89R97J553J813J684
54067A72894J356J143J082R31N47J74Q3J79K12K08L10M10K77Ro8J07L51O42J092
54048A81939J520J595J408J419J774K144K394K774L325L685L833M413N808P369
54034B25400Q105P903P520P573P986Q432Q829R366J0270J1550J2873J3725J3857
54021C53389J3400J2383J0430P132K632k383p055j0515j2089j1845j0896j0590
$$ y = [151952, 152425, 152322, 151883, 151517, 151274, 151194, 151579, 152510, 153555, 154308, 154831, 155303, 155723, 156208, 157013, 157897, 158093, 157333, 156321, 155635, 154878, 153630, 152631, 153004, 154625, 156241, 157099, 157546, 158015, 158362, 158432, 158500, 158846, 159436, 160296, 161569, 162953, 163645, 163274, 162424, 161834, 161476, 160852, 159892, 159013, 158439, 157968, 157450, 157120, 157252, 157738, 158127, 158046, 157550, 157098, 157260, 158344, 160237, 162497, 164598, 166143, 166991, 167244, 167117, 166816, 166525, 166458, 166847, 167844, 169397, 171210, 172894, 174250, 175393, 176475, 177406, 177953, 178127, 178210, 178389, 178601, 178809, 179119, 179529, 179806, 179815, 179747, 179854, 180205, 180847, 181939, 183459, 185054, 186462, 187881, 189655, 191799, 194193, 196967, 200292, 203977, 207810, 212223, 218031, 225400, 233505, 241408, 248928, 256501, 264487, 272919, 281748, 291114, 301384, 312934, 325807, 339532, 353389, 366789, 379172, 389602, 396734, 399366, 396983, 389928, 379413, 367324, 355479, 344583, 333993]
54009C33993j1235j1879j1573j0457r469r085q825q052o876n907n313m614l531
53996B27177k502k022j887j578j134j050j463j973k258k308k067j472q65p60j036
53981B02802j071q05r39j690k172j611n13P8K2n2R0J04m1P1M26L90l26j056r32
53962A92775J03J354K186K502K505K327J876J098K77p5K22P16Q64P15P49J136
53946B11330J568J867K298L043L693L714L199K758K696K643K184J537J308J737
53932B45575K501L246L895M322M132L197K163J920K556L299L598L747M152M454
53918B92757L991K972K559L545N301O448O419N960O033O590O804O235N298M523
53904C65435L861K950J721M17p21j441j523j222j349k406l759m330l978l578l729
$$ y = [333993, 322758, 310879, 299306, 288849, 279380, 270295, 261470, 253418, 246542, 240635, 235322, 230708, 227177, 224675, 222653, 220766, 219188, 218054, 217004, 215541, 213568, 211310, 209002, 206935, 205463, 204598, 203838, 202802, 201731, 200926, 199987, 198297, 196125, 194514, 194001, 194079, 194101, 194049, 194139, 194243, 194202, 194273, 194699, 195089, 194763, 193707, 192775, 192878, 194232, 196418, 198920, 201425, 203752, 205628, 206726, 207003, 206928, 207150, 207866, 208730, 209445, 210194, 211330, 212898, 214765, 217063, 220106, 223799, 227513, 230712, 233470, 236166, 238809, 240993, 242530, 243838, 245575, 248076, 251322, 255217, 259539, 263671, 266868, 269031, 270951, 273507, 276806, 280404, 284151, 288303, 292757, 296748, 299720, 302279, 305824, 311125, 317573, 323992, 329952, 335985, 342575, 349379, 355614, 360912, 365435, 369296, 372246, 373967, 374384, 373663, 372222, 370699, 369477, 368128, 365722, 361963, 357633, 353655, 350077, 346348]
53889C46348m128m352m563n005n352n031m024k923k274k083j846j084O7Q75R22
53874C05547Q00J411K608L209K520J232M88O39J275J989K607L003L187L297L156
53859C36968K039o94m790r102j2252j3306j2279j0265q693q076p741o908n623
53846B39278m440l649l222l078k988k560j739j024q02q04o39m81p64j429j998
53831B09661k134j759r28j6L52N4j41M79J483J797J076No69q00n94k82n7P0L55
53812B07952R67J665K171K588L040L193K736K103K083K751L464L793L875L880
53798B46261L787L739M024M549M850M759M526M194L482K360J296O27K49Q3L56
53783B89142J050J525J137n5j465k666l549m000l866l267k728k779l436m178m447
$$ y = [346348, 342220, 337868, 333305, 328300, 322948, 317917, 313893, 310970, 308696, 306613, 304767, 303683, 303750, 304625, 305547, 306347, 307758, 310366, 313575, 316095, 317327, 317815, 318454, 319729, 321718, 324325, 327328, 330515, 333812, 336968, 339007, 338313, 333523, 324421, 312169, 298863, 286584, 276319, 267626, 259550, 251809, 244901, 239278, 234838, 231189, 227967, 224889, 221901, 219341, 217602, 216578, 215776, 214972, 214333, 213852, 213088, 211659, 209661, 207527, 205768, 204840, 204824, 205176, 205230, 205089, 205568, 207051, 208848, 209924, 209929, 209260, 208460, 207866, 207584, 207527, 207597, 207952, 208919, 210584, 212755, 215343, 218383, 221576, 224312, 226415, 228498, 231249, 234713, 238506, 242381, 246261, 250048, 253787, 257811, 262360, 267210, 271969, 276495, 280689, 284171, 286531, 287827, 288454, 288703, 288786, 289142, 290192, 291717, 292854, 292799, 291334, 288668, 285119, 281119, 277253, 273986, 271258, 268479, 265043, 260865, 256418]
53768B56418m144l545k892k302k010k219k641k654k216k068k635l156k594j067
53754B20275K36M84r6q45j385j658j710j672j623j501j288j111r51n63n3k5o65
53737B05849j120o02L28N14K4M3R77J801J652J010P56R57J213J458J748J756J218
53720B19582N82N15R54J151O55j60n57j96N65J051R44N79M53O09Q18J148J779
53703B30472K377K335J752J498J974K499K330J737J552K080K885L439L480K985
53689B63395K191J566J404J523J534J267Q07L20p3l70p69j317j579j059o3M49
53673B69226J09l46j82K72K56j83l04J24L99j62j288k029j793r25k72k17l67k29
53655B62089Pk56j088j903k195j930j167RR98Q88l54j495j407l96L99N62O26J008
$$ y = [256418, 252274, 248729, 245837, 243535, 241525, 239306, 236665, 234011, 231795, 229727, 227092, 223936, 221342, 220275, 220511, 220995, 220899, 220054, 218669, 217011, 215301, 213629, 212006, 210505, 209217, 208106, 207155, 206592, 206539, 206514, 205849, 204729, 204127, 204455, 204969, 204993, 205036, 206013, 207814, 209466, 210476, 211232, 212189, 213402, 214860, 216608, 218364, 219582, 220164, 220679, 221633, 222784, 223439, 223279, 222722, 222526, 223091, 224142, 225086, 225665, 226118, 226727, 227545, 228693, 230472, 232849, 235184, 236936, 238434, 240408, 242907, 245237, 246974, 248526, 250606, 253491, 256930, 260410, 263395, 265586, 267152, 268556, 270079, 271613, 272880, 273687, 274007, 273934, 273564, 272795, 271478, 269899, 268840, 268777, 269226, 269335, 268989, 268807, 269079, 269335, 269152, 268848, 268972, 269371, 269209, 267921, 265892, 264099, 263174, 262902, 262685, 262318, 262089, 262096, 261840, 260752, 258849, 256654, 254724, 253557, 253566, 254564, 255452, 255098, 253603, 252196, 251800, 252199, 252761, 253387, 254395]
53637B54395J453J592J378R23L48q0l8M22Q63R84R50J092J513K072K611L016L191
53620B76685L106K880K729K815L127L529L882M098M109L897L604L403L238K886
53606C23988K402K197K409K585K297J753J285O76l41j153q09N18J523J401O99
53591C41430K22k9m07q28j061j252j549j670j383j071j241j760k040j789j131
53576C24441k74N85J117J077N02l69j151j222j43J599K745K631J903J589J895
53561C36925K299K283J582J96j347k262k483k748l264l119j769k78K4m98l63P89
53545C25967J909K340K609L200L713L680L310K983K775K879L827N657P413Q037
53531C80299P559O986P216Q251R353R807R688R840J0901J2456J3458J3479J3078
$$ y = [254395, 255848, 257440, 258818, 259741, 260089, 260009, 259971, 260393, 261256, 262240, 263190, 264282, 265795, 267867, 270478, 273494, 276685, 279791, 282671, 285400, 288215, 291342, 294871, 298753, 302851, 306960, 310857, 314461, 317864, 321102, 323988, 326390, 328587, 330996, 333581, 335878, 337631, 338916, 339592, 339251, 338098, 337289, 337807, 339330, 340731, 341430, 341652, 341623, 341216, 340388, 339327, 338075, 336526, 334856, 333473, 332402, 331161, 329401, 327361, 325572, 324441, 324167, 324752, 325869, 326946, 327448, 327079, 325928, 324706, 324563, 326162, 328907, 331538, 333441, 335030, 336925, 339224, 341507, 343089, 343285, 341938, 339676, 337193, 334445, 331181, 328062, 326293, 326015, 326039, 325541, 325178, 325967, 327876, 330216, 332825, 336025, 339738, 343418, 346728, 349711, 352486, 355365, 359192, 364849, 372262, 380299, 387858, 394844, 402060, 410311, 419664, 429471, 439159, 448999, 459900, 472356, 485814, 499293, 512371]
53518E12371J3036J3661J4844J6290J7575J8384J8883J9504K0313K0955K1255
53507G07071K1517K2117K3061K4013K4432K3898K2608K1472K1193K1387K1124
53496I53893K0263J9521J9190J8667J7516J6285J5780J6038J6463J6597J6344
53485A146557J5796J5245J5107J5381J5457J4777J3586J2650J2309J2100J1212
53474A300177R222O417L558J268m63k129m095o306q501j0465j2084j3477j5022
53461A248100j6909j8615j9272j8704j7791j7615j8494j9976k1387k2209k2238
53450A034890k1676k0985k0446j9981j9396j8563j7342j5727j4129j3119j2665
53439H40861j2023j0663q918p418o175m704k822q71Q21K220L334M069M528N185
$$ y = [512371, 525407, 539068, 553912, 570202, 587777, 606161, 625044, 644548, 664861, 685816, 707071, 728588, 750705, 773766, 797779, 822211, 846109, 868717, 890189, 911382, 932769, 953893, 974156, 993677, 1012867, 1031534, 1049050, 1065335, 1081115, 1097153, 1113616, 1130213, 1146557, 1162353, 1177598, 1192705, 1208086, 1223543, 1238320, 1251906, 1264556, 1276865, 1288965, 1300177, 1309399, 1315816, 1319374, 1320642, 1320179, 1318050, 1313955, 1307649, 1299148, 1288683, 1276599, 1263122, 1248100, 1231191, 1212576, 1193304, 1174600, 1156809, 1139194, 1120700, 1100724, 1079337, 1057128, 1034890, 1013214, 992229, 971783, 951802, 932406, 913843, 896501, 880774, 866645, 853526, 840861, 828838, 818175, 809257, 801839, 795664, 790960, 788138, 787267, 788088, 790308, 793642, 797711, 802239, 807424]
53425H07424O466Q228R931J1297J2564J4029J5536J6780J7897J9326K1050K2427
53413I82955K3088K3553K4606K6385K8432L0415L2246L3743L4773L5657L6968
53402A312821L8882M1107M3331M5364M6984M8211M9512N1148N2446N2477N1454
53391A833737N0612N0623N0973N1098N1161N1196N0356M7853M4172M0597L7820
53380B360198L5551L3233L0503K7150K3181J8895J4585J0194N553P05m241r331
53368B546176j4598j9905k5285l1004l6997m2568m7085n0652n3612n5742n6558
53357B112170n6260n5724n5531n5478n5001n3716n1603m9108m6996m5729m5026
53346A541998m4358m3694m3251m2756m1611l9830l8034l6420l4455l1886k9354
$$ y = [807424, 813890, 822118, 832049, 843346, 855910, 869939, 885475, 902255, 920152, 939478, 960528, 982955, 1006043, 1029596, 1054202, 1080587, 1109019, 1139434, 1171680, 1205423, 1240196, 1275853, 1312821, 1351703, 1392810, 1436141, 1481505, 1528489, 1576700, 1626212, 1677360, 1729806, 1782283, 1833737, 1884349, 1934972, 1985945, 2037043, 2088204, 2139400, 2189756, 2237609, 2281781, 2322378, 2360198, 2395749, 2428982, 2459485, 2486635, 2509816, 2528711, 2543296, 2553490, 2559043, 2559748, 2555507, 2546176, 2531578, 2511673, 2486388, 2455384, 2418387, 2375819, 2328734, 2278082, 2224470, 2168728, 2112170, 2055910, 2000186, 1944655, 1889177, 1834176, 1780460, 1728857, 1679749, 1632753, 1587024, 1541998, 1497640, 1453946, 1410695, 1367939, 1326328, 1286498, 1248464, 1212044, 1177589, 1145703, 1116349]
53335A116349k7490k5910k3788k1094j8607j6738j5005j2852j0514q773q055q047
53323I19476q039p553o623n604m703l765k639j620j185j202q09N91K506M016N051
53308H87898O346Q111R532R974J0040J0818J2464J4207J5545J6751J8221J9939
53296A039846K1710K3361K4650K5402K5890K6609K7575K8275K8380K7992K7065
53285A326755K5235K2547J9749J7460J5408J3031J0444Q249O504M459J425k442
53273A468824o262r213j1116j2389j3470j4469j5429j6744j8862k1646k4474k6954
53261A277796k9028l0424l0695l0052k9441k9385k9389k8967k8578k8885k9587
53250I53365k9796k9246k8419k7627k6784k5874k5063k4297k3435k2640k2087
$$ y = [1116349, 1088859, 1062949, 1039161, 1018067, 999460, 982722, 967717, 954865, 944351, 935578, 927523, 919476, 911437, 903884, 897261, 891657, 886954, 883189, 880550, 878930, 877745, 876543, 875734, 876325, 878831, 882847, 887898, 894244, 902355, 911887, 921861, 931901, 942719, 955183, 969390, 984935, 1001686, 1019907, 1039846, 1061556, 1084917, 1109567, 1134969, 1160859, 1187468, 1215043, 1243318, 1271698, 1299690, 1326755, 1351990, 1374537, 1394286, 1411746, 1427154, 1440185, 1450629, 1458878, 1465382, 1469841, 1471266, 1468824, 1462562, 1453349, 1442233, 1429844, 1416374, 1401905, 1386476, 1369732, 1350870, 1329224, 1304750, 1277796, 1248768, 1218344, 1187649, 1157597, 1128156, 1098771, 1069382, 1040415, 1011837, 982952, 953365, 923569, 894323, 865904, 838277, 811493, 785619, 760556, 736259, 712824, 690184, 668097]
53239F68097k1415k0153j8567j7328j6377j4970j2982j1277j0408r776q659p411
53227D98774o930p230p401o920o353o515p343p964p768p137o933p436q100q315
53213C96429q056p558o731n404l970l243l546m399n133n458n399n088m799m808
53199C22837m998m908m312l504k852k416k148k150k441k750k836k807k906l144
53185B78665l327l285k897k108j132m19j94k44l28n43j000j439j531j374j302
53170B57542j314j173r34q91r94q13k35L11N08N52O27M37k54r65j006m84j88n03
53152B50223r52j027r15j078j476j683j552j361j357j461j464j267r38o44n14
53137B32534m64k67J11L97L94K91L47N12O84J071J807K376K060R30j18m75l98
$$ y = [668097, 646682, 626529, 607962, 590634, 574257, 559287, 546305, 535028, 524620, 514844, 506185, 498774, 491844, 484614, 477213, 470293, 463940, 457425, 450082, 442118, 434350, 427213, 420280, 412844, 404744, 396429, 388373, 380815, 374084, 368680, 364710, 361467, 357921, 353522, 348389, 342931, 337532, 332444, 327645, 322837, 317839, 312931, 308619, 305115, 302263, 299847, 297699, 295549, 293108, 290358, 287522, 284715, 281809, 278665, 275338, 272053, 269156, 267048, 265916, 265497, 265303, 265059, 264731, 264188, 263188, 261749, 260218, 258844, 257542, 256228, 255055, 254121, 253230, 252236, 251423, 251188, 251499, 252007, 252559, 253186, 253623, 253369, 252404, 251398, 250914, 250726, 250223, 249271, 248244, 247329, 246251, 244775, 243092, 241540, 240179, 238822, 237361, 235897, 234630, 233692, 233048, 232534, 232070, 231803, 231914, 232311, 232705, 232996, 233343, 233855, 234539, 235610, 237417, 239793, 241853, 242783, 242665, 242190, 241792]
53120B41792l37k69k0K59L73M59O67P75M95o2n96j114j752k341k528k248j715
53103B31838j070m43k06p08j671k299k101j366p24m70m11k26J57M74M42J04k48
53086B21072m89p72j098j103n56J82M91K02k66l69J11R07J381J086L68J43P32
53069B22022J361J196M84P3Q6j08o88r62m14M88Q90N34j57p18r98j039r24p39
53051B20387n61m00j55K94Q15R37L37n20p20j18K93k12r31o67M44J067N29l99
53033B20420q41j004j454j982j876j052k39n5l41m39L8P59R55K59q22j404j154
53016B09768m38K98Q19Q98L06p01j391j261m76M57J077R90J13r59j283o18K86
52999B07885O97O84O31N42L19K57O25J051R24K53l86o52o52m65NO08Q46M11m05
$$ y = [241792, 241455, 241186, 241166, 241425, 241798, 242257, 242924, 243699, 244194, 244132, 243536, 242422, 240670, 238329, 235801, 233553, 231838, 230768, 230325, 230119, 229411, 227740, 225441, 223340, 221974, 221250, 220780, 220369, 220143, 220300, 220774, 221216, 221320, 221072, 220583, 219811, 218713, 217610, 217054, 217236, 217727, 217929, 217663, 217294, 217405, 218312, 219693, 220779, 221147, 221290, 222022, 223383, 224579, 225063, 225136, 225222, 225114, 224426, 223464, 223050, 223538, 224428, 224962, 224805, 224087, 223089, 222050, 221126, 220387, 219826, 219426, 219271, 219565, 220380, 221317, 221654, 221134, 220414, 220296, 220589, 220377, 219446, 218779, 219223, 220290, 220819, 220420, 219579, 218575, 217121, 215139, 213263, 212211, 211972, 211917, 211576, 211137, 211175, 211934, 212889, 213148, 212326, 210922, 209768, 209330, 209628, 210447, 211345, 211651, 210950, 209559, 208298, 207822, 208279, 209356, 210346, 210459, 209500, 208217, 207599, 207885, 208582, 209266, 209897, 210439, 210758, 211015, 211640, 212691, 213615, 213868, 213482, 212830, 212178, 211713, 211718, 212326, 213172, 213583, 213178]
52980B13178r32o41M33J639K228K111J960K268K555J951N22o16n65L63J200J416
52964B29070J241J055R79R75J047J129R57K76p99j779k237k164j839j509j322
52949B25080j418j814k213k168j547o56N1K82n4p80j375j339p69l43m98q53p00
52932B08886J01R33J111N72j38m57l63k79m18m55n2N19O90L85M9j51n19j059j232
52913B08123p85k72k15k41K54R50R53J95l20R0P85O62m63j700k153j684p08L22
52895B03793J066J290J028P05P70J172J453J404J260J123O68j92q04o14j40l10
52879B13672r97j168n79k28p47j289p61O52J911K490K523K121J490J354K224L377
52863B26045L494K339J068P47J274J831J793J021j35r99j187j103j346j762j712
$$ y = [213178, 212246, 211605, 212038, 213677, 215905, 218016, 219976, 222244, 224799, 226750, 227272, 226656, 226091, 226454, 227654, 229070, 230311, 231366, 232345, 233320, 234367, 235496, 236453, 236729, 235930, 234151, 231914, 229750, 227911, 226402, 225080, 223662, 221848, 219635, 217467, 215920, 215264, 215315, 215597, 215543, 214763, 213388, 212049, 211280, 210937, 210439, 209586, 208886, 208987, 209920, 211031, 211603, 211465, 211008, 210645, 210366, 209948, 209493, 209441, 209960, 210650, 211035, 211084, 210933, 210414, 209355, 208123, 207338, 207066, 206851, 206610, 206864, 207814, 208767, 208962, 208642, 208732, 209517, 210179, 209716, 208016, 205863, 204179, 203471, 203793, 204859, 206149, 207177, 207882, 208652, 209824, 211277, 212681, 213941, 215064, 215732, 215540, 214736, 214122, 213982, 213672, 212675, 211507, 210928, 210700, 209953, 208664, 207903, 208555, 210466, 212956, 215479, 217600, 219090, 220444, 222668, 226045, 229539, 231878, 232946, 233693, 234967, 236798, 238591, 239612, 239477, 238478, 237291, 236188, 234842, 233080, 231368]
52848B31368j195r48j342k016k627l195l484l028k062j556j724j549m28N89K23
52833B07026j053j637j019j97j8j89j13L22J014J851K358J896O33l94o16o31j099
52816B08134j598j318l46N48J124J767K475K691K347K221K850L659L649K566Q79
52801B31648r59k727m034m427l923l080k410k026j828j697j444q98k17J69N8k87
52785B01918m76l56j6L30L68m7n33m44K91R44Q92M08K15M65O82N50L05K78M47
52766B06221N25K38m40j188j469j085n22m21p39p89j34Q73J543J477P58j59o06
52749B04083j78P19J160P60J65J67O81R56O48J56m7O6L03N45O91O40N09O37J114
52730B13775J595J794J879K067K037J298N6q62j040r53j190j615j743j582j529
$$ y = [231368, 230173, 229225, 227883, 225867, 223240, 220045, 216561, 213533, 211471, 209915, 208191, 206642, 206214, 206803, 207026, 205973, 204336, 203317, 203120, 203102, 202913, 202800, 203122, 204136, 205987, 208345, 210241, 210874, 210480, 209864, 209233, 208134, 206536, 205218, 204872, 205420, 206544, 208311, 210786, 213477, 215824, 218045, 220895, 224554, 228203, 230769, 231648, 230689, 227962, 223928, 219501, 215578, 212498, 210088, 208062, 206234, 204537, 203093, 202195, 201978, 202147, 202205, 201918, 201442, 201086, 201070, 201400, 201768, 201721, 201188, 200744, 201035, 201979, 202871, 203279, 203494, 203959, 204641, 205191, 205496, 205774, 206221, 206746, 206984, 206544, 205356, 203887, 202802, 202280, 201859, 201120, 200331, 200197, 201070, 202613, 204090, 204848, 204689, 204083, 203905, 204624, 205784, 206544, 206709, 206876, 207557, 208513, 209161, 209317, 209270, 209336, 209639, 210184, 210875, 211515, 212024, 212661, 213775, 215370, 217164, 219043, 221110, 223147, 224445, 224501, 223639, 222599, 221646, 220456, 218841, 217098, 215516, 213987]
52715B13987j655j624j296r40p07m40q2R0j34n68r03j017q84m66J31O44R20R91
52697B06047P80J59n63p17j04O92J151J479J938K080J360J76n27n68n72p55n42
52680B11514L19J078R55K60n1L31P60N32l20j123j216n39L14O54M26K79P98J806
52662B16777K557K540J952J342J002P35K13n14r80p78lR03J638K160K428K222
52646B34194J378Q7j100j621j349p83o11j005j532j788j917k176k333j905q99
52631B16640J18O88R09J132J566K190K791L029K720K045J355P25K5p31j383j866
52615B31953k095j800r35j37j63q03r90j80R57J476J220N98j46r47j513j460q10
52598B24225L8P00R79Q46N36M54P57J086R91M81o5l43l39j59J36O10J307J950
$$ y = [213987, 212332, 210708, 209412, 208472, 207765, 207325, 207243, 207333, 207199, 206631, 205728, 204711, 203827, 203361, 203492, 204136, 205056, 206047, 206827, 206986, 206423, 205706, 205602, 206294, 207445, 208924, 210862, 212942, 214302, 214478, 213951, 213383, 212811, 212056, 211514, 211833, 212911, 213866, 214126, 214075, 214406, 215166, 215698, 215378, 214255, 213039, 212500, 212814, 213468, 213894, 214173, 214971, 216777, 219334, 221874, 223826, 225168, 226170, 226905, 227118, 226604, 225624, 224846, 224843, 225746, 227384, 229544, 231972, 234194, 235572, 235659, 234559, 232938, 231589, 230806, 230195, 229190, 227658, 225870, 223953, 221777, 219444, 217539, 216640, 216758, 217446, 218355, 219487, 221053, 223243, 226034, 229063, 231783, 233828, 235183, 235908, 235933, 235202, 233819, 231953, 229858, 228058, 227123, 226986, 226823, 226020, 225030, 224850, 225807, 227283, 228503, 229101, 228955, 228008, 226495, 225035, 224225, 224263, 224963, 225942, 226788, 227324, 227778, 228535, 229621, 230612, 231093, 231028, 230685, 230346, 230187, 230323, 230933, 232240, 234190]
52580B34190J937J018q2l04L59Q21M32j24M6O71P88J39o50j036j036q92q80j297
52562B34100k013k247j459l38l9n72p63K7J049J310P43j29r49j433j179k28O43
52545B26523P81M64K99K13k21q01q45l14K6l27r63j237j013m77L03J231J899J895
52527B27436J248L19n73j203j355j003m39N0N28J119J557J406P93M63R55J952
52511B33253K651K586J959J322J079J229J457J494J384J284J088N24l93j267j784
52496B47866j949j807j334p87o63r75j051n06rl81j232j308j90J180J780J571
52480B40205J110P17M76M96P84J166J609K218K704K448J498Q40J137J722J551
52465B60681P39K94N87R88J018R43J028R65M30l71j052j571j997k163j953j684
$$ y = [234190, 236127, 237145, 237063, 236759, 237118, 237939, 238371, 238247, 238293, 238964, 239752, 239891, 239241, 238205, 237169, 236277, 235397, 234100, 232087, 229840, 228381, 228043, 228004, 227432, 226669, 226696, 227745, 229055, 229798, 229669, 228720, 227287, 226108, 225880, 226523, 227304, 227768, 228067, 228280, 228059, 227258, 226413, 226099, 226125, 225798, 224835, 223598, 222585, 222108, 222411, 223642, 225541, 227436, 228684, 229003, 228430, 227227, 225872, 224869, 224430, 224480, 225008, 226127, 227684, 229090, 229883, 230346, 231301, 233253, 235904, 238490, 240449, 241771, 242850, 244079, 245536, 247030, 248414, 249698, 250786, 251310, 250917, 249650, 247866, 245917, 244110, 242776, 241989, 241326, 240351, 239300, 238794, 238785, 238404, 237172, 235864, 235674, 236854, 238634, 240205, 241315, 242032, 242508, 243004, 243788, 244954, 246563, 248781, 251485, 253933, 255431, 256271, 257408, 259130, 260681, 261420, 261714, 262301, 263289, 264307, 265250, 266278, 267243, 267673, 267302, 266250, 264679, 262682, 260519, 258566, 256882]
52449B56882j792k261k647k662k457k314k238j956j289n23k27o08j136j097m65
52434B33210J23L24N60J215J797J370j59j696k064j243k19J54m9k47j14K38O82
52417B33882J257J848K059J656R70O03Q54J588K553L554M395M970N435O064O852
52402B78540P464P518O789N215K971M92j862m073o083p295p015n487l880l029
52388B70265k696k349k066k088k020j235O3R88J134Q79M99j70q94o90R49K992
52372B63561L870L295K392K122K336K509K558K544K210J458Q56R79J428J232K13
52357B93563p21q07l49j10k85n55p32q63q28m37J48N36O76R21J389J709J582J313
52339B96150J451K089K760L067L099L256L730M292M590M644M958N934P261Q158
$$ y = [256882, 255090, 252829, 250182, 247520, 245063, 242749, 240511, 238555, 237266, 236743, 236516, 235908, 234772, 233675, 233210, 233333, 233657, 234217, 235432, 237229, 238599, 238440, 236744, 234680, 233437, 233218, 233372, 233323, 233076, 232962, 233200, 233882, 235139, 236987, 239046, 240702, 241672, 242275, 243129, 244717, 247270, 250824, 255219, 260189, 265624, 271688, 278540, 286004, 293522, 300311, 305526, 308497, 308989, 307127, 303054, 296971, 289676, 282661, 277174, 273294, 270265, 267569, 265220, 263154, 261066, 259046, 257811, 257874, 258862, 259996, 260875, 261374, 261204, 260310, 259620, 260569, 263561, 267431, 270726, 273118, 275240, 277576, 280085, 282643, 285187, 287397, 288855, 289711, 290690, 292118, 293350, 293563, 292842, 292035, 291686, 291576, 291291, 290736, 290004, 289141, 288313, 287876, 288024, 288560, 289236, 290157, 291546, 293255, 294837, 296150, 297601, 299690, 302450, 305517, 308616, 311872, 315602, 319894, 324484, 329128, 334086, 340020, 347281, 355439]
52325C55439Q280Q101Q245Q706R046R157R354R741R929R546Q722P885P287O986
52311D76424P065P563Q253Q778R014R087R166R327R560R647R247Q406P767P831
52297E97135Q095P622O445N614N606N487M262K327P64k96j546l058m025m070l778
52282F26584l626l349k738k241k210k190j610o99n2K59N47Q13R55J363K540M188
52266F18534N384N764N889O344O991P392P501P592P836Q155Q452Q702Q833Q685
52252G22054Q180P576P410P915Q495Q154O598M565K873J533J62j247k461l509
52238G78298m393m570l598k200j815k887m368n152n275n334n410n246n002n115
52224G17933n508n540m772l466k244j537j355j349j050k08R97K109K787L011K993
$$ y = [355439, 363719, 371820, 380065, 388771, 397817, 406974, 416328, 426069, 435998, 445544, 454266, 462151, 469438, 476424, 483489, 491052, 499305, 508083, 517097, 526184, 535350, 544677, 554237, 563884, 573131, 581537, 589304, 597135, 605230, 612852, 619297, 624911, 630517, 636004, 640266, 642593, 643357, 643061, 641515, 638457, 634432, 630362, 626584, 622958, 619609, 616871, 614630, 612420, 610230, 608620, 607921, 607869, 608128, 608675, 609488, 610443, 611806, 614346, 618534, 623918, 629682, 635571, 641915, 648906, 656298, 663799, 671391, 679227, 687382, 695834, 704536, 713369, 722054, 730234, 737810, 745220, 753135, 761630, 769784, 776382, 780947, 783820, 785353, 785515, 784268, 781807, 778298, 773905, 769335, 765737, 763537, 761722, 758835, 754467, 749315, 744040, 738706, 733296, 728050, 723048, 717933, 712425, 706885, 702113, 698647, 696403, 694866, 693511, 692162, 691112, 690904, 691901, 694010, 696797, 699808, 702801]
52209G02801K926K861K789K819L081L430L407K753J805J214J259J677K054K247
52195G37123K346K536K958L585M214M617M618M047K911J734J284J623J799R79
52181G76374m56j534k094k852m132n386o009n971n515m845m287m131m146l825
52167G21191l195k718k350j488r4J004J338J483K040K689K959L166L758M300L925
52152G38008K547Q19p87k078k623k004n93O86J389J825K335K839L094K935K228
52137G50620J060j00q22j162j374j347q26O7J059K268L924N701P072Q222R861
52122G84223J2094J4152J5414J6080J6597J7050J7310J7367J7173J6569J5583
52111I59612J4479J3409J2279J1035R729Q310O755N381M598M297L935L297K714
$$ y = [702801, 705727, 708588, 711377, 714196, 717277, 720707, 724114, 726867, 728672, 729886, 731145, 732822, 734876, 737123, 739469, 742005, 744963, 748548, 752762, 757379, 761997, 766044, 768955, 770689, 771973, 773596, 775395, 776374, 775918, 774384, 772290, 769438, 765306, 759920, 753911, 747940, 742425, 737580, 733293, 729162, 725016, 721191, 717996, 715278, 712928, 711440, 711346, 712350, 713688, 715171, 717211, 719900, 722859, 726025, 729783, 734083, 738008, 740555, 741374, 740587, 738509, 735886, 733882, 733289, 733975, 735364, 737189, 739524, 742363, 745457, 748392, 750620, 751680, 751580, 750758, 749596, 748222, 746875, 746049, 746116, 747175, 749443, 753367, 759068, 766140, 774362, 784223, 796317, 810469, 825883, 841963, 858560, 875610, 892920, 910287, 927460, 944029, 959612, 974091, 987500, 999779, 1010814, 1020543, 1028853, 1035608, 1040989, 1045587, 1049884, 1053819, 1057116, 1059830]
52098A059830K494K655L155L871M308L981L081K141R18j447m971q366j0533j1709
52084A049408j2627j3250j3076j2097j0634q656o117l652k150j635j378j017q52
52071I62267r96r46k49Q87J955K801L661M711N761O357O251N769N590N999O558
52056A016376O625N981M834L540K639K680L514M036L226J359l90j409k175l322
52042A047514m867o442p713q361q131p240o372n974n814n429m745m005l386l034
52028I66001l250m228n617o608o619n794m844m422m643n138n458n421n084m615
52014H94260m166l815l437k856k186j833k073k788l845n338p213r004j0332j1508
52000H23866j2992j4545j5490j5800j6100j6536j6409j5322j3933j3042j2405
$$ y = [1059830, 1062324, 1064979, 1068134, 1072005, 1076313, 1080294, 1083375, 1085516, 1086434, 1084987, 1080016, 1071650, 1061117, 1049408, 1036781, 1023531, 1010455, 998358, 987724, 979068, 972951, 969299, 967149, 965514, 964136, 963119, 962267, 961271, 960325, 960076, 960963, 962918, 965719, 969380, 974091, 979852, 986209, 992460, 998229, 1003819, 1009818, 1016376, 1023001, 1028982, 1033816, 1037356, 1039995, 1042675, 1046189, 1050225, 1053451, 1054810, 1054420, 1053011, 1050836, 1047514, 1042647, 1036205, 1028492, 1020131, 1012000, 1004760, 998388, 992414, 986600, 981171, 976426, 972421, 969035, 966001, 962751, 958523, 952906, 946298, 939679, 933885, 929041, 924619, 919976, 914838, 909380, 903959, 898875, 894260, 890094, 886279, 882842, 879986, 877800, 875967, 873894, 871106, 867261, 861923, 854710, 845706, 835374, 823866, 810874, 796329, 780839, 765039, 748939, 732403, 715994, 700672, 686739, 673697, 661292]
51989F61292j1158r105p004n665n312n735o615p511p988p914p622p670q460r849
51975E53684j1024j1068r908q530p893p777p112n316k886o59J044K441L825N339
$$ y = [661292, 650134, 641029, 634025, 628360, 623048, 617313, 610698, 603187, 595199, 587285, 579663, 571993, 563533, 553684, 542660, 531592, 521684, 513154, 505261, 497484, 490372, 485056, 482170, 481511, 482555, 484996, 488821, 494160]
$$ [...]
##END NTUPLES=NMR SPECTRUM
##END=
