
##TITLE=UV1130_M4-1010-1000_6275044_VrdjKuWxyS
##JCAMPDX= 6.0         $$ Bruker NMR JCAMP-DX V2.0
##DATA TYPE= NMR SPECTRUM
##DATA CLASS= NTUPLES
##ORIGIN= BRUKER
##OWNER= Administrator
$$ 1.72 TOPSPIN		Version 2.1
$$ 2012-06-03 03:31:08.078 -0500  Administrator@TOPSPIN
$$ Compression mode = diff/dup
##.OBSERVE FREQUENCY= 400.13188235
##.OBSERVE NUCLEUS= ^1H
##.ACQUISITION MODE= SIMULTANEOUS (DQD)
##.ACQUISITION SCHEME= undefined
##.AVERAGES= 64
##.DIGITISER RES= 22
##SPECTROMETER/DATA SYSTEM= spect
##.PULSE SEQUENCE= noesygpps1d.comp
##.SOLVENT NAME= COFFEE_meoh
##.SHIFT REFERENCE= INTERNAL, COFFEE_meoh, 1, 14.96683
##AUDIT TRAIL= $$ (NUMBER, WHEN, WHO, WHERE, PROCESS, VERSION, WHAT)
$$ ##TITLE= Audit trail, TOPSPIN		Version 2.1
$$ ##JCAMPDX= 5.01
$$ ##ORIGIN= Bruker BioSpin GmbH
$$ ##OWNER= Administrator
$$ $$ C:\Bruker\TOPSPIN/data/COFFEE/nmr/UV1130_M4-1010-1000_6275044_VrdjKuWxyS/12/pdata/1/auditp.txt
$$ ##AUDIT TRAIL=  $$ (NUMBER, WHEN, WHO, WHERE, PROCESS, VERSION, WHAT)
(   1,<2012-06-03 03:31:03.031 -0500>,<Administrator>,<TOPSPIN>,<go>,<TOPSPIN 2.1>,
      <created by zg
	started at 2012-06-03 03:19:32.734 -0500,
	POWCHK enabled, PULCHK disabled,
       configuration hash MD5:
       D5 CA 7A 23 FE 6B EE E2 50 67 74 61 24 F7 5E 3B
       data hash MD5: 64K
       A5 0D FD E4 1E E7 5E DF EB E0 C5 00 D6 36 F5 A0>)
(   2,<2012-06-03 03:31:05.828 -0500>,<Administrator>,<TOPSPIN>,<proc1d>,<TOPSPIN 2.1>,
      <Start of raw data processing
       efp LB = 0.3 FT_mod = 6 PKNL = 1 PHC0 = 0 PHC1 = 0 SI = 128K 
       data hash MD5: 128K
       E5 61 56 22 4F 54 40 7F 2A 29 7D 3B 47 C2 A1 A6>)
(   3,<2012-06-03 03:31:07.000 -0500>,<Administrator>,<TOPSPIN>,<proc1d>,<TOPSPIN 2.1>,
      <pk PHC0 = 31.80542 PHC1 = 0 
       data hash MD5: 128K
       5C 0D ED 9D BA C8 E6 04 C3 FC 10 BF 9D 2B 77 25>)
(   4,<2012-06-03 03:31:07.718 -0500>,<Administrator>,<TOPSPIN>,<proc1d>,<TOPSPIN 2.1>,
      <abs ABSG = 1 
       data hash MD5: 128K
       C2 0E 8C 1E DA 96 8E BA B9 C1 BB 2D 43 50 F6 C6>)
(   5,<2012-06-03 03:31:07.796 -0500>,<Administrator>,<TOPSPIN>,<proc1d>,<TOPSPIN 2.1>,
      <abs ABSG = 2 
       data hash MD5: 128K
       14 E8 67 36 B1 95 CF 17 FF 33 06 C4 55 D2 C2 38>)
(   6,<2012-06-03 03:31:07.859 -0500>,<Administrator>,<TOPSPIN>,<proc1d>,<TOPSPIN 2.1>,
      <abs ABSG = 3 
       data hash MD5: 128K
       C2 CE AC 75 D7 6D 7B 36 B6 41 D9 39 6C 7B 2D F2>)
(   7,<2012-06-03 03:31:07.921 -0500>,<Administrator>,<TOPSPIN>,<proc1d>,<TOPSPIN 2.1>,
      <abs ABSG = 4 
       data hash MD5: 128K
       08 06 48 A9 79 72 46 6D 00 F7 6D 02 54 5A 40 90>)
(   8,<2012-06-03 03:31:07.984 -0500>,<Administrator>,<TOPSPIN>,<proc1d>,<TOPSPIN 2.1>,
      <abs ABSG = 5 
       data hash MD5: 128K
       19 A1 F5 3F 13 22 C8 9D 11 2D 87 91 43 DC 45 07>)
$$ ##END=
$$ 
$$ $$ hash MD5
$$ $$ A8 58 14 22 54 8D 08 0A 4C EB 73 5D 49 41 74 3E
##$RELAX= 
##$RELAX= 
##$RELAX= 
##$RELAX= 
##$RELAX= 
##$RELAX= 
##$RELAX= 
##$RELAX= 
$$ Bruker specific parameters
$$ [...]
##$TP07= 0
##$TPNAME0= <>
##$TPNAME1= <>
##$TPNAME2= <>
##$TPNAME3= <>
##$TPNAME4= <>
##$TPNAME5= <>
##$TPNAME6= <>
##$TPNAME7= <>
##$TPOAL= (0..7)
0.5 0.5 0.5 0.5 0.5 0.5 0.5 0.5
##$TPOFFS= (0..7)
0 0 0 0 0 0 0 0
##$TUNHIN= 0
##$TUNHOUT= 0
##$TUNXOUT= 0
##$USERA1= <user>
##$USERA2= <user>
##$USERA3= <user>
##$USERA4= <user>
##$USERA5= <user>
##$V9= 5
##$VALIST= <valist>
##$VCLIST= <CCCCCCCCCCCCCCC>
##$VD= 0
##$VDLIST= <DDDDDDDDDDDDDDD>
##$VPLIST= <PPPPPPPPPPPPPPP>
##$VTLIST= <TTTTTTTTTTTTTTT>
##$WBST= 2048
##$WBSW= 25
##$XGAIN= (0..3)
0 0 0 0
##$XL= 0
##$YL= 0
##$YMAX_a= 10863430
##$YMIN_a= -6586658
##$ZGOPTNS= <>
##$ZL1= 120
##$ZL2= 120
##$ZL3= 120
##$ZL4= 120
##$ABSF1= 14.96683
##$ABSF2= -5.5857
##$ABSG= 5
##$ABSL= 3
##$ALPHA= 0
##$AQORDER= 0
##$ASSFAC= 0
##$ASSFACI= 0
##$ASSFACX= 0
##$ASSWID= 0
##$AUNMP= <proc_prof1d_extract.lims>
##$AXLEFT= 0
##$AXNAME= <>
##$AXNUC= <1H>
##$AXRIGHT= 0
##$AXTYPE= 0
##$AXUNIT= <>
##$AZFE= 0.1
##$AZFW= 0.1
##$BCFW= 0
##$BC_mod= 0
##$BYTORDP= 0
##$COROFFS= 0
##$CY= 15
##$DATMOD= 1
##$DC= 0
##$DFILT= <>
##$DTYPP= 0
##$F1P= 0
##$F2P= 0
##$FCOR= 0.5
##$FTSIZE= 131072
##$FT_mod= 6
##$GAMMA= 0
##$GB= 0
##$INTBC= 1
##$INTSCL= 1
##$ISEN= 128
##$LB= 0.3
##$LEV0= 0
##$LPBIN= 0
##$MAXI= 10000
##$MC2= 0
##$MEAN= 0
##$ME_mod= 0
##$MI= 0
##$NCOEF= 0
##$NC_proc= -3
##$NLEV= 6
##$NOISF1= 0
##$NOISF2= 0
##$NSP= 0
##$NTH_PI= 0
##$NZP= 0
##$OFFSET= 14.96683
##$PC= 1
##$PHC0= 31.80542
##$PHC1= 0
##$PH_mod= 1
##$PKNL= yes
##$PPARMOD= 0
##$PPDIAG= 0
##$PPIPTYP= 0
##$PPMPNUM= 2147483647
##$PPRESOL= 1
##$PSCAL= 4
##$PSIGN= 0
##$PYNMP= <proc.py>
##$REVERSE= no
##$SF= 400.13000551355
##$SI= 131072
##$SIGF1= 0
##$SIGF2= 0
##$SINO= 400
##$SIOLD= 131072
##$SPECTYP= <>
##$SREGLST= <1H.CDCl3>
##$SSB= 0
##$STSI= 131072
##$STSR= 0
##$SW_p= 8223.68421052632
##$SYMM= 0
##$S_DEV= 0
##$TDeff= 65536
##$TDoff= 0
##$TI= <>
##$TILT= no
##$TM1= 0
##$TM2= 0
##$TOPLEV= 0
##$USERP1= <user>
##$USERP2= <user>
##$USERP3= <user>
##$USERP4= <user>
##$USERP5= <user>
##$WDW= 1
##$XDIM= 131072
##$YMAX_p= 530023041
##$YMIN_p= -467892931
##$CURPLOT= <Network HP LaserJet P1505>
##$CURPRIN= <$Network HP LaserJet P1505>
##$DFORMAT= <normdp>
##$LAYOUT= <+/1D_H.xwp>
##$LFORMAT= <normlp>
##$PFORMAT= <normpl>
##$SURQMSG= 1
$$ End of Bruker specific parameters
$$ ---------------------------------
##NTUPLES= NMR SPECTRUM
##VAR_NAME=  FREQUENCY,     SPECTRUM/REAL,   SPECTRUM/IMAG
##SYMBOL=    X,             R,               I
##VAR_TYPE=  INDEPENDENT,   DEPENDENT,       DEPENDENT
##VAR_FORM=  AFFN,          ASDF,            ASDF
##VAR_DIM=   131072,        131072,          131072
##UNITS=     HZ,            ARBITRARY UNITS, ARBITRARY UNITS
##FACTOR=    0.0627417313425165, 1,          1
##FIRST=     8223.62146879498, 12761,        -107757
##LAST=      0,             15397,           -105896
##MIN=       0,             -467892931,      0
##MAX=       8223.62146879498, 530023041,    0
$$ Real data points
##PAGE= N=1
##DATA TABLE= (X++(R..R)), XYDATA
$$ [...]
63502A104224J3382J4431J6463J9123K1259K2553K3517K4380K5196K6726K9810
63491A341064L3912L7618M0665M4145M8394N2170N4648N6787N9437O0975N8257
63480A888072M9613L6044J9930L849r681j8793k3292k4545k4233k3528k3202k3619
63468A826615k4695k6566l0111l5854m2528m7928n1238n3472n5469n6752n6739
63457A345263n5662n3655n0267m5728m1440l8162l4768l0117k5184k1853k0285
63446I28142j9098j7623j6355j5386j4110j2566j1428j0507q885o821n829o241
63434G83293o370n096l651l593m265l828k014k41N04M79J90l2M01J802L192L147
63418G63918J788Q40J399K780L763L875K966P84k235m637n350m888m471m447m274
$$ plain form
63502 1104224 1117606 1132037 1148500 1167623 1188882 1211435 1234952 1259332 1284528 1311254 1341064
63491 1341064 1374976 1412594 1453259 1497404 1545798 1597968 1652616 1709403 1768840 1829815 1888072
63480 1888072 1937685 1973729 1993659 1997508 1987827 1969034 1945742 1921197 1896964 1873436 1850234 1826615
63468 1826615 1801920 1775354 1745243 1709389 1666861 1618933 1567695 1514223 1458754 1402002 1345263
63457 1345263 1289601 1235946 1185679 1139951 1098511 1060349 1025581 995464 970280 948427 928142
63446 928142 909044 891421 875066 859680 845570 833004 821576 811069 802184 795363 789534 783293
63434 783293 776923 771827 768176 764583 760318 756490 754476 754235 754739 755218 755408 755376 755777 757579 760771 763918
63418 763918 765706 766546 767945 770725 774488 778363 781329 782113 779878 775241 769891 765003 760532 756085 751811
63403G51811l631k698j536m0J521K522K735K718L344N009P298R367J0726J1569
63389H00715J2212J2548J2614J3303J5528J8688K1053K1903K2229K2974K3850
63378I97617K4537K5737K8056L0898L3606L6723M0876M5256M8398M9705M9003
63367A410412M5764M0430L5478L3029L2139L0626K8974K9753L3462L7784M1352
63356A799203M5285N0156N4284N6304N6707N5215M9350L7948K4132J2162K779
63345B243525n958j4415k0776k4110k5545k6479k7608k9619l3020l7327m1878
63334A956790m7098n3285n8647o0583n8946n6125n3827n1567m8450m4594m0283
63323A383385l5536l0986k7615k5040k1523j6386j0957o475k459K000O536J0118
$$ plain form
63403 751811 748180 745482 743946 743906 745427 747949 750684 753402 756746 761755 769053 778420 789146 800715
63389 800715 812927 825475 838089 851392 866920 885608 906661 928564 950793 973767 997617
63378 997617 1022154 1047891 1075947 1106845 1140451 1177174 1218050 1263306 1311704 1361409 1410412
63367 1410412 1456176 1496606 1532084 1565113 1597252 1627878 1656852 1686605 1720067 1757851 1799203
63356 1799203 1844488 1894644 1948928 2005232 2061939 2117154 2166504 2204452 2228584 2240746 2243525
63345 2243525 2237567 2223152 2202376 2178266 2152721 2126242 2098634 2069015 2035995 1998668 1956790
63334 1956790 1909692 1856407 1797760 1737177 1678231 1622106 1568279 1516712 1468262 1423668 1383385
63323 1383385 1347849 1316863 1289248 1264208 1242685 1226299 1215342 1208867 1206408 1208408 1214944 1225062
63311A225062J2504J4210J5729J7534K0103K3364K6669K9739L2963L6471L9713
63300A494061M2429M5128M8063N0604N2255N3498N4996N6515N7175N6090N2367
63289B063181M5237L4915K2837J0617o87j0107j6679k0540k3174k5722k7732k8546
63277B023600k9123l1348l5866m1581m7055n1435n4203n5161n4910n4412n3746
63266A514760n1935m8410m4060m0158l6576l1907k5534j8756j3317r472o671n786
63254A182178q849j5741k2892k6877k8206k9527l0908k9684k5214k0766j9163
63243I24351j8816j6345j1752q375q114r135q798p018n685n940p134q033q092
63230H01114p605p156p150p631q408r265j0029j0327r467o942l317l70K64j192
$$ plain form
63311 1225062 1237566 1251776 1267505 1285039 1305142 1328506 1355175 1384914 1417877 1454348 1494061
63300 1494061 1536490 1581618 1629681 1680285 1732540 1786038 1841034 1897549 1954724 2010814 2063181
63289 2063181 2108418 2143333 2166170 2176787 2176100 2165993 2149314 2128774 2105600 2079878 2052146 2023600
63277 2023600 1994477 1963129 1927263 1885682 1838627 1787192 1732989 1677828 1622918 1568506 1514760
63266 1514760 1462825 1414415 1370355 1330197 1293621 1261714 1236180 1217424 1204107 1194635 1187964 1182178
63254 1182178 1173329 1157588 1134696 1107819 1079613 1050086 1019178 989494 964280 943514 924351
63243 924351 905535 889190 877438 869063 860949 851814 843016 835998 830313 824373 817239 809206 801114
63230 801114 793509 786353 779203 771572 763164 753899 743870 733543 724076 717134 713817 713447 713711 712519
63216G12519k715k617j226r2r2q60j657j957j462l52N80Q03Q94J693K858L325
63200G09642L148L689N686Q172R732R942R176P927O858O750P863R755J1983J4346
63186H24669J6375J7439J7763J8413J9873K1404K2293K2965K4336K6630K9245
63175A061405L1266L1951L1410L0860L1439L2698L3308L3210L3708L5091L5863
63164A422209L4939L3152L1744L0871L0564L1561L3622L4466L2264K8291K5246
63153A768929K3591K1403J7417J2227O488p0p376j4288j9825k4098k7460k9704
63141A727234l0611l0538k9788k7978k4603k0010j5439j2070j0039q383o024k970
63129A508781k39J560L143N709R560J3895J7706K0395K1848K2298K2044K1218
$$ plain form
63216 712519 709804 707187 705961 705869 705777 704917 703260 701303 699841 699489 700069 700872 701766 703459 706317 709642
63200 709642 712790 716479 722165 730337 740069 750011 759187 767114 773972 780722 788585 798340 810323 824669
63186 824669 841044 858483 876246 894659 914532 935936 958229 981194 1005530 1032160 1061405
63175 1061405 1092671 1124622 1156032 1186892 1218331 1251029 1284337 1317547 1351255 1386346 1422209
63164 1422209 1457148 1490300 1522044 1552915 1583479 1615040 1648662 1683128 1715392 1743683 1768929
63153 1768929 1792520 1813923 1831340 1843567 1850055 1849985 1842609 1828321 1808496 1784398 1756938 1727234
63141 1727234 1696623 1666085 1636297 1608319 1583716 1563706 1548267 1536197 1526158 1517775 1511751 1508781
63129 1508781 1508542 1510102 1513245 1518954 1528514 1542409 1560115 1580510 1602358 1624656 1646700 1667918
63117A667918K0100J9623K0743K2981K4447K3881K2033K0420J9289J7513J4036
63106A892984Q831K805k834p536j2010j7327k3311k8710l3068l7142m1085m3764
63094A657833m4734m5204m5823m5070m1564l6726l3192l1438k9929k7835k5485
63083A250833k2631j8648j4434j2016j1857j2286j1877j0716r097o702l701j086
63071A115782O62K055L382M399N521P674J0500J2267J2370J2247J2912J3159J1562
63058A224492Q922P102O305N293L890L478M729O171N782L377P67l22l3J65n28
63043A279590j268q64N13J512J190k56k059l406l574k503j205o73m58O47K532
63028A269718L694L535L322M256N774O673O820O790O697O581P281R490J2241J3629
$$ plain form
63117 1667918 1688018 1707641 1728384 1751365 1775812 1799693 1821726 1842146 1861435 1878948 1892984
63106 1892984 1901815 1904620 1901786 1894250 1882240 1864913 1841602 1812892 1779824 1742682 1701597 1657833
63094 1657833 1613099 1567895 1522072 1477002 1435438 1398712 1365520 1334082 1304153 1276318 1250833
63083 1250833 1228202 1209554 1195120 1183104 1171247 1158961 1147084 1136368 1127271 1120569 1116868 1115782
63071 1115782 1116444 1118499 1121881 1126280 1131801 1139475 1149975 1162242 1174612 1186859 1199771 1212930 1224492
63058 1224492 1233414 1240516 1246821 1252114 1256004 1259482 1264211 1270382 1276164 1279541 1280308 1279986 1279953 1280118 1279590
63043 1279590 1278322 1277458 1277971 1279483 1280673 1280417 1278358 1274952 1271378 1268875 1267670 1266997 1266539 1267186 1269718
63028 1269718 1273412 1276947 1280269 1284525 1290299 1296972 1303792 1310582 1317279 1323860 1331141 1340631 1352872 1366501
63014A366501J3180J2486J3207J5311J7650J9527K1027K2248K3105K3978K5872
63003A574092K9388L3781L7681M0698M3676M7190N0621N3295N5773N9080O3086
62992B088361O6759O9829P2979P6282P8711P9742Q0287Q1294Q2224Q1944Q0570
62981B938982P9304P8604P7611P5602P3147P1309P0162O8772O6296O2415N6649
62970C718853M8137L6686K3554J0364k496j5710k9354m2358n3754o3480p1624
62959C558818p7810q1852q4100q4606q2781p8543p2854o6378n8639m9435l9967
62948B781853l1337k2995j4130n654J114O940J3727K1392K7842L2125L5399L8436
62936B884712M0411M0879M0999M1702M2237M1652M0268L8572L5909L1579K6207
$$ plain form
63014 1366501 1379681 1392167 1405374 1420685 1438335 1457862 1478889 1501137 1524242 1548220 1574092
63003 1574092 1603480 1637261 1674942 1715640 1759316 1806506 1857127 1910422 1966195 2025275 2088361
62992 2088361 2155120 2224949 2297928 2374210 2452921 2532663 2612950 2694244 2776468 2858412 2938982
62981 2938982 3018286 3096890 3174501 3250103 3323250 3394559 3464721 3533493 3599789 3662204 3718853
62970 3718853 3766990 3803676 3827230 3837594 3835098 3819388 3790034 3747676 3693922 3630442 3558818
62959 3558818 3481008 3399156 3315056 3230450 3147669 3069126 2996272 2929894 2871255 2821820 2781853
62948 2781853 2750516 2727521 2713391 2707737 2708851 2715791 2729518 2750910 2778752 2810877 2846276 2884712
62936 2884712 2925123 2966002 3007001 3048703 3090940 3132592 3172860 3211432 3247341 3278920 3305127
62925C305127K0770J5096Q332K22r106j9814l1654m3240n3122o1198o8168p4136
62913B989109p8736q2136q4712q5999q5024q1851p7924p4673p2139o9234o5100
62902B131581o0174n5806n2647m9771m6057m2195m0118m0240m0516l8926l5873
62891A629258l3324l2389l2602l2897l2389l0720k8438k6602k5403k3891k1606
62880A308997j9652j9027j8842j7522j5287j3858j3803j3609j1821q984o864o412
62868A143316p027p466p012n907m923m626m951n394n354m532l373k985l986n508
62854A070272o144n803n571n685n092l534k525l190m495n003n153o058p030o437
62840I98552m544l267l030k188j97R38k95k192j986K67J934J652R77J683K914
$$ plain form
62925 3305127 3325897 3340993 3349325 3349547 3340441 3320627 3288973 3245733 3192611 3131413 3063245 2989109
62913 2989109 2910373 2828237 2743525 2657526 2572502 2490651 2412727 2338054 2265915 2196681 2131581
62902 2131581 2071407 2015601 1962954 1913183 1867126 1824931 1784813 1744573 1704057 1665131 1629258
62891 1629258 1595934 1563545 1530943 1498046 1465657 1434937 1406499 1379897 1354494 1330603 1308997
62880 1308997 1289345 1270318 1251476 1233954 1218667 1204809 1191006 1177397 1165576 1156592 1149728 1143316
62868 1143316 1136289 1128823 1121811 1115904 1110981 1106355 1101404 1096010 1090656 1086124 1082751 1079766 1075780 1070272
62854 1070272 1064128 1058325 1052754 1047069 1041977 1038443 1035918 1032728 1028233 1023230 1018077 1012019 1004989 998552
62840 998552 994008 990741 987711 985523 985326 986264 985969 983777 981791 982058 983992 985644 986621 988304 991218
62825I91218K370l13k753k751j042k22j360k826k650r62N69Q89J19j425l530n322
62809I70009n522l971k106j341j493j378n38K43M0j097k201k322j428m33k56p14
62793I45492p72rN97l0j248j126J015L400L802K220N56k3j97q50j588j670j410
62776I48159j605k107j992r39M19J353J495Q00j17m7J405K791K561J548K156M893
62760I60773P425P748O700O391P389Q732R769J0558J0960J0581R641R024R376
62747A075067J0604J2046J2910J2891J2723J3619J5797J8218K0037K1551K3276
62736A248739K4981K6371K7907L0105L2662L5102L7693M0966M4885M9216N4076
62725A652703N9390O4543O9349P4535Q0465Q6372R1909R8128J05413J11566J14086
$$ plain form
62825 991218 993588 993275 990522 987771 986729 986507 985147 982321 979671 978709 979278 980167 980286 978861 975331 970009
62809 970009 964487 960516 958410 957069 955576 954198 953660 953903 953943 952846 950645 948323 946895 946462 946206 945492
62793 945492 944720 944711 945308 945278 944030 942904 943919 947319 951121 953341 953897 953874 953677 952827 951239 949569 948159
62776 948159 946554 944447 942455 941516 941935 943288 944783 945583 945466 945419 946824 949615 952176 953724 955880 960773
62760 960773 968198 975946 982646 989037 996426 1005158 1014927 1025485 1036445 1047026 1056667 1065691 1075067
62747 1075067 1085671 1097717 1110627 1123518 1136241 1149860 1165657 1183875 1203912 1225463 1248739
62736 1248739 1273720 1300091 1327998 1358103 1390765 1425867 1463560 1504526 1549411 1598627 1652703
62725 1652703 1712093 1776636 1845985 1920520 2000985 2087357 2179266 2277394 2382807 2494373 2608459
62714B608459J13605J12755J11824J08017R9453Q7598P4829O1473M6428K9264
62704C453705J0435r509k9665m8437o4554p7925q8837r7069j02607j06435j09506
62693B729596j11388j10972j08203j04214r9954r5564r1044q6583q2064p7008
62683A762602p1286o5394n9698n3862m7455m0920l5474l1904k9632k7271k4042
62672A275664k0442j7321j4699j1945q963o491m969l697j690J025L561N476P187
62659A202696Q940J0159J0422J0599J2114J5165J8513K1236K3819K7066L0781
62648A391510L4368L8060M2424M7100N1286N5357O0599O7053P3023P7324Q0770
62637B018874Q4633Q8657R1625R3100R3535R3185R1842Q9218Q4789P7691O7585
$$ plain form
62714 2608459 2722064 2834819 2946643 3054660 3154113 3241711 3316540 3378013 3424441 3453705
62704 3453705 3464140 3454631 3424966 3376529 3311975 3234050 3145213 3048144 2945537 2839102 2729596
62693 2729596 2618208 2507236 2399033 2294819 2194865 2099301 2008257 1921674 1839610 1762602
62683 1762602 1691316 1625922 1566224 1512362 1464907 1423987 1388513 1356609 1326977 1299706 1275664
62672 1275664 1255222 1237901 1223202 1211257 1202294 1195803 1190834 1187137 1185447 1186472 1190033 1195509 1202696
62659 1202696 1211636 1221795 1232217 1242816 1254930 1270095 1288608 1309844 1333663 1360729 1391510
62648 1391510 1425878 1463938 1506362 1553462 1604748 1660105 1720704 1787757 1860780 1938104 2018874
62637 2018874 2103507 2192164 2283789 2376889 2470424 2563609 2655451 2744669 2829458 2907149 2974734
62626B974734N5210M1373K5943Q665r605k7448m4099n9198p1958q1848q9631r6287
62614B625851j01153j02639j00772r7576r4660r1840q8446q4625q0702p6337p1130
62603A635971o5371n9603n4073m9082m5225m2667m0613l7899l3989k9245k4718
62592A153486k1626k0403k0113j9356j7820j6378j5600j5009j3948j2517j1288
62581I69428j0688j0620j0234q253m520j032j64j621k561j222Q68J163o22k472
62567I17450k539o36K037L690L029N65j537j737p42j32jR24L240O232R052J1395
62551I50290J2908J3148J2502J2219J3169J5136J7584K0252K2701K4147K4504
62540A138560K4984K6908L0198L3700L6804L9937M3507M7180N0501N3501N6104
$$ plain form
62626 2974734 3029944 3071317 3097260 3105925 3096320 3068872 3024773 2965575 2893617 2811769 2722138 2625851
62614 2625851 2524698 2422059 2321287 2223711 2129051 2037211 1948765 1864140 1783438 1707101 1635971
62603 1635971 1570600 1510997 1456924 1407842 1362617 1319950 1279337 1241438 1207449 1178204 1153486
62592 1153486 1131860 1111457 1091344 1071988 1054168 1037790 1022190 1007181 993233 980716 969428
62581 969428 958740 948120 937886 929633 925113 924081 923917 922296 919735 918513 919381 920544 919922 917450
62567 917450 914911 914275 916312 920002 923031 923596 922059 920322 919580 919448 919447 920371 923611 929843 938895 950290
62551 950290 963198 976346 988848 1001067 1014236 1029372 1046956 1067208 1089909 1114056 1138560
62540 1138560 1163544 1190452 1220650 1254350 1291154 1331091 1374598 1421778 1472279 1525780 1581884
62529A581884N7359N6052N2027M6304L9833L2712K4714J6004O957k122j0731j8203
62517A882790k4564l0803l7503m3646m7627m9141m9191m8468m7073m5646m5214
62506A413914m5335m3888l9768l4729l1307k9662k7876k4892k1572j8812j6190
62495A079883j3057r835p504o444o433p095p658o910m384j335L98M64K52R88K424
62480A013754L561L895L581L128L344M885P140Q293P428O143O886R956J3351J5567
62466A110912J7173J9179K1258K2571K3410K4942K7802L1829L6691M1841M6304
62455A423912M9501N2117N5184N8526O1075O2652O4269O6418O8068O7805O5284
62444B094811O1102N5903N0103M4053L7852L1271K4246J7387J1613P449M986M516
$$ plain form
62529 1581884 1639243 1695295 1747322 1793626 1833459 1866171 1890885 1906889 1913846 1911724 1900993 1882790
62517 1882790 1858226 1827423 1789920 1746274 1698647 1649506 1600315 1551847 1504774 1459128 1413914
62506 1413914 1368579 1324691 1284923 1250194 1218887 1189225 1161349 1136457 1114885 1096073 1079883
62495 1079883 1066826 1056991 1049487 1043043 1036610 1029515 1021857 1014947 1010563 1009228 1009626 1010090 1010342 1011330 1013754
62480 1013754 1017315 1021210 1024791 1027919 1031263 1036148 1043288 1051581 1059009 1065152 1072038 1081994 1095345 1110912
62466 1110912 1128085 1147264 1168522 1191093 1214503 1239445 1267247 1299076 1335767 1377608 1423912
62455 1423912 1473413 1525530 1580714 1639240 1700315 1762967 1827236 1893654 1961722 2029527 2094811
62444 2094811 2155913 2211816 2261919 2305972 2343824 2375095 2399341 2416728 2428341 2435790 2440776 2445292
62432B445292O730J1898J8960K5913L1603L6926M3734N2595O2209P0950P8213
62421B885023Q4084Q8865R3404R8577J03146J02973R4000P6248N3950L2029J3109
62410C725408k900j8114l5604n7053q0550j01723j17617j28640j36408j41159
62400B905640j42245j40004j35689j29970j22609j13638j03930r4381q5109p5661
62390A762404o5862n6327m8125m1731l6475l1310k6011k1162j6963j2850q523
62379A397065m600j776J14J689L007L554L050J769R2j967m653p966j1327j3956
62365A364095j5702j7159j8615j9401j8918j7913j7663j8041j7562j5664j3672
62354A173785j2959j3118j2920j2192j1737j1777j1591j0681r420q466p979p643
$$ plain form
62432 2445292 2452022 2463920 2482880 2508793 2540396 2577322 2621056 2673651 2735860 2806810 2885023
62421 2885023 2969107 3057972 3151376 3249953 3353099 3456072 3550072 3626320 3680270 3712299 3725408
62410 3725408 3722508 3704394 3668790 3611737 3531187 3429464 3311847 3183207 3046799 2905640
62400 2905640 2763395 2623391 2487702 2357732 2235123 2121485 2017555 1923174 1838065 1762404
62390 1762404 1696542 1640215 1592090 1550359 1513884 1482574 1456563 1435401 1418438 1405588 1397065
62379 1397065 1392465 1390689 1390803 1392492 1395499 1399053 1402103 1403872 1403964 1401997 1397344 1389378 1378051 1364095
62365 1364095 1348393 1331234 1312619 1293218 1274300 1256387 1238724 1220683 1203121 1187457 1173785
62354 1173785 1160826 1147708 1134788 1122596 1110859 1099082 1087491 1076810 1067390 1058924 1050945 1043302
62342A043302o994n747l978k142p31J20O92J526L071N173O879P149N965M462L861
62327A062608M592O390Q653J0506J1247J1126J1178J1904J2640J2769J2981J4510
62315A191104J7342K0042K1463K1944K2631K4094K6040K8013K9945L1978L4175
62304A468771L6653L9814M4026M9039N3993N8328O2435O7174P2833P8847Q4398
62293B116311Q8945R2252R4105R4048R1139Q4198P2700N7542M0803K4701J0615
62282B867359j358j2158k2630l2421m0414m6519n2204n8532o4327o7245o6414
62271B403137o3166n9377n5903n2526m8572m3706l8718l5165l3611l2675l0837
62260A908881k8589k7693k8689l0593l2682l4958l6908l7569l7106l6655l6288
$$ plain form
62342 1043302 1036308 1030561 1026583 1024441 1023710 1023830 1024522 1026048 1029119 1034292 1041171 1048320 1054285 1058747 1062608
62327 1062608 1067200 1073590 1082243 1092749 1103996 1115122 1126300 1138204 1150844 1163613 1176594 1191104
62315 1191104 1208446 1228488 1249951 1271895 1294526 1318620 1344660 1372673 1402618 1434596 1468771
62304 1468771 1505424 1545238 1589264 1638303 1692296 1750624 1813059 1880233 1953066 2031913 2116311
62293 2116311 2205256 2297508 2391613 2485661 2576800 2660998 2733698 2791240 2832043 2856744 2867359
62282 2867359 2866001 2853843 2831213 2798792 2758378 2711859 2659655 2601123 2536796 2469551 2403137
62271 2403137 2339971 2280594 2224691 2172165 2123593 2079887 2041169 2006004 1972393 1939718 1908881
62260 1908881 1880292 1852599 1823910 1793317 1760635 1725677 1688769 1651200 1614094 1577439 1541151
62249A541151l4732l1723k8845k7257k6113k4287k2141k0391j8575j6128j3908
62238A277051j3096j3168j2441j0283p564n197l340j867n99Q18K601M402N695
62225A223012O345O543O577P029Q439J0370J1607J1915J2695J5025J7935J9667
62213A357159J9993K0136K0955K2404K4398K6963K9575L1477L2745L4290L6782
62202A656877M0215M4381M9208N4731O1132O8446P5816Q1744Q5855Q9697R4558
62191B402660R9045J00126R6431Q9171P9834O8481N4933M0298K6199J2947n37
62180C069588j5003k9615m2658n3266o2208p0817p9377q6839r2042r4634r4737
62169B348392r2433q8071q2481p6278o9316o1507n3861m7936m4130m1107l7162
$$ plain form
62249 1541151 1506419 1474696 1445851 1418594 1392481 1368194 1346053 1325662 1307087 1290959 1277051
62238 1277051 1263955 1250787 1238346 1228063 1220499 1215302 1211962 1210095 1209496 1210314 1212915 1217317 1223012
62225 1223012 1229357 1235900 1242477 1249506 1257945 1268315 1279922 1291837 1304532 1319557 1337492 1357159
62213 1357159 1377152 1397288 1418243 1440647 1465045 1492008 1521583 1553060 1585805 1620095 1656877
62202 1656877 1697092 1741473 1790681 1845412 1906544 1974990 2050806 2132550 2218405 2308102 2402660
62191 2402660 2501705 2601831 2698262 2787433 2867267 2935748 2990681 3030979 3057178 3070125 3069588
62180 3069588 3054585 3024970 2982312 2929046 2866838 2796021 2716644 2629805 2537763 2443129 2348392
62169 2348392 2255959 2167888 2085407 2009129 1939813 1878306 1824445 1776509 1732379 1691272 1654110
62158A654110l1977k6928k3608k2087k0877j8748j6107j4039j2463j0377p676
62147A449223n404m014k746j222j76J86J193L831O977Q901R709J0810J2478J3505
62133A503251J3229J2498J2398J2988J3652J4012J4230J4653J5288J5608J5261
62122A657068J4992J6094J8521K0498K0628J9564J8714J8276J7644J7149J7992
62111A857140K0564K3871K6674K8632L0629L4324M0760M8735N5392N9214O1523
62100B287458O3992O5751O4476N9445N1749M2011L0096J7046N251l995j1664j9215
62088B652401k6879l4329m1602m8507n4007n7307n9006o0361o1586o1514n8948
62077B088355n3989m7893m1888l6425l1613k7793k5059k2594j9557j6605j5231
$$ plain form
62158 1654110 1622133 1595205 1571597 1549510 1528633 1509885 1493778 1479739 1467276 1456899 1449223
62147 1449223 1443819 1439805 1437059 1435837 1435661 1435847 1437040 1440871 1447848 1456749 1466458 1477268 1489746 1503251
62133 1503251 1516480 1528978 1541376 1554364 1568016 1582028 1596258 1610911 1626199 1641807 1657068
62122 1657068 1672060 1688154 1706675 1727173 1747801 1767365 1786079 1804355 1821999 1839148 1857140
62111 1857140 1877704 1901575 1928249 1956881 1987510 2021834 2062594 2111329 2166721 2225935 2287458
62100 2287458 2351450 2417201 2481677 2541122 2592871 2634882 2664978 2682024 2687275 2683280 2671616 2652401
62088 2652401 2625522 2591193 2549591 2501084 2447077 2389770 2330764 2270403 2208817 2147303 2088355
62077 2088355 2034366 1986473 1944585 1908160 1876547 1848754 1823695 1801101 1781544 1764939 1749708
62066A749708j5379j5133j3390j1351j0468j0408j0270j0267j0575r883p133l726
62054A621725j895j712j839k477m996q834j1416j1443j0041q393o577n293o209
62041A540600r449j2732j4216j4588j5171j5578j4570j2057q892n698l062j881
62029A412706k127k031J74M042P521R467J0599J2111J4206J6194J7549J8716K0814
62016A539941K4373K8477L1596L3165L3965L5070L6964L9409M1508M2255M1835
62005A928558M2013M4222M7619N0274N1808N3203N4157N2637M7582M0269L2222
61994B444564K3328J3078K313p492j5899k3472l0751l8035m5493n2792n9112o4092
61982B146145o8095p1242p2932p2761p1081o8291o4537o0452n7040n4198n0557
$$ plain form
62066 1749708 1734329 1719196 1705806 1694455 1683987 1673579 1663309 1653042 1642467 1632584 1625451 1621725
62054 1621725 1619830 1618118 1616279 1613802 1608806 1599972 1588556 1577113 1567072 1558679 1552102 1546809 1540600
62041 1540600 1531151 1518419 1504203 1489615 1474444 1458866 1444296 1432239 1423347 1417649 1414587 1412706
62029 1412706 1410579 1408548 1408722 1412764 1420285 1429752 1440351 1452462 1466668 1482862 1500411 1519127 1539941
62016 1539941 1564314 1592791 1624387 1657552 1691517 1726587 1763551 1802960 1844468 1886723 1928558
62005 1928558 1970571 2014793 2062412 2112686 2164494 2217697 2271854 2324491 2372073 2412342 2444564
61994 2444564 2467892 2480970 2483283 2475791 2459892 2436420 2405669 2367634 2322141 2269349 2210237 2146145
61982 2146145 2078050 2006808 1933876 1861115 1790034 1721743 1657206 1596754 1539714 1485516 1434959
61971A434959m5526m0460l6893l4542l2080k9064k6080k3538k1397j9651j8271
61960A107457j6962j5590j4456j3717j3073j2516j2636j3573j4285j3627j1722
61949I55300r598p885o501n251m101l032j955o88R35K551L089J991M91N57K406
61934I28309M180M338L166J590K3r96n41J127J897o0m104p928r792r323p169m880
61918H99837m213n428o899p206o804o806p170p193o871o450n460l484j273J23
61904H24703P13R80P24j55n53N49K165K430J293N05J067K319L525M709N717O059
61888H56750O075O870Q727J0821J2819J5309J8120J9761J9504J8817J9551K1592
61876A034716K3432K4344K4715K4679K3887K2620K1845K1659K0690J7829J3951
$$ plain form
61971 1434959 1389433 1348973 1312080 1277538 1245458 1216394 1190314 1166776 1145379 1125728 1107457
61960 1107457 1090495 1074905 1060449 1046732 1033659 1021143 1008507 994934 980649 967022 955300
61949 955300 945702 937817 931316 926065 921964 918932 916977 916289 917224 919775 922864 924855 925346 925903 928309
61934 928309 932489 936827 939993 941583 941606 940610 940069 941196 943093 943033 938929 931001 921209 911886 904717 899837
61918 899837 895624 890196 883297 876091 869287 862481 855311 848118 841247 834797 829337 825853 824580 824703
61904 824703 825416 826396 827120 826965 826412 826961 829126 831556 832849 833354 834421 836740 840265 844974 850691 856750
61888 856750 862825 869695 878422 889243 902062 917371 935491 955252 974756 993573 1013124 1034716
61876 1034716 1058148 1082492 1107207 1131886 1155773 1178393 1200238 1221897 1242587 1260416 1274367
61865A274367J1036R854R261P783N078J655j962n127o797o378m851m116m873n603
61851A279327m082L20N957J0417J2660J3701J5079J6861J7692J6929J5616J4612
61839A415089J2811Q602K544k954o413q303r411j0019j0852j3003j6088j8046
61827A343957j7661j6078j4901j4104j2870j1450j0930j1857j3903j6314j7935
61816A185954j7698j5846j3855j2414j0538p527m575l255l290l079j775L89K997
61803A095488N549P332Q364R865J2600J5646J7936K0123K3352K7031K9656L1216
61791A304158L2825L4337L4555L3855L4406L7040L9722M0025L7804L4532L1138
61780A694397K7537K3447J8703J3190P183J446l400p209r773j0580r612p799o002
$$ plain form
61865 1274367 1285403 1295257 1304518 1312301 1317379 1319034 1317072 1311945 1305148 1298770 1293919 1289803 1284930 1279327
61851 1279327 1275245 1275565 1281522 1291939 1304599 1318300 1333379 1350240 1367932 1384861 1400477 1415089
61839 1415089 1427900 1436502 1439046 1436092 1429679 1421376 1411965 1401946 1391094 1378091 1362003 1343957
61827 1343957 1326296 1310218 1295317 1281213 1268343 1256893 1245963 1234106 1220203 1203889 1185954
61816 1185954 1168256 1152410 1138555 1126141 1115603 1108076 1103501 1100246 1096956 1093877 1092102 1092491 1095488
61803 1095488 1101037 1108369 1116733 1126598 1139198 1154844 1172780 1192903 1216255 1243286 1272942 1304158
61791 1304158 1336983 1371320 1405875 1439730 1474136 1511176 1550898 1590923 1628727 1663259 1694397
61780 1694397 1721934 1745381 1764084 1777274 1784457 1785903 1782503 1775294 1765521 1754941 1745329 1737530 1731528
61767A731528l809j06N028R700J2032J2349J2691J3906J4151J1226N714K77m049
61754A820638q990j5840k2835k7167k8416k8403k8496k8667k8808k9128k9190
61743A544698k8039k5670k3307k1976k1669k1974k2572k2874k2181k0590j9077
61732A294769j8289j7788j6787j5222j3717j2785j2268j1561j0452r529r398r468
61720A137505q435o215m546m825o185o611n548m297m049m459m225k539o1J439
61706A076949Q72n68m50J911M612N897O246O732O927O211N705O705P969P095M284
61691A147097K090J359P5l067o393p840p822p922q204p676o506o048o780p554
61677A074809o998m988k625j197j116j684j976j845j738j671j207m96m71j541
$$ plain form
61767 1731528 1727719 1727613 1732641 1742341 1754373 1766722 1779413 1793319 1807470 1818696 1824410 1824687 1820638
61754 1820638 1811648 1795808 1772973 1745806 1717390 1688987 1660491 1631824 1603016 1573888 1544698
61743 1544698 1516659 1490989 1467682 1445706 1424037 1402063 1379491 1356617 1334436 1313846 1294769
61732 1294769 1276480 1258692 1241905 1226683 1212966 1200181 1187913 1176352 1165900 1156371 1146973 1137505
61720 1137505 1129070 1122855 1118309 1113484 1107299 1100688 1095140 1090843 1086794 1082335 1078110 1075571 1075510 1076949
61706 1076949 1077821 1077253 1076803 1078714 1083326 1089223 1095469 1102201 1109128 1115339 1121044 1127749 1135718 1142813 1147097
61691 1147097 1149187 1150546 1150621 1147554 1141161 1133321 1125499 1117577 1109373 1101697 1095191 1089143 1082363 1074809
61677 1074809 1067811 1062823 1060198 1059001 1057885 1056201 1054225 1052380 1050642 1048971 1047764 1047268 1046797 1045256
61663A045256k766k933j998r63n05k56N78K049L011K019r84m135n214l879k027
61648A027253j870l872o476p679o902n470n105o000o834o646n944n616n711n923
61634I47205o434p418q340q615q436q092p189n489l899l423l698l688l367l462
61620H65655l952m185m156m339m451l721k324j273r77j038j266j594j270L52K273
61605H33734K673J339q7l63L31J613L422N074N392M369L285K823K492K262L082
61590H71441N096O850P153O476N697M758L414K211J679J539J538K116L362M183
61576I27513L509J613m41k014k917l020k568k136j635j65K415M558M471J913j977
61561I29119n940q964j0295j0074r490r412r305q251o590n674o176p417q297q357
$$ plain form
61663 1045256 1042490 1039557 1037559 1036596 1036091 1035835 1036413 1038462 1041473 1043492 1042508 1038373 1033159 1029280 1027253
61648 1027253 1025383 1021511 1015035 1007356 1000454 994984 989879 983879 977045 970399 964455 958839 953128 947205
61634 947205 940771 933353 925013 916398 907962 899870 892681 887192 883293 879870 876172 872484 869117 865655
61620 865655 861703 857518 853362 849023 844572 840851 838527 837254 836277 835239 833973 832379 831109 831461 833734
61605 833734 836407 837746 837659 837296 837627 839240 842662 847736 853128 857497 860782 863605 866097 868359 871441
61590 871441 876537 883387 890540 897016 902713 907471 910885 913096 914775 916314 917852 919968 923330 927513
61576 927513 931022 932635 932194 930180 927263 924243 921675 919539 917904 917739 920154 924712 929183 931096 929119
61561 929119 923179 914215 903920 893846 884356 874944 865639 857388 850798 845124 838948 831531 823234 814877
61547H14877p874p349p068p040p264p727q048p507o013m589m118m052l331k351
61533G30546k573m209n658n678m808m032l335k430j928k595l922m431l305j262
61519F80380K19K84m74o82J36Q05l4k096l789m072l100j428L41J447J679J969
61503F71585L034L899L267J877J581K375K556J923K199L708M201K213o77k315
61489G01426k716k772k140k27K079L473L870L613K426O33l9J276K791K534J408
61474G17635J708L506M808M698L923K747O43j743k637j797j159k043l218k843
61460G24228j166j80r63k352k358m55J832K662J857O53j04m37r7J486L505L749
61444G31860J344j715k984k301q62R77L214M676M224K834K482L330L955L960M204
$$ plain form
61547 814877 807003 799654 792586 785546 778282 770555 762507 755000 748987 744398 740280 736228 732897 730546
61533 730546 727973 723764 718106 712428 707620 703588 700253 697823 695895 693300 689378 684947 681642 680380
61519 680380 680599 680883 680409 679727 679863 680668 680634 678538 674749 670677 667577 666149 666490 667937 669616 671585
61503 671585 674619 678518 681785 683662 685243 687618 690174 692097 694296 698004 702205 704418 703741 701426
61489 701426 698710 695938 693798 693571 695650 699123 702993 706606 709032 709665 709626 710902 713693 716227 717635
61474 717635 719343 722849 727657 732355 736278 739025 739668 737925 735288 733491 732332 730289 727071 724228
61460 724228 723062 722882 721919 719567 717209 716754 718586 721248 723105 723758 723654 723217 723120 724606 728111 731860
61444 731860 733204 731489 728505 726204 725342 726319 729533 734209 738433 741267 743749 747079 751034 754994 759198
61429G59198M559L782J952P96R83J126L21j71R69K870L773L469L104L276L639
61414G93646L961M432N007N248M775L451J415o91j953k206k427l563n123n658
61400H00314m540k772j901k472l699m384l956k715j310j91N77J252K250L662M771
61385G84886M427K391O5o99M11J862K189J645J575K534L784M661N522O756P609
61370H29618P125N873N364N575M763K450Q85J962M134M514L175K763M086M943
61356H87230L840K264J992K398K140J630J906K327J439n46j948j902r88K3Q20
61341I02625J258J491J916K226J306q23k007n22K150K948J194r11j537j063m70
61326I09781J20O66N79k45q42n90k80q71j793j539K59K182K622J449k13j496k377
$$ plain form
61429 759198 763757 767539 769491 770287 771270 772396 772717 772546 773515 776385 780158 783627 786731 790007 793646
61414 793646 797607 802039 807046 812294 817069 820520 821935 821244 819291 817085 814658 811095 805972 800314
61400 800314 795774 793002 791101 788629 784930 780546 776590 773875 772565 772374 772951 774203 776453 780115 784886
61385 784886 789313 791704 791769 791070 791481 793343 795532 797177 798752 801286 805070 809731 815253 822009 829618
61370 829618 836743 842616 847980 853555 858318 860768 861653 863615 867749 872263 875438 878201 882287 887230
61356 887230 891070 893334 895326 897724 899864 901494 903400 905727 907166 906620 904672 902770 901782 901805 902625
61341 902625 903883 905374 907290 909516 910822 909999 907992 907470 909620 912568 913762 912851 911314 910251 909781
61326 909781 909901 910567 911146 910901 910059 909469 909189 908318 906525 904986 905245 907427 910049 911498 911285 909789 907412
61309I07412k741j848M21K427K248K94r63k02J292J883J757J801J836J448J516
61294I18581L157N706P345P550P578Q645J0704J2851J4039J3574J1858J0272R612
61281A041472R138Q002O813O635P223P609P772Q168Q175O787M591L265L044K404
61267A131098M64j771k935k662j225R72L071M137M257M427N219O392P753R212
61253A168409J0098R773R031R555J1681J4022J5596J6962J8727K0367K1136K1039
61241A346396K0181J8156J4875J1084P411L687j88l542n899p893j0447j3536j6376
61228A363909j8390j9399j9310j8241j6743j5397j4441j3855j3506j2951j1649
61217A190027r631p518n623l558j096J018J748J049J00J76J501L326N052O905
$$ plain form
61309 907412 904671 902823 903244 905671 907919 908213 907250 907048 908340 910223 911980 913781 915617 917065 918581
61294 918581 921738 927444 934789 942339 949917 958562 969266 982117 996156 1009730 1021588 1031860 1041472
61281 1041472 1050610 1058612 1065425 1072060 1079283 1086892 1094664 1102832 1111007 1117794 1122385 1125650 1128694 1131098
61267 1131098 1131562 1129791 1126856 1124194 1122969 1123941 1127012 1131149 1135406 1139833 1145052 1151444 1159197 1168409
61253 1168409 1178507 1188280 1197311 1206866 1218547 1232569 1248165 1265127 1283854 1304221 1325357 1346396
61241 1346396 1366577 1384733 1399608 1410692 1418103 1421790 1421602 1418060 1412161 1404268 1393821 1380285 1363909
61228 1363909 1345519 1326120 1306810 1288569 1271826 1256429 1241988 1228133 1214627 1201676 1190027
61217 1190027 1180396 1172878 1167255 1163697 1162601 1163619 1165367 1166416 1166516 1166692 1168193 1171519 1176571 1183476
61203A183476R120J0852J0787R169Q110R147J1246J2195J1398J0114R363Q941
61191A303918Q432P856P028N421L165J434J237K291L381L494K484J002k28j191
61177A349724k419l738l892k100M78J892J769J599K725N049P626R615J0635J1108
61163A390071J2280J4902J7776J8615J6673J3719J2062J2275J3173J3424J2698
61152A547668J1546J0569R836R223R091R888J0910J0453P932N024L812M419N485
61139A655856O234O891P615Q438R924J2549J5552J7568J8264J8194J7411J5536
61127A810032J2965J0561Q237N271J969l88j438k148l203m288n113n862o500o831
61113A813264p322q533r728r606q599q764j0942j3533j4619j4010j2640j1421
$$ plain form
61203 1183476 1192596 1203448 1214235 1223404 1231514 1240661 1251907 1264102 1275500 1285614 1294977 1303918
61191 1303918 1312350 1320206 1327234 1332655 1335820 1337254 1338491 1340782 1344163 1347657 1350141 1351143 1350915 1349724
61177 1349724 1347305 1343567 1339675 1337575 1338053 1339945 1341714 1343313 1346038 1351087 1358713 1368328 1378963 1390071
61163 1390071 1402351 1417253 1435029 1453644 1470317 1484036 1496098 1508373 1521546 1534970 1547668
61152 1547668 1559214 1569783 1579619 1588842 1597933 1607821 1618731 1629184 1637116 1642140 1645952 1650371 1655856
61139 1655856 1662090 1668981 1676596 1685034 1694958 1707507 1723059 1740627 1758891 1777085 1794496 1810032
61127 1810032 1822997 1833558 1841795 1847066 1849035 1848647 1847209 1845061 1841858 1837570 1832457 1826595 1820095 1813264
61113 1813264 1805942 1797409 1787681 1778075 1769476 1760712 1749770 1736237 1721618 1707608 1694968 1683547
61101A683547j1239j2647j4723j5467j4151j2168j0864r757p809n264l108j537
61089A564813n2J522L101M976P514J0367J2499J2888J1140P926M976L963N068
61076A650701P125R145J1063J3003J4836J6641J8813K1399K4096K6978L0362L3923
61064A878085L6863L9213M1909M5428M9283N3021N6673N9929O1993O2763O3177
61053B448337O3992O5016O5859O6617O7431O8050O8015O6694O3331N7951N2047
61042C153340M7247M3455L9366L4349K8397K0725J0563o63j0178j7319k3991l1132
61030C294159l7136m0930m4198m8745n3435n5868n5889n5471n5896n6836n7669
61019B732086n7972n7058n4572n1403m8805m6732m4193m0998l7950l5369l2651
$$ plain form
61101 1683547 1672308 1659661 1644938 1629471 1615320 1603152 1592288 1582531 1574722 1569458 1566350 1564813
61089 1564813 1564761 1566283 1569384 1574360 1581874 1592241 1604740 1617628 1628768 1636694 1641670 1645633 1650701
61076 1650701 1657826 1666971 1678034 1691037 1705873 1722514 1741327 1762726 1786822 1813800 1844162 1878085
61064 1878085 1914948 1954161 1996070 2041498 2090781 2143802 2200475 2260404 2322397 2385160 2448337
61053 2448337 2512329 2577345 2643204 2709821 2777252 2845302 2913317 2980011 3043342 3101293 3153340
61042 3153340 3200587 3244042 3283408 3317757 3346154 3366879 3377442 3376779 3366601 3349282 3325291 3294159
61030 3294159 3257023 3216093 3171895 3123150 3069715 3013847 2957958 2902487 2846591 2789755 2732086
61019 2732086 2674114 2617056 2562484 2511081 2462276 2415544 2371351 2330353 2292403 2257034 2224383
61008B224383k9552k6794k4922k3387k1402j9135j7350j6033j4204j1312q163
60997B012129n884m466l049j227J023M384R535J5163J8505J8860J8918K1465K6137
60984B131493L0894L5107L9438M3971M8667N4539O2082O9331P3874P6235P8950
60973B744581Q2957Q7332R1990R7805J04251J09855J15098J22064J30766J38580
60963C825279J43899J48034J52950J59486J68329J80476J96070K14558K36147
60954E425228K61303K89272L19299L52780L91895M37250M89571N51729O25097
60945I143424P05943P90790Q83562R91276J114797J252462J411210J603033J830991
60936A9727488K092240K390232K708601K948903K926129K491152J690113P81260
$$ plain form
61008 2224383 2194831 2168037 2143115 2119728 2098326 2079191 2061841 2045808 2031604 2020292 2012129
60997 2012129 2006245 2001779 1998730 1997503 1998526 2002910 2012445 2027608 2046113 2064973 2083891 2105356 2131493
60984 2131493 2162387 2197494 2236932 2280903 2329570 2384109 2446191 2515522 2589396 2665631 2744581
60973 2744581 2827538 2914870 3006860 3104665 3208916 3318771 3433869 3555933 3686699 3825279
60963 3825279 3969178 4117212 4270162 4429648 4597977 4778453 4974523 5189081 5425228
60954 5425228 5686531 5975803 6295102 6647882 7039777 7477027 7966598 8518327 9143424
60945 9143424 9849367 10640157 11523719 12514995 13629792 14882254 16293464 17896497 19727488
60936 19727488 21819728 24209960 26918561 29867464 32793593 35284745 36974858 37756118
60928C7756118O3931l12892l78521k26347O4125L81889N29633L01586l47673j230521
60918C6601328k046385k580183k795378k775616k620987k401068k161589j932569
60910A7287553j724675j534249j357988j197952j054587r24465q06475p03827
60902G983335o18146n46473m85063m31925l84962l41898l02909k69719k41626
60893D360614k15788j91492j70303j52023j34628j18739j07751j02365r8901r4369
60883B974255q9651q6125q2678p7988p2972o8952o5725o2942o1168o0220n8704
60872B187130n6482n5277n5474n4657n1058m6294m2914m0995l8968l6363l3854
60861A674794l1632k9377k7181k5330k3825k2811k2709k3154k2754k0627j7538
$$ plain form
60928 37756118 37820049 37507157 37128636 36902289 36966414 37348303 37877936 38179522 37831849 36601328
60918 36601328 34554943 31974760 29179382 26403766 23782779 21381711 19220122 17287553
60910 17287553 15562878 14028629 12670641 11472689 10418102 9493637 8687162 7983335
60902 7983335 7365189 6818716 6333653 5901728 5516766 5174868 4871959 4602240 4360614
60893 4360614 4144826 3953334 3783031 3631008 3496380 3377641 3269890 3167525 3068624 2974255
60883 2974255 2884604 2798479 2715801 2637813 2564841 2495889 2430164 2367222 2306054 2245834 2187130
60872 2187130 2130648 2075371 2019897 1965240 1914182 1867888 1824974 1783979 1745011 1708648 1674794
60861 1674794 1643162 1613785 1586604 1561274 1537449 1514638 1491929 1468775 1446021 1425394 1407856
60850A407856j5094j4249j4677j4875j3206r895p560q365j0991j2042j0237p428
60838A269237n624n095n509o867q707j0128j1070j2124j3007j2890j2282j2631
60826A153303j3846j4291j3601j3357j4228j4623j3055j0209p695o250n851o255
60814A020042o643o030m522l092k095j187n12k54O23L057N479N286K874J519K728
60799A017273M399M458L627L314L359L290L579M058L246Q86q39m04O50J51j631
60784A049416l234m651o366p171n548k731k082n224j0280j4060j4926j3622j2175
60771I47346j2030j2780j2904j1765j0172q900p721o351n241m907n262n935o401
60758H36977n813l965k422l082n333o484n457m089m007m274l385j768p47l95j1
$$ plain form
60850 1407856 1392762 1378513 1363836 1348961 1335755 1325860 1318300 1309935 1298944 1286902 1276665 1269237
60838 1269237 1263613 1258518 1253009 1246142 1237435 1227307 1216237 1204113 1191106 1178216 1165934 1153303
60826 1153303 1139457 1125166 1111565 1098208 1083980 1069357 1056302 1046093 1038398 1032148 1026297 1020042
60814 1020042 1013399 1007369 1002847 999755 997660 996473 995961 995707 996330 999387 1004866 1010152 1013026 1014545 1017273
60799 1017273 1021672 1026130 1029757 1033071 1036430 1039720 1043299 1047357 1050603 1051489 1050650 1050246 1050896 1051047 1049416
60784 1049416 1046182 1041531 1035165 1027994 1022446 1019715 1017633 1012409 1002129 988069 973143 959521 947346
60771 947346 935316 922536 909632 897867 887695 878795 871074 864723 859482 854575 849313 843378 836977
60758 836977 831164 827199 824777 821695 816362 809878 804421 800332 796325 792051 788666 786898 786151 785756 785745
60743G85745L50K30j11q4L74J111K073K643J888K38l74R89K782K994J555j52j066
60726H01185p86O32K162K204N19j231j794j943k822l926m082l367k749k541k412
60711G79049k256k043j396j78J089J928K309J961L67k003l623l640k557r32J070
60696G69145K342J179j983m085l162r09m2o43r04j12R82J861K508K710K535K708
60680G74130L221K572j44l383n030n089m865m445k965p72P14J098J233J482J418
60665G59175J116J239J763J945J594J198Q25J04o36m82N08R21k67k184k874j504
60649G62441N17Q82j003l061k745p0K315K109l86k950l572j944J18q7l293o728
60633G42543o899l849r45m04j146j417j191j008n92J59O40J073K693N301O722
$$ plain form
60743 785745 786095 786325 786214 786130 786504 787615 789688 792331 794219 794457 794083 795072 797854 800848 802403 802251 801185
60726 801185 800399 801031 803193 805397 805916 804685 802891 800948 798126 794200 790118 786751 784002 781461 779049
60711 779049 776793 774750 773354 773176 774265 776193 778502 780463 780830 778827 775204 771564 769007 768075 769145
60696 769145 771487 772666 770683 766598 763436 762527 762485 761842 760938 760826 761808 763669 766177 768887 771422 774130
60680 774130 777351 779923 779779 776396 771366 766277 761412 756967 754002 753230 753944 755042 756275 757757 759175
60665 759175 760291 761530 763293 765238 766832 768030 768855 768959 768323 767841 768349 769270 769003 766819 763945 762441
60649 762441 762958 763840 762837 759776 757031 756961 759276 761385 760999 758049 754477 752533 752651 752564 749271 742543
60633 742543 735644 731795 730850 730446 729300 727883 726692 725684 725092 725251 725891 726964 729657 734958 741680
60618G41680N964M759M535M216K864K103L416N088M641K644J260M33j356l500
60604G78747l776k139j034j741k892k830j404P46K770L475K361Q48O88J491J481
60589G76791M80J10J206K897M267N104M980L421J047r56k401l594l821k398q59
60574G86274j598m154n300l469p73K18m54j360k027k551k320p80J263K466K551
60559G67986K257K063J822J355P74L08J36K31L40L76O70J366J817J254l4r35r14
60542G80872m55q9L21J114K269L449M286M514M072L104J814O06K92J534L766N399
60526H16868N430M293K903J837J699L016M918N343L688K190L230O110Q072P884
60512H77481O913O898Q100R743J1183J2435J4052J6264J8108J8174J6564J4964
$$ plain form
60618 741680 747644 752403 756938 761154 764018 766121 769537 774625 779266 781910 783170 783603 782247 778747
60604 778747 774971 772832 771798 770057 767165 764335 762931 763677 766447 769922 772283 773131 773819 775310 776791
60589 776791 777271 777381 778587 781484 785751 790855 795835 799256 800303 799347 796946 793352 789531 787133 786274
60574 786274 784676 780522 775222 771753 770980 771198 770744 769384 767357 764806 762486 761706 762969 765435 767986
60559 767986 770243 772306 774128 775483 776257 776565 776701 776932 777272 777648 778318 779684 781501 782755 782721 781786 780872
60542 780872 780417 780328 780649 781763 784032 787481 791767 796281 800353 803457 805271 805877 806169 807703 811469 816868
60526 816868 822298 826591 829494 831331 833030 836046 840964 846307 849995 852185 855415 861525 869597 877481
60512 877481 884394 891292 899392 909135 920318 932753 946805 963069 981177 999351 1015915 1030879
60500A030879J4048J2276Q411L817P48n64j422k248k495k232j927j106R61L634
60486A062780N606O976Q908J1559J3901J5458J6624J7519J8069J9056K1554K5365
60474A243375K9332L2898L5893L7161L5216L0319K4352J8489J2375N609j304p629
60462A496086j2742j5780j6092j4349j2248j1098j1223j2195j2790j1384p630
60451A358555l215J38K687N504Q328J0319J2149J5356K0020K4946K9851L5496
60439A520134M1802M7665N2678N7419O2047O5893O8288O8537O5716O0010N3471
60428B163660M7780M1971L4361K5758J8279J1531K807r018k2398l5896m9280o1554
60416B168001p0729p6406q0200q2805q2969q0164p5901p1337o5781n8794n1785
$$ plain form
60500 1030879 1044927 1057203 1065614 1069431 1070179 1069615 1068193 1065945 1063450 1061218 1059291 1058185 1059146 1062780
60486 1062780 1068386 1075362 1084270 1095829 1109730 1125188 1141812 1159331 1177400 1196456 1218010 1243375
60474 1243375 1272707 1305605 1341498 1378659 1413875 1444194 1468546 1487035 1499410 1505019 1503715 1496086
60462 1496086 1483344 1467564 1451472 1437123 1424875 1413777 1402554 1390359 1377569 1366185 1358555
60451 1358555 1355340 1355478 1358165 1363669 1371997 1382316 1394465 1409821 1429841 1454787 1484638 1520134
60439 1520134 1561936 1609601 1662279 1719698 1781745 1847638 1915926 1984463 2050179 2110189 2163660
60428 2163660 2211440 2253411 2287772 2313530 2331809 2343340 2346147 2337129 2314731 2278835 2229555 2168001
60416 2168001 2097272 2020866 1940666 1857861 1774892 1694728 1618827 1547490 1481709 1422915 1371130
60405A371130m6104m1255l6497l2622l0667k9925k8669k6163k2935j9795j7402
60394A039096j6201j6013j6057j5580j4123j1459q206o005n785o188n261l454
60382I14764l016m417n528m846l557l521m773n887n629l731j185m5j546m183n071
60367H57829l418j100L30J168J805J512Rj578k268k404k454j994p33P44J914K883
60351H52245L500L179K112J414J604K127K628L343M032M031L579L571L880L673
60337H94918L384M268N746N626L565J928K312L459L764L630L925M103L445K577
60323I46650K288K220J941J946K489K845K820L392M824N675M929L539K717K255
60309I90530J711J638K262K570K104K072L234M314M147L760M433N215M567L306
$$ plain form
60405 1371130 1325026 1283771 1247274 1214652 1183985 1154060 1125391 1099228 1076293 1056498 1039096
60394 1039096 1022895 1006882 990825 975245 961122 949663 941457 935452 929667 923479 918218 914764
60382 914764 911748 907331 901803 896957 893400 889879 885106 879219 873590 869859 868674 868629 867083 862900 857829
60367 857829 854411 853311 853641 854809 856614 858126 858135 856557 854289 851885 849431 847437 846704 847448 849362 852245
60351 852245 855745 858924 861036 862450 864054 866181 868809 872152 876184 880215 883794 887365 891245 894918
60337 894918 898302 902570 908316 913942 917507 919435 921747 925206 928970 932600 936525 940628 944073 946650
60323 946650 948938 951158 953099 955045 957534 960379 963199 966591 971415 977090 982019 985558 988275 990530
60309 990530 992241 993879 996141 998711 1000815 1002887 1006121 1010435 1014582 1018342 1022775 1027990 1032557 1035863
60295A035863L644N871Q145R226R603R988J0300J0137R144P016M109J655M30m25
60281A124706k209m635o029n393l535k150k306l653m895n221n093n221n165m113
60267A065088k673k338l125l420k468j309q14m97J20P20J459L248N886P626P652
60252A075155P372Q221R771J1086J2393J4169J6051J7744J9659K1588K2136K0500
60240A255845J7460J3791R314M317j3l752q725j5465k1516k4330k4102k2270j9240
60227A161314j5289j1855r770p834n041k674k189k698k683k611l474m383m127
60214A086686l794n064o953p104n612m835n764p164q034q508q470p530o302n653
60200I95899m971l153r68k46q78r48J56J032Q70N99R71J519J988L013M674N823
$$ plain form
60295 1035863 1039507 1045378 1053523 1062749 1072352 1082340 1092640 1102777 1111921 1118937 1123046 1124701 1125131 1124706
60281 1124706 1122497 1117862 1111833 1106440 1102905 1100755 1098449 1094796 1089901 1084680 1079587 1074366 1069201 1065088
60267 1065088 1062415 1060077 1056952 1053532 1051064 1049755 1048941 1048444 1048564 1049284 1050743 1053991 1059877 1067503 1075155
60252 1075155 1082527 1090748 1100519 1111605 1123998 1138167 1154218 1171962 1191621 1213209 1235345 1255845
60240 1255845 1273305 1287096 1296410 1300727 1300714 1296962 1288237 1272772 1251256 1226926 1202824 1180554 1161314
60227 1161314 1146025 1134170 1124400 1116566 1111525 1108851 1106662 1103964 1101281 1098670 1095196 1090813 1086686
60214 1086686 1082892 1077828 1070875 1063771 1058159 1053324 1047560 1040396 1032362 1023854 1015384 1007854 1001552 995899
60200 995899 990928 987775 986807 986561 985683 984735 984891 985923 986793 987392 988363 989882 991870 994883 999557 1005380
60184A005380N592M446L263K394J958K022K134J631O57N7J15K22o5m16l00M66
60168A029556J725L007L658L558L475M203N587O898P809Q523R329J0443J1769
60155A109540J2561J2086J0954J0798J2190J3957J4996J5424J5378J4290J2460
60144A254634J1716J3091J5134J5910J5488J4994J4399J2961J0884R009P511O258
60132A401989N462M789K962l26l377m845n781p691r921j1026j1422j2358j3316
60119A335139j2878j1504j0990j1612j2030j1728j1299j0633r043p087o077n803
60107A214455m841l141k279k867l698l906m118m847n218m179j983O0R11P16P61
60092A175826K246M692O272O097N179M494L541J833M21M35J364K303L672O031
$$ plain form
60184 1005380 1010972 1015418 1018681 1021075 1023033 1025055 1027189 1028820 1029477 1029534 1029649 1029871 1029806 1029390 1029090 1029556
60168 1029556 1031281 1034288 1037946 1041504 1044979 1049182 1054769 1061667 1069476 1077999 1087328 1097771 1109540
60155 1109540 1122101 1134187 1145141 1155939 1168129 1182086 1197082 1212506 1227884 1242174 1254634
60144 1254634 1266350 1279441 1294575 1310485 1325973 1340967 1355366 1368327 1379211 1388220 1395731 1401989
60132 1401989 1407451 1412240 1415202 1414876 1411499 1406654 1400873 1393182 1383261 1372235 1360813 1348455 1335139
60119 1335139 1322261 1310757 1299767 1288155 1276125 1264397 1253098 1242465 1233422 1226335 1220258 1214455
60107 1214455 1209614 1206473 1204194 1201327 1197629 1193723 1189605 1184758 1179540 1175361 1173378 1173438 1174349 1175065 1175826
60092 1175826 1178072 1182764 1189036 1195133 1200312 1204806 1208347 1210180 1210601 1211036 1212400 1214703 1218375 1224406
60078A224406Q522J0211J1774J3973J5715J5629J4438J3647J3104J2026J1185
60067A364630J1514J1821J0553Q759Q420Q835P905O250O502Q753J0268R926R560
60054A483696J0245J0462R017P050N995N655N264M606L392J393m25p15m4m92k738
60039A542361n365p216q386q857q392p926q767j0123r767p546n856o144p233p725
60025A433058p774p768p421o953p226q007p975o949o239o253n896m863m564o012
60011A339158q591j1328j3684j4816j4126j2795j2664j3543j3738j3219j3449
60000A197205j3995j2580r285p251p838q246n890k251k34P7N66J801K912L632
59986A138623M453N478O501P431P862P333O746P967J1136J3907J4242J2561J0334
$$ plain form
60078 1224406 1232928 1243139 1254913 1268886 1284601 1300230 1314668 1328315 1341419 1353445 1364630
60067 1364630 1376144 1387965 1398518 1407277 1415697 1424532 1432437 1438687 1445189 1453942 1464210 1474136 1483696
60054 1483696 1493941 1504403 1513420 1520470 1526465 1532120 1537384 1541990 1545382 1546775 1546350 1545635 1545591 1545099 1542361
60039 1542361 1536996 1529780 1521394 1512537 1504145 1496219 1487452 1477329 1467562 1460016 1454160 1448016 1440783 1433058
60025 1433058 1425284 1417516 1410095 1403142 1395916 1387909 1379934 1372985 1366746 1360493 1354597 1349734 1345170 1339158
60011 1339158 1330567 1319239 1305555 1290739 1276613 1263818 1251154 1237611 1223873 1210654 1197205
60000 1197205 1183210 1170630 1161345 1154094 1146256 1138010 1132120 1129869 1129635 1129712 1130278 1132079 1134991 1138623
59986 1138623 1143076 1148554 1155055 1162486 1170348 1177681 1184427 1192394 1203530 1217437 1231679 1244240 1254574
59973A254574Q277O701N902N240L468P93j229k509m964r178j2960j4681j5716
59960A223718j7801j9921j9975j8013j5882j4805j4944j6051j7022j6045j2794
59949A040465r309p311o038m180k387j999k575k642k006j540j428j198q57o47
59935I96348l52J1j91p79k41J975M000M062L218L665N359O512O691P068P794P481
59919A052621N619L594K610K052P32j283l005m060m875n495n161l564j926j790
59905A036069k741k641p01J161J197O85J917M358N302M059K784K920L319K765
59891A060453J914J716J780J524J329J507J536J209J199J713J953J506Q96L81
59877A080616k96o12K95J759K200J959L026N390O593N826N418O706P416N246J538
$$ plain form
59973 1254574 1262851 1269552 1275454 1280694 1284162 1284955 1283726 1281217 1276253 1267075 1254115 1239434 1223718
59960 1223718 1205917 1185996 1166021 1148008 1132126 1117321 1102377 1086326 1069304 1053259 1040465
59949 1040465 1031156 1023845 1017807 1013627 1011240 1009241 1006666 1004024 1002018 1000478 999050 997852 996995 996348
59935 996348 995996 996007 995816 995037 994796 996771 1000771 1004833 1008051 1011716 1017075 1023587 1030278 1037346 1045140 1052621
59919 1052621 1058240 1061834 1064444 1066496 1067228 1065945 1062940 1058880 1054005 1048510 1043349 1039785 1037859 1036069
59905 1036069 1033328 1030687 1029986 1031147 1032344 1033029 1034946 1039304 1044606 1048665 1051449 1054369 1057688 1060453
59891 1060453 1062367 1064083 1065863 1067387 1068716 1070223 1071759 1072968 1074167 1075880 1077833 1079339 1080235 1080616
59877 1080616 1080320 1079708 1080003 1081762 1083962 1085921 1088947 1094337 1100930 1106756 1112174 1118880 1126296 1131542 1133080
59862A133080r54j839k344k754k857l268m013l501j023J317J480O88J337L258
59848A118607M583M993N430N636M631L003K207K152J676Q39N99P55L62k96j91
59833A154986M82Q17J156K503M477N889O954Q843J1239J2405J1730J0436R663
59820A241580R421R468R803J0246J0717J1629J2881J2936J0389O064K165k90j940
59807A345069l372m429m937m933m347l428k997l241l040j600J38R76J358K342
59793A313559L641M438N333P427J0004J1127J0413R517R834J1221J2769J3412
59781A422695J1938Q034L312m5j661k760l721l378j035J993L401J946j514m757
59767A434448o143o182o648q066r175r254r467j0986j3097j4411j4623j3867j1618
$$ plain form
59862 1133080 1132126 1130287 1127943 1125189 1122332 1119064 1115051 1111550 1110527 1111844 1113324 1114012 1115349 1118607
59848 1118607 1123190 1128183 1133613 1139249 1143880 1146883 1149090 1151242 1152918 1153757 1154356 1155111 1155473 1155177 1154986
59833 1154986 1155468 1156285 1157441 1159944 1164421 1170310 1177264 1186107 1197346 1209751 1221481 1231917 1241580
59820 1241580 1251001 1260469 1270272 1280518 1291235 1302864 1315745 1328681 1339070 1345134 1347299 1347009 1345069
59807 1345069 1341697 1337268 1332331 1327398 1323051 1319623 1316626 1313385 1310345 1308745 1308883 1309859 1311217 1313559
59793 1313559 1317200 1321638 1326971 1334398 1344402 1355529 1365942 1375459 1385293 1396514 1409283 1422695
59781 1422695 1434633 1442667 1445979 1445934 1444273 1441513 1437792 1434414 1433379 1435372 1438773 1440719 1439205 1434448
59767 1434448 1428305 1422123 1415475 1407409 1398234 1388980 1379513 1368527 1355430 1341019 1326396 1312529 1300911
59754A300911p877m292k367j401J24J887K260Q69j016k294k670k029n76O07M14
59739A282550j102l164n153o262n469l089j231j389k566l123l194l720m412m505
59725A234171m522n246n937n472m478m354n001n357n405n658n516m226k767k531
59711A167701k769j639O80K274K619L113M450N629N841N625N840O842Q617J0556
59697A225379J1514J1242J1104J2093J3135J2959J2444J3112J4401J4776J4689
59686A366848J5814J7905J9001J8416J7063J5142J2142Q979P365O921N562L025
59674A514183J391J494J438m78l460n827p098p534p234o492n890n409m561l592
59660A460931l347l821m161m078l948l658k872k178k375k736j727N69K456L044
$$ plain form
59754 1300911 1293034 1288742 1286375 1284974 1285098 1286985 1289245 1290114 1289098 1286804 1284134 1282105 1281529 1282136 1282550
59739 1282550 1281448 1278284 1273131 1266869 1261400 1258311 1257080 1255691 1253125 1250002 1246808 1243088 1238676 1234171
59725 1234171 1229649 1224403 1218466 1212994 1208516 1204162 1199161 1193804 1188399 1182741 1177225 1172999 1170232 1167701
59711 1167701 1164932 1163293 1163973 1166247 1168866 1171979 1176429 1182058 1187899 1193524 1199364 1206206 1214823 1225379
59697 1225379 1236893 1248135 1259239 1271332 1284467 1297426 1309870 1322982 1337383 1352159 1366848
59686 1366848 1382662 1400567 1419568 1437984 1455047 1470189 1482331 1491310 1498675 1505596 1511158 1514183
59674 1514183 1515574 1517068 1518506 1518028 1514568 1508741 1501643 1494109 1486875 1480383 1474493 1469084 1464523 1460931
59660 1460931 1457584 1453763 1449602 1445524 1441576 1437918 1435046 1432868 1430493 1427757 1426030 1426599 1429055 1432099
59646A432099L006K991K946L061L701M443M737N287P068R234R974R280Q906R677
59632A516410J0918J2301J3891J4326J1475N658J5l060m051m517n095n875o871
59619A555525p477p033o433p384r691j1149j0732r987j0391j1191j0891r575q609
59606A434982q925j0276j1414j0791q011m728l041l020k875j452O90K502L329
59593A376970K828J484J113L137O345P868O421L215r8k757m454n326o430q539
59579A381777j0583j0954j0110j0008j1101j1820j1205j0093r469r200q681p446
59567A261107n314l155k897n106p409p244n384m552n371o245o529o977p498p249
59553A180177o778p188p528n939l135j494r21P96L482M298K540Q29N49J0j484
$$ plain form
59646 1432099 1435105 1438096 1441042 1444103 1447804 1452247 1456984 1462271 1469339 1478573 1488547 1497827 1506733 1516410
59632 1516410 1527328 1539629 1553520 1567846 1579321 1584979 1584994 1581934 1577883 1573366 1568271 1562396 1555525
59619 1555525 1548048 1541015 1534582 1527198 1517507 1506358 1495626 1485639 1475248 1464057 1453166 1443591 1434982
59606 1434982 1426057 1415781 1404367 1393576 1385565 1380837 1377796 1374776 1371901 1370449 1371139 1373641 1376970
59593 1376970 1379798 1381282 1382395 1385532 1391877 1399745 1406166 1409381 1409283 1406526 1402072 1396746 1390316 1381777
59579 1381777 1371194 1360240 1350130 1340122 1329021 1317201 1305996 1295903 1286434 1277234 1268553 1261107
59567 1261107 1255793 1252638 1249741 1244635 1237226 1229982 1224598 1220046 1214675 1208430 1201901 1194924 1187426 1180177
59553 1180177 1173399 1166211 1158683 1152744 1149609 1148115 1147194 1147990 1151472 1155770 1158310 1159139 1159688 1159698 1158214
59538A158214j691L86J995P65j448j510N42K473L354L717L653K912J860Q01n93
59523A175430k100k569j739r89j298k022k551l514n263o770o998o106m650l021
59509A125840j976k032k166j036M59K05j505k219j443j301k439k660r36N71K82
59494A107644j55J054K897L743M052M767N352N412O065P692Q496P392O221O974
59480A177606Q725R559R784J1129J4225J8611K3539K7037K5907J8896Q700o15
59468A353103o876r595q806n781k979j492j61J610K479K019K282M416O125M895
59454A341239J597j482m194p540j0829j2501j2592j2146j1363j0175r215q533
59442A242266p007m679l749n278p066o943n903n506m559j406K327L633K471J163
$$ plain form
59538 1158214 1156523 1156909 1158904 1159669 1158221 1156711 1157253 1159726 1163080 1166797 1170450 1173362 1175222 1176023 1175430
59523 1175430 1173330 1170761 1169022 1168033 1166735 1164713 1162162 1158648 1153385 1146615 1139617 1133511 1128861 1125840
59509 1125840 1123864 1121832 1119666 1118630 1119089 1119294 1117789 1115570 1114127 1112826 1110387 1107727 1106791 1107362 1107644
59494 1107644 1107489 1108543 1111440 1115183 1119235 1124002 1129354 1134766 1140831 1148523 1157019 1164411 1170632 1177606
59480 1177606 1186331 1195890 1205674 1216803 1231028 1249639 1273178 1300215 1326122 1345018 1353718 1353103
59468 1353103 1346227 1336632 1327826 1322045 1319066 1317574 1317413 1319023 1321502 1323521 1325803 1330219 1336344 1341239
59454 1341239 1342836 1341354 1337160 1329620 1318791 1306290 1293698 1281552 1270189 1260014 1250799 1242266
59442 1242266 1235259 1230580 1226831 1221553 1214487 1207544 1201641 1196135 1191576 1190170 1192497 1196130 1198601 1199764
59428A199764N37k80j071n57J158K736L875N377P402R450J1329J2593J2154J0166
59414A274633Q822R343R845Q317O010N144M951L199M45n76O08J623J048J23M38
59399A333973K103M286N842N629L832K630L915O919R475J0766J1294J1200J0493
59386A422357R917R833R195P304N325M249K870j38l536n257n488n629n504m240
59372A441258k760k638l341l254k489k043r96K436P532J1502J3076J3405J3917
59359A485605J5421J8623K3092K6517K7353K7424K9533L3645L8141M3297M9728
59348A818379N4097N0581L7435J9206K012j0624j7398j8341j5433j1380o557Q44
59336A902821J0597J8215J8060P883r504k7638l9800m3210m0440l5954l1814k7894
$$ plain form
59428 1199764 1200301 1200021 1198950 1198393 1199551 1202287 1206162 1211539 1218941 1228391 1239720 1252313 1264467 1274633
59414 1274633 1283455 1292798 1302643 1310960 1316970 1322114 1327065 1330264 1330709 1330133 1330741 1332364 1333412 1333535 1333973
59399 1333973 1336076 1340362 1346204 1351833 1355665 1358295 1362210 1369129 1378604 1389370 1400664 1411864 1422357
59386 1422357 1432274 1442107 1451302 1458606 1463931 1468180 1471050 1470912 1467376 1462119 1456631 1451002 1445498 1441258
59372 1441258 1438498 1435860 1432519 1429265 1426776 1424733 1423737 1426173 1433705 1445207 1458283 1471688 1485605
59359 1485605 1501026 1519649 1542741 1569258 1596611 1624035 1653568 1687213 1725354 1768651 1818379
59348 1818379 1872476 1923057 1960492 1979698 1981710 1971086 1953688 1935347 1919914 1908534 1901977 1902821
59336 1902821 1913418 1931633 1949693 1957576 1948072 1920434 1880634 1837424 1796984 1761030 1729216 1701322
59324A701322k4686k3218k2752k1225j8077j4554j1465q613o225m825l875k490
59312A539317j100n74l68L66P16n18k010j250J761M768O585P524P300N685M765
59297A572967P025J1214J3535J3187J3185J5170J7072J7094J6689J7767J9660
59286A734565K0590K0234J9247J7995J6904J6525J6321J4852J1907Q902O659M463
59274A909164J676j444m973r450j4293j7927k0076k2182k4986k7403k8347k7945
59262A711814k6535k4246k2148k1910k3524k4820k4023k1501j8565j5941j3929
59251A474672j2703j1933j1125j0468j0313r967q262n303k274K54K593M768O488
59238A406427Q003R827J1957J4313J6846J7961J4566N797m718j2655j7546k0947
$$ plain form
59324 1701322 1676636 1653418 1630666 1609441 1591364 1576810 1565345 1556732 1550507 1545682 1541807 1539317
59312 1539317 1538217 1537643 1537275 1537641 1538357 1537839 1535829 1534579 1536340 1541108 1547693 1555217 1562517 1568202 1572967
59297 1572967 1579992 1591206 1604741 1617928 1631113 1646283 1663355 1680449 1697138 1714905 1734565
59286 1734565 1755155 1775389 1794636 1812631 1829535 1846060 1862381 1877233 1889140 1898042 1904701 1909164
59274 1909164 1910840 1909396 1904423 1894973 1880680 1862753 1842677 1820495 1795509 1768106 1739759 1711814
59262 1711814 1685279 1661033 1638885 1616975 1593451 1568631 1544608 1523107 1504542 1488601 1474672
59251 1474672 1461969 1450036 1438911 1428443 1418130 1408163 1399901 1394598 1392324 1392578 1395171 1399939 1406427
59238 1406427 1414430 1424257 1436214 1450527 1467373 1485334 1499900 1505697 1500979 1488324 1470778 1449831
59226A449831k2011j8860j3300r692q980p920m674j222P34K504N453Q526J0449
59213A390838J1870J3773J5833J7597J9425K1294K2490K3035K3561K3559K1953
59202A605228J9394J7483J5581J1498N679J330m02j964m813o819o085m355m308
59189A647447n779o917p135o763n456l103j127j091k776m811o326p118p228p109
59175A574708p183o948n719m282m135n133n757n753o254p246p420o930p541r474
59161A484933j0837j1037j1849j3905j4901j3052r910q043p803q028q186q153
59149A359229p295n263k727m99J037J460P66K81J183K156R65j612k339l88J399
59134A348353J020r7k14K8l14n63l07p37k290l223k260o20J33J65k3q47k049k132
$$ plain form
59226 1449831 1427820 1408960 1395660 1385968 1376988 1369068 1364394 1363172 1363906 1366410 1371863 1380389 1390838
59213 1390838 1402708 1416481 1432314 1449911 1469336 1490630 1513120 1536155 1559716 1583275 1605228
59202 1605228 1624622 1642105 1657686 1669184 1674863 1676193 1675791 1673827 1669014 1662195 1656110 1651755 1647447
59189 1647447 1641668 1634751 1627616 1620853 1615397 1612294 1611167 1610076 1607300 1602489 1596163 1589045 1581817 1574708
59175 1574708 1567525 1560577 1554858 1550576 1546441 1541308 1535551 1529798 1523544 1516298 1508878 1501948 1494407 1484933
59161 1484933 1474096 1463059 1451210 1437305 1422404 1409352 1399442 1391399 1383596 1375568 1367382 1359229
59149 1359229 1351934 1346671 1343944 1343445 1344482 1345942 1346708 1346989 1348172 1350328 1351293 1349681 1347342 1346954 1348353
59134 1348353 1349373 1349276 1349062 1349090 1348776 1348213 1347906 1347169 1344879 1341656 1339396 1338776 1338909 1339074 1339051 1338204 1336155 1334023
59116A334023r15m41j825l426l679l333l366k986j566k27K94J089K613L125J589
59101A320969j93m85l30j214k207k009j869l693o710q618q981r242j0220j1501
59087A253697j2499j2683j1747j0613j0819j1950j1672r464p903q631r619q615
59075A127482o788o348o610n412k907j013j22R71K547L796M564N324N966O183
59061A127633O402P031P757Q685J0768J3785J5593J5006J3706J3638J4264J4195
59049A268463J3706J3491J2624J0095P055N341M949M867M990N243M383J953j18
59036A357042k11J70j241l598m332l331k832l672m349l761k535j584j269j856
59022A322641l247m512n087n889p791r781j0218r310q627q742q915q640q032p131
$$ plain form
59116 1334023 1333108 1332667 1330842 1327416 1323737 1320404 1317038 1314052 1312486 1312259 1312553 1313642 1316255 1319380 1320969
59101 1320969 1320776 1320291 1319961 1318747 1316540 1314531 1312662 1308969 1302259 1293641 1284660 1275418 1265198 1253697
59087 1253697 1241198 1228515 1216768 1206155 1195336 1183386 1171714 1162250 1154347 1145716 1136097 1127482
59075 1127482 1120694 1114346 1107736 1102324 1099417 1098404 1098282 1099253 1101800 1105596 1110160 1115484 1121450 1127633
59061 1127633 1134035 1141066 1148823 1157508 1168276 1182061 1197654 1212660 1226366 1240004 1254268 1268463
59049 1268463 1282169 1295660 1308284 1318379 1325434 1330775 1335724 1340591 1345581 1350824 1355207 1357160 1357042
59036 1357042 1356831 1357001 1355760 1352162 1347830 1344499 1341667 1337995 1333646 1329885 1327350 1325766 1324497 1322641
59022 1322641 1319394 1314882 1309795 1303906 1296115 1286334 1276116 1266806 1258179 1249437 1240522 1231882 1223850 1216719
59008A216719o150n917o771p617p150n491l676k407k088k973m285m373k788j060
58994A153973m88n70n51q54j727k172j612j078j284j185J08J545J860J519J501
58979A148985J683J917K879M339M474K645J004J409K727L210L629N522Q100R460
58965A201983R678J0188J1250J2260J3588J5832J8130J9217J9292J9122J8308
58954A368848J6169J3052R291M309j472n538o155m814l894l513k751k154k517
58941A378861k660j021J721L826N077O116O616O362O630Q183R275Q112N764M300
58927A447162L539K291J269J802K924K721J681J845L412M888N786O742P730Q591
58913A502383J0482J4234J8202K0210K0699K1533K2713K2846K1942K1012J9742
$$ plain form
59008 1216719 1210569 1204652 1197881 1190264 1183114 1177623 1173947 1171540 1169452 1166479 1162194 1157821 1155033 1153973
58994 1153973 1153485 1152915 1152364 1151510 1149783 1147611 1145999 1144921 1143637 1142452 1142560 1144105 1145965 1147484 1148985
58979 1148985 1150668 1152585 1155464 1159803 1164277 1166922 1167926 1169335 1172062 1175272 1178901 1184423 1192523 1201983
58965 1201983 1211661 1221849 1233099 1245359 1258947 1274779 1292909 1312126 1331418 1350540 1368848
58954 1368848 1385017 1398069 1407360 1411669 1410197 1404659 1398504 1393690 1389796 1386283 1383532 1381378 1378861
58941 1378861 1376201 1375180 1376901 1380727 1385804 1391920 1398536 1404898 1411528 1419711 1428986 1437098 1442862 1447162
58927 1447162 1450701 1452992 1454261 1456063 1458987 1461708 1463389 1465234 1468646 1473534 1479320 1486062 1493792 1502383
58913 1502383 1512865 1527099 1545301 1565511 1586210 1607743 1630456 1653302 1675244 1696256 1715998
58902A715998J7284J4560J3029J1816Q778L980m40l530o162q846j1174j3247j5617
58889A726429j8047k0081k2134k4494k6137k6233k5586k4969k3371j9971j6282
58878A479124j4112j2765j0575p829n841m515l083j882j204M5K272L646L059K487
58864A428827L597M279J995j420k133r2J409R59J11m4J63Q99K561M085M320M299
58848A453815N452O801O845O928R381J3470J6510J8020J9442K0754K0827K0337
58836A618582K0985K2449K3173K3241K3575K3447K2000K0874K2047K4315K5312
58825A870000K5544K6759K7930K6835K4233K2290K0154J5502R443N360L566J467
58813B079083j602m073n964q677j1523j2782j3502j5846j8345j7637j4453j2917
$$ plain form
58902 1715998 1733282 1747842 1760871 1772687 1781465 1785445 1785005 1781475 1775313 1766467 1755293 1742046 1726429
58889 1726429 1708382 1688301 1666167 1641673 1615536 1589303 1563717 1538748 1515377 1495406 1479124
58878 1479124 1465012 1452247 1441672 1433843 1428002 1423487 1420404 1418522 1417318 1417363 1419635 1423281 1426340 1428827
58864 1428827 1432424 1436703 1438698 1437278 1435145 1435053 1436462 1437421 1437532 1437488 1437651 1438550 1441111 1445196 1449516 1453815
58848 1453815 1459267 1466068 1472913 1479841 1489222 1502692 1519202 1537222 1556664 1577418 1598245 1618582
58836 1618582 1639567 1662016 1685189 1708430 1732005 1755452 1777452 1798326 1820373 1844688 1870000
58825 1870000 1895544 1922303 1950233 1977068 2001301 2023591 2043745 2059247 2068690 2074050 2077616 2079083
58813 2079083 2077481 2073408 2067444 2058767 2047244 2034462 2020960 2005114 1986769 1969132 1954679 1941762
58801A941762j4088j5113j4844j5370j7494j9364k0229k1225k2088k1256j9529
58790A741162j9358k0396k0017j8199j7378j7501j6157j3806j3769j6431j8425
58779A549725j8345j8304j8996j8298j6045j5234j6844j7855j6138j3256j1114
58768A369296r559q500q486q289n713j548J210K349M307O871O971M510L234M651
58754A361304O006N487M563L901J968q91j858p25o24k330k936j719j910m643o640
58739A358953o272o487q935j0536r100p446q446j0328j0455r707r768r750q721
58726A243002q137q655q020m944j722j90J326M307O874P276P132Q172Q926P558
58712A262905N056K745m04n139r433j1297j1651j2170j2665j2540j2173j1351
$$ plain form
58801 1941762 1927674 1912561 1897717 1882347 1864853 1845489 1825260 1804035 1781947 1760691 1741162
58790 1741162 1721804 1701408 1681391 1663192 1645814 1628313 1612156 1598350 1584581 1568150 1549725
58779 1549725 1531380 1513076 1494080 1475782 1459737 1444503 1427659 1409804 1393666 1380410 1369296
58768 1369296 1359737 1351237 1342751 1334462 1328749 1327201 1328411 1330760 1335067 1341938 1348909 1353419 1356653 1361304
58754 1361304 1367310 1372797 1377360 1381261 1383229 1382338 1380480 1379755 1379131 1376801 1373865 1372146 1370236 1365593 1358953
58739 1358953 1352681 1346194 1337259 1326723 1317623 1310177 1301731 1291403 1280948 1271241 1261473 1251723 1243002
58726 1243002 1234865 1226210 1218190 1213246 1211524 1211334 1212660 1216967 1223841 1231117 1238249 1246421 1255347 1262905
58712 1262905 1267961 1270706 1270302 1265163 1255730 1244433 1232782 1220612 1207947 1195407 1183234 1171883
58700A171883r099o425n814o891o281l126m24N38K276N594P029M661J765J406
58686A157092J788M63r64o2K049L184L838N195O412O797P610R038Q820O428N003
58671A222691O294P709P243P226R706J2229J2101J1040J1618J2501J1496J0108
58659A341962J0875J2842J3774J4244J5690J6807J5686J3429J2145J1475J0147
58648A489076Q719P767N782J750k584n785r342j4518j9573k2885k5789k9426l1923
58635A351269l1881l1330l1973l1679k8290k3900k1664k0969j9357j6699j4227
58624A079300j1778r149p748q125q446p721p581q489p912m930k672l072l308r21
58610I87448J659J698J276L411O640P901P783Q551R852J0327J0613J0984R105
$$ plain form
58700 1171883 1162784 1156359 1150545 1143654 1137373 1134247 1133823 1134361 1136637 1142231 1149260 1153921 1155686 1157092
58686 1157092 1158880 1159343 1158379 1158317 1160366 1163550 1167388 1172583 1178995 1185792 1193402 1202440 1211260 1217688 1222691
58671 1222691 1228985 1236694 1243937 1251163 1260869 1273098 1285199 1296239 1307857 1320358 1331854 1341962
58659 1341962 1352837 1365679 1379453 1393697 1409387 1426194 1441880 1455309 1467454 1478929 1489076
58648 1489076 1497795 1505562 1511344 1513094 1510510 1504725 1495383 1480865 1461292 1438407 1412618 1383192 1351269
58635 1351269 1319388 1288058 1256085 1224406 1196116 1172216 1150552 1129583 1110226 1093527 1079300
58624 1079300 1067522 1058373 1050625 1042500 1034054 1026333 1018752 1010263 1002351 997421 994749 991677 988369 987448
58610 987448 989107 990805 992081 995492 1002132 1010033 1017816 1026367 1036219 1046546 1057159 1068143 1077248
58597A077248M035p19k041j824l026m623m583m250n372o228n117m335o186q389
58583A024590p997o458o240n996l922k359l814n770m772k456k110k453n30K122
58569I71835K099M56N93K021J863N38N26J384J214J140L172N620N687M706N773
58554A008627Q193R185R012R550R948Q566O988P342Q050O893N536O114O443L948
58540A114395J205J794L699K856L75j10N45p94k756j746J040J671P73K025N041
58525A130013O437O665R064J3129J5242J5214J6010J7904J8836J9351K1232K2582
58513A311679K0499J7313J7853K1634K3944K3635K3720K5349K7341L0426L5715
58502A579108M0313M0806L9722M1992M6409M7398M3990L9996L6321L0404K2618
$$ plain form
58597 1077248 1081283 1080564 1078523 1076699 1073673 1069050 1064467 1060217 1054845 1048617 1043500 1039165 1032979 1024590
58583 1024590 1016593 1010135 1003895 997899 993977 991618 987804 982034 977262 974806 972696 970243 969713 971835
58569 971835 973934 974390 974983 977004 978867 979405 979931 981315 982529 983669 986841 992461 998148 1002854 1008627
58554 1008627 1016820 1026005 1035017 1044567 1054515 1063081 1070069 1077411 1085461 1092354 1097890 1104004 1110447 1114395
58540 1114395 1115600 1117394 1121093 1123949 1124324 1124214 1124759 1123965 1121209 1119463 1120503 1122174 1122947 1124972 1130013
58525 1130013 1136450 1143115 1152179 1165308 1180550 1195764 1211774 1229678 1248514 1267865 1289097 1311679
58513 1311679 1332178 1349491 1367344 1388978 1412922 1436557 1460277 1485626 1512967 1543393 1579108
58502 1579108 1619421 1660227 1699949 1741941 1788350 1835748 1879738 1919734 1956055 1986459 2009077
58491B009077J5976R864J125q924j5486j7976j9760k0715j7517j1424q289j0103
58479A905848j3278j5988k0441k7065l2871l6600l9647m1436l9739l5898l3817
58468A569068l3585l1814k8166k5632k4555k2499j9720j8516j7638j3840q642
58457A324461o750q083q180o362o259q131p931m737k242k003j669n11n49j633
58443A259421j495p52j886l616k530L60J289R66K917N662M496N43k02L090N228
58428A273491M499M774P547R863J1020J3426J6262J6118J4514J6649K2105K5122
58416A435390K4640K5463K8561K9187K6040K3338K2036J7699R249J421l479q179
58404A631366j2971j4129j1735j0775j2323j1759p639l975j835K561R366J3480
$$ plain form
58491 2009077 2025053 2034917 2036042 2027118 2011632 1993656 1973896 1953181 1935664 1924240 1915951 1905848
58479 1905848 1892570 1876582 1856141 1829076 1796205 1759605 1719958 1678522 1638783 1602885 1569068
58468 1569068 1535483 1503669 1475503 1449871 1425316 1402817 1383097 1364581 1346943 1333103 1324461
58457 1324461 1317711 1309628 1301448 1295086 1288827 1280696 1272765 1268028 1265786 1263783 1262114 1261603 1261054 1259421
58443 1259421 1257926 1257174 1255288 1251672 1249142 1249502 1250791 1251757 1254674 1260336 1264832 1265375 1265173 1268263 1273491
58428 1273491 1277990 1282764 1290311 1300174 1311194 1324620 1340882 1357000 1371514 1388163 1410268 1435390
58416 1435390 1460030 1485493 1514054 1543241 1569281 1592619 1614655 1632354 1641603 1643024 1639545 1631366
58404 1631366 1618395 1604266 1592531 1581756 1569433 1557674 1550035 1546060 1544225 1546786 1556152 1569632
58392A569632J3782J5182J9102K0710J8200J5813J4763J0277R23p788j2556j6520
58380A661520k1212k2998k0891j9339j9765j7906j2907j0247j1814j1889p097
58369A485455j885q2P43K517K729J292K923Q411J1790J0275Q728J0064R794M786
58355A557540q31l391n464r211j1663j1204j1366j3868j5036j3030j1313j1485
58343A439678j0443p770p635j0113r443m382j166k531l186k07J878P94J352N571
58329A392397P685M449J158J984L386K436K539N460O792M758M549Q569J1490J0277
58315A467929R698J2519J3804J0769Q751J1521J4813J5148J5798J8537J9209J6811
58303A635307J7032K1288K2713J8656J6328J9936K3361K2046K0953K3696K4931
$$ plain form
58392 1569632 1583414 1598596 1617698 1638408 1656608 1672421 1687184 1697461 1698384 1690596 1678040 1661520
58380 1661520 1640308 1617310 1596419 1577080 1557315 1539409 1526502 1516255 1504441 1492552 1485455
58369 1485455 1483570 1483488 1484231 1486748 1489477 1490769 1493692 1502103 1513893 1524168 1532896 1542960 1552754 1557540
58355 1557540 1556709 1553318 1547854 1538643 1526980 1515776 1504410 1490542 1475506 1462476 1451163 1439678
58343 1439678 1429235 1421465 1413830 1403717 1394274 1389892 1388726 1386195 1383009 1382802 1384680 1385474 1386826 1392397
58329 1392397 1400082 1404531 1405689 1407673 1411059 1413495 1416034 1421494 1428286 1433044 1437593 1446162 1457652 1467929
58315 1467929 1477627 1490146 1503950 1514719 1523470 1534991 1549804 1564952 1580750 1599287 1618496 1635307
58303 1635307 1652339 1673627 1696340 1714996 1731324 1751260 1774621 1796667 1817620 1841316 1866247
58292A866247K0958J6945J6301J3796O694J548K377L304O06M59O504J1443R739
58279A976921P330J0021J3514J3666J4994K0195K2963K0360K0263K7158L2693
58268B180078L0231K6519K8556L1141K8147K4192K4188K3123J7136J2916J5278
58257B441505J7348J3928J2033J6988K1076J7787J4387J8091K2712K1597K0666
58246B638118K5700K9846K7086K4851K9653L3622K9460K5115K8994L4162L2376
58235B958983L0208L5560M1483L9533L6157L9680M4050M1767L9610M5031N0423
58224C402485M7688M4776N0564N7359N5992N4031O0841O8984O9060O8408P6003
58213D056191Q3795Q2721Q1935R1683J02553J02942J01506J10295J21390J22978
$$ plain form
58292 1866247 1887205 1904150 1920451 1934247 1940941 1942489 1944866 1948170 1948776 1949235 1955739 1967182 1976921
58279 1976921 1984251 1994272 2007786 2021452 2036446 2056641 2079604 2099964 2120227 2147385 2180078
58268 2180078 2210309 2236828 2265384 2296525 2324672 2348864 2373052 2396175 2413311 2426227 2441505
58257 2441505 2458853 2472781 2484814 2501802 2522878 2540665 2555052 2573143 2595855 2617452 2638118
58246 2638118 2663818 2693664 2720750 2745601 2775254 2808876 2838336 2863451 2892445 2926607 2958983
58235 2958983 2989191 3024751 3066234 3105767 3141924 3181604 3225654 3267421 3307031 3352062 3402485
58224 3402485 3450173 3494949 3545513 3602872 3658864 3712895 3773736 3842720 3911780 3980188 4056191
58213 4056191 4139986 4222707 4304642 4396325 4498878 4601820 4703326 4813621 4935011 5057989
58203E057989J22804J32143J42381J41823J39864J49641J62547J65332J66210
58194F380734J77879J91286J93353J93937K07258K23798K29393K34660K55425
58185H287723K81793K97793L13539L45575L83838M11611M39301M83594N32566
58176A1777333N68068O02859O57126P18168P63365Q02783Q57226R14769R53221
58167A8614918R85033J034382J090768J132896J176498J248327J335299J411712
58159B8029833J493110J607361J737128J850735J965150K115430K287941K451249
58151D3537937K626126K852661L116251L384254L687607M082764M562643N094203
58143G2944446N710139O463135P322453Q224408R191774J0291032J1518683J2860343
$$ plain form
58203 5057989 5180793 5312936 5455317 5597140 5737004 5886645 6049192 6214524 6380734
58194 6380734 6558613 6749899 6943252 7137189 7344447 7568245 7797638 8032298 8287723
58185 8287723 8569516 8867309 9180848 9526423 9910261 10321872 10761173 11244767 11777333
58176 11777333 12345401 12948260 13605386 14323554 15086919 15889702 16746928 17661697 18614918
58167 18614918 19599951 20634333 21725101 22857997 24034495 25282822 26618121 28029833
58159 28029833 29522943 31130304 32867432 34718167 36683317 38798747 41086688 43537937
58151 43537937 46164063 49016724 52132975 55517229 59204836 63287600 67850243 72944446
58143 72944446 78654585 85117720 92440173 100664581 109856355 120147387 131666070 144526413
58135A44526413J4400778J6210130J8182505K0187358K2333044K4884345K8038340
58128B88762913L2040100L7170911M2743003M5892369M2411384L0014512J0987849
58121E30023041q896956k4298063l3178441l6531084l6436040l4715108l2583249
58114C23384100l0577600k8624367k6466071k4103076k1753693j9546346j7470842
58107A54842105j5552533j3863045j2383532j1022761r759774q641259p660048
58100G5959153o757645n930708n224601m632913m101763l622802l230810k918004
58092C9539907k635231k371745k156297j984933j820086j656798j522726j416307
58084B3975784j307412j195232j106262j038689r64918q85270q25257p83209p32754
$$ plain form
58135 144526413 158927191 175137321 193319826 213507184 235840228 260724573 288762913
58128 288762913 320803013 357973924 400716927 446609296 489020680 519035192 530023041
58121 530023041 521126085 496828022 463649581 427118497 390682457 355967349 323384100
58114 323384100 292806500 264182133 237716062 213612986 191859293 172312947 154842105
58107 154842105 139289572 125426527 113042995 102020234 92260460 83619201 75959153
58100 75959153 69201508 63270800 58046199 53413286 49311523 45688721 42457911 39539907
58092 39539907 36904676 34532931 32376634 30391701 28571615 26914817 25392091 23975784
58084 23975784 22668372 21473140 20366878 19328189 18363271 17478001 16652744 15869535 15136781
58075A5136781o74346o34120o13448n87497n52338n27293n11710m84430m46325
58066A0105274m20430m08990l91037l63371l44584l37064l23034l00054k84310
58057F932400k76823k61422k38186k25063k24021k17848k02697j92574j89614
58048D904152j80487j64448j55471j54474j47929j35543j31008j33767j28381
58039C572644j13971j06534j09531j09286j02298j00292j04781j02823r2233q6159
58029B544736q8310q7362p9881p5718p6778p3039o3424n8693o0076n6766m7822
58018A776867m4806m9186m8823m0842l6552l9422l9223l2838l0263l4629l6127
58007A344156l1207k8743l1683l1207k4726k1614k5174k6288k0748j6328j7102
$$ plain form
58075 15136781 14462435 13828315 13214867 12627370 12075032 11547739 11036029 10551599 10105274
58066 10105274 9684844 9275854 8884817 8521446 8176862 7839798 7516764 7216710 6932400
58057 6932400 6655577 6394155 6155969 5930906 5706885 5489037 5286340 5093766 4904152
58048 4904152 4723665 4559217 4403746 4249272 4101343 3965800 3834792 3701025 3572644
58039 3572644 3458673 3352139 3242608 3133322 3031024 2930732 2825951 2723128 2630895 2544736
58029 2544736 2456426 2369064 2289183 2213465 2136687 2063648 2000224 1941531 1881455 1824689 1776867
58018 1776867 1732061 1682875 1634052 1593210 1556658 1517236 1478013 1445175 1414912 1380283 1344156
58007 1344156 1312949 1284206 1252523 1221316 1196590 1174976 1149802 1123514 1102766 1086438 1069336
57996A069336j6889j3580j4075j9573k1375j6542j2985j4156j3464q547o466r826
57984I01858j1690q916p037p884o092j606j870p723j0729q204p194j0167j0739
57971H02007p334p002j1597j3952j1869j2190j6842j8458j4319j1276j2429j2113
57959F52626q391p250r989r694m804k898o366p601l491j389n123q046n749l318
57945E68517m118l603o0N13l707n337p63L248J904K33K417M282K640J646L580
57930E71392L462j104m645m017m004p203q369m659j606l139n158m492m572o784
57916E15102o090r57K166j03k212m63M56k376l561M26M135L003J163K676L990
57901E17355J836l0J282J696j497l619j536j15l012n444l295j170l951p885p635
$$ plain form
57996 1069336 1052447 1038867 1024792 1005219 983844 967302 954317 940161 926697 918150 911684 901858
57984 901858 890168 881252 874215 866331 860239 858633 856763 849040 838311 830107 822913 812746 802007
57971 802007 794673 787671 776074 762122 750253 738063 721221 702763 688444 677168 664739 652626
57959 652626 644235 636985 626996 617302 612498 609600 603234 595633 592142 590753 585630 577584 571835 568517
57945 568517 564399 560796 560736 561249 557542 552205 551442 554690 556594 556827 559244 563526 566166 567812 571392
57930 571392 574854 573750 569105 565088 561084 553881 545512 540853 539247 536108 530950 526458 521886 515102
57916 515102 509012 508055 510221 510118 507906 507443 507899 505523 501962 502388 506523 509526 510689 513365 517355
57901 517355 519191 519161 520443 522139 520642 517023 515487 515372 512360 506916 503621 502451 498500 490615 482980
57886D82980n162m445m009j656j43j462j825J428M292L419K381M589O733N370
57872D92490L393L892M290K461J808M088M404k48m513l482j034k341m819m070
57858D96319k545m469p675p953o679p154q029o925n779o536o361l118l52j066
57844D21678j902M52K766J235j627k330k835n258n983k013K353K235K33P26J484
57829D11214j393n069m402p05J328J693L030M205K975J503K594L810J766j286
57815D21263j413J65L39L38K490M602L999L141N010O839N031K270K980N537N915
57800D68506N336P194R838R611P872Q054Q796O993M526M877O118M380J428J439
57786E54968K999J796j182j728n05j448l953m153k611l232n679o117m659m864
$$ plain form
57886 482980 477818 473373 469364 467708 467565 466103 464278 465706 469998 473417 475798 480387 487120 492490
57872 492490 495883 499775 504065 506526 508334 512422 516826 516578 512065 508583 507549 505208 500389 496319
57858 496319 493774 489305 481630 473677 466998 459844 451815 444890 439111 432575 426214 423096 422744 421678
57844 421678 419776 420228 422994 424229 422602 420272 417437 412179 406196 404183 406536 408771 409004 409730 411214
57829 411214 409821 404752 400350 399645 400973 402666 405696 409901 412876 414379 416973 420783 422549 421263
57815 421263 419850 420015 420354 420692 423182 427784 431783 434924 439934 446773 451804 454074 457054 462591 468506
57800 468506 473842 481036 490874 500485 508357 516411 525207 532200 536726 541603 547721 552101 553529 554968
57786 554968 557967 559763 558581 556853 556348 554900 550947 546794 544183 540951 535272 529155 524496 519632
57772E19632o460n605k303p83k185l125k002r74j116q29L10P26L54Q09J977K155
57756E00581J332Q48O19k8l7J454K433Q64j647k674l258n375p477p000n262n427
57740D69946p307q559r079r988j0126p923m970l806m019m107m588n639m776j083
57726C83976J667N58j391o13N19j668m730l920l91J222R55K391N182N604L397
57711C92758J790J651J287Q71J521J507j172m057l733k042l022n665o020m529
57697C71145m651n832m690j924j066j284J435O489R011P908O916P526P408O076
57683D04467N872O808O227M035K787K660J776J106L096N857N071J604P77L621
57669D55764N423L720J557J480K058J789J386R35o29k451k602j952k697l553j708
$$ plain form
57772 519632 513172 507567 505264 504481 502296 499171 497169 496195 495079 494250 494560 495286 495640 496449 498426 500581
57756 500581 501913 502761 503380 503352 503315 504769 507202 508066 506419 503745 500487 495112 487635 480635 475373 469946
57740 469946 462639 454080 445001 435013 424887 416964 411994 408188 404169 400062 395474 389835 385059 383976
57726 383976 385643 386201 384810 384197 384716 383048 378318 374398 374007 375229 376184 378575 383757 389361 392758
57711 392758 394548 396199 397486 398357 399878 401385 400213 396156 392423 390381 387359 381694 375674 371145
57697 371145 366494 360662 355972 354048 352982 351698 353133 359622 368633 376541 383457 390983 398391 404467
57683 404467 410339 417147 423374 427409 430196 432856 434632 435738 438834 444691 449762 451366 452143 455764
57669 455764 461187 464907 466464 467944 470002 471791 473177 474112 473483 471032 468430 466478 463781 460228 458520
57654D58520J071K31l897o330n505m830n763n735l962l066l620l010r91o34k453
57639D10026l176j710p59j254p83J071J550M00R44L783N028K912P11R62J878J737
57623D23320J806K754K954K462L948P622R957R580R638J2177J4818J5552J6335
57610E32923J9322K3458K7329L1663L6706M0300M0274L5770K5538Q993j0072k5165
57598G87039l3765l8392m0656l9266l4759l0670k8121k4559j9716j7393j8912
57587D60830k0052j7449j3320j0926r688p828n817m423k896j455j796l222k481
57574C59477N29J536j227l763k823j003j825m015m575m002m451n548n612m820
57560C17878m176l373k112j429j831k256k208k274j756P73L674L065j138m325
$$ plain form
57654 458520 459591 459822 455925 449595 444090 439260 433497 427762 423800 420734 417114 414104 413113 412479 410026
57639 410026 406850 405140 404381 403127 402344 403415 404965 405365 406309 410092 415120 418032 418743 419705 421583 423320
57623 423320 425126 427880 430834 433296 437244 444866 454823 464403 474041 486218 501036 516588 532923
57610 532923 552245 575703 603032 634695 671401 711701 751975 787745 813283 822276 812204 787039
57598 787039 753274 714882 674226 634960 600201 569531 541410 516851 497135 479742 460830
57587 460830 440778 423329 410009 399083 389395 381567 375750 371327 368431 366976 365180 361958 359477
57574 359477 360006 361542 360315 356552 353729 352726 350901 346886 342311 338309 333858 328310 322698 317878
57560 317878 313702 310329 308217 306788 304957 302701 300493 298219 296463 297236 300910 303975 302837 298512
57546B98512m015k994l719m305k863j241j317j596p28n83k525m215l424j793j604
57531B61590j962j250m14p52j276j031j250k663l626l390m047o644q557p414m656
57516B12658k648j336j13K29k29L29J769J190j849l439j382J069P70l04P07K418
57500B09839K437K032L100L762J571j601k256n30J242K788M684N343L367R54R22
57485B37654K156J765m1r42o16j72Q79L433N978O311M867L404K029L60j06J999
57469B68958N016O234N426M050K679J653K226M507O153N612M624N210O515P019
57455C35882P259P829P409N542M520N577O158M131J793K141L899L970K374J107
57441C99591M51j01L91K129K632M25j935j996j676l503n602m880k573j952k807
$$ plain form
57546 298512 294497 291503 287784 283479 280616 279375 278058 276462 275734 275151 272626 268411 264987 263194 261590
57531 261590 259628 258378 257964 257212 255936 254905 253655 250992 247366 243976 239929 233285 224728 217314 212658
57516 212658 210010 208674 208561 208790 208561 208890 210659 211849 210000 206561 205179 206248 207018 206714 207421 209839
57500 209839 212276 214308 217408 221170 222741 221140 218884 218354 219596 222384 227068 232411 235778 236732 237654
57485 237654 239810 241575 241534 240592 239976 239804 240683 244116 250094 256405 261272 264676 266705 267065 266959 268958
57469 268958 273974 280208 285634 289684 292363 294016 296242 300749 306902 312514 317138 322348 328863 335882
57455 335882 343141 350970 358379 363921 368441 374018 380176 384307 386100 388241 392140 396110 398484 399591
57441 399591 400042 399941 400332 402461 405093 405518 403583 401587 399911 396408 390806 385926 383353 381401 378594
57426C78594k921k827m234n543m043j108k41j176p67J289K454K257K477K960J855
57411C69026k51q41K6j66j774k347p44J567L391M867N647M977L496K553K192J839
57395C93458J896K458K206R45J044L569N439L927J349J330K900K845J706K368
57381D27440M317M494K862K180K963L478L949O001Q429Q407O532N973O949O759
57367E00733N060M348N045M895L516L112M162M698M366N094P109Q268P899P652
57353E75957Q054P827O928O835P571P808P882R129J0546R816P513O462P108P412
57339F86848P089P737Q901Q400O664O390P662P812O519O502Q503R936R459Q675
57325G97097Q427P498N927N642O809P315O698O747P656P608O826P718J0154J0910
$$ plain form
57426 378594 375673 372846 368612 363069 359026 357918 357677 356501 355734 357023 359477 361734 364211 367171 369026
57411 369026 368775 367934 367960 367794 366020 363673 362929 364496 367887 372754 378401 383378 386874 389427 391619 393458
57395 393458 395354 397812 400018 400963 402007 405576 411015 414942 416291 417621 420521 423366 425072 427440
57381 427440 431757 436251 439113 441293 444256 447734 451683 457684 466113 474520 481052 487025 493974 500733
57367 500733 505793 510141 515186 520081 523597 526709 530871 535569 539935 545029 552138 560406 568305 575957
57353 575957 584011 591838 598766 605601 613172 620980 628862 637991 648537 658353 665866 672328 679436 686848
57339 686848 693937 701674 710575 718975 725639 732029 739691 747503 754022 760524 769027 778963 788422 797097
57325 797097 805524 813022 818949 824591 831400 838715 845413 852160 859816 867424 874250 881968 892122 903032
57311I03032R034P325P158O331L797K249L743O396P686P797P758P361O821P559
57297I94047R646J1126J1110J0815J0550Q912O130M829O128Q080R285J0744J2833
57284A114235J3860J3242J2829J3473J3389J1511R544Q992R153R491J0894J3041
57272A253654J3589J1737R777R508R928R960J0422J1688J2268J1587J1401J2761
57260A388280J4154J4275J4070J4440J4475J3625J3199J4089J5177J5234J4359
57249A545377J2787J0670R540J1067J3845J4594J3195J2962J4995J6241J4628
57238A689901J2243J1478J1639J1520J2035J4031J6291J7708J8725J9096J7412
57227A852079J4416J3531J6094J9344K0899K1830K3263K3721K2451K2013K4526
$$ plain form
57311 903032 912066 919391 926549 932880 936677 938926 942669 949065 956751 964548 972306 979667 986488 994047
57297 994047 1003693 1014819 1025929 1036744 1047294 1056206 1062336 1067165 1073293 1081373 1090658 1101402 1114235
57284 1114235 1128095 1141337 1154166 1167639 1181028 1192539 1202083 1211075 1220228 1229719 1240613 1253654
57272 1253654 1267243 1278980 1288757 1298265 1308193 1318153 1328575 1340263 1352531 1364118 1375519 1388280
57260 1388280 1402434 1416709 1430779 1445219 1459694 1473319 1486518 1500607 1515784 1531018 1545377
57249 1545377 1558164 1568834 1578374 1589441 1603286 1617880 1631075 1644037 1659032 1675273 1689901
57238 1689901 1702144 1713622 1725261 1736781 1748816 1762847 1779138 1796846 1815571 1834667 1852079
57227 1852079 1866495 1880026 1896120 1915464 1936363 1958193 1981456 2005177 2027628 2049641 2074167
57216B074167K8109K9954L0337L0926L1466L0874K9484K7879K5574K2817K1288
57205B382875K1191K0312J7896J6479J7630J9010J8267J6928J7510J9407K0643
57194B588148K1293K2248K2747K2026K1389K1909K2144K0754J9342J9839K1034
57183B822873K0572J8672J7233J6765J6653J6881J7204J6445J4805J4954J8403
57172C011460K2698K4751K5042K5870K7295K7787K7566K8408L0924L4357L8188
57161C324346M2040M5068M7106M9348N2335N4723N5494N5769N6840N8142N8828
57150C900039N9552O0890O1614O0333N7494N4448N1890N0208M9525M8545M5540
57139D500078M1347L8883L8791L8341L5685L2032K8253K2640J3976L827o175j6392
$$ plain form
57216 2074167 2102276 2132230 2162567 2193493 2224959 2255833 2285317 2313196 2338770 2361587 2382875
57205 2382875 2404066 2424378 2442274 2458753 2476383 2495393 2513660 2530588 2548098 2567505 2588148
57194 2588148 2609441 2631689 2654436 2676462 2697851 2719760 2741904 2762658 2782000 2801839 2822873
57183 2822873 2843445 2862117 2879350 2896115 2912768 2929649 2946853 2963298 2978103 2993057 3011460
57172 3011460 3034158 3058909 3083951 3109821 3137116 3164903 3192469 3220877 3251801 3286158 3324346
57161 3324346 3366386 3411454 3458560 3507908 3560243 3614966 3670460 3726229 3783069 3841211 3900039
57150 3900039 3959591 4020481 4082095 4142428 4199922 4254370 4306260 4356468 4405993 4454538 4500078
57139 4500078 4541425 4580308 4619099 4657440 4693125 4725157 4753410 4776050 4790026 4793853 4787678 4771286
57127D771286k6799l5640m2477m9526n7859o5266o9773p2134p3028p1276o6987
57116D140521o2961o0635n8121n4384n1479n0113m7175m0790l3987l0139k8582
57105C622155k8029l0271l6628m4545n1683n9990p1510q3464r1697r6076r8450
57094B929812r8417r5347r1737r0243r0028r0053r3046j01861j14445j26689j37801
57083A800145j48901j59031j66784j73535j81003j87831j91993j93978j94412
57074B02677A0796a75860j82947j83573j86305j89286j96051k10793k32827k60403
57064a818045k95516l39841l90126m42948m99900n63054o30126o99774p76688
57055f456018q64978r61232j060702j165718j281462j408546j546987j702419
$$ plain form
57127 4771286 4744487 4708847 4666370 4616844 4558985 4493719 4423946 4351812 4278784 4207508 4140521
57116 4140521 4077560 4016925 3958804 3904420 3852941 3802828 3755653 3714863 3680876 3650737 3622155
57105 3622155 3594126 3563855 3527227 3482682 3430999 3371009 3299499 3216035 3124338 3028262 2929812
57094 2929812 2831395 2736048 2644311 2554068 2464040 2373987 2280941 2179080 2064635 1937946 1800145
57083 1800145 1651244 1492213 1325429 1151894 970891 783060 591067 397089 202677
57074 202677 10796 -175860 -358807 -542380 -728685 -917971 -1114022 -1324815 -1557642 -1818045
57064 -1818045 -2113561 -2453402 -2843528 -3286476 -3786376 -4349430 -4979556 -5679330 -6456018
57055 -6456018 -7320996 -8282228 -9342930 -10508648 -11790110 -13198656 -14745643 -16448062
57047a6448062j880920k082940k310335k574113k887322l256350l688049m199725
57039c9327816m814255n554384o452438p554030q892412j0459220j2211419j4103773
57031a09369747j6105175j8186008k0289054k2299854k4066479k5527459k6864236
57024b62708012k8423975l0301616l1917903l2118604k9854858k4858446j7711289
57017d57894703r360683o37545P854271J5613176K2177933K7197505L0508069
57010c64541977L2141100L2291368L1272534K9451855K7173692K4708108K2240192
57003a65263128J9883557J7699981J5717647J3941890J2358105J0937717R652597
56996f5071634Q486323P432322O486623N645851M907464M266341L712659L235703
$$ plain form
57047 -16448062 -18328982 -20411922 -22722257 -25296370 -28183692 -31440042 -35128091 -39327816
57039 -39327816 -44142071 -49696455 -56148893 -63702923 -72595335 -83054555 -95265974 -109369747
57031 -109369747 -125474922 -143660930 -163949984 -186249838 -210316317 -235843776 -262708012
57024 -262708012 -291131987 -321433603 -353351506 -385470110 -415324968 -440183414 -457894703
57017 -457894703 -467255386 -467892931 -460038660 -444425484 -422247551 -395050046 -364541977
57010 -364541977 -332400877 -300109509 -268836975 -239385120 -212211428 -187503320 -165263128
57003 -165263128 -145379571 -127679590 -111961943 -98020053 -85661948 -74724231 -65071634
56996 -65071634 -56585311 -49152989 -42666366 -37020515 -32113051 -27846710 -24134051 -20898348
56988b0898348K827186K478377K177384J913143J680299J477554J303181J154528
56980e886696J029545R25621Q38078P62145O95412O36747d14805A21823M93980
56971F15803M57374M26117L98147L72135L48218L27322L10516K98248K89105K79440
56961D122425K64525K40337K05393J62603J19172Q2927N7794M2996L5700L2988
56951E366860L1779K9390K5233K0790J7257J3961R477L319l912j1548j9552k8467
56939E454587l8716n0030o1895p4398q7734j00841j11910j20751j29190j38335
56929D540787j47025j54141j60827j68610j76431j81383j81917j78939j74359
56920C017155j69734j65574j60724j53116j42218j29970j18380j07374r6140q5194
$$ plain form
56988 -20898348 -18071162 -15592785 -13415401 -11502258 -9821959 -8344405 -7041224 -5886696
56980 -5886696 -4857151 -3931530 -3093452 -2331307 -1635895 -999148 -414805 121823 615803
56971 615803 1073177 1499294 1897441 2269576 2617794 2945116 3255632 3553880 3842985 4122425
56961 4122425 4386950 4627287 4832680 4995283 5114455 5197382 5255176 5298172 5333872 5366860
56951 5366860 5398639 5428029 5453262 5474052 5491309 5505270 5514747 5518066 5514154 5502606 5483054 5454587
56939 5454587 5415871 5365841 5303946 5229548 5141814 5040973 4929063 4808312 4679122 4540787
56929 4540787 4393762 4239621 4078794 3910184 3733753 3552370 3370453 3191514 3017155
56920 3017155 2847421 2681847 2521123 2368007 2225789 2095819 1977439 1870065 1773925 1688731
56910A688731p5672o7647o0813n5645n2263m9104m4495l8721l3000k7452k1793
56899A162126j6989j4195j2727j1253j0527j2976j9419k7839l5397m0446m2687
56888I17671m2594m0814l7611l3239k9077k7039k6982k6182k2641j7631j3529
56877F00332j0502p199l545n66J994N735J1209J6828K0001J8414J0966r34j3339
56864F49394k2334k6635k7111k4883k1062j7305j4853j3371j1837j0127q653p231
56852D43992n398l389j783p60l67o19p72K77K117K819J777Q11J367K447K752L037
56836D48308M342N643N424M371M240N197O252P328Q846J0252J1058J2201J4302
56823E47764J5467J3252Q056K519j770m791o236n661m084l069k355m80K535N193
$$ plain form
56910 1688731 1613059 1545412 1484599 1428954 1376691 1327587 1283092 1244371 1211371 1183919 1162126
56899 1162126 1145137 1130942 1118215 1106962 1096435 1083459 1064040 1036201 1000804 960358 917671
56888 917671 875077 834263 796652 763413 734336 707297 680315 654133 631492 613861 600332
56877 600332 589830 582631 579086 578520 580514 586249 597458 614286 634287 652701 663667 662733 649394
56864 649394 627060 600425 573314 548431 527369 510064 495211 481840 470003 459876 451223 443992
56852 443992 438594 435205 433422 432662 432295 431676 430904 431181 433298 436117 437894 438705 440072 442519 445271 448308
56836 448308 452650 458293 463717 468088 472328 477525 483777 491105 499951 510203 521261 533462 547764
56823 547764 563231 576483 584539 587058 585288 580497 574261 568600 564516 561447 559092 558612 561147 566340
56809E66340P019Q948J1357J3730J6243J9721K3978K8040L2089L7237M2956M6326
56797H53984M4407L6456K3828R048m912j5672k2371k5309k5029k2299j8227j3526
56785H20378q216k681J957N431R132J4159J9650K4378K8931L4781M2001M9385
56773A039286N5830N9992N9246N0780L3923J0910j3665l3914m5332m8174m6893
56762A121989m4921m1603l5513k8382k3125j9687j5819j0862n943j155M574J1031
56750I10584J6660K1121K5796L1569L7293M0196L6811K4821N940j3891k8946l7817
56738A070137m2006m2344l9081l4107l0002k7256k4538k1189j7564j3688r603
56727G68759o195l808j049L072P201J0013J2852J7098K0399J8766J1697K257o994
$$ plain form
56809 566340 573359 582307 593664 607394 623637 643358 667336 695376 727465 764702 807658 853984
56797 853984 898391 934847 958675 967723 962811 947139 924768 899459 874430 852131 833904 820378
56785 820378 812162 809481 811438 816869 826001 840160 859810 884188 913119 947900 989901 1039286
56773 1039286 1095116 1155108 1214354 1265134 1299057 1309967 1296302 1262388 1217056 1168882 1121989
56762 1121989 1077068 1035465 999952 971570 948445 928758 912939 902077 896134 894979 899553 910584
56750 910584 927244 948365 974161 1005730 1043023 1083219 1120030 1144851 1150791 1136900 1107954 1070137
56738 1070137 1028131 985787 946706 912599 882597 855341 830803 809614 792050 778362 768759
56727 768759 762564 758756 757707 760779 767980 777993 790845 807943 828342 847108 858805 861062 854068
56714H54068j5060k0585k2585k2722k3437k4107k2430j9193j7764j8687j8772
56703F28726j6329j3632j2960j3362j2951j1746j0738j0135r772r572q887p041
56691D91601m953m352n137n533m991m740n178n147m228l501l474l350k828k641
56677D31548k736j972j45J468J971J566M37j238k231j311O02J347M65q01j998
56662D26972l417l992k206P71J802J44j616j401K13K065L820M739L824J909J133
56647D34760J700J740P74M67J394K106K205L134M783M601J714j069j258r5Q5n10
56631D56531l45M72P31L19o8m00j033j777k279k468k009n43J174J722J012L05
56615D51344Q6k38l63P40K318K071k61k036j536j95K84N22J529K447K206J761
$$ plain form
56714 854068 839008 818423 795838 773116 749679 725572 703142 683949 666185 647498 628726
56703 628726 612397 598765 585805 572443 559492 547746 537008 526873 517101 507529 498642 491601
56691 491601 486648 482296 477159 471626 466635 461895 456717 451570 447342 443841 440367 437017 434189 431548
56677 431548 428812 426840 426695 428163 430134 431700 432137 430899 428668 427357 427959 429306 429771 428970 426972
56662 426972 423555 419563 417357 418128 419930 420074 418458 417057 417270 419335 423155 427894 431718 433627 434760
56647 434760 436460 438200 438974 439441 440835 442941 445146 448280 453063 457664 459378 458309 457051 456956 457041 456531
56631 456531 456186 456658 457389 457708 457640 457240 456207 454430 452151 449683 447674 447131 448305 450027 451039 451344
56615 451344 451430 451192 450829 451569 453887 455958 455697 453661 452125 451930 452214 452736 454265 456712 458918 460679
56599D60679K590M221N040M660M056L998M415M656L756J279j615k992k365j174
56585D91204r52k169m574p108p705n314j988q53k000k821k357k407l856m889l994
56570D38217k073n00N79J029L47m92N86L257M350K351k26p04J58L52J37Q82K177
56553D50427K486J566K74j040k308k883k293j126r7P49J197N77q02j432p82k77
56537D44236j165k763l804m104l898k914j047J107L027M383M315K272r2m8K484
56522D41989M362L302O16j017p06P32K240K854K066O21q1K21Q15J728L427N062
56506D68231N406N417P162J0190J1942J2015J2705J4677J5599J4211J2384J1651
56494F01590J0844Q778O376M461K221n13k167k179k090k434j522R33K182M89k066
$$ plain form
56599 460679 463269 467490 472530 477190 481246 485244 489659 494315 498071 499350 497735 494743 492378 491204
56585 491204 490252 488083 483509 476401 468696 463382 461394 460541 458541 455720 453363 450956 447100 442211 438217
56570 438217 436144 435644 436223 437252 437599 437107 437693 440950 445300 447651 447425 446721 446879 447231 447368 448250 450427
56553 450427 452913 454479 454753 453713 451405 448522 446229 445103 445006 445755 446952 447529 446727 445295 444513 444236
56537 444236 443071 440308 436504 432400 428502 425588 424541 425648 428675 433058 437373 439645 439553 439505 441989
56522 441989 446351 449653 450269 449252 448546 449278 451518 454372 456438 457059 456978 457199 458014 459742 463169 468231
56506 468231 473637 479054 486216 496406 508348 520363 533068 547745 563344 577555 589939 601590
56494 601590 612434 621212 627588 632049 634270 633757 631590 629411 627321 624887 623365 624298 626480 626969 624903
56479F24903l063l219m043m798m413m024m909n913n423m149l536l218k251j270
56465E70674j307k005k698l666m830n078m343m190m986m874l043j428j450j825
56451E24951j436j493k677l041j376J00q31k674k867j917k010l307m382m801m830
56436D87409m133k825k306l111l714l040j985j106N01K354J952q95k522q80R54
56421D66653j35k135j611N67J326P53R97J777J299J10O2O26jj317j505q28o20
56404D66018k29J481K923J775p68j508k29M06n44j249o11L77Q42J016J048Q83
56388D71631J150K235L146K964K498K831L309K824J774J054M76j39R6J366K233
56373D99448K090K259L104K658K58j365j37K100L020L497M835N427L745J834J993
$$ plain form
56479 624903 621840 618621 614578 609780 605367 601343 596434 590521 585098 580949 577413 574195 571944 570674
56465 570674 569367 567362 564664 560998 556168 551090 546747 542557 537571 532697 529654 528226 526776 524951
56451 524951 523515 522022 519345 516304 514928 515028 514197 511523 508656 506739 504729 501422 497040 492239 487409
56436 487409 483276 480451 478145 475034 471320 468280 466295 465189 465690 468044 469996 469101 466579 465699 466653
56421 466653 466518 464383 462772 463339 464665 465418 466415 468192 469491 469601 469663 470289 470288 468971 467466 466638 466018
56404 466018 465789 467270 470193 471968 471200 469692 469463 469869 469325 468076 467465 467842 468684 469700 470748 471631
56388 471631 472781 475016 478162 481126 483624 486455 489764 492588 494362 495416 495892 495753 495849 497215 499448
56373 499448 501538 503797 506901 509559 509817 508452 508315 510415 513435 516932 521767 527194 530939 532773 534766
56358E34766K631J328m30J57K041K112L96p54j036j783k575k189j517j878k040
56343E29229n50Q85J32j242p02M91k80j746q23J568J795l99j939j768j482j205
56327E21964N34L151M434M328M439M422K820P87Q84K722L709L493L777M412L726
56312E69602K156J744K507K869K826L161K732L57j891j241J107K002J558K044
56298E91533L008K299P86J244L307M189L635L536L632K288O91J311L085L000J679
56283F29223K261M442M963L619L342M525M548L139L037N016O889P648Q177Q033
56269F98862O082L860L774M549L273J048J295L298L232J136Q26K837L561J826
56255G39459M91Q47R88M86J283L258M043L724M593O024N114K611K511N277P212
$$ plain form
56358 534766 537397 538725 538295 538452 540493 542605 543001 542247 541211 539428 536853 534664 533147 531269 529229
56343 529229 528679 529564 529696 528454 527752 528243 527963 526217 525394 526962 528757 528358 526419 524651 523169 521964
56327 521964 522498 525649 530083 534411 538850 543272 546092 546879 547763 550485 554194 557687 561464 565876 569602
56312 569602 571758 573502 576009 578878 581704 584865 587597 587954 586063 584822 585929 587931 589489 591533
56298 591533 594541 596840 597626 598870 602177 606366 610001 613537 617169 619457 620148 621459 624544 627544 629223
56283 629223 631484 635926 640889 644508 647850 652375 656923 660062 663099 668115 675004 682652 690829 698862
56269 698862 704944 708804 712578 717127 720400 721448 722743 726041 729273 730409 731235 734072 737633 739459
56255 739459 739950 740797 741785 742271 743554 746812 750855 754579 759172 765196 770310 772921 775432 780709 787921
56240G87921P170Q085J0975J3146J3339J3228J3085J1465R649J0661J3338J3455
56228I25517J1322J1835J6019J9161J8902J8556K0531K2609K3051K3551K5008
56217A136062K5666K5435K6727K9500L0819L0716L2776L7487M0949M1818M3377
56206A501332M6978M9616N0217N2222N7429O3050O7303P2404P9688Q7051R3500
56195B220790J00957J09729J17589J24972J35402J49099J62039J72895J84695
56186C478167J97950K08855K16368K24207K33332K39099K38761K35058K29349
56177E501146K17767J97670J71875J43226J10815P4654L8201L164l2491o8675
56167F357352j01250j28453j53065j75762j92914k03566k11651k18517k20387
$$ plain form
56240 787921 795091 803176 814151 827297 840636 853864 866949 878414 888063 898724 912062 925517
56228 925517 936839 948674 964693 983854 1002756 1021312 1041843 1064452 1087503 1111054 1136062
56217 1136062 1161728 1187163 1213890 1243390 1274209 1304925 1337701 1375188 1416137 1457955 1501332
56206 1501332 1548310 1597926 1648143 1700365 1757794 1820844 1888147 1960551 2040239 2127290 2220790
56195 2220790 2321747 2431476 2549065 2674037 2809439 2958538 3120577 3293472 3478167
56186 3478167 3676117 3884972 4101340 4325547 4558879 4797978 5036739 5271797 5501146
56177 5501146 5718913 5916583 6088458 6231684 6342499 6417153 6455354 6458518 6426027 6357352
56167 6357352 6256102 6127649 5974584 5798822 5605908 5402342 5190691 4972174 4751787
56158D751787k16266k10934k06639j99533j88190j77909j71849j65445j54598
56149C060424j42480j32995j24311j14106j04853r8545r2310q4318p7976p5243
56139B013287p2045o5283n8294n4203n0203m3729l8043l6000l4365k9975k5775
56128A505372k4978k4898k2273j9297j8706j8287j5691j3426j3739j3846j1379
56117A308852r052q902p720l367L21K84j41K210M341L345K527N295Q775R428R254
56102A325450J0750J1641J0399J0793J4941J8134J6695J4771J6919K0320K0846
56091A491659K0691K3217K6294K7416K9501L5028M0445M2783M5579N1844N8010
56080A892467O1521O7199P8662R0581R7254J01743J08173J11967J06788R5138
$$ plain form
56158 4751787 4535521 4324587 4117948 3918415 3730225 3552316 3380467 3215022 3060424
56149 3060424 2917944 2784949 2660638 2546532 2441679 2343134 2250824 2166506 2088530 2013287
56139 2013287 1941242 1875959 1817665 1763462 1713259 1669530 1631487 1595487 1561122 1531147 1505372
56128 1505372 1480394 1455496 1433223 1413926 1395220 1376933 1361242 1347816 1334077 1320231 1308852
56117 1308852 1299800 1290898 1283178 1279811 1280132 1280416 1280275 1282485 1286826 1290171 1292698 1297993 1306768 1316196 1325450
56102 1325450 1336200 1347841 1358240 1369033 1383974 1402108 1418803 1433574 1450493 1470813 1491659
56091 1491659 1512350 1535567 1561861 1589277 1618778 1653806 1694251 1737034 1782613 1834457 1892467
56080 1892467 1953988 2021187 2099849 2190430 2287684 2389427 2497600 2609567 2716355 2811493
56070B811493Q3406P2290O0539N1994M9796M9084M3913L6018K8807J9263M586
56059C311189r538j6711j9979k5275l1051l3894l8212m9963o5877p8593q7506
56048B854590r5264r9168r5789q9037q4114p8651o8860n8605n2875m8268l9749
56037B044210l0838k6971k4919j9066j2251r795q872m366P94J813K160O557J0479
56024A928935Q141M389O681J1687J2186J0979J4945K1166K2148J9643K0315K2742
56012B103957K1637J9783K2959K7874K7892K5558K7040K9638K7622K4575K6845
56001B385380L0767K9611K6984K9813L4571L4395L2927L6684M0871L7955L3024
55990B752982L4864L9118L6839L2340L5084M0967L9837L5170L7611M4968M7459
$$ plain form
56070 2811493 2894899 2967189 3027728 3079722 3129518 3178602 3222515 3258533 3287340 3306603 3311189
56059 3311189 3301651 3284940 3264961 3239686 3208635 3174741 3136529 3086566 3020689 2942096 2854590
56048 2854590 2759326 2660158 2564369 2475332 2391218 2312567 2243707 2185102 2132227 2083959 2044210
56037 2044210 2013372 1986401 1961482 1942416 1930165 1920370 1911498 1907132 1907926 1909739 1911899 1918456 1928935
56024 1928935 1937076 1941465 1948146 1959833 1972019 1982998 1997943 2019109 2041257 2060900 2081215 2103957
56012 2103957 2125594 2145377 2168336 2196210 2224102 2249660 2276700 2306338 2333960 2358535 2385380
56001 2385380 2416147 2445758 2472742 2502555 2537126 2571521 2604448 2641132 2682003 2719958 2752982
55990 2752982 2787846 2826964 2863803 2896143 2931227 2972194 3012031 3047201 3084812 3129780 3177239
55979C177239M6947N1947N9130N9351N6596O1284P0072P2239P0669P6050Q5711
55968C887235Q9157Q9247R6262J06238J07361J02977J05820J14285J17254J17344
55958D933180J25667J38389J42895J42678J51381J66645J74975J78082J88604
55949F342496K04405K13573K20153K37638K61785K77960K90311L14521L46935
55940H709777L71473L91837M24894M67114N00926N29696N71758O23903O66446
55931A3257824P00504P43555P92132Q27287Q53118Q90436R36527R72611J006242
55922B0980236J062398J137039J205624J272650J363547J472562J571759J667753
55914C1733568J793675J948373K102834K263517K465772K707543K958196L231667
$$ plain form
55979 3177239 3224186 3276133 3335263 3394614 3451210 3512494 3582566 3654805 3725474 3801524 3887235
55968 3887235 3976392 4065639 4161901 4268139 4375500 4478477 4584297 4698582 4815836 4933180
55958 4933180 5058847 5197236 5340131 5482809 5634190 5800835 5975810 6153892 6342496
55949 6342496 6546901 6760474 6980627 7218265 7480050 7758010 8048321 8362842 8709777
55940 8709777 9081250 9473087 9897981 10365095 10866021 11395717 11967475 12591378 13257824
55931 13257824 13958328 14701883 15494015 16321302 17174420 18064856 19001383 19973994 20980236
55922 20980236 22042634 23179673 24385297 25657947 27021494 28494056 30065815 31733568
55914 31733568 33527243 35475616 37578450 39841967 42307739 45015282 47973478 51205145
55906E1205145L578131M004860M483750N034728N713884O517465P390614Q331513
55898I6260090R386591J0549734J1787914J3163518J4792435J6685965J8799731
55891A91425978K1230526K4155954K7586465L1427084L5657391L9770027M1696925
55884D12950350L8051074K6601908Q869521j0207037k5522332l4743095l8461691
55877C77538698l8442157l6254592l3038835k9596247k6325993k3291545k0495939
55870A70093390j8005277j5836376j3918762j2215347j0755343r525706q445588
55863H1390991p469737o617278n882940n214097m592518m053341l605728l210612
55855D0744740k850985k551850k315535k104228j901931j732279j600683j476474
$$ plain form
55906 51205145 54783276 58788136 63271886 68306614 74020498 80537963 87928577 96260090
55898 96260090 105646681 116196415 127984329 141147847 155940282 172626247 191425978
55891 191425978 212656504 236812458 264398923 295826007 331483398 371253425 412950350
55884 412950350 451001424 477603332 486472853 476265816 450743484 416000389 377538698
55877 377538698 339096541 302841949 269803114 240206867 213880874 190589329 170093390
55870 170093390 152088113 136251737 122332975 110117628 99362285 89836579 81390991
55863 81390991 73921254 67303976 61421036 56206939 51614421 47561080 43955352 40744740
55855 40744740 37893755 35341905 33026370 30922142 29020211 27287932 25687249 24210775
55847B4210775j346804j234578j148967j068166r84116r16557q69709q19952p59181
55838A5062745p08120o74560o38884n92770n53623n28842n02343m67736m39896
55829I955971m23069m01248l70558l48312l39638l26973l02918k82598k72973
55820F887684k60057k37665k20236k15567k11685k01623j95573j97803j96255
55811D951220j85572j76959j75436j70188j56925j47316j46755j44413j34471
55802C513185j26088j23566j17568j05057r7400r9562j00899r5484r2250r5995
55792B459316r7404r1176q5945q7006q6455p9485p3709p3576p1786o4497n9246
55781A589031n9615n7666m9545m3300m3423m2681l6864l2719l3668l2468k5763
$$ plain form
55847 24210775 22863971 21629393 20480426 19412260 18428144 17511587 16641878 15821926 15062745
55838 15062745 14354625 13680065 13041181 12448411 11894788 11365946 10863603 10395867 9955971
55829 9955971 9532902 9131654 8761096 8412784 8073146 7746173 7443255 7160657 6887684
55820 6887684 6627627 6389962 6169726 5954159 5742474 5540851 5345278 5147475 4951220
55811 4951220 4765648 4588689 4413253 4243065 4086140 3938824 3792069 3647656 3513185
55802 3513185 3387097 3263531 3145963 3040906 2943506 2843944 2743045 2647561 2555311 2459316
55792 2459316 2361912 2270736 2184791 2097785 2011330 1931845 1858136 1784560 1712774 1648277 1589031
55781 1589031 1529416 1471750 1422205 1378905 1335482 1292801 1255937 1223218 1189550 1157082 1131319
55770A131319k1504k4236k6941k4824k3342k5419k4755j9056j6126j9328k0652
55759H85136j5663j1774j3991j5796j2177q768r957j0394o356l475n231n649j175
55746G64730J941k71j735J621L877J207L02O024J1773J1019Q164Q984R971O257
55732H33864J310Q9M28j095k501k436m772j0664j4253j2442j0542j2277j3254
55719G51455j0491r030j2214j4536j1360p071o406o027j958K729M759P329J2941
55706G00120J6832J4321P816Q73p323j6117k0223j8222j6223j7614j7716j4092
55694F12432j2560j6381j8983j5039r740r177j0205q207o564r409j2475j0377
55682D73315o440o345p983o259k539j045r08L85N97k820o727p560p668r875j1105
$$ plain form
55770 1131319 1109815 1085579 1058638 1033814 1010472 985053 960298 941242 925116 905788 885136
55759 885136 869473 857699 843708 827912 815735 806967 797010 786616 780260 776785 771554 765905 764730
55746 764730 766671 766400 764665 766286 770163 771370 771672 777696 789469 800488 808652 817636 827607 833864
55732 833864 835174 835263 835691 834596 832095 829659 824887 814223 799970 787528 776986 764709 751455
55719 751455 740964 731934 719720 705184 693824 686753 680347 674320 672362 675091 679850 687179 700120
55706 700120 716952 731273 739089 739962 732639 716522 696299 678077 661854 644240 626524 612432
55694 612432 599872 583491 564508 549469 539729 530552 520347 512140 505576 496167 483692 473315
55682 473315 466875 460530 452547 446288 443749 442704 441796 442181 442778 439958 433231 425671 418003 408128 397023
55667C97023q150m399m101n107l939k691m212n714l935j516j736k116K66K587
55653C52260K016K040O079J0328J0208Q530R822J1574Q992L877R38o49m452r197
55639D12366j1359j1892j3599j5110j3945j1973j1625j0508o139k033k523n311
55627B96349n645m137m025m452k983j149j123n37L054O508O203M791O221Q066
55613C07141N850J286q80q82j720k362l21K081J104j437j433Q3m44j847n50K426
55597C08095L447K927L485M035K200J12J167L487L140J360K026M293M404K522
55583C46700J299Q1k869m951k925L66p9l085l929l005m348p452q213o867p323
55568B93400r390q914n307k222j010J52J168K57j334q32N86l58k765l189k174
$$ plain form
55667 397023 388873 384474 380373 375266 371327 368636 364424 358710 354775 353259 351523 349407 349673 352260
55653 352260 354276 356316 362395 372723 382931 391461 401283 412857 421849 425726 426664 426015 421563 412366
55639 412366 401007 389115 375516 360406 346461 334488 322863 312355 306216 304183 301660 296349
55627 296349 290704 286567 282542 278090 275107 273958 272835 272298 275352 281860 288063 292854 299075 307141
55613 307141 312991 314277 313397 312515 310795 308433 308112 310193 311297 309860 308427 308510 308066 306219 305669 308095
55597 308095 311542 314469 317954 321989 324189 324301 325468 328955 332095 333455 335481 339774 344178 346700
55583 346700 347999 348080 345211 340260 337335 337701 337622 334537 330608 327603 323255 315803 307590 300723 293400
55568 293400 284010 275096 269789 267567 266557 266709 267877 268134 266800 265968 266554 266196 263431 260242 258068
55553B58068k859m287k857M21J003j317k485j824k756n623o593m441k308j893
55539B20249j459l70j93q35o33m07k297m715l910n11R83o38k119j862j662k070
55523A97551j409R9L10m94j91M63r43k791q87M126O812N224L265L760M774M397
55507B24066L913M360M428L464K626K018M32j513k020k012l956o699o303k530
55493B20274L45o0j705k646l412m004l153j478j076j401N3K543K522j42j521j96
55477B04943O99o72j975j485r50j752k396j866j523k012j893r21q87j931j829
55462A83550k51J77j464k733k360k449m251n564m388j948j25J133K136K089J067
55447A64619O86J543K426K840L541L992K526k68j549l78J213J850K118J857r3
$$ plain form
55553 258068 255209 250922 248065 248486 249489 248172 245687 243863 241107 235484 228891 224450 222142 220249
55539 220249 218790 218420 218227 217392 216759 216352 214055 209340 205430 204919 205902 205264 203145 201283 199621 197551
55523 197551 196142 196241 196551 196057 195866 196329 195386 192595 191708 195834 202646 207870 211135 214895 219669 224066
55507 224066 227979 232339 236767 240231 242857 244875 245307 243794 241774 239762 235806 229107 222804 220274
55493 220274 220619 220559 218854 216208 212796 208792 205639 204161 203085 201684 201737 204280 206802 206660 205139 204943
55477 204943 205642 204970 202995 201510 200560 198808 196412 194546 193023 191011 189118 188197 187310 185379 183550
55462 183550 183299 183476 182012 179279 176919 174470 170219 164655 160267 158319 158194 159327 161463 163552 164619
55447 164619 165305 166848 169274 172114 175655 179647 182173 181905 180356 179978 181191 183041 185159 187016 186923
55432A86923k702l188j555q48j907j925L81K253J371p82j958k271k393j737k06
55417A69456Q58R62J188J675J314O66J799M274M851K514J96n3N6j137k094j054
55401A85471P87J437J025N68J7o61n53M75J021L56n67j109j786k430k011r73j130
55384A79937k457k650p12J683L105L870M010K742P50p6N7j052l411m155k185J
55368A79457M30K87R54J570J282R32R96N55l49j64J106J376K85L05K518M489M187
55351B00216K911K382J894L57j318k038k327k714k509j686j563k226j932l91J54
55336A89210j233k209q24J411K177J644J116O01k96r20o80p3N27J386K009J355
55320A95201Q1J13J390J753P03J98R62J274M66K00R96R70n64j644j404j682l152
$$ plain form
55432 186923 184221 181033 179478 178630 176723 174798 175179 177432 178803 178021 176063 173792 171399 169662 169456
55417 169456 170314 171276 172464 174139 175453 176119 177918 182192 187043 189557 189753 189700 189756 188619 186525 185471
55401 185471 186258 187695 188720 189288 189305 188644 188091 188566 189587 189943 189376 188267 186481 184051 182040 181067 179937
55384 179937 177480 174830 174118 175801 178906 182776 186786 189528 190278 190202 190259 189207 185796 181641 179456 179457
55368 179457 179887 180174 181128 182698 183980 184912 185908 186463 186114 185950 187056 188432 188717 189022 191540 196029 200216
55351 200216 203127 205509 207403 207760 206442 204404 202077 199363 196854 195168 193605 191379 189447 189056 189210
55336 189210 187977 185768 184944 186355 188532 190176 191292 191893 191597 190677 189997 189924 190451 191837 193846 195201
55320 195201 195282 195395 196785 198538 199241 199439 200401 201675 202141 202341 203337 204307 203743 202099 200695 199013 195861
55303A95861l478j423N77K36j334k369l226m113l330m10K000J953J158J611K211
55288A85924J389K54K81L94p04j724j194l78r66j847j025J012K325K258J133q19
55272A86313k274r75K775N195L897J165R7J58p07k085k421k111k256k118p27P28
55256A84654P51J41K29L64m18j162q68m78o53J13K477L902K463N19J046K496J259
55239A96835k310m343l143p29P88J166O90k53o31p4j02j911l842l400p87J826
55223A79780L424M198L657J326j358k317j433p5J027J649J131m83j592j269q87
55208A86778j565j758K64L121M137L056J526K60p74p32Q58K311J800Q6r78j388
55192A97002k088k602k026j084o88L4J712K464N96j911j887K08J153k11k128l172
$$ plain form
55303 195861 192383 190960 191537 191773 190439 188070 184844 180731 177401 176991 178991 180944 182102 183713 185924
55288 185924 187313 187567 187848 188242 187538 185814 184620 184242 183276 181429 180404 181416 183741 185999 187132 186313
55272 186313 184039 183064 185839 191034 194931 196096 196193 196351 195644 193559 191138 189027 186771 184653 183926 184654
55256 184654 185405 185546 185775 186139 185721 184559 183691 183213 182560 182673 185150 189052 191515 192034 193080 195576 196835
55239 196835 194525 190182 187039 186310 187098 188264 188954 188701 188070 187996 187894 185983 182141 178741 177954 179780
55223 179780 183204 187402 191059 192385 191027 188710 187277 187202 188229 189878 191009 190526 188934 187665 186778
55208 186778 185213 183455 183719 186840 190977 194033 195559 195819 195045 194313 195171 197482 199282 199368 198390 197002
55192 197002 194914 192312 190286 189202 188514 188548 190260 192724 193320 191409 189522 189730 190883 190672 188544 185372
55176A85372l312k388l45J421J577J066J514K363K039R08L51K6j043j835p76J030
55160A87968J259J98k6O47M30p50j174n04P4N80J938L220K446J43j002k22N68
55143A95793J81n64j081j726k020r39P12Q15q25k131j872q01L23J416J949J536
55127A90766J500L117M660L192p11l206k488o82J79P27J745K098Q14j037k039
55112A98635k196j842o26J261K449K055P89l22r92r78K04K151L494L552L041K704
55096B13379K328J492K84r36j777j896j585j789k680l012k003q13o68o89M72J884
55080B01991J583j6n09R65K742L165K053r7k386l157j473J110K125J393P23P96
55064B11008N68l54r75q06n13m46q4Q81K186L421L700J842j605l779k783l50Q54
$$ plain form
55176 185372 182060 179672 179327 180748 182325 183391 184905 187268 189307 190215 190566 190592 189549 187714 186938 187968
55160 187968 189227 189425 189399 190046 190476 189726 188552 188048 188122 188702 190640 193860 196306 196449 195447 195225 195793
55143 195793 195974 195410 194329 192603 190583 189644 190356 191171 190346 188215 186343 185542 185865 187281 189230 190766
55127 190766 192266 195383 200043 203235 202524 199318 196830 196148 196327 197054 198799 200897 201711 200674 198635
55112 198635 196439 194597 193971 195232 197681 199736 200525 200203 199211 198233 198437 200588 204082 207634 210675 213379
55096 213379 215707 217199 217483 216547 214770 212874 211289 209500 206820 203808 201805 200992 200324 199635 200107 201991
55080 201991 203574 203558 203049 204014 206756 209921 211974 211877 209491 206334 204861 205971 208096 209489 210212 211008
55064 211008 211576 211222 210247 209441 208928 208482 208398 209279 211465 214886 218586 220428 218823 215044 212261 211911 212765
55047B12765J012J654K074P17j052n04J664K169O17N4J574K452Q19j517k344j926
55031B20228j127L55K214K616Q87r28q51N06J418J327O59m9M4J432K869K433M94
55014B34527m76M44J480J373J142J596J462l93k777l802l283k275j452r49o45
54999B25972N4J549K738J898p23k781k667r91J031K813L621K581J38j983k802
54984B30448k638j685M1J356Q48n96m88J502K919K251Q37K26P5k76l59O7J48m06
54966B34270n90j04j68j417k557k232o84J044K075J529p25k759k213K62J447N1
54950B27229j677j606m31L96Q77J220P61l83o15O10J538Q71j21J60J139J386Q55
54933B32209L09o6j50N92J789J863J96j775k624k591k233j140Q05K483L025K864
$$ plain form
55047 212765 213777 215431 217505 218222 217170 216666 218330 220499 221116 221170 222744 225196 226015 224498 222154 220228
55031 220228 219101 219456 221670 224286 225173 224245 223394 223900 225318 226645 227304 227255 227299 228731 231600 234033 234527
55014 234527 234051 234495 235975 237348 238490 240086 241548 241155 238378 234576 231293 229018 227566 226617 225972
54999 225972 226026 227575 230313 232211 231488 228707 226040 225049 226080 228893 232514 235095 235233 233250 230448
54984 230448 227810 226125 226166 227522 228370 227774 227286 228788 231707 233958 234795 235021 235096 234820 234461 234528 234676 234270
54966 234270 233680 233576 233408 231991 229434 227202 226518 227562 229637 231166 230441 227682 225469 225731 227178 227229
54950 227229 225552 223946 223515 223911 224788 226008 226769 226386 225771 226381 227919 228790 228669 228829 229968 231354 232209
54933 232209 232518 232452 232302 232894 234683 236546 236742 234967 232343 229752 227519 226379 227184 229667 232692 235556
54917B35556K492J697P59N88R86P35O2O62K394K678N39j353n80J524K262J382
54901B52383L78j89n24l39K87K83n55o68N34J007q32l153l216j328J39M32O50
54884B45289J186J408J381J776K306J968O32q80j898k122j459n81o23j453j409
54869B45521J88J684J408M6o03J22J846M062N730N623M371M433O571Q273P380
54854B96655N351M839N756O099N232L858J959p47l063l444k405j809k310l147
54840C12824l793m159l966l507m004n649o428m756k064p27n88J51J626K287J638
54825B78885O04l98j602k413j855l52O99J035J582K817M462O275P735P691N900
54810C11065M134M093N028N097M113L010J610p86l374m697n009n617o348o033
$$ plain form
54917 235556 238048 239745 240504 241092 242078 242813 242875 243537 245931 248609 249148 247795 247215 248739 251001 252383
54901 252383 252761 252572 252048 251709 251996 252279 251724 251056 251590 252597 251765 248612 245396 244068 244207 244639 245289
54884 245289 246475 247883 249264 251040 253346 255314 255946 255066 253168 251046 249587 249006 248383 246930 245521
54869 245521 245709 247393 248801 248847 248244 248366 250212 254274 260004 265627 269998 274431 281002 289275 296655
54854 296655 302006 306845 312601 318700 323932 327790 329749 329002 325939 322495 320090 318281 315971 312824
54840 312824 309031 304872 300906 297399 293395 287746 281318 276562 274498 273771 273183 273334 274960 277247 278885
54825 278885 279489 279091 277489 275076 273221 272869 273568 274603 276185 279002 283464 289739 297474 305165 311065
54810 311065 315199 319292 324320 329417 333530 336540 338150 337364 333990 329293 324284 318667 312319 306286
54796C06286n058m944n482m864k808j257j501k594l073k588j470l36l19k035m128
54781B63829m407k700j111j184k228k687j908l26R42P11r67k310j817l41J72n52
54765B43116j323j880k944l905k863M41L684M812M274L589L074K073O39k23J67
54750B52731J102J026o97k614k657r11K58m66j471q96L93M37m55l43J042K057
54734B48536J912J358O83o17j973j961q24n03j446j537O69L472M275K976J705
54719B56725J896K949L452K811J605P77O03O23O42J192K593M097M775M642M256
54704B93638L944M295O256R370J1058R581O867O141P163O497K644j769l882m222
54690C57581m939o320p004o589o094o063n768m620l330l045l655l707k269m70
$$ plain form
54796 306286 301228 296284 290802 285938 283130 281873 280372 277778 274705 272117 270647 270311 269992 267957 263829
54781 263829 259422 256722 255611 254427 252199 249512 247604 247278 248220 248931 247964 245654 243837 243496 243668 243116
54765 243116 241793 239913 236969 233064 230201 230642 234326 239138 243412 247001 250075 252148 252787 252564 252731
54750 252731 253833 254859 254162 251548 248891 247980 248238 247772 246301 245405 245798 246235 245780 245437 246479 248536
54734 248536 250448 251806 252489 251872 249899 247938 247114 246611 245165 243628 244297 247769 252044 255020 256725
54719 256725 258621 261570 265022 267833 269438 270215 270818 271441 272083 273275 275868 279965 284740 289382 293638
54704 293638 297582 301877 308133 317503 328561 338142 345009 351150 358313 364810 367454 365685 361803 357581
54690 357581 352642 346322 339318 332729 326635 320572 314804 310184 306854 303809 300154 296447 294178 293708
54676B93708l00j954l384k922j215J28O29O63K40m75l55J318L231L515K504K150
54660B97481L014L650L233K911L863N523O471O168N062L599J759o70l434n460
54646C33170n701m722m564o230q135q151o320m322l007k043j388j348j506j178
54632B74555p04p58p30M27J965J912M5j609j656j001j027j626j855j493j127j291
54616B64027j911k304j771o22p6m74n53N10J355L61j481j739r9J325J215M55J44
54599B58362J31M8J14L86N45P09J192J447O77n88j191j362k206l158k380K4J474
54582B54224N31j062j025N94K252K995K597J096n40n99J250L083K989J199q48
54567B68736k364l109k705j425o93j402k296j481P82K143J119j043j831k67K185
$$ plain form
54676 293708 293408 291454 288070 285148 283933 284061 284690 285353 285593 285118 284763 286081 289312 292827 295331 297481
54660 297481 300495 304145 307378 310289 314152 319675 326146 332314 337376 340975 342734 342064 338630 333170
54646 333170 327469 322747 318183 311953 303818 295667 289347 285025 282018 279975 278587 277239 275733 274555
54632 274555 273851 273093 272363 272790 274755 276667 276712 275103 273447 272446 271419 269793 267938 266445 265318 264027
54616 264027 262116 259812 258041 257419 257343 256869 256316 256826 258181 258542 257061 255322 255223 256548 257763 258218 258362
54599 258362 258493 258541 258655 259041 259586 260295 261487 262934 263611 263023 261832 260470 258264 255106 252726 252750 254224
54582 254224 254755 253693 252668 253262 255514 258509 261106 262202 261662 261063 262313 265396 268385 269584 268736
54567 268736 266372 263263 260558 259133 258440 257038 254742 253261 254043 256186 257305 256262 254431 254164 256349
54552B56349L323K457O95p46j713k359k229j046K46M94Q6L99J610K352J735N96
54536B62249L27J151K012J742L73o20K29K343L425K331N18k90n53j536k774k889
54520B68038k084j582j199L03K572L713L046J748O01p82k230k541j446k76r9n79
54504B67203j019j169q44j19J46o01j191j13J949K928K472K090K356K248J374
54489B77710N21j25j012j401q4J950K326J130R40K410L054J526j17JP51O83O96
54472B90959J727K168K76k673m037l329j995q97l7L38J41M4K93K2j017j466n25
54455B79992M51J8j045j210n86j46J47O72Q11M2o92l78L15L55K80J058K023J880
54437B83987J013Q40J429J509O07l19k99P20K001K278O30k141l679k557J88K523
$$ plain form
54552 256349 259672 262129 262824 262078 260365 258006 255777 254731 254977 255471 255557 255956 257566 259918 261653 262249
54536 262249 262576 263727 265739 267481 267854 267234 267463 269806 273231 275562 276080 275790 275237 273701 270927 268038
54520 268038 265954 264372 263173 263476 266048 269761 272807 274555 275156 274374 272144 269603 268157 267881 267782 267203
54504 267203 266184 265015 264171 264052 264198 263597 262406 262293 264242 267170 269642 271732 274088 276336 277710
54489 277710 278231 278106 277094 275693 275609 277559 279885 281015 281955 284365 287419 288945 288828 288829 289580 290263 290959
54472 290959 292686 294854 295130 292457 288420 285091 283096 282199 282162 282500 282641 282685 282978 283000 281983 280517 279992
54455 279992 280443 280461 279416 278206 277620 277474 277621 278293 279104 279146 278454 278076 278391 278746 279026 280084 282107 283987
54437 283987 285000 285840 287269 288778 289385 289066 288767 289487 291488 293766 294396 292255 288576 286019 286207 288730
54421B88730L379K562K89k203l087k128j048p75o8J900L711M051L914M444M536
54406C08207L032J553K279M126M157K053K57j1N4l62l92M94J351J252K48j464
54390C26834l694n333m924k576j28R13N86l30j113j134k77N49L09q09j753k098
54374C05022k173k120j806j385r83k31R27J542R45J71O94K161K756J665k6q63
54358C06296m93L82P66L12n1R22K724L140J181j299k107j500r83o56J66P73j58
54341C09415j958k388p25J547L107M067M685M497L338J920R73O01P06J285K279
54326C33349L576M886N227L530N00j271l50J455J494k22j616j695j102j89J338
54311C48910L084M156M564M809M437K833J118J089K335K524P92j160j816j765
$$ plain form
54421 288730 292109 294671 294960 292757 289670 287542 286494 285719 285651 287551 291262 295313 299227 303671 308207
54406 308207 311239 312792 315071 319197 323354 325407 325664 325653 325707 325345 324953 325447 326798 328050 328298 326834
54390 326834 323140 317807 312883 310307 310179 311092 311678 311348 310235 309101 308824 309373 309682 308873 307120 305022
54374 305022 302849 300729 298923 297538 296555 296324 297251 298793 299738 299909 300603 302764 305520 307185 307159 306296
54358 306296 305803 306185 306951 307263 307212 308134 310858 313998 315179 313880 311773 310273 309290 308634 308800 309573 309415
54341 309415 307457 305069 304344 305891 308998 313065 317750 322247 325585 327505 328478 329079 329785 331070 333349
54326 333349 336925 341811 347038 350568 351068 349797 349447 350902 352396 352174 350558 348863 347761 347572 348910
54311 348910 351994 356150 360714 365523 369960 372793 373911 375000 377335 379859 380651 379491 377675 375910
54297C75910k196l066l569l304k279p47N84R20K06j024k478l900m480l688k398
54282C44491j923k135j933j311j342k157k525j757o13J3R5j35o72j283j518j410
54266C23885j371j361r48%J325K915M193L939J815n96j531j299j376j976k086
54251C25528j466p76j37P18J112J80j231j329j57L30q48k467l087k592j485k50
54235C12043L12l98j497j357N7J036N67m31o96j75L97M56j40r25r37K01J660K690
54217C12863L772N222N735M018J118q47j549j942j821m71Q59J60j817k235n69
54202C22496P95P37J009K664L983L319J510O7p05n88J068L318L554J179q54o0
54186C43492K057K513J069k55n68p03j225j816k177k238j853j194q10o56m9Q30
$$ plain form
54297 375910 373714 370648 367079 363775 361496 360749 361333 362253 362459 361435 358957 355057 350577 346889 344491
54282 344491 342568 340433 338500 337189 335847 333690 331165 329408 328795 328808 328903 328768 328096 326813 325295 323885
54266 323885 322514 321153 320205 320205 321530 324445 328638 332577 334392 333796 332265 330966 329590 327614 325528
54251 325528 324062 323286 323149 323867 324979 325159 323928 322599 322442 322772 321924 319457 316370 313778 312293 312043
54235 312043 312355 311957 310460 309103 309160 310196 310763 310332 309636 309461 309858 310314 310174 309249 308312 308513 310173 312863
54217 312863 316635 321857 327592 331610 332728 331881 330332 328390 326569 326098 326957 327117 325300 323065 322496
54202 322496 323291 324028 325037 327701 331684 335003 336513 336580 335875 335287 336355 339673 343227 344406 343552 343492
54186 343492 345549 348062 349131 348876 348308 347605 346380 344564 342387 340149 338296 337102 336292 335636 335587 336417
54170C36417Q02k74q72k38J56j035k705k815j127J037K691L485L039J476jk75
54154C39761L51P76M51m38j393j718j166p23j515k792k602p97N73M72J91N48K92
54137C30271j216k094q52Q72Q43j32K77K000K848K049R75N51J98n10r41n49K60
54120C34850O07q7j457j929o1L239N170M499L027K525K170P68m82j7Q99j00k339
54103C51282k802q33P99l4k160l322l060k412k200k428k594k037o69O35J064R95
54087C30224J119R86k39j884k117l67J904K987K461J007l01n70J66Q82R80J240
54071C38478K393L426K746N85j243j709j207j56J374K701K910K398K567L659M435
54056C63357M253L989M329M633M284M040N013O935Q301P899N827L148P81j399
$$ plain form
54170 336417 337219 336945 336073 335835 335991 334956 332251 329436 328309 329346 332037 335522 338561 340037 340036 339761
54154 339761 340112 340888 341339 340901 339508 337790 336624 335901 334386 331594 328992 328195 328768 329240 329431 329979 330271
54137 330271 329055 326961 326109 326981 327824 327692 327969 329969 332817 334866 335841 336392 336590 336080 335139 334590 334850
54120 334850 335457 335370 333913 331984 331923 335162 340332 344831 347858 350383 352553 353321 352839 352822 353721 353621 351282
54103 351282 348480 347647 348446 348412 346252 342930 339870 337458 335258 332830 330236 328199 327530 328165 329229 330224
54087 330224 331343 332329 332090 330206 328089 327722 329626 332613 335074 336081 335780 335210 335376 336258 337238 338478
54071 338478 340871 344297 347043 347628 346385 344676 343469 343313 344687 347388 350298 352696 355263 358922 363357
54056 363357 367610 371599 375928 380561 384845 388885 393898 400833 409134 417033 422860 426008 426789 425390
54042D25390m089p004q454p271m638k959l173m176m642m241l200j869q92p88j220
54027C66774j460j408j320q66L49J619J808J238J337K264K451J035o64r29K83
54012C72511J891L328M631N487N242L818K024R20R27J366J150K69J90J878L814
53997D09446L389L72k445k690j096J04K97O24J767L100L892M103L879L351L203
53982D31296M354O512P927P481O418O903R067J0765J0540R482R303R799R566Q533
53968E47946Q106Q797R424Q976P889O848N658M081K554J270l79k428l512k612
53954F02618p80J33j60o07p86j347k723m579o390p696q168q204q946j0641j1664
53939E30060j0447p776n745m887m087l013k708l422l666k293j45J165J251Q57
$$ plain form
54042 425390 421301 414297 405843 398572 393934 390975 387802 383626 378984 374743 371543 369674 368782 367994 366774
54027 366774 365314 363906 362586 361720 362069 363688 365496 366734 368071 370335 372786 373821 373157 372228 372511
54012 372511 374402 377730 382361 387848 393090 396908 398932 399852 400779 402145 403295 403564 403754 405632 409446
53997 409446 412835 413207 410762 408072 406976 407080 407377 408001 409768 412868 416760 420863 424742 428093 431296
53982 431296 435650 442162 450089 457570 463988 470891 479958 490723 501263 510745 520048 529847 539413 547946
53968 547946 556052 564849 574273 583249 591138 597986 603644 607725 610279 611549 611170 608742 605230 602618
53954 602618 601838 601971 601811 601204 600418 599071 596348 591769 585379 577683 569515 561311 552365 541724 530060
53939 530060 519613 511837 506092 501205 497118 494105 491397 487975 484309 482016 481871 483036 484287 485144
53925D85144N39K33j69m86l84L17J462K686L837M952N718N618N103N726Q212J0964
53909E39472J1572R334N262L20m871q945j0370r464q261p938p682o548n081m303
53895D92497m127l727k771j490K1J788L537M705M911M305L583L522M196M864N001
53880E20815N054N611O313O425O116O166O553O441N571M704M542M998N510N451
53866F00270M436L117L254N852R450J1531J1504J0946J0938J0838R959Q877Q365
53853G09337Q320Q413Q852R799J0925J1945J2696J2480J0445P080M145K551J422
53840H18410j21j479j769j456j731k937m479n842o860p495p933q618r780j1227
53826G46683j2682j3736j3681j2378j1201j1733j3366j3771j2234j0658j0341
$$ plain form
53925 485144 485683 485916 485747 485261 484877 485194 486656 489342 493179 498131 503849 509467 514570 520296 528508 539472
53909 539472 551044 560378 565640 565960 561089 552144 541774 532310 524049 516111 508429 501881 496800 492497
53895 492497 488370 484643 481872 480382 480403 482191 485728 490433 495344 499649 503232 506754 510950 515814 520815
53880 520815 525869 531480 537793 544218 550334 556500 563053 569494 575065 579769 584311 589309 594819 600270
53866 600270 604706 607823 611077 616929 626379 637910 649414 660360 671298 682136 692095 700972 709337
53853 709337 717657 726070 734922 744721 755646 767591 780287 792767 803212 810292 814437 816988 818410
53840 818410 818289 816810 815041 813585 811854 808917 804438 798596 791736 784241 776308 767690 757910 746683
53826 746683 734001 720265 706584 694206 683005 671272 657906 644135 631901 621243 610902
53815F10902r830p435m357l095l872m713m636m518m968n379n445n846o826p418
53801E32564o806n548m743m744n124n321m899l737k273j191p25p32j364k855m515
53786D77987m922l635j921j211j419j531j208r38q54m31N10J270J171M43j28j18
53770D63065K24L97J40l25m77j48mp77j927j877o1K037K734K296K163K613K717
53753D72790K367K560L470M058M218N370P799R244P872N337M716O324P724P558
53739E51407O993P175P459P014O380O399O745O590N883N082M289L492L195L917
53725F32020N199N739M646K384L38n53p07j202k286l205l712m695o664q596r335
53710F09371r312r512r555q383o398n109m853m729m688n562o730o047l077m27
$$ plain form
53815 610902 601072 593637 589280 586185 582313 577600 572964 568446 563478 558099 552654 546808 539982 532564
53801 532564 525758 520210 515467 510723 505599 500278 495379 491642 489369 488178 487453 486721 485357 482502 477987
53786 477987 473065 469430 467509 466298 464879 463348 462140 461202 460348 459917 460427 461697 462868 463311 463183 463065
53770 463065 463289 463686 463826 463501 463024 462876 462872 462095 460168 458291 458230 460267 463001 465297 467460 470073 472790
53753 472790 475157 477717 481187 485245 489463 494833 502632 511876 519748 525085 529801 536125 543849 551407
53739 551407 558400 565575 573034 580048 586428 592827 599572 606162 612045 617127 621416 624908 628103 632020
53725 632020 637219 642958 647604 649988 650326 649773 649066 647864 645578 642373 638661 633966 627302 618706 609371
53710 609371 600059 590547 580992 572609 566211 561102 556249 551520 546832 541270 534540 528493 525416 524989
53696E24989n17k487l814l762l616m219m877m618l422k053j257j104r64l48K56
53681D88187Qr26j504j348j115j143q80l8Q11J266J675K192K397K318K687L552
53665D98139L916L394K920L005K668J280J17P05K467L544L306K698K553K810L159
53650E36681L442L531L541L847M429M703M466M279M349M022L122K771L886N727
53636E92796O896P061O700N992N032M417M485M658M429M193M212L633J729q38
53622F55395k996m554n337m507k213o60j487l138k965j114J8l79q56n76l16l62
53606F23953P4Q68P23m94j221p54k44l53MJ348K122J012p51j142k04M58K26j00
53588F25525J10O71J297J937K552L253M296N396N629M705L709L755M514M924M812
$$ plain form
53696 524989 524472 521985 518171 514409 510793 506574 501697 497079 493657 491604 490347 489243 488279 487931 488187
53681 488187 488195 487269 485765 484417 483302 482159 481279 481241 482052 483318 484993 487185 489582 491900 494587 498139
53665 498139 502055 505449 508369 511374 514042 515322 515439 516144 518611 522155 525461 528159 530712 533522 536681
53650 536681 540123 543654 547195 551042 555471 560174 564640 568919 573268 577290 580412 583183 587069 592796
53636 592796 599692 606753 613453 619445 624477 628894 633379 638037 642466 646659 650871 654504 656233 655395
53622 655395 652399 647845 642508 638001 635788 635128 633641 630503 627538 626424 626442 626063 625207 624631 624315 623953
53606 623953 624027 624895 625618 625124 623903 623149 622905 622552 622556 623904 626026 627038 626287 625145 624941 625399 625625 625525
53588 625525 625635 626306 627603 629540 632092 635345 639641 645037 650666 655371 659080 662835 667349 672273 677085
53573F77085M791M896M476L398K513K736M080N631O236N458M108L462L744L942
53559G36556L375K680K590K675K287K105L347N687P350P430O909O887O923N907
53545H02708L897K201J917L003M558N534N262L923K551K169K729L127K297J49
53531H46025k510m619n346m394k347n23j18j252k934l999l922l006k121k184l443
53516H03307n053n750n174m218l890m187m407m192l672k809j292O83K074J920
53502G63340M39j066j394l94J198K560L338L556L338K891K614L014M326O123P275
53487H01158O684M522K700L396O662J0068J1237J0319R277R323J0116J1205J2702
53474I09369J4325J5096J4747J4412J5179J6705J8037J9021J9991K0806K1279
$$ plain form
53573 677085 681876 686772 691248 694646 697159 699895 703975 709606 715842 721300 725408 728870 732614 736556
53559 736556 739931 742611 745201 747876 750163 752268 755615 761302 768652 776082 782991 789878 796801 802708
53545 802708 806605 808806 810723 813726 818284 823818 829080 833003 835554 837723 840452 843579 845876 846025
53531 846025 843515 838896 833550 829156 826809 826286 826168 824916 821982 817983 814061 811055 808934 806750 803307
53516 803307 798254 792504 787330 783112 779222 775035 770628 766436 762764 759955 758663 759346 761420 763340
53502 763340 763779 762713 761319 760925 762123 764683 768021 771577 774915 777806 780420 783434 787760 793883 801158
53487 801158 807842 812364 815064 818460 825122 835190 846427 856746 866023 875346 885462 896667 909369
53474 909369 923694 938790 953537 967949 983128 999833 1017870 1036891 1056882 1077688 1098967
53463A098967K2150K4380K7536K9959L0691L0462L0565L1532L3071L4717L6151
53452A430181L7291L8417L9948M1787M3083M2970M1631M0488M0959M2871M4474
53441A884100M4375M3127M2168M1582M0039L7065L3948L1879L0487K9223K8913
53430B286906L0505L2980L4176L3413L1841L0202K7925K4828K2259K1596K2427
53419B599058K3050K2426K0845J8902J6484J3033Q544L991N22j813m236p988j2989
53406B699829j7953k1575k3537k4538k5511k6625k7199k6973k7116k8985l1855
53395B417962l3238l2057l0201k9975l1123l1675l0920k9899k9331k8646k7179
53384B083718k5147k3158k1590k0392j8857j5870j1305o769l957k519p74J747
$$ plain form
53463 1098967 1121117 1145497 1173033 1202992 1233683 1264145 1294710 1326242 1359313 1394030 1430181
53452 1430181 1467472 1505889 1545837 1587624 1630707 1673677 1715308 1755796 1796755 1839626 1884100
53441 1884100 1928475 1971602 2013770 2055352 2095391 2132456 2166404 2198283 2228770 2257993 2286906
53430 2286906 2317411 2350391 2384567 2417980 2449821 2480023 2507948 2532776 2555035 2576631 2599058
53419 2599058 2622108 2644534 2665379 2684281 2700765 2713798 2722342 2726333 2726855 2725042 2720806 2712818 2699829
53406 2699829 2681876 2660301 2636764 2612226 2586715 2560090 2532891 2505918 2478802 2449817 2417962
53395 2417962 2384724 2352667 2322466 2292491 2261368 2229693 2198773 2168874 2139543 2110897 2083718
53384 2083718 2058571 2035413 2013823 1993431 1974574 1958704 1947399 1940630 1936673 1934154 1933380 1935127
53372A935127L968N418P098R725J2525J4474J5777J7319J9514K2288K5557K9023
53360B117813L1988L3975L5351L7005L9537M2799M6020M8522N0542N3060N6481
53349B593093N9983O2792O5327O8182P0778P2367P3711P6121P9019Q0485Q0313
53338C382171Q0641Q2941Q6098Q8308Q9304Q9758Q9790Q9284Q8633Q8078Q7028
53327D342034Q4876Q1867P8423P4468P0110O6072O2599N8655N3066M5821L7581
53316E055572K8743J9747J1484M432j900p995j3716j9482k6976l7232m8787n9101
53304D904789o7281p4058p9681q3523q5670q7314q9177r0785r1553r1484r0580
53293C973683q8571q5779q3224q1330p9288p6363p3248p1369p1128p1392p0691
$$ plain form
53372 1935127 1939095 1944513 1951611 1961336 1973861 1988335 2004112 2021431 2040945 2063233 2088790 2117813
53360 2117813 2149801 2183776 2219127 2256132 2295669 2338468 2384488 2433010 2483552 2536612 2593093
53349 2593093 2653076 2715868 2781195 2849377 2920155 2992522 3066233 3142354 3221373 3301858 3382171
53338 3382171 3462812 3545753 3631851 3720159 3809463 3899221 3989011 4078295 4166928 4255006 4342034
53327 4342034 4426910 4508777 4587200 4661668 4731778 4797850 4860449 4919104 4972170 5017991 5055572
53316 5055572 5084315 5104062 5115546 5119978 5118078 5110083 5096367 5076885 5049909 5012677 4963890 4904789
53304 4904789 4837508 4763450 4683769 4600246 4514576 4427262 4338085 4247300 4155747 4064263 3973683
53293 3973683 3885112 3799333 3716109 3634779 3555491 3479128 3405880 3334511 3263383 3191991 3121300
53282C121300o8457o5117o1442n7964n4854n2012m9172m6030m2478l8712l5096
53271B549966l1995k9709k8297k7235k5730k3670k1906k0984k0184j8667j7042
53260B284547j6657j7413j7734j6793j5261j3443j0433n971j637J123K907M924
53248B178159O884Q085R609J3173J8053K1407K2059K2033K3564K6212K8089K8769
53236B406096K9643L1901L5254L8497M0538M0882L9790L8150L6871L6119L5185
53225B808926L3066K9405K5003K1311J9068J7463J4874J0467M835q08n750j0139
53213B967721j4567j9374k4090k7739k9917l1528l3930l7402m0907m3389m4892
53202B619986m6173m7649m9029m9819m9910m9703m9818n0571n1664n2390n2160
$$ plain form
53282 3121300 3052843 2987726 2926284 2868320 2813466 2761454 2712282 2666252 2623774 2585062 2549966
53271 2549966 2517971 2488262 2459965 2432730 2407000 2383330 2361424 2340440 2320256 2301589 2284547
53260 2284547 2267890 2250477 2232743 2215950 2200689 2187246 2176813 2170842 2169205 2170328 2173235 2178159
53248 2178159 2185043 2193128 2202737 2215910 2233963 2255370 2277429 2299462 2323026 2349238 2377327 2406096
53236 2406096 2435739 2467640 2502894 2541391 2581929 2622811 2662601 2700751 2737622 2773741 2808926
53225 2808926 2841992 2871397 2896400 2917711 2936779 2954242 2969116 2979583 2984418 2983610 2977860 2967721
53213 2967721 2953154 2933780 2909690 2881951 2852034 2820506 2786576 2749174 2708267 2664878 2619986
53202 2619986 2573813 2526164 2477135 2427316 2377406 2327703 2277885 2227314 2175650 2123260 2071100
53191B071100n0892m9012m7090m5387m3744m2107m1025m1163m2176m2711m1946
53180A583847m0556l9524l8425l5956l2149k8882k7616k7475k6367k3600k0460
53169A242837j8352j7297j6629j6338j6954j8427j9820k0190j9367j7919j6828
53158A044716j7046j8598k0057j9719j7671j5938j6039j7213j7758j7253j6391
53147H51033j5353j3781j2126j1447j1758j1860j1150j0338j0149j0459j1030
53136G21582j1759j1784r945o877n219o465q848r700q811q021q322r014r243q709
53122E98865p137m623k499k331l837n064m873m048l685l748l679l346k798j917
53108E45280r39o85j688l500n116n667m623k126N45J705J023J9J70J101J180l93
$$ plain form
53191 2071100 2020208 1971196 1924106 1878719 1834975 1792868 1751843 1710680 1668504 1625793 1583847
53180 1583847 1543291 1503767 1465342 1429386 1397237 1368355 1340739 1313264 1286897 1263297 1242837
53169 1242837 1224485 1207188 1190559 1174221 1157267 1138840 1119020 1098830 1079463 1061544 1044716
53158 1044716 1027670 1009072 989015 969296 951625 935687 919648 902435 884677 867424 851033
53147 851033 835680 821899 809773 798326 786568 774708 763558 753220 743071 732612 721582
53136 721582 709823 698039 688094 681217 675998 669533 660685 650985 642174 634153 625831 616817 607574 598865
53122 598865 591728 587105 584606 582275 578438 573374 568501 564453 560768 557020 553341 549995 547197 545280
53108 545280 544341 543656 541968 538468 533352 527685 523062 520936 521481 523186 524209 524228 524398 525499 526679 526286
53092E26286k780m494m588l106r21O88Q80k1p91m26R67K332K690J955Q54J45L6
53075E19706L10P60J232J438J006j27j489k318k031o39J264K937L950M144L407
53060E33550J883L37k31N08K013L620M991N781N659M885M201L839L244K215J375
53045E77870J042N68m55j299j403j711l280n255n780m632l445l369l933m267m085
53030E36566l273j948j159k120m270n451m545k689j318m87J22J5j051j940j549
53015E04903n37k91p84r10m09r0k42k66M2J38k27o60j138k193l685m369l364j377
52997D84541J35M64j35j200k288k747k046m19J235K219K558K649K663K434J851
52982D91914J180Q40Q29O17j11p87n92K61M70o90k190k458j461p65j315k090j476
$$ plain form
53092 526286 523506 519012 514424 511318 510397 511085 511965 511944 511153 510727 511694 514026 516716 518671 519525 519670 519706
53075 519706 520016 520776 522008 523446 524452 524325 522836 520518 518487 517848 519112 522049 525999 530143 533550
53060 533550 535433 535770 535539 536047 538060 541680 546671 552452 558111 562996 567197 571036 574280 576495 577870
53045 577870 578912 579480 579025 577726 576323 574612 571332 566077 560297 555665 552220 548851 544918 540651 536566
53030 536566 533293 531345 530186 528066 523796 518345 513800 511111 509793 509306 509428 509443 508392 506452 504903
53015 504903 504366 504075 503291 502381 501972 501882 501640 501374 501416 501554 501327 500667 499529 497336 493651 489282 485918 484541
52997 484541 484676 485140 485005 483805 481517 478770 476724 476305 477540 479759 482317 484966 487629 490063 491914
52982 491914 493094 493934 494763 495380 495269 494482 493890 494151 494621 493931 491741 489283 487822 487057 485742 483652 482176
52965D82176M79K032J804K14j298j776j125M05K342L727L535J837Q9l18L63O77
52949D95163No53k73N57N47j40O7J750L371L309J999J018P01M9j240k039j418
52932E02773J38J573K466K942L131L150L143K998K595K369K764L049J939k06j264
52917E33560l79L68j183l846m479k189P84K344K654K601K132J085K35K73N98L34
52901E34892j33K98J739L180L895M061L889L112J594o5j023j006l69L41O15K9
52885E55049j445l105m076m376m930o092o689n372k686p33o80j539j809j230l52
52870E09935O26J659K184J729P11k21j100j943j859j27K131K814J381o00j460
52855E15860q67O10K083K377R21j104j667l90R59Q23m44j585j941j397j36Q89
$$ plain form
52965 482176 482655 484687 486491 486705 485407 483631 482506 482911 485253 488980 492515 494352 494441 494123 494486 495163
52949 495163 495168 494515 494242 494799 495346 495206 495273 497023 500394 503703 505702 506720 507421 507470 506230 504191 502773
52932 502773 502911 504484 506950 509892 513023 516173 519316 522314 524909 527278 530042 533091 535030 534824 533560
52917 533560 533181 533549 532366 528520 524041 521852 522636 524980 527634 530235 532367 533452 533687 533960 534558 534892
52901 534892 534759 535057 536796 539976 543871 547932 551821 554933 556527 556462 555439 554433 554064 554405 555020 555049
52885 555049 553604 550499 546423 542047 537117 531025 524336 518964 516278 515545 514865 513326 511517 510287 509935
52870 509935 510561 512220 514404 516133 516844 516623 515523 513580 511721 511594 513725 516539 517920 517320 515860
52855 515860 514993 515603 517686 520063 520984 519880 518213 517823 518782 519605 519161 517576 515635 514238 514102 514991
52839E14991M25j324k511k020r23o15o89P3J548K553K733K672K511J848Q23L1
52823E22126n07j139j403l64J622K744J820k28j539j285n1J228K204L122M224
52808E32574N183N291M382L286K835K689J731l38k426l224k585j599j566k822
52794E43411m315m543l273k020k259l462l815k811k056l009m794n146l284q43
52780D97781J42m25r60m67J86m09k161l552l559k672j865j409j169j183j202l66
52764D76710J614L456L594K210P74j79j446l110l691k271j53P04J76l50k21o2
52748D77755j79J00J148K219K626K844L462L680K035j307m133m512k830r91l13
52733D81604r03k515m672o048n096k091M84M95j376k699k249q53M82J700K670
$$ plain form
52839 514991 515416 514092 511581 509561 508638 508023 507334 507407 508955 511508 514241 516913 519424 521272 522095 522126
52823 522126 521619 520480 519077 518713 520335 523079 524899 524671 523132 521847 521796 523024 525228 528350 532574
52808 532574 537757 543048 547430 550716 553551 556240 557971 557633 555207 551983 549398 547799 546233 543411
52794 543411 539096 534553 531280 529260 527001 523539 519724 516913 514857 511848 507054 501908 498624 497781
52780 497781 497923 497498 496538 496071 496257 495848 493687 490135 486576 483904 482039 480630 479461 478278 477076 476710
52764 476710 478324 481780 485374 487584 488358 488179 486733 483623 479932 477661 477508 478212 478388 478038 477817 477755
52748 477755 477576 477676 478824 481043 483669 486513 489975 493655 495690 494383 490250 485738 482908 481917 481604
52733 481604 480701 478186 473514 467466 462370 460279 460763 461258 459882 457183 454934 454081 454563 456263 458933
52718D58933K517J019l59o1J335J852R13K4L70J045N87p14j248l92Q95J703K228
52701D70647K811K994K213P95l93q91o82J20J022J028k26j530j264M51J796J623
52685D80514Q09Q56K025L506M646N113M374K145n04j464L36L457N085L791R36
52670E15625r23q20l0R7K3R55K534K970J529m06j241j014o96o83q57j329k042
52653E13692k214j350l74n98j744k225j326Q0J095J710J828P17j617l503l182
52638E00989r30J344K377K520K492K181J162k38j066q49r3L90L13p9n94j196j633
52621E07090j340q3J576K666K633J680N46M8M31R39L54j505l111k696j99K727
52605E11756M509M769L807K028K23n01J76J293J854K099K803L704L674K512J538
$$ plain form
52718 458933 461450 462469 462110 462049 463384 465236 466149 466173 466543 467588 468175 467461 466213 465821 466716 468419 470647
52701 470647 473458 476452 478665 479460 479067 478176 477494 477614 478636 479664 479438 477908 476644 477095 478891 480514
52685 480514 481323 482179 484204 487710 492356 497469 501843 503988 503484 502020 502356 505813 510898 514689 515625
52670 515625 514702 513882 513852 513949 513972 514927 517461 520431 521960 521554 520313 519299 518603 517920 517063 515734 513692
52653 513692 511478 510128 509754 509156 507412 505187 503861 503941 505036 506746 508574 509291 507674 504171 500989
52638 500989 500059 501403 503780 506300 508792 510973 512135 511897 510831 509982 509889 510279 510592 510513 509919 508723 507090
52621 507090 505750 505667 507243 509909 512542 514222 514768 514816 515247 516186 516540 515035 511924 509228 509029 511756
52605 511756 516265 521034 524841 526869 527092 526591 526767 528060 529914 532013 534816 538520 542194 544706 546244
52590E46244J921L184M001L941L555K937J322j479m130n016m131k868k051j060
52576E46370P43K586L036J851L15k59J72P32P64L58R6N19J735L241M126L662J909
52559E71956k04j500j431n19K44L81K03O3k21r41j791k144j900j589j500j235
52543E57872l96O61J171R83Q22J380K318K512J319o08j964k091j366m46L30P78
52527E63275Q39J025K209M360N978N637L832K374K097K155J585N04o17j736k683
52512E90834k699j411K63J053P31j35j276k597l334k697j313q72j995l426l767
52497E67359l047k009q57M46J314J037j08j053j115l94P15J738K059J507Q53R53
52481E69398J447J180p4j199j316q15m37k52o1o9l95n15M8R11J360J291J018O06
$$ plain form
52590 546244 548165 551349 555350 559291 562846 565783 567105 565626 561496 556480 552349 549481 547430 546370
52576 546370 547113 549699 552735 554586 554901 554642 554814 555546 556310 556668 556764 557283 559018 562259 566385 570047 571956
52559 571956 571752 570252 568821 568302 568546 568927 569130 569193 568972 568031 566240 564096 562196 560607 559107 557872
52543 557872 557476 558137 559308 560291 561113 562493 564811 567323 568642 568034 566070 563979 562613 562167 562497 563275
52527 563275 564114 565139 567348 571708 577686 583323 587155 589529 591626 593781 595366 595870 595253 593517 590834
52512 590834 588135 586724 586987 588040 588771 588636 587360 584763 581429 578732 577419 576547 574552 571126 567359
52497 567359 564312 562303 561446 561892 563206 564243 564135 563082 561967 561573 562288 564026 566085 567592 568445 569398
52481 569398 570845 572025 571951 570752 569436 568621 568184 567932 567871 567802 567407 566892 566940 567851 569211 570502 571520 572126
52463E72126J39K33J326K700L179K666K074J766J190K78M1J230L202M775N573
52448F02498N850N528M401L067K700L562M372L583J074j795l716m590n032n203
52434F16299m683l447k259j804j915k075k224k547k790k449j597r00p59q92q27
52419E85131l97K32P96J225J742K439K676J658j36r88o6J449K260K848M143N295
52403F10307M861L607L702N169N616M067K518K607L020J932l2j209j839l235n010
52388F36081n463m363l297l220l518l625l895m444m520l592k126q26Q1M46o9j367
$$ plain form
52463 572126 572265 572498 573824 576524 579703 582369 584443 586209 587399 587677 587718 588948 592150 596925 602498
52448 602498 608348 613876 618277 621344 624044 627606 631978 635561 636635 634840 631124 626534 621502 616299
52434 616299 611616 608169 605910 604106 602191 600116 597892 595345 592555 590106 588509 587609 586850 585958 585131
52419 585131 584734 584966 585762 586987 588729 591168 593844 595502 595366 594378 594312 595761 598021 600869 605012 610307
52403 610307 615168 618775 622477 627646 633262 637329 639847 642454 645474 647406 647374 646165 644326 641091 636081
52388 636081 630618 626255 622958 619738 616220 612595 608700 604256 599736 596144 594018 593192 593273 593719 593650 592283
$$ [...]
##END NTUPLES=NMR SPECTRUM
##END=
