
##TITLE=UV1131_M4-1010-1000_6275143_r6RMFeEnJ5
##JCAMPDX= 6.0         $$ Bruker NMR JCAMP-DX V2.0
##DATA TYPE= NMR SPECTRUM
##DATA CLASS= NTUPLES
##ORIGIN= BRUKER
##OWNER= Administrator
$$ 1.72 TOPSPIN		Version 2.1
$$ 2012-06-07 02:20:12.984 -0500  Administrator@TOPSPIN
$$ Compression mode = diff/dup
##.OBSERVE FREQUENCY= 400.13188235
##.OBSERVE NUCLEUS= ^1H
##.ACQUISITION MODE= SIMULTANEOUS (DQD)
##.ACQUISITION SCHEME= undefined
##.AVERAGES= 8
##.DIGITISER RES= 22
##SPECTROMETER/DATA SYSTEM= spect
##.PULSE SEQUENCE= zg30
##.SOLVENT NAME= COFFEE_meoh
##.SHIFT REFERENCE= INTERNAL, COFFEE_meoh, 1, 14.98061
##AUDIT TRAIL= $$ (NUMBER, WHEN, WHO, WHERE, PROCESS, VERSION, WHAT)
$$ ##TITLE= Audit trail, TOPSPIN		Version 2.1
$$ ##JCAMPDX= 5.01
$$ ##ORIGIN= Bruker BioSpin GmbH
$$ ##OWNER= Administrator
$$ $$ C:\Bruker\TOPSPIN/data/COFFEE/nmr/UV1131_M4-1010-1000_6275143_r6RMFeEnJ5/20/pdata/1/auditp.txt
$$ ##AUDIT TRAIL=  $$ (NUMBER, WHEN, WHO, WHERE, PROCESS, VERSION, WHAT)
(   1,<2012-06-07 02:20:04.312 -0500>,<Administrator>,<TOPSPIN>,<go>,<TOPSPIN 2.1>,
      <created by zg
	started at 2012-06-07 02:18:57.312 -0500,
	POWCHK enabled, PULCHK disabled,
       configuration hash MD5:
       D5 CA 7A 23 FE 6B EE E2 50 67 74 61 24 F7 5E 3B
       data hash MD5: 64K
       42 81 8F 40 43 7F E9 0E A1 66 DB C9 C9 88 63 C8>)
(   2,<2012-06-07 02:20:08.625 -0500>,<Administrator>,<TOPSPIN>,<proc1d>,<TOPSPIN 2.1>,
      <Start of raw data processing
       efp LB = 0 FT_mod = 6 PKNL = 1 PHC0 = 0 PHC1 = 0 SI = 32K 
       data hash MD5: 32K
       D3 65 2D BA 5E FB 19 9E C7 25 14 6F E9 BE 1E BC>)
(   3,<2012-06-07 02:20:09.000 -0500>,<Administrator>,<TOPSPIN>,<proc1d>,<TOPSPIN 2.1>,
      <pk PHC0 = 207.691 PHC1 = 0 
       data hash MD5: 32K
       28 D6 79 35 A3 3F AE 79 85 C9 71 ED C8 FD 9C F2>)
(   4,<2012-06-07 02:20:09.078 -0500>,<Administrator>,<TOPSPIN>,<proc1d>,<TOPSPIN 2.1>,
      <abs ABSG = 1 
       data hash MD5: 32K
       C6 8D 9D 1F A2 E2 61 9C 2F 48 0D A5 E9 44 88 DA>)
(   5,<2012-06-07 02:20:09.125 -0500>,<Administrator>,<TOPSPIN>,<proc1d>,<TOPSPIN 2.1>,
      <abs ABSG = 2 
       data hash MD5: 32K
       22 ED FE 7B 11 3F D0 4D 48 70 CF FD 73 D6 FC D1>)
(   6,<2012-06-07 02:20:09.156 -0500>,<Administrator>,<TOPSPIN>,<proc1d>,<TOPSPIN 2.1>,
      <abs ABSG = 3 
       data hash MD5: 32K
       DA 41 DE 23 15 2E 37 62 93 DC 87 C9 03 7D A7 A2>)
(   7,<2012-06-07 02:20:09.203 -0500>,<Administrator>,<TOPSPIN>,<proc1d>,<TOPSPIN 2.1>,
      <abs ABSG = 4 
       data hash MD5: 32K
       48 12 E7 62 16 93 32 F5 2C 73 BE 8E 68 0C 3B 54>)
(   8,<2012-06-07 02:20:09.234 -0500>,<Administrator>,<TOPSPIN>,<proc1d>,<TOPSPIN 2.1>,
      <abs ABSG = 5 
       data hash MD5: 32K
       7E 2B 38 F4 AE 30 66 8C C5 6E 48 FF 84 81 A1 96>)
$$ ##END=
$$ 
$$ $$ hash MD5
$$ $$ 36 B4 80 7B 4E E4 2A 2C 4C AB 8D 26 3D D8 C3 AC
##$RELAX= 
##$RELAX= 
##$RELAX= 
##$RELAX= 
##$RELAX= 
##$RELAX= 
##$RELAX= 
$$ Bruker specific parameters
$$ --------------------------
$$ [...]
##$TP= (0..7)
150 150 150 150 150 150 150 150
##$TP07= 0
##$TPNAME0= <>
##$TPNAME1= <>
##$TPNAME2= <>
##$TPNAME3= <>
##$TPNAME4= <>
##$TPNAME5= <>
##$TPNAME6= <>
##$TPNAME7= <>
##$TPOAL= (0..7)
0.5 0.5 0.5 0.5 0.5 0.5 0.5 0.5
##$TPOFFS= (0..7)
0 0 0 0 0 0 0 0
##$TUNHIN= 0
##$TUNHOUT= 0
##$TUNXOUT= 0
##$USERA1= <user>
##$USERA2= <user>
##$USERA3= <user>
##$USERA4= <user>
##$USERA5= <user>
##$V9= 5
##$VALIST= <valist>
##$VCLIST= <CCCCCCCCCCCCCCC>
##$VD= 0
##$VDLIST= <DDDDDDDDDDDDDDD>
##$VPLIST= <PPPPPPPPPPPPPPP>
##$VTLIST= <TTTTTTTTTTTTTTT>
##$WBST= 2048
##$WBSW= 25
##$XGAIN= (0..3)
0 0 0 0
##$XL= 0
##$YL= 0
##$YMAX_a= 509938
##$YMIN_a= -622524
##$ZGOPTNS= <>
##$ZL1= 120
##$ZL2= 120
##$ZL3= 120
##$ZL4= 120
##$ABSF1= 14.98061
##$ABSF2= -5.57192
##$ABSG= 5
##$ABSL= 3
##$ALPHA= 0
##$AQORDER= 0
##$ASSFAC= 0
##$ASSFACI= 0
##$ASSFACX= 0
##$ASSWID= 0
##$AUNMP= <proc_prof1d_extract_pilot.lims>
##$AXLEFT= 0
##$AXNAME= <>
##$AXNUC= <1H>
##$AXRIGHT= 0
##$AXTYPE= 0
##$AXUNIT= <>
##$AZFE= 0.1
##$AZFW= 0.1
##$BCFW= 0
##$BC_mod= 0
##$BYTORDP= 0
##$COROFFS= 0
##$CY= 15
##$DATMOD= 1
##$DC= 0
##$DFILT= <>
##$DTYPP= 0
##$F1P= 0
##$F2P= 0
##$FCOR= 0.5
##$FTSIZE= 32768
##$FT_mod= 6
##$GAMMA= 0
##$GB= 0
##$INTBC= 1
##$INTSCL= 1
##$ISEN= 128
##$LB= 0
##$LEV0= 0
##$LPBIN= 0
##$MAXI= 10000
##$MC2= 0
##$MEAN= 0
##$ME_mod= 0
##$MI= 0
##$NCOEF= 0
##$NC_proc= -8
##$NLEV= 6
##$NOISF1= 0
##$NOISF2= 0
##$NSP= 0
##$NTH_PI= 0
##$NZP= 0
##$OFFSET= 14.98061
##$PC= 1
##$PHC0= 207.691
##$PHC1= 0
##$PH_mod= 1
##$PKNL= yes
##$PPARMOD= 0
##$PPDIAG= 0
##$PPIPTYP= 0
##$PPMPNUM= 2147483647
##$PPRESOL= 1
##$PSCAL= 4
##$PSIGN= 0
##$PYNMP= <proc.py>
##$REVERSE= no
##$SF= 400.13
##$SI= 32768
##$SIGF1= 0
##$SIGF2= 0
##$SINO= 400
##$SIOLD= 32768
##$SPECTYP= <>
##$SREGLST= <1H.CDCl3>
##$SSB= 0
##$STSI= 32768
##$STSR= 0
##$SW_p= 8223.68421052632
##$SYMM= 0
##$S_DEV= 0
##$TDeff= 65536
##$TDoff= 0
##$TI= <>
##$TILT= no
##$TM1= 0
##$TM2= 0
##$TOPLEV= 0
##$USERP1= <user>
##$USERP2= <user>
##$USERP3= <user>
##$USERP4= <user>
##$USERP5= <user>
##$WDW= 1
##$XDIM= 32768
##$YMAX_p= 462667884
##$YMIN_p= -714395
##$CURPLOT= <Network HP LaserJet P1505>
##$CURPRIN= <$Network HP LaserJet P1505>
##$DFORMAT= <normdp>
##$LAYOUT= <+/1D_H.xwp>
##$LFORMAT= <normlp>
##$PFORMAT= <normpl>
##$SURQMSG= 1
$$ End of Bruker specific parameters
$$ ---------------------------------
##NTUPLES= NMR SPECTRUM
##VAR_NAME=  FREQUENCY,     SPECTRUM/REAL,   SPECTRUM/IMAG
##SYMBOL=    X,             R,               I
##VAR_TYPE=  INDEPENDENT,   DEPENDENT,       DEPENDENT
##VAR_FORM=  AFFN,          ASDF,            ASDF
##VAR_DIM=   32768,         32768,           32768
##UNITS=     HZ,            ARBITRARY UNITS, ARBITRARY UNITS
##FACTOR=    0.250966925370066, 1,           1
##FIRST=     8223.43324360095, -2848,        -96640
##LAST=      0,             42688,           19815
##MIN=       0,             -714395,         0
##MAX=       8223.43324360095, 462667884,    0
$$ Real data points
##PAGE= N=1
##DATA TABLE= (X++(R..R)), XYDATA
$$ [...]
$$ plain form
19559 -115951 -50626 -11493 126229 762 90262 60886 -96860 229807 -130288 -126662 -46733
19547 -25467 -97746 -184073 62635 -115737 19895 93374 -6562 33332 -23882 74103 -247662
19535 52910 64991 -115388 -187030 -151695 78936 183565 142332 -139885 -210655 26389 -262508
19523 -406097 23698 5303 -182767 218665 -82667 -318423 187272 -349257 -346592 -4048 -36655
19512 -36655 281149 -181316 -14435 -55967 -214023 -27554 -371962 -135333 34636 -56254 -34981
19501 -34981 37758 -122113 -145298 -95660 -77914 -302794 -358170 -90540 63034 -146273 72895
19489 258389 -225075 -284210 -78165 75733 136262 186720 149762 -113188 -114817 -124836 6318
19477 -163563 81595 -270135 24796 -268219 -23445 -56415 -118606 -198990 -182552 -152970 162369
$$ packed form
19559a15951e0626a1493A26229G62Q9500k9376i6860B29807a30288L626d6733
19547b5467p2279q6327F2635a15737A9895P3479f562C3332b3882G4103b47662
19535E2910J2081a15388p1642L5335G8936J04629m1233a39885p0770B6389b62508
19523d06097B3698E303a82767B18665h2667k35756A87272c49257K665d048l2607
19512c6655B81149a81316a4435m1532j58056b7554l44408a35333C4636e6254K1273
19501c4981C7758a22113k3185M9638J7746k24880n5376i0540F3034a46273G2895
19489B58389b25075n9135g8165G5733O0529N0458l6958a13188j629j0019F318
19477a63563H1595b70135B4796b68219b3445l2970o2191q0384J6438K9582A62369
$$ plain form
19465 -127850 -95379 -172582 -169842 150496 90841 317618 -94637 40873 -10331 91243 69007
19454 69007 -21196 -20211 -101818 17358 -25417 -42078 -86974 85077 -76878 -343758 -98206 -141723
19442 -141723 142861 32361 -377942 -146515 -146232 126195 45892 198201 25461 12287 12785
19431 12785 276153 50704 5035 114270 -239428 -142345 -96899 -384387 50040 -116204 -349642
19420 -349642 377484 -151701 225835 -204010 66511 106117 -33309 -103255 -254774 -101718
19409 -126878 -220900 -300619 -48211 -387090 -31795 -296859 -141042 -168329 -75173 136019 -396614
19397 -37353 47810 -307531 -185010 -145162 -43840 -56733 -118464 24891 -151133 -9857 -258858
19386 -258858 -17779 8076 -204767 -372937 -163487 69882 -282637 78595 248850 -86912 71376
$$ packed form
19465a27850L2471p7203K740A50496n9655K26777i4637D0873a0331I1243k2236
19454F9007b1196R85q1607A7358b5417j6661m4896H5077g6878k66880i8206m3517
19442a41723A42861C2361c77942a46515K83A26195D5892J52309B5461A2287M98
19431A2785K63368E0704E035J09235b39428R7083M5446k87488E0040a16204k33438
19420c49642C77484a51701B25835b04010F6511L9606c3309o9946j51519a01718
19409a26878r4022p9719d8211l38879c1795k65064a41042k7287g5173A36019c96614
19397c7353D7810c07531J22521L9848d3840j2893o1731B4891a51133i857k49001
19386b58858a7779H076b04767j68170a63487F9882b82637G8595J70255h6912G1376
$$ plain form
19374 -253713 -568347 -246812 146864 56096 -131501 -187857 179214 575 252403 146532
19364 146532 -350462 140132 -555050 -213656 74051 -22845 -55949 336359 -19440 -2474 -83771
19353 -83771 -183304 -359994 -176127 -480305 -46306 -130553 75292 41483 -118259 -119424 -200823
19342 -200823 58595 -122097 -26637 -323865 -1863 -169162 -286144 144094 -237605 -393321
19332 -393321 -210521 -91350 45667 -192243 -59171 100241 284687 -15488 -42775 228500
19321 -69019 97626 103354 -255039 273 -39361 -281127 -79400 -132269 109635 198069 -53584 71795
19308 -313358 -194809 -172262 -151863 -155369 215118 59756 -174859 23449 98088 256609 77303
19296 106668 107149 -178390 29967 165425 234501 391095 -161805 185185 161696 220678 -33401
$$ packed form
19374b53713l14634b46812A46864E6096a31501n6356A79214E75K51828j05871
19364A46532c50462A40132e55050b13656G4051b2845l3104C36359a9440b474q1297
19353h3771r9533j76690a76127l04178d6306q4247G5292l3809a18259j165q1399
19342b00823E8595a22097b6637k97228a863j67299j16982A44094b37605j55716
19332c93321J82800i1350D5667a92243e9171A00241J84446a5488k7287B28500
19321f9019I7626N728b55039B73c9361k41766g9400n2869A09635Q8434e3584G1795
19308c13358J18549K2547K0399l506B15118E9756a74859B3449P4639J58521G7303
19296A06668M81a78390B9967J35458O9076J56594a61805A85185k3489N8982c3401
$$ plain form
19284 29108 -68495 -282654 -389298 -264269 -264235 153153 -110179 -36853 210128 -413987 100105
19272 -76082 -51404 166811 247163 6239 -30635 33688 66121 -119456 -26313 82174 -178173
19260 -61869 59350 -151340 25278 -51893 -157072 185215 172240 -48372 -314827 102532 -151091
19248 -55217 179062 -3126 -54942 1775 -96749 -206015 -49982 -156894 -64314 -254105 169652
19236 12863 92918 -256273 -262605 36669 -152566 -35150 -373714 65579 13238 -21989 -19141
19225 -19141 180440 -86145 15466 -111769 -280301 33172 -43280 -127757 -336964 -82515 -248446
19214 -248446 261160 -75820 58086 -229884 -432240 -143011 -18602 -56887 -61755 -187053 -72224
19202 200841 -14205 -221069 53774 -294507 205703 -95539 -369254 -37291 23518 292261
$$ packed form
19284B9108f8495k14159j06644J25029L4A53153a10179c6853B10128d13987A00105
19272g6082K4678A66811Q0352F239c0635C3688L2433a19456b6313H2174a78173
19260f1869E9350a51340B5278e1893j05179A85215j2975d8372k66455A02532a51091
19248e5217A79062c126n1816A775i6749j09266d9982j06912f4314j89791A69652
19236A2863Q0055b56273o332C6669a52566c5150l38564F5579A3238b1989K848
19225a9141A80440h6145A5466a11769j68532C3172d3280q4477k09207h2515j65931
19214b48446B61160g5820E8086b29884k02356a43011a8602l8285m868j25298g2224
19202B00841a4205k06864E3774b94507B05703i5539k73715c7291B3518K68743
$$ plain form
19192 292261 51461 -49750 -53552 -270179 -349553 -362184 -192777 -87947 -124313 -159939 -34460
19180 -137462 212208 300065 56389 -205437 -343602 128637 26037 -79391 -78846 -225287 -24993
19168 -96767 -4558 116316 -33247 -342168 -12721 -54811 -250844 91185 -79827 -27091 -29968
19157 -29968 -215510 29514 -27985 -91843 128387 -40475 -96700 275630 188518 -261666 -128832
19145 -186411 -109760 24671 467 -35485 -73976 -403480 -37352 28620 -5433 -100705 5612 185138
19133 185138 -103722 -129609 -130013 -90967 -183774 -58558 -160780 -330990 -373847 -344413 212973
19121 -179259 -88036 201737 -79431 109934 -5975 -419181 113374 150472 86684 29883 58585
19110 58585 -128271 -6928 -6614 -30508 60200 188740 -317301 -95410 38594 41579 -27543 48191
$$ packed form
19192B92261E1461d9750l802k16627p9374j2631J69407h7947l6366l5626c4460
19180a37462B12208Q7857E6389b05437j38165A28637B6037g9391N45j46441b4993
19168i6767d558A16316c3247l08921a2721m2090j96033I1185g9827b7091k877
19157b9968j85542B9514b7985o3858A28387d0475n6225B75630q7112b61666a28832
19145a86411P6651B4671D67c5485l8491l29504c7352B8620e433r5272E612J79526
19133A85138a03722k5887m04L9046r2807e8558j02222j70210m2857K9434B12973
19121a79259h8036B01737g9431A09934e975m13206A13374L7098o3788B9883K8702
19110E8585a28271f928L14k3894F0200J28540c17301i5410C8594K985b7543D8191
$$ plain form
19097 21266 -217615 108552 -99623 -140569 53643 11856 62586 -145634 15833 -175502 -105841
19086 -105841 -25852 -17525 129485 -59962 58648 -343026 -145886 336674 -152184 -200172 -444263
19075 -444263 49025 -171207 133642 17557 -253989 -265488 16880 80141 -149910 -43110 196296
19063 103182 -291170 67380 -61909 -247180 13523 -233831 57099 -81238 238665 -79488 -36528
19051 -118593 -301091 3488 -183517 -86717 90198 -59592 -37109 47775 -185850 102706 177345
19040 177345 -144678 91256 -196256 -262754 32111 363021 221238 113557 87234 3716 -222624
19028 -95417 150677 27077 -18406 -306286 -66623 6998 25531 -378060 45879 80871 -104130
19016 115616 -213152 144421 249955 -95806 -11864 -155993 197162 -39940 -63920 -156752
$$ packed form
19097B1266b17615A08552i9623m0946E3643A1856N0730a45634A5833a75502O9661
19086a05841b5852Q327A29485e9962E8648c43026a45886C36674a52184m7988k44091
19075d44263D9025a71207A33642A7557b53989j1499A6880O3261a49910d3110A96296
19063A03182b91170F7380f1909j85271A3523b33831E7099h1238B38665g9488c6528
19051a18593j82498C488a83517h6717I0198e9592K2483D7775a85850A02706P4639
19040A77345a44678I1256a96256o6498C2111L30910j41783j07681k6323C716b22624
19028i5417A50677B7077a8406k87880f6623F998J8533c78060D5879L4992a04130
19016A15616b13152A44421J05534i5806a1864j44129A97162c9940k3980r2832
$$ plain form
19006 -156752 49579 -42945 405866 -14709 -114018 -38013 -18720 -378404 18667 43435 105978
18995 105978 -5519 -54702 50807 -256601 92091 -109109 67226 -239029 -6915 49699 146135
18984 146135 14212 127840 -122072 -115045 -110077 64923 -20650 85695 -176865 -28902 -278929
18973 -278929 -246643 -145861 3986 -36997 -193411 -3335 -102793 162422 141389 -14849 156977
18961 -1607 -62247 52384 -148345 -75870 -110363 -26295 -64055 -136954 18233 -2449 -112580 -125102
18949 -125102 -384291 -166839 120463 8644 201029 -121619 257170 7348 199982 25486
18938 102581 182962 -225276 -71071 56279 60565 145395 176173 58022 -109428 134606 -87541
18926 -5144 -45681 -81832 -102712 -77733 137863 40294 165883 -88200 -13386 82509 -2464 55077
$$ packed form
19006a56752D9579d2945D05866a4709r9309c8013a8720l59684A8667K4768O2543
18995A05978e519m9183E0807b56601I2091a09109F7226b39029f915D9699R6436
18984A46135A4212J13628a22072P027M968F4923b0650H5695a76865b8902k50027
18973b78929L2286J00782C986c6997j56414c335r9458A62422k1033a4849A56977
18961a607o0640E2384a48345P2475l4493b6295l7760p2899A8233b449j10131j2522
18949a25102k59189a66839A20463H644J92385a21619B57170G348J92634B5486
18938A02581Q0381b25276g1071E6279M286Q4830L0778E8022a09428A34606h7541
18926e144m0537l6151k0880K4979A37863D0294J25589h8200a3386H2509b464E5077
$$ plain form
18913 54218 -169943 -75890 49553 -35877 -166750 -180753 52042 -369686 -121868 -84259 -539728
18902 -539728 -117551 -92711 109598 -254337 -64200 253915 289118 18066 -159896 512946
18891 75991 -64658 -31497 21470 24610 228684 -82681 -153512 -79498 73507 -24816 43907 -42173
18878 -41091 47800 143698 -118283 134506 -395449 -112822 -118034 -51794 -193751 250246 185664
18867 185664 25908 -218707 85290 262642 99194 8547 48809 -110906 -125701 67838 -58686
18855 -335001 -69036 -80285 -316211 -20512 35491 -158955 5212 -67271 70888 -332835 -174878
18844 -174878 74695 -53953 -116031 51787 -189059 68456 -33288 -56934 -131704 97468 -110379
18832 60771 32941 195073 -123933 -184414 -79882 -144937 -108965 42106 -99155 36408 302334
$$ packed form
18913E4218a69943g5890D9553c5877j30873j4003E2042c69686a21868L7609m55469
18902e39728a17551K4840A09598b54337f4200B53915L5203A8066a59896E12946
18891G5991f4658c1497B1470L140K04074h2681p0831P4014G3507b4816D3907d2173
18878d1091D7800R5898a18283A34506c95449a12822n212e1794j41957B50246o4582
18867A85664B5908b18707H5290J77352I9194H547M0262a10906j4795F7838e8686
18855c35001f9036j1249k35926b0512C5491a58955E212f7271G0888c32835J57957
18844a74878G4695e3953o2078E1787a89059F8456c3288k3646p4770I7468a10379
18832F0771k7830J62132a23933o0481g9882o5055L5972D2106i9155C6408K65926
$$ plain form
18821 302334 -33648 51669 -168791 -4803 39510 -79399 28262 -8752 -207220 -91344 96027
18809 48705 -281503 -378202 238544 79635 -59098 -72815 239536 -66869 162580 344425 -154663
18797 -56526 -56115 151919 -108109 52341 -19864 44896 -36011 -186243 -60492 -134503 48432
18785 -73201 -5847 171799 -68904 -98213 -169719 297469 240500 128906 -84004 1175 45214
18774 45214 -45122 -94625 -316734 303324 139483 238360 -50104 74994 27380 56942 -73329
18762 -207161 -455954 82423 -120277 -9647 -95857 -113294 47370 -53037 41558 -150777 -93836
18751 -93836 -133413 -436107 -215348 -194043 368461 -88755 -196851 113492 2520 125870 103710
18740 103710 -297387 364186 -226539 -89101 -175611 136020 -111609 -98483 177969 47261
$$ packed form
18821C02334c3648E1669a68791d803C9510g9399B8262h752j98468i1344I6027
18809D8705b81503r6699B38544G9635e9098j3717B39536f6869A62580J81845a54663
18797e6526M11A51919a08109E2341a9864D4896c6011j50232f0492p4011D8432
18785g3201e847A71799f8904k9309p1506B97469n6969j11594h4004A175M4039
18774D5214d5122m9503k22109C03324A39483R8877e0104G4994B7380K9562g3329
18762b07161k48793H2423a20277i647q6210j7437D7370e3037D1558a50777N6941
18751i3836l9577l02694b15348K1305C68461h8755j08096A13492B520J23350k2160
18740A03710b97387C64186b26539h9101q6510A36020a11609J3126A77969D7261
$$ plain form
18729 -183286 -283896 -133231 33955 -105245 271784 -18686 108204 -244206 373535 -26471
18718 -114566 -41909 -198841 -115160 192981 -48259 -94728 -188908 -122890 65547 153090 -92537
18706 -155234 9007 -308937 -132018 -417443 -192006 -91458 -233491 -214348 18027 -188937
18695 -164303 248246 21236 -182921 118735 -90725 -226955 -297498 -175900 26759 -213180
18684 -5773 76958 254012 99387 -207707 72361 -75910 110622 -331610 283042 -97668 -162442
18673 -162442 -468085 -154359 -70181 -126668 354849 -170981 -114494 205162 2692 224034
18663 224034 -122459 -46125 58331 143767 -257033 -189811 270911 44410 -139620 -27533 -273033
18652 -273033 -52531 119203 54019 1109 -136733 -22128 -9959 48543 -194220 -129868 190075
$$ packed form
18729a83286j00610a33231C3955a05245B71784a8686A08204b44206C73535b6471
18718a14566d1909j56932Q3681A92981d8259m6469r4180O6018F5547Q7543i2537
18706a55234I007c08937a32018k85425a92006i1458j42033J9143A8027a88937
18695a64303B48246B1236a82921A18735i0725j36230p0543J21598B6759b13180
18684e773G6958J77054I9387b07707G2361g5910A10622c31610B83042i7668o4774
18673a62442l05643a54359g0181n6487C54849a70981N6487B05162B692K21342
18663B24034a22459d6125E8331Q5436b57033O7222B70911D4410a39620b7533k45500
18652b73033e2531A19203E4019A109a36733b2128i959D8543a94220O4352A90075
$$ plain form
18640 77889 109517 -37149 -289838 -174568 -21736 -136184 -120092 -247239 33772 114154 -157977
18628 -114239 15382 10548 -226869 33173 -15489 37220 150474 -188047 -238888 279386 -174670
18616 -257396 -274143 349267 -31059 -21785 -32665 76413 -126542 208881 -87925 100806 -11286
18604 64024 -222977 50390 -94388 -18906 -255734 -56062 -57332 66525 -216683 -69981 -61271
18593 -61271 -523397 -36559 -487073 -16023 -78546 -149341 -223385 183856 135879 -222474 -96206
18581 -56450 -134593 -270200 -267472 104175 29050 213489 -97472 37068 -12194 -288841 114437
18569 -51904 -178277 165178 -301418 -162343 11376 -64037 -103112 -240858 -188284 199888
18558 -76143 -321167 -195831 244661 20110 -144721 -189678 97937 -35933 -128829 -134671 -201377
$$ packed form
18640G7889L1628c7149k52689J15270b1736j14448J6092j27147C3772Q0382a57977
18628a14239A5382m834b26869C3173a5489C7220J13254a88047n0841B79386a74670
18616b57396j6747C49267c1059R274j0880G6413a26542B08881h7925A00806a1286
18604F4024b22977E0390i4388a8906k36828e6062j270F6525b16683f9981Q710
18593f1271m62126c6559m50514a6023o2523p0795p4044A83856m7977b22474i6206
18581e6450p8143j35607K728A04175B9050J84439i7472C7068a2194k76647A14437
18569e1904j26373A65178c01418J39075A1376f4037l9075j37746N2574A99888
18558g6143k45024J25336B44661B0110a44721m4957I7937c5933r2896n842o6706
$$ plain form
18547 -201377 32118 -325748 -141051 25857 22313 -119901 -238936 4812 38293 -64404 186242
18535 107676 -25808 231984 19559 101958 78370 -59650 -61426 -198811 96313 -122780 21749
18523 136164 43347 18268 -90110 -53382 -182713 5742 10293 140637 48506 -127306 -92101
18512 -92101 -260568 -110609 13953 107721 -149025 101386 175606 181275 18567 -398287 -78295
18500 -27807 -90204 130432 161886 -83768 -134325 35717 -175974 -180810 27591 91574 -18511
18488 -43429 88418 177692 -58250 73773 -10735 -23432 -136819 -151878 -352922 -64557 -165023
18477 -165023 -434631 -5392 -81188 -194537 -136983 -248559 -27208 81016 -115296 319364 -236212
18465 238811 -259004 -73103 -97037 158287 -77123 -360819 123846 -207106 119341 42913
$$ packed form
18547b01377C2118c25748a41051B5857l544a19901j19035D812L3481f4404A86242
18535A07676b5808B31984A9559Q2399k3588e9650j776j37385I6313a22780B1749
18523A36164D3347A8268i0110L6728j29331E742M551J30344D8506a27306L5205
18512i2101j68467a10609A3953R3768a49025A01386P4220N669A8567c98287g8295
18500b7807o2397A30432L1454h3768n0557C5717a75974m836B7591O3983a8511
18488d3429H8418Q9274e8250G3773a0735j2697j13387j5059k01044f4557j00466
18477a65023k69608e392p5796j13349N7554j11576b7208H1016a15296C19364b36212
18465B38811b59004g3103k3934A58287g7123k83696A23846b07106A19341D2913
$$ plain form
18454 22474 -128569 -130446 -329212 118208 267362 -390646 -71236 -49382 -9057 55718 190994
18443 190994 -93185 -22672 57244 -279013 -63595 51572 99761 -36577 -321363 120744 -109217
18431 24890 -24019 -200188 -67030 -121892 123528 -50683 -236184 -4738 -402241 -117532 -71859
18420 -71859 -184480 -45401 104698 -290868 54646 -92149 -68890 131716 -310620 92113 -209302
18408 -334855 60932 -82473 -329374 -392922 40974 6978 36873 -3069 32906 32190 -428529 -46782
18395 180445 -335602 97680 -100880 -204751 42354 -143911 61137 -55932 77456 -154854
18384 -321714 165859 56433 212081 62010 -87167 -78818 320988 -105046 -362132 -29954 -257727
18373 -257727 135048 -367350 -32383 18469 -402 226099 178500 -264920 -63126 59263 -152820
$$ packed form
18454B2474a28569j877j98766A18208J49154c90646g1236K1854i057E5718J35276
18443A90994i3185b2672E7244b79013f3595E1572M8189c6577k84786A20744a09217
18431B4890b4019j76169f7030n4862A23528e0683j85501d738l97503a17532M5673
18420g1859j12621d5401A04698b90868E4646i2149K3259A31716c10620I2113b09302
18408c34855F0932h2473k46901o3548D0974F978K9895c069C2906p16d28529d6782
18395A80445c35602I7680a00880j03871D2354a43911F1137e5932G7456a54854
18384c21714A65859E6433J55648F2010h7167Q349C20988a05046k57086b9954k27773
18373b57727A35048c67350c2383A8469d02B26099m7599b64920f3126E9263a52820
$$ plain form
18361 -174031 -126705 -130859 118198 -236031 128914 50080 120110 118402 352064 -5124 48705
18349 -8973 203 198046 -205334 -198480 61525 -85764 -146841 34503 -203107 -178698 2443 79703
18337 79703 -235137 77133 62150 -110723 128761 -282353 60848 -276005 302204 89832
18326 378008 -81386 456470 292581 90890 -2035 -297812 -129233 -222985 -237334 27146 419848
18315 419848 338407 -27243 57879 -97714 -96808 152770 1449 -269165 -12346 -62809 -117876 28704
18302 -129925 219956 -330820 -14411 -107145 470272 -17458 -33804 273991 -43748 -44224 -107554
18291 -107554 -115920 34591 -360545 -69405 17246 88862 232603 -15594 17213 -160138 167307
18279 50511 -497399 -607 -186554 -298284 70072 217514 -440574 257911 -244803 -142395
$$ packed form
18361a74031M7326m154A18198b36031A28914E0080P0030j708K33662e124D8705
18349h973B03J97843b05334O854F1525h5764o1077C4503b03107K4409B443P7260
18337G9703b35137G7133j4983a10723A28761b82353F0848b76005C02204H9832
18326C78008h1386D56470j63889I0890b035k95777a29233r3752j4349B7146L92702
18315D19848q1441b7243E7879i7714R06A52770A449b69165a2346n0463n5067B8704
18302a29925B19956c30820a4411r2734D70272a7458j6346B73991d3748m76o3330
18291a07554q366C4591c60545f9405A7246P1616J43741a5594A7213a60138A67307
18279E0511d97399f07j85947j11730G0072J47442d40574B57911b44803J02408
$$ plain form
18269 -142395 45607 59745 -42675 290171 -64483 46063 -190526 -116141 -59132 -224900 -56156
18257 -257270 -425463 -330567 -94680 -154884 68834 193983 457302 -200388 75454 -252447
18246 -122974 -182414 244468 -22781 264990 239847 -278040 261252 4755 74694 -364812 74548
18234 -43004 79865 15983 -25927 245755 20732 -221482 84200 -38280 -65843 -147283 156055
18222 -192994 191360 -70001 23943 -264469 -45066 11495 -133327 -157518 49597 -32586 58486
18210 -158824 36067 -162901 -267091 -223732 159539 -107385 -11633 -266799 -18643 -340445
18200 -340445 -86218 190823 213744 63741 -1951 -16808 -243296 -283051 44021 -327555 -91711
18188 -195217 227774 95829 -48093 11048 286638 -179803 -24526 -148523 170865 334797
$$ packed form
18269a42395D5607J4138d2675B90171f4483D6063a90526P4385N7009j65768e6156
18257b57270j68193R4896i4680o0204F8834J25149K63319b00388G5454b52447
18246a22974n9440B44468b2781B64990k5143b78040B61252D755O9939c64812G4548
18234d3004G9865A5983b5927B45755B0732b21482H4200c8280k7563q1440A56055
18222a92994A91360g0001B3943b64469d5066A1495a33327k4191D9597c2586E8486
18210a58824C6067a62901j04190M3359A59539a07385a1633k55166a8643l21802
18200c40445h6218A90823K2921F3741a951j4857k26488l9755D4021c27555i1711
18188a95217B27774I5829d8093A1048K75590a79803b4526j23997A70865J63932
$$ plain form
18178 334797 -248591 197747 -9024 -429426 47885 -253133 -105997 -173055 -345298 -65990
18167 352220 234012 -31770 78963 -93478 115622 -315995 89158 98146 156887 -67205 -4018
18155 -89171 128849 -20989 -163841 137707 154480 100791 -27836 -88293 305782 -222950 24262
18143 205190 -161335 290117 -239406 -311828 27029 9645 312826 107147 -23785 51387 -213092
18131 -213870 -464942 -101539 -62081 -21842 206270 -40807 -71213 29641 -220461 -135711 -17558
18119 -113552 94443 85697 139745 113567 -410594 317500 -102107 96207 -18201 98566 -48792
18107 66581 -115814 344788 -103672 -93962 254812 78464 -16954 -46689 78800 62105 113763
18096 113763 -132354 -271262 47916 -77300 2773 141561 -271835 128715 -160210 -18668
$$ packed form
18178C34797b48591A97747i024m20402D7885b53133a05997o7058j72243f5990
18167C52220j18208c1770G8963i3478A15622c15995H9158Q988N8741f7205d018
18155h9171A28849b0989j42852A37707J6773n3689b7836o0457C05782b22950B4262
18143B05190a61335B90117b39406p2422B7029I645L03181A07147b3785E1387b13092
18131b13870k51072a01539L9458b1842B06270d0807l0406B9641b20461Q4750a7558
18119a13552I4443q746N4048k6178d10594C17500a02107I6207a8201I8566d8792
18107F6581a15814C44788a03672R710B54812G8464a6954k9735G8800j6695N1658
18096A13763a32354j38908D7916g7300B773J38788b71835A28715a60210a8668
$$ plain form
18085 -165608 -74752 -404532 171774 90239 -340977 -164951 -162692 164482 36166 -75469 -221353
18074 -221353 -131165 -316667 -29598 -34201 -66998 59887 -135322 9794 113183 278240 -216987
18062 -152875 38145 -92558 -12831 -23776 -100643 -67935 -212451 -87446 192364 -420976 -240936
18051 -240936 281836 31540 290333 143355 34963 -113072 -357347 15672 -166126 -25483
18040 -19411 -38251 -187112 95989 -34533 -300090 -51299 -289256 368403 -81320 -72096 15469
18028 -259755 22999 87448 -222379 127420 182431 -69676 -120698 -133921 -48667 -193649 381577
18016 76020 -1525 -229402 235558 -217483 -63944 -10620 -224050 -231216 -261474 36026 292648
18005 292648 -27037 -344079 39974 293910 223549 284535 -196890 205820 -15984 -91906 51987
$$ packed form
18085a65608g4752l29780A71774q1535c40977a64951K259A64482C6166g5469j45884
18074b21353R0188j85502b9598m603l2797E9887a35322I794J03389J65057b16987
18062a52875C8145i2558a2831j0945p6867L2708j44516h7446A92364d20976J80040
18051b40936B81836C1540K58793A43355C4963a13072k44275A5672a66126b5483
18040a9411j8840j48861I5989c4533k65557e1299k37957C68403h1320R224A5469
18028b59755B2999O4449b22379A27420N5011f9676n1022j3223d8667j44982C81577
18016G6020a525k27877B35558b17483f3944a0620k13430p166l0258C6026K56622
18005B92648b7037l17042C9974K53936p0361O0986a96890B05820a5984p5922E1987
$$ plain form
17993 -201517 -130800 -247188 -163974 72763 -79823 60043 -57400 -124267 156692 25306 -81766
17981 -235223 25172 35707 143428 -32752 -94532 -297107 -289850 63793 40541 131300 -62677
17969 -434104 53968 -324137 37767 82457 -202862 -134550 250414 -16315 261286 92735 127072
17958 127072 85158 -387907 99334 -295896 77703 82345 75650 -278141 153078 101650 -3455
17946 -140728 -347797 -151831 205674 -38180 -37989 -332717 157657 79740 244057 79130 -387293
17934 202008 106957 -28346 -291492 -160501 -165256 232456 206827 25717 -24875 142787 25003
17922 -40940 -36259 -106012 8513 10848 -271574 -292650 86594 -228591 46218 -383410 -87844 -179306
17910 -179306 57909 40948 -381480 266888 53008 437277 -57272 42554 -47120 173726 46789
$$ packed form
17993b01517P0717j16388Q3214G2763g9823F0043e7400o6867A56692B5306h1766
17981b35223B5172J0535J07721c2752o1780k02575P257F3793k3252R0759f2677
17969d34104E3968c24137C7767M4690b02862O8312B50414a6315B61286I2735L4337
17958A27072m1914c87907I9334b95896G7703M642o695b78141A53078n1428c455
17946a40728k07069a51831B05674c8180J91k94728A57657p7917J64317G9130c87293
17934B02008r5051b8346k63146J30991m755B32456k5629B5717b4875A42787B5003
17922d0940M681o9753H513K335b71574k1076H6594b28591D6218c83410h7844r1462
17910a79306E7909j6961c81480B66888E3008L84269e7272D2554d7120A73726D6789
$$ plain form
17898 74738 64917 106746 168192 192583 177455 -173157 -64823 55493 -276047 204342 -228954
17886 46036 -238866 -195638 -118271 176481 18531 269029 -89498 25862 27098 -113602 -134666
17875 -134666 35307 -51235 -43803 -74502 178023 50482 -95384 -58800 40788 261056 213781
17864 213781 -77455 -48732 -192884 -362381 94767 -87645 -241051 -330394 155836 -410873
17853 98287 -44201 -119851 -148834 -59081 160151 -203501 -59308 -146611 -308261 -27973 -22636
17842 -22636 -118223 199849 2848 29629 -77584 -196701 -24787 313151 -299523 -225937 64579
17830 74070 -107291 96708 120460 -1131 -177557 -196791 -71410 34051 321672 52539 93666
17819 93666 -66219 -356435 -110607 151337 -72899 286936 136916 39032 -11502 -81553 -120985
$$ packed form
17898G4738r821M1829O1446K4391j5128a73157f4823E5493b76047B04342b28954
17886D6036b38866M3228P7367A76481A8531K50498h9498B5862J236a13602k1064
17875a34666C5307e1235P432l0699A78023E0482i5384L6584D0788K20268m7275
17864B13781g7455K8723j44152j69497I4767h7645j53406q9343A55836d10873
17853I8287d4201p5650k8983e9081A60151b03501e9308q7303j61650b7973N337
17842b2636r5587A99849B848K6781g7584j19117b4787C13151b99523P3586F4579
17830G4070a07291I6708K3752a131j76426j9234g1410C4051K87621E2539M1127
17819I3666f6219k90216a10607A51337g2899B86936A36916C9032a1502p0051l9432
$$ plain form
17808 -120985 140299 -43506 -151958 -360356 196670 -288862 -297112 -48460 82637 265265
17798 265265 14446 5575 -82647 45736 -102916 -152385 -301165 -264007 115464 349729 -118496
17786 -315407 106255 -157589 -226033 -216241 45091 -133606 129442 -200550 -206587 -211837 -165997
17775 -165997 140751 -171390 -122066 327935 -7206 -67010 424793 -32356 -411797 -39475 152359
17763 -14199 166470 -70116 -191155 127903 162133 199722 55758 -284508 -50918 163925 64520
17751 -8417 -11289 120266 -290716 3282 105787 -38114 110041 175356 352455 116182 165765
17740 165765 273176 202970 72228 8907 342960 -173702 -129106 -2711 136601 271837 -66459
17728 3467 73253 -139330 -251714 160554 180713 -228145 218287 13097 97608 -192004 8707
$$ packed form
17808a20985A40299d3506j08452k08398A96670b88862q250d8460H2637J82628
17798B65265A4446E575h2647D5736a02916m9469j48780L7158A15464K34265a18496
17786c15407A06255a57589o8444R792D5091a33606A29442b00550o037n250M5840
17775a65997A40751a71390M9324C27935g206n9804D24793c2356l79441c9475A52359
17763a4199A66470g0116j21039A27903L4230L7589E5758b84508e0918A63925F4520
17751h417k872A20266b90716C282J02505c8114A10041O5315J77099A16182M9583
17740A65765J07411p0206G2228H907L34053a73702M4596b711A36601J35236f6459
17728C467O9786a39330j12384A60554K0159b28145B18287A3097Q4511a92004H707
$$ plain form
17716 -212901 -93651 171122 -338619 252622 224419 -100553 -72781 61865 76476 40278 290143
17705 290143 16378 -266810 267626 336864 -184578 159430 -174613 227345 -357809 -363224
17695 -363224 -76977 38792 57518 300438 -197689 -222054 -66441 45252 83058 364567 276077
17684 276077 61478 -365683 -249580 113461 100311 248064 21224 166926 30899 -34944
17673 -22756 -238471 35121 -369771 333173 -360356 83570 -59268 112303 144078 319539
17663 319539 -168733 121712 129999 -126431 82423 228813 238397 60412 -39195 4744 -180119
17651 264373 -236835 -303695 165434 -49471 282996 -280288 136579 44156 240333 -11557
17640 79208 6118 2977 -158655 202911 -81280 -168887 147029 -155580 173271 -143581 -326768
$$ packed form
17716b12901i3651A71122c38619B52622k8203a00553K7772F1865J4611l6198K49865
17705B90143A6378b66810B67626O9238a84578A59430a74613B27345c57809n415
17695c63224g6977C8792J8726K42920a97689k4365f6441D5252L7806K81509q8490
17684B76077F1478c65683J16103A13461j3150J47753B1224J45702C0899c4944
17673b2756k15715C5121c69771C33173c60356H3570e9268A12303L1775J75461
17663C19539a68733A21712Q287a26431H2423J46390R584F0412c9195D744a80119
17651B64373b36835o6860A65434d9471B82996b80288A36579D4156J96177a1557
17640G9208F118B977a58655B02911h1280q7607A47029a55580A73271a43581j83187
$$ plain form
17629 -326768 194259 51192 -9003 45870 -154462 273113 -153027 33532 28493 1586 194124
17618 194124 257945 -64310 -6266 -38429 -221314 -34790 -311562 81267 18896 342999 200526
17607 200526 145919 -137 -300236 -58030 -95116 168311 57563 99806 -89282 80199 86760 42580
17594 129186 -235767 -263128 -41494 85572 -310210 5090 154127 122335 42840 -124179 -228153
17583 -228153 15198 134156 94090 116717 -262656 199763 160658 133323 99017 -7642 164016
17571 30703 -182051 838 91400 -108879 50758 270310 -9463 216020 65692 178256 -38456
17559 137573 -113962 -73262 -51457 346431 -200602 -41757 41315 44699 69947 210478 -53427
17547 116057 239723 -269862 92499 7192 -256844 -151669 69197 -47510 235273 -34234 374034
$$ packed form
17629c26768A94259E1192i003D5870a54462B73113a53027C3532n039A586J92538
17618A94124O3821f4310f266l2163j82885c4790k76772H1267A8896L24103j42473
17607B00526n4607a37l00099e8030l7086A68311E7563M2243h9282H0199O561D2580
17594A29186b35767k7361d1494H5572c10210E090J49037l1792D2840a24179j03974
17583b28153A5198J18958m0066K2627b62656A99763l9105k7335l4306g642A64016
17571C0703a82051H38R0562a08879E0758K19552i463B16020F5692J12564c8456
17559A37573a13962M0700K1805C46431b00602d1757D1315L384K5248J40531e3427
17547A16057J23666b69862I2499G192b56844J05175F9197d7510B35273c4234C74034
$$ plain form
17535 144938 68678 -81547 340812 237636 213800 204609 103510 -117812 -3960 29310 79830
17524 79830 -38049 -163300 -57070 37163 -20757 -32143 -35581 182126 -118030 321068 -3155
17512 8732 4794 149279 -26789 35584 133609 -289326 -278123 287437 -94773 -84566 158610
17500 849 152615 17800 77144 -237401 298448 167083 179609 69898 -171878 164826 290963
17489 290963 77334 -16832 78713 238873 164124 68754 162668 232446 -30870 293666 -36264
17477 337995 261466 -293424 431452 148898 -83871 197485 -106411 317938 207427 263682
17467 263682 373156 99117 132674 220197 -15992 137048 -31704 -8342 350861 -75961 -27462
17455 -140157 -2201 263413 -45303 3043 151363 86325 -242677 18712 239711 158420 30192
$$ packed form
17535A44938F8678h1547C40812j03176k3836r191j01099a17812c960B9310N0520
17524G9830c8049j25251e7070C7163b0757j1386l438A82126a18030C21068c155
17512H732l938J44485b6789C5584R8025b89326J1203B87437i4773J0207A58610
17500H49J51766A7800N9344b37401B98448j31365J2526F9898a71878A64826J26137
17489B90963G7334a6832G8713J60160p4749F8754R3914O9778c0870B93666c6264
17477C37995p6529b93424D31452A48898h3871A97485a06411C17938j10511N6255
17467B63682J09474I9117L3557Q7523a5992A37048c1704h342C50861g5961b7462
17455a40157b201B63413d5303C043J48320o5038b42677A8712K20999q1291C0192
$$ plain form
17443 -155168 -58330 155142 534029 -236227 281099 92641 -90473 271445 203269 503147
17433 503147 270358 413687 447321 165402 54824 399324 7671 71226 158605 231669 509997
17422 509997 68794 121183 210437 -11740 -52109 145713 459299 255841 274716 344511 137133
17410 424370 403553 70491 190998 77836 362256 290211 44627 61347 -319550 56195 54170
17399 54170 590509 92004 364379 127934 277437 135506 -203864 175950 -79831 -54707
17389 -54707 -386911 -37267 305990 482396 193816 332164 -21619 188771 42476 215502
17379 215502 152629 179967 425549 22306 147151 -100901 170930 -40321 385111 233535
17369 233535 284539 -138980 96285 191316 -10580 381597 118798 -46678 421702 185358
$$ packed form
17443a55168e8330A55142L78887b36227B81099I2641i0473B71445o8176K99878
17433E03147k32789J43329L3634A65402E4824L44500G671O3555Q7379P3064K78328
17422E09997F8794N2389Q9254a1740m0369A45713L13586k03458J8875O9795A37133
17410D24370k0817G0491J20507G7836K84420p2045D4627J6720c19550E6195k025
17399E4170N36339I2004K72375A27934J49503A35506b03864A75950g9831K5124
17389e4707l32204c7267C05990J76406A93816J38348b1619A88771D2476J73026
17379B15502o2873K7338K45582B2306J24845a00901A70930d0321C85111j51576
17369B33535N1004a38980I6285R5031a0580C81597A18798d6678D21702A85358
$$ plain form
17358 326734 116776 -15596 167314 164125 456547 -99572 281648 -92813 390897 -3014 217757
17346 90198 137135 362766 136869 -90097 14030 3189 319081 82677 244194 -270137 9968
17334 179712 73850 376394 249609 154945 402372 -28833 94006 184934 -330766 173102
17323 -102772 397052 381165 -6139 146666 14159 84635 93484 154191 374648 -218990 143311
17311 472628 -161301 19313 314741 226252 289553 -48912 -34486 -16635 -29384 163601 161306
17300 161306 85665 -41812 188966 250601 46038 91908 -123564 -31808 124743 88534 309502
17289 309502 89776 251835 14439 452733 228598 110415 220544 -143099 19435 175797
17279 175797 71591 -38247 -44350 440467 229042 130053 210088 109971 78530 171318 186725
$$ packed form
17358C26734A16776a5596A67314l189K92422i9572B81648i2813C90897c014B17757
17346I0198M6937K25631A36869i0097A4030C189L15892H2677J61517b70137I968
17334A79712G3850L02544j26785r4664K47427b8833I4006R0928c30766A73102
17323a02772C97052j5887f139A46666A4159P0476Q849O0707K20457b18990A43311
17311D72628a61301A9313K95428q8489O3301d8912J4426a6635j2749A63601k295
17300A61306p5641d1812A88966O1635D6038M5870a23564c1808A24743l6209K20968
17289C09502H9776J62059A4439M38294k24135A10415J10129a43099A9435J56362
17279A75797G1591c8247o103D40467k11425r8989Q0035j00117l1441R2788J5407
$$ plain form
17268 186725 -133647 224963 188962 -127773 295012 223980 353721 172096 459806 258898
17258 258898 326465 421147 -246746 13524 18228 -68709 248688 117422 206113 154239 -214865
17246 253678 82005 -53814 188597 90558 90717 203602 67673 289795 163963 370055 241938
17235 241938 -24032 234418 -13751 154358 -26753 -60074 -84501 43257 93274 -149710 255796
17223 210199 457201 222139 -130204 130990 477074 6144 67192 470970 38288 235161
17213 235161 367958 52735 151416 -52769 172958 99293 344459 48144 357246 262482 9746
17201 -104179 221052 237215 -7858 16090 80841 44546 85253 87420 525387 229306 223961
17190 223961 -17170 186872 718289 -30065 123976 176598 458208 56594 347345 383866
$$ packed form
17268A86725a33647B24963l6001a27773B95012p1032J29741A72096K87710k00908
17258B58898O7567R4682b46746A3524M704f8709B48688A17422Q8691n1874b14865
17246B53678H2005e3814A88597I0558J59J12885F7673K22122j25832K06092j28117
17235B41938b4032B34418a3751A54358b6753l3321k4427D3257N0017a49710B55796
17223B10199K47002B22139a30204A30990L46084F144O1048M03778C8288J96873
17213B35161J32797E2735R8681e2769A72958p3665K45166D8144L09102r4764I746
17201a04179B21052J6163g858A6090O4751l6295M0707K167M37967B29306n345
17190B23961a7170A86872N31417c0065A23976N2622K81610E6594K90751L6521
$$ plain form
17180 383866 48079 2262 154991 64859 -10304 61911 296693 -42339 161491 396885 154793
17168 293365 64237 441284 319742 294283 703525 134282 141234 225832 472781 187363
17157 268996 61279 133372 178776 497038 69464 301664 285873 197019 276400 185619 385046
17146 385046 323902 -62846 398100 55590 111375 -6498 15232 28401 164303 477191 275432
17135 275432 111920 177602 421374 155605 30614 493097 51773 336387 18988 368348
17125 368348 142662 283798 694850 86228 226345 228854 439195 31256 366090 298262
17115 298262 409785 356046 376293 271835 229400 269326 268369 56060 185109 329488 152215
17103 193526 166978 335298 447166 764849 52369 538170 286363 302012 174056 -29729
$$ packed form
17180C83866D8079B262J52729F4859a0304F1911K34782d2339A61491K35394A54793
17168B93365F4237L77047j21542k5459M09242A34282O952Q4598K46949A87363
17157B68996F1279P2093M5404L18262F9464K32200j5791q8854P9381r0781J99427
17146C85046o1144f2846C98100E5590N5785f498A5232J3169J35902L12888k01759
17135B75432A11920O5682K43772A55605C0614M62483E1773K84614A8988L49360
17125C68348A42662J41136M11052H6228J40117K509K10341C1256L34834o7828
17115B98262J11523n3739K0247j04458m2435L9926r57E6060J29049J44379A52215
17103A93526k6548J68320J11868L17683E2369M85801k51807J5649j27956b9729
$$ plain form
17092 139179 321515 180006 533246 302605 522761 649971 418624 423469 418315 436591
17082 436591 540911 434733 448600 327830 537799 610467 494808 460411 70178 242380
17072 242380 267376 523743 -1809 595481 309299 401814 557712 482880 256895 262183 869940
17061 869940 547042 225986 306231 231283 501158 671950 466267 136041 133438 268618
17051 268618 397540 479849 100399 547575 443818 739417 610262 502748 363729 467683
17041 467683 435542 180255 212310 440088 445888 107874 496571 493253 385686 429565 599259
17030 599259 455946 133916 491217 403832 372641 275664 608400 540845 755673 566074
17020 566074 302526 409350 697162 690271 743895 447654 576164 783432 648718 633052
$$ packed form
17092A39179J82336j41509L53240k30641K20156J27210k31347M845n154J8276
17082D36591J04320j06178J3867j20770K09969P2668j15659l4397G0178J72202
17072B42380K4996K56367a809E95481k86182R2515J55898p4832k25985N288O07757
17061H69940l22898B25986Q0245p4948K69875J70792k05683A36041k603J35180
17051B68618J28922Q2309A00399M47176j03757K95599j29155j07514j39019J03954
17041D67683l2141A80255L2055K27778N800A07874L88697l318j07567M3879J69694
17030E99259j43313A33916L57301q7385l1191r6977L32736o7555K14828j89599
17020E66074k63548J06824K87812o891N3624k96241J28510K07268j34714j5666
$$ plain form
17010 633052 748474 408682 644221 455456 525179 443086 405161 525448 568437 176914
16999 648016 1010167 558294 609554 535210 522515 555967 809201 433051 669335 815602
16989 815602 780581 502803 484492 572857 769428 817992 460277 636109 601950 636027 649636
16978 649636 664200 740403 454307 971213 554919 479124 1011363 439364 844910 648097
16968 648097 565898 873722 1012050 758244 789543 566858 993914 847204 409376 523290
16958 523290 829477 713677 864349 618489 641309 667440 629538 466894 691944 548643
16948 548643 950534 1119239 588189 734067 900622 813187 1022307 466271 962511 963284
16938 963284 907037 1082150 602876 1081728 463020 823596 863029 844545 1303806 939950
$$ packed form
17010F33052J15422l39792K35539j88765O9723q2093l7925J20287M2989A76914
16999F48016L62151m51873N1260p4344j2695L3452K53234l76150K36284J46267
16989H15602l5021k77778j8311Q8365J96571M8564l57715J75832l4159L4077J3609
16978F49636J4564P6203k86096N16906m16294p5795N32239D39364M05546j96813
16968F48097q2199L07824J38328k53806L1299k22685M27056j46710D09376J13914
16958E23290L06187j15800J50672k45860K2820K6131l7902j62644K25050j43301
16948E48643M01891J68705n31050J45878J66555q7435K09120D66271M96240P73
16938I63284n6247J75113m79274M78852D63020L60576L9433j8484M59261l63856
$$ plain form
16928 939950 1144996 925353 1054846 911891 827253 1050686 833576 950749 817919 1287609
16918 1287609 1347475 1114378 1058762 889288 966376 1077684 1362528 1220133 1273547 988707
16908 988707 1112210 1200654 1215162 1182418 1348473 1201860 1377195 1368575 1102176 1302175
16898 1302175 1342043 1302821 1640920 1204199 1478225 1188599 1221592 1780626 1411771 1717308
16888 1717308 1407367 1488399 1577532 1411030 1250850 1400750 1389765 1386819 1433750 1279126
16878 1279126 1583915 1441559 1924190 1451870 1767162 1687246 1555693 1775717 1749512 1880305
16868 1880305 1995350 1665838 1913327 1728072 1774333 2336324 2012925 2146800 2127708 1949499
16858 1949499 1904530 2316818 2276435 2121194 2092382 1905094 2435849 2441318 2515894 2279748
$$ packed form
16928I39950K05046k19643J29493j42955q4638K23433k17110J17173j32830M69690
16918A287609N9866k33097n5616j69474P7088J11308K84844j42395N3414k84840
16908I88707J23503Q8444J4508l2744J66055j46613J75335q620k66399J99999
16898A302175L9868l9222L38099m36721K74026k89626L2993N59034l68855L05537
16888A717308l09941Q1032Q9133j66502j60180J49900j0985k946M6931j54624
16878A279126L04789j42356M82631m72320L15292p9916j31553K20024k6205J30793
16868A880305J15045l29512K47489j85255M6261N61991l23399J33875j9092j78209
16858A949499m4969M12288m0383j55241k8812j87288N30755N469P4576k36146
$$ plain form
16848 2279748 2179414 2410107 2307022 2299839 2408823 2560295 2784057 2477455 2318284 2994442
16838 2994442 2768867 3013624 2695547 2914734 3054423 2925042 3116947 3322174 2880491
16829 2880491 3212824 3245835 3415482 3238970 3390463 3229947 3695795 3413916 3491351 3510631
16819 3510631 3780276 3672309 3810880 3610143 4132601 3927780 4290259 4207644 4266871 4632775
16809 4632775 4246532 4496223 4604165 4812490 4721920 5181696 4950322 5161932 4870183 5170172
16799 5170172 5696079 5339976 5666218 5999129 5621879 5975622 6076126 5885061 6253909
16790 6253909 6535784 6494524 6516131 6748334 7016607 7274796 7367648 7442416 7878193 7663608
16780 7663608 8270956 8141962 8543488 8775069 8857012 9198322 9525195 9666286 10055427 10409610
$$ packed form
16848B279748j00334K30693j03085p183J08984J51472K23762l06602j59171O76158
16838B994442k25575K44757l18077K19187J39689j29381J91905K05227m41683
16829B880491L32333L3011J69647j76512J51493j60516M65848k81879P7435J9280
16819C510631K69645j07967J38571k00737N22458k04821L62479q2615N9227L65904
16809D632775l86243K49691J07942K08325r0570M59776k31374K11610k91749K99989
16799E170172N25907l56103L26242L32911l77250L53743J00504j91065L68848
16790F253909K81875m1260K1607K32203K68273K58189R2852P4768M35777k14585
16780G663608O07348j28994M01526K31581Q1943L41310L26873J41091L89141L54183
$$ plain form
16770 10409610 10673724 10446367 10979654 11613826 12112198 12626564 12560437 13071654 13666789
16761 13666789 14136928 14705292 14775744 15422576 15864219 16697856 16993292 17310380 18114636
16752 18114636 19037495 19873144 20694046 21239884 22267573 23497677 24527155 25268229 26499566
16743 26499566 27815797 28807592 30436383 32074253 33564868 35353611 37056566 38668132
16735 38668132 41139581 43110338 45788295 48397955 50862519 54104774 57302234 60690547
16727 60690547 64636036 69094289 73585464 78016260 83360442 88857521 94973667 101358445
16719 101358445 107990132 115227453 122991442 131133569 139225056 147648039 156292767 165129924
16711 165129924 173505093 181368939 189126706 195361170 201127955 205405924 207808819 209102952
$$ packed form
16770A0409610K64114k27357N33287O34172M98372N14366o6127N11217N95135
16761A3666789M70139N68364P0452O46832M41643Q33637K95436L17088Q04256
16752A8114636R22859Q35649Q20902N45838J027689J230104J029478P41074J231337
16743B6499566J316231R91795J628791J637870J490615J788743J702955J611566
16735C8668132K471449J970757K677957K609660K464564L242255L197460L388313
16727F0690547L945489M458253M491175M430796N344182N497079O116146O384778
16719A01358445O631687P237321P763989Q142127Q091487Q422983Q644728Q837157
16711A65129924Q375169P863846P757767O234464N766785M277969K402895J294133
$$ plain form
16703 209102952 208650575 206544561 202439750 197721123 191327994 183879541 176175448 167628862
16695 167628862 158811214 150162485 141618395 132827199 124770257 117086950 109803411 102645285
16687 102645285 95957563 89707253 83775428 78601064 73806656 68881453 64732778 60746220
16679 60746220 57090545 53346934 50316442 47610350 45019681 42039794 39579232 37540635
16671 37540635 35814578 34081586 32639051 30768333 29319088 27876193 26435562 25247562
16663 25247562 24114140 23345870 21928844 21403360 20485396 19452368 18440706 18044957 16921773
16654 16921773 16601107 15919640 15112650 15097844 14071235 13578442 13068096 12724445 12418407
16645 12418407 11661357 11580059 11075866 10936520 10658321 10164864 10001677 9588086 9277255
$$ packed form
16703B09102952m52377k106014m104811m718627o393129p448453p704093q546586
16695A67628862q817648q648729q544090q791196q056942p683307p283539p158126
16687A02645285o687722o250310n931825n174364m794408m925203m148675l986558
16679F0746220l655675l743611l030492k706092k590669k979887k460562k038597
16671C7540635j726057j732992j442535j870718j449245j442895j440631j188000
16663B5247562j133422p68270j417026n25484r17964j033028j011662l95749j123184
16654A6921773l20666o81467q06990j4806j026609m92793n10346l43651l06038
16645A2418407p57050q1298n04193j39346k78199m93457j63187m13591l10831
$$ plain form
16636 9277255 8919061 8462765 8515063 8146547 7857798 7571362 7476838 7551352 7183221 7006706
16626 7006706 6529472 6281256 6298523 6102165 5980590 5838795 5767652 5777236 5647296 5409816
16616 5409816 5424579 5125831 5275325 4618040 4647314 4420139 4321442 4267590 4414281 4242225
16606 4242225 4233763 4065615 3763949 4031066 3779851 3556791 3920136 3462423 3375634 3422884
16596 3422884 3125320 3286285 3299978 3508788 3203787 3282358 2917305 2516070 3035603 2824701
16586 2824701 2849895 2774225 2830158 2773735 2942362 2375140 2366954 2636053 2507997 2384374
16576 2384374 2415399 2108874 2033644 2184161 2335523 2103137 2176224 2045315 1935095 2083855
16566 2083855 1969119 1815215 1862613 1931533 1571727 1814450 1889668 1841005 1650956 1446267
$$ packed form
16636I277255l58194m56296N2298l68516k88749k86436r4524P4514l68131j76515
16626G006706m77234k48216J7267j96358j21575j41795p1143R584j29940k37480
16616E409816J4763k98748J49494o57285K9274k27175r8697n3852J46691j72056
16606D242225q462j68148l01666K67117k51215k23060L63345m57713q6789M7250
16596C422884k97564J60965J3693K08810l05001P8571l65053m01235N19533k10902
16586B824701K5194p5670N5933n6423J68627n67222q186K69099j28056j23623
16576B384374L1025l06525p5230J50517J51362k32386P3087j30909j10220J48760
16566B083855j14736j53904M7398O8920l59806K42723P5218m8663j90049k04689
$$ plain form
16556 1446267 1705572 1551892 1691692 1381617 1761004 1676458 1399024 1874105 1615882 1339568
16546 1339568 1187297 1543480 1585142 1278665 1162914 1561271 1558571 1300164 986641 1477867
16536 1477867 1116985 1238058 1179489 1196961 1450960 1219107 1427816 1231579 1059948 829383
16526 829383 1045607 883696 959480 1241600 1207968 1155446 1144869 808373 1094666 1208636
16516 1208636 1049141 1007246 1248338 765509 1002166 581496 782324 839046 941192 699017
16506 699017 974467 996397 1118651 739038 923034 708370 557126 737874 912698 782864
16496 782864 937925 843082 746576 680001 942762 1006081 617609 482235 941465 814445
16486 814445 500368 1041674 602106 881777 683143 845819 451786 724314 984599 595237
$$ packed form
16556A446267K59305j53680J39800l10075L79387q4546k77434M75081k58223k76314
16546A339568j52271L56183M1662l06477j15751L98357k700k58407l13523M91226
16536A477867l60882J21073n8569J7472K53999k31853K08709j96237j71631k30565
16526H29383K16224j61911P5784K82120l3632n2522j0577l36496K86293J13970
16516A208636j59495m1895K41092m82829K36657m20670K00828N6722J02146k42175
16506F99017K75450K1930J22254l79613J83996k14664j51244J80748J74824j29834
16496G82864J55061r4843r6506o6575K62761O3319l88472j35374M59230j27020
16486H14445l14077N41306m39568K79671j98634J62676l94033K72528K60285l89362
$$ plain form
16476 595237 775361 483365 512808 531732 482460 812321 689933 726510 700704 585691
16466 585691 1071565 850514 273011 1090036 506796 313523 750426 929844 370252 550125
16456 550125 299443 555110 530649 447330 313163 408320 709395 339274 525771 339514
16446 339514 403232 146740 539555 327149 564083 314585 301345 585674 487345 479974
16436 479974 447309 466149 210686 637950 544083 509274 294532 289498 199161 483282 469685
16425 469685 425378 271135 304871 172102 281374 577657 530949 229647 276732 288038
16415 288038 379929 255049 205153 114717 423539 372447 69165 306284 329390 265802 146743
16404 146743 75063 380369 399678 444650 433986 163344 308172 49446 538309 149475
$$ packed form
16476E95237J80124k91996K9443J8924m9272L29861j22388L6577k5806j15013
16466E85691M85874k21051B73011Q17025E06796j93273M36903J79418C70252J79873
16456E50125k50682K55667k4461q3319j34167R5157L01075C39274J86497j86257
16446C39514O3718A46740L92815k12406K36934k49498j3240K84329r8329p371
16436D79974l2665J8840B10686M27264r3867l4809k14742n034r0337K84121j3597
16425D69685m4307j54243L3736j32769J09272K96283m6708B29647M7085J1306
16415B88038R1891j24880m9896r0436L08822n1092F9165K37119K3106o3588j19059
16404A46743p1680L05306J9309M4972j0664A63344J44828D9446M88863A49475
$$ plain form
16393 -37797 260788 383698 329749 40019 239072 307107 57972 45421 332954 490378 216036
16381 -196636 396695 261658 34544 107279 550695 250092 330237 411701 391251 196934
16371 196934 415611 393937 193126 233405 131407 135765 43001 208885 152125 152466 138862
16360 138862 489447 187669 52577 45710 170585 109949 222784 -159413 135042 273896
16350 273896 -26825 38935 58470 -322646 -92720 450948 -171624 38799 376483 200466
16340 200466 300387 103113 140823 -163893 94598 93140 337586 46949 347585 136157 -17709
16328 -120114 100996 338329 358816 -46580 196404 256254 43970 -37212 280 333963 38195
16316 111048 242941 14299 76537 218012 155191 33366 4849 -260325 -79430 82092 70170
$$ packed form
16393c7797B60788J22910n3949D0019J99053O8035E7972j2551K87533J57424B16036
16381a96636C96695j35037C4544P2735M43416B50092Q0145Q1464k0450j94317
16371A96934K18677k1674A93126M0279j01998M358D3001J65884n6760L41j3604
16360A38862L50585A87669E2577o867J24875o0636J12835a59413A35042J38854
16350B73896b6825C8935J9535c22646i2720D50948a71624C8799L37684j76017
16340B00466R9921A03113L7710a63893I4598j458K44446D6949L00636A36157a7709
16328a20114A00996K37333K0487d6580A96404N9850D3970c7212B80L33683C8195
16316A11048J31893A4299O2238J41475o2821C3366D849b60325g9430H2092j1922
$$ plain form
16305 70170 131863 -14552 161232 -35240 144973 318093 94336 252326 195838 54481 -17641
16293 153050 93941 215168 143429 269216 206024 108902 -290803 121042 -47260 -8330 -135695
16282 -135695 -205743 -377429 197989 74273 106036 38341 99018 153726 -13649 112612 -118116
16270 145585 341849 143059 57809 -125438 198762 -219177 -51707 -38045 38364 279169
16260 279169 285546 -1575 44315 195625 153186 181706 147466 -46246 135464 -52718 -126491
16249 -126491 -114507 79530 105741 202580 96480 381835 229380 6558 -99200 -38680 60619
16237 86431 213204 -124000 91467 315481 -175338 317905 254493 173340 -23041 93048 149077
16226 149077 26567 23181 -78967 -87578 249483 259026 71160 -27429 71334 -57676 -79511 226439
$$ packed form
16305G0170O1693a4552A61232c5240A44973J73120I4336J57990n6488E4481a7641
16293A53050n9109J21227p1739J25787o3192r7122b90803A21042d7260h330j27365
16282a35695p0048j71686A97989G4273L1763C8341O0677N4708a3649A12612a18116
16270A45585J96264A43059E7809a25438A98762b19177e1707J3662C8364K40805
16260B79169O377a575D4315J51310m2439K8520l4240d6246A35464e2718p3773
16249a26491J1984G9530K6211R6839I6480K85355j52455F558i9200c8680F0619
16237H6431J26773a24000I1467K24014a75338C17905o3412q1153b3041I3048N6029
16226A49077B6567l386g8967q611B49483R543G1160b7429G1334e7676k1835B26439
$$ plain form
16213 239692 -73271 -86224 124645 49758 302139 -71134 -86297 -63923 112232 -6593 182817
16201 41012 -209323 5885 215830 65532 -80332 45362 60485 -140176 -185914 -95582 469624
16189 -84254 134310 -91661 263499 269113 -32493 -43571 126359 -66426 45988 197465 -55603
16177 80237 -181547 -262196 61394 245068 518586 173488 167120 -279773 -86418 208908 348986
16166 348986 116981 -4620 270724 -154988 -235164 37062 259650 72212 267997 328231 -10625
16154 135083 19474 -203487 49476 -258351 2179 33057 -199687 -33374 7748 82667 -74309
16142 217909 38579 198839 -154615 95500 -175505 -4921 -112734 -34487 -232874 -83873 -305739
16131 -305739 -17149 -265490 -218843 -142491 60116 80501 -2248 159026 -163438 63754 -24376
$$ packed form
16213B39692g3271j2953A24645D9758K52381g1134j5163K2374A12232f593A82817
16201D1012b09323E885K09945F5532h0332D5362J5123a40176m5738R0332D69624
16189h4254A34310i1661B63499N614c2493j1078A26359f6426D5988J51477e5603
16177H0237a81547q0649F1394J83674K73518A73488o368b79773h6418B08908J40078
16166C48986A16981d620B70724a54988q0176C7062K22588G2212J95785O0234a0625
16154A35083A9474b03487D9476b58351B179L0878a99687c3374G748P4919g4309
16142B17909C8579J60260a54615I5500a75505d921j07813c4487j98387h3873k21866
16131c05739a7149k48341M6647P6352F0116K0385b248A59026a63438F3754b4376
$$ plain form
16119 -49648 -140199 -144314 169145 -159818 -16968 60593 232079 -319559 96358 105756 -218516
16107 -369912 -138522 51396 -121927 -71860 -431200 -126756 28517 156312 -5968 149796
16096 -151740 217567 -158161 -308528 -67290 36135 -141656 116475 36628 -3657 76758 192194
16085 192194 -290896 170673 160790 92248 158958 166292 164825 -300865 217926 -149763 -104811
16074 -104811 30505 387457 -218795 28403 -125457 24486 -1847 -188693 -105645 -205426 -114429
16063 -114429 -54067 195108 92663 -212215 172772 -38703 -151605 -10754 -206798 40651
16052 -19243 193158 47391 -46383 151261 71794 20859 -28175 243619 -36170 30735 66780
16041 66780 278345 -42369 -196590 -322416 74859 -77140 -69247 -83142 -283708 -48309 -116889
$$ packed form
16119d9648r0551m115A69145a59818a6968F0593J71486c19559I6358R398b18516
16107c69912a38522E1396a21927N0067l59340a26756B8517J27795e968A49796
16096a51740B17567a58161j50367f7290C6135a41656A16475C6628c657G6758J15436
16085A92194b90896A70673r883o8542O6710P334j467c00865B17926a49763M4952
16074a04811C0505L56952b18795B8403a25457B4486a847j86846Q3048r9781R0997
16063a14429e4067A95108I2663b12215A72772c8703j12902a0754j96044D0651
16052a9243A93158D7391d6383A51261G1794B0859b8175B43619c6170C0735L6045
16041F6780K11565d2369j54221j25826G4859g7140P893j3895k00566d8309o8580
$$ plain form
16030 -116889 112292 -76212 135648 -42076 219019 -81537 49312 -109762 67009 -457778
16019 -195423 -100182 -66358 -22550 -59552 -134438 -67304 158666 -215516 -336321 -285325 47913
16007 -475404 179854 363053 247044 -237492 -2020 22812 130885 -269923 -188552 75506
15996 291986 -19340 -310796 -152971 -13782 24211 184957 181781 70302 -238077 -90171 -201511
15985 -201511 42354 68510 74379 18950 156139 4690 -161064 -252968 209742 -44888 -140299
15974 -140299 337120 71968 265020 -6531 346196 -232794 390904 115510 392739 129129
15963 -186194 168125 24222 66392 151444 198996 -376498 -215372 -103641 -211120 -149706
15953 -149706 -12209 216555 149415 -27265 182567 382074 -79256 -91429 -96600 -36642 -37468
$$ packed form
16030a16889A12292g6212A35648d2076B19019h1537D9312a09762F7009d57778
16019a95423R5241L3824b2550l7002p4886O7134A58666b15516j20805N0996D7913
16007d75404A79854J83199j16009b37492b020B2812J08073b69923Q1371G5506
15996B91986a9340k91456a52971a3782B4211J60746l176G0302b38077i0171j11340
15985b01511D2354K6156N869A8950J37189D690a61064r1904B09742d4888r5411
15974a40299C37120G1968J93052f531C46196b32794C90904A15510K77229A29129
15963a86194A68125B4222M2170Q5052M7552c76498J61126a03641j07479O1414
15953a49706a2209B16555o7140b7265A82567J99507g9256j2173n171c6642q26
$$ plain form
15942 -37468 14048 125809 -182162 -45760 -397276 201552 158264 -89660 85928 -31999 135550
15930 -75160 -118781 -119893 11550 -217867 -82829 92951 362479 -258773 -115490 -15329 133077
15918 -136471 106865 27609 -289920 -237545 -169315 -237223 -232915 -282008 6802 -107563 72981
15906 -162783 -168670 -219035 223118 36720 -149788 33289 -143695 -180263 -96052 158847 -210758
15894 -67387 -64370 -244641 -59836 -108539 -376381 -239123 -117528 45415 197012 34113 -193874
15882 -21641 -61646 -22075 85753 13282 43040 -16424 223067 -68084 -211083 -292233 180274
15870 100536 298602 94504 258679 319533 -110900 -185505 -120693 -210569 -162686 138309 43556
15858 -158045 -369203 -185394 -224459 265308 196816 -141257 -342832 121475 -259803 176849
$$ packed form
15942c7468A4048J11761a82162d5760l51516B01552m3288h9660H5928c1999A35550
15930g5160m3621j112A1550b17867h2829I2951K69528b58773a15490a5329A33077
15918a36471A06865B7609b89920N2375O8230o7908M308m9093F802a07563G2981
15906a62783n887n0365B23118C6720a49788C3289a43695l6568Q4211A58847b10758
15894f7387L017j80271e9836m8703k67842J37258a17528D5415J51597C4113a93874
15882b1641m0005b2075H5753A3282K9758a6424B23067f8084j42999q1150A80274
15870A00536J98066I4504J64175O0854a10900p4605O4812q9876M7883A38309D3556
15858a58045k11158J83809l9065B65308o8492a41257k01575A21475b59803A76849
$$ plain form
15847 -172644 202020 70025 -6678 -145286 -102001 -204612 18857 -182493 -42439 -413448 -100445
15835 -51661 76958 132305 -288468 -57408 -175016 -399977 58907 -181080 -165588 127639 114583
15824 114583 -65270 -100595 -393297 -13614 -230159 -360372 -106050 151809 -946 89800 -168212
15812 -3853 -105339 -34802 58527 18219 -86550 -243806 294008 -114579 202973 215020 11785
15800 -9546 -48033 -30979 -18880 76443 48482 -5523 -189959 129974 59722 -401379 -304856
15789 -304856 -87309 -119847 298052 96352 -112861 -23083 168151 136515 114981 -223915 33978
15777 127414 104220 132803 -112456 220034 144192 -107629 -77700 -210490 -242567 86111 -60273
15765 -77440 -8622 -111374 -282827 21257 31031 41797 315123 -89696 -2212 -12271 -9418 6007
$$ packed form
15847a72644B02020G0025f678j38608M3285j02611A8857a82493d2439l71009a00445
15835e1661G6958N5347b88468e7408j17608k24961E8907a81080J5492A27639j3056
15824A14583f5270l5325k92702a3614k16545j30213a06050A51809i46H9800a68212
15812c853j01486c4802E8527A8219h6550j57256B94008a14579B02973J2047A1785
15800i546l8487J7054J2099G6443k7961e523j84436A29974E9722d01379R6523
15789c04856h7309l2538B98052I6352a12861b3083A68151l1636k1534b23915C3978
15777A27414k3194K8583a12456B20034p5842a07629K9929j32790l2077H6111f0273
15765g7440h622j02752j71453B1257R774J0766K73326h9696b212j0059K853F007
$$ plain form
15752 -150736 -368800 138328 3469 -37632 -353594 173812 -101657 -167757 -7258 -33950 -73917
15741 -73917 348711 -45989 -32266 -156417 -157321 90093 13847 49061 -11903 154335 -164430
15729 254654 273392 -98627 -43131 -28187 -89309 -105304 -215188 -183351 -22523 -199262 52766
15717 -180133 -341647 275250 21916 98046 284163 -154207 237450 -113035 40813 70020
15707 70020 14815 -147216 6433 -75895 -42709 -222397 -282726 18334 -169608 -350749 -204526
15696 -204526 -16531 202277 88261 51588 99502 -114036 -319935 -152656 -20563 -224845
15686 -224845 -173184 -28144 -23 168413 213101 96790 386641 -11800 150712 105816 145960
15675 145960 -113674 196216 151337 -132801 53809 4147 -480500 144585 -72847 -111237 -15021
$$ packed form
15752a50736k18064A38328C469c7632l15962A73812a01657o6100g258k6692l9967
15741g3917C48711d5989J3723j24151r04I0093A3847L5214a1903A54335a64430
15729B54654J8738i8627d3131J4944o1122j5995j09884L1837b2523j76739E2766
15717a80133j61514B75250B1916P6130J86117a54207B37450a13035D0813K9207
15707G0020A4815a47216F433g5895L3186j79688o0329A8334a69608j81141J46223
15696b04526a6531B02277H8261l6673M7914a14036k05899a52656b0563k04282
15686b24845N1661b8144b3A68413M4688I6790K89851a1800A50712m4896M0144
15675A45960a13674A96216m4879a32801E3809D147d80500A44585g2847l8390a5021
$$ plain form
15663 81502 -89500 333967 585 194947 28791 69704 196924 -124451 97685 -151364 -447069
15652 -447069 -77416 -45590 134104 58054 -30809 -229081 -68047 67732 -162235 -73439 124840
15640 -160031 -49242 -180322 8345 184409 -34792 134193 66871 62130 401074 -91378 -357975
15629 -357975 179596 248563 150637 -121128 20455 -267892 34034 193643 -15989 -95711 -46122
15617 -10946 -30107 -187865 -96006 -159860 -190295 -82043 33213 -72786 -23485 -22585 35803 -224830
15604 -213740 -154641 63485 35347 -18445 190578 -74961 -163925 112393 153782 160928 -129855
15592 -53787 -370178 28783 -9599 -167143 56842 -91722 46653 -179047 250187 -303231 76916
15580 16503 -8574 15949 -35963 11019 54331 -23771 21232 -127479 -13437 22891 -25652 -272141
$$ packed form
15663H1502h9500C33967E85J94362B8791M0913J27220a24451I7685a51364k95705
15652d47069g7416L1826A34104E8054c0809j98272f8047F7732a62235g3439A24840
15640a60031d9242j31080H345J76064c4792A34193F6871m741L38944i1378k66597
15629c57975A79596O8967r7926a21128B0455b67892C4034J59609a5989p9722d6122
15617a0946j9161j57758R1859o3854l0435h2043C3213g2786b3485R00C5803b24830
15604b13740N9099F3485k8138a8445A90578g4961q8964A12393M1389P146a29855
15592e3787l16391B8783i599j57544E6842i1722D6653a79047B50187c03231G6916
15580A6503h574A5949c5963A1019M3312b3771B1232a27479a3437B2891b5652k46489
$$ plain form
15568 -272141 245890 99563 62006 227439 114466 -162891 -117570 -332866 64739 -95568
15557 -91795 -140254 24441 -312797 201939 -269201 -53939 141768 197468 105661 -123364 169599
15545 131773 -225090 -3770 -2466 -94743 -98599 -83008 196616 -3710 22927 -62358 133732 -92184
15532 177473 149744 -197471 143928 222051 -320305 59551 1368 -57559 131290 -4753 -106209
15521 -106209 -6623 -214151 -137787 71889 -81438 -104240 -260241 92656 231785 -38116 -54958
15510 -54958 207041 -1058 27724 -44809 83245 -111437 -222233 -200739 170196 -134582 223415
15498 27927 -249167 19165 -159658 40730 14659 65102 -104220 10734 81151 -796 71130
15486 93007 59488 -38847 -251776 55362 -223467 57072 -25623 -468900 81082 -286141 -4590
$$ packed form
15568b72141B45890I9563l7557J65433j12973a62891M5321k15296F4739i5568
15557i1795m8459B4441c12797B01939b69201e3939A41768N5700r1807a23364A69599
15545A31773b25090c770J304r2277l856J5591A96616c710B2927f2358A33732i2184
15532A77473k7729a97471A43928P8123c20305E9551A368e7559A31290d753j01456
15521a06209f623k07528P6364G1889h1438k2802j56001I2656J39129c8116j6842
15510e4958B07041a058B7724d4809H3245a11437j10796K1494A70196a34582B23415
15498B7927b49167A9165a59658D0730A4659N0443a04220A0734P0417g96G1130
15486I3007l3519c8847k12929E5362b23467E7072b5623m43277H1082b86141d590
$$ plain form
15474 -7389 -195422 -144101 -8122 117383 76931 167424 -81665 -28598 -204713 92461 200417
15463 200417 71832 -85274 -56719 57484 -262672 44428 -35607 189205 -2751 -112183 37606
15451 -304566 11779 -397808 -280129 -123043 -4523 -2991 -66408 189155 -179041 51583 74117
15440 74117 -55915 51785 -219234 -212852 58676 45007 32054 176837 245357 -227152 173785
15428 -89007 -192762 -132052 -45252 -5789 -207672 -293778 -282946 -162937 138832 95056 21302
15416 275357 267205 114406 130267 -50727 7497 171768 11302 241080 -200617 -322490 186976
15404 -221406 -129077 143239 -379283 -202994 -316311 -132025 -22890 10357 -204039 -84836
15393 288541 109131 202723 -55405 -149683 -155930 -515805 30527 -22732 -41526 24379 115742
$$ packed form
15474g389j88033N1321h122A17383m0452R0493h1665b8598j76115I2461J07956
15463B00417G1832h5274K8555E7484b62672D4428c5607A89205b751j09432C7606
15451c04566A1779c97808J17679a23043d523J532o3417A89155a79041E1583K2534
15440G4117e5915E1785b19234O382E8676j3669j2953J44783O8520b27152A73785
15428h9007j03755O0710d5252e789k01883q6106J0832J20009A38832m3776B1302
15416B75357q152A14406J5861e0727G497J64271A1302K29778b00617j21873A86976
15404b21406R2329A43239c79283J76289j13317a32025b2890A0357b04039h4836
15393B88541A09131R3592e5405r4278o247l59875C0527b2732j8794B4379R1363
$$ plain form
15382 115742 -186784 20818 94195 -4367 -92277 76306 -36687 -508423 -68754 -312595 17046
15370 90376 70022 -31662 -314469 433381 92280 246910 16477 -55883 -86039 59559 195677
15359 195677 146528 89810 -18454 132541 45107 76155 204372 35415 -348912 48842 201840
15348 201840 400388 62919 -125465 287177 -157346 -102334 -6811 85549 123968 -262807 -268626
15337 -268626 362316 128109 119137 -227852 147163 252402 209327 37188 262852 -29340
15326 63396 -165449 -141463 317291 -44202 -61284 49486 -105946 67603 -194433 109211 -102867
15314 135872 190698 -203022 141766 265944 -39590 -126863 -202358 118771 122921 311027 -42590
15302 102934 52315 40245 -144206 91704 106830 -157618 -72076 310949 180553 -17165 -110625
$$ packed form
15382A15742a86784B0818P3377d367q7910G6306c6687m71736f8754k43841A7046
15370I0376k0354c1662k82807D33381I2280J54630A6477e5883l0156E9559J36118
15359A95677m9149n6718a8454A32541D5107L1048J28217C5415c48912D8842J52998
15348B01840J98548F2919a25465B87177a57346N5012f811H5549L8419b62807n819
15337b68626C62316A28109q972b27852A47163J05239m3075C7188K25664b9340
15326F3396a65449K3986C17291d4202j7082D9486a05946F7603a94433A09211a02867
15314A35872N4826b03022A41766J24178c9590q7273p5495A18771M150J88106d2590
15302A02934n0619j2070a44206I1704J5126a57618g2076C10949j30396a7165r3460
$$ plain form
15291 -110625 -220743 24613 -268577 -57416 -183981 70484 503119 -82057 -160635 77865 -29524
15279 -89181 22377 219353 297877 -118054 -278253 -102328 160116 -100236 182277 -115563
15268 116784 131664 -376987 -287758 -81775 -184462 150735 98455 175404 -55606 113782 396955
15257 396955 -71477 -23569 -9732 -64722 -199323 17096 101375 -74379 49123 244311 225149
15246 225149 126533 90495 63561 -158592 344272 -222185 -128334 155070 -9937 244940 315112
15235 315112 415179 1050754 1484453 1022156 1221923 815142 317497 359855 538101 91977
15224 202856 -42140 397103 170189 77667 -149744 -96622 100351 -165206 173741 405680
15214 405680 -35980 -232890 43131 -167792 237753 -43285 -238616 112901 -138606 -50920
$$ packed form
15291a10625j10118B4613b68577e7416j26565G0484M32635h2057p8578G7865b9524
15279h9181B2377J96976P8524a18054j60199a02328A60116a00236A82277a15563
15268A16784J4880c76987Q9229h1775j02687A50735n2280P6949e5606A13782K83173
15257C96955g1477b3569i732n4990j34601A7096Q4279g4379D9123J95188j9162
15246B25149r8616l6038k6934a58592C44272b22185R3851A55070i937B44940P0172
15235C15112J00067O35575M33699m62297J99767m06781C17497M2358J78246I1977
15224B02856d2140C97103A70189G7667a49744N3122A00351a65206A73741K31939
15214D05680c5980j96910D3131a67792B37753d3285j95331A12901a38606e0920
$$ plain form
15203 173349 -13317 182936 237092 72672 154985 95163 -8243 457390 -74988 107145 -170760
15191 30599 -39633 343478 78275 29537 -86991 147369 322196 125531 57840 47353 213511
15180 213511 -48938 -181365 -110793 -352219 67124 -9063 154513 41058 -31359 14214 228849
15169 228849 -11457 -104010 208504 2605 174889 4307 248881 91347 -194823 72976 76884
15158 76884 -138943 -235409 349791 61377 -242557 112969 250195 -89501 -281704 -429745
15148 -429745 -348725 138780 28167 -198260 -34274 386377 -24168 283206 155132 47230
15137 27235 79890 191960 152739 169533 14330 282065 303517 111083 -304936 72841 -168431
15125 -141564 129330 218672 10540 1961 -46525 72174 245352 85108 -242117 -14686 40831
$$ packed form
15203A73349a3317A82936N4156G2672Q2313n9822h243D57390g4988A07145a70760
15191C0599c9633C43478G8275B9537h6991A47369J74827A25531E7840j0487J66158
15180B13511d8938j32427P0572k41426F7124i063A54513D1058c1359A4214K14635
15169B28849a1457r2553B08504B605J72284D307K44574I1347a94823G2976L908
15158G6884a38943r6466C49791F1377b42557A12969J37226h9501j92203j48041
15148d29745Q1020A38780B8167a98260c4274C86377b4168B83206j28074D7230
15137B7235N2655J12070l9221J6794A4330K67735K1452A11083c04936G2841a68431
15125a41564A29330Q9342A0540A961d6525G2174J73178H5108b42117a4686D0831
$$ plain form
15113 89111 126665 91277 87059 -275393 153221 143307 22265 233465 -100121 263401 256938
15102 256938 201612 94069 137343 -59868 326126 -135082 118348 335035 -114911 765439
15091 46850 34323 120754 354769 179616 26767 -23196 -8729 261385 31977 247504 494962
15080 494962 8622 154585 130922 192167 72067 -90285 438349 -147109 95253 -8272 338785
15068 117054 -12503 60962 2151 154795 349205 88417 19467 55011 -15274 272072 208158
15057 208158 75626 -109225 149411 98005 415713 39493 -191892 160196 160824 168486 247683
15046 247683 61290 -172518 11106 174306 50811 350848 373523 346612 -127164 185318
15035 132546 208700 -61991 160583 374596 401578 283625 162186 -95223 -30239 42618 -15985
$$ packed form
15113H9111L7554l5388m218b75393A53221r914B2265K11200a00121B63401o463
15102B56938n5326I4069M3274e9868C26126a35082A18348K16687a14911G65439
15091D6850j2527Q6431K34015j75153B6767b3196h729B61385C1977K15527K47458
15080D94962H622J45963k3663O1245G2067i0285D38349a47109I5253h272C38785
15068A17054a2503F0962B151J52644J94410H8417A9467L5544a5274B72072o3914
15057B08158G5626a09225A49411n1406L17708C9493a91892A60196O28P662P9197
15046B47683F1290a72518A1106J63200E0811L00037K2675k6911a27164A85318
15035A32546P6154f1991A60583K14013K6982j17953j21439i5223c0239D2618a5985
$$ plain form
15023 84644 334708 148061 170331 223268 179945 103095 135497 74770 169040 125547 411882
15012 411882 68058 96528 289653 163678 177688 -82371 191573 210521 140996 -101849 34665
15000 408401 172590 -34423 223304 92852 -52467 -30939 -156948 295890 77448 146700 148428
14989 148428 187762 327476 566576 176168 339496 145861 -3018 393876 183067 328818
14979 328818 255646 41412 208681 161041 259691 224746 280868 -273934 96505 232916 110354
14967 -85840 328544 179122 403570 66827 171944 422133 382753 547252 357943 44643
14956 315914 57659 149302 65219 -41903 259792 198445 191008 58292 279791 235842 358480
14945 358480 366870 430617 460953 42387 212586 58511 306663 59677 257295 242105 13163
$$ packed form
15023H4644K50064A48061K2270N2937m3323p6850L2402o0727R4270m3493K86335
15012D11882F8058K8470J93125j25975J4010h2371A91573J8948o9525a01849C4665
15000D08401A72590c4423B23304I2852e2467K1528j26009B95890G7448O9252J728
14989A48428L9334J39714K39100A76168J63328A45861c018C93876A83067J45751
14979C28818p3172D1412J67269m7640R8650l4945N6122b73934I6505J36411A10354
14967h5840C28544j49422K24448F6827J05117K50189l9380J64499j89309D4643
14956C15914E7659R1643F5219d1903B59792o1347p437E8292K21499m3949J22638
14945C58480Q390O3747L0336D2387J70199E8511K48152E9677J97618j5190A3163
$$ plain form
14933 -81148 88997 -19064 378265 123233 199026 169295 325081 479748 33331 392988 26196
14921 442401 316717 169627 -7768 469106 331268 360585 394351 19459 238804 66957 297508
14910 297508 323745 94523 422617 78157 228605 350778 208909 270075 294754 462481
14900 462481 361075 174770 342007 251216 483722 299129 666829 438786 -54861 231208
14889 158388 103671 311053 379729 407220 140275 310030 404439 312858 650450 156633
14878 106343 423765 473644 550824 409977 184753 249840 604027 315938 345427 351938 244704
14867 244704 287365 247518 388063 147057 212002 66255 361070 254810 431086 263726
14857 263726 107892 435801 175463 390700 149432 -96409 240158 -26610 374577 483472
$$ packed form
14933h1148H8997a9064C78265A23233P5793k9731J55786J54667C3331L59657B6196
14921D42401j25684j47090g768D69106j37838K9317L3766A9459K19345F6957K30551
14910B97508K6237I4523L28094G8157J50448J22173j41869O1166K4679J67727
14900D62481j01406A74770J67237r0791K32506j84593L67700k28043e4861B31208
14889A58388n4717K07382O8676K7491A40275J69755R4409r1581L37592A56633
14878A06343L17422M9879P7180j40847A84753O5087L54187k88089K9489O511j07234
14867B44704M2661l9847J40545A47057O4945F6255K94815j06260J76276j67360
14857B63726A07892L27909A75463K15237A49432i6409B40158b6610C74577J08895
$$ plain form
14847 483472 397078 148254 244892 64464 82138 166254 191186 406653 539514 675342 402144
14836 402144 513770 164467 528617 609885 489626 530047 55984 575098 585962 392671
14826 392671 20480 429281 552721 535807 697797 440893 484283 435399 645816 639040 398151
14815 398151 457936 523719 337755 328813 411881 203454 405807 876804 41170 375529 110618
14803 294221 467326 392113 285866 343059 246822 443028 280553 575790 350979 287956
14793 287956 181447 585876 462202 293817 445760 569857 168227 281109 542499 587389
14783 587389 600724 337851 604677 487754 638089 462032 278156 513680 229668 605376
14773 605376 627431 689096 664466 444639 805712 637337 473672 643826 609939 173225
$$ packed form
14847D83472q6394A48254R6638F4464J7674Q4116K4932K15467J32861J35828k73198
14836D02144J11626A64467L64150Q1268j20259M0421E5984N19114J0864j93291
14826C92671B0480M08801J23440j6914J61990k56904M3390m8884K10417o776k40889
14815C98151N9785O5783j85964q942Q3068B03454K02353M70997D1170L34359A10618
14803B94221J73105p5213j06247N7193r6237J96206j62475K95237k24811o3023
14793B87956j06509M04429j23674j68385J51943J24097A68227J12882K61390M4890
14783E87389J3335k62873K66826j16923J50335j76057j83876K35524B29668L75708
14773F05376K2055O1665k4630k19827L61073j68375j63665J70154l3887A73225
$$ plain form
14762 571800 481356 181611 592683 351719 890518 500185 616685 669057 624102 649667
14752 649667 490607 928643 809098 548903 433923 432711 495620 630769 464125 442110
14742 442110 831695 494291 520562 598681 466366 193401 545905 563293 723935 620611
14732 620611 409040 548519 457063 577494 735215 675055 910952 846260 1003548 614857
14722 614857 619139 905067 865453 576346 620337 348260 498758 338931 1003444 838475
14712 838475 714568 290909 1059503 571265 725823 600123 429218 637719 668397 692717
14702 692717 558835 752731 1026201 528698 652089 885276 981969 837568 716972 292105
14691 833997 623645 857376 929937 480603 887778 576654 979069 794230 670381 1094840
$$ packed form
14762E71800r0444A81611M11072k40964N38799l90333J16500N2372m4955K5565
14752F49667j59060M38036j19545k60195j14980j212O2909J35149j66644k2015
14742D42110L89585l37404K6271P8119j32315A93401L52504J7388J60642j03324
14732F20611k11571J39479r1456J20431J57721o0160K35897o4692J57288l88691
14722F14857M282K85928l9614k89107M3991k72077J50498j59827O64513j64969
14712H38475j23907B90909P68594m88238J54558j25700j70905K08501L0678K4320
14702F92717j33882J93896K73470m97503J23391K33187R6693j44401j20596B92105
14691H33997k10352K33731P2561m49334M07175l11124M02415j84839j23849M24459
$$ plain form
14681 1094840 972633 659432 894515 655456 880035 496390 935281 668880 771861
14672 771861 593079 870604 1028407 896270 692534 652251 947621 1130558 808147 927982
14662 927982 568311 680469 882871 861466 1054573 628601 1129569 567944 777405 1086298
14652 1086298 960243 656949 899010 517008 854936 1029311 949570 818798 1067317 909958
14642 909958 1016623 1105481 1074090 1242624 952777 1121103 1303868 953887 1138875 978426
14632 978426 907243 985366 1200092 1066487 1061337 900971 904711 1040800 1145853 1472275 1377908
14621 1377908 1506238 1242529 1313453 1357635 1490300 1180252 1423860 907226 1216705 1178750
14611 1178750 1407657 1458042 1256782 1318454 1212450 1439658 1148405 1371254 1256621 1308785
$$ packed form
14681A094840j22207l13201K35083k39059K24579l83645M38891k66401J02981
14672G71861j78782K77525J57803j32137k03736m0283K95370J82937l22411J19835
14662I27982l59671J12158K02402k1405J93107m25972N00968n61625K09461L08893
14652A086298j26055l03294K42061l82002L37928J74375p9741j30772K48519j57359
14642I09958J06665Q8858l1391J68534k89847J68326J82765l49981J84988j60449
14632I78426p1183P8123K14726j33605n150j60366L740J36089J05053L26422r4367
14621A377908J28330k63709P0924M4182J32665l10048K43608n16634L09479l7955
14611A178750K28907N0385k01260O1672j06004K27208k91253K22849j14633N2164
$$ plain form
14601 1308785 1372499 1288893 1421078 1173524 1499454 1329225 1488174 1221247 1026928 1344428
14591 1344428 1457129 1368322 1204713 1265713 1526745 1559716 1465689 1390323 1653379 1512019
14581 1512019 1382962 1381853 1573129 1724602 1602258 1560427 1810675 1479894 1558496 1884007
14571 1884007 1810965 1695670 1463122 1826731 1676176 1813760 2115604 1826547 1916446 1871992
14561 1871992 2102133 1915448 2196014 1783418 1825090 2175466 2095159 2262767 2125989 2050030
14551 2050030 2212359 2390907 2449769 2511618 2222162 2439834 2682454 2756944 2912316 2971250
14541 2971250 3139159 3263844 3473704 4485286 4996776 5704086 7177356 9301253 13324379
14532 13324379 19848080 31000098 30979512 19080408 11029208 7020082 4776115 3365684
$$ packed form
14601A308785O3714q3606J32185k47554L25930j70229J58949k66927j94319L17500
14591A344428J12701q8807j63609O1000K61032L2971r4027p5366K63056j41360
14581A512019j29057j109J91276J51473j22344m1831K50248l30781P8602L25511
14571A884007p3042j15295k32548L63609j50555J37584L01844k89057Q9899m4454
14561A871992K30141j86685K80566m12596M1672L50376q0307J67608j36778p5959
14551B050030J62329J78548N8862O1849k89456K17672K42620P4490J55372N8934
14541B971250J67909J24685K09860J011582N11490P07310J473270K123897M023126
14532A3324379O523701J1152018k0586j1899104q051200m009126k243967j410431
$$ plain form
14524 3365684 3046798 2877866 2499065 2556324 2465741 2140121 1981959 2348784 2131175 2152920
14514 2152920 2012663 2201485 2241778 2190805 2196643 2244391 2350582 1867674 2309070 1907177
14504 1907177 2400070 1945024 2309491 2215600 2375283 2597230 2602232 2853664 2590698 2598208
14494 2598208 2526976 2461491 2891344 2558158 2780044 2601872 2937414 2571592 2541637 2900586
14484 2900586 2869865 2992467 2936885 3006174 3024609 3078165 2734987 3367876 3340428 3239850
14474 3239850 3407883 3589574 3206863 3313590 3281388 3375842 3655107 3794153 3535418 3354595
14464 3354595 3342631 3506164 3714807 3784821 3750837 3653986 4146368 3907592 3895958 3843907
14454 3843907 4069757 3796608 4001115 4367864 4219100 4426729 4509860 4314437 4504133 4236801
$$ packed form
14524C365684l18886j68932l78801N7259r0583l25620j58162L66825k17609K1745
14514B152920j40257J88822M0293n0973N838M7748J06191m82908M41396m01893
14504A907177M92893m55046L64467r3891J59683K21947N002K51432k62966P510
14494B598208p1232o5485M29853l33186K21886j78172L35542l65822k9955L58949
14484B900586l0721J22602n5582O9289J8435N3556l43178O32889k7448j00578
14474C239850J68033J81691l82711J06727l2202R4454K79265J39046k58735j80823
14464C354595j1964J63533K08643P0014l3984r6851M92382k38776j1634n2051
14454C843907K25850k73149K04507L66749j48764K07629Q3131j95423J89696k67332
$$ plain form
14444 4236801 4364779 4704650 4447475 4284784 5039836 4963602 4610431 5206676 5036655 5053998
14434 5053998 4997273 5330123 5275392 4864533 5310729 5513311 5297102 5703200 5618549 5412459
14424 5412459 5855104 5766354 5879464 5958971 5899244 6273538 5995309 5845460 6367313 6559668
14414 6559668 6718317 6754227 6640518 6696272 6726893 6793809 6889579 7201596 7207909 7535446 7609998
14403 7609998 7549106 7953808 7767326 7839507 7933232 8337104 8127567 8518043 8242270 8587126
14393 8587126 9275910 9127395 8883209 9458829 8991246 9532478 9330362 9547353 9856633
14384 9856633 9993909 9927494 10015944 10474215 10650257 10661051 11106620 11220245 11200469 11558765
14374 11558765 11728812 11740716 12146189 12663273 12504188 12999960 13090535 13612458 13706408 14106587
$$ packed form
14444D236801J27978L39871k57175j62691P55052p6234l53171N96245j70021J7343
14434E053998n6725L32850n4731m10859M46196K02582k16209M06098q4651k06090
14424E412459M42645q8750J13110P9507n9727L74294k78229j49849N21853J92355
14414F559668J58649L5910j13709N5754L0621O6916R5770L12017O313L27537P4552
14403G609998o0892M04702j86482P2181R3725M03872k09537L90476k75773L44856
14393H587126O88784j48515k44186N75620m67583N41232k02116K16991L09280
14384I856633J37276o6415Q8450M58271J76042J0794M45569J13625j9776L58296
14374A1558765J70047J1904M05473N17084j59085M95772R0575N21923R3950M00179
$$ plain form
14364 14106587 13916750 14359424 14491948 14843669 15439302 15382627 15681203 16028112 16446557
14355 16446557 16655269 16961577 17320143 17769129 18251255 18775800 18670042 19630794 19591727
14346 19591727 20137481 20742572 21510030 21537443 22150712 22625254 23173547 24010551 24127146
14337 24127146 24596425 25858009 26301153 26882633 27585048 28473717 28726466 29545320 30360508
14328 30360508 31338339 32240716 33093234 33981244 34713482 35802199 37016523 37873035 39172913
14319 39172913 40367714 41765321 42756060 44034031 45704120 47231153 48681277 50323233
14311 50323233 52271880 53511979 55415034 57596362 59888435 61800898 64022388 66490618
14303 66490618 69186989 71953029 75425770 77979708 80972640 84158455 87906994 91810252
$$ packed form
14364A4106587j89837M42674J32524L51721N95633n6675K98576L46909M18445
14355A6446557K08712L06308L58566M48986M82126N24545j05758R60752l9067
14346A9591727N45754O05091P67458K7413O13269M74542N48293Q37004J16595
14337B4127146M69279J261584M43144N81480P02415Q88669K52749Q18854Q15188
14328C0360508R77831R02377Q52518Q88010P32238J088717J214324Q56512J299878
14319C9172913J194801J397607R90739J277971J670089J527033J450124J641956
14311E0323233J948647J240099J903055K181328K292073J912463K221490K468230
14303F6490618K696371K766040L472741K553938K992932L185815L748539L903258
$$ plain form
14295 91810252 95545893 100395714 104647379 109073363 114512489 120118437 125380625 131776468
14287 131776468 138235575 145672009 153116392 161040025 169605970 178275534 188263116 198368190
14279 198368190 208799818 220322221 232265854 245132423 258328364 272487824 286973605
14272 286973605 301700340 316645753 332277457 347131714 362661801 377496803 390995799
14265 390995799 403917572 415786386 426646898 436129266 444759313 452492807 458977864
14258 458977864 461523738 462501078 462296828 462667884 457470302 448864702 441944561 432907121
14250 432907121 419516937 406602876 393292122 379047585 364876891 349744838 335188021
14243 335188021 320682371 305954659 292000578 278413086 265491383 252614517 240579341
$$ packed form
14295I1810252L735641M849821M251665M425984N439126N605948N262188O395843
14287A31776468O459107P436434P444383P923633Q565945Q669564R987582J0105074
14279A98368190J0431628J1522403J1943633J2866569J3195941J4159460J4485781
14272B86973605J4726735J4945413J5631704J4854257J5530087J4835002J3498996
14265C90995799J2921773J1868814J0860512R482368Q630047P733494O485057
14258D58977864K545874R77340k04250L71056n197582q605600o920141r037440
14250D32907121j3390184j2914061j3310754j4244537j4170694j5132053j4556817
14243C35188021j4505650j4727712j3954081j3587492j2921703j2876866j2035176
$$ plain form
14236 240579341 228950088 217861246 207197928 196320797 186161655 175931771 166903069
14229 166903069 158682007 150666413 143237223 136123952 129685978 123675604 118149667 112932489
14221 112932489 107792318 102935418 98487045 94088627 90552524 86953697 83615745 80105902
14213 80105902 76824737 73915170 71065580 68317295 65964752 63450982 61046834 59085174
14205 59085174 57384892 55333651 53372892 51360715 49639375 48143330 47118763 45394737
14197 45394737 44275213 42641128 41209065 40351094 39027933 38642498 37383885 36097270
14189 36097270 34834329 34015791 33305750 32315713 31561777 30771250 30161573 29082837 28125040
14180 28125040 27697590 26958283 26439585 25907171 25205279 24073748 23792649 23339041 22934194
$$ packed form
14236B40579341j1629253j1088842j0663318j0877131j0159142j0229884r028702
14229A66903069q221062q015594p429190p113271o437974o010374n525937n217178
14221A12932489n140171m856900m448373m398418l536103l598827l337952l509843
14213H0105902l281165k909567k849590k748285k352543k513770k404148j961660
14205E9085174j700282k051241j960759k012177j721340j496045j024567j724026
14197D5394737j119524j634085j432063q57971j323161l85435j258613j286615
14189C6097270j262941q18538p10041r90037p53936p90527o09677j078736r57797
14180B8125040m27450p39307n18698n32414p01892j131531k81099m53608m04847
$$ plain form
14171 22934194 22128170 21626739 21163551 20905986 20441748 19949105 19546283 19081004 18723290
14162 18723290 18456770 18099851 17391913 17251541 16986738 16557960 16200114 16013246 15409856
14153 15409856 15119935 15272400 14502966 14536240 13922216 14031519 13697621 13391635 13219156
14144 13219156 13024886 12984232 13017021 11880678 12450800 11941872 11793116 11586493 11406023
14135 11406023 11142097 11066612 10830415 10556540 11122786 10492883 10036652 10359801 10043161
14126 10043161 9640406 9394413 9314538 9257859 9239239 9057780 8996112 8846419 8708745 8894963
14116 8894963 8375245 8330807 7800425 7671976 8063439 7750109 7866627 7483260 7491953 7337815
14106 7337815 7218065 7308261 6957719 6775604 6963313 6963651 6747232 6423148 6538380 6636449
$$ packed form
14171B2934194q06024n01431m63188k57565m64238m92643m02822m65279l57714
14162A8723290k66520l56919p07938j40372k64803m28778l57846j86868o03390
14153A5409856k89921J52465p69434L3274o14024J09303l33898l05986j72479
14144A3219156j94270m0654L2789j136343N70122n08928j48756k06623j80470
14135A1406023k63926p5485k36197k73875N66246o29903m56231L23149l16640
14126A0043161m02755k45993p9875n6679j8620j81459o1668j49693j37674J86218
14116H894963n19718m4438n30382j28449L91463l13330J16518l83367Q693j54138
14106G337815j19750R0196l50542j82115J87709L38k16419l24084J15232R8069
$$ plain form
14096 6636449 6585610 6451483 6370777 6147748 5909426 5924625 6055796 5709433 5913159 5784607
14086 5784607 5961962 5602157 5607889 5444148 5829110 5577140 5399718 5338088 4965866 5264962
14076 5264962 5052616 4937953 4790672 5091653 4819167 4805409 4473886 4751791 4523834 4428105
14066 4428105 4655553 4399512 4278609 4227179 4468632 3943815 4692885 4372918 4391682 4313282
14056 4313282 4266806 3881014 3861647 3596009 3772109 3807760 3648870 3976378 3579446 4030911
14046 4030911 3862449 3632790 3710976 3802427 3775119 3759062 3991541 3703549 3643942 3578039
14036 3578039 3314710 3718157 3382796 3743850 3097978 3245748 3199994 2859639 3104376 3183029
14026 3183029 2944103 2731617 3214894 2853702 2814479 2900658 3033806 2732843 3009904 2684879
$$ packed form
14096F636449n0839j34127q0706k23029k38322J5199J31171l46363K03726j28552
14086E784607J77355l59805N732j63741L84962k51970j77422o1630l72222K99096
14076E264962k12346j14663j47281L00981k72486j3758l31523K77905k27957r5729
14066D428105K27448k56041j20903n1430K41453n24817P49070l19967J8764p8400
14056D313282m6476l85792j9367k65638J76100L5651j58890L27508l96932M51465
14046D030911j68462k29659P8186R1451k7308j6057K32479k87992n9607o5903
14036C578039k63329M03447l35361L61054o45872J47770m5754l40355K44737P8653
14026C183029k38926k12486M83277l61192l9223Q6179J33148l00963K77061l25025
$$ plain form
14016 2684879 3178822 2865424 2772739 2699841 2933337 3050971 2773270 2687675 2496351 2889528
14006 2889528 2957995 2470837 2696594 2328792 2557790 2304460 2645824 2260520 2167023 2629910
13996 2629910 1958075 2498322 1918348 2015862 2190459 1818276 2160867 2351601 2278454 1880211
13986 1880211 2091631 2275460 2231654 2231480 2257357 2384208 2442045 2486730 2936597 2880896 3548756
13975 3548756 4576841 6283940 8973225 14772807 26341092 31386731 20944174 13721091
13967 13721091 9111144 6973412 5799053 4476340 4160137 3924339 3417092 3353338 2700509
13958 2700509 2915754 2854629 2439605 2459205 2475761 2464951 2419114 2056039 2047611 2155664 2368946
13947 2368946 2049942 1962972 2071369 2151630 1929433 1655396 1747022 1725147 1802873 1790737
$$ packed form
14016B684879M93943l13398r2685p2898K33496J17634k77701q5595j91324L93177
14006B889528O8467m87158K25757l67802K28998k53330L41364l85304r3497M62887
13996B629910o71835N40247n79974R7514J74597l72183L42591J90734p3147l98243
13986A880211K11420J83829m3806j74K5877J26851N7837M4685M49867n5701O67860
13975C548756J028085J707099K689285N799582J1568285N045639j0442557p223083
13967A3721091m609947k137732j174359j322713l16203k35798n07247o3754o52829
13958B700509K15245o1125m15024J9600J6556j0810m5837l63075q428J08053K13282
13947B368946l19004q6970J08397Q0261k22197k74037R1626k1875P7726j2136
$$ plain form
13937 1790737 1827536 2229968 1756240 1863793 1901978 1795907 1880955 1828668 1647770 1799715
13927 1799715 1704525 1557976 1598429 1431867 1608959 1724262 1545431 1723719 1179762 1537787
13917 1537787 1306841 1563431 1398574 1733394 1572059 1461409 1312722 1538278 1465736 1385436
13907 1385436 1569331 1408046 1551643 1406176 1343674 1019652 1608711 1385737 1419009 1166621
13897 1166621 1096438 1313142 1056349 1439541 1437315 1192261 1471086 1364050 1056834 1265732
13887 1265732 1388503 1150067 1349372 1591015 1293523 1062087 1212418 1474056 1378884 1257924
13877 1257924 1389381 1319856 1095930 1303507 1301086 1303603 1285107 1083969 1114663 1246305 1260802
13866 1260802 1142008 1216495 1109001 1260794 992482 732664 781940 1249073 1379165 1313519
$$ packed form
13937A790737L6799M02432m73728J07553L8185j06071Q5048n2287j80898J51945
13927A799715r5190j46549M0453j66562J77092J15303j78831J78288n43957L58025
13917A537787k30946K56590j64857L34820j61335j10650j48687K25556p2542q0300
13907A385436J83895j61285J43597j45467o2502l24022N89059k22974L3272k52388
13897A166621p0183K16704k56793L83192k226k45054K78825j07036l07216K08898
13887A265732J22771k38436J99305K41643k97492k31436J50331K61638r5172j20960
13877A257924J31457o9525k23926K07577k421K517j8496k01138L0694J31642J4497
13866A260802j18794P4487j07494J51793k68312k59818M9276M67133J30092o5646
$$ plain form
13856 1313519 1063616 1168701 1250267 1161118 1270669 1163294 1422417 1005098 685867 949219
13846 949219 816517 781626 767831 906168 861605 1072430 957407 1120898 1039145 895888
13836 895888 1207674 1075291 651537 671353 1042682 847575 709844 933443 963191 1081305
13826 1081305 1084345 969049 592547 786158 810776 752332 962813 1016341 1067033 1257983
13816 1257983 681714 882175 807971 790743 828968 794059 784306 957696 783260 737034 825444
13805 825444 724014 943938 944287 1030827 912893 903787 675732 1019859 1208419 591980 800942
13794 800942 539736 786400 1019349 521834 726924 822144 921350 960142 1017129 460065
13783 717973 687522 712053 719397 841945 581417 746989 693362 497394 541779 496025 459766
$$ packed form
13856A313519k49903J05085Q1566q9149J09551j07375K59123m17319l19231K63352
13846I49219j32702l4891j3795J38337m4563K10825j15023J63491q1753j43257
13836H95888L11786j32383m23754J9816L71329j95107j37731K23599K9748J18114
13826A081305L040j15296l76502J93611K4618n8444K10481N3528N0692J90950
13816A257983n76269K00461p4204j7228L8225l4909r753J73390j74436m6226Q8410
13805H25444j01430K19924L49Q6540j17934r106k28055L44127J88560E91980K08962
13794H00942k61206K46664K32949m97515K05090R5220R9206L8792N6987D60065
13783G17973l0451K4531P344J22548k60528J65572n3627j95968M4385m5754l6259
$$ plain form
13772 459766 564214 785739 283248 886972 641089 538096 789377 674810 546548 364148
13762 364148 696599 730360 797557 821291 740598 404887 511770 859266 649843 608448
13752 608448 936815 442059 866492 796916 415200 593308 855872 384547 604192 362579
13742 362579 543955 506516 514785 687854 659640 732618 735310 572726 496845 613259 299166
13730 193286 876008 703806 675785 664226 355164 708954 352768 316101 577917 465011
13720 465011 791009 385234 515521 497322 645814 487046 639099 715534 345015 401648
13710 401648 505561 789151 828648 698183 542544 590979 527944 372563 614845 503497
13700 503497 459456 413719 490568 593933 647432 242584 527540 673229 619716 380467
$$ packed form
13772D59766J04448K21525B83248O03724k45883j02993K51281j14567j28262j82400
13762C64148L32451L3761O7197K3734q0693l35711J06883L47496k09423m1395
13752F08448L28367D42059M24433o9576l81716J78108K62564C84547K19645k41613
13742C62579J81376l7439Q269J73069k8214P2978K692j62584p5881J16414B99166
13730A93286O82722j72202k8021j1559l09062L53790C52768l6667K61816j12906
13720D65011L25998C85234J30287j8199J48492j58768J52053P6435C45015N6633
13710D01648J03913K83590L9497j30465j55639M8435o3035j55381K42282j11348
13700E03497m4041m5737P6849J03365N3499B42584K84956J45689n3513k39249
$$ plain form
13690 380467 620074 610830 471020 676695 734128 707721 716849 513601 673106 679113 561257
13679 561257 297960 539340 381234 289045 426251 560684 581857 612023 248897 339756
13669 339756 466581 548143 482544 654947 555108 615176 444914 574334 266317 381392
13659 381392 286922 39143 543742 313967 581967 177949 408253 403209 575152 328546
13649 328546 384298 342796 649265 483379 225119 667752 -42325 358756 462735 629666
13639 629666 591041 509877 427877 362038 477477 457211 263811 100302 603424 510773 372689
13628 372689 389024 263142 732390 266583 628665 358307 523198 248006 440602 385990
13618 385990 271014 408479 420167 443968 617359 46055 489121 517821 491569 255977
$$ packed form
13690C80467K39607r244j39810K05675N7433k6407R128k03248J59505O007j17856
13679E61257k63297K41380j58106r2189J37206J34433K1173L0166B48897R0859
13669C39756J26825Q1562o5599J72403r9839O0068j70262J29420B66317J15075
13659C81392r4470C9143N04599k29775K68000A77949K30304n044J71943k46606
13649C28546N5752m1502L06469j65886B25119M42633d2325C58756J03979J66931
13639F29666l8625q1164q2000o5839J15439k0266j93400A00302N03122r2651j38084
13628C72689J6335j25882M69248B66583L62082k70358J64891B48006J92596n4612
13618C85990j14976J37465J1688K3801J73391D6055M43066K8700k6252k35592
$$ plain form
13608 255977 395383 388198 477058 637074 444346 377813 366410 515881 540748 132640 276073
13597 276073 407300 359039 242984 514551 213947 593078 296303 117897 524710 345223
13587 345223 440705 375542 -107440 534073 294434 347733 537226 439272 292749 336564
13577 336564 33034 18 321058 190733 483767 478170 410891 441767 293075 571748 81967
13565 313035 79043 332415 382768 108630 348700 328015 332044 318088 272446 237729 77761
13553 293639 217484 268893 247860 207094 377594 379087 251020 237415 472250 168493 364327
13542 364327 127415 163285 147774 277746 524449 346011 369300 131491 355399 528485
13532 528485 307262 492639 -50593 399398 364305 64061 187539 376306 414689 161961
$$ packed form
13608B55977J39406p185Q8860J60016j92728o6533j1403J49471K4867A32640J43433
13597B76073J31227m8261j16055K71567B13947L79131B96303A17897M06813j79487
13587C45223R5482o5163a07440E34073k39639N3299J89493r7954j46523M3815
13577C36564C3034A8L21040j30325K93034n597o7279L0876j48692K78673H1967
13565C13035G9043K53372N0353A08630K40070k0685M029j3956m5642l4717G7761
13553B93639p6155N1409k1033m0766J70500J493j28067j3605K34835A68493J95834
13542C64327A27415L5870j5511J29972K46703j78438K3289A31491K23908J73086
13532E28485k21223J85377e0593C99398l5093F4061J23478J88767L8383A61961
$$ plain form
13521 144832 275603 268183 274254 -246917 176378 390895 379680 164955 231660 82917 428846
13510 428846 284573 462764 246462 258833 188749 2081 207172 122950 -188929 420113
13499 606115 131626 387151 284960 182940 209383 218345 257505 63528 432880 144233
13488 261469 185375 381740 174450 325293 499160 241518 144761 263207 263860 164183 310887
13477 310887 323239 19958 445958 188529 23215 249399 31426 -206742 46736 129477 -8464
13465 1388 300115 335084 144222 538552 366272 39466 -122868 -76880 175854 116829 258523
13454 258523 322449 439658 84995 -6173 272463 447956 201571 88718 118817 188960 348488
13443 348488 226300 341721 268964 -288455 258829 162468 223400 214021 95838 -102996 444369
$$ packed form
13521A44832J30771p420O071b46917A76378K14517j1215A64955O6705H2917L45929
13510D28846j44273J78191k16302J2371p0084B081K05091q4222a88929D20113
13499F06115A31626K55525j02191j02020K6443Q962L9160F3528L69352A44233
13488B61469p6094J96365A74450J50843J73867B41518r6757J18446O53r9677J46704
13477C10887J2352A9958M26000A88529B3215K26184C1426b06742D6736Q2741h464
13465A388K98727L4969A44222L94330j72280C9466a22868M5988A75854n9025J41694
13454B58523O3926J17209H4995f173B72463J75493B01571H8718L0099P0143J59528
13443C48488j22188J15421p2757b88455B58829r6361O0932r379I5838a02996D44369
$$ plain form
13431 290397 -166300 245691 217957 -42685 322662 81557 323119 131885 386119 208659
13421 208659 267792 404835 538 112839 3744 165018 281290 244414 -14870 25370 478789
13410 478789 290422 114865 474263 -59206 394682 139858 59119 -658 135943 362925
13400 362925 113500 460417 176665 153931 47809 144127 -121984 -35980 -168528 190688
13389 228216 149263 479004 215592 84216 191397 300254 -295092 350188 -49894 297547
13378 -89281 305623 159955 293632 118134 -23397 342590 146877 55884 316069 81655
13367 141881 164974 225486 123125 163409 293895 160981 172530 341511 116232 83718
13357 83718 139591 27806 417235 438322 164736 146332 84810 229241 170930 457328 125754
$$ packed form
13431B90397a66300B45691k7734d2685C22662H1557K41562A31885K54234j77460
13421B08659N9133J37043E38J12301C744J61274J16272l6876a4870B5370M53419
13410D78789j88367A14865L59398e9206C94682A39858E9119f58A35943K26982
13400C62925A13500L46917A76665k2734D7809R6318a21984c5980j32548A90688
13389B28216p8953L29741B15592H4216J07181J08857b95092C50188d9894B97547
13378h9281C05623j45668J33677A18134b3397C42590A46877E5884K60185H1655
13367A41881K3093O0512j02361M0284J30486j32914J1549J68981A16232l2514
13357H3718N5873B7806L89429K1087A64736j8404o1522J44431n8311K86398A25754
$$ plain form
13345 -59613 89661 76576 590328 79930 373564 345801 -57590 196052 182855 370729 407376
13334 407376 -16387 121331 97210 164446 162606 143916 344218 88041 123618 285267 118459
13322 152321 147370 337616 35127 399106 127480 178673 177143 368902 -161876 305406 207892
13311 207892 104360 -40619 102029 190216 191290 211336 214599 224002 398934 111707 101041
13300 101041 145803 378628 -124045 -190475 212791 208091 152001 5578 66206 41341 88770
13289 88770 218901 -97727 -174033 120002 -258929 22016 116065 262945 247502 135017 -137584
13277 37989 119022 -23622 436832 192012 -1119 451659 205603 -5952 121288 103082 76419
13266 76419 -32003 42050 87107 47373 4411 273484 239844 266577 -243470 131828 247058
$$ packed form
13345e9613H9661j3085N13752G9930K93634k7763e7590A96052j3197J87874L6647
13334D07376a6387A21331k4121O7236j840j8690K00302H8041L5577J61649A18459
13322A52321m951J90246C5127L63979A27480N1193j530J91759a61876C05406r7514
13311B07892j03532d0619A02029Q8187J074K0046L263R403J74932A11707j0666
13300A01041M4762K32825a24045o6430B12791m700n6090E578O0628k4865M7429
13289H8770J30131i7727p6306A20002b58929B2016R4049J46880j5443j12485a37584
13277C7989Q1033b3622D36832A92012a119D51659B05603e952A21288j8206k6663
13266G6419c2003D2050M5057l9734D411K69073l3640K6733b43470A31828J15230
$$ plain form
13255 247058 -124958 98265 77802 407456 114678 181416 -103232 346372 27691 178937
13245 178937 -221908 37954 182415 63021 252463 439033 407943 -191605 182086 25833
13234 320308 -205752 -61301 368487 123890 -74436 43648 -88768 410100 122942 360214
13224 360214 98614 64948 206539 390039 88201 78500 91229 356290 106219 -43198 10095
13212 310889 84277 -78783 194703 313155 -191640 52614 -77836 144364 -37969 53423 262286
13201 262286 130004 136289 -138261 180923 173097 211351 -52952 449659 38013 308245 213795
13190 213795 75424 211810 144455 242837 -25240 -48932 119374 -200237 146667 -233173
13179 41272 46897 202308 -89515 -70385 153612 143051 260561 274904 -55145 284811 263484
$$ packed form
13255B47058a24958I8265k0463L29654A14678O6738a03232C46372B7691J51246
13245A78937b21908C7954J44461F3021J89442J86570l1090a91605A82086B5833
13234C20308b05752f1301C68487A23890g4436D3648h8768D10100A22942K37272
13224C60214I8614l3666J41591J83500H8201r701J2729K65061A06219d3198A0095
13212C10889H4277g8783A94703J18452a91640E2614g7836A44364c7969E3423K08863
13201B62286A30004O285a38261A80923p826L8254e2952D49659C8013K70232r4450
13190B13795G5424J36386o7355R8382b5240k3692A19374b00237A46667b33173
13179D1272N625J55411h9515J9130A53612j0561J17510J4343e5145B84811k1327
$$ plain form
13168 263484 -89909 49855 -186118 26216 -179463 233513 86840 95128 11923 166657 55447
13156 188063 -92075 87761 278969 -34510 165530 312380 1548 -49086 117969 -187063 31988
13144 163607 24650 304930 -75128 -270874 215395 152084 -56229 116280 -44193 -391686
13134 -391686 231433 95668 76492 222293 -9466 141916 96396 297365 151342 23066 111977
13123 111977 -122952 81333 -124661 58676 165766 351764 93444 233526 -10210 -219480
13113 -219480 101060 -239517 157314 171939 161407 21888 128328 66705 -44248 -56321 84384
13101 294684 -283685 -115561 -4913 -597451 129199 -23578 -188789 142305 464475 2701
13090 -9771 38414 -176348 -260426 141534 201730 262137 -183737 36542 -71884 153552 -215081
$$ packed form
13168B63484h9909D9855a86118B6216a79463B33513H6840Q288A1923J54734E5447
13156A88063i2075H7761J91208c4510A65530J46850A548d9086A17969a87063C1988
13144A63607B4650K80280g5128j95746B15395o3311e6229A16280d4193l47493
13134c91686B31433I5668j9176J45801i466A41916m5520K00969j46023B3066Q8911
13123A11977a22952H1333a24661E8676J07090J85998I3444J40082a0210k09270
13113b19480A01060b39517A57314J4625j0532B1888J06440o1623d4248j2073H4384
13101B94684b83685a15561d913n92538A29199b3578j65211A42305L22170B701
13090i771C8414a76348q4078A41534O0196O0407a83737C6542g1884A53552b15081
$$ plain form
13078 410504 50134 301094 -175101 -84135 74047 57692 254846 57646 -205785 199536
13067 -110199 39122 -197860 -187973 154944 63567 85457 28691 87313 4368 186567 366403
13056 366403 211061 176208 -108166 54327 173050 256767 14230 6825 51152 79366 217911
13045 217911 275074 172226 287285 -54346 -261674 61067 502869 187404 12206 2284 -178259
13033 86173 235172 257636 103270 -352174 255170 111424 200003 448034 91061 -78017
13022 -4126 -132274 -96637 -5742 328943 196222 -63342 -36058 -142379 33107 171022 244458
13011 244458 265425 393272 -158520 185048 2941 25805 184247 382173 -301307 117976
13000 -50672 -199339 -86877 121882 245371 549405 140618 316254 303118 72229 70402 -1610
$$ packed form
13078D10504E0134K50960a75101h4135G4047j6355J97154E7646b05785A99536
13067a10199C9122a97860R887A54944F3567K1890B8691N8622D368J82199J79836
13056C66403j55342l4853a08166E4327J18723Q3717A4230F825M4327K8214J38545
13045B17911N7163j02848J15059e4346k07328F1067M41802A87404A2206B284a78259
13033H6173J48999K2464A03270c52174B55170A11424Q8579K48031I1061g8017
13022d126j28148L5637e742C28943j32721f3342K7284j06321C3107J37915P3436
13011B44458K0967J27847a58520A85048B941K2864J58442J97926c01307A17976
13000e0672j48667h6877A21882J23489L04034A40618J75636j3136G2229j827a610
$$ plain form
12988 43734 80809 236559 14998 26448 2894 -48493 -223307 138851 -55633 -97838 -177083
12977 -177083 13736 294396 55374 238387 -174414 263796 204713 -77360 104089 -8437 156077
12965 89911 135512 302716 7821 -34499 101567 303948 77145 -44423 147452 -228684 8892
12953 -25005 -3329 187682 90916 -433595 21671 -21731 -1086 31427 -146798 145279 -112296
12941 -278080 270005 218692 432342 66664 -86922 54511 -130239 261768 2700 339815 -81313
12929 69537 164297 -37627 -112947 138678 223241 14194 53253 -84636 104308 -16725 -46879
12918 -46879 160796 208456 -58505 68120 231699 -220860 8348 -15352 115893 208384 67983
12906 -3540 -34268 68766 -44719 -104738 -120008 32406 189160 191139 72039 87591 -94399 205563
$$ packed form
12988D3734L7075J55750A4998J1450B894d8493j74814A38851e5633m2205p9245
12977a77083A3736K80660E5374J83013a74414B63796n9083g7360A04089h437A56077
12965H9911M5601J67204G821c4499A01567K02381G7145d4423A47452b28684H892
12953b5005c329A87682I0916d33595B1671b1731a086C1427a46798A45279a12296
12941b78080B70005n1313K13650F6664h6922E4511a30239B61768B700L37115h1313
12929F9537R4760c7627p5320A38678Q4563A4194L9059h4636A04308a6725l0154
12918d6879A60796M7660e8505F8120J63579b20860H348a5352A15893R2491F7983
12906c540l0728F8766d4719o0019j5270C2406J56754J979G2039J5552i4399B05563
$$ plain form
12893 206971 -227593 100338 -396317 -26538 -36890 176215 110964 -32650 -160967 32441
12882 -129699 168872 90184 87982 11263 208508 118555 -110101 11235 -322659 -93343 220096
12870 -387776 24760 118263 -71922 -68576 97477 -158311 -31467 136801 -197814 -21090 157552
12858 283645 -129161 -149102 -61072 -169805 -104097 -4331 237253 137084 76890 60927 -70521
12846 -79957 48089 -88201 85008 338800 -85914 -179535 220029 359474 -72114 349740 -121352
12834 -203906 -307217 -37929 33426 -59603 210449 333790 129289 153017 -87127 456351
12823 54114 -202140 139180 -124763 -139109 203616 259757 135975 24724 -173364 191948
12812 10128 172784 -134067 466490 -32764 -71878 -351456 116024 -156254 -257808 323227
$$ packed form
12893B06971b27593A00338c96317b6538j0352A76215o5251c2650j28317C2441
12882a29699A68872p8688k202A1263J97245q9953a10101A1235c22659i3343B20096
12870c87776B4760R3503g1922L346I7477a58311c1467A36801a97814b1090A57552
12858B83645a29161j9941f1072j08733O5708d331B37253j00169o0194j5963g0521
12846g9957D8089h8201H5008K53792h5914r3621B20029J39445g2114C49740a21352
12834b03906j03311c7929C3426e9603B10449J23341A29289K3728h7127D56351
12823E4114b02140A39180a24763j4346B03616N6141j23782B4724a73364A91948
12812A0128J62656a34067D66490c2764l9114k79578A16024a56254j01554C23227
$$ plain form
12801 128579 397343 47962 -47007 174593 61602 -96831 -100839 -171906 -18709 31889 406330
12790 406330 141795 -182938 50855 -7047 45132 39603 23292 -39256 -138229 210300 6843
12778 17497 -133539 62007 176603 338052 39294 -98328 195326 -160885 14295 -66042 -168863
12767 -168863 -50543 -142830 148046 196113 67903 352997 49051 127184 1802 226009 42858
12755 -24651 106017 42467 110640 466086 149246 -303957 34216 -88920 -140969 -213923 -116233
12744 -116233 135763 -60181 223144 304486 168399 224708 -17110 25499 53012 -48767 124232
12732 295031 -444304 223811 -175445 -290103 -3101 -154902 -227451 -170563 -167646 404529 -173267
12720 -31152 387861 80600 -151585 -211850 70123 223148 39960 150615 210040 2401 -23983
$$ packed form
12801A28579K68764D7962d7007A74593F1602i6831m008p1067a8709C1889L74441
12790D06330A41795a82938E0855g047D5132n529j6311c9256r8973B10300F843
12778A7497a33539F2007J14596J61449C9294i8328A95326a60885A4295f6042j02821
12767a68863e0543r2287A48046M8067F7903K85094D9051P8133A802K24207D2858
12755b4651A06017D2467O8173L55446A49246c03957C4216h8920n2049p2954R7690
12744a16233A35763f0181B23144Q1342j36087N6309a7110B5499K7513d8767A24232
12732B95031d44304B23811a75445j14658c101j51801p2549N6888K917D04529a73267
12720c1152C87861H0600a51585o0265G0123J53025C9960J10655N9425B401b3983
$$ plain form
12708 -144362 -57397 209373 -62178 -186064 -238747 84951 -122343 27653 75600 289957 -22410
12696 65434 341907 -4931 207887 409169 -35133 42848 99866 39283 268854 194342 127470
12685 127470 52655 378255 176624 254637 213488 -83796 -130685 131831 35645 202354 -300825
12673 310175 -142834 -246957 -29706 -147508 118871 174182 138527 176681 -27000 257856
12662 144153 38183 110860 -122941 71942 53480 24049 -112933 189029 85594 -71299 -170462
12651 -170462 19354 120434 162191 29098 234205 19522 343057 130795 31310 204725
12641 204725 32300 176679 -8967 -123766 79369 198152 -53879 120140 132163 -126362 163789
12629 2540 197636 -118695 209886 16072 81971 -269962 166334 -14971 -155038 -149873 80576
$$ packed form
12708a44362e7397B09373f2178j23886n2683H4951a22343B7653M7947K14357b2410
12696F5434K76473d931B07887K01282c5133D2848N7018C9283K29571p4512o6872
12685A27470E2655L25600A76624P8013m1149h3796m6889A31831C5645J66709c00825
12673C10175a42834j04123b9706j17802A18871N5311l5655L8154b7000B57856
12662A44153C8183P2677a22941G1942j8462B4049a12933A89029H5594g1299r9163
12651a70462A9354J01080M1757B9098K05107A9522L23535A30795C1310J73415
12641B04725C2300J44379h967j14799G9369J18783e3879A20140J2023a26362A63789
12629B540J95096a18695B09886A6072O5899b69962A66334a4971j40067N165H0576
$$ plain form
12617 334979 -5582 252845 194194 204186 99438 210708 203286 -10753 77882 162902 67298 134865
12605 134865 161690 26579 1074 -20484 -36526 -128229 20241 -253646 -69767 -53636 -186761
12594 -186761 187391 17823 -5996 55608 -119237 315179 271559 122202 179297 122363 -40507
12582 166850 303084 166487 141824 -211417 128918 143579 -37222 -6168 -362426 -49696 399873
12570 270664 -24772 8913 3139 196181 365504 -339043 47063 -80084 -28699 -190844 -35679
12558 -22090 147932 -29388 78838 261361 219234 -102611 251927 -262579 -16339 111218
12547 127115 162787 -63473 -105543 323001 283726 60442 29669 -21066 -76020 -56243 -80307
12536 -80307 -44581 279431 41947 -27679 44835 -137959 15654 -41784 -60649 -31057 -89059
$$ packed form
12617C34979e582B52845n8651R992I9438J11270p422a0753G7882Q5020F7298O7567
12605A34865K6825B6579A074b0484j6042r1703B0241b53646f9767J6131j33125
12594a86761A87391A7823e996E5608a19237C15179m3620A22202N7095n6934d0507
12582A66850J36234j36597k4663b11417A28918J4661c7222f168l56258d9696C99873
12570B70664b4772H913C139J93042J69323c39043D7063h0084b8699j62145c5679
12558b2090A47932b9388G8838J82523m2127a02611B51927b62579a6339A11218
12547A27115L5672f3473m2070C23001l9275F0442B9669b1066n4954J9777k4064
12536h0307L5726B79431D1947b7679D4835a37959A5654d1784j8865K9592n8002
$$ plain form
12525 -89059 123534 137490 -12398 -188822 -302360 -68488 -95099 60927 -3230 230349 236214
12514 236214 -69167 -20329 -47956 87036 4988 -203873 123781 -124264 44136 166438 -113998
12502 -280116 -62508 -282127 117356 45039 207800 88150 -340677 96948 347504 91614
12491 71404 249399 180971 -381373 -249934 -29574 133211 183066 158191 46455 207143 -26850
12479 -146423 189745 135906 50527 -51506 53457 -73883 70787 22630 63408 179392 -186012
12467 -218516 289452 606739 126363 -278169 28325 203702 -169558 124838 381849 -111731
12456 544903 -34203 284729 -85862 7999 245100 81393 223331 95355 260456 -98115 28621
12444 -189813 143112 52873 97281 54065 -216935 131547 143573 -75178 116875 -43438 204655
$$ packed form
12525h9059A23534J3956a2398j76424j13538f8488k6611F0927c230B30349N865
12514B36214f9167b0329k7627H7036D988b03873A23781a24264D4136J22302a13998
12502b80116f2508k19619A17356D5039J62761H8150c40677I6948K50556I1614
12491G1404J77995o8428c81373J31439b9574A33211M9855k4875D6455J60688b6850
12479a46423A89745n3839E0527e1506E3457g3883G0787B2630M0778J15984a86012
12467b18516B89452L17287A26363b78169B8325J75377a69558A24838K57011a11731
12456E44903c4203B84729h5862G999K37101H1393J41938I5355J65101i8115B8621
12444a89813A43112E2873M4408m3216b16935A31547J2026g5178A16875d3438B04655
$$ plain form
12432 -46379 -306144 -38187 -68909 -18375 -192718 -93139 -114377 -183548 321284 350181 47982
12420 183353 -35291 88070 202632 174452 -123366 -13811 -227839 -15828 216924 277080 -133162
12408 154168 7274 -76761 71382 108183 -24448 -60454 -40818 -209439 -176097 97148 102085 230741
12396 230741 -208650 -50291 -76616 18009 291926 -326845 -90397 -85890 123553 121234 -267424
12384 -51868 -56403 -46557 78103 -160635 191178 -15046 -332794 56061 -478084 110355 106724
12373 106724 201403 -214953 -79204 -112531 262249 -72382 -75109 -194304 134209 -78884 125570
12361 67996 14115 -72565 32439 104426 -95694 -272503 39122 26940 -171724 180125 -81093
12349 309685 -55727 -7163 278474 -190968 295299 76535 161796 120299 -71807 -201809 167747
$$ packed form
12432d6379k59765c8187l0722a8375j74343i3139k1238o9171C21284K8897D7982
12420A83353c5291H8070J14562k8180a23366a3811k14028a5828B16924O0156a33162
12408A54168G274g6761G1382L6801b4448l6006J9636j68621L3342I7148M937J28656
12396B30741b08650e0291k6325A8009K73917c26845i0397M507A23553k319b67424
12384e1868m535R846G8103a60635A91178a5046l17748E6061d78084A10355l631
12373A06724R4679b14953g9204l3327B62249g2382k727j19195A34209g8884A25570
12361F7996A4115g2565C2439P1987i5694j76809C9122j2182a71724A80125h1093
12349C09685e5727g163B78474a90968B95299G6535Q5261m1497g1807j30002A67747
$$ plain form
12337 -130359 -40356 39727 55043 41154 50181 -208997 24216 93395 -330615 7415 184759
12326 184759 -11247 48993 32529 -119215 -17613 -423237 90760 179242 -63354 289916 -167180
12314 -165315 34631 -107269 205842 -111142 37871 -73759 -290129 -399921 -322539 351026
12303 -203493 -276879 228349 -321699 133612 300686 -20333 -207519 352772 203579 -74759
12292 -49045 -37844 -38119 164521 41091 -196993 -82723 -168435 116727 137489 484282 -257053
12280 31327 197530 385707 105320 -91250 87130 306649 105850 69033 157725 -135403
12269 83722 17077 -142780 9955 309070 141585 37816 -52041 -162187 23326 130883 144268
12258 144268 152030 56645 436813 -108316 49939 181312 -290266 -87278 180869 -5568 58356
$$ packed form
12337a30359d0356C9727J5316j3889R027b08997B4216O9179c30615G415J77344
12326A84759a1247D8993j6464a19215a7613m05624I0760Q8482f3354B89916a67180
12314a65315C4631a07269B05842a11142C7871g3759k16370j09792P7382C51026
12303b03493p3386B28349c21699A33612J67074b0333j87186C52772j49193g4759
12292d9045J1201k75A64521D1091a96993h2723q5712A16727K0762L46793b57053
12280C1327J66203J88177A05320i1250H7130K19519A05850l6817Q8692a35403
12269H3722A7077a42780I955K99115A41585C7816e2041j10146B3326J07557J3385
12258A44268P762E6645L80168a08316D9939J31373b90266h7278A80869e568E8356
$$ plain form
12246 237349 192082 22692 65568 -140595 207686 -283457 -74670 -209086 135696 33783
12235 93538 331135 -123314 81760 329429 418004 -125141 54350 57735 166782 233711 26264
12223 94036 80576 -79521 -356849 -238128 30424 25257 61613 119558 40150 -41289 346923
12211 307870 102361 232043 -1015 37880 406529 427098 48868 221668 -274873 11902 345854
12200 345854 303863 49487 226840 172548 73231 108340 313447 347488 -105951 166036 276066
12189 276066 -160207 34312 137180 -136485 148942 34209 50183 -29327 300594 570112
12179 570112 -28385 411120 137867 166624 128972 371176 380182 -8629 26174 257164 256720
12168 256720 13629 261969 -135758 230721 386378 521567 70927 101983 -42486 27747
$$ packed form
12246B37349m5267B2692M2876a40595B07686b83457g4670j34416A35696C3783
12235I3538K37597a23314H1760K47669Q8575a25141E4350L385J09047O6929B6264
12223I4036j3460g9521k77328J18721C0424n167L6356N7945D0150d1289C46923
12211C07870A02361J29682a015C7880L68649K0569D8868J72800b74873A1902L33952
12200C45854m1991D9487J77353n4292G3231L5109K05107L4041a05951A66036J10030
12189B76066a60207C4312J02868a36485A48942C4209J5974b9327C00594K69518
12179E70112b8385D11120A37867K8757l7652K42204R006h629B6174K30990m44
12168B56720A3629K48340a35758B30721J55657J35189G0927L1056d2486B7747
$$ plain form
12157 222040 -59518 271468 -129611 193910 567 -132665 170915 -12931 42939 67663 269386
12146 269386 246475 178341 198771 -87710 48159 -166216 214680 46352 220762 -66857 -21028
12134 239785 -22911 -19755 158405 -54893 168728 -65386 213344 -276856 246613 57822 -202013
12122 -309084 80902 -99188 -178885 163268 197841 396685 -30219 -136934 16402 -138123 50357
12110 262228 -30229 -151189 291121 233224 100157 77692 -71904 -4699 -260806 -215076 9625
12098 -36643 -76843 55724 -102786 -236630 304740 -32795 132968 274039 231585 -74883 -305832
12087 -305832 -89854 84176 114785 134617 133823 -8053 82737 94155 -382662 -39040 -7068 -10085
12075 -10085 36840 -252367 -448160 -141927 12656 -96636 43896 -122264 49921 -145828 4230
$$ packed form
12157B22040e9518B71468a29611A93910E67a32665A70915a2931D2939K4724K01723
12146B69386k2911o8134K0430h7710D8159a66216B14680D6352J74410f6857b1028
12134B39785b2911L156A58405e4893A68728f5386B13344b76856B46613E7822b02013
12122c09084H0902i9188p9697A63268L4573J98844c0219j06715A6402a38123E0357
12110B62228c0229j20960B91121n7897A00157k2465g1904d699k56107M5730I625
12098c6643m0200E5724a02786j33844C04740c2795A32968J41071m2454g4883k30949
12087c05832h9854H4176L0609J9832p94h053H2737J1418c82662c9040g068l017
12075a0085C6840b52367j95793a41927A2656i6636D3896a22264D9921a45828D230
$$ plain form
12063 213727 391466 843504 1152531 709004 556320 203641 153008 367225 -19769 84432
12052 -66683 60569 -94135 -64986 23235 25555 -201084 -224686 -380513 92513 -21126 -62302
12041 -62302 -79038 108279 315272 -500383 -203684 -122968 189291 235016 -44464 11293 -120127
12029 -35326 -36049 -61465 -52263 -86184 156842 -3316 -53332 34546 -33673 82111 61880 -188704
12016 62737 77152 -126614 183386 -9823 143039 203090 -312181 171334 158385 132384 115656
12005 115656 -15837 -40995 81744 -301295 133477 139529 226200 -29673 39261 -125527 -182885
11994 -182885 -20183 -7857 -303535 -155004 -389991 -65364 -9969 206159 261046 -157375 -64694
11982 270266 556349 76626 -94400 -181060 -41000 118079 -31979 147038 88074 -144209 187001
$$ packed form
12063B13727J77739M52038L09027m43527j52684B03641n0633K14217a9769H4432
12052f6683F0569i4135K9149B3235K320b01084k3602j55827I2513b1126m1176
12041f2302j6736A08279K06993e00383b03684Q0716A89291M5725d4464A1293a20127
12029c5326p23k5416R202l3921A56842c316n0016C4546c3673H2111k0231a88704
12016F2737J4415a26614A83386i823A43039O0051c12181A71334j2949k6001j6728
12005A15656a5837k5158H1744c01295A33477O052Q6671b9673C9261a25527n7358
11994a82885b0183g857k95678J48531k34987f5364i969B06159N4887a57375f4694
11982B70266K86083G6626i4400q6660d1000A18079c1979A47038n8964a44209A87001
$$ plain form
11970 137113 -189434 -245889 -114691 188115 -141788 -76911 370043 1647 -93636 -123946 -257447
11959 -257447 -97827 25578 -24331 -289505 408606 -47227 35026 55023 85513 7164 -51544
11947 329145 109266 -11062 -210228 240389 -148416 114133 -503375 -59304 -78115 -34566
11936 155605 -204062 265558 -175099 130278 -223681 7101 13719 273744 -270695 19859
11925 48211 105527 -246621 219012 56219 6763 -206113 30900 -185275 152815 -6300 18876
11913 131365 -335884 -99668 220097 -113633 -180397 -124170 255399 -37216 -222721 58295
11902 -167933 371740 264478 -54160 -131936 -61202 -260972 -21419 -37792 -86232 28958 -54346
11890 168875 144077 -28366 -210515 -160006 -242416 -34554 -82124 84338 -158461 49973 44302
$$ packed form
11970A37113a89434n6455a14691A88115a41788O4877C70043A647i3636l0310j33501
11959b57447i7827B5578b4331k65174D08606d7227C5026J9997L0490G164e1544
11947C29145A09266a1062j99166B40389a48416A14133e03375e9304j8811c4566
11936A55605b04062B65558a75099A30278b23681G101O618K60025b70695A9859
11925D8211N7316b46621B19012E6219F763b06113C0900a85275A52815f300A8876
11913A31365c35884i9668B20097a13633o6764N6227B55399c7216j85505E8295
11902a67933C71740j07262e4160p7776f1202j99770b1419j6373m8440B8958e4346
11890A68875k4798b8366j82149N0509q2410c4554m7570H4338a58461D9973n671
$$ plain form
11879 44302 -116787 104890 -28761 -244184 229173 -20859 375980 -67127 -416440 -305182
11869 -305182 242999 320681 -151591 32660 -42545 -81015 -314793 -147139 -127730 29733 36633
11858 36633 -100903 1874 102878 -75427 -136655 -287535 -104782 56953 -118749 -89406 10340
11846 -69944 -78154 -91168 149025 32430 -160995 78345 201974 233269 289298 35506 -35164
11834 -148105 -33863 45851 27400 79391 192411 -86313 -27561 -24938 234449 -413040 58960
11822 8120 237220 54872 -20951 180670 75857 30734 -593074 -187954 -169720 -185538 225785
11810 -30966 -207635 -104844 -295154 38021 33600 230088 -106778 70178 -1669 -190484 -219924
11799 -219924 12228 -43323 -72167 112076 -133779 92468 -256096 -202484 -172541 60707 -67505
$$ packed form
11879D4302a16787A04890b8761k15423B29173b0859C75980f7127l49313J11258
11869c05182B42999P7682a51591C2660d2545l8470k33778a47139J9409B9733O900
11858C6633a00903A874J01004g5427o1228j50880a04782E6953a18749K9343A0340
11846f9944q210j3014A49025C2430a60995G8345J23629L1295N6029C5506c5164
11834a48105c3863D5851j8451N1991J13020h6313b7561K623B34449d13040E8960
11822H120K29100E4872b0951A80670G5857C0734e93074a87954J8234j5818B25785
11810c0966j76669J02791j90310C8021m421J96488a06778G0178a669j88815k9440
11799b19924A2228d3323k8844A12076a33779I2468b56096N3612K9943F0707f7505
$$ plain form
11787 265114 -160226 -377712 -137078 -475758 12684 102928 -35651 -11690 167690 -53076
11776 154685 314850 147292 102599 139623 -93907 77583 83071 49699 165922 100967 88418
11765 88418 -167644 110975 -153961 -13729 107171 234029 -134466 -81568 -150203 41355
11754 -394702 -82956 -13070 -62232 -203748 -26858 -170138 -109917 232557 10178 -124409 -384813
11743 -384813 -108682 -25862 83089 -8710 56741 144912 60378 19789 -256375 208484 117632
11732 117632 -73342 166096 132724 -104600 -254653 -89377 -21265 -97584 -63919 79325 -315832
11720 -194081 -186157 -173526 -156834 211951 -89758 345473 89476 137296 344404 52268 -39389
11708 -133449 68097 128186 161429 64922 146394 -18648 19908 69506 -55012 162608 137703
$$ packed form
11787B65114a60226k17486a37078l38680A2684R0244c5651a1690A67690e3076
11776A54685J60165A47292m4693L7024i3907G7583N488l3372J16223o4955j2549
11765H8418a67644A10975a53961a3729A07171J26858a34466N2898o8635D1355
11754c94702h2956a3070m9162j41516b6858j43280O0221B32557A0178a24409k60404
11743c84813a08682b5862H3089h710E6741Q8171F0378A9789b56375B08484r0852
11732A17632g3342A66096l3372a04600j50053h9377b1265p6319L3665G9325c15832
11720a94081P924J2631J6692B11951h9758C45473H9476M7820K07108E2268c9389
11708a33449F8097O0089L3243F4922Q1472a8648A9908M9598e5012A62608k4905
$$ plain form
11697 137703 28155 -12418 -158734 -265740 52227 -22102 -43245 -269085 56815 -27217 469224
11685 149842 -150516 -23551 -37678 -114664 281282 -16592 241576 69052 145329 95035 218834
11674 218834 313220 117452 -150948 -159249 259945 -7632 212747 160579 210618 -6509 -260055
11663 -260055 107037 56261 148935 58066 133404 -341186 -172120 60805 195298 -149871
11652 -67931 224115 -182485 27819 279505 68118 -94364 52934 282173 138725 -65343 43688
11640 -270667 -200617 -260287 -77339 -185955 -50488 140356 -125274 287293 -53810 59059 -223193
11628 17639 27078 101475 -63751 -144201 -126962 -35351 104528 87526 -75187 250601 -56154
11616 348083 -18488 -229265 -259751 77045 -143518 177157 -74428 -107778 -161522 -377894 599561
$$ packed form
11697A37703B8155a2418j46316j07006E2227b2102k1143k25840E6815b7217D69224
11685A49842a50516b3551j4127p6986B81282a6592B41576F9052P6277n0294J23799
11674B18834R4386A17452a50948q301B59945g632B12747n2168N0039f509k53546
11663b60055A07037n0776R2674E8066P5338c41186J69066F0805J34493a49871
11652f7931B24115a82485B7819K51686F8118i4364E2934K29239A38725f5343D3688
11640b70667P0050n9670g7339j08616e0488A40356a25274B87293e3810E9059b23193
11628A7639R439P4397f3751q0450J7239c5351A04528j7002g5187B50601e6154
11616C48083a8488k10777l0486G7045a43518A77157g4428l3350n3744k16372E99561
$$ plain form
11604 -51360 214814 132386 147039 -186559 -58748 -57716 161031 123505 264306 296560 -186327
11592 -227395 45679 -206906 10995 16744 199721 -175903 12890 59020 231752 219248 -90847
11580 85099 -35812 248901 -119803 -84918 92373 32734 35953 195166 -76034 -326900 287493
11568 179903 37739 -189506 184218 -54356 88673 221454 97233 -57665 -16975 8456 23051
11557 23051 4544 -39693 178753 262608 58167 176397 -110534 227422 -71738 114685 -145515
11545 -78850 -184663 12560 111837 10151 -219681 -318890 51994 102299 19549 49080 -17956
11533 148143 119996 -202193 64606 -97325 -133106 32319 106790 -160239 -107310 -197374 -159695
11522 -159695 -15991 -147294 118361 -10620 168070 -137939 109567 -70550 212861 455015
$$ packed form
11604e1360B14814q2428J4653a86559e8748J032A61031l7526J40801L2254a86327
11592b27395D5679b06906A0995N749J82977a75903A2890M6130J72732j2504i0847
11580H5099c5812B48901a19803L4885I2373C2734L219J59213g6034k50866B87493
11568A79903C7739a89506A84218e4356H8673J32781I7233e7665a6975H456J4595
11557B3051D544c9693A78753Q3855E8167J18230a10534B27422g1738A14685a45515
11545g8850j05813A2560R9277A0151b19681r9209E1994N0305A9549K9531a7956
11533A48143k8147b02193F4606i7325l5781C2319P4471a60239N2929r0064L7679
11522a59695a5991j31303A18361a0620A68070a37939A09567g0550B12861K42154
$$ plain form
11512 455015 -113039 -217338 224024 228688 115711 -81932 138335 -192493 -164167 146250
11501 89762 -204120 201425 212815 -178714 -11199 -36832 -15003 162401 -88589 56555 58365
11490 58365 114495 -27768 342183 495660 179835 214727 46938 -49505 118187 131305 36628
11478 -13991 -7947 419126 69893 352703 -111781 147345 301226 -69427 223272 -116897
11467 125171 270560 103346 24216 155439 -2572 19707 -29717 78674 148161 -288845 23725
11455 510814 -117780 141903 -179527 285487 -107219 -16435 -52132 212922 136595 151021
11445 151021 149152 36541 137896 323850 139749 169831 192998 -98951 158418 -43494 422071
11433 -307513 -164716 128480 317580 312407 123931 -94042 178617 336889 230497 -265941
$$ packed form
11512D55015a13039j04299B24024M664j12977h1932A38335a92493K8326A46250
11501H9762b04120B01425J1390a78714a1199k5633a5003A62401h8589E6555J810
11490E8365N6130b7768C42183J53477A79835L4892D6938d9505A18187J3118C6628
11478a3991O044D19126F9893K82810a11781A47345J53881f9427B23272a16897
11467A25171J45389A03346B4216J31223b572A9707b9717G8674O9487b88845B3725
11455E10814a17780A41903a79527B85487a07219a6435l5697B12922p6327J4426
11445A51021j869C6541J01355J85954A39749L0082K3167i8951A58418d3494D22071
11433c07513J42797A28480J89100n173A23931i4042A78617J58272j06392b65941
$$ plain form
11422 -60677 -355356 2087 85999 413924 256759 64347 -9358 -99347 -179676 41199 281777
11411 281777 182395 -161458 -189612 45009 26941 -24026 -133484 27754 -183327 211936 -149164
11399 -260129 -86256 -6467 -43425 25837 -186286 -91335 -308165 75019 140398 301157 119523
11387 342089 2353 -161515 350469 344915 -32549 -7885 -18487 -9982 230857 216704 -156639
11375 37324 -70505 13091 -70538 56109 -87583 -45517 7602 -113543 100490 77372 206163
11364 206163 -403106 -75072 152046 -68259 79051 105779 7078 219398 216332 -402937 -19401
11352 -144938 -20581 -81352 -308612 -439621 -56906 -20340 -64695 23036 89262 -35535 23075
11340 25765 -69145 143672 9366 -391438 267372 133292 158566 -69149 99345 58301 -335968
$$ packed form
11422f0677k94679B087Q3912L27925j57165F4347i358q9989q0329D1199K40578
11411B81777r9382a61458k8154D5009j8068b4026j09458B7754a83327B11936a49164
11399b60129h6256f467l6958B5837a86286i1335k16830G5019O5379J60759A19523
11387C42089B353a61515C50469n554c2549g885j0602Q505B30857j4153a56639
11375C7324g0505A3091g0538E6109h7583M2066G602a13543A00490k3118J28791
11364B06163d03106g5072A52046f8259G9051K6728G078K12320l066d02937a9401
11352a44938b0581o0771k27260j31009e6906b0340m4355B3036O6226c5535B3075
11340B5765f9145A43672I366c91438B67372A33292K5274f9149I9345m1044c35968
$$ plain form
11328 -209394 -186313 -60181 -145513 276994 -33511 201150 -222083 -153021 -160307 -94518 209437
11316 -60891 75941 -77914 -91678 -75864 -199965 -117364 314808 -13923 19385 -155142 -4649
11304 19584 -268995 -20778 671 -74960 86605 128128 112077 -96013 -323875 92533 276895
11293 276895 -180538 71952 148618 -228339 191782 110967 -94096 -143634 -102092 -112761 73282
11281 209831 -158857 -293338 -411766 -42641 271724 -251706 -91369 320964 34407 47888
11271 47888 37461 301899 -260772 -67694 235359 238903 -117215 -140876 -267139 206298 -187001
11259 40249 35887 92627 174542 -153956 -53927 -66218 157836 -29302 -106324 -154269 136464
11247 -237057 -121105 -344979 10495 255623 -176049 -83341 -5357 72247 280650 82892 -238583
$$ packed form
11328b09394K3081f0181q5332B76994c3511B01150b22083O9062p286O5789B09437
11316f0891G5941g7914j3764J5814j24101Q2601C14808a3923A9385a55142d649
11304A9584b68995b0778F71g4960H6605M1523j6051i6013k27862I2533J84362
11293B76895a80538G1952P6666b28339A91782q0815i4096m9538M1542j0669G3282
11281B09831a58857j34481j18428d2641B71724b51706i1369C20964C4407J3481
11271D7888j0427K64438b60772f7694B35359L544a17215k3661j26263B06298a87001
11259D0249m362N6740Q1915a53956e3927j2291A57836b9302p7022m7945A36464
11247b37057J15952k23874A0495K45128a76049h3341e357G2247K08403H2892b38583
$$ plain form
11235 -161223 -270987 173898 114347 -98490 -281145 -123610 -281835 -149168 -321271 -349781
11225 -349781 32698 65564 144588 -192470 346819 -140221 -16489 108677 33842 4310 207476
11214 207476 -85348 183066 17788 9712 157388 -122746 259063 -103273 -135247 248911
11203 -205021 -292255 -126433 72368 381501 -84468 172348 -207514 155995 19968 240646
11193 240646 -37570 -106139 85313 -57260 54296 7140 28027 -113069 -178925 -87770 113857
11181 227514 66752 -2669 -373149 50501 -464731 -260960 -37096 -569 219881 -4171 -146511
11170 -146511 -125423 145829 -299352 -73894 349915 -106343 -6222 331288 -215660 1948 -130265
11158 -29439 -254040 -214078 -95880 -8507 -121690 140448 208397 -22316 -35352 -77737 89720
$$ packed form
11235a61223j09764A73898n9551i8490j82655a23610j58225J32667j72103k8510
11225c49781C2698L2866P9024a92470C46819a40221a6489A08677C3842D310K03166
11214B07476h5348A83066A7788q076J47676a22746B59063a03273l1974B48911
11203b05021q7234a26433G2368L09133h4468A72348b07514A55995A9968K20678
11193B40646c7570o8569H5313e7260E4296G140K0887a13069o5856h7770A13857
11181B27514F6752b669l70480E0501d64731K03771c7096e69B19881d171j42340
11170a46511K1088A45829b99352g3894C49915a06343f222C31288b15660A948a30265
11158b9439k24601L9962i5880h507j13183A40448O7949b2316j3036m2385H9720
$$ plain form
11146 152833 -252329 -243340 -19176 -278186 111468 -229772 -81672 161962 161629 -197689 -212955
11135 -212955 140105 -196242 -1882 96095 68958 110604 4418 -236232 20871 -140716 376595
11123 -164026 26735 -2960 76604 -135557 62596 -314283 129311 168606 -192839 109233 286761
11112 286761 -173535 -105367 171464 322155 80599 112820 -52335 -94878 -179031 -227079 162859
11100 -66013 -116045 160887 -69972 -406850 22105 66854 119409 140553 -114924 22684 301281
11089 301281 68466 -33714 22263 291865 -11891 -119121 226890 159048 283794 37646 162672
11078 162672 -1433 244181 27273 -20454 249458 456380 -9906 199287 231842 1129 277733
11067 277733 -3614 469747 -10382 181038 50049 223226 513698 184633 207722 37164 149722
$$ packed form
11146A52833b52329Q989a9176k59010A11468b29772h1672A61962l33a97689j5266
11135b12955A40105a96242a882I6095k7137M1646D418b36232B0871a40716C76595
11123a64026B6735b960G6604a35557F2596c14283A29311L9295a92839A09233J77528
11112B86761a73535O8168A71464J50691H0599L2221e2335m2543q4153m8048A62859
11100f6013n0032A60887f9972l36878B2105M4749N2555K1144a14924B2684K78597
11089C01281F8466c3714B2263K69602a1891j07230B26890o7842J24746C7646J25026
11078A62672a433B44181B7273b0454B49458K06922i906A99287L2555A129K76604
11067B77733c614D69747a0382A81038E0049J73177K90472A84633K3089C7164J12558
$$ plain form
11056 149722 301237 207898 387600 417025 439856 304801 467778 223586 224961 307685 478539
11045 478539 456508 247889 747575 594250 303575 777987 621780 543472 690918 385379
11035 385379 658600 737593 573377 672105 765933 899520 626868 706375 1006565 620335
11025 620335 747135 742198 672073 743171 535205 562082 838547 351030 834525 468115
11015 468115 762445 483289 746262 851710 564568 934981 773863 752514 574975 673151
11005 673151 525117 788741 281098 478880 736027 923127 503257 683919 747416 374443
10995 374443 594690 351363 739379 957012 478505 562879 687244 739701 744911 646586
10985 646586 579618 492624 676580 480454 504318 805897 698524 749714 724227 809250 863997
$$ packed form
11056A49722J51515r3339J79702K9425K2831j35055J62977B23586J375Q2724J70854
11045D78539k2031k08619M99686j53325k90675M74412j56207p8308J47446l05539
11035C85379K73221P8993j64216R8728R3828J33587k72652P9507L00190l86230
11025F20335J26800m937p0125P1098k07966K6877K76465C51030M83495l66410
11015D68115K94330k79156K62973J05448k87142L70413j61118k1349j77539R8176
11005F73151j48034K63624B81098J97782K57147J87100m19870J80662O3497l72973
10995C74443K20247k43327L88016K17633D78505Q4374J24365N2457N210r8325
10985F46586o6968q6994J83956j96126K3864L01579j07373N1190k5487Q5023N4747
$$ plain form
10974 863997 924425 558562 1058685 516765 976439 1208724 1028534 841725 1011506 1141922
10964 1141922 1195117 1362599 1629657 1880654 1922996 2166540 2457874 2648281 2726204 2654285
10954 2654285 2382677 2205095 2149961 1787229 1777843 1526103 1614238 1823884 1421912 1522712
10944 1522712 1032751 1564468 1585978 1635685 1254514 1415276 1506353 893453 927949 1062190
10934 1062190 965957 530206 640004 568467 242024 266172 395937 610282 123783 164396
10924 164396 272247 124355 154898 5792 93705 280173 182669 4 117559 212085 61414 -61985
10911 -135680 85227 233243 181782 131028 160502 36734 -8554 -15601 54030 -311342 -301699 -295803
10899 -295803 -20000 38059 -127568 -103214 -44158 -150209 -5904 -117566 -340452 103979 -315957
$$ packed form
10974H63997O0428l65863N00123E16765M59674K32285j80190j86809J69781J30416
10964A141922N3195J67482K67058K50997M2342K43544K91334J90407P7923p1919
10954B654285k71608j77582n5134l62732r386k51740Q8135K09646m01972J00800
10944A522712m89961N31717K1510M9707l81171J60762R1077o12900L4496J34241
10934A062190r6233m35751J09798p1537B42024K4148J29765K14345A23783M0613
10924A64396J07851A24355L0543E792Q7913J86468r7504DJ17555R4526F1414f1985
10911a35680H5227J48016n1461n0754K9474C6734h554p047E4030c11342R643N896
10899b95803b0000C8059a27568K4354d4158j06051e904j11662k22886A03979c15957
$$ plain form
10887 167231 53145 176563 -87601 172577 -254589 208012 312778 -13218 -292053 -10683
10876 100559 42773 -293575 40472 131686 -75809 -151178 -201557 -273059 109629 7324 -146721
10864 -121326 109969 -101770 -19620 163793 113956 -17405 -133429 223887 -200877 -26345
10853 127828 -42201 102711 58897 -142680 126581 -260660 -141018 237230 18073 -112611
10842 -278572 -128397 -100346 318021 267505 83829 160426 -156445 31629 -155705 29793 2119
10830 282806 52773 195741 104176 173533 185340 234300 182194 42799 142869 -115270 -61871
10819 -61871 -257184 -39537 16572 -385745 37706 -168572 466294 -244594 -123978 15659
10808 -45800 -99281 -151430 -212484 -133233 143715 295898 -118991 37714 138936 -25677 160520
$$ packed form
10887A67231E3145J23418h7601A72577b54589B08012J04766a3218k78835a0683
10876A00559D2773b93575D0472R1214g5809p5369n0379p1502A09629G324a46721
10864a21326A09969a01770a9620A63793m9837a7405j16024B23887b00877b6345
10853A27828d2201A02711m3814a42680A26581b60660J19642B37230A8073a12611
10842b78572a28397K8051C18021n0516H3829P6597a56445C1629a55705B9793B119
10830B82806E2773J42968r1565O9357J1807M8960n2106D2799J00070a15270N3399
10819f1871j95313c9537A6572c85745C7706a68572D66294b44594J20616A5659
10808d5800n3481n2149o1054P9251A43715J52183a18991C7714J01222b5677A60520
$$ plain form
10796 -300197 28769 -69466 350330 177083 -141586 63671 32920 -45096 -56373 -84631 -49291
10785 -49291 -3716 -40768 -15382 75708 -383868 -117916 -133406 -142669 -169947 -25010 -54737 -239194
10773 -239194 149911 -201497 -124099 -10083 -219924 -103591 -48020 5846 -27080 -278240 -122585
10761 -72554 254458 48254 -52285 139187 -379380 265443 -116210 53549 196998 -33579
10750 -146838 236131 -344696 99278 -31497 -167191 -84271 64002 70261 -292555 27818 196604
10739 196604 -85458 390737 15362 -68721 103835 -6281 149149 -55785 -112909 70752 -295841
10727 -39207 18064 -56206 -37408 292359 110274 47756 -108605 150657 -189885 -58443 5405
10715 -111155 -126653 -59123 -346785 110131 -370886 162542 197815 -8156 -141111 -376634
$$ packed form
10796c00197B8769f9466C50330j73247a41586F3671l0751d5096j1277k8258L5340
10785d9291c716l7052a5382G5708c83868a17916j5490r263k7278b5010k9727j84457
10773b39194A49911b01497P7398a0083k09841a03591d8020E846b7080k51160a22585
10761g2554B54458D8254e2285A39187c79380B65443a16210E3549J43449c3579
10750a46838B36131c44696I9278c1497j35694Q2920F4002O259b92555B7818J68786
10739A96604h5458C90737A5362f8721A03835f281A49149e5785n7124G0752b95841
10727c9207A8064e6206J8798B92359A10274D7756a08605A50657a89885e8443E405
10715a11155j5498e9123k87662A10131c70886A62542L5273h156j32955k35523
$$ plain form
10705 -376634 -180350 202036 34585 -239061 25998 -158205 -26888 -23261 -105 27049 75850
10694 75850 -140016 -87373 -40943 -37105 -64633 -201390 -30199 -2073 83247 -75158 195869
10682 -83179 345049 -105746 -147492 -130839 -199902 128938 -304915 109383 -1554 -178141 -246253
10671 -246253 37920 -175043 104168 103858 -215995 22130 -224034 -158929 -150036 -253060 111933
10659 270650 70214 -190541 -122376 26930 -33376 -105407 39698 -149883 18527 222535 -10388
10647 128064 -175111 -109551 56385 -151687 185873 -403417 -67644 58086 -332151 -184133
10637 -184133 -47645 -155225 -176067 -37903 312442 -89255 -146759 -94444 60989 263080 -151614
10625 27274 -20402 18873 91187 87709 -15217 -70172 -55107 103560 165301 -141857 -105194
$$ packed form
10705c76634a80350B02036C4585b39061B5998a58205b6888L627a05B7049M8801
10694G5850a40016N2643d0943L838k7528j36757c0199b073H3247g5158A95869
10682h3179C45049a05746m1746J6653o9063A28938c04915A09383a554j76587o8112
10671b46253C7920a75043A04168l10b15995B2130b24034O5105Q893j03024A11933
10659B70650G0214a90541O8165B6930c3376p2031C9698a49883A8527K04008a0388
10647A28064a75111O5560E6385a51687A85873d03417f7644E8086c32151J48018
10637a84133d7645j07580k0842c7903C12442h9255n7504N2315F0989K02091a51614
10625B7274b0402A8873P2314l478a5217n4955J5065A03560O1741a41857L6663
$$ plain form
10614 -105194 46627 360134 -30423 -127521 -24171 152106 -272811 -137015 -297998 79396
10603 -74704 -18005 -225347 -114153 -186550 -21059 -298977 -170887 -157640 -222313 -368525 300412
10591 -111337 -523 105365 -288131 85845 -119197 -363210 44931 -73337 -81173 -203142 -31676
10579 72398 21256 -86439 128360 -12834 -56660 116223 -14720 -287302 26602 -75617 -38782
10568 -38782 -121936 -72218 64846 -258826 48737 -308217 107308 -153097 246582 25890 296950
10557 296950 -278176 -60025 30582 20188 -41981 135144 -244132 -247996 21076 -100322 19915
10545 10721 -415644 -88436 -208691 -60832 -138113 -104181 -6202 398962 56666 -147790 -104052
10534 -104052 -192189 4607 -88301 174597 61577 -9874 -204349 -12666 466267 146020 93613
$$ packed form
10614a05194D6627L13507c0423r7098b4171A52106b72811J35796j60983G9396
10603g4704a8005k07342J11194p2397b1059k77918J28090J3247o4673j46212C00412
10591a11337e23A05365b88131H5845a19197k44013D4931g3337p836j21969c1676
10579G2398B1256h6439A28360a2834m3826A16223a4720k72582B6602g5617L6835
10568c8782q3154M9718F4846b58826D8737c08217A07308a53097B46582B5890K71060
10557B96950b78176f0025C0582j0394d1981A35144b44132l864B1076a00322A9915
10545A0721d15644h8436j20255f0832p7281L3932f202C98962E6666a47790M3738
10534a04052q8137D607h8301A74597F1577i874j94475a2666D66267A46020n2407
$$ plain form
10523 93613 419143 -411663 1870 -197673 33499 22891 -128166 69382 -222617 27356 46338
10512 46338 -383613 -191030 -292952 -174326 82802 -150491 179417 -15047 105275 -224925
10501 28947 74283 -343644 138873 113542 -76037 -53024 -40624 50610 38134 -188318 12721
10489 139939 219022 -30251 38468 28207 -251376 75983 183370 -28821 -178995 -62717 -321702
10478 -321702 170901 -72804 9185 -8136 -94644 223448 71666 41636 175951 199004 51094
10466 118047 393378 -66195 -47103 212801 195004 106381 -301293 107791 96867 5717 -305046
10454 -105328 106230 -61968 130590 -160660 -88454 -238406 -282059 177561 -13484 -114062
10444 -114062 119211 115493 -194056 328887 97319 95800 -50155 109499 -162806 -234138 140758
$$ packed form
10523I3613L25530d11663A870a97673C3499j0608a28166F9382b22617B7356J8982
10512D6338c83613a91030j01922J18626H2802a50491A79417a5047A05275b24925
10501B8947M5336c43644A38873k5331g6037K3013J2400E0610j2476a88318A2721
10489A39939P9083c0251C8468j0261b51376G5983J07387b8821j50174f2717k58985
10478c21702A70901g2804I185h136q6508B23448G1666l0030J34315K3053E1094
10466A18047K75331f6195J9092B12801j7797q8623c01293A07791j0924E717c05046
10454a05328A06230f1968A30590a60660P2206j49952m3653A77561a3484j00578
10444a14062A19211l718a94056C28887I7319j519e0155A09499a62806p1332A40758
$$ plain form
10432 148149 125552 -171366 83658 -45445 16416 -120046 23570 117722 212403 -89455 -151805
10421 -151805 346348 367698 63886 -44958 -182786 -33190 185375 -293644 283134 -162339
10410 17088 231639 139325 -71302 -89640 -89768 -7663 76315 -155836 358777 -54247 -110825 226123
10397 301516 197217 250553 -50168 219365 53789 96848 126624 80096 -12712 423 -128760
10385 56736 -86691 521923 -10790 31662 -2152 -194030 -88489 -80936 -81764 109521 211049 -19395
10372 -197938 262784 297961 76634 151044 -224378 161662 189319 145521 375501 -48852 -21222
10360 450776 371843 -95121 201072 27575 338588 355277 486915 250101 273835 65188 511995
10349 511995 371240 344184 520065 194719 104965 160260 27121 303414 -125227 166658
$$ packed form
10432A48149k2597a71366H3658d5445A6416a20046B3570R4152R4681h9455o2350
10421a51805C46348K1350F3886d4958j37828c3190A85375b93644B83134a62339
10410A7088K14551r2314g1302j8338j28g663G6315a55836C58777e4247n6578B26123
10397C01516j04299N3336e0168B19365E3789M3059K9776m6528a2712D23a28760
10385E6736h6691E21923a0790C1662b152j91878h8489P553q28A09521J01528a9395
10372a97938B62784L5177G6634P4410b24378A61662K7657m3798K29980d8852b1222
10360D50776p8933i5121B01072B7575L11013J6689J31638k36814K3734F5188M46807
10349E11995j40755k7056J75881A94719q9754N5295B7121K76293a25227A66658
$$ plain form
10338 370920 348993 511331 376613 362701 124779 448897 111213 369349 183399 -96051
10327 79524 257987 326161 262878 194302 149999 167160 165849 260132 152744 248205 28410
10315 241225 -24896 385149 -17557 45523 21026 134543 52250 109353 107153 129959 25328
10303 23875 -42477 -94987 -96171 164062 26584 70344 -323529 37812 -32908 -34498 12089 -84907
10290 14170 -41172 -70240 -3649 83888 -115234 -93279 -19481 -84119 -28482 -32917 258963 -23416
10277 -29624 10725 212738 -227889 119014 42170 -20198 57462 -76386 -220293 -136975 -132015
10266 -132015 -186516 -285446 50148 -515348 -191436 -75775 -93930 -139984 284418 17036 -242673
10254 26732 -140927 167529 113944 -175713 110975 -108994 -315467 -56458 134498 284255
$$ packed form
10338C70920k1927J62338j34718j3912A24779L24118A11213K58136A83399i6051
10327G9524J78463O8174o3283o8576m4303J7161j311R4283j07388R5461B8410
10315B41225b4896C85149a7557D5523B1026J13517E2250N7103k200K2806B5328
10303B3875d2477n2510j184A64062B6584M3760c23529C7812c2908j590A2089h4907
10290A4170d1172k9068c649H3888a15234K1955a9481o4638b8482m435B58963b3416
10277b9624A0725K02013b27889A19014D2170b0198E7462g6386j43907Q3318M960
10266a32015n4501r8930E0148e15348a91436g5775j8155m6054B84418A7036b42673
10254B6732a40927A67529n3585a75713A10975a08994k06473e6458A34498J49757
$$ plain form
10244 284255 482123 -63977 -178704 -6419 305626 295547 -49895 -101359 -79447 160146 54411
10232 15585 160699 -304822 -210755 123037 -312663 225024 -845 -156326 -102774 39989 -89462
10220 116191 88911 -98042 286035 -217112 -88684 -167057 -53054 375611 74765 -51294 -234385
10209 -234385 94569 214777 -207844 96420 -331340 302102 62248 223449 -21163 63943
10198 -78589 173022 281237 82807 -38307 -70583 -21710 8369 -444419 -99035 64991 -96807
10186 495 -207785 -19895 -40339 171485 -60749 -484847 16142 -114889 -97404 -366215 322940
10174 -173260 13026 80687 55408 -22331 -251470 -36941 118845 15514 160536 -22296 133724
10162 -122627 54647 -256398 133898 42510 -263555 59918 233514 -266400 -51422 3091 -73628
$$ packed form
10244B84255J97868f3977j14727f419C05626j0079d9895n1464K1912A60146E4411
10232A5585J45114c04822R4067A23037c12663B25024h45j55481N3552C9989h9462
10220A16191k7280i8042B86035b17112h8684p8373e3054C75611G4765e1294j83091
10209b34385I4569J20208b07844I6420c31340C02102F2248J61201b1163F3943
10198g8589A73022J08215H2807c8307l2276b1710H369d44419i9035F4991i6807
10186D95b07785a9895k0444A71485f0749m24098A6142a14889J7485k68811C22940
10174a73260A3026O7661k5279b2331k29139c6941A18845A5514J45022b2296A33724
10162a22627E4647b56398A33898D2510b63555E9918J73596b66400e1422C091g3628
$$ plain form
10150 185410 149639 10170 125398 217009 -280430 323867 273276 137797 -30681 -1614 -3330
10139 -3330 -510943 -162120 -146283 -18520 136393 -106900 -426910 115647 215590 -145525
10128 -142888 -4850 -87462 29491 -342460 -8057 -323834 17454 -332446 -57612 -324197 -367267
10117 -367267 65100 -311347 -26288 132165 -24479 632556 4502 -122323 128758 117262 -412755
10105 -185374 40772 -51173 181322 -91210 89396 -98555 292982 -42186 171005 -58624 54051
10093 -83489 -193412 50404 -70457 -50062 -14442 -20704 162350 -143375 37586 -210651 -11030
10081 -214102 25199 13107 -121411 -11538 -71239 46565 -460881 230731 -30562 -154091 -419657
10070 -419657 325173 77673 139808 3427 -171998 32014 -121927 -147208 -500224 -74378 -213947
$$ packed form
10150A85410l5771A0170J15228R1611b80430C23867n0591j35479c0681a614j716
10139c330n07613a62120J5837a8520A36393a06900l20010A15647R9943a45525
10128a42888d850q2612B9491c42460h057l15777A7454c32446e7612k66585m3070
10117c67267F5100c11347b6288A32165b4479F32556D502a22323A28758j1496d12755
10105a85374D0772e1173A81322i1210H9396i8555B92982d2186A71005e8624E4051
10093h3489j09923E0404g0457K0395a4442o262A62350a43375C7586b10651a1030
10081b14102B5199j2092a21411a1538n9701D6565d60881B30731c0562j23529k65566
10070d19657C25173G7673O2135C427a71998C2014a21927k5281l53016g4378j39569
$$ plain form
10059 -213947 150396 -344520 -51444 3634 -154941 -19488 -28978 78097 -67982 -91389 -301634
10048 -301634 -277007 45783 -72590 -52169 6803 -54445 -181526 -196925 62740 -298168 -16419
10036 -444115 -9074 83318 14198 -159379 7027 -69985 91048 -58809 111022 327661 90133
10024 125025 11300 -21011 -62649 -88485 310120 -47962 128620 -94996 -57302 -21853 -409081
10013 -409081 -74185 -35656 64779 -109839 66300 167398 -245724 -209580 -261160 39346 115104
10002 115104 108241 -185520 22993 -53039 219875 -20672 -229145 -184939 71778 68371 263234
9991 263234 -82990 123651 84222 -227129 73526 -151819 136383 -117986 39202 54841 -99887
9979 -119796 -98299 54021 36225 -335007 -16873 -321387 -385372 -67410 -347450 -151816 -156238
$$ packed form
10059b13947A50396c44520e1444C634a54941a9488r490G8097f7982k3407k10245
10048c01634K4627D5783g2590K0421F803e4445j27081j5399F2740b98168a6419
10036d44115i074H3318A4198a59379G027f9985I1048e8809A11022K16639I0133
10024A25025A1300b1011m1638k5836C10120d7962A28620i4996L7694b1853l87228
10013d09081g4185c5656F4779a09839F6300J01098b45724L6144n1580C9346P5758
10002A15104o863a85520B2993e3039B19875b0672k08473M4206G1778l407J94863
9991B63234h2990A23651l9429b27129G3526a51819A36383a17986C9202J5639i9887
9979a19796K1497E4021j7796c35007a6873l04514o3985f7410k80040a51816m422
$$ plain form
9968 -156238 -12848 112705 95165 -217802 108793 -91325 -703 260076 -214318 199845 -123442
9956 10224 -21776 70974 -97483 116934 -188808 307628 -61666 15601 -151704 11097 -90960
9944 -130614 41464 -3905 98844 -36971 154660 48339 -111584 -108999 13340 -68913 -317761
9933 -317761 148714 92721 49712 -328418 -120477 -113858 61058 -51073 -135716 -43594 127636
9921 -161345 -200690 -41179 502086 28659 -17547 -126823 -160352 -202225 -32234 -100717 -271661
9910 -271661 -430855 119314 226228 72898 -82168 -32340 -337693 4388 65555 -192765 -233372
9899 -233372 -178245 -421656 172904 60130 -285208 -162279 224186 -252181 -42492 -205621
9889 -205621 41934 -139251 -47249 -24508 -121950 -310497 -179619 -88219 -175794 -248049 -80873
$$ packed form
9968a56238a2848A12705j7540b17802A08793i1325g03B60076b14318A99845a23442
9956A0224b1776G0974i7483A16934a88808C07628f1666A5601a51704A1097i0960
9944a30614D1464c905I8844c6971A54660D8339a11584K585A3340f8913k48848
9933c17761A48714n5993m3009c28418a20477O619F1058e1073q4643d3594A27636
9921a61345l9345d1179E02086B8659a7547j09276l3529m1873c2234o8483j70944
9910b71661j59194A19314J06914G2898h2168c2340l05353D388O1167a92765m0607
9899b33372N5127k43411A72904F0130b85208J22929B24186b52181d2492j63129
9889b05621D1934a39251d7249K2741r7442j88547J30878h8219q7575p2255h0873
$$ plain form
9877 -169523 85270 124401 120180 21477 7531 -144320 18012 66500 162593 -137527 -272920
9866 -272920 -40880 97076 -93590 -176256 -124478 170668 -14144 134827 178931 190034 95268
9855 95268 199116 197385 12480 12671 -226578 100405 -34748 -87320 -210805 -157505 -37672 -197853
9843 -197853 63495 -126817 224041 -31031 20148 -123414 303118 -183749 -320624 -310538
9833 -310538 -279262 334997 109653 -25069 -155385 -479491 -284908 -306777 -137295 -115704
9823 -115704 -321776 271236 -145288 64932 99177 -188808 -186348 63837 -191114 -170368 -127025
9812 -127025 -47544 -30617 -315858 -39794 70953 -284495 -66902 -116879 -142288 -435952 -102955
9800 39843 18360 -9728 158878 -82666 -19033 -175125 -440911 -46816 -161356 -313013 -284698
$$ packed form
9877a69523H5270L9131m221B1477G531a44320A8012M8488R6093a37527j35393
9866b72920d0880I7076i3590q2666N1778A70668a4144A34827M4104J1103r4766
9855I5268J03848j731A2480J91b26578A00405c4748n2572j23485N3300c7672j60181
9843a97853F3495a26817B24041c1031B0148a23414C03118a83749j36875J0086
9833c10538L1276C34997A09653b5069j30316l24106J94583k1869a37295K1591
9823a15704k06072B71236a45288F4932L4245a88808K460F3837a91114K0746M3343
9812a27025d7544J6927k85241c9794G0953b84495f6902m9977k5409k93664a02955
9800C9843A8360i728A58878h2666a9033j56092k65786d6816j14540j51657K8315
$$ plain form
9789 -284698 90130 -372339 53658 -15 -254689 -7894 -286029 37928 -268716 32250 -83322 -214454
9777 -214454 4019 280257 -104084 -274424 -244884 403897 -38381 -261641 -240768 -209043 17168
9765 -35484 49485 -287791 27445 -142045 1274 -116078 -299940 85244 -100338 -148658 -161717
9754 -161717 -155422 86721 -74079 156436 176572 -305222 -193523 -53490 -153684 -166650 36882
9742 -28722 -303088 55687 43672 332159 -279735 135192 133708 62257 84417 -369832 27773
9730 233441 11945 84041 55615 -41011 -158704 62799 116289 76599 -101417 112683 -96461
9718 -22398 123315 31155 10172 -357807 -50479 -176919 241370 256101 -211143 -17805 -6985
9706 235203 417807 117129 125663 42229 -87552 22822 -150079 -115450 -187326 -87498 232462
$$ packed form
9789b84698I0130c72339E3658a5k54674g894k78135C7928b68716C2250h3322j31132
9777b14454D019K76238a04084j70340K9540D03897c8381k23260K0873L1725A7168
9765c5484D9485b87791B7445a42045A274a16078j83862H5244a00338m8320j3059
9754a61717O295H6721g4079A56436K0136c05222J11699e3490j00194j2966C6882
9742b8722k74366E5687j2015K88487b79735A35192j484F2257K2160c69832B7773
9730B33441A1945P2096k8426d1011j17693F2799N3490l9690a01417A12683i6461
9718b2398A23315C1155A0172c57807e0479j26440B41370J4731b11143a7805f985
9706B35203J82604A17129Q534D2229h7552B2822a50079L4629p1876h7498B32462
$$ plain form
9694 -171609 53284 54320 -20927 -462203 36791 -112879 -153525 123373 -55891 210443 -146138
9682 41002 -212610 47760 -94577 -256113 85271 -29566 106665 37242 -76864 -136028 -35943
9670 -11378 -77438 89251 -70357 85164 -122903 -53126 -111785 -268769 -291221 -257985 -48462
9658 -316035 -218065 -120691 -267842 -51855 73705 46442 65946 44010 26969 45577 155048
9647 155048 -68869 -250567 -351261 -268832 193013 -242085 -168153 -153675 -56478 -107795 -94723
9636 -94723 31976 291354 16783 -468298 -144710 -22511 45464 -167435 -181976 -221335 -277988
9625 -277988 50354 -121165 92339 61746 -83421 -29229 -130050 -74178 -151966 26549 214136
9614 214136 -130743 2512 -245000 -92034 -281538 192404 107752 211017 -206007 161081
$$ packed form
9694a71609E3284J036b0927m41276C6791a12879m0646A23373e5891B10443a46138
9682D1002b12610D7760i4577j61536H5271b9566A06665C7242g6864n9164c5943
9670a1378o6060H9251g0357H5164a22903e3126n8659j56984k2452L3236d8462
9658c16035R7970R7374j47151e1855G3705k7263J9504k1936j7041J8608J09471
9647A55048f8869j81698j00694Q2429A93013b42085P3932J4478e6478n1317J3072
9636i4723C1976K59378A6783d68298a44710b2511D5464a67435j4541l9359n6653
9625b77988E0354a21165I2339l0593h3421b9229j00821N5872p7788B6549J87587
9614B14136a30743B512b45000i2034j89504A92404q4652J03265b06007A61081
$$ plain form
9603 212883 -75573 170335 -232954 -161399 -245173 -211164 69905 -206700 -24505 -102941 -34551
9591 9576 -190547 31055 190135 136671 -402054 81109 123681 -173881 -55800 -40928 82484
9579 -56772 -354727 287789 249189 73168 -76133 -97963 -137801 -90246 -157187 -23107 132495
9567 -80389 207648 -169001 -226979 -121541 65400 176541 -97773 -5844 -145945 -42053 -183879
9556 -183879 143805 116830 -220535 -136546 -395910 -169110 -162504 45498 -236793 -191838 -714395
9545 -714395 103372 -136277 -86415 -3643 -247997 -82412 79022 -423082 -154718 -165872 18559
9533 189805 26478 -32287 3700 -56232 -119152 -166362 -191665 -99098 -32260 154219 -88130 -65654
9521 -65654 191502 -126891 -153451 -294944 143797 -287519 213652 -7932 -120900 -170684 -150350
$$ packed form
9603B12883g5573A70335b32954P1555q3774L4009F9905b06700b4505p8436c4551
9591I576a90547C1055J59080n3464d02054H1109M2572a73881e5800J4872H2484
9579e6772k97955B87789l8600G3168g6133k1830l9838M7555o6941b3107A32495
9567h0389B07648a69001n7978J05438F5400J11141i7773e844j40101d2053j41826
9556a83879A43805k6975b20535Q3989k59364a69110O606D5498b36793M4955n22557
9545g14395A03372a36277M9862c643k44354h2412G9022d23082a54718j1154A8559
9533A89805B6478c2287C700e6232o2920m7210k5303R2567c2260A54219h8130K2476
9521f5654A91502a26891k6560j41493A43797b87519B13652g932j12968m9784K0334
$$ plain form
9510 -150350 -136341 -230058 -187614 -211698 121169 -473098 -314378 -431035 -270054 -393228
9500 -393228 -54975 185633 -115712 97354 65873 -153682 -154787 95494 252613 -335714 107175
9488 18559 13979 3618 -88430 -192953 12737 -242744 -67751 211402 12592 108372 20620 9988
9475 -13297 112397 171005 -180656 -87445 71971 181772 178970 -107874 5380 2066 -157367
9463 -182835 -277303 -268912 -6421 -353488 -405878 1086 57745 -121841 -150899 -50496 220060 163650
9451 163650 138371 -316621 126024 42276 78952 -268303 -124317 130010 61111 -163893
9440 201385 59280 -131098 -87727 -239475 -102974 92197 -79341 71508 65059 -62817 -29093
9428 198855 -178021 -89076 -192785 -92704 -7577 -268518 -14622 102732 62188 -25202 -161092
$$ packed form
9510a50350J4009r3717M2444k4084A21169d73098J58720j16657J60981j23174
9500c93228e4975A85633a15712I7354l1481a53682j105I5494J57119c35714A07175
9488A8559m580C618h8430j04523A2737b42744f7751B11402A2592R5780B0620I988
9475a3297A12397N8608a80656h7445G1971J09801k802a07874E380B066a57367
9463a82835r4468Q391f421l47067n2390A086N6659a21841k9058e0496B20060n6410
9451A63650k5279c16621A26024D2276L6676b68303a24317A30010F1111a63893
9440B01385E9280a31098M3371j51748a02974I2197g9341G1508o449f2817b9093
9428A98855a78021Q8945j03709i2704g577k60941a4622A02732m0544b5202j35890
$$ plain form
9417 -161092 -44066 -222234 132551 -64183 -90660 240812 37248 -52586 -281664 -162750 44133
9405 -159039 -110975 -404025 -284121 69788 -106639 6920 -197449 -320087 -9544 -388788 -79161
9393 174326 52467 -30137 -301427 -42295 4871 -183099 143547 -83011 -80360 5081 -120071
9381 21446 -207438 -109592 107408 -26236 -158951 -123013 -3041 -297043 -97152 -173175 312266
9369 374001 -117620 22751 -46331 53048 -211255 4065 -118374 39483 70559 52067 -205905
9357 -249316 -75326 -139496 -200670 110804 55312 63236 -174044 163243 -362622 -71633 264683
9345 -275036 94276 44016 -28290 -142878 271069 -42151 -47817 -118102 160124 227231 -25268
9333 255277 -204638 -216742 -332064 -259509 -137268 217329 94966 -91264 -427385 -12155 40006
$$ packed form
9417a61092d4066j78168A32551f4183k6477B40812C7248e2586k29078J18914D4133
9405a59039M8064k93050J19904F9788a06639F920a97449j22638i544l79244g9161
9393A74326E2467c0137k71290d2295D871a83099A43547h3011K651E081a20071
9381B1446b07438R7846A07408b6236j32715L5938c041k94002i7152p6023C12266
9369C74001a17620B2751d6331E3048b11255D065a18374C9483L1076j8492b05905
9357b49316g5326o4170o1174A10804E5312P924a74044A63243c62622g1633B64683
9345b75036I4276D4016b8290j14588B71069d2151n666p0285A60124O7107b5268
9333B55277b04638j2104j15322P2555J22241B17329I4966i1264l36121a2155D0006
$$ plain form
9321 176781 -151180 -211262 169930 -293750 -105371 -223090 89191 -30073 -732 -180564 -121664
9310 -121664 144645 -239165 212398 -152068 -275091 -294457 -338060 233848 -92483 179483
9299 -177150 -253609 107173 -115368 109919 -178737 -430093 368537 106836 66592 5848
9288 -39049 -239902 55965 -122221 -19447 -191062 -73111 -46651 -27778 -91639 -189953 -149512
9277 -149512 -154957 -17521 -87929 -138803 -267427 109257 11142 -190158 -263108 -252495 185514
9265 -332819 165789 21163 2048 70266 -103696 -150437 -155552 -183460 -194406 -249871 5176 -3788
9252 -92181 219586 -5524 150986 -207365 81110 -339172 281834 31671 -49571 -28666 -413147
9241 -413147 -156941 -74551 -69437 8687 -31519 -190973 -595900 -9019 -66759 -203483 -26577
$$ packed form
9321A76781a51180o0082A69930b93750a05371j17719H9191c0073g32j79832N8900
9310a21664A44645b39165B12398a52068j23023j9366m3603B33848i2483A79483
9299a77150p6459A07173a15368A09919a78737k51356C68537A06836m0244E848
9288c9049k00853E5965a22221a9447j71615g3111K6460J8873o3861r8314M0441
9277a49512n445a7521p0408n0874j28624A09257A1142a90158p2950J0613A85514
9265c32819A65789B1163B048O8218a03696m6741n115k7908j0946n5465E176c788
9252i2181B19586e524A50986b07365H1110c39172B81834C1671d9571K0905l84481
9241d13147a56941g4551N114H687c1519j59454m04927i019n7740j36724b6577
$$ plain form
9229 16664 41166 -87391 89655 378069 17628 -215212 141980 12030 -71544 66617 -143151
9217 184219 67426 192655 -246015 -160583 -82403 -203871 -94531 -99975 75368 288001 434952
9206 434952 -288151 -188746 -230288 333042 -92528 -177090 -138580 -81158 201761 27006 17411
9195 17411 -222148 -182933 116173 -187135 -42462 -269262 198374 73795 83464 -26661 -146484
9184 -146484 -163922 -132544 -158869 -17879 -61976 -49613 25371 9331 83188 142836 320749 -406482
9171 52905 -701 -5427 -72647 -283075 -474430 85906 -42986 144742 168678 -144809 -119531 19211
9158 -183797 -41715 21032 -189489 51107 -737 -123284 -171745 27692 51466 -313800 -291658
9147 -291658 -85648 -216881 -341075 -310058 -126171 -393832 -313320 333974 -142874 136510
$$ packed form
9229A6664K4502h7391H9655K88414A7628b15212A41980A2030g1544F6617a43151
9217A84219F7426J25229b46015Q5432P8180j21468i4531n444G5368K12633J46951
9206D34952b88151R9405m1542C33042i2528q4562L8510N7422B01761B7006r595
9195A7411b22148L9215A16173a87135d2462k26800A98374G3795R669b6661j19823
9184a46484j7438L1378k6325a7879m4097J2363B5371I331P3857N9648J77913d06482
9171E2905g01m726o7220k10428j91355H5906d2986A44742K3936a44809K5278A9211
9158a83797d1715B1032a89489E1107g37j22547m8461B7692K3774c13800K2142
9147b91658h5648j31233j24194L1017a26171k67661Q0512C33974a42874A36510
$$ plain form
9136 25010 328361 -153367 60090 -223371 51619 56575 -145898 91049 -5738 -274807 122259
9124 -4875 -200064 322633 -3516 -84717 -168692 -73404 -67298 -106103 57004 -67099 182732 -122642
9111 -293977 -42586 -149693 -250346 -317803 -29906 -89626 266229 7563 37853 121429 162088
9100 162088 -163363 81972 126926 -200072 -38438 56219 -22469 8397 -250873 -199893 -27370
9088 112231 -175547 -148612 8052 -66703 -140556 -118187 97347 -357055 -81218 -78748 275228
9076 169897 59468 -46135 -170361 86364 -309823 -121578 72937 -357860 -159455 -64686 -18571
9064 228795 106074 -254460 95855 213811 33173 260756 -18560 35961 -54019 97144 194080
9053 194080 -108014 -234497 -250987 -477940 -132646 -97114 9709 57119 -106360 38317 174807
$$ packed form
9136B5010L03351a53367F0090b23371E1619M956a45898I1049e738k69069A22259
9124d875j95189C22633c516q1201q3975g3404O106l8805E7004f7099A82732a22642
9111b93977d2586j07107j00653o7457b9906n9720B66229G563L0290Q3576M0659
9100A62088a63363H1972M4954b00072c8438E6219b2469H397b50873N0980b7370
9088A12231a75547K6935H052f6703p3853K2369I7347c57055h1218K470B75228
9076A69897E9468d6135j24226H6364c09823a21578G2937c57860a59455f4686a8571
9064B28795A06074b54460I5855J17956C3173K27583a8560C5961e4019I7144R6936
9053A94080a08014j26483j6490k26953a32646L5532I709M7410a06360C8317J36490
$$ plain form
9042 174807 25189 82232 158772 -178486 -419378 -281824 -262656 221592 -32685 -131620 -196110
9031 -196110 -184002 49323 -209621 -299842 31976 228908 -414620 181489 -209193 -133490 25686
9019 91170 98380 -61389 98719 -19947 -193771 -345499 227671 46803 -15634 -291767 -239295
9008 -239295 160327 -81801 -123254 -15611 -225947 273514 13713 -308397 67320 -70484 21663
8996 -69814 -5056 -364408 60466 -61292 10605 -375905 -31785 295169 33637 -63194 -95677
8985 -95677 -50395 -109280 106540 -355422 -11448 36521 -42767 16694 -35704 38733 24313
8974 24313 -199914 -83939 78818 -132757 -23837 -302792 384319 68354 -314196 33116 -66197
8962 -154978 197226 158230 -150888 -396523 -356127 84529 21857 29938 -309098 93290 -298979
$$ packed form
9042A74807B5189N7043P6540a78486k40892J37554J9168B21592c2685r8935o4490
9031a96110J2108D9323b09621r0221C1976J96932d14620A81489b09193P5703B5686
9019I1170P210f1389I8719a9947j73824j51728B27671D6803a5634k76133N2472
9008b39295A60327h1801m1453a5611k10336B73514A3713c08397F7320g0484B1663
8996f9814e056l59352F0466f1292A0605c75905c1785B95169C3637f3194l2483
8985i5677M5282n8885A06540c55422a1448C6521d2767A6694c5704C8733j4420
8974B4313a99914h3939G8818a32757b3837k78955C84319F8354c14196C3116f6197
8962a54978A97226l8996a50888k45635M0396H4529B1857Q081c09098I3290b98979
$$ plain form
8950 -239204 -228365 203267 -106726 -36343 -147837 222073 -4305 -161466 20247 36405 49461
8939 49461 -196740 -51349 69537 -44556 -114723 -161881 -168424 -234764 309399 90988 -141389
8927 -165883 -43139 -169876 -145361 75893 217189 -344777 110331 -61201 249742 75171 -92140
8915 -163697 315847 193610 183941 256474 468737 229383 1091708 1853118 3199936 6446661
8905 6446661 6794241 3528773 1804830 1217729 541143 454297 116923 365099 103130
8895 150741 205264 292220 322109 173929 359833 -28733 430424 284350 139453 -5544 -85336
8884 -85336 239303 -178068 289310 86075 145212 -84891 -5974 111394 -41039 -320301 -209449
8873 -209449 -160963 33447 -217485 116284 16159 -46037 216509 -193141 -46082 -135162 223615
$$ packed form
8950b39204J0839B03267a06726c6343j11494B22073d305j57161B0247J6158J3056
8939D9461a96740e1349F9537d4556p0167m7158o543o6340C09399I0988a41389
8927a65883d3139j26737K4515G5893J41296c44777A10331f1201B49742G5171i2140
8915a63697C15847j22237r669P2533K12263B29383Q62325P61410J346818L246725
8905F446661L47580l265468j723943n87101E41143q6846A16923K48176A03130
8895A50741N4523Q6956K9889j48180J85904b8733D30424j46074A39453e544p9792
8884h5336B39303a78068B89310H6075N9137h4891e974A11394d1039k79262J10852
8873b09449M8486C3447b17485A16284A6159d6037B16509a93141d6082q9080B23615
$$ plain form
8861 -261985 -201100 -187055 68730 105733 67574 -238011 -185800 51565 -151125 -84861 75730
8849 -235413 106381 -181790 132538 -16193 -24837 -199602 11485 34429 -68137 162183 -12436
8837 106631 -203231 94573 -243509 -58032 102499 29971 -187309 141073 -391621 -9741 -361749
$$ packed form
8861b61985O0885J4045F8730L7003l8159b38011N2211E1565a51125O6264G5730
8849b35413A06381a81790A32538a6193q644j74765A1485K2944f8137A62183a2436
8837A06631b03231I4573b43509e8032A02499B9971a87309A41073c91621i741l52008
$$ [...]
##END NTUPLES=NMR SPECTRUM
##END=
