
##TITLE=UV1131_M4-1010-1000_6275143_r6RMFeEnJ5
##JCAMPDX= 6.0         $$ Bruker NMR JCAMP-DX V2.0
##DATA TYPE= NMR SPECTRUM
##DATA CLASS= NTUPLES
##ORIGIN= BRUKER
##OWNER= Administrator
$$ 1.72 TOPSPIN		Version 2.1
$$ 2012-06-07 02:33:16.687 -0500  Administrator@TOPSPIN
$$ Compression mode = diff/dup
##.OBSERVE FREQUENCY= 400.13188235
##.OBSERVE NUCLEUS= ^1H
##.ACQUISITION MODE= SIMULTANEOUS (DQD)
##.ACQUISITION SCHEME= undefined
##.AVERAGES= 64
##.DIGITISER RES= 22
##SPECTROMETER/DATA SYSTEM= spect
##.PULSE SEQUENCE= noesygpps1d.comp
##.SOLVENT NAME= COFFEE_meoh
##.SHIFT REFERENCE= INTERNAL, COFFEE_meoh, 1, 14.96681
##AUDIT TRAIL= $$ (NUMBER, WHEN, WHO, WHERE, PROCESS, VERSION, WHAT)
$$ ##TITLE= Audit trail, TOPSPIN		Version 2.1
$$ ##JCAMPDX= 5.01
$$ ##ORIGIN= Bruker BioSpin GmbH
$$ ##OWNER= Administrator
$$ $$ C:\Bruker\TOPSPIN/data/COFFEE/nmr/UV1131_M4-1010-1000_6275143_r6RMFeEnJ5/22/pdata/1/auditp.txt
$$ ##AUDIT TRAIL=  $$ (NUMBER, WHEN, WHO, WHERE, PROCESS, VERSION, WHAT)
(   1,<2012-06-07 02:33:11.281 -0500>,<Administrator>,<TOPSPIN>,<go>,<TOPSPIN 2.1>,
      <created by zg
	started at 2012-06-07 02:21:41.078 -0500,
	POWCHK enabled, PULCHK disabled,
       configuration hash MD5:
       D5 CA 7A 23 FE 6B EE E2 50 67 74 61 24 F7 5E 3B
       data hash MD5: 64K
       5D EE 7E C8 D1 F1 39 B5 53 D6 C3 C4 BD F3 60 3C>)
(   2,<2012-06-07 02:33:14.109 -0500>,<Administrator>,<TOPSPIN>,<proc1d>,<TOPSPIN 2.1>,
      <Start of raw data processing
       efp LB = 0.3 FT_mod = 6 PKNL = 1 PHC0 = 0 PHC1 = 0 SI = 128K 
       data hash MD5: 128K
       7E 60 88 8D 09 85 B8 58 82 05 F7 A6 7D 72 A1 56>)
(   3,<2012-06-07 02:33:15.312 -0500>,<Administrator>,<TOPSPIN>,<proc1d>,<TOPSPIN 2.1>,
      <pk PHC0 = 29.49829 PHC1 = 0 
       data hash MD5: 128K
       DD D3 21 15 62 32 87 DB DC 90 93 95 32 43 4E 4A>)
(   4,<2012-06-07 02:33:16.203 -0500>,<Administrator>,<TOPSPIN>,<proc1d>,<TOPSPIN 2.1>,
      <abs ABSG = 1 
       data hash MD5: 128K
       3D 9C 9E 85 FE 18 BF 82 88 B6 D6 F7 6D A3 D6 39>)
(   5,<2012-06-07 02:33:16.281 -0500>,<Administrator>,<TOPSPIN>,<proc1d>,<TOPSPIN 2.1>,
      <abs ABSG = 2 
       data hash MD5: 128K
       27 C0 DD 8A 38 5D 24 AF 86 D2 F1 E1 CE 98 7C 47>)
(   6,<2012-06-07 02:33:16.343 -0500>,<Administrator>,<TOPSPIN>,<proc1d>,<TOPSPIN 2.1>,
      <abs ABSG = 3 
       data hash MD5: 128K
       FC 7F 9F 7B B8 05 9D 09 DD 1A 15 C9 36 70 E7 1E>)
(   7,<2012-06-07 02:33:16.406 -0500>,<Administrator>,<TOPSPIN>,<proc1d>,<TOPSPIN 2.1>,
      <abs ABSG = 4 
       data hash MD5: 128K
       20 AE B7 FD 60 E1 58 6C 00 67 7A A6 33 76 C3 AD>)
(   8,<2012-06-07 02:33:16.453 -0500>,<Administrator>,<TOPSPIN>,<proc1d>,<TOPSPIN 2.1>,
      <abs ABSG = 5 
       data hash MD5: 128K
       E1 14 6B 1C 01 2C CF 03 75 F7 60 4D CE 3D F5 61>)
$$ ##END=
$$ 
$$ $$ hash MD5
$$ $$ 2D 3F CC 69 AA FF 25 D4 E3 D9 5C 5F 9A 94 63 C0
##$RELAX= 
##$RELAX= 
##$RELAX= 
##$RELAX= 
##$RELAX= 
##$RELAX= 
##$RELAX= 
##$RELAX= 
$$ Bruker specific parameters
$$ [...]
##$TP07= 0
##$TPNAME0= <>
##$TPNAME1= <>
##$TPNAME2= <>
##$TPNAME3= <>
##$TPNAME4= <>
##$TPNAME5= <>
##$TPNAME6= <>
##$TPNAME7= <>
##$TPOAL= (0..7)
0.5 0.5 0.5 0.5 0.5 0.5 0.5 0.5
##$TPOFFS= (0..7)
0 0 0 0 0 0 0 0
##$TUNHIN= 0
##$TUNHOUT= 0
##$TUNXOUT= 0
##$USERA1= <user>
##$USERA2= <user>
##$USERA3= <user>
##$USERA4= <user>
##$USERA5= <user>
##$V9= 5
##$VALIST= <valist>
##$VCLIST= <CCCCCCCCCCCCCCC>
##$VD= 0
##$VDLIST= <DDDDDDDDDDDDDDD>
##$VPLIST= <PPPPPPPPPPPPPPP>
##$VTLIST= <TTTTTTTTTTTTTTT>
##$WBST= 2048
##$WBSW= 25
##$XGAIN= (0..3)
0 0 0 0
##$XL= 0
##$YL= 0
##$YMAX_a= 10904854
##$YMIN_a= -6429891
##$ZGOPTNS= <>
##$ZL1= 120
##$ZL2= 120
##$ZL3= 120
##$ZL4= 120
##$ABSF1= 14.96681
##$ABSF2= -5.58572
##$ABSG= 5
##$ABSL= 3
##$ALPHA= 0
##$AQORDER= 0
##$ASSFAC= 0
##$ASSFACI= 0
##$ASSFACX= 0
##$ASSWID= 0
##$AUNMP= <proc_prof1d_extract.lims>
##$AXLEFT= 0
##$AXNAME= <>
##$AXNUC= <1H>
##$AXRIGHT= 0
##$AXTYPE= 0
##$AXUNIT= <>
##$AZFE= 0.1
##$AZFW= 0.1
##$BCFW= 0
##$BC_mod= 0
##$BYTORDP= 0
##$COROFFS= 0
##$CY= 15
##$DATMOD= 1
##$DC= 0
##$DFILT= <>
##$DTYPP= 0
##$F1P= 0
##$F2P= 0
##$FCOR= 0.5
##$FTSIZE= 131072
##$FT_mod= 6
##$GAMMA= 0
##$GB= 0
##$INTBC= 1
##$INTSCL= 1
##$ISEN= 128
##$LB= 0.3
##$LEV0= 0
##$LPBIN= 0
##$MAXI= 10000
##$MC2= 0
##$MEAN= 0
##$ME_mod= 0
##$MI= 0
##$NCOEF= 0
##$NC_proc= -3
##$NLEV= 6
##$NOISF1= 0
##$NOISF2= 0
##$NSP= 0
##$NTH_PI= 0
##$NZP= 0
##$OFFSET= 14.96681
##$PC= 1
##$PHC0= 29.49829
##$PHC1= 0
##$PH_mod= 1
##$PKNL= yes
##$PPARMOD= 0
##$PPDIAG= 0
##$PPIPTYP= 0
##$PPMPNUM= 2147483647
##$PPRESOL= 1
##$PSCAL= 4
##$PSIGN= 0
##$PYNMP= <proc.py>
##$REVERSE= no
##$SF= 400.130005524334
##$SI= 131072
##$SIGF1= 0
##$SIGF2= 0
##$SINO= 400
##$SIOLD= 131072
##$SPECTYP= <>
##$SREGLST= <1H.CDCl3>
##$SSB= 0
##$STSI= 131072
##$STSR= 0
##$SW_p= 8223.68421052632
##$SYMM= 0
##$S_DEV= 0
##$TDeff= 65536
##$TDoff= 0
##$TI= <>
##$TILT= no
##$TM1= 0
##$TM2= 0
##$TOPLEV= 0
##$USERP1= <user>
##$USERP2= <user>
##$USERP3= <user>
##$USERP4= <user>
##$USERP5= <user>
##$WDW= 1
##$XDIM= 131072
##$YMAX_p= 566519087
##$YMIN_p= -361073726
##$CURPLOT= <Network HP LaserJet P1505>
##$CURPRIN= <$Network HP LaserJet P1505>
##$DFORMAT= <normdp>
##$LAYOUT= <+/1D_H.xwp>
##$LFORMAT= <normlp>
##$PFORMAT= <normpl>
##$SURQMSG= 1
$$ End of Bruker specific parameters
$$ ---------------------------------
##NTUPLES= NMR SPECTRUM
##VAR_NAME=  FREQUENCY,     SPECTRUM/REAL,   SPECTRUM/IMAG
##SYMBOL=    X,             R,               I
##VAR_TYPE=  INDEPENDENT,   DEPENDENT,       DEPENDENT
##VAR_FORM=  AFFN,          ASDF,            ASDF
##VAR_DIM=   131072,        131072,          131072
##UNITS=     HZ,            ARBITRARY UNITS, ARBITRARY UNITS
##FACTOR=    0.0627417313425165, 1,          1
##FIRST=     8223.62146879498, 4786,         -100558
##LAST=      0,             6775,            -100023
##MIN=       0,             -361073726,      0
##MAX=       8223.62146879498, 566519087,    0
$$ Real data points
##PAGE= N=1
##DATA TABLE= (X++(R..R)), XYDATA
$$ [...]
67222 144919 142230 138462 133750 129349 126055 123546 121378 119871 119546 120114 120686 120944 121489 122905 125034
67207 125034 127501 130464 134182 138063 140784 141543 140888 140221 140599 141817 142399 140896 137607 134600 133398
67192 133398 133150 132085 130355 130033 132139 135121 136788 136524 134869 132134 128610 125412 123940 124685 127143
67177 127143 130475 133654 135699 136525 137027 137498 136712 133568 129077 125516 123956 123750 124094 124750 125280 124967
67161 124967 123888 123096 123385 124629 126438 128555 130404 131219 131055 130910 131469 132345 132909 133190 133575 134174 134881
67144 134881 135586 136015 135843 135255 134946 135271 135845 136228 136505 136918 137404 137853 138404 139095 139620 139893 140553 142451
67126 142451 145665 149226 151744 152213 150538 147578 144663 142926 142902 144414 146522 147932 148029 147493 147433 147979
67110 147979 148247 147685 146806 146461 147009 148423 150740 153953 157628 160714 161761 159867 156003 152989 153095 155589
67094 155589 157640 157731 157039 157178 157958 158395 158904 161124 165796 171837 177345 180812 181570 180049 177702 175934
67078 175934 174826 173386 171149 169042 168479 169954 172753 175711 178011 179470 180438 181503 183009 184580 185229
67063 185229 184399 183003 182864 184630 186754 187430 187268 188865 193448 199102 203015 204547 205150 206019 207112 208272
67047 208272 209955 212438 215150 217410 219278 221159 222911 223909 223962 223637 223518 223558 223535 223966 225879 229451 233396
67030 233396 236236 237849 239183 240745 242241 243642 245555 248115 250438 251826 252872 254601 256993 259137
67016 259137 260531 261474 262289 262942 263500 264392 266061 268688 272218 276325 280527 284779 289739 295768 301763
67001 301763 305836 307417 307980 309306 311635 314079 316316 319010 322672 326915 331056 334820 338106 340623
66987 340623 342361 344142 347002 350990 355178 358875 362277 365808 369503 373371 377645 382184 386279 389731
66973 389731 393508 398476 404017 408934 413312 418216 423731 428732 432828 437074 442236 447565 452041 455691
66959 455691 458932 461659 464077 467493 473049 480157 487361 494354 501992 510534 519045 526615 533213 539245
66945 539245 545158 551674 559647 569249 579625 589419 597446 603173 607203 611344 617589 626716 637931 649619
66931 649619 660326 669635 678733 689635 702986 716912 728959 738987 749080 760616 772538 782908
66919 782908 791260 798879 807505 818299 831495 846291 861244 875311 888623 902187 916982 933348
66907 933348 950873 968630 985677 1001669 1017086 1032922 1050070 1068739 1088310 1107973 1127555
66896 1127555 1147413 1167549 1187546 1207710 1229343 1253135 1278010 1302510 1326636 1351173 1375913
66885 1375913 1400227 1425111 1452714 1483448 1515285 1546613 1578198 1611425 1646058 1681053 1716392
66874 1716392 1752641 1789521 1826603 1864995 1906693 1952101 1999386 2046426 2092355 2137175 2181147
66863 2181147 2225163 2270783 2319118 2369984 2422540 2476401 2531797 2589022 2648047 2708453 2769483
66852 2769483 2830371 2890908 2951650 3013580 3077695 3144695 3214519 3285997 3357419 3427830 3497571
66841 3497571 3567454 3637790 3708521 3779778 3851676 3923720 3995046 4065268 4134511 4202533 4268541
66830 4268541 4332190 4394083 4454499 4512086 4564762 4611927 4654912 4694947 4731463 4762831 4788101
66819 4788101 4807440 4821358 4830196 4834100 4832815 4825792 4813125 4796094 4775959 4752389 4724008 4690386
66807 4690386 4652403 4610530 4564088 4512893 4458507 4402676 4345107 4283946 4218263 4149019 4077677
66796 4077677 4004919 3931112 3857068 3783601 3710575 3636972 3561979 3485884 3409951 3335430 3262550
66785 3262550 3190456 3118370 3046810 2977319 2910851 2846728 2783518 2720648 2658822 2599001 2541455
66774 2541455 2485772 2431211 2376847 2321995 2267127 2214075 2164561 2118461 2074002 2029712 1985581
66763 1985581 1942244 1899880 1858479 1818519 1780497 1743942 1707639 1670811 1633640 1596793 1560991
66752 1560991 1526966 1495154 1465366 1437087 1409915 1383162 1355440 1325708 1294851 1265211 1238231
66741 1238231 1213396 1189733 1167184 1145771 1124486 1102286 1079738 1058513 1039319 1021249 1003064
66730 1003064 984150 964213 943089 921449 901013 883407 868874 856263 843982 830871 816705
66719 816705 802318 788951 776966 765210 751944 736493 719805 703509 688718 675735 664424
66708 664424 654428 645121 635814 626229 616583 607062 597470 587649 578051 569482 562151 555252 547592 538562
66694 538562 528561 518693 510027 502909 496833 491021 485063 478947 472758 466658 460981 455919 451207 446517
66680 446517 442020 438076 434499 430780 426944 423389 419797 415188 409492 404139 400284 397075 392612 386370
66666 386370 379869 374979 372152 370303 367953 364437 360319 356592 353360 349683 344875 339441 334258 329427
66652 329427 324564 319717 315093 310311 305062 300334 297786 297543 297598 295840 291976 287151 282553 278920 276628
66637 276628 275367 274052 271818 269008 266660 265122 263653 261326 257919 253874 249813 246190 243237 241124
66623 241124 240197 240851 242981 245699 247862 248854 248655 247315 244840 241700 238936 237193 235757 233117 228649
66608 228649 223352 218627 214803 211448 208690 207156 206568 205569 203579 201884 201931 203140 203460 201752 198630
66593 198630 195300 192778 192041 193429 195598 196474 195789 195356 196175 196700 195131 192204 190116 189454 188880 187486
66577 187486 185734 184059 182171 180029 178049 175977 173067 169978 168934 170926 174015 175709 175965 176267 176539
66562 176539 175053 171409 167677 165924 165984 166464 166757 166889 166195 163600 159237 154778 151863 150756 150778 151531
66546 151531 153299 156365 160180 163370 164694 164121 162840 162050 161792 161077 159016 155769 152580 150975 151544
66531 151544 153175 153814 152520 150647 150383 152051 153497 152456 149108 145813 144562 145166 145967 145844 145265 145481
66515 145481 146992 148984 150182 150053 149027 147738 146321 144544 142392 140375 139227 139318 140164 140559 139365
66500 139365 136399 132683 129872 129291 131203 134593 137721 139268 139196 138485 138035 137947 137755 137057 135775 134040
66484 134040 132106 130357 129227 128863 128781 127973 125727 122544 120011 119528 121263 124426 128079 131254 132740
66469 132740 131700 128689 125358 122920 121299 119871 118375 116829 115227 113868 113536 114714 116872 118990
66455 118990 120579 121710 122248 121795 120569 119782 120692 123201 125647 126221 124783 123077 122871 123998 124699 123813
66439 123813 121979 120553 120107 120384 120958 121299 120771 119392 118237 118318 119267 119861 119608 119054 118685 118412 118136 118032
66421 118032 118147 118465 119393 121337 123677 125051 125038 124778 125532 127313 129345 131020 131854 131331 129742 128680
66405 128680 129685 132498 135394 137025 137210 136171 134149 131972 130915 131292 131790 130908 128822 127157 127026
66390 127026 127865 128341 128016 127805 128879 131273 133701 134806 134537 134053 134183 134339 133364 131256 129369 128686 128503
66373 128503 127398 125200 123283 122837 123514 124156 124447 125244 127227 129591 130431 128577 125078 122559 122760 124771
66357 124771 126057 125192 123029 121213 120303 119799 119274 118621 117559 115862 114133 113556 114609 116484 117991 118628
66341 118628 118561 117994 116857 115014 112724 110944 110854 112641 114939 116070 115843 115618 116694 119283 122906 126704
66325 126704 129127 128541 125072 121166 119459 120380 122466 124460 126245 128150 130388 133112 136113 138442 139202
66310 139202 138763 138327 138133 137038 134248 130605 127586 125741 124784 124586 125175 126026 126281 125731 124893 124050 122866
66293 122866 121276 120182 120670 122609 124413 124327 121924 118377 115451 114257 114842 116676 119277 122314 125311
66278 125311 127547 128361 127720 126497 126006 126904 128547 129741 130074 130032 129740 128403 125624 122714 121701 123140
66262 123140 125733 128131 130127 131755 132219 130569 127015 122898 119596 117852 117792 118871 120037 120620 121076
66247 121076 122332 124567 127161 129691 132205 134459 135618 135032 132825 129614 126185 123541 122463 122628 122747
66232 122747 122024 120996 120486 120423 120472 121272 123964 128395 132665 134791 134381 132545 130694 129640 129323 128953 127680
66215 127680 125528 123505 122506 122263 121879 121307 121699 123992 127630 131140 133643 135134 135493 134292 131982 130244
66199 130244 130235 130981 130590 128787 127124 126735 127091 127309 127427 127602 127060 124983 121994 119826 119656 121340 124009
66182 124009 126691 128622 129664 130359 131110 131605 131567 131548 132052 132196 130487 127114 124407 124530 127373 131069 133910
66165 133910 135279 135254 134076 132033 129631 127797 127680 129739 132975 135591 136601 136360 135445 133780 131408
66150 131408 129522 129726 132135 134936 136222 135966 135761 136669 137880 137798 136053 133922 132923 133638 135873 139044
66134 139044 141944 143008 141670 139072 136744 134964 133210 131694 131273 131917 132492 132357 132258 133308 135701 138681
66118 138681 141078 141731 140246 137637 135558 134542 133760 132711 132106 132459 132764 131675 129582 128458 129590
66103 129590 132141 134081 134111 132533 130548 128955 127679 126516 125861 126215 127256 128125 128537 128863 129162 129147 129165
66086 129165 130088 131805 133001 133102 133364 135081 137620 139261 139367 138655 137942 137795 138949 141729 145116 147526
66070 147526 148556 148978 149107 148347 146535 144630 143495 142761 141436 139220 136876 135609 136232 138474 141007
66055 141007 142565 143215 144150 146204 149015 151627 153392 154179 154259 154203 154397 154538 154142 153764 155069 159118 164879
66038 164879 169867 172165 171586 169101 165702 162051 158912 157203 157161 157724 157554 156844 157338 160062 163784 166491
66022 166491 167709 168280 168308 166896 164050 161425 160473 160779 160904 160147 158799 157336 156178 155861 156661 158208
66006 158208 159927 161594 163084 163970 164069 164090 165027 166894 168597 169089 168268 166797 165458 164641 164115 163253 161832
65989 161832 160481 160008 160354 160689 160538 160340 160762 161900 163392 164996 166768 168804 170984 172867 173800 173401
65973 173401 172079 170918 170828 171926 173846 176350 179352 182465 184967 186339 186695 186640 186876 187920 189883 192296
65957 192296 194363 195672 196720 198495 201489 205206 208717 211629 214420 217839 222051 226505 230604 234291
65943 234291 237795 241079 243961 246776 250335 254999 260259 265606 271294 277672 284224 290149 295703 301910
65929 301910 308732 314535 317852 318936 318975 318447 316942 314160 310289 305689 300867 296568 293186 290211 286816
65914 286816 282799 278344 273223 267285 261652 258166 257088 256306 253654 249429 245771 243917 242984 241427 238734
65899 238734 235383 231920 228808 226845 226884 228888 231718 234244 236436 239101 242736 247071 251575 255912 259822
65884 259822 263048 265670 268183 270989 274001 276937 279663 282115 284250 286357 289016 292386 295836 298672
65870 298672 300847 302580 303788 304686 306626 311281 318729 327003 333861 338603 342040 345227 348588 351961
65856 351961 355177 358593 363034 368953 375705 382066 387515 392648 398224 404155 409529 413324 415066 415228
65842 415228 415043 415453 416008 415341 413068 410700 410044 410930 411259 409399 405945 402618 399759 395645 388544 379009
65826 379009 369525 361922 355716 349202 341572 333447 325709 318514 311474 304332 297354 291257 286637 283156
65812 283156 279525 274740 269243 264400 261011 258892 257759 257662 258329 258875 258643 257827 256810 255348 253006 250218
65796 250218 248261 248089 249458 251260 252517 252993 253115 253495 254510 256029 257382 257778 257140 256485 257015 258786
65780 258786 260806 262547 264541 267069 269230 270296 271379 274405 279542 284822 288529 290943 293511 297277
65766 297277 302519 309020 316138 323221 330519 339167 349823 361659 372946 382194 388625 392264 394067
65753 394067 395357 396669 397443 397012 395370 392711 388931 383999 378314 372370 366532 361280 356897 352756 347904
65738 347904 342844 339584 339185 340205 340480 339504 338011 336327 334714 334656 337832 343739 349969 355213 360645
65723 360645 367892 376993 387045 397731 409097 420491 430909 440397 450304 461850 474624 486607
65711 486607 495558 500387 501335 499121 494335 487669 479959 471379 461017 448119 433643 419781 407927
65698 407927 397870 389116 382085 377540 375467 375139 375957 377893 381380 387050 395275 405594 416840 428161
65684 428161 439766 452502 466777 482030 496946 510086 520633 528849 535518 540766 543631 543019 538721
65671 538721 531193 520728 507438 491890 475056 457445 438798 419153 399893 383087 369559 358039
65659 358039 346571 334498 322522 311067 299542 287717 276947 269069 264276 261084 258391 256463
65647 256463 255541 254561 252290 249150 246828 246113 246064 245502 244449 243623 243035 241869 239610 236838 234829 234611
65631 234611 236367 239412 242663 245406 247856 250892 255096 259944 264077 266539 268009 270686 276608 285809
65617 285809 296403 306747 317158 329027 342615 356651 370234 384103 399567 416940 435794
65606 435794 456110 478108 501147 523790 545017 564679 582767 599073 613647 626790 638393
65595 638393 648068 656126 663532 670457 675755 678511 679483 680337 681974 684272 686878 689337 690680 689747 686056
65580 686056 679916 671857 662424 652183 641117 627949 610772 588731 562980 535970 509885 485448
65568 485448 461881 438189 414785 393569 376017 361564 348447 335786 324050 313698 304424 296004
65556 296004 289039 284244 281349 279149 276548 273329 269992 266967 264020 260529 256394 252321 248948 246080
65542 246080 243279 240782 239109 237998 236739 235654 236164 238853 242233 244155 243956 242615 241257 240411 240592
65527 240592 242537 246408 251404 256752 262736 270087 278514 286658 293847 301249 310720 322902 337123 352832
65513 352832 370072 388421 406480 423027 438161 452895 468177 484587 502095 519338 533757
65502 533757 543505 548965 551658 551992 549033 542219 532262 520236 506602 491287 474128 455216 435385
65489 435385 416185 398660 382357 366417 351442 339117 329918 322445 315345 308783 303497 299502 296464
65476 296464 294429 293353 292666 292088 292236 293571 295343 296475 296944 297297 297176 295497 292047 287865 283808 279542
65460 279542 274262 267871 261174 255377 251564 250205 250767 251937 252454 251859 250604 249601 249470 249919 249947 248863
65444 248863 247015 245285 244048 243009 241950 241206 241327 242519 244500 246723 248802 250864 253444 256770 260215
65429 260215 262734 263939 264675 266617 271268 278925 288158 296473 302058 305091 307104 309116 310795 311412 310997
65414 310997 310078 308724 306472 303100 298878 293923 287924 280914 273873 267885 262856 257792 252473 248078
65400 248078 245682 244799 244088 243101 242468 242629 243362 244548 246263 247772 247637 245654 243802 244118 246092 247363
65384 247363 246754 245387 244678 244644 244925 246322 250001 255579 261171 265394 268452 271121 273709 276497 280251
65369 280251 285310 290482 293868 294829 294449 293987 293593 292732 291025 288202 283976 278808 274420 272580 273149 273985
65353 273985 273083 270589 268602 269206 272747 277682 281799 283540 282493 279282 275541 273607 275120 279416 283973
65338 283973 286989 289053 291796 295642 299695 303272 306536 309851 313471 317598 321743 324245 323699 320958
65324 320958 318586 318066 318544 318504 317508 315928 314131 312623 311975 311911 311296 309772 308618 309299 311893 315644 320136
65307 320136 325008 329388 332898 336705 342243 349092 355322 359984 364268 370112 378475 389042 400787 412625
65293 412625 424118 435686 447695 459435 469583 477569 483817 488710 491983 493164 491942 488142 482131
65280 482131 475302 469306 464468 459563 453403 446022 438044 429592 420293 409919 398634 386995 375993
65267 375993 366637 358999 351968 344405 336317 328619 322011 316603 312394 309460 307503 305668 303225 300424
65253 300424 298368 297834 298273 298190 296609 293954 291346 289323 287554 285638 283673 282056 281127 281146 282224 284077
65237 284077 286067 287758 289345 291490 294783 299256 304142 308176 310513 311465 312085 312931 313584 313483 312843 312448
65221 312448 312784 313630 314282 313929 312131 309352 306867 305640 305331 304883 304078 303870 304927 306487 307260 307005 306352
65204 306352 305288 302969 299412 296309 295210 295498 295283 294067 293248 293678 293970 292123 288205 284361 282307
65189 282307 281626 280698 278597 275631 272416 269073 265544 262304 260185 259317 258650 257090 254961 253802 254592
65174 254592 256626 258362 259026 259185 260106 262682 266535 269882 270708 268547 264966 262074 260766 260544 260564 260435
65158 260435 260207 260023 259774 259146 258227 257919 259104 261383 263466 265009 267028 269954 272479 273303 273003 272826
65142 272826 272411 270414 267093 264449 263595 263608 263466 263561 264491 265725 266581 267538 269382 271800 274035 276389 279724
65125 279724 283730 287146 289902 293651 299572 306628 312850 317628 321704 325321 327670 328527 329465 332623 338584
65110 338584 346043 353341 359700 365135 369946 374653 379857 385709 391814 397943 404517 412110 420839 430656
65096 430656 441893 455051 470264 487423 506531 527340 548973 570828 593939 620550 651927
65085 651927 687160 724584 763832 805790 850764 897386 943436 987271 1028263 1066423 1102155
65074 1102155 1136176 1168827 1199069 1224633 1243723 1256372 1263637 1265800 1262129 1252257 1236881 1216983
65062 1216983 1193365 1167134 1139392 1109696 1075904 1036679 993473 948928 904078 858562 813200
65051 813200 770446 731855 696428 662283 629176 598652 572168 549538 529029 508850 488805
65040 488805 470361 454664 440844 427118 413283 400917 390920 382215 373497 365196 358752 354633 351962
65027 351962 349740 347627 345756 344493 344249 344985 345910 346028 344904 342716 339862 336864 334398 332925 332303
65012 332303 331993 331534 330710 329463 327882 326119 324157 321822 319159 316620 314833 314294 315160 316931 318418
64997 318418 318628 317880 317623 318957 321645 324486 326174 325891 323924 321887 321433 322259 322103 319356 315017 311399
64981 311399 309458 308232 306557 304342 302064 299790 297058 293515 289531 286192 284485 284309 284470 283823 282223
64966 282223 280324 278864 278235 278249 278048 276766 274597 272668 271527 270385 268462 266407 265628 266685 269219
64951 269219 272993 277869 282839 286247 287451 287466 287626 288305 289480 291927 296920 304609 313206 320166 324211
64936 324211 326124 327570 329342 330957 331801 332152 332850 334274 336043 337550 338529 339263 340456 342720 345868
64921 345868 348905 351075 352768 355002 358030 360839 362087 361214 358579 354813 350321 345296 339945 334543
64907 334543 329290 324283 319618 315338 311246 307084 303117 300131 298440 297193 295209 292320 289316 286803
64893 286803 284849 283578 283128 283010 282520 281957 282312 283476 283982 283131 282102 282064 282359 281788 280730 280433 280827
64876 280827 280671 279749 279360 280449 282485 284551 286453 288452 290726 293444 296472 298763 298941 297001 294646
64861 294646 293334 292630 291145 288641 286430 285809 286763 288382 290136 292281 294989 297515 298867 299396 301032
64846 301032 305420 312204 319689 326781 333585 340460 347464 354702 362297 369835 376663 383071 390457 399807
64832 399807 410348 420068 427406 432378 436403 441107 447001 453202 458492 462426 465197 466960 467925 468566
64818 468566 468793 467259 462673 455753 448663 442425 436201 429392 422916 417648 412974 408030 403287 399581
64804 399581 396326 392211 387362 383379 381127 379608 377250 373385 368237 362284 355989 349670 343359 337129
64790 337129 331517 327031 323271 319193 314406 309592 305536 302519 300998 301973 305843 311293 316130 319159
64776 319159 320678 321212 320517 318147 314650 311718 310989 312643 315150 316644 316748 316894 318592 321675 324769
64761 324769 327381 330679 335845 342296 348215 352614 356323 361040 367922 376982 387247 397395 406766 415992
64747 415992 426307 438153 450773 463146 474735 485115 493474 498889 500809 499098 494081 486860 479088
64734 479088 471926 465458 459259 453028 446364 438694 430133 421921 415228 409856 404799 399773 395461 392624
64720 392624 391758 393240 396744 400747 403737 405904 408506 411652 414161 415993 419366 426529 437386 450143
64706 450143 463431 476808 489917 502393 514325 525733 535680 542884 547398 550995 555551 561375 567176
64693 567176 571393 573565 574655 576071 578243 580334 581390 581279 580269 578251 574957 570473 564805 557209
64679 557209 546827 534000 520202 506633 493627 481544 471433 464233 459788 457058 454983 452832
64667 452832 450141 446829 443176 439218 434387 428296 421929 417445 416424 418446 421656 424563 427015 429552
64653 429552 432327 434989 437303 439335 440892 441238 439720 436565 432741 429169 426304 424315 423059 421713
64639 421713 419044 414636 409646 405768 403364 401169 397933 393728 389226 384374 378708 372868 368745 367728
64625 367728 369410 372405 375812 379343 382660 385665 389319 395141 403532 413257 422983 432759 443476 455295
64611 455295 467374 479070 490758 503116 515941 528034 538143 545647 550256 551577 549446 544572
64599 544572 538175 530820 522118 511993 501745 493142 486643 481208 475976 471452 468679 467694 467371 466789
64585 466789 466567 468653 474664 484276 495343 505787 515285 525032 536249 549411 564650 582052 601186
64572 601186 620896 640025 658223 675769 692624 707758 719396 726131 728104 727036 724758 721686
64560 721686 716960 709862 700573 689686 677812 665955 655477 646981 639511 631423 621944 611521 600737
64547 600737 589310 576352 561511 545808 531244 519326 509882 501430 492660 483386 474156 465383 457026
64534 457026 448844 440830 433454 427425 422963 419463 416237 413458 411928 412075 413674 416330 419559 422588
64520 422588 425083 428138 433374 440730 448224 454456 460208 466748 473616 479277 483231 486038 487627 487020
64506 487020 483870 479138 473972 468824 463823 459068 454125 447953 439863 430153 419612 409038 399582 392787
64492 392787 389392 388304 387441 385711 383688 382285 381348 380020 378163 376741 376671 377886 379868 382581 386256
64477 386256 390527 394523 397650 399471 399005 395390 389567 384050 380323 377494 374385 371815 371406 372888 374308
64462 374308 374825 375709 378270 382084 385807 388791 391385 394337 398338 403441 408572 412178 413810 414644 416313
64447 416313 419810 425533 433351 442127 450060 456392 462455 470479 481578 495026 508936 521315 531306
64434 531306 540033 549577 560350 569931 575177 575093 571036 564830 557678 550425 543560 536945 530561 525452
64420 525452 522784 521854 520367 517162 513475 510738 508225 504080 498042 491849 487090 483816 481369 479526
64406 479526 478429 478224 479366 482672 488330 495136 501379 506402 510725 514726 517984 520227 522238 525129
64392 525129 529014 533098 537096 541789 547907 555112 562670 570698 579988 590731 602181 613747 625815
64379 625815 639260 654694 672481 692863 715601 739986 765872 794400 826997 863851 904137
64368 904137 947714 995900 1050449 1112446 1182378 1260601 1347424 1443227 1548761 1664666 1790094
64357 1790094 1922062 2056548 2189952 2319481 2442903 2558689 2666031 2763897 2849922 2920430
64347 2920430 2971466 2999919 3004581 2986949 2950714 2899652 2835710 2758954 2668609 2563880 2444929
64336 2444929 2314390 2177545 2039892 1904590 1772996 1646990 1529227 1421158 1322358 1232139
64326 1232139 1150624 1077906 1013474 957013 908545 867024 829911 795079 762453 733071 707363
64315 707363 685059 665833 649072 633637 618863 605264 593372 582464 571435 560372 550155
64304 550155 540852 531683 522411 513723 506229 499941 494732 490551 487292 485182 485057 487298 490743 493788
64290 493788 496563 500813 507329 514673 520964 526001 530966 536759 543326 550061 556029 559998 561048 559330
64276 559330 555993 552366 549315 547194 545960 545124 543760 540998 536863 532620 529890 529237 529796 530263 529824
64261 529824 528111 525054 521276 517949 515506 512847 508462 501990 494191 486025 478583 473259 470635 469385
64247 469385 467414 464053 460143 456202 451954 447755 444825 443388 441818 438580 434092 429906 426785 424499
64233 424499 422906 422379 423352 425915 429528 432909 434925 436070 438318 442911 449000 455156 461375 468579 476785
64218 476785 485046 492953 501077 509963 519755 530758 543152 555810 566513 574007 579257 584058 588895
64205 588895 592676 594183 593159 590237 586522 583308 581630 581734 582996 584427 585156 584547 582192 578072 572604
64190 572604 566244 558935 550093 539241 526681 513473 500799 489360 479294 470590 463495 458418 455312
64177 455312 453282 451146 448572 446419 445757 446707 448375 449659 449891 448988 447457 446195 445865 446306 446674 446109
64161 446109 444186 441067 437568 434939 434076 434867 436432 437885 438714 438766 438164 437023 435041 431865 428258 426091
64145 426091 426322 427511 427457 425951 424613 424218 423870 423138 423313 425559 429154 432869 437190 443777 453198 464538
64129 464538 476995 490610 505320 520575 536313 553364 572193 591650 609495 623860 633902
64118 633902 639428 640482 637313 630351 620133 607439 593375 578919 564262 549075 533742 519827
64106 519827 508595 499342 490116 480193 470797 463044 456500 450625 446351 444600 443973 441955 438428 436117
64092 436117 436995 439924 442660 444732 447097 450041 452864 455219 457606 460707 465000 470723 477474 483997
64078 483997 488954 491804 492675 491886 490032 487963 486085 484199 482491 481862 482460 482659 480731 477224 474644
64063 474644 474908 478039 483142 489494 496549 503861 511490 520033 530054 541772 555200 570106 585959
64050 585959 602311 619042 635847 651929 666765 680550 693112 702994 708946 712096 715329 720462
64038 720462 727236 735093 744422 755400 766894 777431 786557 794425 800713 804750 806335 805686 802806 797438
64024 797438 789524 779316 767203 753701 739422 724780 709929 695055 680444 666172 652143 638456
64012 638456 625248 612172 598857 586171 576151 570072 567194 565975 565788 566568 567460 567140 565556 564258
63998 564258 564767 567332 571422 576532 581982 586780 590532 594247 599481 606712 615101 623809 632988 643349
63984 643349 655261 668526 682613 696785 710460 723892 738037 752969 766688 776565 782304 786514
63972 786514 791719 797459 801131 801113 798034 793307 787825 782419 778346 776333 775673 775127 774455 774310 774776 774844
63956 774844 773529 770770 766883 761696 754849 746636 737840 728769 719153 709186 700023 692756 687381 683279
63942 683279 680317 678718 678001 676983 675152 673482 673590 676429 681947 689558 698739 709448 722023 736339
63928 736339 751240 765500 779339 794134 810583 828237 847055 868011 891323 915331 938393
63917 938393 961018 984806 1009932 1035152 1059844 1084569 1109818 1135834 1163809 1195774 1232817
63906 1232817 1274332 1319262 1367133 1417943 1472297 1531810 1598080 1670943 1749022 1832321 1922874
63895 1922874 2022503 2131603 2250989 2383222 2530813 2694519 2874863 3074139 3295133 3538660
63885 3538660 3804096 4091548 4401285 4731003 5075681 5430629 5793105 6160423 6527887
63876 6527887 6889240 7237861 7566636 7867748 8133899 8359514 8540292 8672278 8752224 8778421
63866 8778421 8750460 8668491 8533509 8348244 8117216 7846005 7541002 7209546 6859326 6497162
63856 6497162 6128683 5759344 5395226 5042306 4704893 4385074 4083788 3802352 3542833
63847 3542833 3306995 3095040 2905485 2736016 2584340 2448481 2326834 2218100 2120913 2033455
63837 2033455 1953847 1881043 1814862 1754822 1699424 1647091 1597450 1550892 1507058 1464666 1423061
63826 1423061 1383095 1345891 1311291 1278214 1246231 1216122 1189028 1165744 1146822 1132645 1123020
63815 1123020 1117133 1114272 1114362 1117512 1123298 1130862 1139753 1150427 1163737 1179813 1197424 1214673 1230590
63802 1230590 1245896 1261863 1278579 1294807 1309379 1321994 1332537 1340498 1345639 1348615 1350260 1350503
63790 1350503 1348510 1343546 1335138 1322736 1306039 1285649 1262786 1238351 1212642 1185789 1157705 1127612
63778 1127612 1094476 1058381 1021091 984858 950797 918502 887044 856302 827395 801616 778710
63767 778710 756554 733121 708596 684993 663901 645354 628783 613896 600250 586934 573563
63756 573563 561127 551058 543616 537686 532008 526137 520359 515211 511162 508387 506587 505056 503017 500054
63742 500054 496376 492649 489373 486438 483394 479935 475855 470864 465022 459204 454398 450522 446644 442470
63728 442470 438824 436361 434596 432599 430002 426800 422940 418694 414841 411757 408831 405517 402536 401182
63714 401182 401671 402876 403454 402616 400196 396900 394278 393544 394367 395496 396374 397255 397978 397893 397175 397077 398323
63697 398323 400254 402067 403990 406475 409047 410788 411463 411365 410578 409337 408743 410026 413058 416418 418990
63682 418990 420815 422424 424185 426440 429454 432881 436001 438827 442293 446914 452014 456841 461783 467640
63668 467640 474175 480375 485991 491829 498434 505369 512053 518529 524912 530559 534406 535988 535883 535288 535236
63653 535236 535960 536840 537170 536896 536318 535163 532642 528668 524403 521265 519794 519712 520489 521357 521377 520261 518957
63636 518957 518880 520619 523669 527146 530425 533441 536704 540677 544840 547891 549315 550136 551554 553563 555623
63621 555623 557864 560486 562665 563521 563888 565509 568487 571011 571912 572086 572895 574520 576523 578853 581485
63606 581485 583976 586092 587998 589181 588263 584825 580494 577049 574148 570072 564227 557695 551586 546070
63592 546070 541036 536677 533190 530657 529339 529507 530860 532601 534098 535128 535724 536371 538176 542150 548207
63577 548207 555301 562489 569495 576499 584022 592921 603793 616296 629572 643261 657500 672034 686231
63564 686231 700264 715461 732948 752473 773160 795063 819206 846091 874978 905122 937351
63553 937351 973646 1014920 1059758 1105851 1152362 1200220 1250113 1301048 1351110 1398883 1443456
63542 1443456 1483549 1517468 1543928 1562400 1572755 1575086 1570134 1559663 1546187 1532057 1518264 1503865
63530 1503865 1486831 1465791 1440929 1413221 1383258 1351012 1316304 1279253 1240711 1202507 1166726
63519 1166726 1134375 1105196 1079053 1056653 1038350 1023069 1009448 997613 988844 983789 982008 983106
63507 983106 987188 994014 1002626 1012213 1022823 1034996 1049065 1064876 1081865 1099493 1117977 1138378
63495 1138378 1161572 1187444 1215570 1246203 1279874 1316685 1357050 1402496 1454115 1510297 1567609
63484 1567609 1624150 1680266 1735092 1784052 1821323 1844135 1853667 1852628 1843508 1828817 1811248 1792655
63472 1792655 1773316 1752559 1729895 1705403 1679149 1650370 1617428 1578996 1535393 1488360 1439400
63461 1439400 1388880 1337027 1285071 1234743 1187012 1141934 1099364 1059259 1021665 987141 956838
63450 956838 931239 908975 887870 867208 848046 831107 815522 800188 785376 772104 760616
63439 760616 750486 741773 734879 729369 724172 719183 715568 713916 713043 711436 709165 707350 706218 704852
63425 704852 702817 700958 700344 701251 703460 706813 711048 715704 720529 725508 730192 733654 735539 736564 737488
63410 737488 738172 738146 737484 736336 734079 729918 724280 718825 714872 712231 709629 706045 701792 698553 698115
63395 698115 700763 705135 709832 714637 719906 725617 731798 739285 749139 761670 776811 794856 815822
63382 815822 838547 861637 885046 909545 935022 960859 987927 1018458 1053548 1092363 1134267
63371 1134267 1179785 1228145 1275412 1317020 1351850 1382488 1411824 1440749 1469058 1497179 1526418
63360 1526418 1558239 1593776 1633638 1677810 1725830 1777090 1830692 1884937 1937192 1984445 2024103
63349 2024103 2054503 2074913 2085216 2085761 2077684 2063082 2044155 2021909 1996091 1966655 1934793 1901864
63337 1901864 1867469 1829319 1785530 1736878 1686382 1636540 1587377 1537516 1486747 1436673 1388790
63326 1388790 1343122 1299548 1259619 1225779 1198904 1177625 1160137 1145767 1134719 1127221 1123310 1122831
63314 1122831 1125355 1130556 1138713 1150344 1165501 1184039 1206236 1232040 1259874 1287593 1315032 1344433
63302 1344433 1377844 1415272 1455871 1499558 1546446 1595753 1646481 1698487 1751757 1805118 1856683
63291 1856683 1905059 1948968 1986038 2013302 2029188 2034379 2030800 2020417 2004831 1985169 1962158 1936602
63279 1936602 1909576 1881505 1851279 1817103 1778356 1736051 1691367 1644342 1594388 1541755 1488208
63268 1488208 1436174 1387313 1341933 1299863 1261648 1228403 1200535 1177270 1157698 1141711 1129370
63257 1129370 1119556 1109545 1095964 1076453 1051182 1022906 994823 968139 942173 916711 893108
63246 893108 872731 855524 840844 828697 819163 811302 803551 794814 784756 773896 764090 757724 755172
63233 755172 753673 749758 742226 732038 720569 709415 700731 695601 692318 688100 682399 676867 672320
63220 672320 667646 661892 655569 649498 644092 640266 639206 640315 640898 639005 635584 632955 632210 632997 634874
63205 634874 637705 641244 645227 649512 653649 656788 658503 659240 659870 661624 666461 675987 689289 703097
63191 703097 715051 725733 736653 747678 757960 768268 780385 794562 809442 824510 841002
63180 841002 860143 881821 905362 930319 956056 981717 1007325 1034020 1062509 1092001 1121372
63169 1121372 1150753 1181126 1212711 1244625 1276023 1306748 1336743 1365545 1392846 1419231 1445824
63158 1445824 1473162 1500762 1527875 1554259 1579754 1603225 1622547 1636032 1643617 1646325 1644752 1638513
63146 1638513 1627105 1610788 1590368 1566505 1539765 1511343 1483190 1457019 1433264 1411429 1391407
63135 1391407 1374067 1360412 1350676 1344517 1341601 1341551 1343838 1348514 1356686 1369200 1384852 1401031 1416418
63122 1416418 1432003 1448938 1466543 1483484 1500166 1518589 1539989 1563692 1588233 1612523 1635706
63111 1635706 1656895 1675619 1691879 1705223 1714248 1717674 1715661 1709548 1700249 1687215 1669014 1644778
63099 1644778 1615108 1581670 1545938 1508346 1468781 1427775 1386896 1347856 1311452 1277458 1245203
63088 1245203 1214053 1183708 1154537 1127617 1104142 1084632 1068694 1055309 1043180 1031158 1018981
63077 1018981 1007636 998557 992234 987906 984627 982148 980541 979611 979303 980308 983516 988891 995507 1002735
63063 1002735 1010781 1019855 1029404 1038550 1046857 1054305 1060862 1066507 1071453 1075977 1080140 1083978 1087818 1092070
63049 1092070 1096704 1101083 1104260 1105509 1104978 1103949 1103967 1105404 1107298 1108825 1110244 1111834 1112739 1111990 1110308
63034 1110308 1109620 1110701 1112423 1113637 1114774 1117039 1120845 1125632 1130591 1134913 1137953 1139933 1142147 1145811
63020 1145811 1150911 1156781 1163402 1171345 1180679 1190952 1202296 1215548 1230871 1247114 1263236 1279818
63008 1279818 1298341 1319227 1341497 1364425 1388698 1415593 1445642 1478711 1514885 1554541 1597627
62997 1597627 1643580 1691945 1742533 1795051 1849454 1906901 1969390 2037664 2110005 2183883 2258287
62986 2258287 2333583 2409561 2485012 2559311 2633112 2706769 2779141 2848941 2916647 2983884 3050966
62975 3050966 3116104 3177349 3234443 3288046 3337544 3380448 3414022 3436798 3448155 3447110 3432475
62964 3432475 3404273 3364199 3314347 3256016 3190205 3118735 3044162 2968771 2894266 2822358 2754925
62953 2754925 2693343 2638061 2589078 2546568 2510911 2482388 2461127 2447411 2441925 2445361 2457280 2475519
62941 2475519 2497533 2522725 2552632 2588194 2627611 2667816 2707341 2746484 2785306 2823186 2860240
62930 2860240 2897208 2933380 2966375 2994810 3019578 3041176 3057155 3063950 3060481 3048145 3027615 2997528
62918 2997528 2956644 2905758 2846837 2781397 2710521 2635630 2558233 2479120 2398494 2316975 2236091
62907 2236091 2157737 2083371 2013739 1949126 1889592 1834802 1783887 1735903 1690592 1648379 1609456
62896 1609456 1573210 1538723 1505461 1473132 1441296 1409618 1378315 1347901 1318646 1290679 1264308
62885 1264308 1239698 1216378 1193751 1172108 1152527 1135607 1120707 1106532 1092138 1077315 1062531
62874 1062531 1048691 1036609 1026415 1017653 1009921 1003110 997096 991730 987282 984314 982692 981126 978207
62861 978207 973732 968581 963455 958271 952781 947236 942116 937536 933268 929152 925096 920720 915428 909032
62847 909032 902082 895387 889459 884567 880970 878616 876770 874518 871761 869244 867452 865999 864434 863178
62833 863178 863044 863995 865012 865271 864997 864840 864838 864396 863176 861478 859527 856896 853237 849515 847660 848454 850248
62816 850248 850530 848656 846302 845162 844994 844311 842376 839928 838138 837368 836931 835829 833846 831978 831570 832890
62800 832890 834808 835993 836043 835369 834479 833781 833606 833926 834310 834530 834928 835733 836364 835983 834565 832895 831626
62783 831626 830855 830547 830802 831688 833169 835198 837480 839295 840059 839990 839679 838996 837094 833642 829582 826394
62767 826394 825005 825588 827854 831156 834603 837579 840253 843466 848140 854694 862748 871301 879476 887185
62753 887185 894893 902779 910602 918493 927347 937994 950227 963038 975683 988233 1001261 1015297
62741 1015297 1030465 1046401 1062782 1080315 1100886 1125940 1154580 1184028 1212435 1240802 1271717
62730 1271717 1306720 1345571 1387728 1433483 1483489 1538078 1597621 1662979 1734927 1813305 1897200
62719 1897200 1985825 2078876 2176181 2277295 2381172 2485880 2588891 2688092 2782241 2870025
62709 2870025 2948949 3015785 3067959 3103984 3122926 3124366 3108837 3077462 3031024 2970210 2896796
62698 2896796 2813685 2723453 2627618 2527574 2425337 2322903 2221714 2123226 2029149 1940430
62688 1940430 1856638 1777013 1701525 1630388 1563371 1500410 1442241 1389440 1341377 1297148 1257126
62677 1257126 1222465 1193221 1168056 1145766 1126196 1109600 1095999 1085306 1077279 1071200 1066252 1062363
62665 1062363 1060085 1059608 1060513 1062580 1066047 1070901 1076694 1083472 1092257 1104026 1118513 1134532 1151464
62652 1151464 1170148 1192238 1218766 1249483 1283674 1321395 1363490 1410515 1462338 1518920 1580629
62641 1580629 1647352 1718188 1792756 1871876 1955948 2043399 2132018 2221294 2311890 2402960 2491558
62630 2491558 2574830 2651376 2720025 2778590 2824500 2855827 2871312 2870397 2853733 2822769 2778315 2720326
62618 2720326 2649556 2568534 2480360 2387395 2291673 2195641 2101523 2010358 1922279 1837309 1755564
62607 1755564 1677371 1603632 1535293 1471920 1411654 1353346 1298093 1247975 1203913 1165364 1131208
62596 1131208 1100042 1070443 1042247 1017097 996592 980153 965648 951683 938130 924828 911184
62585 911184 897151 883334 869923 856604 843768 832733 824310 818035 813310 810505 810292 812369 815421
62572 815421 818091 819733 820456 820702 820568 819532 817170 814044 811297 809360 807794 806519 806325 807685 809871
62557 809871 811986 814395 818319 824215 831377 839188 848075 858918 871890 886213 900903 915637 930997
62544 930997 947961 967019 987743 1009358 1031876 1056587 1085190 1118340 1155161 1194286 1235292
62533 1235292 1278865 1325555 1374653 1424426 1473193 1519854 1563512 1603004 1636924 1663891 1682832
62522 1682832 1693389 1696252 1692756 1683710 1668677 1646656 1617427 1581975 1541734 1497951 1452020 1405738
62510 1405738 1360506 1316366 1272553 1229166 1187676 1149493 1114722 1082829 1053839 1028000 1004762
62499 1004762 983280 963896 947891 935518 925369 916210 908319 902249 897319 892493 888007 884815 882852
62486 882852 881340 880719 882555 886967 891537 893772 893889 894301 896905 901722 907649 913440 918125 921584 924984
62471 924984 929975 937167 945988 956224 968926 985178 1004430 1024867 1045451 1067008 1091185 1118878
62459 1118878 1150029 1184553 1222805 1265046 1310804 1359109 1409395 1462067 1518077 1577877 1640740
62448 1640740 1705119 1769468 1832460 1892411 1947111 1994781 2035096 2068818 2096460 2117810 2132726
62437 2132726 2141832 2146222 2147034 2145689 2144143 2144462 2148335 2157165 2172116 2193608 2221240 2254825 2295188
62424 2295188 2343249 2398672 2460247 2527425 2600421 2678715 2760372 2843001 2924060 2999572 3063876
62413 3063876 3112236 3143578 3159724 3162136 3150246 3122607 3078307 3017086 2939420 2847325 2744410
62402 2744410 2634385 2519817 2402652 2285224 2170027 2058961 1953581 1855699 1766846 1687236
62392 1687236 1616018 1552559 1496644 1447452 1403450 1363869 1329550 1301576 1279425 1261174 1245292
62381 1245292 1231650 1220835 1213145 1208432 1206401 1206609 1208209 1209969 1210823 1210477 1209378 1207839 1205174 1200012
62367 1200012 1191578 1180458 1167891 1154549 1140286 1124831 1108326 1091147 1073600 1056053 1039255
62356 1039255 1024182 1011255 999701 987991 975298 962423 950998 941869 934561 928149 922115 916413
62344 916413 911366 907590 905305 903492 900525 896128 891957 889698 889216 889328 889779 891393 894562 898655 903072
62329 903072 908108 914512 922576 931742 940922 949442 957993 968247 981059 995447 1009832 1023843 1038269
62316 1038269 1053897 1071272 1090948 1112770 1135321 1157505 1180509 1206733 1236732 1268744 1301541
62305 1301541 1336206 1374437 1416505 1461883 1510825 1564216 1622446 1685346 1752880 1825293 1902913
62294 1902913 1986017 2074152 2165151 2255419 2341517 2420879 2491050 2549613 2595541 2629450 2651736
62283 2651736 2661566 2658525 2644042 2619914 2586370 2542952 2490557 2431205 2366537 2298130 2228750 2161358
62271 2161358 2096728 2033595 1971455 1911919 1856981 1807170 1761914 1720693 1683134 1648735 1617103
62260 1617103 1587998 1560677 1533538 1504939 1474461 1443418 1414113 1388132 1365037 1343076 1321539
62249 1321539 1301725 1284989 1270635 1256899 1243439 1231446 1221446 1212528 1203959 1196109 1189267 1182784
62237 1182784 1176210 1170375 1166402 1164144 1162258 1159590 1156099 1152678 1150300 1149046 1147992 1146529 1145657 1147221
62223 1147221 1151865 1158585 1166298 1174640 1182934 1189845 1195147 1200923 1209867 1222794 1238620 1256160 1274885
62210 1274885 1294383 1314488 1336133 1361034 1390077 1422629 1457722 1495381 1536440 1581538 1630774
62199 1630774 1684219 1742387 1806148 1876236 1952809 2035299 2122627 2213440 2305949 2397502 2484572
62188 2484572 2563648 2632480 2690401 2737224 2771973 2793123 2800107 2794051 2776626 2748500 2709267 2658582
62176 2658582 2596916 2525548 2446534 2362697 2277020 2191707 2107931 2026343 1947583 1872545 1802550
62165 1802550 1738983 1682202 1630975 1583572 1539359 1498790 1462137 1429083 1399497 1373680 1351523
62154 1351523 1332142 1314664 1298905 1285126 1273623 1264537 1257427 1251035 1244354 1238110 1234390 1234405 1237272
62141 1237272 1241180 1244933 1248170 1251166 1255104 1261691 1271703 1284329 1298360 1313270 1328691 1343916
62129 1343916 1358822 1374449 1391584 1409465 1427062 1444986 1464609 1485522 1505578 1523804 1541865
62118 1541865 1561904 1583857 1605766 1626132 1645122 1663796 1683041 1703480 1725919 1751405 1780868
62107 1780868 1814789 1853286 1896426 1944411 1997477 2055551 2117653 2181343 2243184 2300438 2352224
62096 2352224 2398192 2436099 2462028 2473867 2473812 2466316 2453860 2435556 2409576 2375667 2335049 2288852
62084 2288852 2237513 2181571 2122585 2063145 2005828 1952013 1901721 1854637 1811083 1771910 1737780
62073 1737780 1708780 1684318 1663121 1643763 1625600 1608842 1593467 1578677 1563961 1550019 1537849
62062 1537849 1527375 1517897 1509376 1502305 1496750 1492706 1491091 1492757 1496316 1498406 1496677 1491402 1483842 1474609
62048 1474609 1464593 1456023 1450729 1447638 1443379 1435428 1423861 1410243 1395959 1381902 1368833 1357361
62036 1357361 1347618 1339195 1331450 1324131 1317864 1313757 1312196 1312437 1313784 1316727 1322179 1329871 1338471 1347390
62022 1347390 1357583 1370177 1385045 1401300 1418750 1438227 1460586 1485889 1513568 1542975 1573634
62011 1573634 1605237 1637705 1671382 1707074 1745632 1787267 1831326 1876973 1924036 1973008 2024112
62000 2024112 2076463 2128025 2176168 2218445 2253385 2280837 2301262 2314556 2319726 2315737 2302287 2279648
61988 2279648 2248343 2209434 2164587 2115035 2060549 2000191 1934340 1865447 1796546 1729410 1664419
61977 1664419 1601786 1542272 1486692 1435055 1386386 1339523 1294346 1252343 1215661 1185145 1159322
61966 1159322 1135531 1112140 1089559 1069211 1051781 1036474 1021684 1006231 990056 973935 958646
61955 958646 944420 931116 918725 907507 897704 889244 881769 874831 868116 861729 856334 852796 851396
61942 851396 851439 851925 852635 854279 857312 860950 863823 865504 866779 868255 869427 869569 868901 868048 866662 863627
61926 863627 858672 852845 847071 841011 833771 825046 815198 804927 795465 788342 783987 780901 777063 772037
61912 772037 767053 763296 760897 759403 758284 756918 755000 753174 752509 753093 753810 753770 753218 752653 751875 750681
61896 750681 750008 751471 755742 761936 768654 775258 782141 790132 799857 811352 823993 836777 848983
61883 848983 860859 873652 888730 906532 926571 948466 972532 999019 1027146 1055419 1082710
61872 1082710 1108552 1132599 1154514 1174440 1192962 1210320 1226064 1239636 1250954 1260273 1267758 1273253
61860 1273253 1276200 1275914 1272293 1266261 1259125 1251762 1244940 1240111 1238797 1241087 1245648 1251563 1259312 1269612
61846 1269612 1282170 1296153 1311074 1326413 1340973 1353496 1363620 1371550 1377053 1379471 1378496 1374209
61834 1374209 1366502 1355124 1340362 1323168 1304619 1285665 1267271 1250183 1234363 1219048 1203591
61823 1203591 1188080 1173081 1158976 1145635 1132596 1119415 1105828 1091711 1077205 1063078 1050625
61812 1050625 1040660 1032681 1025594 1019211 1014413 1011809 1011184 1012576 1016931 1024845 1035298 1046572 1058161
61799 1058161 1070966 1085767 1102346 1120267 1139914 1162441 1188892 1219454 1253469 1290155 1329203
61788 1329203 1370339 1412464 1453890 1493695 1532200 1569672 1605256 1637675 1666274 1690537 1709156
61777 1709156 1720673 1724956 1723267 1717053 1707476 1695980 1684311 1673685 1664577 1657452 1653106 1652147 1654717
61764 1654717 1660815 1670276 1682268 1695401 1708530 1720915 1731320 1737594 1737720 1731179 1718954 1702267
61752 1702267 1681489 1656199 1626143 1592173 1556271 1520537 1486114 1453036 1420988 1390101 1361100
61741 1361100 1334697 1310715 1287873 1264785 1241254 1218321 1197107 1178134 1161598 1147305 1133937
61730 1133937 1119438 1103023 1086169 1070836 1057257 1044427 1032167 1021424 1012734 1005697 1000062 996210
61718 996210 994112 992637 990322 986342 980607 973632 966550 960665 956596 954128 952914 952830 953676 955115 956998
61703 956998 959280 961680 964011 966695 970198 974030 977251 980018 983562 988355 993384 997693 1001546 1005201
61689 1005201 1007503 1006937 1003718 999691 996065 992115 986428 978912 971163 965027 961060 958351 955593 952036
61675 952036 947417 941562 934596 927364 921027 916187 912877 911232 911457 913092 915088 916902 918737 920402
61661 920402 920850 919621 918132 918537 921410 925267 928380 930304 931416 931593 929955 925915 920118 914193 909616
61646 909616 906814 905094 903151 899710 894167 886910 878871 870596 862016 853211 844871 837585 831145 825072
61632 825072 819402 814271 809154 803399 797323 791889 787358 783146 779046 775628 773251 771565 770119 768586
61618 768586 766214 762206 757166 753115 751237 750441 748983 746862 745538 745695 746410 746591 746318 746466 747562 749402
61602 749402 751542 753838 756478 759637 763241 767133 771228 775363 779318 783289 787997 793722 799549 804310
61588 804310 808140 812166 816718 820840 823740 825623 826789 827118 827140 828431 831855 836145 839314 840953 842067
61573 842067 843051 843168 842025 840430 839357 838797 838049 836708 834964 833099 830901 827591 822344 814984 806159
61558 806159 796893 788160 780713 774679 769129 762653 754831 746795 739967 734658 730233 726094 721788 716537
61544 716537 709594 701241 692922 686088 681012 676702 671832 665878 659538 654036 650014 647230 645067 642812
61530 642812 639561 634705 628787 623200 618654 614664 610899 608181 607279 607386 606898 605485 604420 604751 605871
61515 605871 606117 604332 600768 596822 593992 592876 593055 593920 595368 597606 600632 604068 607235 609415 610558
61500 610558 611785 614371 617876 620060 619182 615789 611850 609021 608332 610399 614646 618935 621370 622325 623632
61485 623632 625987 628286 629453 629727 629989 630773 632195 634028 635640 636554 637143 638062 639034 639133 638428 638319 639844
61468 639844 642396 644553 645509 645352 644650 644295 645068 646630 647320 645650 641959 638169 636034 635935 637126 638588
61452 638588 639525 639552 638865 638231 638368 639068 639185 638017 636621 637030 639861 643306 645054 644817 644429 645804 649399
61435 649399 654396 659672 664572 669209 673935 678344 681244 682069 681769 681606 681615 681253 681078 682499 685803 689638
61419 689638 692676 694859 696845 699277 702951 708614 715885 723110 728910 733290 736751 738985 739208 737418
61405 737418 734630 731934 729658 727240 723647 718201 711334 704431 698795 694898 692433 690519 687892 683756
61391 683756 678907 675417 674701 676241 678536 680823 683441 686912 691194 695624 699217 701306 702265 703394 705726
61376 705726 709123 712719 715911 718596 720872 722969 725264 727964 730882 733736 736400 738667 740248 741398
61362 741398 743102 746071 749955 754141 758906 764842 771305 776532 779614 781523 783732 786564 789497 792388
61348 792388 795358 797744 798307 796769 794322 792101 789811 786544 782518 779164 777517 777270 777536 777969 778860
61333 778860 780660 783669 787775 792170 795745 798101 799892 801871 803963 805645 806831 807999 809684 812158
61319 812158 815150 817491 817631 815247 812059 810331 810700 812083 813378 814407 815235 815559 815111 814183 813491 813739
61303 813739 815086 816626 816752 814891 812752 812912 816075 820538 824411 827415 830360 834073 839528 847907 859359
61288 859359 871998 883100 891353 897491 902971 908605 914451 920493 927075 934679 943207 951629 958708 964242
61274 964242 969330 975291 982518 990369 997636 1003037 1005835 1006413 1005845 1004587 1002054 998068 994304 993464 996789
61259 996789 1002891 1009336 1015114 1021276 1029277 1039134 1049492 1059277 1068744 1078791 1089768 1101456 1113895
61246 1113895 1127559 1142803 1159574 1177535 1195812 1212650 1226177 1235946 1243274 1249644 1255051 1258180
61234 1258180 1257849 1253912 1246969 1237627 1226163 1212781 1198061 1182958 1168148 1153430 1138063 1121818
61222 1121818 1105651 1091305 1080079 1071615 1063848 1054710 1044316 1035130 1029612 1028114 1029358 1032277 1036574
61209 1036574 1042013 1048172 1054720 1061144 1066449 1070075 1072933 1076553 1081315 1086572 1092435 1100190 1110706 1123412
61195 1123412 1137051 1150399 1162012 1170557 1176155 1180652 1185990 1192741 1200297 1207557 1213203 1216364 1217494
61182 1217494 1217802 1217471 1215447 1211395 1206709 1202868 1199755 1196456 1192877 1189635 1186946 1184562 1182493 1181235
61168 1181235 1181563 1184366 1190107 1198158 1207418 1217866 1230617 1245947 1262175 1277075 1289661 1300248
61156 1300248 1309812 1319758 1331052 1342812 1352997 1361269 1369881 1380585 1391979 1401350 1408125 1413944 1420207
61143 1420207 1427095 1434332 1441324 1447113 1451813 1457577 1466495 1477825 1489015 1499205 1510043 1523071 1537928
61130 1537928 1553246 1567720 1580058 1589372 1596106 1601435 1605451 1607076 1605866 1602560 1597614 1590538 1581300
61117 1581300 1571213 1561777 1553434 1545840 1538465 1530548 1521421 1511397 1501606 1492541 1483421 1473210 1461535
61104 1461535 1448506 1434538 1420654 1407956 1396314 1384346 1371120 1357155 1343401 1330070 1317050
61093 1317050 1304923 1294892 1287886 1283886 1281939 1280969 1280972 1282980 1287228 1291915 1294867 1295945 1296409 1296246 1294035
61078 1294035 1289735 1285627 1283731 1283771 1284626 1286400 1290041 1296072 1304673 1315896 1328913 1342254 1355910 1372057
61064 1372057 1392485 1416446 1442452 1470959 1503302 1538751 1574954 1611272 1649546 1691056 1734584
61053 1734584 1778490 1823338 1871091 1922233 1974762 2026052 2075120 2122933 2170846 2218992 2266260
61042 2266260 2311566 2354616 2395249 2432594 2465436 2493199 2516143 2534799 2549684 2561350 2570214
61031 2570214 2576381 2579940 2581287 2580855 2578756 2574983 2569772 2563522 2556762 2550301 2544630 2538642 2529825 2516797
61017 2516797 2501168 2485780 2471377 2456222 2438898 2420158 2401603 2383607 2365155 2345133 2323414
61006 2323414 2301261 2280861 2263617 2248526 2233076 2216214 2199608 2185338 2173351 2162327 2152277
60995 2152277 2144680 2140176 2137795 2136992 2138981 2145040 2154626 2166555 2181354 2200765 2224967 2252059 2280854
60982 2280854 2312633 2349140 2390126 2434389 2482356 2535727 2594712 2657505 2722933 2792156 2867228
60971 2867228 2949342 3039167 3137429 3243961 3357172 3475721 3599978 3730835 3868055 4011298
60961 4011298 4162232 4324118 4499732 4691168 4901281 5133533 5390365 5673443 5985880
60952 5985880 6332964 6720771 7155708 7645342 8197572 8818804 9515420 10297768 11180494
60943 11180494 12179140 13310897 14600388 16079554 17778069 19717517 21913198 24357010
60935 24357010 26962189 29513725 31706551 33286021 34187240 34550363 34609555 34573114 34585683
60926 34585683 34737931 35039663 35360466 35433589 34975411 33842527 32096860 29938660 27586490
60917 27586490 25202388 22885621 20694458 18660317 16794136 15095618 13562596 12192909
60909 12192909 10981249 9918670 8994941 8198497 7514015 6922750 6406716 5951911 5547845
60900 5547845 5186033 4860001 4565471 4299260 4058377 3840516 3644403 3468761 3311399
60891 3311399 3169758 3041590 2924550 2816102 2714745 2620528 2533357 2451626 2373715 2300101
60881 2300101 2232301 2169960 2110606 2052524 1996413 1943719 1894514 1847633 1801970 1756978 1712665
60870 1712665 1669722 1629158 1591330 1555808 1522382 1491464 1463126 1436523 1410809 1385978 1362190
60859 1362190 1339031 1316239 1294641 1275398 1258504 1242853 1227724 1213500 1200851 1189763 1179469
60848 1179469 1168979 1157694 1145905 1134657 1124740 1115806 1106829 1097400 1088191 1080038 1072960 1066186 1058968
60835 1058968 1051164 1043189 1035598 1028709 1022436 1016372 1009995 1002919 994973 986035 975843 964323 952217
60822 952217 940931 931272 922627 913851 904770 896177 888585 881852 876091 871926 869492 868026 866968 866676
60808 866676 867355 868058 867725 866817 866898 868712 871567 874607 877797 881449 885532 889851 894363 898926 903082 906535
60792 906535 909595 912761 915933 918341 919230 918385 916021 912510 908495 905041 903099 902565 902119 900341 896791
60777 896791 891784 885479 877843 869339 860796 852346 843202 832911 822206 812069 802464 792759 783167
60764 783167 774906 768789 764156 759469 753686 747012 740604 735670 732575 730522 728118 724425 719643 714882
60750 714882 711204 708805 707116 705587 704124 702658 700860 698732 696964 695923 694638 691993 688917 687968
60736 687968 690164 693466 695343 695817 696723 698707 700651 701934 703692 707241 712162 716529 718570 717868 715479
60721 715479 713128 711878 711455 711180 711262 712380 714009 714259 711962 708081 704421 701579 698996 696549 694922
60706 694922 694331 693806 692284 689864 687485 685672 684197 682883 682081 681977 681896 680933 679215 677946 677966 678744 679166
60689 679166 679031 679266 680804 683801 687907 692700 697481 701094 702584 702055 700431 698226 694981 690306 685053
60674 685053 680644 677233 673432 668420 663491 660539 659521 658639 656989 655659 655827 657022 658122 659081 660637
60659 660637 662908 665335 667599 669625 671034 671712 672833 676087 681535 686991 689961 689726 687430 684779 682910
60644 682910 682107 682204 683297 685849 689772 693676 695689 694953 691813 686916 681130 676157 673809 674055 674740 673835
60628 673835 671247 668023 664803 661877 659763 658559 657386 655842 655585 658866 665373 672059 676590 679671
60614 679671 683107 686824 689128 689273 688211 686871 685123 682909 681234 681102 682029 682490 681581 679607 677237
60599 677237 674790 672396 670171 668069 666102 664941 665842 669485 675052 680715 684986 687551 689105 690657
60585 690657 692848 695578 698129 699649 699591 697980 695530 693355 692132 691478 690395 688312 685424 682154 678865
60570 678865 676060 674205 673207 672605 672440 673180 674556 675331 674819 673946 674159 675818 678387 681569 685257 688657
60554 688657 690474 690100 688062 685409 683212 682431 683428 685532 687579 688846 689148 688528 687625 687974 690876 695831
60538 695831 700828 704213 705657 705648 705088 705395 707779 711961 716377 719856 722337 723915 724409 724355 725273 728124
60522 728124 732201 736223 739837 743500 747609 752526 758740 766151 773747 780836 788151 796880 807103 818146
60508 818146 829966 842980 856829 870691 884862 900474 917037 931695 941982 948569 953995 959114
60496 959114 962138 961342 957412 952429 947500 942651 938718 937772 940972 946988 953524 959983 967636 977511 989409
60481 989409 1003206 1019838 1040213 1063890 1089636 1116789 1145317 1174943 1204968 1234596 1262645
60470 1262645 1287239 1306779 1321226 1331605 1338181 1340062 1336822 1329639 1320282 1309583 1297450 1283951
60458 1283951 1269796 1255992 1243496 1233051 1224951 1219089 1215481 1214593 1216861 1222103 1229708 1239243 1250668
60445 1250668 1264318 1281019 1301942 1327875 1358875 1395002 1436958 1485210 1538744 1595615 1654722
60434 1654722 1716002 1778607 1839960 1897336 1949645 1996987 2039095 2075158 2104676 2127450 2142719
60423 2142719 2149017 2144805 2128701 2099513 2057062 2003009 1940081 1870537 1796164 1719547 1643864 1571006
60411 1571006 1500934 1433492 1369874 1311654 1259242 1212106 1169821 1132017 1097889 1066734 1038667
60400 1038667 1013991 992125 971910 952808 935152 919386 905623 893608 882502 871054 858737
60389 858737 846478 835641 826600 819010 812960 808773 805866 802982 799637 796355 793310 789731 785053 779887
60375 779887 775417 772224 769899 767386 763758 759220 755314 753465 753350 753345 752492 751176 749921 748544 746766
60360 746766 744809 743067 741904 741855 743107 744622 744817 743569 742612 743522 746170 749572 753201 756851 760173
60345 760173 763193 766524 770398 774247 777740 781256 784643 786896 788162 790706 796041 802014 804937 804401
60331 804401 803795 805792 809394 812330 814557 817888 823161 829296 834707 838387 839803 839002 837178 836306 837709
60316 837709 841277 846210 852009 858260 863949 867837 869752 870973 872897 875632 878265 880258 881977 883983
60302 883983 886405 889066 891631 893652 895238 897849 903442 912187 921831 930059 936928 944140 952594 961768
60288 961768 971061 980280 988641 994619 997426 997772 996596 993743 988553 981216 972896 964797 957625 951659
60274 951659 946765 942455 938415 934861 932053 929742 927574 925844 925124 925170 924902 923768 922605 922761 924657
60259 924657 927554 930463 932930 935190 938025 942419 948952 957536 967940 980289 994583 1009946 1025138
60246 1025138 1039910 1055181 1071533 1088131 1103523 1117004 1128651 1138392 1145604 1149360 1148663 1142727
60234 1142727 1131565 1116150 1097731 1077371 1056516 1037218 1020873 1007088 994721 983714 974887
60223 974887 968162 962309 956732 952386 950378 950471 951353 951663 950303 946545 940526 933335 926183 919642 913649
60208 913649 907710 901114 893608 885979 879299 873639 868373 863699 860631 859248 858286 856991 856093 856215 856678
60193 856678 856863 857512 859388 861654 863072 863980 865478 867282 868185 868486 870096 873913 878521 881979 883729
60178 883729 884268 883998 883148 882191 881718 882123 883530 885662 887827 889681 891975 895793 900900 905666 909000 911716
60162 911716 915626 921783 930005 939543 949599 959394 968322 976357 984144 992499 1001677 1011249 1020932 1031327
60148 1031327 1043281 1056536 1069841 1082721 1096120 1110610 1124881 1137145 1147463 1157431 1167813
60137 1167813 1177688 1185904 1192266 1197248 1201544 1205869 1210166 1212951 1212549 1209080 1204186 1198813 1192556 1185383
60123 1185383 1178379 1172128 1165794 1158718 1151679 1145404 1138812 1130162 1119380 1108108 1097877 1089314 1082638
60110 1082638 1077597 1073088 1068063 1062908 1058871 1056117 1053481 1050361 1047596 1045892 1044480 1042254 1039523 1037535
60096 1037535 1036630 1036029 1035512 1036166 1038871 1042703 1045672 1046849 1047157 1048157 1050650 1054533 1059335 1064470 1069432
60081 1069432 1074210 1079310 1084930 1090347 1094774 1098754 1104069 1111891 1121436 1130852 1139295 1147668 1157277 1168164
60067 1168164 1179190 1189526 1199394 1209105 1218031 1225296 1231231 1237299 1244555 1252942 1262101 1271816 1281317
60054 1281317 1289281 1295390 1301008 1307325 1313518 1317946 1320668 1323464 1327457 1331981 1335882 1338732 1340401 1340478
60040 1340478 1338661 1335102 1329998 1323363 1315501 1307193 1299254 1292308 1286895 1282977 1279204 1273617 1265560 1256395
60026 1256395 1248041 1241308 1235742 1230384 1224380 1217550 1210723 1204942 1200104 1195031 1189183 1183452 1178707 1174165
60012 1174165 1167860 1158475 1146395 1133341 1121252 1111048 1102190 1093739 1085632 1078144 1070289 1060258 1048045
59999 1048045 1036241 1027127 1019981 1012562 1004448 997376 992595 989476 986969 985109 984609 985834 988749 993262
59985 993262 998980 1004946 1010139 1014432 1019050 1025917 1036009 1048061 1059269 1067784 1074154 1079939 1085425
59972 1085425 1089690 1092593 1095469 1099418 1103759 1106678 1106784 1103572 1096968 1087244 1075185 1061691 1047291
59959 1047291 1032549 1018779 1007384 998047 988349 976086 961881 948611 938181 929758 921589 913541
59947 913541 906740 901283 895690 888894 881680 875683 871675 869288 867779 866494 865040 863575 862695 862689 863241
59932 863241 864121 865707 868432 872161 876504 881262 886156 890662 894800 899643 906201 913934 921087 926397
59918 926397 929822 931616 931498 929116 924942 920275 916243 912809 908926 903990 899115 896364 896463 897911 898785
59903 898785 898762 898720 899069 899581 900615 903211 907661 912770 916880 919148 919746 919406 918927 918668 918398 918064 918460
59886 918460 920412 923333 925560 926456 927284 929473 932717 935422 936481 935941 934401 932622 931579 932099 934283
59871 934283 937726 942330 948457 956172 964807 973397 981228 987758 992331 994362 993794 991230 987623 983937
59857 983937 980950 979099 978358 978499 979643 982332 986609 991179 994166 995159 995961 998655 1003193 1007684 1010893
59842 1010893 1013354 1015720 1017243 1016954 1015631 1015250 1016480 1017963 1018362 1018051 1018169 1019021 1020435 1023135 1028474
59827 1028474 1036718 1046572 1056613 1066361 1075609 1083679 1090203 1096170 1103218 1111888 1121280 1130493 1139644 1148982
59813 1148982 1157570 1163717 1166958 1168995 1172052 1176333 1179712 1180201 1178207 1175869 1174645 1174391 1174559 1175105 1175886
59798 1175886 1176329 1176482 1177625 1180903 1185848 1191139 1196427 1202470 1209745 1217992 1226992 1236751 1246852 1256546
59784 1256546 1265550 1273725 1279845 1281946 1279504 1274398 1269122 1264788 1261344 1258750 1256861 1254688 1250894 1245056
59770 1245056 1237901 1230445 1223379 1217010 1211160 1205154 1198440 1191238 1184237 1177724 1171272 1164238 1156375 1148145
59756 1148145 1140555 1134461 1129910 1126480 1124246 1123778 1124954 1126534 1127425 1127736 1127926 1127613 1126130 1123849 1121882
59741 1121882 1120622 1119448 1117753 1115384 1112059 1107377 1101618 1095760 1090405 1085286 1079977 1074399 1068566 1062685
59727 1062685 1057690 1054580 1052710 1049770 1044279 1037324 1030965 1025785 1021255 1017769 1016496 1017103 1017361 1015743
59713 1015743 1013245 1011832 1012130 1013545 1015765 1018857 1022345 1025413 1027992 1030814 1034554 1039644 1046559 1055231
59699 1055231 1064440 1072969 1081233 1090504 1100681 1110418 1119613 1129856 1141771 1153788 1164754 1176060
59687 1176060 1189541 1204625 1219382 1233329 1247060 1259734 1269250 1275050 1278902 1282672 1286747 1290721
59675 1290721 1294021 1295664 1294909 1292560 1290324 1288655 1286501 1283256 1279451 1275330 1270449 1265094 1260434 1256764
59661 1256764 1253272 1250065 1248439 1248191 1246693 1242211 1236522 1232563 1230784 1229633 1228583 1228597 1230054 1232140 1234307
59646 1234307 1236850 1239973 1243463 1247447 1252607 1259459 1267865 1277053 1285764 1292938 1298780 1304557 1310830 1316620
59632 1316620 1320922 1324079 1326901 1329414 1331421 1333226 1334616 1334117 1330784 1325955 1321710 1318141 1313704 1307773
59618 1307773 1301126 1294142 1286298 1277617 1269128 1261471 1254149 1246412 1237999 1228909 1219387 1210215 1202277 1195845
59604 1195845 1190882 1187585 1185684 1183678 1180062 1175224 1171013 1168577 1167641 1167672 1168562 1170330 1173324 1178543 1186411
59589 1186411 1195352 1202878 1208111 1211892 1214434 1214518 1211402 1206105 1200122 1193924 1187234 1179850 1171660 1162591
59575 1162591 1152944 1143262 1133813 1124848 1117181 1111459 1106832 1101551 1095084 1088726 1083821 1080227 1076698 1072017
59561 1072017 1065779 1058856 1052887 1048342 1043339 1035651 1025740 1016460 1009822 1005464 1002274 999838 997968 996414
59547 996414 995587 996190 997646 998300 997678 997158 997890 999525 1001531 1004075 1006704 1007822 1006770 1005193 1005051 1006267
59531 1006267 1007532 1008464 1009645 1011271 1013189 1015733 1019204 1022618 1024146 1022906 1019711 1016026 1012630 1009226
59517 1009226 1005115 1000287 995716 992173 989074 985347 981366 978825 978442 978868 978268 976018 972598 968935 966286
59502 966286 965563 966187 966655 966739 967940 971184 975351 978767 980863 981588 980749 979240 979653 983925 990950 997803
59486 997803 1002916 1006955 1011155 1016064 1021758 1028309 1035997 1045488 1057546 1072384 1089853 1110254 1133642
59473 1133642 1157785 1178208 1191382 1197130 1197275 1193251 1186080 1177371 1168724 1160825 1154254 1150254 1149338 1150108
59459 1150108 1151026 1152619 1156140 1160569 1162951 1161827 1158763 1156083 1154335 1152241 1148107 1140886 1130655 1118590
59445 1118590 1106279 1095002 1085569 1078141 1071723 1064569 1055880 1046709 1038646 1032170 1026785 1022039 1017836
59432 1017836 1014616 1013782 1016796 1022933 1029091 1032948 1035294 1038087 1041550 1044666 1047325 1050085 1052725 1055058
59418 1055058 1058485 1064614 1072715 1080569 1087540 1094773 1102634 1110163 1117071 1123983 1130415 1134813 1137231 1139816
59404 1139816 1143729 1147458 1149303 1149823 1150604 1152031 1153715 1156073 1159949 1165131 1170398 1174905 1178794 1182704
59390 1182704 1187254 1192846 1199581 1207356 1215997 1224975 1233301 1240286 1246186 1251339 1254921 1255517 1252849 1248082
59376 1248082 1242534 1237090 1232644 1229798 1227962 1225852 1223055 1220214 1217900 1216529 1217195 1220887 1226779 1233005
59362 1233005 1239526 1248616 1261928 1278675 1297363 1317727 1340090 1364437 1391200 1421616 1456206 1494145
59350 1494145 1534835 1578113 1621133 1656857 1678454 1685096 1681804 1674077 1664545 1654411 1645633 1640629
59338 1640629 1641056 1647400 1658528 1670860 1679013 1678462 1667886 1649144 1625512 1599919 1573970 1547988
59326 1547988 1522008 1496757 1473514 1453212 1436123 1422193 1410922 1400954 1390727 1380035 1370375 1363260
59314 1363260 1358558 1354992 1351909 1349812 1349142 1349294 1349284 1349029 1349443 1351308 1354444 1357965 1360974 1362947 1363929 1364727
59298 1364727 1366661 1370741 1377131 1385510 1395593 1406957 1418725 1430086 1441175 1453068 1466845 1482910
59286 1482910 1501065 1520830 1541678 1563180 1584900 1606020 1625432 1642493 1657292 1669718 1678756
59275 1678756 1683491 1684524 1683359 1680344 1674169 1663800 1650090 1634934 1619332 1602920 1585091 1565902
59263 1565902 1545751 1524658 1502297 1478825 1455374 1433388 1413495 1395370 1378672 1363509 1349898
59252 1349898 1337375 1325547 1314410 1303756 1293065 1282568 1273648 1267327 1263077 1260205 1259683 1263095 1270036
59239 1270036 1278183 1286193 1295113 1306159 1317958 1326666 1328484 1322018 1308892 1292499 1275742 1259661
59227 1259661 1244147 1229406 1216137 1204728 1195195 1187717 1182400 1178774 1176428 1175945 1178212 1183025 1189442
59214 1189442 1197309 1207221 1219124 1232332 1246935 1263801 1282865 1302703 1322095 1340872 1359002 1376047
59202 1376047 1391804 1406235 1418542 1427569 1433282 1436409 1436626 1433025 1426786 1421199 1417958 1415410 1411736
59189 1411736 1407979 1406178 1406031 1405463 1403515 1400894 1398437 1396825 1397123 1399696 1402906 1404506 1404098 1402732 1400529
59174 1400529 1396536 1390943 1385553 1381489 1377839 1373168 1367320 1361088 1354918 1348544 1341392 1332935 1322984 1311888
59160 1311888 1300182 1287982 1275010 1261201 1247077 1233628 1221889 1212198 1203642 1194887 1186010 1178821
59148 1178821 1174672 1172609 1170587 1168012 1166075 1165939 1167648 1170566 1173788 1176222 1177348 1178007 1179612 1182614
59134 1182614 1186542 1191307 1197260 1203870 1209598 1213553 1216320 1218741 1220738 1221836 1221980 1221240 1219529 1217382
59120 1217382 1216329 1217397 1219533 1220514 1219427 1217413 1215775 1214325 1212162 1209396 1207127 1205866 1204967 1203789
59106 1203789 1202489 1201111 1198874 1195450 1192374 1191685 1193109 1193972 1192403 1189327 1186576 1184242 1181054 1176457
59092 1176457 1170705 1163330 1153212 1140512 1127294 1115586 1105576 1096125 1086358 1076235 1066202 1056995
59080 1056995 1049416 1043558 1038366 1032585 1026189 1020309 1015644 1011667 1007840 1004990 1004513 1006395 1008985 1011003
59066 1011003 1012796 1015227 1018334 1022012 1027037 1034039 1041922 1048875 1054971 1062302 1072276 1084154 1096743
59053 1096743 1110096 1124602 1139510 1153551 1166284 1177761 1187432 1194591 1199782 1204671 1210369 1216521
59041 1216521 1222194 1227081 1231560 1235766 1238975 1240245 1239753 1238986 1239048 1239149 1237716 1234730 1231811 1229948 1228486
59026 1228486 1226678 1224775 1222920 1220339 1216623 1212529 1208368 1202723 1194267 1184027 1174201 1165281 1156050 1146164
59012 1146164 1136941 1129202 1121827 1113229 1103417 1093888 1086003 1080055 1075699 1072718 1071076 1070262 1069080 1066700
58998 1066700 1063785 1061709 1060609 1059223 1056990 1055015 1054153 1053376 1051354 1048765 1047456 1047683 1047695 1046096 1043420
58983 1043420 1041256 1040784 1042222 1044821 1047149 1048112 1047986 1048060 1049277 1051506 1053906 1055655 1056740 1058442 1062488
58968 1062488 1069234 1077315 1085598 1094512 1104654 1115314 1125865 1137770 1153304 1172512 1193028 1212843
58956 1212843 1231591 1249022 1264002 1275648 1284209 1290160 1293469 1294264 1293364 1291609 1289312 1286679 1284022
58943 1284022 1281386 1278692 1276414 1275311 1275380 1276006 1277339 1280524 1286080 1292854 1299033 1303681 1307106 1310395 1314705
58928 1314705 1320075 1324652 1326049 1324019 1321083 1319994 1321092 1322619 1323119 1323073 1324528 1329413 1337851 1348043
58914 1348043 1358207 1368588 1380842 1395507 1411111 1426198 1441269 1457986 1476993 1497112 1516304
58903 1516304 1532984 1546863 1559059 1571083 1583127 1593501 1600088 1602130 1600300 1595362 1587348 1576074
58891 1576074 1562003 1546238 1529717 1512522 1494140 1474361 1453765 1433324 1413787 1395519 1378509
58880 1378509 1362289 1346303 1330878 1317586 1308126 1302820 1300374 1298940 1297265 1295246 1293770 1293672 1294574 1295181
58866 1295181 1295014 1295139 1296585 1298702 1299951 1299828 1299090 1298396 1297635 1296412 1294390 1291286 1287362 1283796 1281839
58851 1281839 1281691 1282732 1284576 1287234 1290670 1295139 1301690 1311400 1324157 1338928 1355028 1372394 1390984
58838 1390984 1410759 1431916 1454202 1476332 1497025 1516314 1534894 1552784 1569988 1587988 1608809
58827 1608809 1632468 1656902 1680688 1704325 1728339 1751527 1771974 1788987 1803374 1816366 1828526
58816 1828526 1839061 1846012 1847817 1844944 1839442 1832895 1825409 1816301 1804912 1791040 1775704 1761375 1750127
58803 1750127 1741435 1732814 1722650 1711285 1699478 1687266 1674580 1661548 1647712 1632127 1614674 1596187
58791 1596187 1577116 1557293 1537342 1518903 1502765 1487828 1472453 1455984 1438717 1421516 1405706
58780 1405706 1392023 1379270 1365303 1349735 1334257 1319909 1305804 1291419 1278406 1268651 1261742 1255753
58768 1255753 1249618 1243418 1237137 1230693 1224854 1220823 1218975 1218875 1220357 1223628 1228322 1233223 1237280 1240588
58754 1240588 1244158 1248641 1253339 1256888 1259049 1261109 1263790 1265608 1264690 1261759 1259640 1259698 1260319 1259126 1255176
58739 1255176 1248615 1239825 1229694 1219432 1209355 1198922 1188382 1178979 1170931 1162724 1153329 1143813 1135842
58726 1135842 1129804 1125376 1122641 1121558 1121424 1121993 1124128 1128263 1133203 1137619 1141851 1147067 1153302 1159399
58712 1159399 1164208 1166850 1166431 1162656 1156364 1148720 1140290 1131303 1122021 1112266 1101469 1089838 1078597
58699 1078597 1068556 1059589 1052187 1048088 1048245 1051225 1054706 1057583 1059611 1060288 1059580 1058910 1059840 1062310 1065335
58684 1065335 1068792 1073256 1078606 1084078 1089419 1095005 1101196 1108319 1116694 1125835 1134309 1141291 1147769 1155479
58670 1155479 1165255 1176892 1189580 1201742 1211665 1219299 1226426 1234243 1242130 1249808 1258944 1270860 1284039
58657 1284039 1295884 1305966 1315629 1325407 1335072 1345494 1357921 1371425 1383228 1391737 1397530 1401328
58645 1401328 1402825 1401674 1397825 1390499 1378393 1361426 1341069 1318627 1294374 1268614 1242292 1216080
58633 1216080 1189873 1163582 1137573 1112218 1088019 1066366 1049068 1036595 1027435 1019395 1010973 1001535
58621 1001535 991178 980771 971404 963367 956109 949393 943963 940841 940224 941186 942353 942975 943501 944881
58607 944881 947245 949866 952622 956717 963418 972613 983064 993457 1002694 1009861 1014570 1016926 1016894 1014516
58593 1014516 1010961 1008054 1005937 1002440 995841 987200 978813 971474 964684 958578 953836 950097 946147 941664
58579 941664 937435 933851 930375 926688 923439 921638 921822 923805 926828 930029 932970 935486 937252 938243 939368
58564 939368 941356 943021 942330 939455 936885 935885 935073 933487 932714 934359 937564 941131 946075 953600 962099
58549 962099 968945 974209 980021 986995 993880 1000083 1006043 1011488 1015739 1019420 1023519 1027093 1028378 1028064
58535 1028064 1028905 1031840 1034811 1035911 1035675 1035663 1036618 1038667 1041927 1046255 1051458 1058027 1066767 1077744 1090492
58520 1090492 1104852 1120600 1136811 1152792 1169007 1185746 1201687 1215401 1227673 1240808 1256251
58509 1256251 1274340 1295379 1319119 1344131 1369693 1397426 1429029 1463512 1499057 1536513 1578027
58498 1578027 1622750 1666912 1707940 1745660 1779574 1808020 1830318 1846953 1857391 1860508 1857595 1852061
58486 1852061 1845443 1836310 1823772 1809414 1794858 1779908 1764229 1748540 1732770 1714849 1692566 1665453
58474 1665453 1634265 1600145 1564745 1529720 1495723 1463207 1433824 1409114 1388016 1368010 1348670
58463 1348670 1331718 1317506 1304135 1290396 1277032 1264672 1253169 1243442 1237109 1233408 1229137 1222665
58451 1222665 1215633 1209836 1204992 1200577 1197178 1194713 1191729 1187906 1185162 1184904 1186086 1187136 1187881 1188471 1188472
58436 1188472 1188148 1188806 1190800 1192981 1194871 1197374 1200682 1203784 1206902 1211963 1219614 1228209 1236882 1247105
58422 1247105 1259914 1274187 1289283 1306915 1328481 1352641 1377335 1402213 1427239 1450780 1471159
58411 1471159 1488586 1503771 1515950 1523941 1527899 1528507 1525581 1518883 1509354 1498558 1487860 1478721 1472447
58398 1472447 1469008 1467390 1467353 1469282 1472538 1476297 1482150 1493000 1508735 1525671 1540886 1554114 1564595
58385 1564595 1569594 1567804 1561186 1551594 1538285 1520702 1501173 1482814 1466911 1453871 1444271 1437318
58373 1437318 1430827 1424506 1420786 1420756 1422055 1422641 1423814 1427341 1432459 1438111 1445426 1455317 1466010 1475613
58359 1475613 1484847 1494562 1502621 1506054 1504580 1499665 1491945 1481908 1471227 1461071 1450825 1440398 1431587
58346 1431587 1425043 1418355 1409553 1400055 1391704 1383498 1374291 1366323 1362606 1362580 1363448 1364248 1365632 1367221 1368238
58331 1368238 1369520 1372237 1375803 1379303 1383321 1388084 1391710 1392860 1393295 1395216 1398019 1400417 1403679 1409661
58317 1409661 1417325 1424240 1430099 1436060 1442326 1449271 1459162 1473660 1490903 1507801 1523771 1539692 1555083
58304 1555083 1569267 1583666 1600022 1617791 1635935 1655455 1677296 1699641 1720207 1739484 1758750
58293 1758750 1776791 1791760 1804580 1817279 1829490 1839687 1848468 1857785 1868302 1879974 1893390 1908074
58281 1908074 1921603 1933044 1945015 1959866 1976502 1993607 2012703 2034623 2056308 2075083 2093238
58270 2093238 2114311 2137606 2160485 2183128 2206513 2228451 2246494 2262373 2278799 2294272 2305996
58259 2305996 2315617 2326863 2339469 2350653 2360860 2372846 2386553 2399976 2413841 2430667 2450432
58248 2450432 2471555 2494508 2520163 2546611 2572267 2599924 2632787 2668584 2702573 2734261 2766223
58237 2766223 2798845 2831670 2867449 2909007 2954055 2998688 3043795 3092407 3143290 3193336 3243942
58226 3243942 3298648 3356613 3414698 3473720 3536221 3600513 3663692 3728145 3798220 3872902 3948805
58215 3948805 4027521 4112518 4201764 4291692 4385702 4489941 4603066 4719272 4839124 4967749
58205 4967749 5104194 5242829 5384275 5534838 5695739 5862747 6035944 6219886 6414486
58196 6414486 6615756 6825382 7049489 7287976 7535026 7790054 8058036 8339428 8630265
58187 8630265 8932118 9251213 9587953 9938396 10305832 10699157 11119517 11560349 12021249
58178 12021249 12510075 13031040 13582987 14169892 14800543 15476938 16195090 16957344 17771017
58169 17771017 18635299 19543542 20498694 21512451 22589733 23729468 24940354 26239349
58161 26239349 27634381 29125343 30721963 32442718 34296501 36284737 38421406 40730146
58153 40730146 43221808 45897816 48776951 51896019 55284862 58967892 62993025 67434368
58145 67434368 72369014 77882950 84097707 91151509 99147748 108157529 118275755 129637393
58137 129637393 142385300 156678732 172738972 190829735 211191647 234065777 259784539
58130 259784539 288765628 321438463 358250666 399485401 444338401 489542102 529076030
58123 529076030 556161762 566519087 560260014 540963456 513129145 480289648 444721201
58116 444721201 407993519 371370892 335867201 302219189 270906397 242189199 216166868
58109 216166868 192851240 172194333 154061858 138231357 124443551 112441823 101970655
58102 101970655 92784747 84685576 77529984 71194829 65556554 60510780 55983546 51910638
58094 51910638 48226215 44879354 41839225 39073582 36540443 34208423 32065803 30100599
58086 30100599 28288881 26610720 25060302 23631029 22305766 21070528 19923826 18863819
58078 18863819 17878548 16956502 16095085 15291475 14536141 13822291 13151740 12525407 11937615
58069 11937615 11384831 10870012 10392950 9945621 9521960 9123280 8749817 8396123 8059065
58060 8059065 7741191 7441987 7154851 6876831 6612406 6363466 6124537 5892065 5669414
58051 5669414 5458098 5252804 5049928 4852721 4663279 4477546 4293286 4115176 3946965
58042 3946965 3785945 3630143 3483752 3350236 3226803 3110684 3004319 2909256 2821196 2736240
58032 2736240 2656238 2583073 2513429 2444306 2378385 2318900 2264035 2211143 2161839 2118263 2078448
58021 2078448 2039612 2001961 1965534 1927728 1887802 1849553 1815736 1783932 1751401 1719610 1690216
58010 1690216 1660826 1628853 1595974 1565139 1536520 1509571 1485432 1464245 1443584 1422352 1402579
57999 1402579 1384845 1366059 1344416 1322251 1301213 1279246 1255542 1233844 1217010 1202397 1186365
57988 1186365 1169504 1153696 1137862 1120572 1103452 1088206 1073461 1058157 1044722 1035004 1026093 1014037
57976 1014037 999159 984284 970306 956875 944856 934689 924469 912577 900084 888233 876216
57965 876216 863711 852490 842991 832683 820604 810054 803622 798876 792350 784591 777736 771227 763749
57952 763749 756783 752326 749325 745854 742621 740960 739559 736534 732684 729670 727190 724890 724523 726994
57938 726994 729791 730698 731535 734679 738392 739508 738577 738243 738297 736355 732107 727183 721982 716066 710475 706302
57922 706302 702099 695820 688093 680614 672846 663608 654473 648011 643697 638976 633645 629922 628776 629117
57908 629117 630033 631185 631614 630721 629665 629569 629454 628246 627428 628948 631725 633004 632122 630261 627569 623365
57892 623365 618236 613156 607304 599380 590409 582816 577481 573764 571343 569823 567948 565613 565262 568802
57878 568802 574652 580469 587011 596130 606497 615002 621435 628282 636469 644525 651391 656873 659877 659457
57864 659457 657311 656157 655764 653436 648060 640865 632665 623398 614054 605867 597722 587541 576316 567633
57850 567633 562830 559569 555663 551430 547588 543599 539187 535354 532853 531297 530343 530193 530544 530537 530015 529427
57834 529427 528587 526986 525191 524394 524730 525430 526115 526466 525491 523032 521283 522600 526265 529489 531095 532114
57818 532114 533383 534974 537573 541840 546492 549334 550196 550774 551788 552633 553615 556030 559889 563789 567179
57803 567179 570672 574185 576977 579446 582617 585858 587502 587957 589773 594197 599910 605537 611159 616676
57789 616676 620732 622196 621273 618726 615322 612165 609986 608036 605113 601541 598540 596005 592821 589099
57775 589099 586065 583872 581520 578817 576311 573561 569813 566280 565254 566795 568769 570428 573405 578643
57761 578643 584772 590301 595267 599901 603642 606333 608674 610826 612025 611881 610538 607600 602754 597291
57747 597291 592742 588072 580708 570615 560660 552541 545139 537571 530926 525647 519858 512014 503210 495393
57733 495393 489129 484416 481726 480682 479354 476458 472939 470176 468114 466365 465626 466526 468326 470103 472231
57718 472231 475490 479753 484552 489945 495810 501269 505733 509651 513499 516847 518973 519423 517660 513529
57704 513529 508539 505163 504118 503674 502325 500568 499183 497315 493613 488285 482958 479256 478109 479404
57690 479404 481561 482490 481765 481148 482530 486268 491646 497675 503119 507169 510568 514732 519409 522770 524222
57675 524222 525304 527116 528691 528885 528155 527329 526165 524343 522570 521485 520637 519543 518586 517937 516917 515330
57659 515330 514086 513393 511752 508028 503286 499299 496363 493865 491833 490412 488663 485426 480912 476316
57645 476316 472252 468498 464750 460821 456696 453043 450908 450299 450004 449499 449956 452431 456011 458881 460510
57630 460510 461828 463801 466658 470015 473069 475167 476649 478634 481766 485939 491343 498524 507100 515744
57616 515744 524045 533175 544245 557400 573181 593192 618376 647996 681398 719476 762880 809428
57604 809428 854185 891345 915527 922834 912521 887534 852642 812207 769617 727322 686415 647043
57592 647043 609852 576204 546626 520455 497587 479072 465081 453768 443263 433538 425257 418093
57580 418093 411369 405152 399459 393534 387221 381986 379201 378178 377089 375040 372199 368750 364959 361527
57566 361527 358805 356170 352934 349212 345398 341804 339328 339117 340853 342635 343241 342979 341672 337924 331686
57551 331686 325520 321485 318500 314755 311063 309358 309087 307776 304689 301399 298802 295740 291042 285297
57537 285297 280035 276043 272710 268581 262795 256287 250859 246756 242352 236778 231265 226833 222313 216289
57523 216289 209692 204684 201923 200535 199817 199329 198198 196128 194434 194440 195553 196319 196515 196584 195955 193728 190391
57506 190391 187246 184827 183273 183153 184182 184258 181839 178346 176132 175080 173502 171477 170548 170713 170550 170208
57490 170208 171435 174364 176871 177658 177624 177597 176890 174890 172205 169477 166698 164356 163671 165023 167436 170060
57474 170060 172732 174752 174750 172480 169382 166762 164580 162473 160704 159505 158599 157860 157522 157405 156946 156240
57458 156240 156055 156651 157626 158987 161144 163631 165115 165073 164426 164229 164705 165743 167257 168781 169716 170304 171510
57441 171510 173740 176329 178299 178901 177742 175350 173309 172748 172949 172516 171354 170102 168215 164520 159542
57426 159542 155353 152847 150940 148752 146785 145432 144072 142450 141553 142265 144161 146212 147594 147469 145210
57411 145210 141490 137982 135377 132701 129111 125348 122817 122093 122715 123597 123399 121593 119544 119380 121300
57396 121300 123036 122536 120097 117326 115055 113061 110921 108307 105090 101840 99666 98899 98441 97035 94783
57381 94783 92823 91727 90766 88841 85954 83514 82912 83795 84306 83222 81147 79261 77877 76943 76917 77939
57365 77939 78889 78641 77787 77929 79651 82231 84600 85450 83350 78543 73973 72641 74333 76649 78657 81339
57349 81339 84847 87932 90315 93143 96533 98799 98912 97784 96346 94291 91642 89674 89105 88823 87594
57334 87594 85810 84578 84232 84705 86272 88917 91815 94273 96447 98601 100562 102432 104935 108457 112476
57319 112476 116321 119683 122241 123814 125049 126795 128557 128828 127239 125048 123113 120706 116972 112457
57305 112457 108555 106236 105587 105680 104892 102462 99695 98368 98111 97038 94947 93844 94785 96163 95996 94306
57289 94306 92382 91067 90539 90473 89720 87116 83287 80350 79297 78875 77509 74973 71795 68608 66506 66375
57273 66375 67276 67118 65432 63707 62526 60446 56487 51628 46785 41410 35411 30508 28147 27665 27885
57258 27885 28837 30441 31248 30298 28889 28775 29759 30564 30901 31072 30704 29604 28895 29664 31249 32432 33591
57241 33591 36164 40465 45356 49626 52668 54342 55165 56227 58229 61098 64881 70048 76533 83702 91757
57226 91757 101822 114175 127948 143120 160961 181811 204393 228183 254188 282122 309225 333622
57214 333622 356581 379426 400523 417892 432960 448765 465694 481906 497065 512600 528515
57203 528515 542745 554020 563305 572098 580872 589453 597652 605481 613550 622884 633495 643902 652948
57190 652948 661158 669317 677045 684123 691849 701287 711228 719739 726820 733858 741458 749634 759118 770462
57176 770462 782672 794673 807278 821637 836622 850095 862225 875208 889965 905357 920532
57165 920532 936005 952470 970462 991241 1016345 1046352 1081528 1123135 1172013 1226109 1281477
57154 1281477 1335863 1389572 1442997 1495470 1547038 1599489 1654674 1712638 1771685 1829558 1884928
57143 1884928 1938785 1994105 2053062 2114892 2177338 2239369 2301277 2363132 2424819 2486820 2549145
57132 2549145 2610122 2668055 2723517 2778190 2832220 2884856 2937135 2991414 3048215 3105703 3162346
57121 3162346 3218003 3272313 3324304 3374214 3423800 3474069 3524042 3572282 3618429 3662983 3706722
57110 3706722 3750514 3794581 3837824 3878869 3917600 3954781 3990684 4025448 4060276 4096739 4135172
57099 4135172 4175307 4218192 4265806 4318830 4376236 4436982 4500581 4565903 4630608 4691826 4746535
57088 4746535 4791791 4825821 4848668 4860930 4862528 4853474 4834623 4806142 4766316 4713553 4648740 4573943
57076 4573943 4489650 4394999 4289951 4175451 4052034 3919846 3779330 3630540 3472587 3304776
57066 3304776 3126575 2934789 2722418 2482165 2209578 1901206 1552067 1157483 715188
57057 715188 222615 -326228 -938527 -1619259 -2373219 -3208414 -4134365 -5159374 -6293400
57048 -6293400 -7552232 -8955566 -10523268 -12277541 -14246885 -16464486 -18966087 -21795232
57040 -21795232 -25009868 -28681242 -32891923 -37742974 -43361775 -49896760 -57505787 -66352509
57032 -66352509 -76604690 -88420828 -101933619 -117245582 -134425891 -153493411 -174407123
57025 -174407123 -197082927 -221381511 -246980943 -273159836 -298662407 -321802026 -340788081
57018 -340788081 -354124024 -360926261 -361073726 -355142160 -344145300 -329209450 -311343453
57011 -311343453 -291369066 -269951224 -247644688 -224931707 -202256443 -180045124 -158697854
57004 -158697854 -138563636 -119919446 -102956699 -87771409 -74365747 -62667762 -52558176
56997 -52558176 -43888917 -36493898 -30200878 -24844575 -20275624 -16365561 -13009806 -10125757
56989 -10125757 -7644815 -5505233 -3651450 -2036115 -619832 629319 1734358 2710533
56981 2710533 3571959 4336894 5024858 5649772 6218022 6732287 7195349 7611166 7984888
56972 7984888 8322224 8627447 8901726 9144079 9353890 9532279 9681935 9806757 9911482
56963 9911482 10000746 10078078 10145660 10204726 10256026 10299739 10334440 10356047 10359083 10340214 10300120
56952 10300120 10241113 10164023 10068799 9956916 9830630 9689852 9531852 9354388 9157549 8942165
56942 8942165 8707976 8453753 8178149 7880515 7562488 7229180 6887823 6545201 6207122
56933 6207122 5879264 5566139 5269077 4987025 4719566 4467523 4230840 4008130 3798844
56924 3798844 3603869 3423190 3254619 3095587 2944743 2801158 2663496 2530803 2402865
56915 2402865 2279071 2158151 2039778 1925402 1816826 1714759 1619113 1529690 1446163 1368184
56905 1368184 1295816 1229126 1167507 1110399 1058395 1012398 971977 936100 905071 879619 857848
56894 857848 835250 808444 777298 743016 706270 668043 630165 593573 557402 521007 485679
56883 485679 453285 424530 399600 379122 363131 350142 338695 329057 322246 318250 316619 318108
56871 318108 323959 333423 343052 348767 348177 341130 328742 312120 291757 268097 242442 216805 192676
56858 192676 170304 149247 129175 110085 92322 76446 62686 50670 40220 32006 26460 22340
56846 22340 17616 11839 6472 2852 1064 1027 3154 7345 12638 18603 26045 35513 46150 56883
56832 56883 67939 80216 93839 108419 124383 143079 165416 190733 216726 240167 258099 269070
56820 269070 273512 273060 269645 264955 260088 255451 251195 247764 245904 246451 250438 258826 271452 286756
56806 286756 303469 322340 345346 373523 406455 443412 483786 526475 569816 611675 648480
56795 648480 674986 687181 685848 675745 661205 644144 626185 609989 597233 587323 579765 576475
56783 576475 580119 591216 608564 631882 662388 701012 747456 801085 861667 928853 1001418 1076751
56771 1076751 1150095 1214044 1259817 1280458 1274024 1244414 1199204 1146071 1090382 1035096 981963
56760 981963 932425 888036 850690 822107 802623 790992 786108 788407 798867 817255 842598 875033
56748 875033 915822 965302 1021274 1078649 1129446 1164054 1175125 1161495 1127837 1080707 1025890
56737 1025890 968569 913085 861214 812108 765055 721411 683366 652081 627724 610104 598356
56726 598356 591093 587884 589920 598544 613841 635029 660886 688654 713316 729291 732930 723251 701205
56713 701205 669229 631010 590503 550635 512787 477095 443089 410557 380066 352411 327609
56702 327609 304953 284029 265159 248869 235412 224689 216049 208438 201286 194738 188322 180322 169827
56689 169827 158732 149944 143983 139166 134772 131722 129977 127813 124534 121782 120885 120703 119382 116737
56675 116737 113575 110046 106231 103387 103045 105256 108589 111359 112270 110887 108364 106841 107196 108061 107745
56660 107745 106283 104861 104184 104346 105470 107535 110076 112734 115496 117955 119251 119277 118917 118528 117426 115677
56644 115677 115130 117443 121969 126722 130594 133512 135328 135997 136424 137804 140139 142330 143709 144799 146671
56629 146671 149909 153978 157483 159519 160877 163163 166652 170040 172546 174938 177844 180328 181058 179995
56615 179995 178173 176686 176551 178410 181434 183552 183761 183282 183443 183533 182090 179498 177768 178039 179511 180695
56599 180695 180689 179381 177306 175365 174176 173697 173679 174089 174832 175560 176051 176318 176363 176497 177757 180891 184879 187760
56581 187760 189199 190755 193275 195687 197105 198334 200091 201193 199940 196280 191371 186039 180847 176714
56567 176714 174151 172585 171487 171276 172089 172648 171678 169690 168250 168158 169336 171591 174391 176739 178384 180297
56551 180297 182997 185469 186888 188096 189856 190915 189753 187405 186494 187837 189935 191534 192733 193566 193437
56536 193437 192513 192158 193243 194952 195902 195878 196035 197715 201194 205414 209004 211722 214561 218326 222614 226423
56520 226423 229179 230974 232470 234722 238219 241970 244580 246441 249493 254444 259705 263640 266377 268687
56506 268687 270805 273418 278069 285232 293361 301237 309893 320834 333739 347399 361457 375461 387525
56493 387525 396006 401598 405966 409183 410364 409906 409059 407913 405766 403044 400949 399590 398129 396355 394475
56478 394475 391819 387525 382206 377282 372994 368679 364600 361603 359091 355081 348573 340595 332866 326478
56464 326478 321738 318124 314556 310614 307224 305275 304176 302715 300658 298493 296362 294306 292674 291171
56450 291171 288567 284582 280972 279294 278785 277947 276895 276264 275187 272617 269654 268218 268200 268187 268277 269684
56434 269684 272164 274294 275886 277687 278991 278151 275458 273145 272510 273230 275316 279167 283456 285547 284690
56419 284690 282798 281660 281423 282116 284375 287777 290305 290449 288673 286369 284628 284162 285022 286188 286624 286565
56403 286565 286478 285397 282260 278448 276691 277446 278628 279018 279605 281118 282549 282979 282985 283376 284048 284669 285231
56386 285231 285620 285967 287329 290491 294222 296538 297418 298209 298608 296918 293600 291816 293450 296848 299445
56371 299445 300661 301225 301666 302553 304567 307203 308853 308987 308911 309734 311146 312704 314626 316594 317559 317551 318061
56354 318061 319763 321457 322116 322371 322993 323390 322695 321138 319435 317880 316742 316380 316362 315584 313885 312383
56338 312383 311854 312050 312916 314850 317211 318277 317587 316941 318200 321312 325207 329353 333548 337313 340367
56323 340367 342926 345014 346340 347150 348121 349174 349502 349028 348607 348577 348407 348037 348172 348858 349139 348661 348396 349277
56305 349277 351071 352956 354307 354846 354909 355532 357320 359587 361604 364056 367829 372022 374960 376649 378445
56290 378445 380777 383137 385770 389199 392569 394734 396465 399101 401554 401561 399702 399084 400984 403892 407107
56275 407107 411914 418523 425043 430555 436307 442822 448617 452881 456769 460984 464726 468102 472791 479119
56261 479119 485120 489763 494473 500129 505312 508969 512240 516047 519400 521687 524214 527797 531231 533835
56247 533835 537175 542527 548842 554914 561322 568612 575875 582964 591765 603220 615278 625939 636298
56234 636298 648401 661905 675061 687417 699479 711174 722659 735428 750775 768231 786818
56223 786818 806481 827043 847343 866797 886359 906811 927725 949091 972033 996928 1022959
56212 1022959 1050578 1081906 1117341 1154368 1191419 1230322 1273031 1318483 1365024 1413682 1466658
56201 1466658 1524420 1586659 1654355 1728688 1809438 1896502 1991456 2095792 2209327 2332197 2466665
56190 2466665 2614914 2776586 2950182 3135185 3331153 3536612 3750570 3973158 4202899
56181 4202899 4435328 4666033 4892931 5113549 5322272 5512441 5679257 5818750 5926407
56172 5926407 5999402 6038287 6044042 6015329 5951025 5853654 5727964 5577875 5406995 5220191 5022032
56161 5022032 4815178 4602296 4387690 4175004 3965390 3760187 3563156 3377475 3202514
56152 3202514 3036210 2878732 2731305 2593448 2464176 2344111 2233641 2130749 2033423 1942620
56142 1942620 1860171 1785370 1716255 1652604 1595027 1542626 1494135 1449828 1409855 1372309 1335414
56131 1335414 1300000 1267508 1237422 1209079 1184034 1163870 1147375 1132404 1118855 1107463 1097507
56120 1097507 1088077 1079687 1072449 1064846 1056463 1049430 1044877 1040796 1035884 1032333 1031885 1032360 1031499 1031190 1034232
56105 1034232 1039922 1046632 1055682 1068463 1082586 1095405 1108812 1125921 1145317 1163384 1180293 1199001
56093 1199001 1220168 1242824 1268252 1298332 1331418 1364618 1398938 1437733 1481413 1528265 1579224
56082 1579224 1637247 1702978 1775371 1855417 1944932 2042674 2145719 2253230 2364535 2474995
56072 2474995 2578389 2672359 2757440 2832595 2896580 2952249 3004245 3052905 3094656 3127226 3150166
56061 3150166 3161868 3161132 3150694 3134611 3113165 3084538 3049460 3008979 2959315 2894758 2815137 2725573
56049 2725573 2630087 2530538 2430553 2334750 2244519 2159421 2081671 2014193 1955550 1902200 1854562
56038 1854562 1815408 1783588 1755226 1730078 1710735 1696408 1683541 1671849 1663734 1658324 1652228 1645816
56026 1645816 1642786 1643764 1645991 1648888 1654256 1661597 1668916 1677354 1689305 1703043 1715223 1727380 1743425
56013 1743425 1762060 1778611 1793441 1811322 1833197 1855804 1878810 1904912 1933304 1960562 1987775
56002 1987775 2019278 2054514 2088717 2121370 2156217 2193128 2228206 2262074 2299715 2341572 2382986
55991 2382986 2423142 2466333 2513491 2560448 2605571 2651471 2698601 2745070 2793075 2847293 2906555
55980 2906555 2965501 3024590 3089521 3160531 3231702 3301619 3375219 3454230 3535500 3619840 3712551
55969 3712551 3813627 3917139 4021757 4132134 4248741 4366722 4486383 4614238 4751815
55960 4751815 4893975 5040207 5196823 5365833 5542547 5726540 5924159 6137813 6363441
55951 6363441 6600537 6853682 7122465 7401420 7691447 7999352 8324813 8660778 9008264
55942 9008264 9377035 9769838 10180355 10608947 11065396 11553457 12068397 12612865 13198966
55933 13198966 13830791 14501119 15209029 15963772 16767470 17612167 18498771 19440684 20444098
55924 20444098 21504053 22625164 23826112 25117991 26498984 27976124 29569982 31291499
55916 31291499 33137715 35117658 37258036 39575864 42071762 44759045 47672853 50843132
55908 50843132 54289707 58055312 62214488 66843433 72018297 77852737 84493324 92059151
55900 92059151 100623956 110270033 121114014 133271001 146859465 162072874 179196737
55893 179196737 198547077 220473089 245431232 273930808 306340852 342813921 383247802
55886 383247802 426709411 470273863 508523502 535040178 545332813 538885598 518725667
55879 518725667 489292036 454580814 417529048 380157990 343787788 309208820 276897748
55872 276897748 247175454 220222967 196073111 174669081 155907038 139606487 125498233
55865 125498233 113285106 102694025 93466132 85352492 78155725 71749551 66037811 60920809
55857 60920809 56313870 52163588 48422769 45032488 41944318 39135411 36585074 34257572
55849 34257572 32121690 30165298 28375885 26726145 25192474 23769482 22453132 21226536
55841 21226536 20074775 18997606 17995381 17057138 16173721 15348329 14583181 13868890 13197024
55832 13197024 12570313 11990709 11449651 10939483 10462957 10022711 9612472 9226750 8868159
55823 8868159 8537308 8226310 7929779 7651222 7391115 7139825 6890341 6647467 6416308
55814 6416308 6191746 5967546 5746349 5532293 5322380 5113115 4907615 4708618 4512233
55805 4512233 4315821 4124662 3944143 3772662 3608661 3457062 3322051 3200369 3087836
55796 3087836 2985540 2893720 2806865 2721106 2639712 2565385 2494008 2421828 2351863 2287114 2224273
55785 2224273 2160387 2099203 2044471 1993083 1941064 1890479 1844323 1800383 1756328 1715353 1680701
55774 1680701 1649743 1619252 1591198 1567471 1544117 1516972 1488305 1462153 1437700 1412897 1389876
55763 1389876 1370863 1352982 1332813 1312035 1293242 1274344 1252564 1229985 1209711 1190404 1169900
55752 1169900 1150414 1134761 1120971 1105877 1090695 1078129 1067413 1057069 1048986 1044675 1040971 1034637
55740 1034637 1028055 1025305 1025613 1025689 1025537 1026845 1028348 1027851 1026506 1026331 1025871 1022916 1019185 1017606 1017001 1013933
55724 1013933 1008107 1001940 996546 991619 987038 981131 969912 951942 931680 914425 900370 887147
55712 887147 875346 867325 863050 861403 863552 870775 880459 887839 890215 886689 876273 859787 841286
55699 841286 824047 807132 788935 771407 757145 744958 732232 719452 708520 698670 687919 676613
55687 676613 665930 654838 642133 629461 618704 608361 596103 582921 571239 561053 551674 545105
55675 545105 543525 544916 544987 542178 537575 531680 524792 518801 514961 511267 505231 497594 490300 482988 474880
55660 474880 467862 463870 461243 457499 453812 452818 453884 454683 455672 458707 462649 464733 465262 466833 469779
55645 469779 472173 473361 473777 472323 467721 461484 455892 450173 442444 434149 428423 425025 421020 415726
55631 415726 410914 406775 401921 396996 394161 393068 391196 388056 385344 383135 379837 376088 374799 376723
55617 376723 379342 380717 381453 382334 382869 382690 382000 380391 377387 373959 371393 369251 366762 365251 366375
55602 366375 368870 370173 370518 372108 374752 375904 374968 374250 375438 378162 382133 387765 394291 399881 403893
55587 403893 406941 409057 410123 411398 413897 415800 414364 409936 405253 401319 396963 391827 386478 379960
55573 379960 370753 360115 351101 344175 337018 328826 321532 316461 312842 309974 307920 305870 302807 299914
55559 299914 299179 299500 297462 292405 287305 283989 280867 276407 271709 268250 265621 262765 259424 255551 251296
55544 251296 247938 246708 246555 245451 243751 243458 244208 243301 240177 237390 236272 234954 231931 228508 226139
55529 226139 224151 221805 220171 220145 220535 219725 217716 215351 213115 211559 211231 211444 210856 209825 210246 212558
55513 212558 215070 216935 219465 223575 228082 231632 234301 236334 237296 237574 238806 241598 244400 245599 245267
55498 245267 244097 242301 240283 238754 237453 235275 232233 229634 227903 226007 223438 220855 218374 215380
55484 215380 212469 211296 211737 211544 209745 208185 208651 210562 212592 214474 215935 215825 213776 211269 209924
55469 209924 210056 211566 214455 217606 218893 217612 215303 213407 211762 210002 208414 206498 202776 197202
55455 197202 191994 189009 187951 187899 188476 188522 185961 180561 174946 171332 169100 166988 165601 165847 166614 166132
55439 166132 164577 163430 163200 163361 163769 164676 165957 167365 168890 170150 170495 170348 171053 172658 173395 172363
55423 172363 171070 171093 171797 171769 171072 170558 170155 169396 168634 168402 168499 168890 170374 173037 175204 175422 174616 174864
55405 174864 176764 179178 180785 180741 178665 175225 172076 170135 168493 165899 162530 159486 157484 156944 158345
55390 158345 161338 164323 165916 166265 166239 166224 166427 167243 168405 168710 167571 165955 165069 165117 166094 168500 172111
55373 172111 175199 176251 175706 175027 174855 175036 175549 176353 177002 177294 177627 178044 177767 176304 174089 171508 168466
55356 168466 165580 164493 166105 169540 173453 177048 179229 178544 175233 171808 170224 169692 168432 166211 163779
55341 163779 161174 158236 155850 155122 156015 157900 160471 163060 164241 163491 162191 161655 161298 160076 158607
55326 158607 158288 159285 160829 162560 164194 164962 164920 165693 168287 171238 172695 173176 174231 175425 175033 173147
55310 173147 171590 170957 170099 168699 168095 168923 169778 169085 167071 165117 164019 163359 162065 159381 155738 152570
55294 152570 150855 150317 150494 151715 154022 155925 155615 153049 149718 146791 144739 144282 146091 149498 152768
55279 152768 154937 156426 157833 159029 159547 159094 157645 155643 154069 153643 154004 154047 152888 150299 146709 143199
55263 143199 140861 139748 139102 138937 140335 143641 147536 150740 153404 155750 156660 155135 152295 150327 149969
55248 149969 150374 150818 151104 150798 149565 148003 146940 146248 145419 144705 144373 143597 141713 140133 141178 145067
55232 145067 149692 153451 156719 160247 163629 166045 167473 168411 168938 168569 166927 164471 162515 162143 162991
55217 162991 163727 163833 163912 163947 162736 159937 157312 156681 157840 159779 162591 166378 169436 169791 168069 166781
55201 166781 167064 167970 168687 169391 169926 169674 169012 169079 169707 169230 166892 164040 162328 161894 161843 161538 160913 160188
55183 160188 159538 158567 156433 153259 150943 151347 154034 157037 159459 161777 163912 164876 164602 164381 164919 165332
55167 165332 164638 163052 161283 159567 157859 156187 154514 153054 152680 153947 155724 156100 154856 153757 154132
55152 154132 155489 156921 158462 160334 161954 162599 162323 161620 160827 160269 160215 160289 159720 158582 157990 158542 159348
55135 159348 159224 158268 157661 158328 160288 162913 165421 167318 168642 169620 170052 169433 167675 165268 162649 159878
55119 159878 157171 155390 155644 158235 162003 164943 165999 166167 167187 169175 170592 170735 170883 172213 173946
55104 173946 174739 174789 175133 175792 176150 176450 177230 177916 177701 177326 178064 179205 178565 175636 172416 170885 171219 172599
55086 172599 174026 174097 171870 168567 166786 167297 168116 167422 165844 164932 164821 164602 163976 163259 162451 161451 160840
55069 160840 161478 163346 165381 166445 166298 165772 166088 167762 170143 172162 173206 173038 171509 169036 166786
55054 166786 165521 164746 163786 163020 163011 163244 163162 163766 166398 170266 172965 173390 172483 171253 169988 169509 171100
55037 171100 174550 177874 179559 179819 179453 179063 179586 181783 184730 186534 186992 187801 189732 191577 192572 193681
55021 193681 195460 196661 196319 195419 195004 194312 192494 190752 190869 192567 194035 194384 194067 193453 192540 191684 191390
55004 191390 191637 192319 193795 196111 198270 199303 199557 199947 200418 200069 198357 195368 191372 187011 183559 182214
54988 182214 183277 186304 190369 193834 194937 193588 191877 191939 193805 195968 197284 197468 196530 194750 192766
54973 192766 190880 188751 186441 184984 184986 185305 184198 181476 178660 177279 177762 179715 182488 185489 188371
54958 188371 190798 192044 191456 189427 187156 185216 183336 181797 181679 183068 184308 184065 183115 182980 183738 184452
54942 184452 185040 186379 188791 191459 193283 193747 193301 193307 194991 197961 200465 201484 201634 201567 200866 199401 198422
54925 198422 199029 200559 201716 202333 202707 202245 200431 198377 197730 198446 199172 199428 199863 200681 201389 202072 203378
54908 203378 205194 206561 207045 207104 207121 207146 207558 208887 210817 212203 212206 210833 208644 206611 205811 206408 207346 207868
54890 207868 208668 210484 212322 212628 211668 211062 211139 210449 208033 204601 201250 198394 196240 194981 194206 193328
54874 193328 192809 193683 195720 197555 198934 201121 204459 207197 207926 207774 208780 211049 213094 214465 216406
54859 216406 219849 224068 227791 230873 234253 238591 243487 248127 252505 257619 264199 271312 276619 278186
54845 278186 275949 271515 266869 263221 260595 258068 254513 249459 243474 237743 233104 229357 225655 221878
54831 221878 219396 219847 223078 226934 229292 229636 228497 226446 224393 223889 225790 228986 231618 233496 236190
54816 236190 240709 246169 251100 255107 258645 261863 264476 266622 269131 272683 276926 280735 283274 284437
54802 284437 284094 281552 276506 270227 264654 260157 255214 248740 241729 235890 231566 227876 224200 220593
54788 220593 217267 214548 212936 212276 211251 208599 204599 200697 198088 197358 198840 202107 205343 206468 205100
54773 205100 202720 200898 199988 199425 198619 197551 196892 197289 198224 198224 196768 195285 195340 196573 197529 197893 198468 199265
54755 199265 199179 197735 196009 195517 196947 199923 203060 204401 202937 199958 198064 198631 200916 203554 206005
54740 206005 208419 210858 212940 213899 213199 211534 210709 211747 213613 214646 214711 214870 215470 215875 215697 214965 213461
54723 213461 211305 209791 209939 210484 209269 206715 205750 207750 210598 211770 211609 212247 214635 218014 221553
54708 221553 225191 229164 233504 237913 242000 246102 251691 259820 269157 276949 282310 287060 292671 297913
54694 297913 300660 300711 299469 297649 294665 289908 283628 276878 271218 267846 266258 264359 260589 255386 250029
54679 250029 245043 240681 237927 237568 238697 239534 239514 239355 239280 238587 237190 236304 236944 238549 239778 240255 240966
54662 240966 243026 246485 250389 253844 256817 259773 262788 265441 267699 270415 274494 279688 284550 287549
54648 287549 288141 286822 284420 281463 278225 275079 272268 269187 264582 258063 251081 245710 242720 241476
54634 241476 241331 242044 242901 242614 240532 237225 233636 230293 227477 225316 223459 221512 220019 220096 221699 223195
54618 223195 223184 221904 220249 218347 216019 213879 212819 212622 212147 210982 210157 210835 212653 213782 212748 210100
54602 210100 207912 207498 208108 208396 208584 210105 213253 216404 217941 217955 217445 216662 214956 211903 207958 204158
54586 204158 201482 200351 200623 202092 204742 208121 210938 211994 211403 210203 209089 208269 208118 208741 209107 207931
54570 207931 205383 202761 200656 198918 198294 200143 204088 207762 209597 210233 210571 210257 209161 208561 209346 210378
54554 210378 210088 208720 207666 207603 208444 210113 212075 213051 212508 211551 211158 210625 209150 207820 208287 210281 212226
54537 212226 213663 215274 217024 218190 218985 220283 221691 221605 219415 216347 213936 212826 213129 214745 217060
54522 217060 219254 221010 222325 223050 223396 224282 226012 227235 226611 224945 224092 224167 223633 221907 220056 218867
54506 218867 218115 217923 218949 220785 221874 221639 221149 221156 221158 221088 222178 225038 228314 230474 231826 233565 235774
54489 235774 237556 238372 238138 236651 234120 231817 231075 231788 232632 232604 231807 231092 231453 233374 236142 238124 238232
54472 238232 236850 235022 233342 232063 231600 232124 233107 234001 234967 236221 237134 236891 235846 235253 235620 236167 236119
54455 236119 235790 236040 237135 238554 239648 240225 240645 241503 243048 244746 245678 245625 245498 246275 247554 247730 245843
54438 245843 242776 240318 239516 240425 242782 245850 247917 247422 244937 242847 242522 243028 243228 243684 245220 246941
54422 246941 247553 247840 249766 253320 256335 257688 258717 260834 263423 265108 265711 265829 265485 264399 263031
54407 263031 262373 263021 265082 268466 272558 276100 278145 278961 279500 280227 280853 280854 279842 277741 274989 272345
54391 272345 270392 269577 270530 273351 276410 277078 274380 270089 266408 263477 260149 256361 253342 251805 251329
54376 251329 251573 252871 255224 257616 258913 258942 258396 257992 257980 258147 258027 257238 255719 253648 251293 249094 247670
54359 247670 247397 248087 249307 250885 252845 255086 257484 260151 263211 266433 269388 271794 273338 273468 271972
54344 271972 269689 268004 267594 268100 269022 270283 271743 272944 273785 274869 276561 278118 278541 278157 278512 280490
54328 280490 283232 285266 286090 286088 285461 284125 282522 281548 281497 281818 282234 283434 286130 289953 293863 297303 300375
54311 300375 303198 305736 308185 311027 314625 318929 323344 326762 328281 328296 328312 329117 329718 328760 326274 323136
54295 323136 319586 315729 312955 312908 314753 315180 311899 305969 300077 295760 293093 291877 291850 292352 292847 293403
54279 293403 293914 293406 291044 287478 284271 282136 280499 278641 276590 274836 273647 272782 271783 270692 270386
54264 270386 271665 273974 275823 276616 277074 277433 276557 273846 270994 270388 272261 274714 276236 276856 276944 276330
54248 276330 274996 273537 272419 271432 270269 269132 268556 268996 270648 273177 275712 277546 278754 279621 279774
54233 279774 278661 276664 274803 273350 271598 269105 266280 263691 261752 261199 262702 265511 267609 267936 267651
54218 267651 268466 270571 273087 275769 278958 282190 284234 284821 285287 286990 289645 291736 292222 291399 290339
54203 290339 289921 290342 291164 291637 291120 289497 287339 285622 285126 285885 287094 287633 286906 285385 284212 284146 284923
54186 284923 285807 286542 287341 288076 288165 287487 286819 286878 287410 287692 287510 287037 286226 285119 284517 285380 287482 289371
54168 289371 289830 288815 286945 284745 282527 280390 278221 276167 274967 275068 275618 275398 274739 275174 276918 278265
54152 278265 278233 278214 279667 281380 280831 277572 273518 270200 267563 265500 264730 265601 267435 269662 272423 275534
54136 275534 278106 279911 281820 283993 284887 283296 280419 278426 277652 276755 275215 273950 273500 273278 272978 273223
54120 273223 274210 275111 275630 276849 279368 281682 282007 281198 282089 285755 289914 291714 290994 289887 289913 290606 290820
54103 290820 290207 288980 287061 284339 281487 279623 278947 278423 277231 275945 275570 275929 276008 275728 276133 277491
54087 277491 278396 277670 276390 276894 280030 284278 287413 288177 286458 282921 278814 275464 273459 272503 272088 271939
54071 271939 271990 272512 274191 277395 281321 284650 287132 289669 292622 294978 295694 295062 294203 293981 295008 297896
54055 297896 302575 307935 313030 318200 324150 330424 335836 340109 344060 348381 353254 358870 364961 369835
54041 369835 371407 369717 367178 365786 365255 364491 363471 362469 360578 356690 351429 346543 342519 338300 333507
54026 333507 329407 327119 325963 324411 321884 318953 316423 315005 315359 317583 320795 323871 326497 329010
54012 329010 331399 333112 333805 333768 333577 333749 334709 336583 338923 340996 342458 343478 344286 344930 345470 345974 346351
53995 346351 346530 346701 346965 346985 346730 347386 350448 355552 360278 362786 363832 365431 368377 372254 377216 384077
53979 384077 392438 400217 405876 410372 416069 424206 434148 444760 455567 466384 476567 485274 492410
53966 492410 498819 505350 511946 517836 522413 525666 527941 529729 531540 533379 534273 532985 529481 525056
53952 525056 520767 516476 511882 507551 503962 500204 494762 487388 479177 471049 463244 456216 450712 446684
53938 446684 443086 439110 434848 430595 426398 422565 419675 417703 415876 413727 411572 409751 408275 407391
53924 407391 407426 407811 407462 406653 407195 410006 413756 416828 419358 422153 424844 426788 428963 433175 439758 447548
53908 447548 455724 463990 471181 475530 476573 475311 472362 467530 461469 455938 451555 446813 440385 433257
53894 433257 427462 423696 421335 420022 419909 420718 421850 423332 425674 428847 432327 436178 441183 447617 454619
53879 454619 461174 467177 473125 479105 484648 489462 493776 497814 501283 503873 506238 509938 516015 523832
53865 523832 531815 539229 546697 554859 563093 570023 575169 579779 585956 594981 606413 618866 631621
53852 631621 645207 660095 675200 688375 698342 705498 710759 714412 716535 717880 719583 722116 724968
53839 724968 727251 728308 727830 725670 721538 714934 705727 694885 684101 674312 664972 655063 644395 633428
53825 633428 622334 610942 599390 588121 577336 567029 557494 549065 541437 534028 527141 521876 518532
53812 518532 515794 512011 506660 500109 492652 484594 476765 469885 463548 456842 450028 444652 441572 439660
53798 439660 437003 432878 428083 423805 420740 418848 417285 414749 410609 405609 400950 396896 392892 388926
53784 388926 385909 384578 384735 385815 387469 389276 390576 391172 391731 392956 394696 396345 397743 399135 400455
53769 400455 401257 401233 400417 399058 397663 396935 397176 397951 398760 399738 401128 402470 403240 404261 407295 412747 418603
53752 418603 422378 423721 424441 426225 429167 432552 436273 440860 446464 452554 458824 465870 474402 483961
53738 483961 492998 500382 506395 512111 518292 525242 533132 541696 549795 556056 560252 563630 567549 571903
53724 571903 575052 575345 572781 569121 566227 564320 562158 558794 554431 549322 542768 534106 524277 515400
53710 515400 508688 503452 498149 491803 484388 476560 469343 463600 459541 456869 455309 454589 453947 452207 448594
53695 448594 443326 437477 432408 428910 426433 423466 419300 415212 413175 413547 414761 415156 414295 412509 410122
53680 410122 407433 404836 402787 402053 403603 407278 410932 412406 412456 414095 418435 422862 424492 424001 424412
53665 424412 426922 429805 431256 431645 432566 434812 437965 441212 443956 445900 447112 448136 449883 453110 457779
53650 457779 463002 467886 472280 476331 479647 481904 484168 488343 494767 501413 506242 509447 512538 516137
53636 516137 519781 523217 526660 530147 533739 538043 543450 549161 554093 558460 563247 568231 571822 572983
53622 572983 572110 569951 566916 563765 561651 560780 559950 558065 555381 552813 550841 549664 549553 550268 550717 550085
53606 550085 548889 548185 548023 547495 546249 545215 545594 547388 549152 549285 547659 545891 545738 547264 548928 549392
53590 549392 548720 547843 547468 547712 548137 547887 546427 544538 544044 546119 550328 555587 561402 567666 573899 579484
53574 579484 584385 588989 593485 597893 602339 606784 610780 614181 617751 622438 628225 634375 640511 646733
53560 646733 652885 658584 663944 669389 674774 679595 684138 689367 695386 700992 705279 708746 712208 715596
53546 715596 718846 723101 729574 737412 744089 748177 750600 752755 754538 755048 754483 754163 754759 755384 754664 752191
53530 752191 748698 745232 742483 740687 739730 739172 738297 736385 733139 728945 724578 720620 717159 713984 710878
53515 710878 707731 704666 702149 700658 699992 699204 697481 694865 691899 688986 686582 685488 686119 687618 688664
53500 688664 689199 690383 692576 694483 694987 694888 695782 697864 700002 701771 704180 708216 713684 719871 726548
53485 726548 733714 740921 747527 753520 759637 766697 775012 784440 794769 805919 817777 830054 842640
53472 842640 856119 871399 888518 906270 923583 940937 959794 980933 1004085 1028969 1055614
53461 1055614 1083590 1112029 1140801 1170732 1202150 1234082 1265598 1297270 1330516 1366080 1403868
53450 1403868 1443720 1485248 1527255 1568443 1608876 1649954 1692693 1736610 1780375 1823032 1864375
53439 1864375 1904640 1944015 1982197 2018393 2052125 2084049 2115615 2147826 2180541 2212821 2243544
53428 2243544 2271931 2298126 2323356 2348966 2375158 2401081 2426054 2450102 2473276 2495201 2515552
53417 2515552 2534334 2551393 2566150 2578102 2587039 2592540 2593876 2590876 2584369 2575308 2563819 2549452
53405 2549452 2531952 2511513 2488804 2465033 2441280 2417263 2391514 2363396 2334198 2305384 2276463
53394 2276463 2245751 2212789 2178827 2145189 2112343 2080445 2049602 2019607 1990623 1964043 1941220
53383 1941220 1921136 1901023 1880025 1860783 1846295 1836371 1828403 1820736 1813887 1809122 1807337 1809167 1814806
53370 1814806 1823473 1833943 1845701 1858992 1873966 1890732 1909995 1932511 1957824 1984724 2013243
53359 2013243 2045070 2081332 2120848 2161369 2202027 2243875 2288504 2336922 2389573 2446494 2507085
53348 2507085 2570127 2634497 2699964 2767238 2837160 2909811 2984538 3060801 3138726 3218648 3300486
53337 3300486 3383992 3469282 3556475 3644864 3733082 3820262 3906606 3992788 4079245 4165952 4252168
53326 4252168 4336213 4416195 4491366 4562255 4629204 4691329 4747355 4797001 4840955 4879677 4912673
53315 4912673 4938892 4957600 4968966 4973837 4972597 4964095 4946097 4916999 4876766 4826224 4766183 4697772
53303 4697772 4623021 4544298 4463124 4379839 4294186 4205977 4115504 4023689 3931660 3840015 3748988
53292 3748988 3659518 3573411 3491865 3414361 3339635 3267109 3196478 3126561 3055980 2985049 2915817
53281 2915817 2849951 2787536 2728211 2672325 2620135 2570705 2522772 2476514 2433619 2395460 2361883
53270 2361883 2331897 2304871 2280471 2257823 2235620 2213324 2191783 2172197 2154727 2138561 2123122
53259 2123122 2108580 2095238 2083134 2072432 2063499 2056272 2050242 2045588 2043659 2045571 2050773 2057811 2066212
53246 2066212 2076717 2089818 2105036 2121902 2140871 2162772 2187746 2215070 2243997 2274652 2308083
53235 2308083 2345065 2384620 2424133 2461557 2497250 2533073 2569970 2607214 2643820 2679561 2714228
53224 2714228 2746717 2775445 2799361 2818324 2832890 2843917 2851989 2856982 2858384 2855908 2849343 2838056
53212 2838056 2821567 2800620 2776618 2749602 2717865 2680423 2639066 2596924 2555348 2513144 2468672
53201 2468672 2421613 2372509 2321689 2269415 2216698 2165019 2114976 2065607 2015500 1964515 1914037
53190 1914037 1865444 1818770 1773154 1728124 1683807 1640238 1597375 1555770 1516313 1478900 1442096
53179 1442096 1404696 1367283 1331856 1300133 1272353 1247183 1222545 1197070 1171285 1146998 1125265
53168 1125265 1105443 1086577 1068872 1052975 1038332 1023336 1006945 989245 970486 950648 930243
53157 930243 910554 892385 875120 857708 840200 823569 808114 792870 776952 760945 746402
53146 746402 734085 723251 712682 701868 690891 679690 668054 656136 644339 632707 621024
53135 621024 609564 599126 590093 581982 574225 566930 560569 555310 550917 546854 542230 536275 529313 522733
53121 522733 517396 512601 507342 502087 498181 495670 492912 488692 483798 479961 477806 476434 474640 471976
53107 471976 468865 466165 464635 464443 465060 465681 465692 464763 462867 460508 458765 458585 459846 461328 461835 461325
53091 461325 460768 460931 461534 461708 461024 459751 458224 456447 454478 452796 451886 451648 451629 451761 452498 454047 455777
53074 455777 456597 455956 454429 453365 453870 455962 458591 460514 461191 461016 460961 462059 464910 469251 473997 477998
53058 477998 480861 482931 484537 485588 486085 486697 488388 491366 494723 497428 499486 501756 504600 507167 508273
53043 508273 507622 505779 503199 499858 495742 491064 485928 480407 475180 471476 469792 468971 467128 463423 458649
53028 458649 454183 450779 448327 446407 444873 443869 443320 442609 441079 438831 436556 434467 431992 428909 426188
53013 426188 425025 425279 425529 424591 422374 419407 416250 413526 411810 411219 411534 412805 415228 418162 420042
52998 420042 419917 418638 417799 417745 417354 415750 413448 411530 410365 409632 409222 409477 410616 412429 414651 417297
52982 417297 420382 423496 425819 426566 425493 423136 420480 418202 416249 414392 412998 412720 413416 414030 413960 413999
52966 413999 415376 418148 421047 422739 422854 422037 421424 421755 422556 422571 421504 420702 421167 421509 419443 415351 412733
52949 412733 414341 419040 423389 425424 425925 426596 428199 430251 431568 431010 428362 424675 421432 419345 418089
52934 418089 416982 415700 414611 414638 416527 420031 424046 427611 430385 432295 433535 435007 437751 441426 444329
52919 444329 445524 446047 447227 448784 449650 449780 449860 449816 449090 448125 448233 449966 452729 455913 459342 462574 464873
52902 464873 465994 466184 465553 464361 463567 463817 464124 463098 461503 461866 465068 468925 470804 470200 467961 464553
52886 464553 460365 456476 453595 450935 447465 443667 440808 438933 436980 434594 432514 431190 430293 429773 430142
52871 430142 431350 432323 432223 431441 430741 430021 428724 427205 426876 428721 432063 435103 436498 436193 434879 433170
52855 433170 431438 430018 429057 428330 427629 427254 427631 428488 428922 428398 427260 426219 425808 426335 427720 429111 429281
52838 429281 427873 425938 424983 425677 427532 429438 430454 430696 431481 433984 437601 440481 441864 442931 444864
52823 444864 447094 448340 448506 448557 449110 450184 451899 454300 456777 458693 460380 462525 464792 466176 466641
52808 466641 467189 468245 469220 469927 471193 473448 475831 477430 478545 479872 481167 481686 481373 480615 479082 475882
52792 475882 470854 464905 458992 453493 448580 444362 440347 435640 430277 425810 423770 423798 424053 423413 422484
52777 422484 422227 422334 421647 419808 417768 416607 416461 416731 416891 416741 416192 415274 414343 413972 414492 415680 416806
52760 416806 416981 415660 413038 409894 406898 404139 401442 398946 397150 396434 396842 398338 400960 404539 408409
52745 408409 411712 414065 415819 417499 419016 419657 418954 417417 416201 416034 416583 416785 415655 412916 409125
52730 409125 405252 401989 399481 397795 397261 397891 398641 398079 395988 393767 392823 393051 393296 392912 392333 392323 393205
52713 393205 394711 396072 396266 394774 392278 390273 389820 390827 392495 394053 394917 394643 393254 391529 390445
52698 390445 390134 389741 388592 387280 387169 388885 391730 394656 397266 399670 401957 404325 407174 410355 412706
52683 412706 413214 412456 411982 412371 413042 413983 416236 419985 423477 424934 424791 424946 426406 428801 431739 435177
52667 435177 438464 440312 440197 439053 438234 438338 439103 439779 439471 437901 436081 435424 435804 435247 432153 427333
52651 427333 423212 421389 421531 422330 422750 422384 421339 420190 419720 420397 422077 424288 426694 429168 431434 432846
52635 432846 432730 431135 429080 427842 427858 428489 428866 428799 428770 429230 430060 430659 430492 429646 428901 429080 430195 431383
52617 431383 431807 431466 430920 430494 430202 430352 431470 433286 434361 433432 430962 428706 427878 428445 430131 433036
52601 433036 436865 440574 443626 446806 450781 454470 456110 455663 454917 455298 456933 459819 464237 469385 473158
52586 473158 474410 474340 474513 474457 472532 468501 463811 459657 456228 453835 453307 454772 456960 458265 458098 457058
52570 457058 456332 457014 459374 462550 465353 467491 469593 472079 474514 476115 476387 475273 473219 471158 469810
52555 469810 468884 467474 465440 463889 464007 465740 467787 468654 467714 465682 464150 464296 465882 467643 468538 468368
52539 468368 467452 466370 465965 466956 469273 472137 474791 476850 478042 478212 477604 476691 475749 475029 475138 476511
52523 476511 478506 479885 480368 480975 482586 484926 487297 489462 491298 492303 492256 491984 492643 494243 495397 494649
52507 494649 491826 488170 485360 484326 484818 486014 487312 488352 488571 487389 484960 482218 479971 478349 477289
52492 477289 477066 477946 479601 481212 482014 481634 480168 478182 476529 475899 476349 477123 476999 475266 472615 470652
52476 470652 470183 470403 470262 470051 470840 472820 475194 477425 479464 480943 481360 481174 481421 482087 482145 481529 481625 483153
52458 483153 484894 485470 485277 485603 486754 488253 490199 493199 497240 501682 506199 510930 515957 521238 526726
52443 526726 531886 535505 536701 535800 533651 530586 526815 523240 520832 519418 517946 515812 513195 510315
52429 510315 507123 503633 499920 496026 492444 490220 489796 490170 490173 490216 491649 494584 497506 499153 499734 500227
52413 500227 501477 504134 508281 512670 515253 515181 513689 512592 512496 512929 513559 514563 516040 517762 519623 522002
52397 522002 525469 530043 534818 538596 541005 542670 544018 544392 542929 539933 536600 533493 530148 526234
52383 526234 522274 518901 515991 513041 510105 507894 506985 507075 507131 506428 505345 504818 504978 504926 504113 503188 502867
52366 502867 502624 501366 499027 496617 494986 494364 494785 496055 497552 499053 501560 506223 512529 518647 523618
52351 523618 528143 533201 539019 545567 552934 560898 569174 578264 588979 600835 612090 621705 630063
52338 630063 637252 641921 642562 638977 631871 622160 611402 601730 594259 588365 583278 579408 577139 575426
52324 575426 572910 569622 566373 563340 560713 559993 562685 567813 572447 575000 576692 579503 583954 589295
52310 589295 594706 599740 604445 609685 616579 625007 633189 639287 643076 645627 647763 649365 649978 649562 648551
52295 648551 647417 646333 645293 644461 644150 644430 645096 646239 648534 652573 658114 664276 670264 675734 680846
52280 680846 686394 693453 702293 711872 720954 729537 738704 749374 761821 776020 791628 807809 824029
52267 824029 841050 860290 882113 905585 930068 956160 984601 1014949 1045821 1075998 1104869
52256 1104869 1132198 1158054 1182867 1207337 1232166 1257726 1283690 1309106 1333221 1356184 1378598
52245 1378598 1400579 1421719 1441745 1460551 1477841 1493633 1508891 1524494 1539453 1551497 1559972
52234 1559972 1566937 1574523 1582215 1587800 1590180 1589932 1587559 1582718 1575397 1566660 1557744 1549022 1540258 1531419
52220 1531419 1523012 1515980 1511402 1509929 1511319 1514808 1519957 1526897 1535780 1546435 1558656 1572312 1586971
52207 1586971 1601797 1616261 1630765 1646182 1662778 1679863 1696651 1713203 1730242 1748062 1766005
52196 1766005 1783211 1799503 1815054 1829521 1842319 1853851 1865489 1877778 1889316 1898126 1903639 1906532
52184 1906532 1907130 1905081 1900437 1893734 1884719 1872261 1856226 1838535 1821436 1805371 1789537 1774014
52172 1774014 1760004 1747853 1736049 1722893 1708607 1695088 1683819 1674500 1665684 1656383 1646991 1638856
52160 1638856 1633135 1630017 1628958 1629375 1630864 1632898 1634857 1636577 1638550 1641345 1645077 1649687 1655408 1662467
52146 1662467 1670460 1678523 1686135 1693391 1700442 1707140 1713357 1719200 1724651 1729297 1732753 1735239 1737597 1740831
52132 1740831 1745636 1751961 1758864 1765137 1770294 1774771 1779067 1783230 1787355 1791831 1796511 1800247 1802119 1802657
52118 1802657 1802896 1802461 1799701 1793776 1785489 1775968 1765710 1755306 1745844 1737756 1730239 1722719 1716035 1711174
52104 1711174 1707679 1704637 1702567 1702694 1704531 1706009 1706403 1707617 1711694 1718136 1724649 1729747 1733643 1737185
52090 1737185 1740879 1744765 1748362 1750863 1752048 1752940 1754856 1757882 1760934 1763359 1765733 1768929 1773116 1778102
52076 1778102 1784067 1791270 1799273 1807173 1814785 1823144 1833420 1845655 1859101 1873788 1891025 1911820
52064 1911820 1935362 1959943 1985411 2013755 2046849 2084361 2124372 2165417 2207140 2249443 2291890
52053 2291890 2333753 2373772 2410032 2441098 2467440 2490895 2512416 2531065 2545389 2554903 2559856 2560542
52041 2560542 2557667 2552776 2547395 2542019 2536475 2530840 2525281 2519463 2512979 2506026 2498673 2489776 2477870 2463340
52027 2463340 2448437 2434567 2420451 2403757 2383973 2362955 2343043 2325463 2310373 2297626 2287110
52016 2287110 2278722 2272477 2268780 2268389 2271691 2277779 2284804 2291908 2300555 2312955 2329052 2346099 2361640
52003 2361640 2375959 2390922 2407322 2424303 2440597 2455083 2466543 2474286 2479077 2482377 2484567 2484962
51991 2484962 2483605 2481781 2480229 2477939 2473347 2465938 2456143 2444477 2431450 2417488 2401995 2383072 2359230
51978 2359230 2331174 2301162 2270846 2240456 2209871 2179626 2150811 2124481 2101049 2079851 2059705
51967 2059705 2040486 2023592 2009947 1998033 1985174 1970651 1956176 1943148 1930869 1918162 1905372
51956 1905372 1893678 1883106 1872310 1859994 1845806 1830188 1814020 1798152 1782627 1766587 1749370
51945 1749370 1731217 1712276 1691476 1667419 1640260 1611818 1583767 1556469 1529545 1502669 1475560
51934 1475560 1447985 1420330 1393760 1369496 1348102 1329499 1313148 1298037 1282998 1267395 1251330
51923 1251330 1235148 1219196 1204129 1190794 1179343 1168814 1157974 1146272 1133542 1119106 1101925
51912 1101925 1081887 1060650 1040878 1024527 1011782 1001627 993337 987196 983719 982640 983135 984876 988175
51899 988175 993129 999370 1006907 1016400 1027987 1040379 1051869 1061967 1071241 1079672 1086097 1089697 1091439
51886 1091439 1093377 1096647 1100708 1104756 1109526 1117316 1130295 1149126 1173159 1201216 1231645 1262091
51874 1262091 1290106 1314216 1333872 1348453 1357026 1359270 1355916 1347784 1334898 1316986 1294456 1268389
51862 1268389 1239767 1209113 1176787 1143505 1110692 1080115 1052509 1026595 1000412 973960 949373
51851 949373 927933 908184 888242 868974 853123 841697 833065 825728 820173 817297 816500 816523 817360 820234
51837 820234 825986 834166 843378 851974 858766 863677 867440 870156 870429 866572 858625 848609 838637 829168
51823 829168 819293 808522 797944 789500 784272 781776 780951 781386 783285 786626 790953 795829 801033 806509
51809 806509 812556 819733 827850 835406 841014 845155 849215 852696 852954 848482 841303 835006 831139 828492
51795 828492 825339 821323 817475 815343 815966 818932 822452 824928 826289 827391 828556 829377 829479 828570 825955
51780 825955 820993 814106 806478 798597 789806 779558 768638 758778 751214 745675 740741 735432 730496 727691
51766 727691 727509 728362 728571 728376 728956 730024 729802 727269 723240 719122 715728 713347 711743 709794 706450 702571
51750 702571 700569 701496 703604 704665 704645 705038 706544 708837 711968 716231 720621 722967 722127 719106 715712
51735 715712 713077 711761 712058 713240 713377 711148 707581 704936 703871 702747 699980 696124 693029 691636 691397
51720 691397 691479 691647 691986 692613 693776 695588 697381 698076 697607 697487 699365 703368 708302 713137 717758 722566
51704 722566 727961 734181 741212 748892 757302 766680 776554 785539 792696 798691 804704 810364 813646 812659
51690 812659 806727 795995 781343 764865 749185 735635 723910 713786 706077 701320 698669 697042
51678 697042 696518 697594 699895 702860 707249 714565 725025 737197 749617 761656 772733 781948 789124
51665 789124 795346 801677 807836 812843 816647 820201 823880 826534 826579 823679 818866 813201 807015 800582 794696
51650 794696 789824 785114 779176 771745 763788 756053 748629 742145 738133 737474 739362 742585 746892 752139
51636 752139 756975 759835 760912 761760 762937 763343 762012 759419 756625 754114 751948 750177 748538 746414 743601
51621 743601 740682 738205 736008 733780 731794 730652 730741 732368 736026 741967 749690 758247 766896 775227 783050
51606 783050 790601 798695 808226 819434 831833 844615 856918 867822 876314 881247 881481 876555 867463
51593 867463 856412 845475 835596 826960 819943 815368 814062 816231 820737 824837 825463 821653 815489 809934
51579 809934 805880 801923 796693 790379 783808 777155 770230 763293 756648 749718 741508 732142 723188 715967
51565 715967 710031 703832 696635 689087 682016 675486 669416 664406 661118 659078 656924 654015 651142 649355
51551 649355 648601 647902 646623 645165 644544 645481 647683 649877 650890 650990 651815 654578 658621 662340 665378 669210
51535 669210 675371 683724 692992 702675 713762 727222 742084 755445 764531 768651 769202 768196 767088
51522 767088 766624 766970 767680 768046 767971 768414 770751 775782 783387 792798 803136 814192 827024 843346 863782
51507 863782 886964 910846 934716 959344 985238 1011376 1035885 1057770 1078019 1099292 1124295
51496 1124295 1153930 1186960 1221686 1257657 1295111 1332975 1368347 1398239 1421252 1437294 1446387
51485 1446387 1448266 1442725 1429864 1410308 1385522 1357582 1328148 1297831 1266835 1235819 1205579 1176188
51473 1176188 1147130 1118354 1090634 1064667 1040173 1016112 991705 967175 943603 921993 902369
51462 902369 883815 865515 847663 831188 816734 804025 792087 779917 767227 754881 744420
51451 744420 736707 731040 725964 720829 716111 712238 708747 704858 700414 695932 692101 689535 688571 688753 688686
51436 688686 687158 684633 683235 684849 689358 694901 699684 703233 705929 707870 708665 708317 707779 708223 709774
51421 709774 711245 711134 708762 704410 698703 692117 685062 678087 671625 665473 658836 651346 644039 638794
51407 638794 636327 634916 631717 625537 618069 612301 609974 610627 612549 614059 614116 612546 610271 609049 610294
51392 610294 613818 617874 620738 622243 623654 626308 630757 637151 645707 656331 668181 680284 692598
51379 692598 706063 721564 739091 757657 775513 790535 801140 807148 809413 808595 804887 798988 792415
51366 792415 786203 779778 771887 762431 752772 744408 737853 732753 728427 724210 719711 715020 710487 706327
51352 706327 702593 699386 696814 694929 694031 694858 697928 702661 707610 711737 715223 719064 724080 730260 736781
51337 736781 742735 748099 753737 760157 766699 772677 778945 787299 798291 810751 823798 838292 855635
51324 855635 875988 898578 923182 950342 980424 1013445 1049858 1090632 1136240 1186061 1239047
51313 1239047 1294723 1353126 1413626 1473617 1528422 1572982 1604271 1622318 1629006 1626162 1614704 1594815
51301 1594815 1566295 1529042 1483817 1432546 1377638 1321180 1264876 1210000 1156868 1105001 1054666
51290 1054666 1007761 966247 930158 898291 870437 847283 828171 810835 794093 779142 767083
51279 767083 756672 746152 736212 729061 724828 720866 715003 707863 701333 696068 691420 686703 681415 674907
51265 674907 667100 659269 653074 648730 644986 640915 636901 633743 631693 630764 631083 632240 632949 632317 631162
51250 631162 631095 632331 633440 633562 633791 635608 638671 641243 642548 643569 645249 646893 647085 645753 644587
51235 644587 645324 647968 650812 652086 651530 650371 649820 649842 649728 649583 650480 652869 655568 657019 657251 657886 660329
51218 660329 664700 670509 677515 685427 693325 700069 705145 708759 711248 712760 713432 713530 713413 713585 714619
51203 714619 716665 719110 721142 722679 724292 726071 727089 726427 724435 722420 721112 719884 717634 714051
51189 714051 709718 705204 700488 695394 690263 685849 682520 679822 677019 673915 670914 668352 666093 663874
51175 663874 661742 659924 658470 657200 655926 654544 652991 651231 649169 646564 643358 640212 638234 637787
51161 637787 637935 637607 637033 637401 639263 642075 645211 648558 651851 654314 655517 656031 656768 658108 660117 663071
51145 663071 667167 672093 677464 683334 689626 695348 699158 700755 701215 701890 703293 704968 706098 706333 706170
51130 706170 706241 706083 704339 700702 696923 694986 694938 695583 696683 698877 701600 703040 702681 702285 703427 705375
51114 705375 706487 706548 706327 705597 703241 699218 695080 692244 690677 689438 687811 685706 683603 682340 682539
51099 682539 684085 686456 689456 693158 697212 700829 703552 705528 706932 707598 707433 706779 706123 705680 705370 705028
51083 705028 704634 704535 705235 706617 707570 706925 704758 702141 699684 697056 694132 691746 690698 690682 690945 691643 693593
51066 693593 696640 699096 699348 697744 696491 697663 701445 706270 710409 713313 715512 717655 719944 722412
51052 722412 725254 728633 732356 735956 738955 741031 742245 743387 745733 749866 754801 758813 761294 763274
51038 763274 765879 768876 771299 773111 775374 778678 782143 784278 784357 782699 780181 778052 777714 779846 783673
51023 783673 787655 790916 793594 795855 797246 797280 796220 795073 795053 797081 801335 807057 813124 819002 824943
51008 824943 831400 838794 847743 858643 870733 882506 893679 906068 921796 941261 963764 989412
50996 989412 1018898 1051228 1082856 1109853 1130608 1146277 1159217 1171378 1183771 1196648 1209698
50985 1209698 1221926 1231750 1238033 1241433 1244038 1246862 1248047 1244376 1234498 1219938 1203246 1186324 1170606
50972 1170606 1157295 1146310 1135636 1122734 1106626 1088158 1068602 1048660 1028828 1010147 994241
50961 994241 982541 975355 971639 969827 968968 969130 971037 975760 984451 997435 1013152 1028628 1041588
50948 1041588 1052067 1061867 1072677 1084799 1097171 1108257 1117176 1124176 1129833 1133910 1135625 1135149 1134002
50935 1134002 1133467 1133244 1132386 1131106 1130854 1132742 1136541 1141329 1146745 1153546 1163088 1176094 1191765 1208384
50921 1208384 1225082 1242736 1262925 1286426 1312970 1341850 1372076 1402369 1431759 1460155 1488032
50910 1488032 1515993 1545229 1577810 1615480 1658259 1705145 1756094 1812270 1874154 1940479 2009687
50899 2009687 2081748 2157805 2238246 2321644 2405602 2488353 2569412 2648632 2724824 2795814 2860227
50888 2860227 2918716 2972696 3022134 3065416 3101256 3129833 3152074 3168973 3181980 3192970 3202977
50877 3202977 3211494 3217540 3220722 3220667 3216276 3206775 3193217 3177798 3161463 3142863 3119809 3091116 3056860
50864 3056860 3017502 2973299 2924366 2870806 2812643 2749817 2682612 2612340 2541363 2471781 2403844
50853 2403844 2336111 2267546 2199209 2133581 2072672 2017120 1966628 1920545 1878115 1838721 1801890
50842 1801890 1766862 1732686 1699362 1668410 1641367 1617952 1596697 1577177 1560323 1546320 1533656
50831 1533656 1521103 1509515 1500565 1494343 1489322 1484434 1480169 1477769 1478125 1481398 1486834 1492883 1498277 1503230
50817 1503230 1509040 1516539 1525532 1535834 1548019 1562810 1580385 1600617 1623393 1648313 1674711 1702548
50805 1702548 1732863 1766609 1803357 1841863 1881916 1924979 1972784 2025665 2082490 2142064 2204563
50794 2204563 2271695 2345479 2426757 2515003 2609557 2710784 2819966 2938455 3067167 3206304
50784 3206304 3354935 3511165 3673431 3841604 4016216 4196680 4380909 4566549 4751543
50775 4751543 4933128 5107064 5268601 5413932 5540498 5646632 5731750 5796650 5842879 5871721
50765 5871721 5884293 5882543 5869627 5849072 5823872 5796543 5769671 5745951 5727406 5714449 5705707 5698698
50753 5698698 5690436 5677223 5654492 5618156 5566578 5500517 5420529 5325196 5212759 5083900 4941636
50742 4941636 4788640 4626162 4455985 4282120 4109517 3941706 3780571 3627818 3485356
50733 3485356 3354183 3233886 3123810 3024224 2936050 2859796 2795086 2740913 2695920 2658504 2627067
50722 2627067 2600440 2578037 2559516 2544186 2530762 2517791 2504436 2490802 2477316 2463775 2449167
50711 2449167 2432493 2413681 2393556 2373072 2352649 2332045 2310480 2286813 2260087 2230440 2199491
50700 2199491 2169336 2140840 2113116 2084977 2056718 2030066 2006473 1986121 1968924 1955863 1948496
50689 1948496 1947120 1950226 1956080 1964419 1976306 1992820 2014463 2041503 2074000 2111400 2152779 2197775
50677 2197775 2246822 2300202 2357414 2417957 2482323 2551591 2626166 2705433 2788638 2875518 2965912
50666 2965912 3059071 3153562 3247727 3340305 3430870 3519679 3606881 3691771 3772868 3848471 3916883
50655 3916883 3976336 4025100 4061692 4084800 4093428 4087672 4069230 4040661 4004415 3963256 3921153 3882301
50643 3882301 3848838 3820525 3797100 3779809 3769771 3765737 3764670 3764102 3762796 3759290 3750940 3734770 3708701
50630 3708701 3671809 3624042 3566083 3499343 3425864 3347990 3267834 3187037 3107460 3032040 2964027
50619 2964027 2904882 2853664 2809156 2771834 2743002 2722872 2710783 2706861 2712033 2726456 2749181 2779230
50607 2779230 2815714 2856779 2899899 2943616 2987914 3032570 3076422 3118754 3160098 3200932 3240736
50596 3240736 3279258 3317635 3357149 3397599 3437998 3478170 3518523 3558762 3598168 3637075 3677003
50585 3677003 3719328 3764695 3813603 3866538 3923218 3982498 4043448 4106189 4171545 4240139 4311772
50574 4311772 4385362 4459404 4532684 4604318 4673062 4737245 4795899 4849376 4898156 4941662 4979265
50563 4979265 5011834 5040283 5061991 5070168 5058406 5026026 4978689 4924232 4868435 4814169 4763049
50552 4763049 4716751 4676710 4643344 4616269 4595330 4580835 4572360 4567539 4562413 4552922 4535954 4509415
50540 4509415 4471921 4422584 4360868 4286724 4201006 4105505 4002215 3892702 3778440 3661419
50530 3661419 3543892 3427718 3314340 3205121 3101151 3002952 2910880 2825575 2747492 2676377
50520 2676377 2612035 2555178 2506389 2464446 2427151 2394089 2367194 2347871 2334771 2325395 2319019 2316868
50508 2316868 2320021 2328375 2341444 2358935 2380361 2405016 2432680 2463704 2498135 2535311 2574713 2616804
50496 2616804 2662567 2712330 2765310 2820304 2876708 2934906 2995760 3059623 3125820 3193035 3260257
50485 3260257 3327335 3394726 3462817 3531623 3601202 3672381 3746805 3826032 3910579 4000114 4094685
50474 4094685 4195629 4305117 4424806 4554767 4693599 4839659 4992387 5152461 5320657
50465 5320657 5496764 5679754 5868527 6061956 6258485 6456447 6654682 6851963 7045411
50456 7045411 7230143 7401002 7554340 7687932 7799682 7886951 7946833 7976764 7975191 7942192
50446 7942192 7879400 7789301 7674930 7540395 7391076 7232805 7071045 6910983 6757738 6615830
50436 6615830 6488819 6379825 6291775 6226336 6182992 6159851 6154892 6165350 6186134 6210129 6230375
50425 6230375 6241099 6236560 6210359 6157185 6075011 5965095 5830298 5674162 5501212 5316833
50415 5316833 5126012 4932219 4737726 4544795 4356238 4174727 4001837 3838069 3683748
50406 3683748 3539588 3406265 3283749 3171373 3068460 2974728 2890242 2815153 2749255 2691651
50396 2691651 2641286 2598237 2564046 2540032 2525320 2517139 2513077 2512468 2515663 2522874 2534122 2549611
50384 2549611 2569488 2593560 2621675 2654144 2691256 2732367 2775626 2818379 2857631 2890516 2914998
50373 2914998 2930567 2938400 2940895 2940819 2940284 2940152 2940544 2942043 2946044 2953671 2964656 2977812 2992653 3010146
50359 3010146 3031812 3058440 3089966 3126484 3168925 3218439 3275202 3338257 3406670 3480490 3560303
50348 3560303 3646228 3737746 3834119 3934191 4035921 4136963 4235870 4332028 4424305 4510544 4588660
50337 4588660 4657284 4714891 4759188 4788151 4800909 4796755 4774140 4731886 4671017 4594117 4503288
50326 4503288 4400271 4288672 4174290 4062324 3955384 3854964 3763617 3684192 3617519 3562439
50316 3562439 3518276 3486036 3466627 3458676 3458706 3463074 3469120 3474626 3476914 3472888 3459847 3436115 3401100
50303 3401100 3355148 3299489 3235959 3166351 3092135 3015084 2937938 2863652 2793611 2726995 2662296
50292 2662296 2598999 2537133 2475514 2411537 2343370 2271979 2200511 2131886 2067454 2007772 1953759
50281 1953759 1906399 1865664 1830516 1800277 1775492 1757007 1744380 1735651 1728768 1723020 1719124 1718163
50269 1718163 1720527 1725638 1732488 1740391 1749163 1758660 1768442 1778222 1788303 1799161 1810593 1821764 1832144
50256 1832144 1841974 1851731 1861623 1871692 1881829 1891274 1898611 1902854 1904467 1905003 1906002 1908485 1913142 1920332
50242 1920332 1929898 1941422 1954776 1970193 1987902 2007960 2030308 2054737 2081044 2109715 2142366
50231 2142366 2180915 2226164 2277394 2332926 2389959 2443361 2485549 2509105 2510566 2492163 2460119
50220 2460119 2421202 2380209 2339657 2300918 2265188 2233433 2205909 2182253 2162141 2145693 2133168
50209 2133168 2124450 2118990 2116321 2116585 2120455 2128318 2139586 2153130 2168529 2186428 2207293 2230153 2253153
50196 2253153 2275222 2296703 2318423 2340710 2363385 2386157 2408667 2430358 2450383 2467549 2480516
50185 2480516 2488403 2491053 2488433 2480163 2466215 2447649 2425692 2400360 2371344 2340388 2311325 2286891
50173 2286891 2266493 2247846 2229626 2211231 2190776 2165089 2131906 2091256 2044928 1995613 1946366
50162 1946366 1899436 1855002 1811739 1769009 1727960 1690319 1656746 1626602 1598724 1572190 1546905
50151 1546905 1523761 1503844 1487315 1473420 1461506 1451339 1442403 1433871 1425734 1419071 1414472 1410803
50139 1410803 1406336 1400771 1395371 1391238 1388159 1385164 1381534 1377117 1372063 1366531 1360578 1354372 1348572 1344157
50125 1344157 1341406 1339166 1335738 1330652 1325132 1320536 1316724 1312459 1307266 1302373 1299591 1299608 1301646 1304493
50111 1304493 1307398 1310147 1313040 1317072 1323463 1332331 1342178 1351399 1360132 1369891 1381484 1394194 1407224
50098 1407224 1421052 1436845 1455199 1476164 1500034 1527297 1557917 1591358 1627452 1666853 1710631
50087 1710631 1759718 1814611 1874956 1939220 2005205 2071276 2136916 2201928 2265358 2325635 2381748
50076 2381748 2433903 2482946 2529553 2574247 2617702 2660137 2700139 2734648 2760506 2775785 2779440
50065 2779440 2770457 2748163 2713210 2667539 2613400 2552910 2488287 2421621 2354315 2287484 2222996
50054 2222996 2163231 2109445 2061066 2016895 1976320 1938935 1903786 1869750 1836345 1803754 1772546
50043 1772546 1743790 1718766 1697833 1679952 1663987 1650057 1638943 1630485 1623335 1616123 1608197 1599454
50031 1599454 1590272 1581626 1574650 1569892 1567255 1566444 1567021 1568360 1570194 1573013 1577298 1582561 1587871 1593177
50017 1593177 1599310 1606607 1614206 1620780 1625394 1627722 1628192 1627994 1628134 1628195 1626730 1623240 1619144 1616345 1615159
50002 1615159 1613980 1610704 1604327 1595560 1586243 1578082 1571829 1567638 1565683 1565856 1567136 1568212 1568912 1570421
49988 1570421 1573957 1579881 1588148 1598693 1610909 1623561 1635962 1648936 1664033 1681927 1701900 1722702
49976 1722702 1743696 1765347 1788683 1814003 1840124 1865433 1889758 1914680 1941852 1971634 2003458
49965 2003458 2036744 2070998 2105756 2141055 2177396 2214548 2250744 2283723 2312399 2337053 2358239
49954 2358239 2376126 2390763 2402376 2411147 2416707 2417667 2411650 2396396 2371161 2336745 2294063 2243362
49942 2243362 2185246 2121778 2056015 1990910 1929079 1872754 1822891 1778709 1739008 1703840 1674251
49931 1674251 1650723 1632640 1618876 1607931 1597678 1586199 1573176 1559703 1546630 1533798 1520880
49920 1520880 1507911 1494570 1479702 1462163 1441771 1419237 1395641 1372209 1350017 1329557 1310818
49909 1310818 1293896 1279012 1265883 1253705 1241992 1230862 1220241 1209508 1198427 1187889 1179164
49898 1179164 1172673 1167932 1164324 1161468 1159177 1157659 1157542 1159236 1162431 1166685 1172327 1180234 1190745 1203321
49884 1203321 1217247 1232042 1246962 1260712 1272209 1281535 1289791 1297935 1305927 1312968 1318262 1321420 1322314
49871 1322314 1320851 1316834 1309807 1299081 1284389 1266760 1248308 1230648 1213796 1197159 1181340 1168028
49859 1168028 1157868 1149388 1140724 1131913 1124663 1120147 1117924 1117144 1117862 1120523 1124666 1128998 1132831 1136886
49845 1136886 1142334 1149397 1157211 1164906 1172371 1179945 1187790 1195879 1204442 1214111 1225560 1238941 1253427
49832 1253427 1267229 1278469 1286596 1292977 1299669 1307315 1314308 1318116 1317375 1312761 1306052 1298590 1290568 1281472
49818 1281472 1270738 1257893 1242572 1225139 1207201 1190805 1176783 1164425 1153036 1143021 1134881
49807 1134881 1127980 1121447 1115977 1113451 1114590 1117975 1121778 1125664 1130561 1137256 1145762 1155487 1165430 1174533
49793 1174533 1182447 1189938 1198307 1208507 1220715 1234283 1248011 1260994 1273383 1285724 1297493 1307167
49781 1307167 1314187 1319854 1325417 1330069 1331910 1330395 1326600 1321331 1314352 1305641 1296083 1286257 1275488 1263012
49767 1263012 1249609 1237253 1227235 1219271 1212504 1206879 1203212 1202039 1202719 1203878 1204684 1205529 1207504 1211563
49753 1211563 1218236 1227528 1238537 1249568 1259377 1268318 1277643 1287597 1296745 1303355 1307054 1308993 1310705
49740 1310705 1312869 1314721 1314599 1311500 1306196 1300367 1294644 1288125 1279982 1270705 1261282 1251753 1241246 1229053
49726 1229053 1215137 1199926 1184322 1169717 1157347 1147551 1139984 1134278 1129996 1126127 1121421 1115446 1108959
49713 1108959 1103191 1099070 1096999 1096854 1098212 1101073 1106246 1114324 1124193 1133395 1140476 1146477 1153682 1163313
49699 1163313 1174802 1186741 1197865 1207364 1214988 1220964 1225514 1228537 1230070 1230701 1230862 1229813 1226122 1219357
49685 1219357 1210696 1201533 1192071 1181900 1171544 1162614 1156288 1152229 1149286 1146775 1144493 1141835 1137855
49672 1137855 1132737 1128611 1128003 1131384 1136875 1142518 1148172 1154755 1162325 1169733 1175992 1181274 1186520 1192709
49658 1192709 1200553 1210208 1221027 1232003 1242803 1254139 1267007 1281752 1297672 1312916 1324859 1331615
49646 1331615 1333703 1333574 1332942 1331234 1327255 1321533 1315922 1311320 1307132 1303036 1300019 1299179 1300275 1301998 1303042
49631 1303042 1302496 1299854 1295361 1290098 1285266 1281582 1279506 1279493 1281517 1284854 1288989 1294374 1301574 1310001 1318496
49616 1318496 1327229 1338024 1352413 1370112 1389922 1411429 1434866 1459457 1482683 1501498 1514097
49605 1514097 1520743 1523384 1524509 1525739 1527089 1527795 1528027 1529530 1534373 1543237 1554960 1567117 1576424 1579148
49591 1579148 1572546 1556752 1534942 1511058 1487406 1464554 1442915 1423420 1406571 1391651 1377565
49580 1377565 1364183 1352325 1342583 1334825 1329025 1325819 1325517 1326848 1327639 1326957 1325832 1325380 1324911 1322765 1318525
49565 1318525 1313265 1307673 1301188 1293401 1285053 1276779 1267925 1257878 1247957 1240348 1235201 1230312 1224218 1218249
49551 1218249 1214534 1212937 1211346 1208697 1206403 1206393 1208690 1211535 1213422 1214303 1214960 1215948 1217403 1219417 1222070
49536 1222070 1225177 1228361 1231327 1233740 1234905 1234118 1231649 1229006 1227880 1228985 1232038 1236467 1241658 1246812
49522 1246812 1251162 1254427 1256805 1258550 1259760 1260445 1260634 1260693 1261575 1264092 1267454 1269415 1268969 1268448 1271598 1279527
49506 1279527 1289856 1300123 1310552 1322683 1336546 1350642 1364217 1378017 1392507 1406333 1417245
49495 1417245 1424183 1427975 1429969 1430357 1428138 1422572 1414199 1404366 1394405 1385722 1379955 1377943 1378717 1380515
49481 1380515 1382737 1385925 1389964 1393756 1397046 1401174 1407195 1414363 1421338 1428010 1435151 1443175 1452278 1463092
49467 1463092 1475950 1489990 1504222 1519324 1537410 1560191 1587997 1620056 1654643 1689241 1721686
49456 1721686 1751121 1777197 1798820 1814776 1825260 1831698 1835380 1837382 1839402 1843180 1849065 1856422 1865240
49443 1865240 1875792 1886667 1894851 1898099 1895778 1887214 1871387 1849188 1824076 1798947 1773570 1746559
49431 1746559 1718753 1692927 1670701 1651294 1633140 1615549 1598945 1584591 1573975 1567554 1564120 1562081
49419 1562081 1561132 1561911 1564346 1567274 1569579 1570903 1571355 1571334 1571608 1572871 1575158 1578053 1581155 1583844 1585222
49404 1585222 1585287 1585732 1588407 1593119 1598098 1602589 1607679 1614357 1622135 1630246 1638972 1648612 1657828 1664219 1666623
49389 1666623 1666146 1664756 1663317 1661203 1657615 1652928 1648458 1644890 1641469 1637188 1632369 1628352 1625808 1624289
49375 1624289 1623529 1624196 1626871 1631101 1636178 1642346 1650532 1661199 1674116 1689050 1705957 1724533 1744218
49362 1744218 1764856 1786873 1810555 1835419 1860677 1886367 1913632 1943222 1973273 1998855 2014677
49351 2014677 2018888 2014103 2004698 1993698 1982609 1973209 1967928 1968184 1973318 1981818 1993120 2007600 2025125
49338 2025125 2044332 2063612 2082538 2102048 2123164 2145454 2166912 2185517 2200896 2214155 2226128
49327 2226128 2236294 2243627 2247820 2248978 2246652 2240301 2230728 2219803 2208273 2194992 2179278 2163131
49315 2163131 2149595 2139229 2129862 2120056 2111218 2105352 2102035 2099080 2095681 2093417 2094067 2097543 2102299 2106878
49301 2106878 2110414 2112128 2111063 2106492 2098458 2087899 2076187 2064323 2052466 2040165 2026887 2012359
49289 2012359 1996842 1981415 1967565 1956000 1946029 1936645 1928035 1921391 1917233 1914576 1911976 1908970 1906331
49276 1906331 1905173 1905834 1907299 1907753 1906167 1903326 1900973 1900092 1900610 1902502 1906208 1911926 1919536 1929517 1942683
49261 1942683 1958145 1972329 1981119 1982779 1978323 1969809 1959113 1947700 1936115 1923653 1909510 1894291
49249 1894291 1879330 1864541 1848227 1829665 1810787 1794411 1781406 1770549 1760728 1752223 1745760 1741330
49237 1741330 1738460 1737097 1737556 1739654 1742277 1744004 1744115 1743165 1742641 1743869 1746873 1750259 1752474 1753221 1753380
49222 1753380 1753618 1753697 1753430 1753605 1755078 1757269 1758602 1758572 1758446 1759541 1761716 1764209 1767243 1771786 1777919 1784286
49206 1784286 1789233 1792038 1793088 1793407 1794050 1795512 1797533 1799525 1801040 1801827 1802075 1803000 1806551 1813854 1824398
49191 1824398 1837610 1854672 1877478 1905901 1937410 1969584 2001590 2032577 2059884 2080046 2091112
49180 2091112 2093285 2087872 2076531 2061149 2043317 2023672 2002225 1979433 1956691 1935897 1918702 1905834
49168 1905834 1896767 1890286 1885767 1883664 1884472 1887680 1892301 1898080 1905467 1914426 1923900 1932614 1940188 1947455
49154 1947455 1955799 1966013 1977622 1989647 2002120 2016263 2032848 2051067 2069615 2088215 2107218
49143 2107218 2126264 2144528 2162112 2180146 2199508 2220314 2242500 2265730 2288741 2310109 2330062
49132 2330062 2350286 2371406 2391788 2409668 2425363 2440435 2455575 2470607 2486006 2502893 2521506
49121 2521506 2540856 2560204 2580001 2601070 2623722 2648216 2675495 2706770 2742421 2781772 2823990
49110 2823990 2868942 2917144 2969308 3026362 3089653 3159918 3234815 3307430 3368391 3410633 3432699
49099 3432699 3438030 3432014 3419787 3405497 3392018 3380756 3371970 3365334 3360350 3356836 3355430 3357150 3362004
49086 3362004 3368485 3375032 3381575 3389008 3397639 3407073 3417457 3429837 3445149 3463515 3484546 3507635
49074 3507635 3531974 3557036 3583186 3611176 3641015 3672027 3703928 3736965 3770998 3805568 3841175
49063 3841175 3879249 3920218 3962674 4005324 4048931 4095376 4145542 4199224 4256585 4318486 4385607
49052 4385607 4458390 4537765 4624897 4720252 4824070 4937991 5065291 5209335 5372958 5559780
49042 5559780 5774254 6017499 6281490 6548086 6797028 7019195 7224223 7432135 7651223
$$ [...]
##END NTUPLES=NMR SPECTRUM
##END=
