
##TITLE=UV1139_M5-1005-1002_6279192_vCUIXB4JKL
##JCAMPDX= 6.0         $$ Bruker NMR JCAMP-DX V2.0
##DATA TYPE= NMR SPECTRUM
##DATA CLASS= NTUPLES
##ORIGIN= BRUKER
##OWNER= Administrator
$$ 1.72 TOPSPIN		Version 2.1
$$ 2012-06-03 13:10:57.703 -0500  Administrator@TOPSPIN
$$ Compression mode = diff/dup
##.OBSERVE FREQUENCY= 400.13188235
##.OBSERVE NUCLEUS= ^1H
##.ACQUISITION MODE= SIMULTANEOUS (DQD)
##.ACQUISITION SCHEME= undefined
##.AVERAGES= 64
##.DIGITISER RES= 22
##SPECTROMETER/DATA SYSTEM= spect
##.PULSE SEQUENCE= noesygpps1d.comp
##.SOLVENT NAME= COFFEE_meoh
##.SHIFT REFERENCE= INTERNAL, COFFEE_meoh, 1, 14.9667
##AUDIT TRAIL= $$ (NUMBER, WHEN, WHO, WHERE, PROCESS, VERSION, WHAT)
$$ ##TITLE= Audit trail, TOPSPIN		Version 2.1
$$ ##JCAMPDX= 5.01
$$ ##ORIGIN= Bruker BioSpin GmbH
$$ ##OWNER= Administrator
$$ $$ C:\Bruker\TOPSPIN/data/COFFEE/nmr/UV1139_M5-1005-1002_6279192_vCUIXB4JKL/12/pdata/1/auditp.txt
$$ ##AUDIT TRAIL=  $$ (NUMBER, WHEN, WHO, WHERE, PROCESS, VERSION, WHAT)
(   1,<2012-06-03 13:10:52.625 -0500>,<Administrator>,<TOPSPIN>,<go>,<TOPSPIN 2.1>,
      <created by zg
	started at 2012-06-03 12:59:22.359 -0500,
	POWCHK enabled, PULCHK disabled,
       configuration hash MD5:
       D5 CA 7A 23 FE 6B EE E2 50 67 74 61 24 F7 5E 3B
       data hash MD5: 64K
       E9 A4 E0 06 67 84 B1 AB 31 B8 1C D5 D8 A2 36 01>)
(   2,<2012-06-03 13:10:55.421 -0500>,<Administrator>,<TOPSPIN>,<proc1d>,<TOPSPIN 2.1>,
      <Start of raw data processing
       efp LB = 0.3 FT_mod = 6 PKNL = 1 PHC0 = 0 PHC1 = 0 SI = 128K 
       data hash MD5: 128K
       5F 74 81 7B 85 7A 9A CB 53 85 B1 F6 B0 3D D0 C5>)
(   3,<2012-06-03 13:10:56.640 -0500>,<Administrator>,<TOPSPIN>,<proc1d>,<TOPSPIN 2.1>,
      <pk PHC0 = 30.00916 PHC1 = 0 
       data hash MD5: 128K
       CC 6B DF 53 41 C6 78 7C B7 89 10 08 1E 87 C4 AA>)
(   4,<2012-06-03 13:10:57.359 -0500>,<Administrator>,<TOPSPIN>,<proc1d>,<TOPSPIN 2.1>,
      <abs ABSG = 1 
       data hash MD5: 128K
       AD BC 23 D3 D8 0B 0B 86 25 1F 99 F5 F9 B4 00 7F>)
(   5,<2012-06-03 13:10:57.437 -0500>,<Administrator>,<TOPSPIN>,<proc1d>,<TOPSPIN 2.1>,
      <abs ABSG = 2 
       data hash MD5: 128K
       CC 04 E0 3F 22 89 52 E1 29 7C 25 47 0B DB 09 EF>)
(   6,<2012-06-03 13:10:57.484 -0500>,<Administrator>,<TOPSPIN>,<proc1d>,<TOPSPIN 2.1>,
      <abs ABSG = 3 
       data hash MD5: 128K
       20 46 E5 4A 88 D9 53 52 02 D6 EC 1F 28 F6 31 80>)
(   7,<2012-06-03 13:10:57.546 -0500>,<Administrator>,<TOPSPIN>,<proc1d>,<TOPSPIN 2.1>,
      <abs ABSG = 4 
       data hash MD5: 128K
       1D 6A 3E 05 70 68 C8 F7 18 8C E5 35 69 A0 30 5A>)
(   8,<2012-06-03 13:10:57.609 -0500>,<Administrator>,<TOPSPIN>,<proc1d>,<TOPSPIN 2.1>,
      <abs ABSG = 5 
       data hash MD5: 128K
       4B 5D A7 58 4F 1C 7C D2 D4 B2 7A AA 4A BC 05 44>)
$$ ##END=
$$ 
$$ $$ hash MD5
$$ $$ 34 DA 90 24 54 65 0C E0 3E C0 3C 15 D6 72 8F 9B
##$RELAX= 
##$RELAX= 
##$RELAX= 
##$RELAX= 
##$RELAX= 
##$RELAX= 
##$RELAX= 
##$RELAX= 
$$ Bruker specific parameters
$$ [...]
##$TP07= 0
##$TPNAME0= <>
##$TPNAME1= <>
##$TPNAME2= <>
##$TPNAME3= <>
##$TPNAME4= <>
##$TPNAME5= <>
##$TPNAME6= <>
##$TPNAME7= <>
##$TPOAL= (0..7)
0.5 0.5 0.5 0.5 0.5 0.5 0.5 0.5
##$TPOFFS= (0..7)
0 0 0 0 0 0 0 0
##$TUNHIN= 0
##$TUNHOUT= 0
##$TUNXOUT= 0
##$USERA1= <user>
##$USERA2= <user>
##$USERA3= <user>
##$USERA4= <user>
##$USERA5= <user>
##$V9= 5
##$VALIST= <valist>
##$VCLIST= <CCCCCCCCCCCCCCC>
##$VD= 0
##$VDLIST= <DDDDDDDDDDDDDDD>
##$VPLIST= <PPPPPPPPPPPPPPP>
##$VTLIST= <TTTTTTTTTTTTTTT>
##$WBST= 2048
##$WBSW= 25
##$XGAIN= (0..3)
0 0 0 0
##$XL= 0
##$YL= 0
##$YMAX_a= 11414370
##$YMIN_a= -7044970
##$ZGOPTNS= <>
##$ZL1= 120
##$ZL2= 120
##$ZL3= 120
##$ZL4= 120
##$ABSF1= 14.9667
##$ABSF2= -5.585831
##$ABSG= 5
##$ABSL= 3
##$ALPHA= 0
##$AQORDER= 0
##$ASSFAC= 0
##$ASSFACI= 0
##$ASSFACX= 0
##$ASSWID= 0
##$AUNMP= <proc_prof1d_extract.lims>
##$AXLEFT= 0
##$AXNAME= <>
##$AXNUC= <1H>
##$AXRIGHT= 0
##$AXTYPE= 0
##$AXUNIT= <>
##$AZFE= 0.1
##$AZFW= 0.1
##$BCFW= 0
##$BC_mod= 0
##$BYTORDP= 0
##$COROFFS= 0
##$CY= 15
##$DATMOD= 1
##$DC= 0
##$DFILT= <>
##$DTYPP= 0
##$F1P= 0
##$F2P= 0
##$FCOR= 0.5
##$FTSIZE= 131072
##$FT_mod= 6
##$GAMMA= 0
##$GB= 0
##$INTBC= 1
##$INTSCL= 1
##$ISEN= 128
##$LB= 0.3
##$LEV0= 0
##$LPBIN= 0
##$MAXI= 10000
##$MC2= 0
##$MEAN= 0
##$ME_mod= 0
##$MI= 0
##$NCOEF= 0
##$NC_proc= -3
##$NLEV= 6
##$NOISF1= 0
##$NOISF2= 0
##$NSP= 0
##$NTH_PI= 0
##$NZP= 0
##$OFFSET= 14.9667
##$PC= 1
##$PHC0= 30.00916
##$PHC1= 0
##$PH_mod= 1
##$PKNL= yes
##$PPARMOD= 0
##$PPDIAG= 0
##$PPIPTYP= 0
##$PPMPNUM= 2147483647
##$PPRESOL= 1
##$PSCAL= 4
##$PSIGN= 0
##$PYNMP= <proc.py>
##$REVERSE= no
##$SF= 400.130005565508
##$SI= 131072
##$SIGF1= 0
##$SIGF2= 0
##$SINO= 400
##$SIOLD= 131072
##$SPECTYP= <>
##$SREGLST= <1H.CDCl3>
##$SSB= 0
##$STSI= 131072
##$STSR= 0
##$SW_p= 8223.68421052632
##$SYMM= 0
##$S_DEV= 0
##$TDeff= 65536
##$TDoff= 0
##$TI= <>
##$TILT= no
##$TM1= 0
##$TM2= 0
##$TOPLEV= 0
##$USERP1= <user>
##$USERP2= <user>
##$USERP3= <user>
##$USERP4= <user>
##$USERP5= <user>
##$WDW= 1
##$XDIM= 131072
##$YMAX_p= 448419600
##$YMIN_p= -395302411
##$CURPLOT= <Network HP LaserJet P1505>
##$CURPRIN= <$Network HP LaserJet P1505>
##$DFORMAT= <normdp>
##$LAYOUT= <+/1D_H.xwp>
##$LFORMAT= <normlp>
##$PFORMAT= <normpl>
##$SURQMSG= 1
$$ End of Bruker specific parameters
$$ ---------------------------------
##NTUPLES= NMR SPECTRUM
##VAR_NAME=  FREQUENCY,     SPECTRUM/REAL,   SPECTRUM/IMAG
##SYMBOL=    X,             R,               I
##VAR_TYPE=  INDEPENDENT,   DEPENDENT,       DEPENDENT
##VAR_FORM=  AFFN,          ASDF,            ASDF
##VAR_DIM=   131072,        131072,          131072
##UNITS=     HZ,            ARBITRARY UNITS, ARBITRARY UNITS
##FACTOR=    0.0627417313425165, 1,          1
##FIRST=     8223.62146879498, 1076,         -116258
##LAST=      0,             2116,            -118301
##MIN=       0,             -395302411,      0
##MAX=       8223.62146879498, 448419600,    0
$$ Real data points
##PAGE= N=1
##DATA TABLE= (X++(R..R)), XYDATA
$$ [...]
67274 192752 194248 195895 196870 197187 197997 200404 204247 208357 211795 214392 216265 217382 217738 217578 217231 216900
67258 216900 216687 216708 217181 218355 220130 221738 222287 221908 221769 222399 222599 220960 218195 216821 218381 221946
67242 221946 225662 228876 232175 235999 239825 242362 242227 238970 233921 229600 227798 228424 230325 232531 234312
67227 234312 234866 233951 232558 232012 232407 232653 232105 231423 231528 232279 232672 232086 230916 230050 230099 231244 233444 236404
67209 236404 239410 241642 242805 243168 243010 242539 242427 243515 245475 246680 246468 246682 249418 253655 256014 255032
67193 255032 252814 251802 251828 251572 251215 251759 252699 252465 251007 250224 251672 255031 258900 261908 262904 261273
67177 261273 257693 253982 251906 252375 255453 260202 264660 267086 267570 267745 268825 270651 272635 274551 276038
67162 276038 276334 275218 273654 272901 273271 274068 274401 273838 272703 271963 272457 274099 276131 278098 280045 281904
67146 281904 283422 284800 286587 288752 290688 292346 294422 297028 299121 299927 300111 300807 302155 303608 305028
67131 305028 306526 307664 307863 307444 307352 307895 308518 308692 308257 307047 305239 304220 305984 310976 317158 321839
67115 321839 324166 325350 326834 328865 330768 332029 332809 333643 334811 336058 336959 337556 338432 339955 341577
67100 341577 342341 342183 342284 343682 345842 347234 347398 347734 349869 353772 358022 361493 364066 366018 367606
67085 367606 369351 371849 375040 378312 381549 385371 389985 394568 398295 401269 403770 405342 405674 405971 408197
67070 408197 412806 418231 422831 426445 429657 432535 434944 437522 441282 446199 451006 454650 457454 460581
67056 460581 464700 469512 474283 478377 481406 483357 484751 486275 488024 489331 489633 489281 489201 489981 491673
67041 491673 494213 497479 501027 504445 508083 512708 518143 522919 525819 527245 528519 530330 532608 535456
67027 535456 539122 543053 546129 548286 551045 555704 561543 566609 570018 572646 575622 578984 582074 584557
67013 584557 586520 588055 589538 592089 596864 603520 610014 614445 616862 618801 621428 624779 628616 633056
66999 633056 637931 642329 645548 648233 651802 656714 661891 666110 669513 673361 678496 684365 689525 692958
66985 692958 694962 696936 700281 705237 710704 715322 718877 722597 727913 734973 742493 749090 754552 759709
66971 759709 765322 771410 777589 783611 789370 794749 799847 805198 811273 817716 823525 828267 832772 838227
66957 838227 844821 851723 858208 864225 869880 875227 880896 888058 896998 906300 914502 922281 931748 943459
66943 943459 955270 964748 971825 978421 986232 995690 1006426 1017625 1028139 1037233 1045402 1053882 1063376
66930 1063376 1073756 1084800 1096504 1108643 1120692 1132308 1143437 1154031 1164184 1174560 1185971
66919 1185971 1198389 1210926 1223007 1235063 1247792 1261152 1274480 1287512 1301030 1316344 1333930
66908 1333930 1352718 1371255 1389616 1409295 1430807 1452562 1473181 1493913 1517054 1542396 1567168
66897 1567168 1589595 1610727 1632273 1654434 1676829 1700087 1725235 1752408 1781215 1811653 1843672
66886 1843672 1876555 1909644 1943145 1977439 2012324 2047769 2084674 2123827 2164654 2205974 2247481
66875 2247481 2289603 2332570 2376700 2422961 2471851 2522052 2571603 2620334 2670008 2722158 2777046
66864 2777046 2834740 2895722 2959892 3026003 3092728 3159708 3227196 3295252 3363626 3432094 3500845
66853 3500845 3570946 3644188 3721654 3802450 3884607 3967315 4051486 4138011 4226402 4315479 4404550
66842 4404550 4493426 4581986 4670401 4759456 4849956 4941722 5033360 5123073 5209844 5294018 5376601
66831 5376601 5457803 5536631 5612309 5685477 5757079 5826232 5890273 5947199 5997326 6042348 6083433
66820 6083433 6120463 6152305 6177370 6194462 6203682 6206290 6203338 6194726 6179821 6158664 6132119 6100810
66808 6100810 6064152 6020652 5969354 5910912 5846979 5778594 5705729 5628492 5547852 5464621 5378518
66797 5378518 5289074 5196778 5102444 5006098 4907665 4808261 4709560 4612178 4515857 4420796 4327333
66786 4327333 4234625 4141344 4047704 3955174 3864092 3773367 3682773 3593589 3506389 3420141 3334415
66775 3334415 3250667 3170155 3092224 3015974 2942052 2871161 2802210 2733811 2666695 2602676 2541809
66764 2541809 2482448 2423882 2367219 2313608 2262877 2213904 2165222 2115465 2064529 2014223 1966664
66753 1966664 1921948 1878403 1834896 1791743 1749513 1708375 1668889 1632116 1598321 1566241 1534087
66742 1534087 1500886 1466912 1433508 1402401 1374317 1348075 1321644 1294124 1266145 1238666 1212260
66731 1212260 1187410 1164293 1142105 1119574 1096483 1073922 1052863 1033228 1014493 996280 978192
66720 978192 959977 942206 925912 911070 896233 880232 863627 847881 833618 820226 806827
66709 806827 793084 779136 765079 750588 735136 718804 702624 687734 674458 662697 652716 644559
66697 644559 636990 628277 618233 608349 599717 591995 584803 578692 573870 569089 562983 555795 548676 541834
66683 541834 534526 526496 518298 510337 502554 495031 487974 481099 473951 466967 461259 457011 452914 447789
66669 447789 442224 437843 435124 432573 428180 421328 413144 405320 398879 393904 389973 386613 383532 380655
66655 380655 377886 374858 371181 367102 363538 361066 359098 356438 352443 347271 341396 335588 331080 328735
66641 328735 327846 326575 323908 320508 317415 314635 311492 307745 303846 300466 298121 296850 295908 294335 292181
66626 292181 290590 290213 290128 288908 286267 283138 280608 279277 279034 278679 276423 271714 266234 262088 259327
66611 259327 256409 252906 250361 250090 251264 251875 250901 248837 246585 244469 242175 239219 235627 232304 230469
66596 230469 230395 230940 230657 229179 227263 225597 223958 221622 218443 215360 213746 214184 215831 217017 216494 214207
66580 214207 211101 208266 206162 204551 203202 202519 203093 204646 206019 206392 205973 205119 203562 201206 199062
66565 199062 198294 198612 198600 197500 195568 192812 188912 184829 182935 184368 187185 188369 187152 185254 184253
66550 184253 184053 183877 183529 183257 183218 183444 183681 182989 180350 176296 173188 173002 174995 176384 175368 172862 171117
66533 171117 171214 172301 172911 172410 171098 169340 167065 164182 161230 159274 158985 159879 160646 160345 159224 158270
66517 158270 157992 157796 156667 154389 151853 150130 149475 149489 149997 151223 153010 154475 154939 154811 154881 154977 154199
66500 154199 152582 151487 151722 152067 150616 147178 143419 140869 139785 139772 140345 140703 140198 139498 140130 142224
66484 142224 143820 143341 141789 141325 142432 143791 144330 143902 142315 139367 135889 133175 131181 128878 126710
66469 126710 126886 130298 134719 137281 137611 137322 137535 138367 139918 142008 143395 142985 141691 141554 142972 144190
66453 144190 143651 141451 138298 134643 131328 129628 129628 129693 128485 126711 125971 126643 127922 129251 130538 131289
66437 131289 130665 128585 126028 124134 123372 123428 123471 122731 121329 120350 120651 121762 122452 122073 120889 119446 118284
66420 118284 118023 119029 121093 123910 127427 130953 132485 130306 125386 120888 118860 118468 117953 117130 117021
66405 117021 117969 119413 121140 123427 125818 126872 125563 122362 118576 115145 112497 111113 111477 113374 115649
66390 115649 116964 116758 115404 113615 111938 110805 110716 112022 114522 117533 120464 123189 125739 127753 128525
66375 128525 127734 126007 124452 123522 122601 121039 119278 118418 118726 119277 119330 119311 119909 120777 120890 119857 118196
66358 118196 116559 115318 114640 114213 113186 111248 109610 109859 111823 113656 114115 113637 112859 111470 109250 107141
66342 107141 106259 106522 107157 107919 108935 109893 110447 111088 112599 114790 116575 117221 116859 115949 114928 114189 113700
66325 113700 112824 111180 109459 108614 108537 108409 108197 108769 110479 112589 114309 115588 116602 117261 117574 117944 118748
66308 118748 119984 121389 122411 122207 120436 118112 116825 116849 116811 115494 113172 110826 108976 107890 108207 110390
66292 110390 113828 117077 118926 119038 117992 117066 117448 119051 120404 120186 118597 116814 115498 114424 113355
66277 113355 112586 112491 112901 113087 112370 110967 110264 111714 115173 118711 120477 120387 119611 118887 118020 116780 115545
66260 115545 115056 116009 118785 122864 126542 127962 126806 124561 122886 122110 121610 121082 120845 121099 121601 122246
66244 122246 123304 124690 125478 124934 123926 124359 126804 129379 129703 127572 124936 123485 123148 122960 122471 121883
66228 121883 121472 121399 121740 122284 122548 122157 121024 119157 116755 114607 113832 114879 117060 119156 120165 119670
66212 119670 118220 117381 118492 120997 122874 123055 122487 122314 122132 120990 119266 118302 118645 119664 120559 120774
66196 120774 119867 118183 117463 119473 123791 127841 129337 128015 125103 122083 120095 119574 119988 120406 120495 120495 120476
66179 120476 120426 120888 122400 124261 125134 125125 125928 128231 130299 130189 128433 127260 127791 129291 130843 132360 133775
66162 133775 134469 134100 133329 133154 133847 134867 135529 135546 135072 134476 134001 133537 132832 131872 130828 129679 128235 126717
66144 126717 125974 126782 129005 131780 134560 137665 141582 145897 149235 150372 149337 147414 146132 146201 147104
66129 147104 147557 146510 143925 140699 137879 136012 135072 134669 134252 133448 132535 132425 133937 137003 140514 142868
66113 142868 142927 140953 138655 137866 138996 141111 143372 145631 147557 148316 147784 147132 147212 147134 145633 143312 142142
66096 142142 142877 144326 145253 145612 145606 144876 143363 141866 140943 140105 138889 137961 138226 139427 140593 141459 142381
66079 142381 143155 143083 142343 142250 143694 145993 147866 149008 150039 151078 151217 149775 147650 146792 148230 150987
66063 150987 153086 153364 152198 150909 150761 152122 154035 154874 153933 152199 151111 150955 151178 151815 153423 155623
66047 155623 157057 157248 157421 158743 160548 161099 159642 157098 155149 155126 157243 160310 162653 163837 165007
66032 165007 167023 168981 169424 168421 167434 167432 168109 168766 168968 168354 166840 165191 164519 164960 165502 165341 164683 163925
66014 163925 162822 161000 158816 157161 156645 157284 158706 160241 161138 161154 160837 160833 161014 160744 160085 160197 162074
65997 162074 165025 166967 166489 164338 162535 162239 162987 163992 165454 168097 171769 175112 176697 176247 174705
65982 174705 173253 172319 171501 170441 169501 169298 169741 170074 170015 170291 171710 174116 176598 178481 179815 181156
65966 181156 183140 186003 189281 192291 194977 197898 201232 204481 207402 210403 213463 215446 215335 213593
65952 213593 211502 209737 208556 208669 210493 212807 213684 213056 213026 215195 218847 222416 225751 230063 236185
65937 236185 243591 250814 256465 260333 263870 269025 276045 282932 287628 290197 292210 294428 296081 296419
65923 296419 296061 296340 297745 299422 300062 298909 295934 291422 285846 280127 275535 272885 271956 271934 272146 271952
65907 271952 270349 266606 261440 256749 253717 251754 249714 247561 246139 245607 245009 243560 241726 240605 240536
65892 240536 240857 241053 241630 243434 246391 249631 252881 256915 262182 267693 272079 275370 278846 283293 288195
65877 288195 292515 295519 296920 297148 297436 298664 300082 300253 299467 299907 302921 307324 311264 314747 319238
65862 319238 325483 332762 339797 345429 348959 350924 353295 357833 364350 371356 378105 384937 391804 397818
65848 397818 402537 406590 410553 414069 416702 418900 421412 424030 425649 425549 424199 422725 421787 421019 419467
65833 419467 416486 412191 407215 402300 398062 394608 391095 386143 379246 371467 364213 357560 350408 342152
65819 342152 333393 324894 316581 308054 299707 292728 287897 284646 281705 278869 277693 279680 283702 286268
65805 286268 284960 280993 277614 276569 276932 276773 274865 271112 266607 263290 262489 263761 265871 268465 271491
65790 271491 273547 272900 270393 269163 270609 272531 272535 271494 271830 273728 275227 275411 275412 276395 278474 281739 286534
65773 286534 292208 297031 300158 302651 306058 310858 316767 323603 331132 338813 346482 354777 364191 374024
65759 374024 382872 389998 395867 401460 407275 412787 416773 418453 418440 418195 418482 418770 418228 416652 414222 411005
65743 411005 407187 403301 399650 395812 391187 385926 381016 377508 375713 374911 373859 372041 370394 370191 371227
65728 371227 372012 371964 372324 374386 377973 382664 389469 399743 412862 426439 438869 450511 462486 475594
65714 475594 490437 507136 524236 538952 549205 554906 557001 556241 553302 548939 543119 534760 523280
65701 523280 509862 496250 482808 468764 454067 439955 427740 418005 411117 407652 407987 411937 418957
65688 418957 428260 438830 449985 462042 475827 491373 507711 524064 540497 557057 572952 587126
65676 587126 599081 608552 614843 617263 616062 612241 606417 598320 587275 572730 554568 533704 512315
65663 512315 492541 474583 456834 438289 420012 403550 388735 374191 359642 346363 335220
65652 335220 325600 316802 309348 303911 299712 295168 289914 285147 281942 280093 278717 277198 275190 272397
65638 272397 268858 265222 262456 261360 262234 264552 267069 268852 270258 272234 274672 276424 277317 279061 283317
65623 283317 289486 295385 299761 303315 307567 313608 321873 332205 343835 355817 367670 379423 391226
65610 391226 403395 416618 431575 448474 467469 489154 513808 540210 566118 590187 612791
65599 612791 634836 656544 677590 697678 716447 733125 746616 755832 760309 761153 761133 762685 765561
65586 765561 767370 766735 764800 763169 761655 759202 755970 753002 750069 745187 736347 722844 704949 683295
65572 683295 658867 632849 606083 578952 551771 524807 498041 471546 446180 423236 403254
65561 403254 385660 369626 354686 340425 326338 312511 300106 290633 284665 281280 278628 275218
65549 275218 270965 266865 263357 259366 253703 247153 242135 240112 240312 241324 242789 244741 246347 246681 246364
65534 246364 247079 249342 251771 252899 252826 252770 253760 256356 260945 267452 274842 281623 287102 292002 297888 306156
65518 306156 317289 330618 344752 358667 372542 387285 403184 419442 435265 450966 467439
65507 467439 484899 502760 520748 539221 557972 575355 589305 598962 604670 606646 604518 598244
65495 598244 588621 576438 561719 544393 525272 505665 486124 466194 445529 424811 405380 388288
65483 388288 373869 361893 351786 342789 334266 326102 318804 313096 309303 307053 305611 304455 303396
65470 303396 302199 300360 297473 293664 289474 285459 282005 279269 276901 273964 269643 264150 258554 253653
65456 253653 249415 245582 242323 239929 238337 237376 237183 237800 238589 238629 237707 236410 235284 234413 233869 233892 234353
65439 234353 234605 234319 234093 234825 236742 239395 242301 245141 247626 249723 251929 254818 258355 262024 265560
65424 265560 269041 272466 275886 279941 285439 292035 297910 301190 301377 299197 295678 291865 288850 287178
65410 287178 286217 284600 281372 276552 270884 265468 261259 258151 254604 248914 241186 233598 228576 226990
65396 226990 228097 230528 232973 234411 234384 233098 231082 228828 226800 225504 225291 226278 228515 231896 235727
65381 235727 238867 240689 241678 242742 244296 246482 249800 254654 260362 265546 269786 274118 279432 285007
65367 285007 289231 291392 292064 291937 290973 288739 284969 279712 273459 267386 262948 260788 260200 259944 259373 258517
65351 258517 257413 255962 254462 253775 254703 257370 261310 265869 270368 274183 277119 279732 282979 287351 292338
65336 292338 296711 299408 300353 300665 301867 304465 307221 308235 307001 305122 304587 305589 306492 305868 303935
65321 303935 301838 300235 299130 298571 298720 299285 299655 299782 300311 301581 303042 304129 305283 307540 311319 316236
65305 316236 322087 329270 337869 346770 354329 360015 364996 370834 377843 385111 392090 399555 408634 419310
65291 419310 430481 441210 451152 459732 465964 469675 472252 475411 479384 482683 483363 480221 473364 464323
65277 464323 455212 447042 439006 429935 419896 409535 398560 386338 373825 363234 355422 349098 343254
65264 343254 338798 336590 335167 332097 327025 321754 317502 313674 309518 305494 302287 299551 296547 293453
65250 293453 291154 289975 289373 288790 288127 287188 285268 281910 277912 274987 274057 274201 273724 272100 270362 269692
65234 269692 270343 272165 275314 279684 284041 286649 286930 285954 285115 284629 283590 281278 278226 275924 275459 276432
65218 276432 277369 277099 275567 273394 271174 269268 267731 266158 264216 262651 263153 266450 270938 273933 274093
65203 274093 272156 269663 267820 267349 268401 270307 272045 273271 274538 276490 279183 282112 284363 284838 283023
65188 283023 279595 275787 272148 268482 264860 261888 259816 258174 256506 254815 253063 251002 248804 247118
65174 247118 246006 244524 241980 239101 237319 237260 238494 240448 242874 245558 248132 250201 251365 251193 249494
65159 249494 246602 243208 240058 237835 236973 237334 238372 239856 242055 244916 247490 248719 248590 248019 247699
65144 247699 247512 247082 246488 246255 246751 247645 248034 247328 246038 245351 245809 246782 247489 248072 249268 251322 253680
65127 253680 255557 256436 256283 255814 256405 259094 263537 268288 272239 275493 278810 282534 286265 289354 291471
65112 291471 292746 293477 293871 294098 294441 295117 295906 296293 296225 296558 298558 302875 308890 314906 319160 321207 322502
65095 322502 325296 330708 338027 345829 353301 360520 368165 377341 388984 402826 417349 431368 445403
65082 445403 460923 478578 497694 517130 535943 553464 569593 584985 600266 615045 628343
65071 628343 639908 650332 659889 668158 674981 680740 685092 686426 683527 677369 670268 663376 655789 646206
65057 646206 634624 622082 609284 595925 581139 564226 545137 524682 504327 485473 468746
65046 468746 453918 440366 427480 414768 401968 389238 377082 365990 356165 347494 339523 331581
65034 331581 323520 316456 312097 310737 310382 308630 305202 301872 300018 299253 298658 298340 299005 300581 302098
65019 302098 302826 302873 302602 302016 301035 300179 300503 302510 305200 306728 306298 304899 303721 302463 300159 297199
65003 297199 295181 294672 294557 293985 293519 293515 292793 290296 287161 285553 285841 286435 286303 286187 286998 288223 288595 287654
64985 287654 286092 284911 284526 284430 283582 281414 278475 275803 273809 272126 270443 268975 268099 267832 267640 266588
64969 266588 263959 260092 256305 253604 251826 250427 249460 249027 248309 246234 242973 239894 238148 238167 240233
64954 240233 244322 249223 253078 255322 257291 260447 264637 268501 271063 272605 274470 278179 284255 291627
64940 291627 298561 304156 308455 311424 312707 312497 311718 311116 310908 311390 312952 315184 316906 317523 317619 318018
64924 318018 319182 321842 326945 334125 341095 345605 347586 348701 350210 351892 352637 351472 348279 343904
64910 343904 339249 334114 327612 319926 312707 307212 303056 299505 297003 296226 296331 295437 292630 288573 284379
64895 284379 280813 278398 277281 276878 276306 275210 273774 272271 271204 271471 273489 276341 278536 279490 279625
64880 279625 279296 278557 277794 277585 277763 277373 275782 273354 271056 269927 270691 273072 275483 276323 275780 275676 277280
64863 277280 279909 281904 282337 281440 279920 278355 277016 275954 275283 275312 276241 277872 279936 282476 285516 288676
64847 288676 291703 295090 299346 303829 307333 310021 313827 320436 329552 339590 349437 358939 368206 377253
64833 377253 386253 395545 405224 414904 423909 431649 437970 443257 448027 452350 455804 458139 459766 461484
64819 461484 463769 466406 468710 470002 469893 468196 464772 459756 453822 447704 441317 433927 425525 417484
64805 417484 411297 407059 403685 400137 395808 390347 384207 379024 376211 375042 373217 369518 364860 360410
64791 360410 355829 350105 343259 336354 330200 324790 319731 314744 309868 305495 302012 299266 296771 294594
64777 294594 293478 293814 295089 296687 298569 300650 302208 302760 303107 304529 307045 309363 310653 311573 313185
64762 313185 315489 317628 319293 321258 324319 328143 331705 334817 338613 344199 351245 358449 365171 371969
64748 371969 379604 388193 397465 407148 416821 425891 434061 441503 448347 454261 458609 460707 460004 456628
64734 456628 451687 446332 440501 433466 425676 418862 413902 409813 405618 401988 399829 398246 395532 391756
64720 391756 388786 387747 387858 388028 388406 389877 392939 397471 402822 407788 411365 414115 418270 425807 436628
64705 436628 448839 460472 470696 479830 488586 497193 505173 512178 518803 525909 533134 538979 542824
64692 542824 546105 550759 556948 563027 567479 570188 571859 572881 572950 571420 567883 562601 556382 549835 542782
64677 542782 534603 525093 514773 504440 494696 485823 477770 470183 462751 455708 449797 445553 442622 439898
64663 439898 436456 432475 429195 427776 428153 429285 430642 433006 437343 443225 449055 453847 458083 462659
64649 462659 467647 472545 477066 480997 483640 484222 482815 480126 476302 470613 462494 452360 441172 429801
64635 429801 419153 410271 403668 398830 394828 391153 387580 383676 379186 374719 371426 370013 370506 372699
64621 372699 376104 379687 382594 385253 388932 394076 399936 405991 412690 420336 428270 435952 443896 452613
64607 452613 461413 469447 477309 485983 494340 499398 499655 496922 494114 492189 490216 487545 484551 481392
64593 481392 477381 472033 466020 460560 456304 453258 451426 450869 451174 451499 451516 452047 454504 459825 468076 478674
64577 478674 490569 502400 513287 523741 535327 549049 564327 579771 594517 608344 620858
64566 620858 631246 638855 643481 644976 643088 637964 630403 621196 610289 597011 581265 564319 548117
64553 548117 533726 520661 507933 495486 484230 474833 467108 460635 455216 450338 444951 438613 432441
64540 432441 428119 426034 425070 424087 422914 421949 421688 422761 425571 429508 433220 436180 439448 444427 451349
64525 451349 459501 468494 478626 490164 502968 516752 531117 545191 557816 568517 578038 587491
64513 587491 596895 604792 609520 610853 610237 609379 608681 607035 602830 595060 583885 570596 556847 543477
64499 543477 530149 516481 503123 490952 479458 467097 453661 441373 432875 428645 426909 425540
64487 425540 423382 420357 417258 415320 415112 415802 416092 415760 415615 416070 416667 417081 417570 417987 417243 414524 410577
64470 410577 406992 404422 402215 399681 396943 394353 391775 389009 386554 385240 385040 384858 383938 383124 384136
64455 384136 387573 392187 396349 399675 402839 406272 409765 413217 417064 421732 427112 432687 437990 442914
64441 442914 447966 454186 462274 471688 481094 489841 498402 507101 515158 521617 526740 531665 536871 541652
64427 541652 545039 546522 545882 543168 539257 535810 534046 533734 533809 533788 534108 535096 536084 535848 533735 530145 525918
64410 525918 521540 517070 512719 509180 507292 507486 509579 512940 516854 521029 525879 531911 538615 544513
64396 544513 548842 552737 557891 564242 570094 574678 579387 585852 593769 601677 609260 617757 628397 641579
64382 641579 657496 676295 697260 718914 740616 763354 788382 815789 845118 876852 912410
64371 912410 952982 999260 1052027 1111937 1178604 1250937 1328880 1414061 1508090 1610895 1721604
64360 1721604 1840668 1969883 2109872 2258175 2410186 2561481 2708799 2849425 2980729
64351 2980729 3100595 3207622 3300377 3376592 3433352 3467974 3478758 3465493 3429694 3374031 3300891
64340 3300891 3211491 3106532 2987399 2856182 2714943 2565964 2412808 2260106 2111707 1969488
64330 1969488 1834301 1707346 1590013 1482967 1386152 1299286 1221620 1151573 1087612 1029463
64320 1029463 977695 932251 892266 857274 827390 801921 778851 756458 734792 714889 697143
64309 697143 681133 666411 652442 638087 622242 605089 588027 572286 558216 545812 535089
64298 535089 525827 517723 511002 506043 502162 497763 492359 487568 485228 485136 485684 486218 487453 489657 491825
64283 491825 493065 493673 494201 494383 493825 493032 492763 492695 491661 489115 485587 481854 478496 476283 475940 477035
64267 477035 477838 476954 474806 472975 472276 471963 470826 468619 466221 464538 463500 462273 460358 458194 456577
64252 456577 455825 455790 456372 457454 458498 458761 457912 455918 452389 446748 439175 430740 422433 414694 408048 403301
64236 403301 400571 398814 396925 394775 392658 390387 387829 385870 385897 388338 392308 396588 400448 403832 407370
64221 407370 411976 417793 423682 428397 432047 435800 440503 446334 453428 461734 470366 478182 485190 492485
64207 492485 500562 508541 515117 519397 520692 518734 514725 511256 510350 511898 514315 516129 516626 515734 513895
64192 513895 511578 508421 503297 495635 486219 476351 466818 458064 450677 445018 440706 436987 433357 429622
64178 429622 425803 422273 419560 417802 416858 416950 418309 420081 420663 419521 417643 415852 414029 412589 413010
64163 413010 415591 418114 418384 417139 416751 417918 419492 420889 422478 423804 423619 421958 420365 419719 419473
64148 419473 419289 419560 419826 418592 415580 412539 410812 409631 407959 406581 406953 409068 411936 415313 419484
64133 419484 423907 427653 431029 435526 442263 451349 462505 475194 488314 500782 512560 524256 535740
64120 535740 545950 554112 560313 564630 566429 564842 559538 550831 539417 526260 512514 499295 487367
64107 487367 476872 467343 458280 449764 442154 435195 428136 421017 415027 410964 407969 404589 400730 397760
64093 397760 396918 398225 400719 403173 404837 406107 408190 411566 415194 417935 420255 423486 427732 431653
64079 431653 434401 436772 440133 444946 450474 455341 458363 459460 459759 460207 460281 458863 456183 453838 452937
64064 452937 453328 454785 457722 462259 467594 472883 478055 483441 489424 496732 506088 517114 528532 539865
64050 539865 551909 564983 577964 589951 601721 614332 627080 638112 646472 652479 656845 660763
64038 660763 666238 674588 684651 693922 701592 709153 717854 726914 734591 739735 741724 740089 735050 727639
64024 727639 718543 707459 694204 679798 665672 652334 639523 627223 615602 604234 592396 580332
64012 580332 569535 561361 555780 551720 548341 545546 543348 541321 539140 537474 537555 539500 541689 542649 543286
63997 543286 546141 552241 559781 566566 572917 581090 592165 604619 616097 625752 634438 643318 652978
63984 652978 663770 676200 690477 705882 721169 735806 750383 765324 779571 791333 800042 806621
63972 806621 811510 813457 811124 805209 797908 790587 783057 775036 767064 759576 752278 745252 739912 737652
63958 737652 737731 737494 734948 730403 725324 720180 714125 706495 697910 689657 682492 676473 671744 668831 667936
63943 667936 668271 668534 668036 667140 666617 666800 667419 668130 669036 670675 673497 677437 682159 687802 695201 705123
63927 705123 717430 731216 745604 760107 774466 788734 803637 820306 839383 860702 883900
63916 883900 908911 935657 963858 993477 1024789 1057430 1090005 1121631 1153661 1188919 1229114
63905 1229114 1273870 1322360 1374714 1431107 1490613 1552339 1617539 1689424 1770574 1861306 1960921
63894 1960921 2069845 2189975 2323311 2470951 2633436 2811585 3006785 3220726 3455107
63885 3455107 3711433 3990667 4292724 4616235 4958913 5318120 5690942 6073814 6462501
63876 6462501 6852549 7239218 7616372 7975667 8307596 8603795 8858318 9067006 9226437
63867 9226437 9333868 9387699 9387285 9332285 9222573 9058979 8844151 8582880 8281807 7948743
63857 7948743 7591886 7219270 6838357 6455543 6075750 5702726 5339999 4991422 4660706
63848 4660706 4350570 4062485 3796928 3553573 3331445 3129419 2946806 2783347 2638479
63839 2638479 2510522 2396564 2293384 2198871 2112665 2035165 1965917 1903337 1846030 1793767 1746880
63828 1746880 1705226 1668244 1635644 1607427 1583444 1563394 1547092 1534395 1525151 1519569 1518120 1520509
63816 1520509 1525396 1532091 1542085 1557744 1579557 1605716 1634346 1664945 1697627 1732450 1769950 1810947
63804 1810947 1854883 1899440 1942731 1985044 2027407 2069296 2108892 2145033 2177667 2206681 2231447
63793 2231447 2251364 2265737 2273196 2272366 2263303 2247384 2225488 2196986 2160742 2116544 2065500 2009621
63781 2009621 1950949 1890431 1827600 1762026 1694972 1628690 1564005 1499741 1435026 1371196 1310694
63770 1310694 1254703 1202534 1152808 1104544 1057530 1012560 971190 934532 901997 871677 842124
63759 842124 813598 787466 764481 743702 723148 701647 680097 660764 645280 633274 622784
63748 622784 611782 599516 586863 575449 566114 558254 550870 543906 537890 532511 526592 519691 512718
63735 512718 506426 500206 493194 485896 479693 474900 470255 464453 457578 450902 445689 442260 439941 437795
63721 437795 435512 433384 431412 428988 425785 422393 419446 416602 413227 409735 407167 405407 402930 398867
63707 398867 394447 391755 391510 392710 394120 395406 396862 398636 400463 401901 402666 402793 402524 402007 401192 400098
63691 400098 399085 398735 399487 401414 404165 407006 409167 410457 411569 413491 416534 420166 423829 427656 432187
63676 432187 437611 443563 449489 454889 459416 463243 467317 472560 478659 484196 488338 491715 495175 498477
63662 498477 501187 504229 509132 515663 521627 525494 528140 531233 534862 537739 539245 540210 541716 543859
63648 543859 545767 546493 545984 545305 545625 546775 547434 547051 546770 547722 549178 549478 548334 546987 546317 546103 546304
63631 546304 547768 551190 556301 562484 569292 575875 580859 583670 585405 587595 590376 592513 592952 591769
63617 591769 589858 588310 587923 588701 589761 590139 589811 589760 591123 594413 599252 604434 608389 610060 609425 607157
63601 607157 603975 600584 597794 595970 594371 591592 586841 580471 573281 565875 558901 553219 549212 546216
63587 546216 543324 540720 539604 540627 543005 545534 548011 551076 554939 559058 563178 568005 574471 582757
63573 582757 592407 603072 614604 626620 638522 650049 661518 673496 686535 701202 717946 736744
63561 736744 757060 778314 800337 823382 847884 874397 903673 936545 973365 1013337 1054678
63550 1054678 1096002 1137642 1181101 1226941 1273723 1319453 1363504 1406427 1448183 1487429 1522442
63539 1522442 1551857 1574349 1588627 1594582 1594206 1590790 1586928 1583174 1578329 1570757 1559497 1544387 1525507
63526 1525507 1502972 1477231 1448899 1417846 1383156 1344808 1305006 1266841 1231691 1198896 1167997
63515 1167997 1140142 1116835 1098206 1083204 1070909 1061021 1053549 1048615 1046373 1046753 1049566 1055052 1063815
63502 1063815 1075821 1089941 1104980 1120819 1138112 1157211 1177906 1200049 1223892 1249826 1278024
63491 1278024 1308300 1340334 1374337 1411494 1453199 1499655 1549673 1601986 1655993 1710819 1764261
63480 1764261 1813109 1854008 1883882 1900710 1905014 1900062 1889625 1875687 1858802 1839863 1820291 1800716
63468 1800716 1780578 1759012 1735234 1708114 1676327 1639051 1596034 1547352 1494131 1439224 1385779
63457 1385779 1334790 1285101 1236077 1189066 1145690 1105889 1068568 1033380 1000808 970999 943540
63446 943540 918201 895056 873933 854427 836505 820508 806445 793782 782080 771512 762571 755470
63434 755470 749880 745088 740357 735371 730371 725804 721845 718437 715741 714249 714268 715464 717192 719278 722174
63419 722174 726105 730292 733433 735037 735879 736952 738303 739187 739103 738152 736564 734355 731500 727994 723688
63404 723688 718528 713101 708518 705509 703876 703089 703074 704088 706002 708134 709902 711472 713682 717326 722437
63389 722437 728232 733923 739772 747125 757229 770098 784904 801352 820154 841900 866113 892087
63377 892087 920400 952521 988779 1027746 1068329 1111542 1158917 1209407 1259169 1304626 1344738
63366 1344738 1380151 1411462 1439144 1464205 1487878 1511113 1535176 1562200 1594109 1631124 1672094
63355 1672094 1716106 1762943 1812093 1861998 1910309 1954343 1991591 2020612 2041495 2054950 2061211
63344 2061211 2060551 2054459 2045079 2033309 2018412 1999826 1978415 1955323 1930212 1901154 1866026 1823896
63332 1823896 1775643 1723633 1670435 1617552 1565522 1515010 1467046 1422019 1379326 1338551 1300590
63321 1300590 1266996 1238479 1214457 1193991 1176848 1163668 1155242 1151641 1152078 1155655 1162033 1171270 1183399
63308 1183399 1198538 1216925 1238372 1262158 1288113 1317201 1350045 1385471 1421957 1460267 1502948
63297 1502948 1551005 1602666 1655796 1709715 1763707 1815617 1863576 1908049 1950251 1988934 2020335
63286 2020335 2041418 2052200 2055010 2052457 2046098 2036114 2022011 2004029 1983599 1961807 1937785 1909499
63274 1909499 1876016 1838098 1796594 1751330 1702090 1650110 1597852 1547289 1498674 1451225 1404963
63263 1404963 1361499 1322644 1288675 1258786 1233013 1212336 1196431 1182539 1167348 1149061 1126943
63252 1126943 1100277 1069390 1036931 1006192 978186 951680 925961 901934 880325 860405 841253
63241 841253 823231 807357 793855 781964 770940 760828 752442 746521 742608 738857 733457 726120 717772
63228 717772 709231 700900 693387 687281 682315 677687 673204 669341 666272 663768 661796 660097 657454 652899
63214 652899 647727 644624 644383 645107 645280 645837 648122 651483 654511 657470 661658 666947 671736 675216 678261
63199 678261 682049 687016 693204 700520 708378 715922 722892 729835 737511 746557 757428 769970 783310
63186 783310 796902 811434 827868 845871 864176 882349 901141 921095 942024 964072 988103
63175 988103 1014555 1042821 1072241 1102881 1134837 1167661 1200966 1234695 1268159 1299882 1329518
63164 1329518 1359135 1391179 1425503 1459798 1492902 1526096 1560561 1594887 1626253 1653477 1677742
63153 1677742 1700315 1720411 1735644 1744181 1746041 1742438 1734216 1721196 1703071 1680597 1655508 1629251
63141 1629251 1602182 1574222 1546040 1519338 1496067 1477432 1463446 1453336 1446762 1444755 1448966 1459577
63129 1459577 1474605 1492061 1512402 1537748 1568728 1603395 1639626 1677373 1717680 1760354 1803767
63118 1803767 1846505 1888190 1928980 1969241 2009454 2049272 2086690 2119303 2146569 2169709 2189148
63107 2189148 2203327 2210640 2211220 2205691 2193158 2171868 2141475 2103237 2058080 2005843 1946798 1882807
63095 1882807 1816398 1749478 1683442 1619740 1559404 1502331 1447904 1396286 1348522 1305354 1266535
63084 1266535 1231465 1199926 1171750 1146175 1122161 1099451 1078921 1061578 1047331 1034897 1022950
63073 1022950 1011227 1000544 991775 984958 979395 974620 971043 969506 970266 972650 975661 978694 981745 985358
63059 985358 990382 997190 1004712 1010818 1014332 1016455 1019513 1024466 1030252 1035445 1039672 1043342 1046923 1050829
63045 1050829 1055228 1059487 1062559 1064464 1066733 1070702 1075979 1081304 1086281 1091329 1096450 1101226 1105717 1110194
63031 1110194 1114142 1116934 1119540 1124041 1130857 1137898 1143342 1147990 1153653 1160279 1166310 1171405 1177072 1184504
63017 1184504 1193261 1202556 1212644 1224339 1237999 1253634 1271341 1291088 1312568 1335665 1360502 1386730
63005 1386730 1413657 1441713 1472862 1508588 1548049 1589342 1632102 1677556 1726205 1777088 1829810
62994 1829810 1885956 1947533 2014705 2085882 2159631 2235757 2314733 2396709 2481074 2566568 2651803
62983 2651803 2735853 2818418 2899634 2980131 3061075 3143278 3225896 3306670 3383853 3457306 3527289
62972 3527289 3592905 3652342 3703916 3746031 3776692 3794207 3798264 3789488 3768211 3734611 3689899 3636255
62960 3636255 3575540 3509136 3439216 3368968 3300940 3236021 3174728 3118874 3071191 3033655 3006786
62949 3006786 2990335 2984027 2987722 3001318 3024656 3057335 3098641 3147711 3203677 3265652 3332715 3403863
62937 3403863 3477778 3552843 3627810 3702335 3776365 3849129 3919322 3986225 4049746 4109093 4162257
62926 4162257 4207345 4243705 4270958 4287306 4289659 4275573 4244658 4198052 4136798 4060804 3969342
62915 3969342 3862692 3743400 3615675 3483452 3349256 3214906 3082624 2954852 2833114
62906 2833114 2717579 2607861 2504018 2406607 2315771 2230571 2149667 2072808 2001201 1936011 1876793
62895 1876793 1821885 1769986 1720688 1673866 1629463 1587757 1548886 1512055 1476042 1440453 1405561
62884 1405561 1371159 1336919 1303961 1274410 1248806 1225455 1203039 1182307 1164093 1147241 1130153
62873 1130153 1113304 1098439 1085845 1074205 1062844 1052404 1043148 1034031 1023861 1012649 1001728 993042
62861 993042 987820 985058 981799 976075 969174 963912 961178 959571 957899 956110 953806 949879 944238 938336
62847 938336 933362 929217 925702 923196 921420 919094 915753 912631 910631 908667 905306 901153 898210 897426
62833 897426 898088 899142 899932 899962 899136 898212 898116 898893 899942 900945 901763 901845 900808 899471 899261 900482 901971
62816 901971 902575 902179 901201 899909 898507 897172 895660 893428 890438 887382 884859 882811 881072 879952 879856
62801 879856 880653 881868 883220 884610 885863 886983 888500 890990 894203 897172 899236 900410 900607 899297 896614
62786 896614 894273 894341 896999 900320 902440 903219 903541 903887 904232 904683 905361 905961 906054 905555 904409 902392 899951
62769 899951 898604 899427 901636 903909 906774 912088 920062 928436 935186 940629 946140 952039 957763 963164
62755 963164 968560 974136 980109 986837 994000 1000557 1006526 1013955 1024758 1038035 1050963 1062173 1073003
62742 1073003 1085528 1100747 1118883 1139981 1163396 1187595 1211428 1235393 1261257 1290681 1324400
62731 1324400 1362226 1403397 1447182 1493546 1543214 1597043 1655520 1718965 1787934 1863179 1945075
62720 1945075 2033066 2125740 2221772 2320965 2424034 2531046 2640323 2749180 2855415 2957549
62710 2957549 3053851 3141630 3217434 3277598 3319003 3340195 3341893 3325941 3293701 3245869 3183616
62699 3183616 3109154 3025019 2933314 2835691 2733512 2627978 2520690 2414092 2310642 2211370
62689 2211370 2115967 2024482 1938096 1857808 1783291 1713745 1649111 1589531 1534307 1482663 1435373
62678 1435373 1394249 1359642 1329553 1301863 1276613 1255252 1238204 1224326 1212633 1203467 1197593 1194968
62666 1194968 1195026 1197668 1203279 1212050 1223851 1238517 1255509 1273491 1291166 1308839 1328480 1351998
62654 1351998 1380109 1412985 1450962 1493833 1540434 1590161 1644525 1705943 1775105 1850733 1932056
62643 1932056 2020118 2115994 2218971 2327730 2442630 2565341 2696168 2832950 2973014 3115217
62633 3115217 3259224 3403333 3543866 3676572 3797786 3904313 3993193 4062202 4110007 4135279
62623 4135279 4136188 4111584 4062353 3990849 3899169 3789060 3663543 3527383 3385216 3239847 3092958
62612 3092958 2946616 2803164 2664008 2529464 2399805 2275858 2158693 2049327 1948573
62603 1948573 1856508 1772062 1693729 1620838 1553743 1492796 1437652 1387612 1342172 1301008 1263686
62592 1263686 1229549 1197830 1167998 1140112 1114558 1091186 1069115 1047796 1027810 1010019 994313
62581 994313 979986 966986 955707 945665 935656 925692 917731 913703 913297 914324 914834 914298 913044 911269
62567 911269 908752 905295 901371 898264 897237 898382 900590 902770 904774 906924 909181 911300 913615 917171
62553 917171 922967 931217 941381 952759 965149 979045 995115 1013379 1032951 1052766 1072583 1093331
62541 1093331 1116522 1143268 1173773 1207594 1244218 1283202 1324051 1366456 1410775 1457708 1507187
62530 1507187 1558000 1608825 1658981 1707599 1752637 1791726 1823753 1848712 1866006 1873928 1871077 1857632
62518 1857632 1834944 1804476 1767301 1724194 1676082 1624799 1573130 1523236 1475018 1426964 1378753
62507 1378753 1332012 1288249 1247288 1208491 1172481 1140500 1112547 1087298 1063739 1042073 1023048
62496 1023048 1007054 993896 982910 973173 963966 955172 947125 940139 934355 929809 926407 923940 922299
62483 922299 921493 921456 922183 924155 928170 934461 942306 950778 959532 968628 978053 987912 998811 1011591 1026744
62468 1026744 1044269 1063916 1085417 1108828 1134955 1165194 1200533 1240749 1284703 1331387 1380763
62457 1380763 1433882 1492125 1555942 1624383 1696335 1772024 1852449 1937268 2024025 2109720 2192230
62446 2192230 2269942 2341021 2403812 2457285 2500479 2532287 2552462 2561991 2561502 2550025 2526634 2493131
62434 2493131 2453954 2413307 2373098 2333686 2295767 2261142 2232027 2209865 2194788 2186363 2184775 2190830
62422 2190830 2204576 2224536 2248674 2275654 2304906 2336147 2369159 2403117 2435414 2462037 2480116
62411 2480116 2489588 2491627 2486152 2471746 2447169 2411736 2364898 2306950 2240000 2167071 2090434 2011715
62399 2011715 1932874 1855436 1779104 1702854 1627556 1555923 1489695 1428415 1371425 1319572 1274275
62388 1274275 1236073 1204662 1179365 1158894 1141555 1126200 1112296 1099016 1085559 1072753 1062928
62377 1062928 1057341 1054697 1052899 1051218 1049925 1048827 1047292 1045040 1041855 1036954 1029496 1019451 1007369
62364 1007369 993733 979086 964280 950002 936436 923820 912715 903207 894499 885869 877432 869397
62352 869397 861371 853126 845378 838931 833531 828379 823361 819037 815818 813760 812617 811545 809523 806888
62338 806888 805581 806783 809100 810444 811054 812939 816677 820702 824131 828475 835505 844644 853608 861067
62324 861067 867731 875123 884133 894796 906905 920448 935469 951642 968358 985448 1003495 1023079
62312 1023079 1044027 1066027 1089700 1116227 1145787 1177146 1209203 1242406 1278247 1317744 1360913
62301 1360913 1407531 1457859 1512390 1571220 1634128 1701412 1774155 1853001 1936702 2022456 2107783
62290 2107783 2191368 2271957 2347348 2415066 2473249 2520240 2554254 2574680 2583208 2582337 2572834 2553694
62278 2553694 2524380 2485809 2439120 2384905 2324113 2258650 2190559 2121539 2053615 1989022 1928498
62267 1928498 1870625 1813839 1758555 1706397 1657919 1612260 1568782 1527831 1489649 1453460 1418131
62256 1418131 1383230 1349069 1316032 1284231 1253548 1223616 1193826 1163777 1133927 1105698 1080639
62245 1080639 1059362 1041384 1025979 1012950 1002444 994317 988066 983225 979470 976422 973738 971430 969750
62232 969750 968703 967983 967438 967381 968441 971346 976696 984480 993724 1002969 1011196 1018242 1024677 1031723 1040810
62217 1040810 1052317 1064855 1076714 1088157 1101265 1117340 1135580 1154825 1175404 1198350 1223687
62206 1223687 1250764 1279724 1311422 1346203 1384023 1425749 1473136 1527254 1587721 1653547 1723783
62195 1723783 1797262 1872951 1951094 2032872 2118064 2203745 2286230 2363597 2435234 2499479 2553307
62184 2553307 2594584 2623296 2639926 2643665 2633268 2609180 2573653 2528716 2474835 2411736 2339839
62173 2339839 2260461 2175191 2085832 1994868 1905350 1819977 1740193 1666112 1597110 1532689 1473167
62162 1473167 1419611 1372707 1331475 1293428 1256446 1220548 1187623 1159474 1136368 1117293 1101048
62151 1101048 1086751 1073788 1062004 1051981 1044474 1039270 1035054 1030831 1027149 1025378 1026006 1028367 1032107
62138 1032107 1038147 1047726 1060895 1076406 1092900 1109891 1127836 1147612 1169678 1193418 1217438 1240855
62126 1240855 1264049 1287765 1311759 1334909 1356571 1377116 1397053 1416251 1434297 1451177 1467271
62115 1467271 1482916 1498135 1512637 1526137 1539183 1553762 1572491 1596775 1626019 1658975 1695524
62104 1695524 1736777 1783698 1836109 1892744 1951678 2010678 2067706 2121397 2170883 2215007 2251860
62093 2251860 2279250 2295724 2301340 2297577 2286302 2268446 2243599 2211058 2171169 2125411 2075308 2021795
62081 2021795 1965801 1908914 1853046 1799744 1750174 1705396 1665909 1631079 1599861 1572372 1549987
62070 1549987 1533327 1520745 1509594 1498698 1488812 1480843 1474577 1469306 1464854 1461572 1459913 1460408 1463561
62057 1463561 1469347 1477135 1486233 1495865 1504346 1509158 1508733 1503913 1497153 1490640 1485568 1482397 1480683 1478961
62043 1478961 1475818 1471196 1466019 1460754 1455122 1449086 1443314 1438709 1436212 1436774 1440483 1445802 1450892 1455962
62029 1455962 1463308 1474707 1489701 1506713 1524792 1543839 1564149 1586464 1611618 1639461 1668763
62018 1668763 1698719 1729806 1762607 1796750 1831803 1868365 1907314 1948562 1991388 2035308 2079585
62007 2079585 2122639 2163220 2201892 2240196 2278733 2317310 2356676 2398447 2442977 2488435 2532287
61996 2532287 2572540 2607274 2634414 2652963 2663683 2667657 2664702 2653864 2634861 2608162 2574107 2532885
61984 2532885 2485195 2431876 2372834 2307340 2235935 2161343 2086812 2013840 1942199 1871872 1804035
61973 1804035 1739940 1679842 1623685 1572144 1526004 1484751 1446864 1411553 1379270 1350249 1323532
61962 1323532 1297946 1273184 1249271 1225756 1202344 1179831 1159412 1141192 1124152 1107551 1091744
61951 1091744 1077640 1065804 1055927 1046878 1037635 1028608 1021503 1017193 1014341 1011061 1007485 1005414 1005607 1006806
61937 1006806 1007638 1008088 1008489 1008202 1006242 1002595 998041 993004 987250 980491 972674 963784 953861 943229 932405
61922 932405 921710 911165 900855 891225 882794 875379 867794 858830 848668 838805 830261 822433 814213
61909 814213 805737 798330 793166 790701 790870 792808 794747 795495 796055 798564 803532 809254 814181 818645 823862
61894 823862 830445 838518 848279 859612 871873 884680 898349 913127 928823 945631 964418 985516
61882 985516 1008149 1031718 1056701 1083396 1110638 1137031 1162895 1189782 1218270 1247242 1275187
61871 1275187 1301317 1325504 1348000 1369276 1389537 1408370 1425241 1440058 1452843 1463282 1471162
61860 1471162 1476776 1480169 1480523 1477153 1470811 1463181 1455536 1448911 1445222 1446726 1453981 1465254 1478336 1492364
61846 1492364 1507712 1524875 1543809 1563837 1583822 1602556 1619012 1632063 1640269 1642415 1638200 1628179
61834 1628179 1613447 1595736 1577064 1558279 1538288 1515557 1490087 1463100 1435394 1407298 1379872
61823 1379872 1354510 1331136 1308258 1285181 1262863 1242171 1222669 1203832 1186168 1170129 1154955
61812 1154955 1139760 1125156 1112703 1103122 1095884 1090228 1085798 1082559 1080808 1081181 1084127 1089598 1097612
61799 1097612 1108738 1123535 1141864 1163244 1187609 1215276 1246536 1281637 1320594 1362523 1405805
61788 1405805 1449679 1495126 1543204 1592849 1641256 1686271 1727423 1764719 1797564 1825129 1846819
61777 1846819 1861932 1869740 1870657 1866885 1861126 1854612 1846734 1836684 1825260 1814980 1808452 1806651 1808784
61764 1808784 1813670 1820820 1830104 1840921 1852305 1863467 1873477 1880497 1882184 1877160 1865568 1847949
61752 1847949 1824248 1794383 1759249 1720352 1678567 1634030 1587519 1541316 1498038 1458606 1421784
61741 1421784 1385904 1350712 1317336 1286807 1259180 1234095 1211414 1190906 1171769 1153079 1134632
61730 1134632 1116828 1099805 1083199 1066865 1051353 1037393 1025168 1014373 1004786 996495 989533 983486
61718 983486 977526 970879 963395 955744 949026 944067 940884 938659 936245 933060 929788 928052 928966 931885
61704 931885 934811 936256 936602 937593 940602 945469 950845 955443 959000 962152 965526 968989 971876 973906 975652
61689 975652 977854 980364 982042 981885 979979 977058 973362 968514 962608 956735 951897 947784 943349 938435
61675 938435 934016 930672 927675 924140 920527 918339 918537 920792 924100 927504 930330 932432 934467 937417
61661 937417 941442 945547 948670 950865 953082 955990 959427 962900 966037 968333 968936 967265 963795 959768
61647 959768 956036 952592 949301 946530 944525 942567 939437 934721 929078 923261 917541 912249 908088 905300
61633 905300 903015 900102 896456 892874 889737 886411 882127 877033 872164 868512 866309 865115 864429 864039 863745
61618 863745 862957 861003 857843 854064 850070 845722 841040 836770 833832 832494 832511 833643 835394 836495 835528
61603 835528 832340 828389 825428 824127 824028 824484 825340 826757 828535 829809 829756 828764 828444 830072 833271 836678
61587 836678 839675 842808 846610 850735 854460 857486 859992 862250 864382 866231 867369 867487 866744 865380 863136
61572 863136 859648 855391 851477 848205 844564 839657 834082 829226 825507 822007 817730 812586 807069 801567
61558 801567 796345 791785 788144 785099 781904 778234 774582 771401 767930 762429 753926 743437 733104 724357
61544 724357 717167 710683 704010 696561 688309 679813 671634 663850 656507 650201 645518 642180 639572 637805
61530 637805 637115 636240 632881 626338 618505 611640 606242 601698 597606 593278 587253 579063 570819 565272 562551
61515 562551 560481 557919 555929 555380 555256 554174 552185 550232 548965 548898 550495 552937 553817 551418 546666
61500 546666 541716 537344 533210 530095 529852 532883 537303 541250 544648 547963 550585 551727 552092 553230 555431
61485 555431 557420 558126 557759 557036 556288 555664 555504 556059 557253 559030 561459 564203 566363 567313 567397 567413 567706
61468 567706 568149 568617 568893 568299 566161 562727 559067 555888 552959 549972 547470 546358 546693 547462 547649 547122
61452 547122 546315 545492 544760 544558 545358 546647 546870 545086 542374 540782 540949 541605 541472 540667 539815 538922 537978
61435 537978 537870 539484 542268 544779 546490 548010 549694 551207 552538 554206 556118 557325 557375 557021 557061 557371
61419 557371 557675 558387 559870 561572 562772 563713 565199 567367 569551 571077 571699 571647 571759 572991 575132 576565
61403 576565 576184 575054 575144 576750 578254 578357 577389 576326 575608 575327 575719 576888 578541 580400 582530 584984
61387 584984 587458 589566 591228 592693 594361 596545 599104 601379 602896 604083 605961 609186 613671 618908
61373 618908 624085 628114 630164 630371 629709 629283 630006 632435 636215 639958 642521 644311 646575 649675 652973
61358 652973 656178 659651 663312 666477 669030 671599 674228 676102 677053 678050 679450 680003 678724 676788 676199
61343 676199 677078 677544 676154 673461 671118 670232 670650 671307 671253 670658 670632 671809 673508 674651 675044 675314 676063
61326 676063 677550 679603 681354 681696 680719 680038 680890 682570 683732 684517 686073 688426 690440 691914 694162
61311 694162 698046 702647 706508 709304 711643 714019 716627 719754 723653 728121 732436 735709 737506 738543
61297 738543 740535 744704 750506 756457 762060 768085 775080 782716 790772 799701 809813 820805 832454
61284 832454 844804 857211 868234 877163 884785 891968 898525 904317 910461 918113 926647 934425 941035
61271 941035 947428 953909 959408 963035 965238 966908 968118 968274 966971 964339 961050 958283 957134 957650 958862
61256 958862 960149 962075 965462 970026 974593 978566 982642 988128 996062 1007078 1021393 1038280 1055748
61243 1055748 1071584 1085104 1097563 1110546 1124301 1137897 1150390 1160949 1168225 1170896 1169224 1165032
61231 1165032 1159584 1152469 1143289 1133339 1124264 1115732 1106010 1094756 1083674 1074093 1065333 1056210 1047054
61218 1047054 1039283 1033667 1029923 1027653 1026802 1027319 1028943 1031275 1033776 1035950 1037965 1040717 1044814 1049693
61204 1049693 1054239 1058071 1061768 1066084 1071446 1078068 1085937 1094739 1104256 1114805 1126791 1139809 1152669
61191 1152669 1164360 1174605 1183478 1190957 1196970 1201474 1204356 1205546 1205291 1204000 1201810 1198608 1194484 1189739
61177 1189739 1184465 1178570 1172327 1166420 1161339 1157169 1154119 1152611 1152579 1153223 1154001 1155550 1159176 1165544 1174106
61162 1174106 1183589 1192825 1201449 1210168 1220197 1232166 1245655 1259672 1273156 1285092 1295001 1303696
61150 1303696 1312659 1322044 1330140 1335692 1339913 1345001 1351239 1357046 1361604 1365779 1370318 1374893 1379560 1385563
61136 1385563 1393752 1403463 1414045 1426263 1440728 1455859 1469178 1480283 1490897 1502006 1512575 1521342
61124 1521342 1528390 1534332 1539188 1542939 1546196 1549323 1551492 1551514 1549245 1545367 1540149 1533272 1524831 1515701
61110 1515701 1506813 1498503 1490526 1482189 1472582 1461257 1448721 1435648 1421585 1405222 1386227 1366134
61098 1366134 1346842 1328662 1310442 1291269 1271407 1251757 1233221 1216678 1202876 1191926 1183260
61087 1183260 1176384 1171295 1167888 1165361 1162708 1159555 1156035 1151982 1146837 1140436 1133435 1126762 1120938 1115996
61073 1115996 1111752 1108063 1105230 1104302 1106571 1112415 1120872 1130688 1141576 1154163 1168927 1185688 1204195
61060 1204195 1224752 1247931 1273715 1301220 1329503 1358604 1389436 1422418 1456589 1490681 1524907
61049 1524907 1560785 1598777 1636836 1671935 1702597 1729372 1753397 1775509 1796495 1816840 1835638
61038 1835638 1850564 1859634 1862742 1861096 1855624 1846547 1834170 1819149 1801638 1780792 1755727 1726950
61026 1726950 1696380 1665836 1635827 1605996 1576383 1547628 1520066 1493296 1467022 1441893 1419041
61015 1419041 1398978 1381214 1364765 1348914 1333819 1320698 1310902 1304345 1299283 1294277 1290030 1288667
61003 1288667 1291535 1298478 1308847 1321982 1336671 1351403 1365749 1380737 1397507 1416386 1437634 1462103
60991 1462103 1490307 1521485 1554504 1589448 1627608 1670027 1716556 1766261 1818346 1872872 1930839
60980 1930839 1993359 2060591 2131878 2207116 2287295 2373213 2464342 2559862 2660423 2767911 2883457
60969 2883457 3006401 3135245 3269019 3407625 3551622 3702082 3860330 4027531 4204643
60960 4204643 4392945 4594646 4813089 5052512 5317605 5613228 5944613 6317574 6738085
60951 6738085 7211811 7744665 8343809 9017111 9771430 10612415 11546443 12581902 13729050
60942 13729050 15001627 16420552 18013725 19808950 21826756 24076763 26543908 29150962
60934 29150962 31719897 33987180 35698960 36732829 37151730 37151147 36956025 36749810 36652599
60925 36652599 36702621 36818911 36792188 36358000 35326826 33676210 31539172 29116812 26594543
60916 26594543 24108018 21746265 19562250 17580772 15807203 14235951 12854359 11644048
60908 11644048 10584225 9655742 8841814 8126382 7494227 6932962 6433629 5989121 5592753
60899 5592753 5238067 4919163 4631196 4370936 4136280 3924637 3732461 3557078 3398061
60890 3398061 3255507 3127357 3009466 2898077 2791357 2689061 2591969 2501368 2417811 2340288
60880 2340288 2267422 2199001 2135212 2074917 2016414 1959858 1907117 1858860 1813448 1769248 1726398
60869 1726398 1685370 1645343 1605463 1566729 1531236 1499923 1472094 1446523 1421974 1397156 1371550
60858 1371550 1346234 1322852 1301774 1282177 1263833 1247673 1234288 1222796 1211786 1200861 1190802
60847 1190802 1182463 1175940 1170754 1166638 1163958 1163134 1163668 1164360 1164963 1167063 1172413 1180455 1188511 1194770 1200321
60832 1200321 1207698 1217933 1229671 1240939 1251080 1260815 1271034 1282089 1294277 1308431 1325449 1345230
60820 1345230 1366609 1388582 1411138 1434601 1458806 1483636 1509869 1538405 1568703 1599085 1628859
60809 1628859 1659149 1691185 1724696 1758690 1792944 1827651 1862063 1894654 1924596 1952155 1977563
60798 1977563 2000275 2019440 2034306 2043942 2047467 2045047 2038137 2028168 2015308 1998802 1978057 1952912
60786 1952912 1923313 1889582 1852908 1814872 1776258 1736724 1695719 1653337 1610180 1566884 1524079
60775 1524079 1482382 1441989 1402474 1363530 1325874 1290881 1259185 1230014 1202205 1175443 1150087
60764 1150087 1126175 1103388 1081980 1062852 1046272 1031240 1016703 1002847 990369 978826 966921
60753 966921 954569 943714 936390 932480 929829 926328 921570 916849 913881 913176 913313 912112 908845 904939
60739 904939 902232 901071 900626 900440 900727 901380 901684 901158 899947 898170 895536 891932 887830 883717 879503 874888
60723 874888 870115 866004 863258 861710 860214 857326 852469 846443 840502 834953 828993 821905 813980 806201
60709 806201 799437 794032 789769 786054 782446 779089 776241 773453 769726 764654 758843 753094 747783 743245
60695 743245 739945 737722 735546 732765 730182 729096 729489 729924 729324 728227 728077 729604 732096 734195 735282
60680 735282 736026 737429 739478 741173 741774 741393 740282 738378 736012 734155 733188 732074 729726 726695 724319
60665 724319 722415 719039 712849 704834 697273 691572 687304 682832 676688 668972 661591 656574 653807 650948
60651 650948 645851 638671 631376 625671 621741 618595 615269 611862 609535 609254 610422 611203 610446 608916 608354
60636 608354 609607 611945 613923 614542 613769 612348 611230 611040 611827 613041 613703 613114 611878 611915 614829 620303
60620 620303 626541 632135 636914 641263 645601 650616 657014 664645 672571 680259 687939 695490 701949 706747
60606 706747 710637 714629 718622 721917 724594 727516 731173 735265 739255 742801 745783 748350 750782 753003
60592 753003 754692 756130 758270 761334 764038 765023 764505 763554 762274 759852 756154 751998 747820 743182 737783
60577 737783 731870 725402 717883 709479 701458 694970 689942 685524 681011 676044 670676 665736 662411 660827
60563 660827 659489 656716 652376 647769 644185 642014 640978 640687 641003 642066 643889 645902 647311 647972 648407
60548 648407 648856 648969 648761 649123 650714 652794 653923 653654 652964 653055 654175 655584 656437 656757 657581 659817 662884
60531 662884 665107 665673 665538 665967 667003 668040 669054 670151 670538 669474 668181 669297 673960 680521 686695
60516 686695 692089 697919 705070 713345 722236 731540 741166 750870 760372 769657 779211 789888 802181 815540
60502 815540 828747 841037 852353 862490 870672 876414 880150 882548 883668 883291 881559 878808 875411
60489 875411 872558 872519 876974 885282 895470 906785 920119 935916 953128 970689 988771 1007754 1027046
60476 1027046 1045921 1064678 1083708 1101835 1116769 1127093 1132860 1134575 1132791 1128635 1123420 1117380
60464 1117380 1109930 1101518 1093992 1088425 1083756 1078558 1073227 1069140 1066285 1063391 1060348 1058930 1060574 1064581
60450 1064581 1069361 1074723 1082073 1092667 1106507 1123009 1142212 1165109 1192906 1226025 1263783 1305095
60438 1305095 1349478 1397299 1449108 1504982 1564278 1625524 1686379 1744222 1797069 1843688 1882768
60427 1882768 1912510 1931394 1938756 1934088 1916207 1884057 1838422 1782362 1719864 1654333 1588119 1522584
60415 1522584 1458194 1395058 1333905 1276417 1224262 1177911 1136637 1099531 1066148 1036129 1008607
60404 1008607 982465 957224 933412 911848 892760 875894 861270 849227 839519 830931 822219 813100
60392 813100 803870 794460 784599 774811 766374 759943 754675 749098 742569 735716 729758 725649 723636 723256
60378 723256 723632 723745 722536 719237 714241 709504 707339 708365 710904 712553 712038 709631 706419 703509 701393
60363 701393 699635 697491 695021 693154 692471 692605 693193 694502 696409 697624 697104 695773 695620 697325 699947
60348 699947 702836 706344 710358 713617 715386 716817 719616 723924 728447 732277 735700 739321 743224 747179
60334 747179 751167 755416 760002 764539 768413 771554 774768 778829 783317 787085 790046 793736 799710 808000
60320 808000 817487 827013 835663 842769 848460 853575 858342 861889 863938 866151 870471 876746 883376 889817
60306 889817 896639 903309 908058 910591 913012 916923 921029 922998 922706 922286 923631 927135 932397 938854 945889
60291 945889 953458 962538 973929 986689 998816 1009576 1020083 1031296 1042387 1051500 1057457 1060175
60279 1060175 1060062 1057673 1053789 1049265 1044602 1039662 1033788 1026427 1017947 1009662 1002503 995718 987565 977406
60265 977406 966469 956296 947195 938711 930924 924453 919435 915425 912351 910848 911340 913333 915975 918997
60251 918997 922720 927436 933315 940897 951141 964727 981560 1001168 1023271 1047552 1072957 1097773
60239 1097773 1120546 1140517 1156790 1167362 1169632 1162301 1146772 1126590 1105287 1084440 1063481 1041317
60227 1041317 1018170 995892 976600 961199 949176 939428 931016 923416 916541 910588 905550 900764 895163
60214 895163 888159 880240 872593 866086 860588 855259 849546 843839 839074 835721 833371 831328 829339 827492
60200 827492 825615 823110 819573 815523 812293 810866 810716 810114 807925 804758 801949 799866 798092 796973 797564
60185 797564 799659 801277 801040 800062 800343 802061 803759 804744 805876 807958 810607 812917 814396 815176 816104 818470
60169 818470 822625 826994 829674 831007 833204 837256 841760 845324 848483 852286 856441 860176 863922 868693
60155 868693 874542 880959 888197 896796 906201 915270 923920 932978 942509 951696 960422 969579 979498 989373
60141 989373 998672 1007934 1017553 1026809 1034901 1042107 1049093 1055750 1061596 1066804 1071895 1076618 1080022 1081611
60127 1081611 1081751 1080912 1079156 1076462 1073025 1069020 1064521 1059899 1055930 1053139 1051143 1048845 1045228 1039956
60113 1039956 1033542 1027190 1022209 1019056 1016849 1014163 1010434 1006246 1002174 997901 992957 987889 983850 981076
60099 981076 978617 975907 973827 973634 975328 977760 980154 982794 986192 990181 994075 997418 1000327 1003165
60085 1003165 1006050 1008714 1010904 1012826 1014955 1017484 1020359 1023983 1029259 1036487 1044624 1052144 1058397 1063671
60071 1063671 1068280 1072246 1075690 1078824 1081556 1083640 1085154 1086271 1086690 1086079 1085137 1085349 1087364 1090348 1093414
60056 1093414 1097024 1102232 1108893 1115424 1120512 1124520 1128939 1134659 1141069 1146817 1151162 1154347 1156933 1159221
60042 1159221 1161334 1163156 1163872 1162248 1158091 1153057 1149217 1146954 1144986 1142277 1139071 1136092 1133658 1131800
60028 1131800 1130404 1128971 1127042 1125234 1125066 1127239 1130651 1133513 1134846 1134481 1132386 1128712 1123955 1118323
60014 1118323 1111284 1102327 1091843 1080666 1069150 1057312 1045474 1034000 1022686 1011169 999726 988921
60002 988921 978619 968223 957880 948583 940828 933885 926703 919040 911426 904527 898853 894677 891832
59989 891832 889794 888237 887344 887494 888872 891532 895479 900309 904885 907841 908762 908914 910635 915597 923387
59974 923387 931798 938600 943057 945856 947987 949897 951303 951347 949115 944548 938760 933063 927616 921421 913626
59959 913626 904422 894619 884803 875117 865542 856200 847540 840249 834688 830322 826057 821328 816642 812947
59945 812947 810700 809646 809178 808633 807440 805304 802317 798863 795555 793225 792578 793519 795017 795938 796031 795935
59929 795935 796373 797569 799409 801879 805274 810078 816499 823831 830411 834767 837028 838709 840778 842457
59915 842457 842570 841600 841247 841915 841877 839543 835507 831354 827355 822825 818360 815941 816384 818092 819053 819147 819642
59898 819642 821327 824073 827698 832253 837617 843442 849310 854515 858208 860441 862606 865996 870160 873361
59884 873361 874472 873830 872700 872739 875560 881575 889063 895154 897919 897143 893607 888543 883473 879313 875620
59869 875620 871829 869143 869732 873743 878465 881105 881301 880383 879495 879421 881153 885278 891196 897748 904287 910576
59853 910576 916433 922252 929080 937234 945452 952431 958532 964826 971083 976129 979860 983331 986729 988723
59839 988723 988197 985623 982321 979393 977665 977594 978595 979347 979422 980002 982423 986631 991624 996757 1001959 1007197
59823 1007197 1012548 1018472 1025211 1032020 1037690 1041777 1044826 1047402 1049507 1051041 1052329 1053849 1055613 1056881
59809 1056881 1056311 1052505 1044960 1034828 1024513 1016080 1009934 1005237 1001561 999712 1000577 1003391 1005816 1006057
59795 1006057 1004587 1003471 1004328 1007409 1012345 1018941 1027039 1036231 1046120 1056538 1067137 1077062 1085478 1092205
59781 1092205 1097520 1101433 1103556 1103739 1102491 1100635 1098608 1096202 1092878 1088173 1081814 1073645 1063862 1053420
59767 1053420 1043731 1035430 1027575 1018660 1008534 998762 990867 984693 978803 972105 964711 957525 951413 946641
59753 946641 942770 939212 936027 933928 933313 933676 934269 934819 935093 934320 931955 928866 926819 926488 926582 925185
59737 925185 921544 916440 911288 907012 903374 899242 893961 888497 884618 882752 881296 878385 873746 868490
59723 868490 863709 859896 857178 855326 853740 852026 850450 849318 848144 846053 842875 839352 836413 834758
59709 834758 834803 836303 838177 839581 841064 843758 847356 850035 850812 850983 852521 855855 860042 864469 869296
59694 869296 874482 879516 884328 889657 896171 903703 911565 919234 926512 933378 940001 946651 953307 959422
59680 959422 964384 968260 971926 976270 981236 985858 989451 992618 996691 1002101 1007745 1012148 1014867 1016480
59666 1016480 1017609 1018476 1019216 1020029 1021048 1022371 1024231 1026821 1029996 1033369 1036591 1039337 1041354 1042881 1044705
59651 1044705 1047258 1049933 1051879 1053253 1054844 1056655 1057912 1058638 1060151 1063425 1067782 1071868 1075308 1078666
59637 1078666 1082340 1086342 1090832 1095970 1101258 1105762 1109096 1111636 1113682 1114997 1115336 1114927 1114210 1113359 1112249
59622 1112249 1110622 1108130 1104537 1100064 1095294 1090584 1085723 1080348 1074459 1068246 1061514 1053651 1044272 1033732
59608 1033732 1022953 1012893 1004257 997390 992068 987521 983181 979627 978253 979538 982035 983754 984477 985956
59594 985956 989703 995303 1001242 1006703 1011875 1016868 1021123 1023973 1025299 1025507 1025041 1023893 1021441 1016907 1010308
59579 1010308 1002914 996446 991730 988117 984069 978278 970647 962550 955885 951361 947763 943234 937272 931152
59565 931152 926489 923670 921716 919316 915846 911570 907010 902325 897491 892895 889104 885836 881908 876806
59551 876806 871739 868260 866193 863920 860728 857783 856443 856541 856954 857267 858114 860155 863276 866718 869476
59536 869476 870620 869663 866937 863581 860968 859944 860434 861746 863269 864781 866112 866953 867211 867144 866679 864983
59520 864983 861339 856270 851151 846922 843849 842149 841625 840703 837240 830961 824092 818892 815461 812686 810361
59505 810361 809212 809426 810390 811736 813604 815940 818326 820418 821897 822324 821957 822400 825165 829478 832721
59490 832721 833559 833646 835644 840352 846569 853184 860470 869417 880446 892909 905574 917573 929056 940989
59476 940989 954381 969726 986718 1003881 1018636 1028748 1034129 1036610 1037580 1036513 1032266 1025124 1016887
59463 1016887 1009513 1004477 1002823 1004617 1008329 1011779 1013910 1014983 1015134 1013820 1010947 1007381 1003630 998816
59449 998816 991888 983305 974484 965823 956390 945756 935142 926114 918649 911190 902513 893085 884472 877716
59435 877716 872549 868152 864459 862367 862520 864207 865921 866921 867700 868691 869141 867931 865393 863664 864952
59420 864952 869713 876639 884171 891704 899419 907242 914202 918954 921041 921600 922569 925069 928687 932483 936393
59405 936393 941237 947357 953744 958905 962333 964739 966842 968483 969278 969852 971927 977094 985629 996403
59391 996403 1007629 1017794 1026529 1034930 1044644 1056116 1067821 1077581 1084516 1089269 1092524 1093947 1092711
59378 1092711 1088540 1081956 1074006 1066002 1059016 1053080 1047171 1040416 1033106 1026132 1019909 1014600 1011090 1010694
59364 1010694 1013556 1018179 1023076 1028426 1035597 1045411 1057452 1070893 1085518 1101939 1121103 1143576
59352 1143576 1169291 1198203 1230858 1267078 1303419 1332996 1349471 1351372 1341871 1325063 1304058 1282295
59340 1282295 1263926 1251334 1243722 1239633 1239404 1243026 1246531 1243312 1229628 1207065 1179323 1148798 1117233
59327 1117233 1087435 1061966 1040881 1022562 1006439 993345 983461 975581 968687 962908 958595 955604
59315 955604 954016 954502 957230 961122 964881 968356 972334 977356 983190 989147 994545 999229 1004004 1010192
59301 1010192 1018368 1027817 1037641 1047999 1059751 1073134 1087428 1101898 1116596 1132163 1149197 1167864
59289 1167864 1187850 1208597 1229735 1251259 1273296 1295873 1319051 1342917 1367122 1390578 1411996
59278 1411996 1430716 1446877 1460996 1473525 1484483 1493091 1497997 1498338 1494464 1487274 1476988 1463255
59266 1463255 1446356 1427658 1408659 1390152 1372468 1355832 1339934 1323580 1305537 1285861 1266092
59255 1266092 1248099 1232817 1219925 1208502 1198099 1189381 1183570 1180953 1180077 1178876 1176693 1174969 1175864
59242 1175864 1180504 1188556 1199089 1211564 1226169 1243373 1262747 1281871 1296777 1304220 1303740 1297361
59230 1297361 1287468 1275381 1261670 1246816 1231246 1215530 1201075 1189882 1182785 1178347 1174390 1170406
59218 1170406 1167559 1166503 1166302 1165820 1165234 1165584 1167451 1170614 1174661 1179449 1185173 1192180 1200425 1208999 1216741
59203 1216741 1223559 1230446 1237735 1243855 1246400 1244074 1237220 1227055 1215066 1202581 1190009 1176749 1162567
59190 1162567 1148638 1136240 1124794 1112518 1099093 1086302 1075605 1066399 1057583 1049826 1045070 1044140
59178 1044140 1045882 1048490 1050768 1052130 1052425 1052225 1052702 1054599 1057415 1059879 1061144 1061288 1060751 1059532 1057073
59163 1057073 1052917 1047400 1041577 1036334 1031593 1026506 1020434 1013576 1006593 999915 993688 988327 984565 982726
59149 982726 982252 982324 982814 984169 986438 989008 991448 994088 997336 1000743 1003266 1004387 1004681 1005366 1007573 1011887
59133 1011887 1018140 1025521 1033052 1040106 1046555 1052658 1058897 1065701 1073074 1080618 1088017 1095211 1101956 1107559
59119 1107559 1111461 1113957 1116064 1118816 1122718 1127395 1131567 1133971 1134848 1136011 1138865 1142883 1146677 1149955
59105 1149955 1153352 1156837 1159676 1162011 1165161 1170000 1176026 1182348 1188511 1194008 1198069 1200604 1202424 1203803
59091 1203803 1203643 1200885 1195988 1190187 1183874 1176663 1168600 1160369 1152492 1145047 1137875 1130452 1122087 1113158
59077 1113158 1105661 1101355 1099453 1097332 1093563 1089082 1085166 1081592 1077518 1073137 1069403 1066681 1064722 1063717
59063 1063717 1064276 1066195 1068232 1069708 1071793 1076407 1083949 1092902 1101820 1110973 1121420 1133017 1144218
59050 1144218 1153699 1161323 1167543 1172935 1178617 1185844 1194304 1201743 1206454 1209562 1213515 1218635 1222703 1224092
59036 1224092 1223750 1223331 1222605 1219950 1214882 1208940 1204010 1200478 1197270 1193272 1188479 1183795 1179790 1175855 1170844
59021 1170844 1164359 1156841 1148384 1138393 1126945 1115722 1106589 1099464 1092458 1084114 1074619 1064716 1054399
59008 1054399 1043306 1031811 1020943 1011359 1002943 995344 988439 982242 976815 972343 969005 966581 964325
58995 964325 961297 956727 950299 942537 934901 929031 925553 923815 922811 922049 921423 920767 919867 918644 917146
58980 917146 915640 914872 915616 917639 919788 921593 924073 928167 933053 937165 940462 944408 949857 956285 963119
58965 963119 970329 977438 983576 989236 996533 1006650 1018179 1029218 1040095 1052598 1067064 1081668
58953 1081668 1094350 1104222 1111297 1115997 1119092 1121297 1122959 1124590 1127154 1130940 1134797 1137742 1140786 1145620
58939 1145620 1151703 1156536 1159218 1162000 1167504 1175677 1184343 1191647 1196929 1200134 1201606 1202230 1202901 1203862 1204819
58924 1204819 1205338 1204980 1203748 1202712 1203317 1205498 1207329 1207414 1207017 1208976 1214897 1224153 1235151 1246644 1258008
58909 1258008 1269157 1280316 1291467 1302199 1312539 1323581 1336598 1351669 1367670 1383257 1397281
58898 1397281 1408683 1416911 1422425 1426010 1427618 1426462 1422127 1414866 1404892 1392204 1377102 1360065 1341061
58885 1341061 1319964 1297932 1277371 1259831 1244472 1229223 1213088 1196890 1182194 1170095 1160781
58874 1160781 1153572 1147291 1140992 1134453 1127906 1121492 1115237 1109372 1104366 1100645 1098409 1097525 1097385 1097100 1096202
58859 1096202 1095077 1094412 1094367 1094682 1095497 1097420 1100625 1104462 1108412 1112947 1118847 1125865 1132785 1138879 1144692
58844 1144692 1151161 1158562 1166760 1176085 1187360 1201194 1217581 1236038 1255782 1276081 1296889 1318835
58832 1318835 1341975 1364901 1386007 1405657 1426108 1449088 1474290 1500605 1527770 1556042 1584926
58821 1584926 1613109 1639220 1661977 1680107 1693158 1702195 1708754 1713057 1713802 1709565 1699749 1684491 1664730
58808 1664730 1642419 1619672 1597311 1574984 1552817 1531919 1512768 1494087 1474249 1453226 1432325
58797 1432325 1412449 1393476 1375113 1357297 1339706 1321773 1303552 1285903 1269463 1253918 1238741
58786 1238741 1224126 1210521 1197566 1184354 1170891 1158515 1148381 1139972 1131620 1122158 1111515 1100040
58774 1100040 1088149 1076729 1066937 1059107 1052426 1046148 1040549 1036141 1032559 1029047 1025659 1023058 1021376
58761 1021376 1020297 1020196 1022065 1025958 1030617 1035234 1040631 1047816 1055960 1062913 1067557 1070801 1074165 1078079
58747 1078079 1081797 1084439 1085793 1086307 1086562 1086668 1086115 1084189 1080525 1075258 1068875 1062031 1055171 1048052 1039950
58732 1039950 1030736 1021530 1013786 1007816 1002795 998197 994570 992578 991856 991313 990370 989460 989420 990771 993548
58717 993548 997456 1001970 1006501 1010634 1014154 1016684 1017390 1015332 1010455 1004156 998473 994364 990994 987039
58703 987039 982446 978243 974633 970251 963952 956696 950691 946811 943808 940161 935745 931350 927493 924492
58689 924492 923034 923570 925301 926786 927830 930017 935038 942935 952259 961482 969932 977901 986367 996396
58675 996396 1008213 1020740 1032325 1042047 1050339 1058472 1067439 1076978 1085469 1091145 1093874 1095624 1098805
58662 1098805 1104117 1110235 1115553 1119957 1124938 1132092 1141457 1151157 1158862 1163853 1167545 1171859 1177362 1183233
58648 1183233 1188533 1192745 1195211 1194976 1191665 1186015 1179022 1170692 1159978 1145997 1129015 1110208 1090561
58635 1090561 1070281 1049385 1028494 1008446 989141 969583 949543 930478 913962 899731 886384
58624 886384 873806 863541 856400 850855 844581 836822 828498 820621 813569 807663 803561 801842 802452 804526
58610 804526 806703 808132 809468 812285 816925 821600 824510 826445 830208 837454 847023 856355 863577 868038
58596 868038 869978 870393 870534 870795 870420 868709 866089 863538 861471 859730 858169 856550 854180 850553 846297
58581 846297 842781 840694 839550 838632 837712 836794 835904 835482 836293 838455 841086 843507 846412 851090 857618 864495
58565 864495 870084 873862 876233 877763 878874 879855 880878 882271 884848 889376 895342 900750 903771 904429 904254
58550 904254 904588 905745 907571 909906 912328 914181 915276 916195 917582 919441 921344 922925 923844 923667 922300
58535 922300 920440 919250 919555 921361 923838 925656 925966 925565 926737 931328 939239 949243 960704 973599
58521 973599 987247 1000408 1012866 1025770 1039864 1054399 1068411 1082037 1095678 1108729 1120450
58510 1120450 1131656 1144223 1158953 1175077 1191887 1209729 1229075 1249724 1271507 1295056 1321231
58499 1321231 1350209 1381312 1413041 1443105 1469447 1491942 1512202 1530928 1546285 1555956 1560067 1560742
58487 1560742 1559130 1554428 1545949 1534677 1522243 1509514 1496836 1484640 1472789 1459851 1443988 1424503
58475 1424503 1402024 1377477 1351522 1324891 1298649 1273887 1251340 1231252 1213433 1197443 1182930
58464 1182930 1169790 1158106 1148053 1139811 1133269 1127914 1123421 1120276 1119162 1119515 1119367 1117093 1112949 1108506
58450 1108506 1105014 1102671 1100973 1099099 1096177 1091744 1085971 1079286 1072156 1065475 1060482 1057606 1055806 1053824
58436 1053824 1051745 1050478 1049960 1048963 1046924 1045122 1045485 1048590 1053178 1057425 1060563 1063395 1067268 1072580 1078655
58421 1078655 1085289 1093781 1105717 1121064 1138217 1155663 1172804 1189372 1205101 1220077 1234406 1247303
58409 1247303 1257403 1264238 1268486 1270449 1269393 1265065 1258934 1253003 1247978 1243419 1239155 1235587 1233008 1231674
58395 1231674 1232462 1236425 1243470 1252188 1261260 1270421 1279803 1288913 1296751 1302630 1306405 1307963 1306891 1302876
58381 1302876 1296354 1288596 1280945 1273943 1267218 1260233 1252939 1245699 1238921 1233121 1229246 1228451 1231151 1236316
58367 1236316 1241964 1246638 1250508 1255055 1261685 1270718 1281451 1292793 1303714 1313513 1322036 1329388 1335189
58354 1335189 1338401 1338302 1335431 1331048 1325842 1319689 1312565 1305004 1297539 1290241 1283046 1276105 1269559 1263349
58340 1263349 1257491 1252295 1248100 1244926 1242581 1241072 1240915 1242937 1247350 1252970 1258010 1262116 1266942 1273835
58326 1273835 1281547 1287458 1290786 1293173 1295958 1298415 1299386 1299470 1300536 1303739 1308830 1315006 1321716 1328967 1337403
58311 1337403 1347777 1359933 1372696 1385131 1397511 1410647 1424749 1439369 1454040 1468580 1483181
58300 1483181 1498585 1515688 1534669 1555007 1576567 1599794 1624279 1647907 1668323 1684886 1698616
58289 1698616 1710698 1721690 1731676 1740459 1747909 1754802 1762885 1773430 1785995 1799246 1812598 1826452
58277 1826452 1841312 1857630 1876280 1898155 1923073 1949642 1976366 2002594 2028562 2054983 2082486
58266 2082486 2110976 2139487 2166857 2192494 2216468 2239283 2261732 2284458 2307290 2329414 2350449
58255 2350449 2370910 2391401 2412028 2432998 2455109 2479025 2504502 2530818 2557621 2585122 2613983
58244 2613983 2645207 2679457 2716229 2754453 2794088 2836066 2880390 2925465 2969919 3013913 3057974
58233 3057974 3101809 3145109 3188401 3232268 3276876 3323156 3373116 3427853 3486474 3547977 3612745
58222 3612745 3680839 3750387 3819450 3888394 3958784 4031138 4105449 4182601 4263188 4346053 4430166
58211 4430166 4517030 4609025 4706298 4807704 4914014 5027568 5149162 5277776 5413244 5556721
58201 5556721 5708521 5867684 6033711 6206871 6387159 6574828 6771259 6976973 7189603
58192 7189603 7406549 7629070 7860742 8102507 8352668 8611727 8883439 9170458 9472484
58183 9472484 9789758 10125332 10482756 10864397 11273152 11713079 12187059 12696069 13241411
58174 13241411 13824950 14446268 15102444 15791797 16515597 17275634 18073182 18911449 19796340
58165 19796340 20733820 21729005 22788116 23917980 25122861 26405002 27769056 29222692
58157 29222692 30772693 32424943 34189641 36082976 38123052 40328418 42721375 45328694
58149 45328694 48180164 51313751 54784094 58659807 63011451 67909661 73435944 79684294
58141 79684294 86746272 94702705 103636050 113642811 124824819 137267839 151022971
58134 151022971 166095512 182460549 200137572 219305899 240371122 263898492 290387825
58127 290387825 319878515 351408685 382565036 409605198 428467077 436294107 432521091
58120 432521091 418794839 397911057 372629146 345068167 316720941 288689366 261820705
58113 261820705 236709603 213676894 192802105 174005913 157137972 142032015 128523607
58106 128523607 116453293 105673062 96052792 87478988 79849792 73071967 67057184 61716340
58098 61716340 56959178 52702249 48876273 45425539 42304050 39474455 36906836 34573956
58090 34573956 32447814 30501927 28714746 27068626 25547152 24135659 22823003 21600553
58082 21600553 20459955 19393199 18394032 17457791 16580054 15755830 14979263 14243953 13544961
58073 13544961 12881069 12253725 11663243 11107207 10582692 10088087 9621878 9181380 8763831
58064 8763831 8367553 7991230 7633316 7292938 6970133 6664363 6374003 6098019 5836923
58055 5836923 5591201 5359850 5141141 4933599 4735499 4544752 4360449 4183644 4015578
58046 4015578 3855747 3702418 3554309 3411163 3273382 3141864 3017602 2900883 2791243
58037 2791243 2688232 2591410 2499470 2410541 2323873 2240412 2161403 2087321 2018328 1954627 1895878
58026 1895878 1841308 1790868 1745316 1704674 1667486 1631971 1597064 1562164 1527059 1492524 1459855
58015 1459855 1429286 1399871 1371217 1344153 1319152 1295305 1271483 1247425 1223191 1198772 1174912
58004 1174912 1153008 1133362 1114526 1095263 1076122 1058297 1041915 1026464 1012017 999061 987646
57993 987646 977359 967506 956831 944001 929107 913916 900049 887700 876584 866951 858841 851395
57981 851395 843885 836626 830050 823681 816749 808965 800035 789515 777976 767147 757877 749026 739398
57968 739398 729539 720283 710711 699312 686477 674071 662926 652373 642026 632366 623463 614599 605556
57955 605556 597326 591069 586891 583767 580373 576181 571952 568742 566295 563245 559250 555597 552890 549556
57941 549556 544026 537231 531297 526698 522672 519793 519753 522419 525109 525338 522872 518805 514116 509610 505892
57926 505892 502624 498817 494293 489910 485954 481455 475707 469431 463663 458312 452731 447176 442736 439879
57912 439879 437779 435411 433026 432072 433296 435174 435121 432510 429559 428646 429732 431419 433467 436598 440390
57897 440390 443295 444802 445835 446696 446297 444113 441518 440334 441112 443485 447092 451259 454737 456832 458261
57882 458261 460160 462785 465885 469638 474369 479743 485127 490552 496586 503357 510303 516882 523141 529500
57868 529500 536157 542664 548106 551858 554038 554958 554420 552160 548720 545015 541045 536003 529753 523139 516441
57853 516441 508697 499204 488790 478790 469597 461105 453920 448984 446253 444625 443034 440948 437973 433796
57839 433796 428607 423088 417903 413487 410183 408218 407536 407673 407707 406564 404018 401386 400349 400936 401748 402535
57823 402535 405082 410418 416346 419434 419014 417527 417135 417588 417630 416856 415457 413301 410191 406300 401648 395797
57807 395797 388828 382101 377160 373929 370654 365713 359132 352233 346151 340982 336497 333303 332563 334233
57793 334233 336248 336379 334706 333346 333803 335613 337811 340443 343812 347204 349486 350562 351248 351892 352059
57778 352059 351505 350576 349529 348216 346510 344422 341747 338407 335306 333969 334946 337307 340080 343246 346699
57763 346699 349257 349947 349722 350556 353017 356077 359356 363994 370618 377754 383319 386934 389733 392405 394503
57748 394503 395422 395043 393447 390853 387829 384722 380808 374871 366917 358606 351578 345896 340492 334714 328984
57733 328984 324240 321053 319117 317424 315246 313058 312063 312604 313532 313525 312577 311744 311787 312625 313849 315078 315880
57716 315880 316076 316351 317963 321406 325630 329015 331060 332707 335000 337841 340367 342196 343679 344922 345247
57701 345247 344133 342202 340552 339239 337176 333669 329418 325613 322457 319069 314691 309766 305899 304774
57687 304774 306814 310745 314609 317119 317814 316372 312873 308900 307080 308567 311594 313436 313357 312606 311927
57672 311927 310540 307852 304829 302869 302097 301662 301208 301061 301087 300316 298042 294784 291853 290324 290611 292540
57656 292540 295347 297855 299264 299829 300360 300993 300956 299674 297583 295429 293133 289889 285289 279939 275029
57641 275029 271621 270196 270427 271413 272450 273514 274741 275869 276780 278293 281421 285734 289249 290258 288723
57626 288723 285897 283402 282680 284205 286714 288306 289107 291973 299624 311798 326187 341451 358114 377073
57612 377073 398800 424003 453556 487298 523911 562433 602918 644899 685589 719996 742602
57601 742602 749298 739026 714498 680892 643076 603809 564271 525448 488453 454015 422374 393667
57589 393667 368171 346287 328355 314242 302886 292724 282927 274064 267247 262838 260272 258978 259015
57576 259015 260664 263592 266537 268013 267415 265420 263211 261435 260027 258722 257261 255303 252744 250151
57562 250151 248330 247180 245430 241771 236023 229158 222523 217151 213376 210820 208886 207220 205495 203110
57548 203110 199880 196962 196147 197809 200265 201570 201322 200286 198966 197323 195469 193800 192474 191135 189051
57533 189051 185479 180435 175377 172387 172048 172615 171934 169643 166850 164259 161609 158520 154848 150407 145360
57518 145360 140793 137783 135835 133296 129520 125630 122833 120942 119011 116581 113724 110570 107487 105215
57504 105215 104140 103712 103035 101872 100781 100592 101888 104480 106995 107555 105514 102341 100351 100751 103144
57489 103144 106439 109629 111943 112998 113085 113014 113502 114675 115961 116410 115473 113764 112899 114331 118364 124233
57473 124233 130732 136699 141406 144908 147893 151035 154697 159038 163741 167685 169829 170807 172743 176915
57459 176915 182374 187479 191895 196339 201307 207100 214272 222686 230841 237667 244541 253729 264969 275448
57445 275448 283348 289587 295540 300856 304456 306141 306048 303810 299546 294687 290507 286570 281917 277028 273245
57430 273245 270680 268052 264400 259866 255039 250736 248198 248238 249984 251446 251470 250441 249232 248453 248642 250059
57414 250059 252154 254107 255982 258398 261155 263355 265057 267509 271271 275308 278551 281346 284611 288480
57400 288480 292548 296667 300580 303466 304886 305850 308039 312066 317061 321665 324895 326457 326994 327907 330212
57385 330212 333543 336664 338864 340577 342963 347181 353577 360962 367033 370257 371258 371992 373915 377499
57371 377499 382912 390058 397949 404981 410248 414150 417672 421582 426340 432200 439205 447341 456686 466996
57357 466996 477269 486289 493729 500327 506993 514131 521685 529331 536684 543819 551530 560480 570066 578763
57343 578763 585655 591167 596336 602039 608932 617266 626474 635526 644048 652526 661316 670133 678735 687264
57329 687264 695511 702721 708832 715203 723175 732324 741096 749063 757679 768648 782095 796605 810725
57316 810725 824249 838111 853015 868174 881728 892587 901565 910474 920533 932021 944943 959166
57304 959166 973987 988287 1001356 1013246 1024352 1035157 1046393 1058866 1072830 1087906 1103767
57293 1103767 1120528 1138183 1156172 1173961 1191846 1210615 1230445 1250633 1270540 1290277 1310126
57282 1310126 1329800 1348963 1368215 1388670 1410389 1432141 1453247 1474818 1498287 1523389 1548759
57271 1548759 1574157 1600621 1628318 1655846 1682348 1709057 1737694 1768166 1798812 1828207 1855667
57260 1855667 1880702 1903400 1925184 1947864 1971785 1995780 2018927 2041398 2063646 2086004 2109301
57249 2109301 2134647 2161918 2189378 2215585 2241100 2267637 2296036 2325710 2355726 2385630 2415246
57238 2415246 2444190 2471809 2497527 2521314 2543799 2565652 2586903 2607201 2626685 2646063 2665810
57227 2665810 2686023 2707219 2730515 2756525 2784705 2814305 2845386 2878391 2913372 2950436 2990472
57216 2990472 3034496 3082346 3132674 3184042 3235418 3285862 3334622 3381571 3426803 3469627 3508530
57205 3508530 3542333 3571022 3595422 3616533 3635167 3651767 3666651 3680951 3697151 3717860 3743888
57194 3743888 3774219 3807996 3845616 3887475 3932570 3979264 4026934 4075949 4126205 4176629 4226436
57183 4226436 4276182 4326979 4378755 4429663 4477261 4520136 4558271 4592124 4621840 4647458 4669313
57172 4669313 4687757 4702803 4714596 4723964 4731721 4737544 4740528 4741252 4742414 4746738 4754714 4764934 4776289
57159 4776289 4789165 4804736 4823764 4846060 4870667 4896515 4923237 4951312 4981172 5012402 5044171
57148 5044171 5076200 5108698 5141376 5173222 5203564 5232965 5262630 5293205 5324666 5357417 5392815
57137 5392815 5431989 5474251 5517437 5560189 5603315 5648295 5694942 5741347 5785780 5827425 5865246
57126 5865246 5897614 5923754 5944559 5961043 5972658 5977939 5976138 5967360 5951690 5929217 5900388 5865115
57114 5865115 5821635 5767411 5701324 5624307 5538047 5444074 5344101 5240103 5133679 5025839 4917451
57103 4917451 4809270 4701631 4594873 4489808 4386676 4283730 4178153 4068590 3955615
57094 3955615 3839478 3718925 3592925 3462192 3327826 3189399 3045579 2895899 2740574
57085 2740574 2578965 2409650 2232110 2047197 1855578 1656562 1448947 1232277 1006566
57076 1006566 771115 524608 266738 -1051 -277474 -564231 -866277 -1189209 -1537083 -1913041
57066 -1913041 -2320796 -2764353 -3246896 -3771204 -4340866 -4960001 -5632059 -6360269 -7149519
57057 -7149519 -8006951 -8940811 -9959561 -11071843 -12286558 -13613967 -15068676 -16671817
57049 -16671817 -18449468 -20429993 -22645123 -25133848 -27944140 -31132670 -34766478 -38925316
57041 -38925316 -43699468 -49184639 -55481126 -62696875 -70945941 -80340895 -90988163 -102989007
57033 -102989007 -116434369 -131383086 -147832005 -165704491 -184885410 -205301660 -226982874
57026 -226982874 -249990736 -274175862 -298905930 -323019007 -345108858 -363948433 -378733466
57019 -378733466 -389029685 -394595340 -395302411 -391192241 -382543860 -369863984 -353816692 -335144460
57011 -335144460 -314598099 -292877195 -270593842 -248265064 -226316710 -205082798 -184805742
57004 -184805742 -165648258 -147713274 -131061799 -115726066 -101718446 -89033233 -77642087
56997 -77642087 -67491525 -58507717 -50603702 -43683677 -37646596 -32392314 -27827127 -23865193
56989 -23865193 -20428013 -17444988 -14853526 -12597216 -10624748 -8891578 -7361665 -6006583
56981 -6006583 -4803619 -3734690 -2785045 -1941263 -1190681 -522613 71518 599902 1070690
56972 1070690 1490255 1863029 2194189 2490876 2759349 3002386 3221255 3419395 3602389
56963 3602389 3774198 3933790 4074624 4186900 4261943 4296699 4294843 4263771 4211192 4144074 4068332
56952 4068332 3987427 3901879 3811302 3716357 3617795 3514554 3404207 3284926 3156058 3017481
56942 3017481 2869670 2714175 2553078 2388321 2222369 2058860 1901346 1751617 1610175
56933 1610175 1477970 1356496 1246390 1147148 1058300 980038 912593 855789 809208 772099 743088
56922 743088 720528 703027 689094 676555 663217 648149 631745 614676 597495 581121 566796
56911 566796 555311 546706 540656 536479 532903 528750 524235 521020 520666 523405 528532 535458 544096 554726
56897 554726 567816 583585 601162 618221 631809 639782 641514 637603 629354 618643 607698 598176
56885 598176 590243 583032 576357 571500 569762 570686 572566 574643 577841 583226 590698 599644 610134 622878
56871 622878 638384 656379 675330 692156 703192 706309 701866 691385 676062 657151 636873 617652
56859 617652 600518 585115 571139 559019 549237 541751 536182 532001 528451 524811 520911 517235 514641
56846 514641 514116 516317 520772 525812 530008 533610 538064 544171 551302 558376 564964 571311 577709 584135
56832 584135 590346 596311 602706 610697 620848 632267 643170 652324 659746 666085 671524 675217 675759 672466
56818 672466 666317 659292 652726 646836 642002 639665 641330 647279 656985 670149 686464 704777 723721
56805 723721 743252 764709 789297 817163 847952 881298 916412 951720 985148 1014321 1036488
56794 1036488 1049177 1051607 1045331 1033286 1018345 1002705 988033 975625 966333 960502 958124 959277
56782 959277 964613 975285 992183 1015263 1043641 1076162 1111862 1150443 1192561 1238969 1288478 1336698
56770 1336698 1377207 1404169 1414222 1407071 1385472 1354332 1318629 1281504 1244388 1208506 1175579
56759 1175579 1147165 1124136 1106873 1095341 1088835 1086237 1086904 1091128 1099777 1113838 1134172 1160973
56747 1160973 1192971 1227071 1258726 1282815 1294986 1293181 1278098 1251958 1216989 1175352 1129925
56736 1129925 1084170 1040991 1002164 968767 941469 920205 903986 891329 880962 872451 866522 864500
56724 864500 867102 873989 884657 899005 916254 933685 947262 953502 950591 938525 919143 895592
56712 895592 870685 845732 821200 797641 775013 752083 728155 704935 684951 668291 652739
56701 652739 637211 623045 611358 601061 590598 580134 570789 562869 556130 550925 547702 545715 543326
56688 543326 539445 534053 527765 521546 516494 513108 510911 509186 507725 506455 504817 502151 498537 494905
56674 494905 492486 492190 493852 495943 496773 496333 496089 496503 495826 492397 487430 484222 484642 487339 489532 489835
56658 489835 489172 489478 491909 496062 500478 503601 504415 502846 500133 498305 498430 499443 499462 498164 497028 497351
56642 497351 499065 501426 503516 503928 501537 497296 493888 492811 492929 492652 492194 492564 493587 494409 495060 496111
56626 496111 497424 498643 500275 502822 505324 506348 506057 505783 505706 504701 502638 501238 502057 504798 508147
56611 508147 511270 513848 515433 515585 514464 512962 512390 513854 517439 522022 526358 530287 534497 539473 545368
56596 545368 552455 560671 568863 575716 581578 588224 596316 604108 609347 611809 613171 614719 615894 615155
56582 615155 611848 607032 602505 599179 596607 593990 591064 587751 583644 578583 573396 569253 566422 564247
56568 564247 562077 559511 555990 551186 545830 541245 537812 534618 530799 526507 522253 517940 513015 507302
56554 507302 501450 496717 494126 493435 493104 491793 489730 488012 486872 485565 483918 482810 482734 482807 481869 480062
56538 480062 478751 479120 481115 483474 484631 484059 483042 483811 487575 493475 499484 504193 507778 511389 515456
56523 515456 518597 518829 516296 513909 514307 516847 518978 520200 522745 528084 534663 540167 544547 549403 555205
56508 555205 560729 565019 568636 572776 577980 583987 590373 597144 604984 614876 627199 641171 655254
56495 655254 668030 678684 687013 693246 697739 700765 702771 704647 707105 709671 710983 710433 708976 707896
56481 707896 707316 706426 704687 702058 698309 692982 686218 679063 672648 667269 662477 657959 654064 651302 649319
56466 649319 646653 641856 634879 627146 620234 614627 609679 604522 598986 593851 590139 588029 586605 584822
56452 584822 582365 579256 575231 570267 565327 561634 559291 557573 556481 556814 558404 559424 558109 554402
56438 554402 549338 543629 537700 532625 530053 531034 535074 540209 544062 545431 545093 544553 544062 542666 540271
56423 540271 538439 538467 539681 540522 540512 540239 540108 540228 541031 542789 544685 545467 545112 544924 545882 547674 549482
56406 549482 551065 552775 554973 557575 559938 561285 561568 561693 562520 563895 565222 566580 568518 570978 573325
56391 573325 575414 577732 580233 581859 581679 580002 578017 576741 576630 577696 579460 580902 581025 579800 578574
56376 578574 579151 581976 585231 586420 585240 584143 585287 587613 588197 586164 583606 582363 581638 579855 577488
56361 577488 576396 577023 578022 578641 579800 582241 584912 586132 585603 584409 583582 583486 584138 585120 585310 583777 581129
56344 581129 579196 579103 580278 581573 582586 583498 584315 584887 585247 585412 585275 585114 585639 586860 587512 586508 584677
56327 584677 584063 585554 588050 589999 590960 591582 592827 595354 599020 602788 605685 607723 609188 609256 606497
56312 606497 601091 595454 592125 591735 593316 595618 597538 598251 597868 597456 597737 598263 598427 598518 598982 599280 598541
56295 598541 597031 596084 596786 599481 604181 610350 616366 620362 622096 623288 625612 628743 630802 630616 629232
56280 629232 629125 631903 636848 641856 645652 648682 651877 655305 658501 661596 665430 670696 677362 684770
56266 684770 691930 697974 702750 706851 710854 714727 718151 720979 723115 724364 724807 724987 725515 726955 730214
56251 730214 736138 744089 751690 756929 760152 763324 767881 774000 781305 789075 796146 801836 806965 812943
56237 812943 819915 826906 833750 841602 851120 861307 870795 879495 888293 897612 906935 915519 923275 931078
56223 931078 940385 952181 966171 981338 997248 1014250 1032350 1050752 1068985 1087857 1108602 1131390
56211 1131390 1155338 1179866 1205514 1233385 1264231 1298136 1334686 1373209 1413135 1454417 1497647
56200 1497647 1543703 1593474 1648044 1708757 1776461 1850618 1929795 2013549 2103390 2201491 2308785
56189 2308785 2425001 2550140 2684892 2829541 2983270 3144695 3312310 3484202 3658224
56180 3658224 3832773 4006648 4177765 4342712 4497847 4639899 4765165 4869317 4949051 5003261
56170 5003261 5031798 5033911 5008845 4957358 4881653 4784396 4668783 4538853 4398360 4249553 4094168
56159 4094168 3935275 3776779 3621045 3468261 3318303 3172163 3031308 2896707 2768981
56150 2768981 2648724 2536231 2431361 2333893 2243590 2159866 2081970 2009581 1942785 1881427 1824977
56139 1824977 1772938 1724849 1679950 1637598 1598064 1562344 1530963 1503313 1478204 1454702 1432523
56128 1432523 1412059 1393960 1378327 1364416 1351394 1339096 1327704 1317220 1307827 1300301 1295193 1291824
56116 1291824 1288785 1285268 1281425 1277854 1275500 1275629 1278860 1284352 1290680 1297344 1304638 1312426 1320132 1327851
56102 1327851 1336464 1346511 1357764 1369987 1383430 1398402 1414869 1432486 1450714 1469207 1488525
56091 1488525 1510082 1534807 1562261 1591515 1622306 1654819 1689293 1726738 1769175 1817968 1872631
56080 1872631 1932319 1997714 2070095 2149385 2234611 2325565 2422194 2522663 2623555 2721602 2813848
56069 2813848 2897051 2969228 3031843 3088631 3142239 3193284 3241742 3286786 3325488 3354312 3372357
56058 3372357 3381149 3381250 3371583 3352376 3326060 3294177 3255427 3207690 3150101 3082636 3006002 2923053
56046 2923053 2838292 2754940 2674224 2598125 2530203 2472188 2421983 2376695 2335867 2300251 2269464
56035 2269464 2242920 2221513 2206185 2195843 2188501 2183592 2181534 2182024 2184449 2189277 2197433 2208787 2222407
56022 2222407 2237643 2254015 2270919 2288491 2307808 2329212 2351533 2374034 2397808 2423834 2450891
56011 2450891 2477101 2502710 2529592 2558533 2588651 2619257 2650952 2684937 2722117 2762631 2805471
56000 2805471 2848904 2891870 2934684 2978169 3022832 3069070 3117038 3165887 3214325 3262415 3311555
55989 3311555 3362273 3413544 3464983 3518090 3574459 3634184 3696738 3761792 3828245 3894300 3959720
55978 3959720 4026540 4096439 4168949 4243296 4320187 4400438 4483545 4569090 4658159 4752075 4851126
55967 4851126 4955605 5066447 5183722 5306313 5434360 5570262 5715943 5870847 6033634
55958 6033634 6203851 6380907 6563906 6753949 6954150 7165783 7386779 7615427 7852760
55949 7852760 8099689 8355134 8619364 8896036 9188290 9495760 9818277 10159545 10524099
55940 10524099 10913574 11329306 11775679 12257100 12774130 13326201 13915445 14543785 15208621
55931 15208621 15905730 16634801 17398637 18199215 19038652 19922076 20855833 21844993 22895964
55922 22895964 24018398 25220166 26503358 27869717 29326996 30885580 32553092 34338848
55914 34338848 36260974 38343074 40606522 43072369 45768783 48731885 52004221 55640894
55906 55640894 59715427 64313837 69527393 75457950 82222170 89934228 98679922 108511709
55898 108511709 119465020 131574423 144886362 159476874 175462929 192994964 212247827
55891 212247827 233421733 256719303 282270658 310030298 339635042 370122322 399525595
55884 399525595 424720155 442009375 448419600 442928452 426760682 402637043 373648837
55877 373648837 342474678 311118663 280940135 252760631 226992255 203770271 183052466
55870 183052466 164680805 148434717 134079901 121391611 110156679 100180252 91299359
55863 91299359 83384079 76325752 70029465 64412713 59399034 54910449 50871952 47222965
55855 47222965 43918707 40921784 38198708 35723152 33474527 31431023 29567762 27861615
55847 27861615 26293516 24846101 23503286 22252647 21085038 19991694 18964140 17996203
55839 17996203 17083371 16220904 15405033 14634814 13909967 13227851 12585091 11980854 11415550
55830 11415550 10887238 10392084 9927423 9491670 9082077 8695309 8329731 7984977 7660095
55821 7660095 7354062 7066743 6796824 6539996 6291892 6052039 5822574 5603895 5393898
55812 5393898 5190455 4992111 4797123 4604507 4415592 4232386 4054823 3881524 3712431
55803 3712431 3548588 3390250 3237584 3092601 2957962 2834158 2719722 2613499 2514601 2420954
55793 2420954 2330463 2243371 2161393 2084903 2013002 1945802 1884230 1827770 1774646 1724267 1677490
55782 1677490 1634464 1594097 1555651 1519222 1484669 1451652 1420436 1391107 1362513 1333849 1306709
55771 1306709 1283345 1263096 1242856 1221148 1199524 1179590 1160812 1141981 1123006 1104370 1086119
55760 1086119 1068072 1050062 1031674 1012815 994739 979241 966514 954847 942742 930380 918898
55749 918898 909203 901645 895964 891353 887269 884068 882239 881431 881122 881798 884380 888792 894026 899215 903701
55734 903701 906813 908847 911589 916312 921682 925085 925589 924091 921189 916712 910978 904531 896749 886594
55720 886594 874669 862580 850293 836234 820228 804129 788960 773635 757494 742214 729932
55709 729932 720944 714442 710200 708120 706994 705019 701168 695342 687850 679491 671572 665040 659862 655526
55695 655526 651630 647672 642956 637185 630695 623847 616665 609128 601126 592017 581101 568785 556547
55682 556547 545473 535462 525952 516665 507535 498824 491540 486792 484319 482351 479267 474831 469767 464909
55668 464909 460910 457815 454674 450388 445189 440346 436169 431352 424872 417724 412156 409589 409559 410166 409487
55653 409487 407321 405710 406978 411111 415885 419654 422846 426332 429493 430766 429404 426009 421746 417485
55639 417485 413279 408363 402108 395070 388522 382952 377919 373342 369793 367236 364791 362345 361167 362093
55625 362093 364077 365575 366515 367843 369800 371814 373758 376141 379057 381809 383724 384749 385215 385431 385617
55610 385617 385944 386630 388085 390683 394208 397712 400158 401118 400888 400222 400001 400798 402644 405370 408944 413033
55594 413033 416561 418463 418853 418751 418692 418392 417625 416434 414440 411230 407758 406069 406907 408530 408583 406293
55578 406293 402207 396846 390707 384733 379467 374076 367379 359790 353254 349101 346628 343990 339921 334382
55564 334382 328016 321443 315291 310587 308390 308467 308810 307378 304239 301080 298630 295828 291856 287638 284491
55549 284491 282262 279809 276618 273022 269473 266530 265034 265159 265587 264686 262419 260245 259224 259101 259192 259321
55533 259321 259694 260567 262204 264571 266795 267441 265768 262631 260058 259875 262488 266657 270524 273144 275167
55518 275167 278059 282843 289531 297419 305703 314037 322736 332350 343017 354345 365721 376378 385415
55505 385415 392359 397557 401381 403285 402676 400590 399032 398258 396053 390400 381649 371241 359788 347812
55491 347812 337088 329156 322922 315715 306894 298777 293564 290755 288283 285046 281554 278816 277457 277525
55477 277525 278502 279557 280089 279916 278931 277004 274437 272156 271055 271141 271414 270586 268087 264540 261123 258224
55461 258224 254949 250211 244054 237460 231153 225220 219729 214872 210292 205062 198922 193131 189495 188547
55447 188547 189067 189362 188680 187257 185459 183427 181580 180804 181577 183143 184173 184246 184176 184836 186260 187937 189280
55430 189280 189564 188148 185378 182747 181574 181856 182837 184162 185815 187410 188439 189082 189987 191246 192228 192437
55414 192437 191921 190784 188996 186953 185747 186406 188969 192455 195607 197608 198282 197889 196900 195956 195782 196788
55398 196788 198752 201111 203471 205517 206621 206245 204821 203598 203358 203813 204400 204931 205127 204312 202226 199648
55382 199648 197686 196829 197012 197943 198927 199068 198287 197524 197388 197341 196973 197215 199229 202616 205752 207584 208158
55365 208158 207906 207364 207151 207136 206246 204292 203430 205939 210641 213346 211491 206993 203901 204333 207310 210467
55349 210467 211954 211280 209281 207315 206232 206114 206662 207230 206795 204850 202374 201009 201198 201979 202576 203090
55333 203090 203519 203368 202626 201946 201382 200151 198253 197030 197164 197258 195722 193255 192028 192749 193925 194021 193188
55316 193188 192590 192873 193699 194275 193903 192243 189360 185717 182197 179951 179666 180850 182218 182949 183181 183201 182823
55299 182823 181897 180803 179971 179378 178936 178843 179031 178895 178277 178235 179944 183016 185693 186651 186033 184791 183687
55282 183687 182978 182546 182191 182045 182603 183995 185510 186383 186839 187640 188668 188771 187266 184925 183039 181932
55266 181932 180888 179324 177570 176517 176780 178322 180755 183776 187128 190079 191379 190238 187454 185069
55252 185069 184534 185343 185775 184884 183436 182891 183882 185848 187724 188529 187547 184756 181326 179099 179011 180240 181335
55235 181335 181937 182927 185023 187794 190183 191635 192593 194085 196714 199850 202018 202518 202344 202992 204679 206583
55219 206583 208633 211795 216204 220203 222115 222261 222208 222479 222079 220264 217760 215891 215166 215201 215590 216264 217123
55202 217123 217834 218132 217937 216895 214206 209522 203953 199533 197450 197340 198449 200524 202977 204174 202917
55187 202917 200191 198120 197266 196381 194900 194099 195167 197440 199405 200312 199914 197733 193980 190539 189584 191288
55171 191288 193864 195683 196441 196450 195933 195110 194139 192786 190904 189291 189300 191341 194381 197109 199052 200417 201455
55154 201455 202302 203000 203393 203371 203386 204240 206053 207818 208366 207629 206647 206475 207342 208777 210204 211262 211650 210985
55136 210985 209043 206139 203046 200479 198773 197955 197773 197622 196930 195879 195323 195705 196352 196266 195340 194381 194196
55119 194196 195033 196726 198871 200893 202350 203207 203694 204028 204385 204798 204918 204296 203176 202486 202672 203110 203268
55102 203268 203732 205258 207426 209374 211423 214499 217924 219321 217366 213585 210734 210081 210788 211205 210150
55087 210150 207653 205208 204811 206960 209909 211444 211002 209517 207866 206396 205550 205732 206467 206699 206223 206020
55071 206020 206846 208241 209346 210005 210485 210661 210220 209391 208737 208319 207678 206681 205830 205688 206389 207689 209046
55054 209046 209726 209484 209189 210029 211961 213694 214477 214988 215975 217010 217418 217527 217868 217915 216995 215933 216101 217057
55036 217057 216981 215738 215584 218062 221765 224277 225025 225096 225361 226144 227774 229983 231365 230818 229174 228160
55020 228160 228183 228357 228227 228053 227700 226789 225959 226483 228515 230942 233065 235082 236813 237481 237217 237342 238489
55003 238489 239657 239771 239061 238192 237111 235612 234045 232561 230548 227820 225652 225564 227563 230377 232859
54988 232859 234272 233871 231447 228082 225371 223916 223295 223233 223862 224940 225793 226219 226707 227559 228407 228798 228736
54971 228736 228393 227654 226324 224698 223676 224106 225780 227332 227564 226884 226789 227841 228983 229214 228952 229029 229172
54954 229172 228564 227381 226670 226979 228121 230021 232701 235472 237246 237662 237076 235585 233269 231335 231540 233993
54938 233993 236781 238424 239583 241502 243786 244904 244268 242665 240936 239353 238261 238357 240035 242921 246166
54923 246166 248790 249850 248911 246631 244553 244045 245315 247246 248127 246983 244593 242970 243403 245245 247041
54908 247041 248458 250387 253203 255919 257395 257640 257309 256412 254367 251262 248294 246584 246047 245956 246328 247974
54892 247974 251001 253939 255051 254278 253273 253544 255088 256839 257750 257321 255808 254240 253619 253722 253410 252515
54876 252515 252494 254438 257303 259267 260173 261151 262198 261946 260077 258331 258439 260284 262841 265720 268854 271775
54860 271775 274337 277451 282024 287747 293931 300871 309224 318475 327301 335128 342186 348334 353164 357035
54846 357035 360502 362650 361528 356647 349693 342336 334754 326983 320201 315364 311575 307158 301894 297066
54832 297066 293661 291587 290510 290350 290741 290787 289725 287650 285519 284455 284811 285772 286244 286219 286771 288610 291387
54815 291387 294668 298645 303398 308511 314152 321446 330641 339773 346616 351319 355594 359708 362073 361750
54801 361750 359599 356572 352565 347562 342411 337453 331583 323853 315242 307714 301940 296972 291904 286993
54787 286993 283064 280378 278268 275811 272872 270297 268673 267173 264509 260958 258265 257226 256585 255088
54773 255088 253447 253127 254033 254713 254313 253033 251020 248310 245875 245177 246237 247268 246792 245111 243169 240998
54757 240998 238232 235430 233770 233706 234863 237068 240401 244149 246873 248065 248879 250430 252009 252123 250991
54742 250991 250689 252448 254899 255844 255012 254114 254556 256148 257918 259180 259622 259262 258808 259364 261240 263403
54726 263403 264507 264189 263082 261993 261401 261453 262022 262880 264026 265717 268117 271157 274649 278100 280581 281628
54710 281628 282469 285437 291562 299354 306544 312392 317601 322653 327339 331710 336495 342406 349589 357717
54696 357717 366089 373736 380007 384963 388607 389977 387841 382407 375551 369117 363533 358189 352436 345826
54682 345826 338073 329513 321411 315264 311596 309563 307703 305072 301882 299207 298020 298360 299330 299787 299123
54667 299123 297745 296950 297938 300546 303247 304863 305996 308195 311999 316621 321517 327192 334041 341270 347758
54652 347758 353453 358983 364081 367287 367502 365256 362111 359139 356273 352765 347799 340838 332023 322376
54638 322376 313139 304685 296513 288708 282763 280154 280375 281349 281854 282456 283697 284489 283240 279933 276187
54623 276187 273561 272576 272952 273785 273750 272271 270616 270821 273173 275558 275718 273527 270583 268136 266048 263535
54607 263535 260410 257485 255845 255714 256151 256114 255596 255321 255527 255754 255830 256290 257515 259046 260068 260114 258998
54590 258998 256639 253398 250212 247902 246546 245819 245696 246526 248617 251830 255280 257422 257082 254767 252438
54575 252438 251607 252045 252643 252864 252785 252366 251574 250955 251218 252387 254062 256347 259568 263027 265020 264622 262871
54558 262871 261643 261725 262367 262431 261477 259870 258291 257185 256452 255605 254392 253298 253315 255099 258285 261631 263952
54541 263952 265093 265983 267546 269572 270861 270588 269296 268340 268545 269665 270939 271730 271559 270128 267764 265565
54525 265565 264478 264317 264144 263605 263205 263113 262633 261502 261021 262832 266682 270383 272110 271965 271141 270460 270200
54508 270200 270544 271416 272252 272566 272560 272780 273491 274824 277032 279833 281841 281585 279335 277195 277036 278717 280546
54491 280546 281125 280487 279749 279996 281471 283664 286020 288306 290210 291045 290504 289608 290135 292736 296106 298415
54475 298415 299232 299583 300374 301422 302162 302700 303647 304921 305229 303237 299317 295774 294927 296970 299914 301583
54459 301583 301433 300507 300077 300480 300958 300422 298556 296374 295364 295950 297070 297551 297497 297771 298316 297690 294494
54442 294494 288979 283157 279527 279524 282562 286363 288614 288687 287721 287076 287113 287476 287917 288431 289052 289946 291298 292629
54424 292629 292751 291205 289456 289758 292740 296884 300419 302846 304446 305258 305188 304409 302991 300770 298319 297506
54408 297506 300017 305351 311072 315096 317021 317289 316080 313640 311072 309934 310961 313525 316387 318727
54394 318727 320388 321369 321567 321224 321249 322410 324113 324745 323692 322360 322431 323595 323973 322595 320318 318197
54378 318197 316146 313772 311512 310020 309066 308029 307185 307469 308950 310389 310617 309719 308529 307456 306311
54363 306311 305038 304028 303666 303883 304300 304635 304862 305120 305691 306976 309220 312149 315006 317165 318659 320010
54347 320010 321597 323304 324781 325816 326377 326450 326099 325735 326083 327508 329354 330352 329999 329221 329303 330407 331698
54330 331698 332720 333797 335030 335783 335557 334629 333444 332147 331220 331577 333152 334212 333296 331282 330209 330431
54314 330431 330453 329486 328572 328836 330071 331680 333726 336290 338800 340911 343198 346077 348733 350078 350307 350573
54298 350573 351451 352509 353144 353001 351765 349378 346662 345205 346361 350319 355923 361238 364667 365881 365658
54283 365658 364987 364808 366246 369875 374328 376886 376369 374549 373663 373291 371030 365893 359689 354983 352648
54268 352648 351544 349733 345965 340812 336426 334482 334303 333707 331571 328669 326033 323732 321671 320494 320765
54253 320765 321787 322080 320972 319208 318027 317967 318582 319079 319096 318876 318819 319135 319866 320897 321778 322065 322058 322579 323597
54234 323597 323865 322741 321662 322639 325602 328516 330063 330909 332094 333400 333763 332358 328905 323962 319428
54219 319428 317652 319149 321923 323716 324247 324630 325493 326734 328382 330419 332083 332656 332818 334038 336401
54204 336401 338115 337554 334973 331833 329252 327731 327724 329515 332485 335039 335471 332999 328327 323512 320887
54189 320887 321444 324085 326749 328274 328955 329520 330270 331414 333458 336468 339275 340238 338914 336408 333939
54174 333939 331732 329578 327784 326913 326948 327352 327824 328517 329580 330834 331858 332125 331295 329676 328105 327010
54158 327010 325954 324615 323759 324372 326007 327009 326512 325392 324973 325530 326443 327062 326911 325608 323322 321077
54142 321077 320052 320554 321906 323157 323664 323208 321885 319880 317261 314106 310880 308433 307479 308192 310312
54127 310312 313276 316197 318089 318461 317649 316527 316018 316682 318271 319653 319695 318551 317743 318725 321559 324996
54111 324996 327483 328013 326526 323927 321426 319587 318170 316976 316325 316460 316939 317116 316984 317081 317600 318080 317965
54094 317965 317157 315883 314296 312565 311280 311282 312611 313853 313330 311228 309844 311151 314618 318046 319957
54079 319957 320349 319736 318807 318811 320759 323845 325828 325493 323830 322522 322388 323692 326609 330444 333379 334020
54063 334020 332584 329905 326256 322121 319189 319168 321988 326214 330818 335466 339483 341927 342736 342789 342788 342954
54047 342954 343685 345477 348147 351054 354119 357675 361195 363246 363085 361537 359881 358567 357434 356596 356588 357869
54031 357869 360328 362943 363910 361841 357286 352778 351021 352965 357415 362071 365065 366153 366642 367843 369599
54016 369599 370732 370798 370635 371048 371720 371959 372026 373020 375513 378782 381585 383531 385411 388077 391306 394285
54000 394285 397188 401413 407727 414827 420639 424681 428224 432356 436909 441404 446003 451140 456912 463333
53986 463333 470756 479733 490681 503524 517173 529524 538872 545501 551106 556580 561334 565123 569302
53973 569302 575359 582894 590139 596267 602291 609607 618185 626435 632587 636131 637915 638898 639219 638898 639032
53958 639032 641202 645457 649818 652288 652581 651358 648574 643632 636720 628968 621311 613883 606460 598873
53944 598873 590980 582815 574744 567051 559496 551869 544898 539807 536732 534124 530092 524088 517087 510457
53930 510457 504888 500154 495549 490594 485534 481184 478203 476546 475670 475115 474723 474301 473413 471797 469886
53915 469886 468511 467882 467186 465533 463072 460818 459518 459127 459317 459940 460856 461728 462317 462792 463716 465823 469557
53898 469557 474299 478225 479750 479297 478991 480434 483521 487668 493122 500185 507972 515101 521416 528079 536011
53883 536011 545186 555536 567526 581282 595691 609104 620956 632437 645385 660524 676833 692582
53871 692582 706760 719171 729440 736878 741669 745358 749414 753857 758089 762480 768003 774575 781157
53858 781157 787662 795453 805338 816206 826527 836372 846944 858697 871128 884131 898171 912862
53846 912862 926531 937928 947691 957362 967409 976968 985324 992795 1000106 1007700 1015954 1025388 1036044
53833 1036044 1047069 1057585 1067630 1077270 1084527 1085105 1075150 1054388 1026235 994920 962804 930310
53821 930310 897591 865538 835268 807299 781609 758158 736949 717729 700154 684266 670278
53810 670278 657756 645623 633274 621126 609604 598231 586491 575089 565331 557465 550575 544044
53798 544044 538011 532382 526641 520955 516286 512723 508866 503769 498591 495295 494247 494009 492930 490049
53784 490049 485176 479383 475072 474135 475895 477789 478055 476834 474757 471822 468044 464184 461259 459934 460519
53769 460519 462679 464919 465476 464372 463770 465558 469269 473005 475744 477819 479710 481506 483509 486383 490417
53754 490417 495228 500326 505481 510329 514115 516374 517819 520262 525395 533510 543373 553348 562575 571110
53740 571110 579390 587941 597297 607398 617015 624607 630154 635471 642103 649415 655512 659756 663558 668584
53726 668584 674789 680443 683722 684150 682814 681385 680764 680439 679010 675183 668419 659182 648982 639705 632237
53711 632237 625751 618777 610860 602660 594663 586631 578436 570551 563209 555786 547701 539547 532606 527490
53697 527490 523842 521119 518801 515831 510885 503853 496538 491178 488293 486354 483521 479460 475554 473597
53683 473597 474204 476235 477840 478172 477881 477798 477618 476470 474492 473042 473253 475061 477818 481060 484267 486560
53667 486560 487475 487733 488563 490293 492135 493283 493689 493784 493954 494466 495586 497634 500997 505929 512054 518301
53651 518301 523774 528644 533705 539121 544107 547881 550441 552351 554311 557021 560894 565579 570205 574355
53637 574355 578426 582899 587777 592946 598456 603959 608456 611302 613115 615031 617217 618772 619048 618437 617831
53622 617831 617876 618835 620547 622239 622887 622176 620873 619897 619189 617804 615062 611344 607766 605206 603665 602435
53606 602435 600912 599303 598423 598599 598939 598034 595458 592239 589676 588109 587254 587345 589117 592552 596419 599410
53590 599410 601174 601782 600984 598904 597023 597275 599944 603325 605747 607262 609038 611827 615495 619457 622970
53575 622970 625380 626639 627428 628440 629803 631551 634243 638537 644348 650838 657186 663134 669018 675437
53561 675437 682538 689371 694524 697900 701364 706976 714874 723475 731407 738489 745136 751753 758695 766047
53547 766047 773397 780431 787583 795330 802932 808957 813220 817199 822106 827418 831830 834937 837375 839901
53533 839901 842927 846488 850114 853029 854935 856226 857203 857640 857549 857639 858363 859033 858633 857088 854929 852150
53517 852150 848328 843591 838410 832528 825257 817117 810178 806142 804684 804087 803078 801651 800552 800442 801329
53502 801329 802451 802886 802509 802145 802640 804126 806424 809678 814011 818746 822666 825338 827921 832234 838917
53487 838917 846555 852958 857410 861351 866576 873191 880146 887597 897482 911060 926819 942013 955950
53474 955950 970494 987286 1005800 1024771 1044403 1065907 1089390 1113555 1137623 1162288 1188215
53463 1188215 1214631 1240439 1266200 1293811 1324328 1357217 1391893 1428754 1468017 1508569 1549213
53452 1549213 1590477 1633927 1679712 1726025 1771302 1815943 1861250 1907541 1954146 2000683 2047238
53441 2047238 2093341 2137745 2179698 2219961 2260066 2300697 2341174 2380551 2418828 2456715 2494323
53430 2494323 2530740 2565287 2598673 2632033 2664942 2695410 2722264 2746801 2771477 2797519 2824483
53419 2824483 2851504 2877873 2902493 2923874 2941104 2954247 2963582 2969005 2970527 2968786 2964506 2957621
53407 2957621 2947315 2932905 2914508 2892979 2869439 2844821 2819644 2793903 2767048 2738159 2706537
53396 2706537 2672395 2636777 2600695 2564647 2529139 2494941 2462126 2429277 2394724 2358639 2323150
53385 2323150 2290254 2260420 2233309 2208895 2187346 2168604 2152764 2140334 2131541 2125694 2121771 2119225
53373 2119225 2117906 2117777 2119314 2123711 2131977 2144103 2159532 2177884 2198573 2220371 2242431 2265482
53361 2265482 2291062 2319814 2351483 2386294 2425028 2467668 2513261 2561517 2613335 2669189 2728020
53350 2728020 2788530 2850835 2916103 2985059 3057532 3132883 3210293 3289186 3370181 3455123 3545281
53339 3545281 3639823 3736817 3835264 3935162 4035871 4135840 4234340 4332330 4430960 4529854 4627484
53328 4627484 4722697 4815162 4904600 4990421 5072250 5150324 5224960 5295633 5360655 5417895 5466029
53317 5466029 5505218 5536614 5561198 5579167 5590186 5593822 5589590 5576938 5555436 5524772 5484377 5433442
53305 5433442 5371778 5300602 5222058 5137951 5049410 4957761 4864913 4772216 4679283 4584876 4489140
53294 4489140 4394248 4302345 4213347 4125456 4037653 3950916 3866842 3785826 3707068 3629868 3554193
53283 3554193 3480061 3407067 3334870 3263884 3195183 3129739 3067891 3009501 2954461 2902962 2855298
53272 2855298 2811505 2771217 2733757 2698284 2663923 2629977 2596143 2562614 2530072 2499552 2471882
53261 2471882 2446867 2423319 2400586 2380010 2363996 2353229 2345534 2338222 2331088 2326267 2325487 2328516 2334240
53248 2334240 2342089 2351946 2363642 2377388 2394172 2414866 2439165 2466080 2495279 2527214 2561905 2598356
53236 2598356 2635473 2673153 2712192 2753332 2796445 2840423 2883870 2926221 2968125 3010265 3051777
53225 3051777 3090420 3124504 3154043 3179822 3202084 3220716 3236033 3248312 3256723 3259581 3255821 3245766
53213 3245766 3230517 3211163 3188459 3162540 3132962 3099707 3063945 3026811 2987486 2943892 2895735
53202 2895735 2845465 2795301 2744633 2691674 2636668 2581709 2527888 2474529 2421228 2368820 2317779
53191 2317779 2267210 2216332 2165786 2116510 2068166 2019708 1970934 1922544 1874963 1827904 1780980
53180 1780980 1734244 1688310 1644281 1603225 1565326 1529837 1496070 1463922 1433240 1403528 1374921
53169 1374921 1348681 1325811 1305523 1285779 1265004 1242666 1218862 1194211 1169647 1145331 1120190
53158 1120190 1093528 1066570 1041149 1017234 993327 969202 946552 926530 908214 890249 872598
53147 872598 855707 839102 822011 804721 788262 773207 759632 747765 737695 728715 719752 710278
53135 710278 700145 688941 676449 663532 651709 641760 633374 626061 619643 613803 607935 601782 595754
53122 595754 590319 585412 580634 575755 570831 566054 561612 557635 554199 551387 549208 547349 545325 543106
53108 543106 541368 540707 540723 540204 538259 535174 532250 530857 531260 532162 531802 529802 527564 526497 526372 525889
53092 525889 524286 521617 518053 514081 511160 510880 513139 516135 518467 520287 522038 523144 522845 521570 520402
53077 520402 519477 517897 515311 512732 511468 511673 512388 512855 513358 514599 516480 517984 518349 517838 516944 515332
53061 515332 512306 508032 503471 499304 495955 494623 496731 501644 506155 507467 506061 504654 504939 506503
53047 506503 508401 510251 511701 512174 511644 510709 509515 507501 504631 501977 500333 499045 497081 494888 494151
53032 494151 495665 498250 500006 500146 499219 497851 495815 492611 488765 486054 486058 488523 491613 493819 495143
53017 495143 496183 496626 495407 492276 488553 485973 485070 484969 484587 483719 482963 482911 483669 485059 486918 488941
53001 488941 490395 490456 489065 487261 486339 486621 487224 487092 486136 485240 485229 485987 486678 486675 486103 485464 484959 484352 483454
52982 483454 482602 482534 483729 485735 487285 487415 486552 486073 486491 486594 485046 482555 481487 483105 486044 488027
52966 488027 488412 488272 488495 488829 488759 488308 487618 486521 485103 484174 484449 485496 486108 485671 484651 483762 483308 483540
52948 483540 484936 487544 490413 492377 493325 494138 495374 496601 497228 497402 497603 497726 497111 495461 493417 492192
52932 492192 492730 494911 497328 498098 496374 493048 489793 487593 486498 486321 486913 487959 489305 491473 495038
52917 495038 499438 503275 506071 508787 512047 514726 515178 513404 511210 510539 512317 516417 521718 526301 528665
52902 528665 529056 529163 530479 533416 537733 542766 547189 549551 549529 548032 545845 542902 539169 535313 531852
52887 531852 528431 524741 521552 519798 518993 517569 514861 511904 510111 509834 510378 510770 510254 508513 505886
52872 505886 503135 500813 498938 497259 495479 493215 490263 487130 484886 484098 484199 484170 483530 482360 480711
52857 480711 478619 476628 475667 476110 477270 478088 478232 478317 479063 480355 481212 480761 479200 477615 476794 476528 476308
52840 476308 476340 477255 478887 480063 479906 478803 477690 476838 475904 474811 473829 472956 472009 471450 472310 474878 478074
52823 478074 480576 482144 483323 484330 484959 485364 486111 487225 487782 486809 484365 481652 480258 481317 484893
52808 484893 489840 494511 497977 500615 503385 506560 509252 510185 508928 506415 504187 502979 502106 500325 497250
52793 497250 493707 490849 489285 489023 489703 490546 490416 488466 484748 479991 474777 469219 463520 458478 455024
52778 455024 453180 451856 449959 447572 445651 444634 443844 442407 440267 438021 436269 435590 436703 439941 444747
52763 444747 450144 455339 459310 460465 457994 453475 449753 447892 446406 443908 441139 439553 439189 439299 440126
52748 440126 442319 444999 446254 445890 446179 449130 454130 459090 463056 466553 469746 471545 470898 468246 465087
52733 465087 462285 459336 455435 450872 446934 444550 443492 442985 442616 442358 442153 441905 441665 441426 440996 440380
52717 440380 440045 440412 441377 442717 444522 446698 448484 449318 449827 450980 452339 452284 450151 447121 444686 443300
52701 443300 442990 444123 446580 449018 450107 450130 450368 451190 451839 451963 452141 452609 452590 451594 450538 450688 451852
52684 451852 452598 452232 451718 452338 454159 456459 459156 462887 467606 472054 475215 477747 481159 485764 490263
52669 490263 493507 495906 498601 501817 504728 506736 508118 509252 509835 509357 508111 507085 506744 506306 504617
52654 504617 501557 498213 495676 494042 492650 490865 488440 485475 482405 479872 478289 477632 477675 478098 478221
52639 478221 477256 475345 473900 474253 476162 478212 479345 479338 478258 476567 475662 477043 480491 483901 485348 484612
52623 484612 482657 480667 480062 482200 486950 492171 495586 496818 496876 496243 494510 491575 488116 484858 482203
52608 482203 480605 480515 481778 483657 485556 487223 488369 488783 488867 489331 490191 490712 490580 490501 491298 492882 494536
52591 494536 495863 497108 498785 501250 504382 507425 509370 509757 508992 507753 506339 504848 503743 503786 505198
52576 505198 506999 507421 505246 500991 496687 494313 494326 495804 497746 499826 501950 503641 504236 503450 501499
52561 501499 498840 496071 493914 492927 493091 493836 494525 494836 494740 494400 494165 494411 495154 496048 497113 499286 503482
52544 503482 508902 513051 514195 513319 512762 513217 513333 512377 511853 513560 517060 520196 521620 521757 521601 521741
52528 521741 522543 524249 526584 528924 530935 532472 533019 532269 531333 532167 535156 538184 538934 537557 536264 536626
52512 536626 538033 538662 537291 534209 530928 529096 529300 530756 532238 533116 533393 533180 532682 532404 532694 533049
52496 533049 532477 530701 528520 526753 525321 523688 521867 520457 519850 519881 520243 520799 521244 520912 519320 516816
52480 516816 514347 512609 511686 511418 511613 511862 511684 511185 511129 511990 513301 514485 515855 517979 520295 521418
52464 521418 521069 520745 521919 524274 526312 527150 526953 526108 524990 524489 525685 528573 531778 534046 535658 537855
52448 537855 541140 544732 547730 550356 553661 558143 562992 566814 568844 569174 567967 565083 560745 556082
52434 556082 552324 549525 546653 543133 539736 537626 536933 536747 536287 535584 535046 534826 534801 534891 535248 536248 538221
52417 538221 540939 543395 544541 544373 543994 544395 545498 546554 547089 547200 547346 548362 551333 556715 563564 570081
52401 570081 574984 578131 580135 581989 584754 588630 592101 592893 590232 585668 581312 577822 574464 570426
52387 570426 565474 559900 554633 551093 550133 551066 552136 551976 550445 548382 546825 546086 545273 543225 540250
52372 540250 538187 538022 538190 536339 532341 528405 526484 526889 529392 534087 540439 546651 550982 553267 554611
52357 554611 556046 557972 560465 563580 567505 572591 578974 586156 593441 600841 608963 617953 627293 636757
52343 636757 646666 656844 666286 674471 682144 689940 696803 700681 700450 696448 689584 680880 671748 663704
52329 663704 657500 652947 649599 647202 645469 643881 641886 639252 636359 634177 633600 634570 636245 638210 641024
52314 641024 645269 650734 657006 664092 671662 678429 683472 687900 694033 702779 712704 721636 728255 732179
52300 732179 733768 734381 735825 738747 742040 744309 745443 746414 748154 751228 756030 762418 769315 775388 780154
52285 780154 784097 787849 791959 797444 805814 817877 832645 847860 861818 874633 887737 902362
52273 902362 918665 936147 954508 973908 994698 1017257 1042015 1069223 1098575 1129236 1160395
52262 1160395 1191776 1223666 1256585 1290857 1326294 1362249 1398065 1433424 1468190 1502126 1535020
52251 1535020 1566970 1598162 1628376 1657070 1684102 1710035 1735505 1760321 1783373 1803403 1819994
52240 1819994 1834015 1847197 1861029 1875800 1890544 1903846 1914676 1922687 1928096 1931424 1933132 1933158 1930831
52227 1930831 1925505 1917592 1908945 1901952 1897957 1896527 1896233 1895917 1895150 1893993 1893052 1893716 1897569 1905107 1915394
52212 1915394 1927274 1940606 1956068 1974146 1994729 2017312 2041150 2065354 2089304 2112886 2136090
52201 2136090 2158542 2179783 2199850 2219333 2238912 2258956 2279210 2298606 2315800 2330331 2343032
52190 2343032 2355051 2366844 2378320 2389229 2398749 2405306 2407809 2406857 2403963 2399744 2393659 2385294 2375120
52177 2375120 2364205 2354020 2346198 2341309 2337808 2333315 2327129 2320601 2314992 2310104 2305203 2300044 2294698
52164 2294698 2289638 2286567 2287675 2293089 2300062 2305711 2309698 2313310 2317059 2320730 2325008 2331277 2339792 2349425
52150 2349425 2359377 2370000 2381817 2394788 2408816 2424008 2440046 2455983 2470943 2484499 2496392
52139 2496392 2506642 2515952 2525117 2533884 2541374 2547950 2555535 2565281 2575709 2584056 2589062 2591759 2593957
52126 2593957 2596708 2599915 2602587 2603520 2602430 2600325 2598136 2595168 2589739 2581384 2571504 2561539 2551358 2540047
52112 2540047 2527589 2514918 2502674 2490762 2479131 2468252 2458688 2450701 2444442 2439962 2436853 2434447
52100 2434447 2432733 2432642 2434941 2439120 2443764 2447766 2450779 2452783 2453855 2454227 2453936 2452435 2449163 2444590 2440003
52085 2440003 2436066 2432279 2428229 2424753 2423251 2424218 2426951 2430371 2433573 2435936 2437605 2439799 2443872 2449898
52071 2449898 2456945 2465017 2475876 2491241 2510666 2532084 2554293 2578090 2604820 2634728 2667362 2702967
52059 2702967 2742499 2786171 2832673 2880125 2927426 2974386 3020925 3066480 3109992 3150171 3186080
52048 3186080 3217738 3245929 3270998 3292134 3308334 3319840 3327944 3333490 3336473 3337237 3337071 3336956 3336296
52035 3336296 3333729 3328960 3323114 3317383 3311896 3305993 3299124 3291320 3283063 3274768 3266184 3256410 3244801 3231933
52021 3231933 3219405 3208651 3200059 3193175 3187525 3183394 3182053 3185031 3192681 3203546 3215675 3228577 3243308
52008 3243308 3260493 3279008 3297032 3313829 3329920 3346044 3362709 3380341 3398663 3415841 3429416
51997 3429416 3438726 3445595 3451888 3456947 3458313 3454581 3446555 3435791 3423182 3409149 3393969 3377182 3357409
51984 3357409 3333699 3306744 3278161 3248870 3218690 3187141 3153967 3119151 3083190 3047247 3012384
51973 3012384 2978761 2946277 2915670 2887942 2862677 2838216 2813987 2791640 2773017 2757695 2743506
51962 2743506 2728976 2714134 2698977 2682353 2663095 2641700 2620075 2599496 2579342 2558157 2535546
51951 2535546 2512408 2489287 2465336 2439385 2411316 2381532 2349581 2314578 2276945 2238491 2200324
51940 2200324 2161710 2121537 2079966 2037918 1995794 1953625 1911847 1870909 1830524 1790380 1751355
51929 1751355 1715047 1682111 1651931 1623918 1598206 1574881 1553272 1532375 1511431 1490043 1468292
51918 1468292 1446969 1427105 1408881 1391382 1373620 1355426 1337095 1318648 1299914 1281189 1263433
51907 1263433 1247681 1234346 1223175 1213944 1207038 1202946 1201060 1199583 1197277 1195050 1195208 1199244 1206759
51894 1206759 1216147 1225450 1232800 1237347 1240131 1242991 1245968 1246593 1242657 1235142 1227490 1222310 1219684 1218518
51880 1218518 1218362 1219494 1222090 1226116 1231772 1239345 1248595 1258704 1268937 1278992 1288568 1296963 1303425
51867 1303425 1307599 1309163 1307210 1300644 1289377 1274563 1257387 1238138 1216865 1194401 1172021 1150358
51855 1150358 1129281 1108721 1089013 1070567 1053824 1039398 1027603 1017969 1010039 1004579 1002968 1005196
51843 1005196 1009546 1014736 1021338 1030453 1042101 1056052 1073359 1095374 1121273 1147985 1172998 1196091
51831 1196091 1217611 1235889 1247368 1249231 1241378 1225948 1205483 1181720 1155817 1129236 1103932 1081393
51819 1081393 1061629 1043501 1026216 1010274 996926 987023 980666 977572 977235 978744 980977 983322 986003
51806 986003 989428 993258 996336 997592 996850 994708 991778 988251 984183 979971 976230 973066 969594 964439
51792 964439 957009 948400 941033 937178 937443 940378 943585 945487 946265 947000 948010 948349 946918 943515 938474
51777 938474 931921 924200 916647 910794 906534 902003 895804 888594 881995 876681 872379 869167 867638 867888
51763 867888 869259 871200 873533 875653 876241 874225 869656 863398 856425 849728 844395 841155 839827 839424 838854
51748 838854 837624 836183 835721 837414 841594 847577 854013 859181 861324 859572 854922 849884 846676 845735 845856
51733 845856 845412 843303 839237 833588 827040 820266 813924 808731 805050 802334 799389 795462 790843 786331
51719 786331 782409 779186 776871 776000 777178 780506 785115 789463 792512 794598 796779 799537 802714 806588
51705 806588 811998 819056 826581 833479 840154 847981 857824 869557 882486 895470 906956 915695 921449
51692 921449 924525 924895 922423 917681 911734 905026 897188 888098 878465 869227 861003 854451 850515 849669 851171
51677 851171 853605 856246 859622 864788 872382 882390 894343 907279 919675 930068 938177 945022 951514
51664 951514 957182 961033 963572 966929 972288 977799 979932 976868 969951 961767 953483 944512 934437 924550
51650 924550 916996 912443 909050 904055 896189 886320 876277 867825 862386 860380 860487 860724 860853 862702 867311
51635 867311 872893 876842 878902 880781 883137 884733 884609 883455 882355 881535 880895 880504 879796 877362 872505
51620 872505 866332 860505 855542 851152 847489 844981 843303 841675 840177 839880 841642 845584 851809 860692
51606 860692 871997 884351 896266 907502 918906 930921 942609 952284 958746 961623 960727 955737 946897
51593 946897 935661 924090 913570 904399 896446 889796 884915 882704 884093 888706 893931 896337 894448
51580 894448 889436 882980 875574 867310 858896 850733 841981 831993 822028 814037 808138 802814 797485 793220
51566 793220 790682 788913 786794 784405 782223 780013 777277 773978 770222 766065 762180 759669 758532 757407
51552 757407 755671 754582 755159 756150 755810 754831 755504 758343 761646 764382 767312 770743 773404 774764 776773
51537 776773 781729 789468 798184 807261 817755 830401 844571 859170 873406 886539 897727 906348
51525 906348 911982 914191 912939 909157 904370 899979 897362 898032 902463 908920 914747 919386 925382 936060
51511 936060 952678 973969 997692 1022337 1047890 1075332 1105142 1136397 1167918 1199928 1233509
51500 1233509 1268341 1302377 1334366 1365581 1398167 1432729 1468602 1505649 1544298 1583956 1622519
51489 1622519 1657421 1686106 1705569 1712868 1706962 1689495 1663178 1629746 1589876 1544567 1495735 1445345
51477 1445345 1394513 1343854 1294421 1247787 1205071 1166445 1131941 1102288 1078098 1058367 1040700
51466 1040700 1023341 1006275 990081 974711 960091 946936 935770 925589 914705 902822 891191
51455 891191 880759 871301 862506 854751 848334 842894 838194 834661 832428 830436 827344 823028 818502 814576
51441 814576 811255 808398 806342 805698 806820 809523 813123 816861 820520 824486 828869 832701 834574 834253 833231
51426 833231 833272 834528 835439 834499 831712 828046 823832 818390 811345 803626 796512 790077 783309 775729 768043
51411 768043 760945 753986 746336 738215 730872 725145 720610 716283 711679 706921 702203 697656 693663 690796
51397 690796 689134 687995 686794 686059 686933 689627 692999 696095 699416 703947 709531 715301 721511 729548 739798
51382 739798 750788 761272 772121 785041 800044 815521 830414 844885 858725 870547 879222 885087
51370 885087 888898 890462 889379 886628 884058 882130 879184 873484 865402 856975 849682 843166 836049 827500
51356 827500 817993 808879 801387 795843 791699 788289 785536 783921 784003 786150 790410 796203 802251 807473 812211
51341 812211 817981 825586 833916 841289 847778 855298 865170 876318 886593 895542 905060 917210 932033
51328 932033 947921 963656 979499 996478 1015422 1036951 1061777 1090467 1123230 1160371 1202561
51317 1202561 1249973 1301397 1355169 1411088 1470427 1533623 1598753 1662758 1723122 1777349 1821663
51306 1821663 1851965 1866420 1866059 1852629 1826942 1789841 1743704 1691810 1636399 1578032 1516797 1453623
51294 1453623 1390394 1329138 1271039 1216003 1163263 1112707 1065549 1023491 987387 956923 931343
51283 931343 909984 892127 876828 863093 850059 837096 824067 811558 800432 791020 783025 776241
51271 776241 770783 766294 761498 755368 748562 742898 739218 736421 732915 728397 723721 719507 715612 711724
51257 711724 707764 703736 699800 696520 694390 692971 691120 688384 685760 684740 685957 688829 692101 694547
51243 694547 695686 696129 696791 697619 697703 696946 696815 698736 702295 705786 708098 709338 710011 710603 711811 714183
51227 714183 717276 719841 721019 720990 720540 720521 721598 723836 726459 728563 730054 731426 732856 734205 735705
51212 735705 737719 739879 741404 742393 743845 746153 748419 749688 750095 750481 751557 753740 756927 759987 761350
51197 761350 760662 759168 757976 756733 754609 751711 748657 745458 741804 737939 734227 730302 725777 721523
51183 721523 718998 718229 717481 715265 711872 708692 706770 706395 707319 708714 709317 708332 706264 704589 704507 706020
51167 706020 708070 709464 709809 709722 710103 711151 712062 711718 709663 706435 703097 700508 699016 698618 699118 700021
51151 700021 700592 700369 699669 699449 700710 703952 708858 714265 718896 722605 726576 731778 737511 742160 745114
51136 745114 747153 749201 751700 755139 759925 765326 769592 771687 772203 772211 772059 771698 771242 770572 769264 767533
51120 767533 766389 766106 765424 763210 760062 757237 754655 751213 746722 742398 739575 738781 739782 741630 742958
51105 742958 743154 743097 743923 745395 746378 746558 746703 747433 748777 750798 753561 756502 758813 760604 762889 766343
51089 766343 770631 774699 777033 776186 772200 767255 763789 762122 761060 760347 760848 762328 762958 761688 759688
51074 759688 758684 758914 759373 759093 757627 755264 753202 752531 752748 752472 751923 753065 756484 759842 760799 760139
51058 760139 760356 762177 764320 766165 768602 772102 775607 777925 779210 780510 782583 785518 789004 792639
51044 792639 796373 800836 806781 813963 820908 826098 829424 832343 836512 842192 848116 853025 857009 860861
51030 860861 864551 867268 868985 870758 873074 874922 875273 874606 874097 873923 873405 872414 871630 871592 872308 873760 876010
51013 876010 878815 881682 884342 886823 889300 892310 896869 903803 912954 923350 934053 944704 955671
51000 955671 967855 981868 997214 1013015 1029712 1048833 1070454 1092091 1111248 1127999 1143704
50989 1143704 1158278 1170720 1181941 1194794 1210814 1228408 1244772 1258470 1269794 1279781 1289164 1297202
50977 1297202 1301288 1299043 1291233 1281498 1272790 1265093 1256714 1246042 1231410 1211300 1186329 1159945 1135628
50964 1135628 1114146 1094776 1078113 1065782 1057883 1052655 1048705 1046021 1044698 1044291 1044970 1047945 1053968
50951 1053968 1062295 1071735 1081893 1092772 1103992 1115218 1126871 1139603 1153373 1167704 1182645 1198881
50939 1198881 1216990 1237097 1259036 1282302 1305850 1328530 1349920 1370433 1390603 1410689 1430979
50928 1430979 1451971 1473829 1495855 1516827 1535883 1553089 1569462 1586588 1605829 1627373 1650073
50917 1650073 1672603 1694843 1717886 1742749 1769469 1797559 1826835 1857533 1890041 1925117 1964197
50906 1964197 2008909 2059997 2116966 2178927 2245647 2317711 2395697 2479324 2567438 2658950 2753687
50895 2753687 2851970 2953182 3055110 3155109 3251706 3344677 3433931 3519027 3599750 3676179 3747785
50884 3747785 3813175 3871472 3923684 3972014 4017923 4061466 4102576 4142129 4180953 4217851 4249339
50873 4249339 4271965 4284817 4289429 4287411 4278914 4263597 4241988 4214696 4180673 4137649 4084549 4022302
50861 4022302 3951778 3872204 3782721 3684687 3581155 3474448 3365525 3255555 3146630 3040480
50851 3040480 2937637 2838543 2744651 2657684 2578280 2506002 2440218 2380249 2324993 2273268 2224669
50840 2224669 2179611 2138488 2101131 2067079 2036061 2008095 1983243 1961260 1941436 1923101 1906514
50829 1906514 1892908 1883198 1876760 1871880 1867371 1863478 1861422 1862425 1866905 1873937 1881554 1888219 1894238 1901359
50815 1901359 1910980 1923246 1937821 1954640 1973537 1993828 2015004 2037626 2062994 2091937 2124169
50804 2124169 2158776 2195311 2234577 2278230 2327137 2380292 2436234 2495694 2561686 2636286 2718434
50793 2718434 2806130 2900025 3003204 3117697 3242919 3377841 3522916 3678926 3845270 4020763
50783 4020763 4205454 4400101 4603869 4813728 5026540 5241048 5457399 5675145 5891962
50774 5891962 6103931 6306661 6496332 6670187 6826498 6964436 7084236 7187374 7276127 7352548
50764 7352548 7417816 7472765 7519131 7560086 7599276 7639250 7680862 7724038 7768596 7813893 7857722
50753 7857722 7895845 7922717 7932755 7921389 7885527 7823376 7733967 7616987 7472940 7303034 7108704
50742 7108704 6891895 6656278 6407683 6152559 5896213 5643014 5397561 5164095 4944604
50733 4944604 4738863 4546965 4370822 4212460 4071710 3946572 3835298 3737211 3651873 3578556
50723 3578556 3516514 3464866 3421952 3385416 3353199 3324083 3297025 3270424 3242572 3212941 3182718
50712 3182718 3153662 3126261 3099273 3071236 3041891 3011521 2979367 2944013 2905469 2865599 2825825
50701 2825825 2785516 2743678 2701337 2660901 2623485 2588144 2553750 2520548 2489731 2462502 2439921
50690 2439921 2422860 2411479 2405027 2402517 2403497 2408134 2416825 2429835 2447281 2469579 2497860 2533433
50678 2533433 2576476 2625781 2680266 2740166 2806154 2877988 2955093 3037928 3127482 3223507 3324481
50667 3324481 3429281 3537525 3648104 3758897 3868616 3977728 4086749 4194616 4299597
50658 4299597 4400842 4497888 4589308 4672914 4746913 4809928 4860454 4897531 4921885 4935493 4940221
50647 4940221 4937991 4932086 4926709 4924564 4925792 4929965 4938320 4953090 4975022 5002397 5032227 5061502 5087132
50634 5087132 5105616 5113467 5107757 5085927 5045490 4984722 4903923 4805766 4694267 4573569 4447587
50623 4447587 4320162 4194953 4075060 3962854 3860007 3767444 3685386 3613808 3553081 3504144
50613 3504144 3468045 3445126 3434430 3433957 3441967 3458118 3482926 3515951 3555081 3597868 3642826 3688744
50601 3688744 3733509 3774861 3812323 3847345 3881356 3914522 3946700 3978689 4011784 4046362 4081425
50590 4081425 4115563 4148431 4181384 4216472 4254319 4293254 4331246 4368702 4408528 4453370 4503662
50579 4503662 4558611 4618038 4682433 4751657 4824294 4898066 4970683 5040815 5108624 5174789 5238523
50568 5238523 5297107 5348055 5391340 5428929 5462495 5492168 5516823 5534160 5540101 5529246 5497351
50557 5497351 5444298 5374979 5297235 5218438 5143369 5074477 5013053 4959560 4913546 4874539 4843058
50546 4843058 4819550 4801985 4785676 4766235 4741837 4711884 4674475 4626484 4565837 4492686 4408626
50535 4408626 4315564 4215091 4108053 3994879 3877094 3758175 3642035 3530776 3424767 3324614
50525 3324614 3231817 3147354 3070691 3000695 2936869 2879392 2828507 2784134 2745677 2712147 2682979
50514 2682979 2658668 2639984 2626568 2617002 2610326 2606661 2606185 2608347 2612605 2619422 2630127 2646098 2668050
50501 2668050 2695408 2726138 2758009 2790653 2826017 2866370 2912203 2962407 3016102 3073718 3136329
50490 3136329 3204159 3275850 3349351 3423674 3499281 3576187 3652380 3725488 3795950 3867029 3941280
50479 3941280 4018526 4098170 4181891 4272465 4370874 4476467 4589556 4711897 4844387 4986034
50469 4986034 5135894 5294574 5462912 5640301 5825548 6018619 6219933 6427935 6638658
50460 6638658 6848240 7055042 7258626 7457200 7646821 7822864 7981340 8118762 8231879
50451 8231879 8318506 8378142 8410765 8415142 8389345 8333267 8249713 8142561 8014825 7869522 7711672
50440 7711672 7547868 7383720 7222910 7069121 6927565 6803442 6699394 6615437 6551142 6506643
50430 6506643 6481138 6471476 6473083 6481902 6494420 6505679 6508144 6493185 6453746 6385728 6287803 6161022
50418 6161022 6008709 5835820 5647620 5448831 5243866 5037179 4832841 4633805 4441897
50409 4441897 4258343 4084051 3919520 3765007 3620969 3488207 3367485 3258993 3162029 3075092
50399 3075092 2996504 2925331 2861866 2807079 2761535 2724681 2694923 2670267 2649207 2631438 2617694
50388 2617694 2608664 2604203 2603730 2607101 2614593 2626198 2641435 2659810 2680867 2703690 2726987 2749763
50376 2749763 2771309 2790368 2805354 2816132 2824901 2834254 2844720 2855207 2865643 2877815 2893250 2911562
50364 2911562 2931765 2954358 2980987 3012429 3048081 3087420 3130952 3179439 3233002 3291462 3354996
50353 3354996 3424036 3499025 3580735 3670189 3767513 3871035 3978252 4087547 4198201 4308806
50343 4308806 4416820 4520268 4619054 4713530 4801940 4880239 4944767 4994613 5031139 5055579 5067423
50332 5067423 5064786 5045751 5009229 4954933 4883272 4795842 4696074 4588738 4478173 4367080 4257425
50321 4257425 4152109 4054785 3967818 3891437 3825500 3771297 3730623 3703485 3687713 3680649 3680069 3683287
50309 3683287 3686570 3686121 3679161 3663648 3637676 3599831 3549804 3488192 3416062 3335119 3247769 3156298
50297 3156298 3062287 2967366 2873973 2784351 2698929 2616613 2536790 2460225 2387896 2319863 2255837
50286 2255837 2196252 2142113 2093994 2051556 2013914 1980188 1949900 1923176 1900622 1882889 1870336
50275 1870336 1862964 1860400 1861893 1866462 1873202 1881609 1891911 1905040 1921672 1940961 1960849 1980308
50263 1980308 2000778 2024491 2051672 2080262 2107972 2133341 2154844 2170620 2179699 2182429 2179269 2170458
50251 2170458 2157576 2144041 2132708 2123721 2115841 2109069 2104559 2102487 2101547 2100623 2099729 2099257 2099395 2100535
50237 2100535 2103302 2107914 2114253 2122686 2133989 2148223 2164393 2181473 2199139 2217300 2235666 2254178
50225 2254178 2273481 2294668 2318748 2346244 2376716 2408857 2441755 2475883 2511519 2545659 2571623
50214 2571623 2583003 2578054 2560042 2534006 2503973 2472629 2441952 2413200 2386592 2361724 2338478
50203 2338478 2317325 2298694 2282343 2267675 2254538 2243293 2234009 2226167 2219404 2214005 2210173 2207451
50191 2207451 2205624 2205715 2208928 2214706 2221079 2227245 2234746 2245518 2259682 2276009 2293949 2314271 2337957
50178 2337957 2365123 2394873 2425677 2456111 2485919 2516420 2549340 2585046 2622123 2658590 2693054
50167 2693054 2724583 2752017 2774165 2790903 2803696 2814608 2824755 2833874 2841141 2845732 2846482 2841815
50155 2841815 2830636 2812830 2788290 2756019 2715195 2666917 2613909 2558497 2501819 2445010 2389985
50144 2389985 2338557 2291612 2249579 2212859 2181182 2153179 2127179 2101896 2075906 2047159 2013935
50133 2013935 1976156 1935422 1894099 1854579 1818579 1786235 1756130 1726802 1698069 1670545 1644463
50122 1644463 1619685 1596416 1575044 1555404 1536932 1519467 1503313 1488559 1474854 1461820 1449241
50111 1449241 1436980 1425199 1414506 1405449 1397939 1391604 1386381 1382228 1378620 1375255 1373166 1374118 1378544
50098 1378544 1384815 1391022 1396908 1403549 1411698 1421210 1431941 1444353 1458784 1474577 1490529 1506151
50086 1506151 1521951 1538384 1555074 1571443 1587533 1603423 1618143 1630170 1639100 1646073 1652460 1659062
50074 1659062 1666837 1677138 1690457 1705758 1722037 1740020 1761524 1787654 1818481 1853944 1893974
50063 1893974 1937889 1984652 2033766 2085315 2139474 2196763 2258452 2325773 2398818 2476919 2559591
50052 2559591 2645920 2733406 2819081 2902035 2983505 3064157 3142671 3217572 3289008 3357673 3423012
50041 3423012 3483579 3538303 3585957 3623755 3647841 3655504 3646313 3621272 3581725 3529241 3465824 3393876
50029 3393876 3316227 3236181 3156977 3080855 3008803 2941187 2878357 2820618 2768190 2721601 2681820
50018 2681820 2649355 2622987 2599713 2576351 2551249 2524541 2497151 2469962 2443664 2418583 2394392
50007 2394392 2370500 2347006 2324668 2303655 2283001 2261825 2240405 2219277 2197974 2175775 2153322
49996 2153322 2132201 2113045 2095321 2079029 2065163 2054002 2044264 2034741 2025778 2018468 2013429 2011283
49984 2011283 2013268 2019918 2029601 2039700 2049131 2058733 2069441 2081314 2094384 2109036 2124906 2140319
49972 2140319 2153615 2164615 2174142 2182388 2188381 2191090 2190618 2188116 2184783 2181075 2176802 2171601 2165108 2156924
49958 2156924 2147009 2136190 2125821 2116626 2108316 2100517 2093437 2086867 2079165 2068486 2055251 2042457 2033025
49945 2033025 2027432 2024385 2023163 2024414 2028929 2036732 2047854 2063422 2085257 2114334 2150073 2191228
49933 2191228 2237081 2287370 2341228 2396734 2451687 2504461 2553860 2598575 2637446 2670352 2698426
49922 2698426 2723058 2744777 2763032 2776459 2782829 2778988 2761756 2729479 2682705 2623300 2553379 2475436
49910 2475436 2392974 2309960 2229303 2152243 2079319 2011240 1948513 1890905 1837966 1789710 1746198
49899 1746198 1706820 1670703 1637568 1607522 1580300 1555703 1534639 1518655 1508161 1501976 1498731 1497725
49887 1497725 1498258 1499513 1501885 1507153 1516120 1526858 1536542 1544416 1551557 1558123 1562572 1563898 1563253 1562562
49873 1562562 1562358 1561531 1558416 1551523 1539856 1523421 1503290 1480727 1456412 1430848 1405119 1380687
49861 1380687 1358440 1338386 1320264 1304137 1290388 1279419 1271456 1266451 1264032 1263576 1264383 1265821 1267315
49848 1267315 1268272 1268214 1267313 1266862 1268750 1274049 1282189 1291762 1301921 1312656 1324035 1335954 1348592 1362370
49834 1362370 1377158 1392098 1406531 1420577 1434479 1447792 1459557 1468716 1474058 1474493 1470236 1463273
49822 1463273 1455689 1447597 1437483 1424508 1409522 1393597 1376461 1357036 1335121 1312114 1290211 1271096
49810 1271096 1255024 1240926 1227648 1215231 1204767 1197014 1191713 1188337 1186746 1186708 1187537 1188993 1191940
49797 1191940 1197172 1203911 1210542 1216798 1224061 1233238 1243445 1253574 1264359 1277828 1294824 1313808
49785 1313808 1332229 1348498 1362494 1374568 1384523 1391652 1395627 1397120 1397279 1396583 1394462 1390189 1383900
49772 1383900 1376488 1368656 1360346 1351132 1340941 1330249 1319707 1309859 1301377 1295290 1292402 1292247 1293147 1293864
49758 1293864 1294920 1297805 1303169 1310581 1319797 1331189 1344666 1359196 1373906 1388902 1404412 1419794
49746 1419794 1434054 1446775 1457831 1466692 1472766 1476139 1477469 1477543 1477334 1477642 1477810 1475497 1468966 1459201
49732 1459201 1448630 1438114 1426491 1412820 1397569 1381442 1364534 1347102 1329908 1313312 1297124
49721 1297124 1281835 1268774 1258408 1249617 1241457 1234510 1229461 1225297 1220266 1214098 1208067 1203163 1199380
49708 1199380 1196828 1196460 1199352 1205764 1215023 1226027 1237850 1250052 1262294 1273746 1283482 1291639 1299319
49695 1299319 1306878 1313176 1317359 1320488 1324184 1328133 1330152 1328490 1322885 1313599 1300925 1286006 1270906
49682 1270906 1257194 1245081 1234253 1224854 1217265 1211640 1208012 1206226 1205394 1204139 1201803 1198885 1196007
49669 1196007 1193283 1191294 1191694 1195595 1201694 1207227 1210922 1214031 1218187 1223365 1228657 1234209 1241109 1249561
49655 1249561 1258484 1267368 1277402 1289862 1304118 1318334 1331625 1344013 1354313 1359999 1360132 1357075
49643 1357075 1354051 1351844 1349242 1345813 1342370 1338932 1334286 1328108 1321855 1316690 1311799 1305809 1298857 1292061
49629 1292061 1285644 1278971 1272198 1266682 1263623 1263147 1264836 1268335 1273236 1279040 1285608 1293265 1302293 1312693
49615 1312693 1324526 1337899 1352427 1367308 1382371 1398550 1416658 1435878 1454016 1469208 1480912
49604 1480912 1489345 1494671 1497054 1497050 1495536 1493507 1492142 1492688 1495828 1501088 1506942 1511252 1511543 1505680 1493137
49589 1493137 1475542 1455341 1433936 1411550 1388604 1366233 1345313 1325868 1307895 1292121 1279358
49578 1279358 1269466 1261410 1254117 1247111 1240704 1235822 1233218 1232555 1232591 1232271 1231134 1228721 1224673 1219778 1215760
49563 1215760 1213209 1210462 1205474 1198007 1189103 1179328 1168967 1159316 1152074 1147371 1143817 1140654 1138558 1137991
49549 1137991 1137979 1137133 1135187 1133139 1132562 1134836 1140112 1146701 1152293 1156088 1159064 1162200 1165534 1169138 1173488
49534 1173488 1178151 1181382 1182259 1182333 1183920 1187312 1190912 1193830 1196966 1201384 1206779 1212198 1217507 1223239 1229140
49519 1229140 1233781 1236227 1237707 1240767 1246544 1253752 1260844 1268127 1276669 1285993 1294593 1302477 1311266 1321524
49505 1321524 1331945 1341913 1352884 1365936 1379516 1391237 1400808 1409554 1417941 1425271 1431064 1434812 1434897
49492 1434897 1429954 1421497 1413231 1407182 1402041 1395922 1389310 1384415 1382735 1384209 1388007 1393207 1399067 1405231
49478 1405231 1411481 1417207 1421796 1425803 1430930 1438385 1447840 1458373 1469726 1482267 1496448 1512837 1531930
49465 1531930 1553329 1575742 1598511 1622491 1648744 1677074 1706725 1737632 1769547 1800342 1826857
49454 1826857 1847749 1864209 1877580 1887696 1894338 1899017 1903949 1909859 1916094 1922616 1930582 1940698 1951896
49441 1951896 1961816 1967696 1966732 1956836 1938131 1913172 1884955 1855017 1823964 1793036 1763858 1736755
49429 1736755 1710569 1684516 1659360 1636482 1616628 1600064 1587002 1577085 1569002 1561531 1554685 1549105
49417 1549105 1544667 1540622 1536993 1534829 1534741 1535865 1536677 1536352 1535033 1533307 1531932 1531819 1533660 1537488 1542730
49402 1542730 1548632 1554453 1559540 1563642 1567284 1571412 1576378 1581409 1585309 1587553 1588397 1588110 1586605 1583884
49388 1583884 1580147 1575076 1567674 1557643 1546583 1536903 1529566 1523782 1518830 1515056 1512686 1510770 1508159
49375 1508159 1504939 1502242 1501214 1502812 1507878 1516531 1527863 1541017 1556089 1573216 1591411 1609529
49363 1609529 1628086 1648888 1672891 1699538 1728200 1759107 1792709 1829194 1868702 1910461 1951054
49352 1951054 1984784 2007001 2016916 2017036 2010972 2002458 1995282 1992462 1995204 2003121 2015229 2030465 2047955
49339 2047955 2067671 2090425 2116479 2144447 2172215 2198509 2222818 2244432 2262768 2278447 2292620
49328 2292620 2304928 2313250 2315980 2313719 2308288 2300868 2291706 2280811 2268034 2252969 2235716 2217592
49316 2217592 2200200 2183802 2167406 2150582 2134434 2120517 2109464 2101092 2095132 2091208 2088611 2086992
49304 2086992 2087003 2089216 2092347 2093696 2091762 2087579 2082863 2077796 2071600 2064498 2057590 2050900 2042961 2032822
49290 2032822 2021385 2010191 1999718 1989562 1979659 1970655 1963450 1958821 1956975 1956923 1956904 1956136 1955650 1956558 1957895
49275 1957895 1957293 1953676 1948282 1942871 1937971 1933301 1929077 1926031 1924359 1923230 1921431 1918347 1914356 1910312
49261 1910312 1906611 1902999 1899486 1897040 1896819 1898973 1902966 1908811 1916928 1926636 1936086 1944287 1952150 1960631
49247 1960631 1968910 1975799 1982337 1991150 2003025 2015656 2026514 2035900 2046302 2059492 2075229 2092310
49235 2092310 2109812 2127278 2144543 2161737 2179063 2196513 2214132 2232533 2252636 2274681 2297890
49224 2297890 2321191 2343749 2364355 2380773 2390556 2392905 2389470 2383104 2375892 2368465 2360925 2353881 2348301
49211 2348301 2344554 2341967 2339403 2336073 2331819 2326941 2321925 2317111 2312369 2307263 2301784 2296778 2293398 2292247
49197 2292247 2293348 2296716 2302415 2309978 2318368 2327053 2337094 2350891 2370605 2396493 2426534 2457785
49185 2457785 2488317 2517625 2544869 2567179 2580747 2583760 2577463 2564004 2544115 2517611 2485555 2450871
49173 2450871 2416830 2385462 2357296 2332033 2309504 2290471 2276396 2267953 2263996 2262566 2262709 2264588
49161 2264588 2268081 2272330 2276904 2282337 2289010 2296319 2303546 2310899 2319025 2328099 2338243 2350400 2365788
49148 2365788 2384552 2405778 2428828 2453753 2480219 2506970 2532966 2558498 2584577 2611560 2639030
49137 2639030 2666829 2695499 2725490 2756384 2787174 2817061 2845736 2873039 2898728 2922713 2945459
49126 2945459 2967919 2990777 3013659 3035438 3055742 3076030 3098585 3124356 3152420 3181948 3213973
49115 3213973 3250386 3291515 3335732 3381622 3429692 3481612 3538501 3600529 3667709 3740253 3817809
49104 3817809 3898208 3976521 4045525 4098217 4131089 4145372 4145355 4136041 4122223 4108232 4097094 4090041
49092 4090041 4087487 4090068 4097911 4109480 4122445 4135671 4149454 4164039 4179108 4194746 4211565 4229571
$$ [...]
##END NTUPLES=NMR SPECTRUM
##END=
