
##TITLE=UV1048_TOSA01-ROVE100B_6307172_oPrG7Jgvyj
##JCAMPDX= 6.0         $$ Bruker NMR JCAMP-DX V2.0
##DATA TYPE= NMR SPECTRUM
##DATA CLASS= NTUPLES
##ORIGIN= BRUKER
##OWNER= Administrator
$$ 1.72 TOPSPIN		Version 2.1
$$ 2012-06-06 23:27:55.453 -0500  Administrator@TOPSPIN
$$ Compression mode = diff/dup
##.OBSERVE FREQUENCY= 400.13188235
##.OBSERVE NUCLEUS= ^1H
##.ACQUISITION MODE= SIMULTANEOUS (DQD)
##.ACQUISITION SCHEME= undefined
##.AVERAGES= 64
##.DIGITISER RES= 22
##SPECTROMETER/DATA SYSTEM= spect
##.PULSE SEQUENCE= noesygpps1d.comp
##.SOLVENT NAME= COFFEE_meoh
##.SHIFT REFERENCE= INTERNAL, COFFEE_meoh, 1, 14.98061
##AUDIT TRAIL= $$ (NUMBER, WHEN, WHO, WHERE, PROCESS, VERSION, WHAT)
$$ ##TITLE= Audit trail, TOPSPIN		Version 2.1
$$ ##JCAMPDX= 5.01
$$ ##ORIGIN= Bruker BioSpin GmbH
$$ ##OWNER= Administrator
$$ $$ C:\Bruker\TOPSPIN/data/COFFEE/nmr/UV1048_TOSA01-ROVE100B_6307172_oPrG7Jgvyj/12/pdata/1/auditp.txt
$$ ##AUDIT TRAIL=  $$ (NUMBER, WHEN, WHO, WHERE, PROCESS, VERSION, WHAT)
(   1,<2012-06-06 23:27:50.156 -0500>,<Administrator>,<TOPSPIN>,<go>,<TOPSPIN 2.1>,
      <created by zg
	started at 2012-06-06 23:16:19.984 -0500,
	POWCHK enabled, PULCHK disabled,
       configuration hash MD5:
       D5 CA 7A 23 FE 6B EE E2 50 67 74 61 24 F7 5E 3B
       data hash MD5: 64K
       24 1F 6C 95 64 5C AA 4F DB 00 F8 B6 E3 E8 4F A7>)
(   2,<2012-06-06 23:27:53.156 -0500>,<Administrator>,<TOPSPIN>,<proc1d>,<TOPSPIN 2.1>,
      <Start of raw data processing
       efp LB = 0.3 FT_mod = 6 PKNL = 1 PHC0 = 0 PHC1 = 0 SI = 128K 
       data hash MD5: 128K
       2A 74 59 A1 7F 9F 72 43 24 07 A5 BD 5A D6 59 F6>)
(   3,<2012-06-06 23:27:54.312 -0500>,<Administrator>,<TOPSPIN>,<proc1d>,<TOPSPIN 2.1>,
      <pk PHC0 = 33.20618 PHC1 = 0 
       data hash MD5: 128K
       8C 63 29 1E 1A 70 E5 21 26 DA 8D 13 86 93 9E 36>)
(   4,<2012-06-06 23:27:55.093 -0500>,<Administrator>,<TOPSPIN>,<proc1d>,<TOPSPIN 2.1>,
      <abs ABSG = 1 
       data hash MD5: 128K
       99 89 E9 7D BA B5 83 DF CD 9B EB 3E E3 DF 72 30>)
(   5,<2012-06-06 23:27:55.171 -0500>,<Administrator>,<TOPSPIN>,<proc1d>,<TOPSPIN 2.1>,
      <abs ABSG = 2 
       data hash MD5: 128K
       6A C9 DF C4 C8 0D 54 9C F3 95 7E 58 76 99 46 F5>)
(   6,<2012-06-06 23:27:55.218 -0500>,<Administrator>,<TOPSPIN>,<proc1d>,<TOPSPIN 2.1>,
      <abs ABSG = 3 
       data hash MD5: 128K
       4B A6 56 CB 62 02 C5 06 A0 02 FF ED 66 B2 2F 59>)
(   7,<2012-06-06 23:27:55.281 -0500>,<Administrator>,<TOPSPIN>,<proc1d>,<TOPSPIN 2.1>,
      <abs ABSG = 4 
       data hash MD5: 128K
       F5 45 E3 7F 85 E2 29 59 43 D5 B4 4C F1 83 E1 A3>)
(   8,<2012-06-06 23:27:55.343 -0500>,<Administrator>,<TOPSPIN>,<proc1d>,<TOPSPIN 2.1>,
      <abs ABSG = 5 
       data hash MD5: 128K
       B3 0A 4E 37 50 2B 6C 6D 89 DE 72 22 20 1B 92 39>)
$$ ##END=
$$ 
$$ $$ hash MD5
$$ $$ 01 5F F1 CA A2 AE F6 9E FE 3B 4F 02 CF 28 C0 1A
##$RELAX= 
##$RELAX= 
##$RELAX= 
##$RELAX= 
##$RELAX= 
##$RELAX= 
##$RELAX= 
##$RELAX= 
$$ [...]
150 150 150 150 150 150 150 150
##$TP07= 0
##$TPNAME0= <>
##$TPNAME1= <>
##$TPNAME2= <>
##$TPNAME3= <>
##$TPNAME4= <>
##$TPNAME5= <>
##$TPNAME6= <>
##$TPNAME7= <>
##$TPOAL= (0..7)
0.5 0.5 0.5 0.5 0.5 0.5 0.5 0.5
##$TPOFFS= (0..7)
0 0 0 0 0 0 0 0
##$TUNHIN= 0
##$TUNHOUT= 0
##$TUNXOUT= 0
##$USERA1= <user>
##$USERA2= <user>
##$USERA3= <user>
##$USERA4= <user>
##$USERA5= <user>
##$V9= 5
##$VALIST= <valist>
##$VCLIST= <CCCCCCCCCCCCCCC>
##$VD= 0
##$VDLIST= <DDDDDDDDDDDDDDD>
##$VPLIST= <PPPPPPPPPPPPPPP>
##$VTLIST= <TTTTTTTTTTTTTTT>
##$WBST= 2048
##$WBSW= 25
##$XGAIN= (0..3)
0 0 0 0
##$XL= 0
##$YL= 0
##$YMAX_a= 13162255
##$YMIN_a= -8438843
##$ZGOPTNS= <>
##$ZL1= 120
##$ZL2= 120
##$ZL3= 120
##$ZL4= 120
##$ABSF1= 14.98061
##$ABSF2= -5.57192
##$ABSG= 5
##$ABSL= 3
##$ALPHA= 0
##$AQORDER= 0
##$ASSFAC= 0
##$ASSFACI= 0
##$ASSFACX= 0
##$ASSWID= 0
##$AUNMP= <proc_prof1d_extract.lims>
##$AXLEFT= 0
##$AXNAME= <>
##$AXNUC= <1H>
##$AXRIGHT= 0
##$AXTYPE= 0
##$AXUNIT= <>
##$AZFE= 0.1
##$AZFW= 0.1
##$BCFW= 0
##$BC_mod= 0
##$BYTORDP= 0
##$COROFFS= 0
##$CY= 15
##$DATMOD= 1
##$DC= 0
##$DFILT= <>
##$DTYPP= 0
##$F1P= 0
##$F2P= 0
##$FCOR= 0.5
##$FTSIZE= 131072
##$FT_mod= 6
##$GAMMA= 0
##$GB= 0
##$INTBC= 1
##$INTSCL= 1
##$ISEN= 128
##$LB= 0.3
##$LEV0= 0
##$LPBIN= 0
##$MAXI= 10000
##$MC2= 0
##$MEAN= 0
##$ME_mod= 0
##$MI= 0
##$NCOEF= 0
##$NC_proc= -2
##$NLEV= 6
##$NOISF1= 0
##$NOISF2= 0
##$NSP= 0
##$NTH_PI= 0
##$NZP= 0
##$OFFSET= 14.98061
##$PC= 1
##$PHC0= 33.20618
##$PHC1= 0
##$PH_mod= 1
##$PKNL= yes
##$PPARMOD= 0
##$PPDIAG= 0
##$PPIPTYP= 0
##$PPMPNUM= 2147483647
##$PPRESOL= 1
##$PSCAL= 4
##$PSIGN= 0
##$PYNMP= <proc.py>
##$REVERSE= no
##$SF= 400.13
##$SI= 131072
##$SIGF1= 0
##$SIGF2= 0
##$SINO= 400
##$SIOLD= 131072
##$SPECTYP= <>
##$SREGLST= <1H.CDCl3>
##$SSB= 0
##$STSI= 131072
##$STSR= 0
##$SW_p= 8223.68421052632
##$SYMM= 0
##$S_DEV= 0
##$TDeff= 65536
##$TDoff= 0
##$TI= <>
##$TILT= no
##$TM1= 0
##$TM2= 0
##$TOPLEV= 0
##$USERP1= <user>
##$USERP2= <user>
##$USERP3= <user>
##$USERP4= <user>
##$USERP5= <user>
##$WDW= 1
##$XDIM= 131072
##$YMAX_p= 243843179
##$YMIN_p= -394838109
##$CURPLOT= <Network HP LaserJet P1505>
##$CURPRIN= <$Network HP LaserJet P1505>
##$DFORMAT= <normdp>
##$LAYOUT= <+/1D_H.xwp>
##$LFORMAT= <normlp>
##$PFORMAT= <normpl>
##$SURQMSG= 1
$$ End of Bruker specific parameters
$$ ---------------------------------
##NTUPLES= NMR SPECTRUM
##VAR_NAME=  FREQUENCY,     SPECTRUM/REAL,   SPECTRUM/IMAG
##SYMBOL=    X,             R,               I
##VAR_TYPE=  INDEPENDENT,   DEPENDENT,       DEPENDENT
##VAR_FORM=  AFFN,          ASDF,            ASDF
##VAR_DIM=   131072,        131072,          131072
##UNITS=     HZ,            ARBITRARY UNITS, ARBITRARY UNITS
##FACTOR=    0.0627417313425165, 1,          1
##FIRST=     8223.62146879498, 105,          -49668
##LAST=      0,             720,             -50077
##MIN=       0,             -394838109,      0
##MAX=       8223.62146879498, 243843179,    0
$$ Real data points
##PAGE= N=1
##DATA TABLE= (X++(R..R)), XYDATA
$$ [...]
66059 73016 74357 75385 75692 75723 75833 75611 74619 73349 72802 73251 73952 74068 73370 72031 70281 68579 67617
66042 67617 67688 68234 68416 68061 67672 67584 67510 67040 66250 65597 65447 65912 66933 68212 69220 69627 69746 70176 70957
66023 70957 71383 70855 69731 69097 69692 71175 72424 72601 71983 71703 72494 73857 74765 75087 75751 77373 79272
66006 79272 80329 80430 80556 81584 83442 85386 86719 87282 87536 88157 89340 90661 91829 93230 95272 97486
65990 97486 98974 99665 100384 101566 102643 103050 103228 104080 105782 107612 108779 109046 108712 108364 108583 109540 110876
65973 110876 112072 112879 113289 113284 112861 112180 111438 110654 109809 109142 109068 109776 111006 112295 113353 114200 114978 115631
65955 115631 115856 115447 114612 113738 112876 111747 110314 109048 108369 108048 107437 106206 104612 103114 102009 101430
65939 101430 101444 101916 102423 102511 102140 101826 102192 103327 104617 105224 104681 103111 101088 99393 98609 98658 98867 98754
65921 98754 98596 98892 99439 99478 98789 98111 98288 99401 100988 102675 104186 105055 104854 103741 102446 101616 101345
65904 101345 101354 101503 102001 103114 104687 106070 106639 106368 105772 105373 105345 105577 105789 105665 105190 104843 105165 106193
65886 106193 107634 109495 111958 114593 116331 116533 115655 114605 113903 113754 114378 115672 116843 116936 115699 113648
65870 113648 111528 110002 109559 110177 111189 111873 112072 111999 111684 111116 110693 110962 111873 112751 113089 112973 112692 112287
65852 112287 111657 110886 110303 110255 110736 111213 110979 109856 108312 106770 105125 103271 101622 100638 100102 99546 99183
65835 99183 99658 100863 101714 101370 100070 98544 97058 95418 93517 91497 89564 87931 86824 86339 86338 86526
65819 86526 86506 85888 84626 83252 82434 82208 81969 81251 80152 78903 77477 75892 74554 73959 74186 74897 75707
65802 75707 76425 77078 77763 78364 78425 77683 76704 76519 77396 78431 78634 77986 77002 75755 73995 72061 70903 71046
65784 71046 71983 72799 73038 72808 72386 72022 71944 72238 72672 72801 72340 71460 70706 70511 70722 70714 70107 69302 69057 69610
65764 69610 70465 71112 71685 72700 74334 76224 77883 79061 79718 79963 80162 80825 82131 83623 84608 84874 84806
65747 84806 84777 84683 84202 83337 82447 81789 81244 80545 79629 78660 77738 76685 75228 73504 72278 72385 73820 75579
65729 75579 76649 77006 77339 77942 78313 78006 77396 77185 77340 77052 75836 74240 73184 72846 72596 71920 70984 70145
65711 70145 69336 68225 66790 65403 64421 63952 63891 63868 63290 61875 60218 59353 59604 60236 60413 60090 59700 59373
65693 59373 58937 58357 57662 56554 54693 52440 50799 50338 50431 49878 48221 46222 45019 44922 45160 44745 43445
65676 43445 41766 40298 39395 39381 40462 42251 43805 44479 44458 44254 44053 43905 44137 45013 46143 46735 46421 45517
65658 45517 44585 44066 44167 44674 44969 44577 43604 42400 41065 39734 38993 39314 40269 40971 41219 41521 42017 42227
65640 42227 42012 41995 42663 43753 44859 46014 47224 47994 47906 47251 46597 46109 45764 45847 46606 47655 48358 48721
65622 48721 49298 50157 50520 49693 48052 46845 47087 48768 51078 53285 55244 57064 58504 59070 58661 57774
65606 57774 56988 56588 56760 57673 59142 60579 61601 62333 62813 62520 61031 58933 57468 57225 57570 57414 56207
65589 56207 54194 52117 50818 50775 51695 52597 52502 51164 49211 47575 46751 46508 46347 46174 46350 47084 48007 48514
65571 48514 48335 47625 46642 45587 44647 43969 43557 43310 43157 43093 43116 43208 43350 43529 43786 44188 44606 44658 44130 43454
65551 43454 43331 43838 44283 44128 43636 43352 43374 43468 43536 43499 43045 42056 41129 41045 41714 42223 42000 41435 41162 41243 41395
65530 41395 41635 42177 42843 43058 42567 41901 41912 42915 44376 45472 45858 45868 46021 46354 46311 45303 43386 41324
65512 41324 39924 39322 39082 38901 38962 39456 40068 40254 39935 39586 39640 40058 40476 40562 40226 39693 39359 39381 39461 39233
65492 39233 38733 38187 37532 36609 35716 35440 35845 36320 36323 35851 35118 34320 33868 34241 35304 36237 36452 36173 35905
65473 35905 35842 36074 36793 37893 38864 39485 40113 40908 41375 41191 40880 40990 41147 40691 39808 39152 38739 38135 37530
65454 37530 37595 38358 39164 39804 40732 42035 43079 43488 43663 43942 43936 43136 41725 40382 39651 39717 40356 40898 40721
65435 40721 39999 39508 39525 39543 39278 39242 39874 40698 40946 40574 40078 39697 39376 39217 39378 39672 39811 39900 40179 40442
65415 40442 40261 39699 39278 39298 39692 40487 41799 43277 44181 44266 44086 44106 43997 43263 42200 41672 42058 42989 44058
65396 44058 45262 46579 47633 48114 48212 48259 48173 47699 47099 47064 47884 49104 50190 51192 52471 54042 55469
65379 55469 56262 56186 55353 54230 53372 52913 52430 51517 50289 49110 48132 47414 47191 47510 47765 47215 45972 44963
65361 44963 44828 45355 46070 46764 47209 46962 45911 44706 44102 44136 44330 44503 44890 45535 46094 46363 46617 47206 48032
65342 48032 48637 48742 48525 48356 48371 48331 47882 46945 45871 45262 45626 47104 49379 51832 53867 55217 56013 56625
65324 56625 57443 58635 59955 60819 60746 59802 58580 57757 57690 58350 59546 61208 63451 66324 69519 72541 75219
65307 75219 77803 80447 82924 85168 87774 91439 96001 100597 104843 109263 114272 119254 123106 125447
65293 125447 126704 127103 126219 123770 120392 117073 113943 110195 105395 100357 96311 93407 90658 87336 83830
65278 83830 80892 78566 76299 73812 71387 69400 67960 66894 65823 64309 62283 60271 58930 58353 58011
65263 58011 57272 55830 53828 51819 50444 49831 49496 49081 48931 49531 50603 51303 51149 50297 49046 47695 46802
65246 46802 46838 47397 47378 46251 44692 43699 43454 43338 42774 41762 40802 40456 40826 41409 41637 41530 41515 41721 41856
65227 41856 41740 41444 40944 40171 39471 39430 40042 40630 40764 40696 40669 40419 39764 39084 38769 38613 38241 37747 37446 37362
65207 37362 37419 37776 38477 39012 38804 37978 37222 37020 37381 38076 38702 38709 37864 36650 35795 35476 35310 35049 34848 34848
65187 34848 34862 34573 33928 33281 33214 34042 35359 36278 36314 35855 35572 35648 35828 35956 36081 36212 36328 36519 36826 37081
65167 37081 37196 37462 38256 39501 40703 41428 41536 41102 40397 39793 39440 39088 38368 37154 35552 33862 32694
65150 32694 32711 33943 35628 37045 38140 39092 39758 40031 40242 40567 40406 39130 37197 35731 35152 35028 35219
65133 35219 36137 37633 38545 37901 36065 34259 33335 33350 33906 34432 34413 33764 32883 32129 31437 30656 30061 30169 31154
65114 31154 32645 34070 35067 35673 36232 37058 38099 39002 39511 39717 39859 39989 39881 39218 37880 36118 34378
65097 34378 32954 31946 31604 32311 33936 35551 36265 36239 36393 37216 38389 39555 40827 42403 44180 45969
65081 45969 47641 48870 49219 48775 48276 48221 48221 47620 46514 45678 45645 46241 46916 47190 46849 46042 45197 44594 44054
65062 44054 43276 42430 42019 42175 42405 42232 41766 41410 41211 40876 40350 39973 39902 39706 38879 37603 36657 36576 37219
65043 37219 38180 39191 39932 39941 39149 38315 38438 39785 41822 43969 45996 47714 48827 49313 49635 50364 51729
65026 51729 53581 55552 57232 58448 59500 60898 62798 64885 66816 68493 69923 71187 72622 74647
65012 74647 77219 79809 82097 84281 86487 88306 89370 90030 90916 91975 92473 91939 90615 88943 87075
64997 87075 85060 83104 81330 79543 77482 75164 72746 70165 67237 64112 61370 59542 58609 58021 57141
64982 57141 55645 53623 51428 49428 47822 46627 45770 45132 44475 43452 41874 39997 38463 37808 37978 38313
64966 38313 38084 37209 36435 36674 38027 39585 40344 40164 39611 39052 38318 37281 36301 35902 36288 37347 38838
64949 38838 40363 41457 42004 42399 43034 43804 44356 44622 44755 44677 44124 43133 42184 41769 41981 42523 42985 43169 43262
64930 43262 43594 44139 44512 44613 44883 45594 46233 46145 45554 45252 45353 45076 43959 42599 41784 41396 40674 39301
64912 39301 37777 36817 36715 37249 37910 38196 37878 37086 36118 35213 34549 34323 34693 35628 36880 38136 39216 40168
64894 40168 41134 42133 43057 43886 44690 45299 45225 44179 42575 41220 40571 40443 40311 39707 38493 37096 36333 36648
64876 36648 37536 38041 37781 37177 36803 36922 37550 38473 39108 38849 37731 36497 35909 36227 37214 38251 38509 37563
64858 37563 35918 34499 33669 33259 33451 34766 36985 38966 39955 40372 40845 41263 41441 41949 43284 44713 45001
64841 45001 44139 43347 43358 43671 43650 43412 43209 42781 41912 41093 40912 41093 40799 39733 38407 37380 36810 36822 37687
64822 37687 39311 40955 41909 42258 42565 42944 42946 42388 41718 41331 41004 40453 40034 40328 41177 41800 41929 42195 43127
64803 43127 44291 44861 44694 44374 44297 44173 43552 42461 41352 40579 40176 40146 40695 41932 43453 44567 45071 45422
64785 45422 45916 46063 45249 43768 42621 42299 42334 42150 41851 41936 42588 43498 44071 43726 42326 40482 39130 38687
64767 38687 38902 39492 40375 41214 41432 41069 41001 41794 42772 42820 41762 40396 39450 39101 39322 40015 40760 40972 40444
64748 40444 39476 38503 37944 38295 39784 41853 43398 43826 43689 44096 45582 47560 48899 49054 48639 48664 49245
64731 49245 49474 48740 47573 46723 45915 44374 42362 41257 41906 43664 45370 46643 47742 48699 49220 49273 49165
64714 49165 49041 48781 48471 48538 49179 49907 50034 49534 49105 49278 49789 50064 50079 50288 50774 51057 50945 51001 51676 52336
64694 52336 51823 49953 47884 46828 46837 47134 47262 47494 48189 49141 49758 49724 49327 49058 49081 49223 49398 49724 50193
64675 50193 50504 50473 50410 50821 51784 52880 53657 53974 53890 53434 52565 51288 49793 48537 48081 48672 49943 51114
64657 51114 51561 51228 50571 50080 49755 49106 47843 46497 46020 46676 47695 48254 48421 48754 49269 49299 48436 47163
64639 47163 46401 46599 47399 48088 48254 47985 47514 46866 46049 45443 45600 46565 47735 48522 48859 48921 48721 48294 47948
64620 47948 47981 48352 48835 49297 49646 49838 50164 51069 52342 53023 52657 52166 52698 53933 54424 53540 52181 51407
64602 51407 51231 51098 50859 50767 50938 51269 51657 51999 52183 52303 52657 53323 53989 54364 54507 54612 54737 54905 55114
64583 55114 55053 54145 52250 50152 48911 48809 49211 49461 49564 49899 50543 51146 51439 51617 52022 52596 52901 52737
64565 52737 52449 52430 52533 52277 51526 50651 50084 49950 50175 50651 51237 51773 52202 52640 53319 54440 55867 56911
64547 56911 56716 55179 53212 51835 51168 50769 50613 51153 52432 53796 54648 54986 55058 54956 54822 55010 55702 56615
64529 56615 57356 57890 58438 59066 59527 59393 58311 56425 54588 53812 54244 54934 54884 54144 53668 54252 55829 57686
64511 57686 59068 59620 59461 58956 58366 57661 56621 55098 53229 51486 50407 50142 50333 50561 50805 51275 51985
64494 51985 52774 53650 54712 55794 56547 56988 57585 58697 60155 61504 62418 62808 62809 62721 62719 62547 61798 60533 59316
64475 59316 58538 58004 57296 56296 55244 54562 54687 55696 56958 57496 56945 55883 55028 54452 53829 53125 52657
64458 52657 52599 52781 52959 53079 53240 53488 53698 53713 53715 54296 55844 57849 59211 59348 58671 57885 57219 56584 56081
64439 56081 55961 56256 56721 57019 56836 56041 54951 54166 53852 53392 52084 50068 48242 47351 47502 48454 49956
64422 49956 51599 52743 52948 52514 52314 52925 54069 55056 55641 56124 56657 56936 56855 56934 57602 58357 58332 57570 57038
64403 57038 57300 57880 58155 58275 58748 59612 60470 61066 61426 61587 61513 61204 60686 60039 59501 59328 59454 59574 59678
64384 59678 60096 60880 61574 61890 62219 63066 64303 65429 66331 67311 68414 69143 68963 67920 66720 66195 66582
64367 66582 67375 68120 69231 71538 74947 78165 80057 80769 81177 81765 82589 83891 85966 88565 91062 93253
64351 93253 95539 98344 101814 106043 111111 116708 122079 126537 129961 132805 135694 138906 142087 144642
64337 144642 146521 148313 150359 152128 152899 152735 152187 151244 149268 146040 142205 138431 134673 130682 126831
64322 126831 123798 121501 118901 115175 110810 107155 104886 103258 101034 97825 94288 91256 89125 87886
64308 87886 87250 86684 85791 84715 83804 82917 81698 80515 80321 81316 82493 82965 83011 83272 83611 83535 83189 83042
64290 83042 82910 82229 81111 80256 79854 79437 78828 78472 78636 79041 79524 80364 81603 82563 82534 81666 80895 81109 82518
64271 82518 84614 86608 88086 89299 90686 92233 93567 94568 95537 96819 98601 100982 103752 106154 107436
64256 107436 107851 108685 111018 114770 119105 123399 127553 131591 135281 138181 139943 140555 140240 139096 136997
64241 136997 133962 130390 126736 123195 119949 117355 115436 113494 110842 107744 105048 103016 101271 99851
64227 99851 99377 99908 100464 100241 99700 99844 100822 101907 102602 103123 103799 104537 105038 105175 104992 104584 104241 104598 106213
64208 106213 108792 111035 111696 110832 109630 108869 108047 106345 103983 102040 101143 100952 100822 100359 99339 97723
64192 97723 95953 94756 94454 94729 95109 95376 95537 95827 96715 98423 100432 101915 102704 103345 104192 105057 105753
64175 105753 106358 106815 106965 107183 108303 110583 113343 115942 118510 121350 124285 127101 130064 133426 136894
64160 136894 140070 142977 145603 147501 148516 149458 151266 153849 156532 159363 163025 167547 172084 176168
64146 176168 180354 185293 190866 196633 202563 208809 215138 221164 226983 233107 239742 246439 252559 257845
64132 257845 262396 266209 269023 270723 271688 272422 272847 272275 270229 267008 263177 258738 253170 246196 238140
64117 238140 229526 220663 211761 203217 195516 188859 182945 177208 171363 165716 160841 156933 153642 150558
64103 150558 147611 144899 142386 140077 138234 137070 136362 135700 135080 134853 135100 135413 135436 135340 135616 136632 138490
64086 138490 141049 143912 146536 148605 150257 151806 153315 154610 155622 156508 157451 158549 159958 161862 164082
64071 164082 165945 166913 167362 168339 170330 172560 173804 173703 172929 172169 171426 170450 169426 168834 168705 168366 167046
64054 167046 164678 161954 159537 157346 154805 151795 149051 147437 147054 147361 147936 148765 149880 151143 152436
64039 152436 153731 154854 155493 155567 155372 155353 155945 157594 160529 164404 168478 172270 175843 179396 182917 186284
64023 186284 189390 192033 194031 195539 196943 198276 199120 199213 198766 197983 196697 194797 192632 190622 188717
64008 188717 186597 184193 181683 179217 176982 175402 174857 175244 176003 176522 176418 175715 175027 175276 176871 179219
63992 179219 181277 182502 183133 183802 185179 187691 191204 195034 198584 201911 205441 209315 213313 217258 221169
63977 221169 225109 229229 233840 239126 244781 250168 254849 258786 262156 265171 267925 270245 271894 273129
63963 273129 274740 277204 280013 282288 283795 284937 285977 286907 288013 289858 292478 295131 297220 299156
63949 299156 301999 306382 311968 317863 323453 328904 334924 342046 350134 358563 366670 373977 380329 386091
63935 386091 391984 398374 404876 410975 416845 423173 430356 438336 447119 456867 467494 478731 490721
63922 490721 504056 519077 535537 553162 572120 592738 615152 639449 665799 694126 723976
63911 723976 755117 788106 823894 862948 905012 949649 996766 1046620 1099523 1155643 1215075
63900 1215075 1278083 1345272 1417464 1495405 1579633 1670533 1768480 1874090 1988637 2114099 2252534
63889 2252534 2405396 2573777 2759226 2963914 3189904 3438803 3712404 4013191 4343625
63880 4343625 4704927 5096739 5517611 5965263 6436330 6926423 7430714 7944173 8460829
63871 8460829 8972799 9470223 9942188 10377752 10766477 11098899 11367368 11566721 11693964
63862 11693964 11747135 11724569 11625300 11450000 11201542 10885153 10508476 10081275 9614409 9118574
63852 9118574 8603726 8079190 7553611 7034416 6527573 6038137 5570967 5130673 4720729
63843 4720729 4342685 3996318 3680597 3394418 3136429 2904427 2695442 2506568 2335590
63834 2335590 2180772 2040491 1913304 1798012 1693314 1597575 1509256 1427355 1351196 1280121
63824 1280121 1213773 1152227 1095248 1041683 990340 941280 895453 853077 813256 775274 739336
63813 739336 705675 673870 643674 615737 590674 567917 546326 525631 506402 488744 471945
63802 471945 455554 440008 425831 412763 400138 387815 376298 365999 356671 347622 338446 329564
63790 329564 322014 316545 312873 309923 306827 303542 300529 298078 296106 294384 292665 290605 287868 284427
63776 284427 280597 276525 271790 265824 258843 251945 246022 240823 235472 229760 224415 220069 216431 212691
63762 212691 208303 203179 197507 191711 186258 181137 175837 170251 165254 161752 159345 156566 152574 148052
63748 148052 144312 142031 141048 140864 140911 140655 139931 139049 138293 137489 136338 135002 133944 133287 132643 131660 130420
63731 130420 129281 128501 128048 127618 126859 125771 124781 124232 123881 123231 122254 121391 120816 120234 119453 118623 117664 116037
63713 116037 113606 111289 110166 110172 110254 109761 108992 108398 107914 107329 106767 106393 106018 105345 104400 103486 102885 102831 103567
63694 103567 105151 107287 109467 111230 112290 112688 112933 113682 115136 116962 118914 121176 123871 126617 128909
63679 128909 130763 132645 134955 137860 141434 145624 150193 154979 160129 165866 172155 178824 185852 193308
63665 193308 201206 209616 218638 227940 236631 243973 250037 255204 259284 261599 261837 260306 257463 253671
63651 253671 249379 244983 240482 235688 230747 225998 221323 216238 210724 205386 200590 195954 191010 185954
63637 185954 181426 177800 174944 172497 170222 168237 166940 166465 166249 165534 164313 163390 163447 164551 166658 169965
63621 169965 174400 179219 183568 187237 190608 194148 198261 203238 209002 215106 221341 228099 235777 243962
63607 243962 251537 257560 261815 264648 266446 267149 266189 263088 258186 252454 246434 239805 232247 224314 216998
63592 216998 210752 205365 200544 196087 191731 187426 183729 181389 180475 180296 180248 180398 181205 183053 186043 189851
63576 189851 193706 196945 199804 203333 208291 214317 220429 226149 231902 238390 245891 254209 263113 272618
63562 272618 282868 293940 305873 318764 332647 347351 362708 378878 396168 414483 433274
63551 433274 452181 471335 490788 509954 527924 544028 557715 568233 575078 578741 580417 580910
63539 580910 580279 578617 576533 574543 572450 569786 566521 562849 558411 552288 543891 533493 521785 509278
63525 509278 496338 483539 471465 460196 449277 438402 427894 418333 409905 402358 395473 389271
63513 389271 383777 378933 374893 372102 370882 371109 372502 375014 378665 383139 387930 392947 398740 405995
63499 405995 414943 425314 436772 449320 463307 479048 496446 515004 534251 554001 574084 593972
63487 593972 612903 630368 646242 660386 672362 681786 688852 694254 698542 701756 703849 705299 706978
63474 706978 709337 711867 713517 713479 711420 707157 700432 690986 678608 663081 644391 623090 600209
63461 600209 576677 552951 529279 506049 483666 462286 441930 422775 405179 389445 375657
63450 375657 363649 353015 343290 334332 326462 320032 314879 310344 305818 301179 296730 292927 290183 288764
63436 288764 288631 289332 290200 290820 291371 292371 294084 296358 299195 303151 308814 315923 323408 330423 337022
63421 337022 343739 350821 358070 365241 372323 379462 386657 393402 398640 401336 401254 399050 395573 391235 385999
63406 385999 379673 372159 363747 355303 347834 341729 336626 332052 327840 323899 320177 317085 315362 315072
63392 315072 315200 314798 314120 314046 314770 315787 317012 319092 322484 326890 331777 336977 342561 348597 355282 363007
63376 363007 372055 382439 394084 406889 420603 435015 450437 467619 486962 508066 530268 553356
63364 553356 577487 602641 628503 654806 681463 708299 734782 760105 783390 803812 820652
63353 820652 833437 842204 847600 850524 851551 850793 848414 845051 841405 837451 832418 825635 817122 807199
63339 807199 795755 782193 766056 747536 727460 706979 687231 668931 652081 636189 620982
63328 620982 606822 594278 583445 574076 566326 560848 557851 556581 556224 556946 559413 563535 568520 574182
63314 574182 581240 589990 599599 609351 619955 632755 647968 664450 681033 697414 713882 730974
63302 730974 749481 770079 792609 816068 839483 862482 884857 905930 924572 939690 950682
63291 950682 957613 961006 961300 958584 953097 945837 938206 930952 923778 915955 906938 896327 883724 868929
63277 868929 852052 833295 812939 791657 770473 750044 730160 710297 690509 671473 653659
63266 653659 636854 620672 605292 591329 578954 567513 556257 545242 535099 526086 517886 510388
63254 510388 503922 498338 492497 485391 477472 470183 464347 459639 455488 451729 448287 444947 441749 439054
63240 439054 436884 434602 431551 427741 423689 419832 416253 412724 408893 404691 400585 397152 394365 391731
63226 391731 389091 386744 384660 382263 379326 376465 374190 371947 368760 364598 360551 357704 356250 355624
63212 355624 355054 353995 352394 350562 348669 346488 343870 341238 339181 337660 336066 334107 332261 331226
63198 331226 331214 331884 332651 332948 332489 331497 330522 329863 329333 328757 328476 329053 330547 332398 334138 335875 337871
63181 337871 339920 341533 342701 344097 346367 349528 353227 357300 361779 366531 371288 376043 381093 386648
63167 386648 392584 398751 405297 412536 420444 428360 435340 441044 446291 452414 459818 467408 473724 478446
63153 478446 482481 486822 491795 497255 502911 508329 513122 517341 521286 524829 527272 528033 527155 525007 521903
63138 521903 518215 514452 510863 507181 503036 498443 493745 489355 485797 483634 482989 483313 484017 485262 487783
63123 487783 491963 497323 502962 508341 513657 519595 526693 534910 543817 553150 562899 572854 582402 591106
63109 591106 599249 607548 616382 625505 634386 642563 649717 655712 660632 664677 667957 670365 671565 671070
63095 671070 668467 663746 657341 649802 641476 632509 623004 613094 602963 592900 583218 574113 565699 558125
63081 558125 551401 545084 538523 531623 525057 519516 514948 510831 506948 503505 500595 497955 495313 492617
63067 492617 489792 486535 482642 478500 475015 472861 471838 471137 470246 469399 469038 469152 469482 470124 471350 472850
63051 472850 473779 473814 473653 474102 475165 476539 478568 481940 486541 491372 495734 499902 504322 508717 512506
63036 512506 515763 519132 522798 526149 528680 530792 533288 536333 539410 542290 545457 549338 553535 557371
63022 557371 561036 565601 571714 578679 585153 590605 595755 601576 608110 614446 619723 623924 627644 631376
63008 631376 635296 639524 644064 648410 651682 653507 654495 655581 657135 658923 660630 662071 663202 664353
62994 664353 666201 669117 672798 677004 682279 689255 697512 705933 714126 722651 731862 741404 751136 761635
62980 761635 773319 785770 798405 811228 824400 837617 850491 863095 875535 887323 897862
62969 897862 907332 916455 925426 933636 940501 946074 950670 954176 955926 955166 951639 945731 938046 928829
62955 928829 917901 905074 890512 874797 858972 844339 831697 820701 810431 800722 792456 786393
62943 786393 782280 779418 777671 777544 779582 783975 790489 798561 807753 818215 830263 843443 856642
62930 856642 869352 882161 895585 909087 921746 933294 943894 953439 961832 969503 976777 982899
62918 982899 986465 986825 984464 980021 973425 963995 950988 934099 913803 891181 867131 841815 815053
62905 815053 786995 758152 729111 700541 673123 647092 622167 598284 575966 555582 536711
62894 536711 518813 502097 487053 473488 460776 448836 438146 428866 420523 412477 404237 395546
62882 395546 386711 378572 371607 365337 359206 353603 349192 345587 341658 337044 332438 328407 324809 321430
62868 321430 318324 315364 312247 309122 306534 304621 302971 301310 299647 297738 295272 292712 291099 290757
62854 290757 290919 290883 290749 290738 290638 290368 290421 291162 292197 292925 293335 293826 294578 295402 295976 296063 295768 295649 296190 297150
62834 297150 297931 298562 299652 301319 302913 304045 305134 306605 308252 309810 311496 313502 315524 317348 319421
62819 319421 322292 325826 329435 332795 335939 338950 341962 345215 348833 352720 356694 360349 362795 363239
62805 363239 362036 360417 358908 356751 353340 349362 345851 342873 339951 337166 334809 332395 329091 325007
62791 325007 321111 317855 314744 311355 307971 304983 302294 299730 297529 296098 295534 295588 295905 296131 296026 295582
62775 295582 294932 294113 293102 292089 291546 291873 293039 294608 296068 297139 297734 297697 296802 295256 293957 293712
62759 293712 294183 294141 292959 291353 290343 289986 289617 288977 288511 288674 289430 290466 291560 292672 293921 295449
62743 295449 297164 298666 299601 300028 300366 301089 302480 304417 306343 307725 308723 310147 312599 315969 319879
62728 319879 324222 329002 334039 339193 344585 350276 356016 361697 367856 375393 384883 396326 409280 422982
62714 422982 436725 450512 465114 481175 498501 516558 535327 555114 575732 596391 616429
62703 616429 635730 654376 672135 688257 701649 711452 717696 721236 722783 722166 718689 711885 701688
62690 701688 688308 672383 654964 636840 618059 598448 578313 558120 537812 517092 496262
62679 496262 476203 457563 440488 425052 411339 399047 387571 376619 366382 357001 348333 340305
62667 340305 333107 326884 321596 317260 314013 311778 310217 309131 308626 308754 309236 309688 309975 310317 311159 312883
62651 312883 315440 318354 321296 324596 328897 334374 340574 347028 353702 360881 368900 378072 388591 400405
62637 400405 413336 427330 442474 458827 476438 495411 515832 537690 560984 585637 611139
62626 611139 636698 662087 687940 714637 741199 765968 788167 807976 825046 837943 845431 847665
62614 847665 845640 839947 830519 817226 800175 779580 755811 729569 701801 673465 645485 618620
62602 618620 593127 568677 544922 522082 500803 481397 463427 446116 429115 412859 398067
62591 398067 384934 372934 361601 351244 342508 335307 328662 321725 314580 307804 301589 295637 289700
62578 289700 283875 278446 273732 269981 267159 264822 262529 260309 258461 256891 255037 252675 250372 248749
62564 248749 247510 245774 243395 241355 240564 240691 240640 239889 238858 238117 237796 237779 237999 238379 238893 239779 241344
62547 241344 243456 245639 247772 250226 253190 256369 259529 262836 266395 270097 274269 279767 286748 293911
62533 293911 299841 304832 310566 318044 326673 335412 344027 352946 362492 372654 383257 394052 404795
62520 404795 415407 425853 435783 444463 451160 455574 457942 458810 458578 457132 454093 449506 443912 437518
62506 437518 429733 420039 409037 398032 387765 378098 368766 359773 351087 342588 334431 326901 319859
62493 319859 312828 305786 299358 294051 289712 285864 282215 278690 275329 272286 269585 266868 263734 260358
62479 260358 257380 255114 253235 251299 249231 247313 246072 246062 247250 248682 249390 249610 250489 252573 255391
62464 255391 258562 262329 266539 270050 271991 273069 274875 278210 282786 288245 294642 301930 309705 317736
62450 317736 326410 336395 348003 360931 374534 388318 402248 416568 431429 446779 462495 478303
62438 478303 493557 507455 519592 530023 538738 545370 549507 550956 549634 545600 539315 531438 522193
62425 522193 511362 499102 486378 474208 462839 451870 440865 429629 418314 407541 398005 389659
62413 389659 381695 373742 366595 361206 357318 353793 350055 346530 343665 341183 338508 335470 332374 329677
62399 329677 327812 327130 327728 329248 330889 331810 331752 331283 331260 332053 333566 335895 339327 343451 346924 348668
62383 348668 348968 348881 348924 348906 348778 348826 348976 348651 347501 345788 343767 341175 337651 333384 329002 324992 321499
62366 321499 318601 316442 315067 314273 313771 313453 313461 313963 314949 316279 317891 319868 322329 325338 328833 332477
62350 332477 335715 338374 341222 345471 351487 358316 364772 370685 376746 383404 390448 397591 404940 412714
62336 412714 420843 429096 437423 445977 454783 463446 471223 477488 482212 485945 489269 492367 495154 497679
62322 497679 500220 503015 506095 509399 512993 517171 522306 528554 535736 543632 552347 562245 573598 586611
62308 586611 601759 619722 640818 664751 691065 719584 750262 782955 817605 854455 893830
62297 893830 935753 979864 1025468 1071589 1117273 1161959 1205128 1245364 1280259 1307783 1327617
62286 1327617 1340773 1348129 1349730 1345308 1334981 1319364 1299223 1274989 1246505 1213510 1176593 1137325
62274 1137325 1097255 1057186 1017839 980512 946190 914345 883682 854089 826904 803029 781740
62263 781740 761793 742933 725717 710436 696926 685055 674735 665650 657489 650273 643999 638234
62251 638234 632719 628202 625880 625903 627076 628246 629281 630313 630729 629743 627714 626052 625685 626213 626719 626886
62235 626886 626947 627021 627031 627072 627373 627898 628393 628833 629489 630535 631940 633833 636614 640552 645544 651465 658510
62218 658510 666927 676583 686986 697722 708765 720513 733592 748433 764878 782390 800863 821034
62206 821034 843825 869322 896713 925236 954977 986662 1020891 1057784 1097232 1139182 1183480
62195 1183480 1229605 1276873 1324899 1373481 1421705 1467417 1507992 1541689 1568084 1587325 1599465
62184 1599465 1604610 1603316 1596535 1585162 1569650 1549952 1525992 1498416 1468691 1438111 1406924 1375034
62172 1375034 1343410 1313963 1287798 1264363 1242757 1223161 1206374 1192480 1180785 1170798 1162577 1156197
62160 1156197 1151546 1148684 1147795 1148651 1150527 1152838 1155635 1159350 1164274 1170356 1177411 1185445 1194767 1205649
62146 1205649 1217839 1230649 1243603 1256715 1270054 1283510 1297279 1312147 1328857 1347489 1367857
62135 1367857 1390130 1414457 1440294 1466857 1494242 1523436 1555097 1588848 1623892 1659786 1696416
62124 1696416 1733594 1770950 1807999 1844099 1878533 1910722 1940322 1967225 1991744 2014734 2037174
62113 2037174 2059615 2082282 2105752 2131158 2159619 2191594 2226768 2264356 2303523 2343848 2385507
62102 2385507 2428805 2473394 2518008 2560936 2600708 2636477 2667969 2695138 2717925 2736496 2751590
62091 2751590 2764113 2774177 2780986 2783997 2783755 2781215 2776838 2770974 2764662 2759133 2754686 2750879 2747770 2746137
62077 2746137 2746476 2748659 2752608 2758409 2765489 2772640 2779345 2786352 2794468 2803485 2812887 2822919 2834126 2846184
62063 2846184 2858033 2869123 2879954 2891388 2903828 2916981 2930068 2942291 2953417 2963812 2973762
62052 2973762 2983046 2991460 2999393 3007343 3015012 3021496 3026391 3030196 3033551 3036528 3038911 3040820 3042745 3045084
62038 3045084 3047844 3050771 3053687 3056727 3060308 3064867 3070610 3077530 3085542 3094545 3104523 3115748 3128740
62025 3128740 3143749 3160275 3177456 3195106 3214165 3235912 3260832 3288434 3317968 3348952 3380897
62014 3380897 3412858 3443495 3471429 3495355 3514126 3527290 3535589 3540566 3543425 3544467 3543634 3541044 3536557
62001 3536557 3529068 3516770 3498238 3473104 3441872 3405401 3364600 3320277 3273092 3223712 3172876
61990 3172876 3121143 3068613 3015064 2960330 2904426 2847514 2790011 2732653 2676180 2620998 2567311
61979 2567311 2515433 2465678 2418145 2372962 2330600 2291466 2255206 2220913 2188187 2157552 2129579
61968 2129579 2103872 2079169 2054306 2028885 2003121 1977213 1951022 1924376 1897574 1871271 1845714
61957 1845714 1820441 1795070 1770096 1746417 1724233 1702959 1682269 1662651 1644778 1628762 1614281
61946 1614281 1601192 1589810 1580714 1574246 1570020 1566991 1564270 1561717 1559411 1556705 1552308 1545199 1534931
61933 1534931 1521150 1503523 1482353 1458606 1433059 1405868 1377148 1347347 1316773 1285390 1253635
61922 1253635 1222937 1194801 1169504 1146219 1124231 1103609 1084750 1067733 1052277 1038117 1025248
61911 1025248 1013751 1003448 993942 985188 977785 972302 968499 965754 964125 964340 966648 970422 975116 980930
61897 980930 988182 996718 1006467 1018019 1032104 1048892 1068321 1090678 1116266 1144858 1176062 1209973
61885 1209973 1246925 1286934 1330008 1376656 1427306 1481261 1536881 1592848 1648800 1704779 1760716
61874 1760716 1816474 1871840 1926308 1979224 2030212 2079093 2125388 2168337 2207483 2242946 2275164
61863 2275164 2304781 2332760 2360166 2387863 2416915 2449324 2487765 2534194 2589056 2652067 2723481
61852 2723481 2804260 2895253 2996465 3107068 3225899 3352007 3484855 3624113 3769408 3920483
61842 3920483 4077556 4241382 4412953 4593179 4782427 4979753 5182164 5384499 5579549
61833 5579549 5757827 5907698 6017117 6076505 6080560 6028034 5920989 5764967 5569059 5344317
61823 5344317 5101081 4847527 4590205 4335033 4087291 3850960 3628543 3421530 3230773
61814 3230773 3056480 2898170 2754915 2625674 2509589 2406224 2315545 2237433 2171058 2114991
61804 2114991 2068139 2030337 2001761 1981995 1970176 1965974 1969801 1981901 2001750 2028687 2062617 2103556
61792 2103556 2150728 2202684 2258225 2316641 2376923 2437235 2495454 2549939 2599455 2642497 2677118
61781 2677118 2701688 2715886 2720966 2719042 2712076 2701468 2688457 2674638 2661864 2651629 2644589 2640697
61769 2640697 2639673 2641208 2644659 2648622 2651061 2649961 2643783 2631251 2611035 2582141 2544610 2499541 2448377
61756 2448377 2392436 2333050 2271628 2209387 2147332 2086684 2028952 1975357 1926511 1882826 1844764
61745 1844764 1812338 1784930 1762209 1744913 1734050 1729516 1730197 1735427 1745594 1761209 1782123 1808117
61733 1808117 1839649 1877387 1921270 1970609 2025170 2085687 2153281 2228703 2312349 2404770 2506893
61722 2506893 2619833 2744688 2882525 3034411 3201382 3384514 3585094 3804553 4044119
61713 4044119 4304644 4586933 4892139 5221527 5575679 5953897 6353983 6771845 7200665
61704 7200665 7630033 8045535 8428887 8758903 9013908 9175426 9231730 9179709 9024751 8779220
61694 8779220 8460161 8086597 7676995 7247547 6811532 6379517 5959854 5558864 5180654
61685 5180654 4827195 4499026 4196031 3917496 3661897 3427433 3213052 3018480 2843024
61676 2843024 2684714 2540989 2409950 2290663 2182554 2085043 1997666 1920016 1851235 1789701
61666 1789701 1733479 1681263 1632814 1588251 1546854 1506942 1467250 1428006 1390018 1352937 1315281
61655 1315281 1276245 1236583 1197454 1159241 1122029 1086427 1053113 1022063 992937 965838 940982
61644 940982 917976 896176 875561 856521 838925 822153 805975 790663 776211 762112 748031
61633 748031 734147 720666 707534 694739 682426 670558 658914 647554 636896 627135 617919 608713
61621 608713 599239 589551 580044 571388 564069 557888 552227 546775 541621 536657 531484 526088 521144 517290
61607 517290 514395 511841 509260 506767 504592 502708 500771 498372 495515 492928 491705 492492 495088 498828
61593 498828 503224 508172 513718 519802 526264 533057 540394 548465 556944 564988 571883 577555 582352 586502
61579 586502 589920 592311 593297 592750 591149 589303 587584 585915 584775 585504 588933 594191 599660 604803 610248
61564 610248 616290 622189 626879 629603 629841 627440 622865 616566 608114 596819 583297 569400 556280
61551 556280 543453 530179 516801 504099 492185 480876 470549 461748 454304 447686 441978 437727
61539 437727 434871 432558 430120 427753 426110 425560 425917 426688 427571 428803 430858 433652 436325 438096 439146
61524 439146 440393 442566 445799 449915 454744 460170 466070 472224 478276 484075 490202 497803 507573 519123
61510 519123 531618 544723 558553 572994 587612 602178 616820 631624 646451 661170 675740
61499 675740 689999 703660 716568 728739 740062 750249 759199 767319 775319 783679 792333 800834 808836
61486 808836 816317 823324 829645 835010 839479 843267 846131 847379 846694 844479 841152 836580 830693 824311
61472 824311 818718 814514 811447 809267 808097 807916 808402 809675 812649 818217 826364 836562 848742 863356
61458 863356 880620 900351 922678 948397 978155 1011616 1047925 1087043 1130195 1178780 1233048
61447 1233048 1292058 1354904 1421762 1493650 1571205 1653854 1740284 1829612 1921687 2015890 2109757
61436 2109757 2199157 2279877 2348841 2403986 2443728 2467058 2473930 2465148 2441980 2406137 2359868 2305703
61424 2305703 2246126 2183697 2121124 2060615 2003094 1948426 1896536 1848111 1804253 1765764 1732755
61413 1732755 1704686 1680788 1660640 1644377 1632161 1623611 1618114 1615593 1616653 1621911 1631448 1644806
61401 1644806 1661167 1679557 1699241 1719997 1741866 1764702 1788261 1812545 1837667 1863414 1889288
61390 1889288 1914958 1940406 1965786 1991482 2018052 2045616 2073477 2100889 2127975 2155184 2181950
61379 2181950 2206686 2228197 2246396 2261554 2273707 2283002 2289870 2294480 2296741 2297155 2296857 2296233 2294108
61366 2294108 2288970 2280606 2270084 2258519 2246360 2233457 2219240 2203157 2185431 2167242 2149780 2133417
61354 2133417 2118117 2104180 2092038 2081613 2072463 2064351 2057103 2050082 2042369 2033575 2024111 2014659 2005562
61341 2005562 1996678 1987673 1978578 1970164 1963520 1959205 1957259 1958179 1963305 1973747 1989407 2009653 2034640
61328 2034640 2065383 2102718 2146820 2197700 2255625 2320873 2393337 2472443 2557303 2647052 2741121
61317 2741121 2838962 2939289 3039721 3137236 3228647 3310569 3379541 3432790 3468803 3487097 3487879
61306 3487879 3472219 3441998 3399136 3345132 3281643 3210928 3135092 3055268 2972210 2887368 2802739
61295 2802739 2719850 2639568 2562725 2490237 2422620 2359983 2302506 2250438 2203697 2161906 2124699
61284 2124699 2091493 2061129 2032355 2004665 1978146 1952625 1927573 1902928 1879410 1857942 1839199
61273 1839199 1823775 1812224 1804718 1801003 1800846 1804196 1810797 1819895 1830463 1841651 1853032 1864502 1875783
61260 1875783 1886002 1894169 1900224 1905120 1909516 1912963 1914919 1915972 1917167 1918537 1919270 1919169 1918953 1919021 1918854
61245 1918854 1917847 1916015 1913698 1911232 1909066 1907448 1905652 1902146 1895896 1887036 1876036 1862717 1846533
61232 1846533 1827492 1806474 1784744 1763218 1742035 1720918 1700174 1681084 1664849 1651397 1639867
61221 1639867 1630054 1622541 1617425 1613877 1611190 1609454 1608880 1609274 1610585 1613302 1617829 1624100 1632283 1643263
61207 1643263 1657824 1675753 1696202 1718570 1742529 1767621 1793348 1819485 1845879 1872164 1898038
61196 1898038 1923572 1948899 1973789 1997883 2021179 2044094 2067216 2091008 2115360 2139287 2161529
61185 2161529 2181629 2199830 2215554 2226573 2230211 2225019 2210851 2187847 2156082 2116052 2068905 2016232
61173 2016232 1959912 1901855 1843376 1784971 1727103 1671000 1618171 1569322 1524254 1482687 1444631
61162 1444631 1409910 1377916 1348014 1319939 1293688 1269253 1246539 1225401 1205739 1187624 1171276
61151 1171276 1156864 1144504 1134554 1127565 1123696 1122297 1122338 1123116 1124394 1126041 1127822 1129455 1130813 1132264
61137 1132264 1134745 1139051 1144875 1151086 1157199 1163939 1171916 1180460 1188540 1196301 1204641 1213406 1221010 1225936
61123 1225936 1227849 1227085 1223959 1219001 1213146 1207050 1200474 1192751 1183599 1173103 1161073 1146772 1129376
61110 1129376 1108619 1085122 1060101 1034607 1009007 983351 958086 934039 911682 890807 871040
61099 871040 852345 834866 818614 803519 789553 776678 764876 754373 745545 738444 732679 727936
61087 727936 724325 722050 721090 721526 723791 728038 733298 737701 739642 738579 734886 729379 723086 717008 711756
61072 711756 707388 703676 700404 697412 694582 691953 689742 688107 686949 685980 684961 683851 682871 682446 682864
61057 682864 683839 684587 684537 683837 682907 681706 679888 677642 675809 674928 674628 674322 674125 674577 675715 677052 678368
61040 678368 679893 681575 682825 683288 683362 683538 683512 682353 679323 674277 667554 659866 652055 644528 637014 629231
61024 629231 621564 614704 608772 603323 598114 593363 589253 585739 582904 581002 579971 579346 578859 578671 578854
61009 578854 579058 578962 578683 578450 578244 578094 578463 579929 582568 585880 589108 591552 592949 593875 595434 598204
60993 598204 601723 605324 609109 613630 618958 624699 630743 637301 644236 650991 657364 663856 671117 679390
60979 679390 688570 698398 708507 718652 729022 739996 751526 763129 774530 785982 797835 810178
60967 810178 822960 836137 849582 863207 877219 891911 907188 922646 938112 953699 969415
60956 969415 985252 1001576 1018803 1036716 1054816 1073365 1093194 1114324 1135806 1157354 1180225
60945 1180225 1205899 1234741 1266655 1302234 1342319 1386895 1435328 1487397 1543480 1604094 1669860
60934 1669860 1741546 1819528 1903527 1993353 2089505 2192682 2303363 2422319 2550704 2688989
60924 2688989 2836629 2993374 3159975 3336899 3523518 3719670 3926969 4147623 4383467
60915 4383467 4637716 4916206 5224707 5565895 5940908 6352797 6806204 7304939 7852956
60906 7852956 8457287 9127486 9873340 10706368 11642207 12697423 13885573 15222358 16733867
60897 16733867 18453029 20410083 22637191 25174227 28026411 31068545 33989806 36385852
60889 36385852 37968634 38722388 38872405 38721751 38523241 38460421 38652568 39092010 39566177
60880 39566177 39699069 39138715 37749508 35653025 33112152 30385342 27656326 25037137
60872 25037137 22589889 20341744 18299614 16464213 14832791 13393528 12125964 11009342
60864 11009342 10026978 9162998 8400460 7724793 7125619 6593635 6118619 5691855 5307732
60855 5307732 4961363 4646869 4359307 4096243 3856092 3636665 3436296 3254268 3088616
60846 3088616 2935065 2789528 2650511 2518210 2392730 2274188 2163121 2059490 1962273 1870836
60836 1870836 1785616 1706781 1633535 1565426 1502869 1445466 1391351 1339313 1290265 1245489 1204655
60825 1204655 1166693 1131354 1098576 1067356 1036623 1006500 977630 950035 923638 899001 876504
60814 876504 855496 835234 815871 797612 779904 762479 746297 732269 719810 707781 696099
60803 696099 685340 675542 666606 659176 653777 649534 644927 639452 633603 627746 622049 617063 613241 610150
60789 610150 607040 603872 601069 598729 596860 595766 595429 595117 594366 593605 593012 591629 588735 585211 582340
60774 582340 579989 577257 574160 571246 568196 564440 560739 558510 557731 557078 556034 555309 555124 554619 553368
60759 553368 552213 552145 553299 555323 557796 559994 561061 560758 559534 557851 556084 554882 554741 555272 555724 556230
60743 556230 557729 560673 564642 569213 574301 579545 584223 588038 591443 595099 599443 604557 609802 613788
60729 613788 615526 615529 615129 614884 614326 613045 611118 608588 605436 602062 599047 596434 593933 591683 590021 588614
60713 588614 586613 583679 580231 576842 574070 572595 572713 573841 575151 576414 577547 577901 577012 575619 574807
60698 574807 574482 573805 572779 572133 571886 571437 570896 570944 571487 571922 572743 575223 579236 582955 585215 586757 588620
60681 588620 590650 592305 593693 594946 595516 594925 593521 591862 589898 587130 583016 577154 569851 562517 556483
60666 556483 551331 545547 538892 532672 527387 521800 515046 508070 501971 496311 490297 484442 479666 475616
60652 475616 471265 466553 462163 458103 453776 449080 444337 439387 433843 428079 422975 418720 414712 410575
60638 410575 406477 402519 398601 394950 392053 389933 388109 386383 385133 384598 384295 383422 381709 379772 378697
60623 378697 379233 381248 383950 386641 389133 391514 393821 396073 398386 400922 403853 407326 411235 415120
60609 415120 418663 422213 426453 431622 437462 443725 450191 456362 461940 467596 474458 482707 491415 499927
60595 499927 508582 517847 527564 537419 547400 557404 567056 576381 585993 596130 606070 614936 622552 629079
60581 629079 634386 638290 640957 642520 642686 641127 637965 633568 628226 622257 616050 609719 603159 596593
60567 596593 590584 585312 580405 575671 571384 567649 564106 560516 556988 553492 549861 546540 544467 543844
60553 543844 543790 543604 543572 544152 545307 547173 550460 555455 561369 567379 573609 580486 587923 595946 605304 616510
60537 616510 628875 641377 653952 666995 680110 692363 703404 713350 721807 728023 731968 734454
60525 734454 736171 737139 736998 735330 731885 727004 721585 716245 710781 704835 698520 691834 684057 674560 663904
60510 663904 653478 644291 636678 630632 625699 620955 615890 611031 607013 603512 599918 596566 594295 593058
60496 593058 592007 590795 589831 589313 588995 588998 589964 592293 595899 600680 606388 612136 617006 621406 626939 634597
60480 634597 643768 653360 663224 674092 686677 701348 718261 737304 758049 780087 803456 828676
60468 828676 856531 887845 923286 963261 1008042 1057805 1112387 1171115 1233083 1297414 1362982
60457 1362982 1427952 1489840 1545961 1593824 1631570 1658618 1675874 1685109 1688261 1687399 1684757 1681993
60445 1681993 1679278 1675438 1669009 1659075 1645403 1628303 1608524 1587187 1565723 1545756 1528714 1515438
60433 1515438 1506341 1501858 1502458 1508394 1520018 1538242 1563924 1596710 1635386 1679566 1730069 1787043
60421 1787043 1848596 1911847 1974571 2035151 2091861 2143414 2190066 2233531 2276186 2320928 2371200
60410 2371200 2430210 2500231 2583103 2680891 2795413 2927672 3078542 3249552 3442239 3657185
60400 3657185 3894563 4155252 4440523 4750694 5084304 5437271 5800969 6160691 6496801
60391 6496801 6787882 7013557 7156663 7205729 7156884 7013747 6786254 6490015 6144982 5771760
60381 5771760 5387593 5005325 4634712 4282763 3953008 3646384 3363574 3105603 2872266
60372 2872266 2661579 2471442 2300769 2148516 2012649 1890808 1781255 1682629 1593428 1512321
60362 1512321 1438561 1371687 1311123 1256222 1206309 1160609 1118552 1080022 1044783 1011862 980306
60351 980306 950392 923130 898563 875544 853337 832395 813245 795590 778961 763451 749276
60340 749276 736275 724316 713583 704065 695300 687033 679613 673386 668124 663332 658628 653652 648159
60327 648159 642510 637527 633517 629857 625808 621335 616922 612972 609546 606335 602753 598471 593858 589454
60313 589454 585049 579926 574035 568281 563503 559768 556739 554107 551554 548958 546760 545463 544643 543170
60299 543170 540639 537890 535906 534850 534328 533863 532785 530451 526970 523221 519846 516832 514250 512654 512290
60284 512290 512578 512796 512767 512536 512033 511518 511719 512899 514233 514725 514485 514628 516086 518884 522385 525922 529305
60267 529305 532947 537410 542817 548821 555012 561012 566342 570758 574695 578859 583381 587853 592063 595978
60253 595978 599069 600465 599987 598374 596371 594265 592342 590940 589781 588070 585630 583313 581999 581772 582336
60238 582336 583534 585174 586971 589040 591869 595550 599546 603302 606405 608108 607651 605330 602388 599506
60224 599506 596295 592591 589203 586772 584860 582915 581357 580852 581193 581704 582302 583396 585166 587677 591330
60209 591330 596488 602834 609587 616132 622083 627208 631795 636765 642913 650289 658565 667638 677566 688343
60195 688343 700094 713065 727172 742082 757971 775522 794909 815526 837128 860481 886384
60184 886384 914789 945491 978914 1015420 1054465 1095243 1137747 1182461 1229351 1277814 1327205
60173 1327205 1376858 1425982 1474082 1520991 1565987 1607526 1644520 1677295 1706509 1731715 1751849
60162 1751849 1766633 1776603 1782156 1783571 1781649 1777401 1771271 1763489 1754996 1747077 1740288 1734612 1730585 1729297
60148 1729297 1731315 1736515 1745098 1757855 1775132 1796341 1820889 1849024 1881358 1917922 1958051 2000931
60136 2000931 2045908 2092401 2139697 2186813 2232557 2275710 2315111 2349620 2378289 2400672 2416715
60125 2416715 2426273 2429104 2425429 2416032 2401542 2382124 2358249 2331328 2303212 2275498 2249655 2227265
60113 2227265 2209474 2196527 2188361 2185431 2188492 2197960 2214043 2237201 2267796 2305388 2348841 2397049
60101 2397049 2449192 2504479 2561944 2620132 2676585 2728038 2771739 2806506 2832190 2848583 2855442
60090 2855442 2853208 2842974 2825827 2802862 2775829 2747204 2719464 2694536 2673841 2658507 2649479 2647609
60078 2647609 2653547 2667514 2689468 2719667 2758786 2807381 2865656 2933858 3012347 3100938 3198745
60067 3198745 3305068 3420000 3543842 3676366 3816899 3964385 4116801 4271085 4424237
60058 4424237 4574108 4718725 4855436 4981309 5093893 5191071 5270701 5331015 5370877 5389201
60048 5389201 5384759 5357232 5307845 5238384 5150248 5045225 4926502 4797994 4663154 4525218
60038 4525218 4387962 4255151 4129541 4013191 3908160 3815953 3736753 3670234 3616767 3576899
60028 3576899 3550243 3535959 3533865 3543827 3564398 3593343 3629184 3670899 3716271 3761993 3805515 3845554
60016 3845554 3880760 3909274 3929958 3942901 3948404 3946572 3938241 3925210 3908941 3889721 3867358 3841920
60004 3841920 3813537 3782282 3748597 3713078 3675622 3635487 3592419 3547051 3500091 3451976 3403507
59993 3403507 3355939 3310135 3266411 3225460 3188643 3156966 3130557 3109437 3094101 3084992 3082153 3085760
59981 3085760 3096240 3113322 3135460 3160534 3186607 3211792 3234089 3251858 3264038 3269649 3267637 3257442
59969 3257442 3239186 3212992 3178698 3136541 3087589 3033246 2974856 2913994 2852423 2791311 2731088
59958 2731088 2672528 2617484 2568082 2525555 2490232 2462183 2441363 2427390 2419731 2418094 2422496 2433122
59946 2433122 2450292 2474299 2505085 2542186 2585049 2633281 2686680 2745209 2808597 2875530 2943382
59935 2943382 3009303 3071386 3128348 3178492 3219951 3251883 3274466 3287544 3290203 3281945 3263515 3236136
59923 3236136 3200608 3157566 3108171 3054218 2997909 2941654 2887555 2836933 2790782 2750592 2718013
59912 2718013 2693602 2676699 2666721 2663892 2668460 2679996 2697759 2721089 2749180 2781188 2816807 2855978
59900 2855978 2897702 2940041 2981803 3023406 3065372 3106638 3145071 3179206 3208845 3234410 3256411
59889 3256411 3275306 3291307 3304453 3315188 3324583 3333801 3343802 3355917 3372205 3394754 3425011 3464055
59877 3464055 3512990 3572588 3643040 3724598 3818043 3924013 4042224 4171857 4312247 4462476
59867 4462476 4620423 4782673 4945061 5102837 5250624 5382912 5494682 5581318 5638410 5662499
59857 5662499 5652302 5608928 5535118 5434686 5312616 5174892 5027516 4875470 4722454 4571429
59847 4571429 4425232 4286612 4157727 4039862 3933872 3840784 3761605 3696617 3645230 3606643
59837 3606643 3580311 3565870 3563080 3571926 3592252 3622997 3662194 3707929 3758983 3814228 3871629 3928097
59825 3928097 3980108 4024293 4057559 4076936 4079523 4063043 4026852 3972288 3901611 3816724 3719212
59814 3719212 3611313 3496048 3376320 3254437 3132491 3012476 2895806 2783300 2675844
59805 2675844 2574588 2480378 2393529 2314269 2242872 2179195 2122689 2072996 2030021 1993282 1961857
59794 1961857 1935105 1912711 1893815 1876836 1860577 1844961 1830405 1817117 1805299 1795355 1787409 1781084
59782 1781084 1776101 1772647 1770888 1770648 1771658 1773379 1774382 1772790 1767808 1760051 1749955 1736755 1719716
59769 1719716 1699530 1677672 1654991 1631819 1608894 1587193 1567081 1548390 1531151 1515584 1501705
59758 1501705 1489663 1480301 1474646 1472872 1474302 1478374 1485216 1495417 1509671 1528427 1551457 1577954
59746 1577954 1607460 1640437 1677365 1717401 1758313 1797570 1833181 1863905 1889416 1910390 1928027
59735 1928027 1943365 1957097 1969672 1981158 1991118 1999055 2005025 2009782 2014633 2021403 2032130 2048319
59723 2048319 2070505 2098781 2133558 2175579 2225477 2283635 2350356 2425869 2510264 2603655 2706366
59712 2706366 2818878 2941530 3073943 3214067 3357433 3497358 3625766 3733847 3812960 3856713
59702 3856713 3863244 3835421 3778883 3700241 3606654 3505398 3402581 3302324 3207314 3119575 3040501
59691 3040501 2970948 2911677 2863167 2824767 2795037 2773438 2760947 2758529 2765839 2781979 2806594 2839460
59679 2839460 2879881 2927532 2983248 3048015 3121645 3203377 3293339 3392485 3501481 3620602 3750404
59668 3750404 3891614 4044598 4209781 4388319 4581398 4789024 5010359 5245082 5493568
59659 5493568 5755775 6030767 6317187 6613230 6915993 7221468 7525299 7823189 8111052
59650 8111052 8385982 8647505 8897391 9138127 9372078 9601884 9830698 10061431 10295964
59641 10295964 10535002 10778017 11022966 11266206 11502793 11726833 11932009 12112527 12263876
59632 12263876 12382777 12466961 12515814 12531248 12517475 12479851 12424140 12356541 12283572 12211589 12146587
59621 12146587 12094293 12059909 12047565 12060239 12100247 12169573 12269791 12401904 12566280 12762633
59611 12762633 12990149 13247610 13532991 13842548 14170307 14508259 14846381 15172020 15469748
59602 15469748 15722675 15914524 16031263 16062298 16001609 15848477 15607499 15288313 14904976 14474224
59592 14474224 14012756 13535364 13054766 12581828 12125057 11690143 11280264 10896228 10535818
59583 10535818 10193540 9861626 9531394 9194433 8844517 8479986 8104113 7722729 7341848
59574 7341848 6967431 6605395 6260079 5933128 5624979 5336813 5069920 4823964 4597400
59565 4597400 4389311 4199392 4026415 3868289 3723774 3592763 3474694 3367911 3270957 3183351
59555 3183351 3104687 3033931 2970058 2912532 2860739 2813610 2770156 2729712 2691347 2653735 2615961
59544 2615961 2577857 2539136 2498745 2455610 2409743 2362226 2314219 2266187 2217974 2169578 2121897
59533 2121897 2076565 2034834 1996770 1961736 1929317 1899447 1872067 1847352 1826066 1809039 1796247
59522 1796247 1786898 1780314 1776224 1774275 1773912 1774921 1777709 1782919 1790862 1801227 1813207 1826032 1839482
59509 1839482 1853596 1867987 1882116 1896374 1912104 1930155 1950228 1972144 1996802 2025110 2056798
59498 2056798 2091273 2128921 2170589 2216452 2266522 2321715 2383131 2450599 2523074 2600224 2682617
59487 2682617 2770727 2864901 2965909 3074170 3188491 3306692 3427315 3549684 3672560 3794176
59477 3794176 3913399 4029416 4140271 4243321 4337424 4423189 4500482 4567048 4620323 4659744
59467 4659744 4686703 4703176 4711057 4712102 4707744 4699214 4688079 4676298 4665817 4658667 4657380 4664463 4681367
59454 4681367 4708580 4746550 4795475 4854044 4919168 4987059 5053792 5114891 5165477 5201188 5218368
59443 5218368 5213521 5183685 5127597 5045783 4939646 4811457 4665159 4505959 4338825 4168132
59433 4168132 3998368 3833570 3675753 3525274 3383167 3251828 3132980 3026345 2930975 2846680
59423 2846680 2773413 2710446 2657115 2613606 2580179 2556376 2541591 2535625 2538016 2547651 2563815 2586998
59411 2586998 2617999 2656854 2703242 2757219 2818848 2887633 2962894 3044132 3130398 3219819 3310329
59400 3310329 3400362 3488218 3571126 3645452 3707583 3754418 3783618 3793853 3784555 3755355 3706367
59389 3706367 3639179 3556806 3462336 3358187 3246840 3131335 3014487 2898190 2783870 2672953
59379 2672953 2566495 2464947 2368706 2278315 2193864 2114930 2041478 1974204 1913673 1859724 1811927
59368 1811927 1769871 1732737 1699420 1669468 1643265 1621061 1602522 1587413 1575800 1567370 1561559 1558545
59356 1558545 1559089 1563068 1569374 1577650 1588752 1602937 1619049 1636447 1656198 1678842 1701973 1721680
59344 1721680 1736190 1747068 1757361 1769641 1785373 1804824 1827479 1853407 1884152 1921483 1965153
59333 1965153 2012373 2059548 2104444 2147307 2190581 2237426 2289992 2348994 2414754 2487966 2569275
59322 2569275 2658919 2757234 2864991 2982851 3111106 3250243 3401105 3564164 3739502 3927975
59312 3927975 4131499 4351425 4587192 4837046 5099220 5371601 5650844 5932564 6212050
59303 6212050 6484453 6745185 6991057 7220666 7433184 7627441 7802884 7960708 8103149
59294 8103149 8231902 8347698 8450634 8539991 8614044 8670804 8708820 8726857 8723245 8696097 8644005
59283 8644005 8566416 8463989 8338912 8194266 8032756 7856631 7668808 7472787 7270940 7063941
59273 7063941 6852600 6639207 6426385 6215618 6007784 5804111 5605652 5412759 5226159
59264 5226159 5047652 4878553 4718245 4565507 4420653 4285044 4159025 4041669 3932323
59255 3932323 3831180 3738439 3653956 3577578 3508921 3446925 3390481 3339432 3294285 3255159 3221665
59244 3221665 3193588 3170943 3153490 3140780 3132507 3128428 3128233 3131809 3139139 3149727 3162801 3178373
59232 3178373 3197088 3218588 3241171 3263874 3287688 3313664 3340851 3367396 3392752 3417417 3441193
59221 3441193 3463203 3483212 3501565 3518197 3533032 3547018 3561408 3576153 3590152 3602951 3615042
59210 3615042 3626621 3637125 3645836 3651877 3653687 3649495 3638289 3619531 3592256 3555443 3509198 3454683
59198 3454683 3393081 3325417 3253063 3177603 3100545 3023946 2950701 2883053 2821255 2764732 2713880
59187 2713880 2669112 2628391 2587527 2543535 2496856 2450229 2406442 2367254 2333330 2304599 2281145
59176 2281145 2263831 2253709 2251090 2255770 2267721 2286833 2312500 2344505 2383932 2432182 2489320 2554412
59164 2554412 2627165 2708283 2798548 2898691 3009876 3133082 3268097 3414118 3571012 3738735
59154 3738735 3915666 4098799 4285440 4473314 4658880 4836793 5001292 5147126 5269138
59145 5269138 5362372 5423291 5450332 5443346 5403391 5333264 5237388 5120950 4989608 4849512 4706372
59134 4706372 4564309 4426252 4295080 4173300 4061895 3960782 3870309 3791041 3722096 3661086
59124 3661086 3606071 3556462 3511878 3471320 3433838 3398920 3365780 3333086 3299737 3265203 3228959
59113 3228959 3190464 3149906 3108186 3065954 3023233 2979902 2935810 2890574 2844264 2798256 2754381
59102 2754381 2713165 2673772 2635702 2599540 2566073 2535700 2508836 2485864 2466459 2449807 2435685
59091 2435685 2424651 2417229 2413575 2413740 2417382 2423518 2431587 2442418 2457053 2474965 2494764 2516358 2540889
59078 2540889 2568590 2598335 2629387 2661945 2695657 2729170 2761681 2793568 2824918 2854684 2881843
59067 2881843 2906177 2927458 2945100 2959263 2971169 2981637 2990233 2996352 3000176 3002080 3002161 3000947 2999611
59054 2999611 2998839 2998239 2997400 2996775 2997107 2998770 3002035 3007133 3013621 3020451 3027070 3033811 3041042 3048786 3057437
59039 3057437 3067947 3081067 3097170 3116910 3140938 3168576 3197561 3225223 3248890 3265116 3269898
59028 3269898 3260282 3234940 3193078 3134098 3058893 2970332 2871834 2766225 2656234 2544881 2434632
59017 2434632 2326951 2223113 2124582 2032215 1945931 1865571 1791229 1722578 1658926 1600263 1547219
59006 1547219 1499683 1456565 1417219 1381952 1350747 1322740 1297417 1275157 1255993 1239091 1224034
58995 1224034 1211518 1202080 1195262 1190622 1188353 1188048 1187985 1186583 1183820 1180552 1177350 1174732 1173645 1174842
58981 1174842 1178400 1184413 1193407 1205555 1220357 1237627 1257994 1281850 1308552 1336926 1365466 1391590
58969 1391590 1411942 1424393 1429168 1427757 1421786 1413334 1404844 1397618 1391109 1384374 1377399 1370537 1363765
58956 1363765 1357296 1351910 1347877 1344394 1340754 1337127 1333510 1328940 1322629 1315108 1307506 1300436 1294078 1288448
58942 1288448 1282950 1276548 1268900 1260437 1250944 1239280 1225054 1209327 1192998 1175795 1157584 1139330
58930 1139330 1121837 1104778 1087988 1072516 1059340 1048117 1038227 1029927 1023532 1018605 1015061 1013949
58918 1013949 1015957 1020190 1025560 1032334 1041159 1051632 1063174 1076287 1091619 1108696 1126929 1146965
58906 1146965 1169549 1193779 1217961 1241514 1264729 1287210 1307984 1326702 1343553 1358565 1372131
58895 1372131 1385650 1400440 1416528 1433548 1452081 1472941 1495851 1520115 1545868 1573335 1601516
58884 1601516 1629029 1655716 1682035 1707524 1731479 1754704 1778977 1805045 1832654 1862291 1895202
58873 1895202 1931666 1970776 2012177 2056756 2105369 2157967 2214183 2273777 2336412 2402043 2471812
58862 2471812 2547645 2630690 2720817 2817861 2922686 3036745 3160958 3295257 3439129 3592751
58852 3592751 3757636 3935756 4127877 4333373 4551815 4783787 5029605 5288158 5557715
58843 5557715 5836995 6124458 6417151 6711024 7001555 7283015 7547673 7786915 7993015
58834 7993015 8159375 8279927 8349681 8365936 8328515 8239321 8102345 7923591 7710216 7469762
58824 7469762 7210123 6938959 6662233 6383894 6107472 5837064 5576134 5326430 5088795
58815 5088795 4863972 4651775 4450787 4260136 4080697 3913518 3758107 3613368 3479058
58806 3479058 3354970 3239764 3132138 3032247 2940414 2855126 2773868 2695349 2619516 2546100 2474734
58795 2474734 2406030 2340995 2279703 2221829 2167980 2119161 2075427 2036364 2002334 1973897 1950524
58784 1950524 1931312 1916429 1906405 1900549 1897644 1897811 1902075 1910375 1921537 1935025 1951316 1970733
58772 1970733 1993325 2019760 2050968 2086898 2126847 2170886 2219849 2274139 2333596 2398307 2468486
58761 2468486 2543915 2624504 2711036 2804354 2904386 3011038 3125346 3248500 3380419 3520723
58751 3520723 3670514 3831738 4005218 4190748 4388610 4599503 4823325 5059400 5307346
58742 5307346 5566257 5833399 6105174 6378824 6651618 6918684 7173029 7407288 7614088
58733 7614088 7785508 7914208 7995193 8025505 8003111 7928010 7803880 7636822 7432708 7197275
58723 7197275 6937885 6662866 6379031 6091502 5805394 5525468 5254234 4992451 4741560
58714 4741560 4503763 4279837 4068906 3870436 3684617 3510791 3347592 3194838 3053393
58705 3053393 2922963 2801902 2689365 2585718 2490529 2402122 2319591 2243547 2174408 2111587
58695 2111587 2054764 2004354 1960316 1921987 1889419 1863399 1843926 1830155 1822016 1820301 1824840 1834213
58683 1834213 1847623 1865649 1888909 1917376 1950999 1989217 2029333 2066732 2096990 2116785 2123219
58672 2123219 2114425 2091289 2056983 2014414 1965446 1912413 1858351 1805151 1752957 1701650 1651521
58661 1651521 1602364 1553549 1505243 1458089 1411683 1364942 1318034 1272247 1227947 1184463 1142059
58650 1142059 1102128 1065271 1030954 999176 970558 944693 920354 897519 877170 858997 841484
58639 841484 824486 809426 796500 784046 771224 759064 748125 737392 726375 716155 707394 699330
58627 699330 691684 685565 681424 678052 674736 672672 673071 675465 678953 683642 689860 697370 706281 717380
58613 717380 730765 745477 761080 778124 796493 814949 832945 851205 869820 887394 902762
58602 902762 915958 926822 934354 938203 939193 937697 933106 925433 915740 904333 890304 873446 854866
58589 854866 835196 814173 792633 772873 756177 741826 729179 718701 710306 702929 696694 693394
58577 693394 693780 696387 699951 704878 711419 718677 726552 736410 748615 761582 774535 789000 806170
58564 806170 825044 844659 865984 889957 915737 942637 971845 1004507 1039973 1077708 1119073
58553 1119073 1165392 1215953 1269753 1327510 1390125 1456752 1526263 1599197 1676453 1757393 1840823
58542 1840823 1926299 2012606 2096383 2174021 2243672 2303769 2351071 2382162 2395923 2393011 2374219
58531 2374219 2340993 2296412 2243887 2185694 2123861 2061171 1999872 1940620 1884016 1831852 1785653
58520 1785653 1745431 1711154 1683824 1663716 1649364 1639883 1636678 1641132 1652151 1667756 1687617 1712202
58508 1712202 1740967 1773399 1810687 1854422 1904632 1960497 2021599 2086525 2151213 2210234 2258675
58497 2258675 2291534 2302974 2288497 2247583 2183294 2100511 2005423 1904716 1803126 1702547 1604440
58486 1604440 1511543 1425937 1347280 1274538 1207931 1147767 1093183 1043679 1000147 962697 929234
58475 929234 897936 869378 844474 822281 801800 783953 769441 756414 742712 729017 717473
58464 717473 708467 700938 694547 689321 684357 678951 673956 670271 667317 664714 663775 665340 667836 669611
58450 669611 671575 675308 680152 684585 689030 694921 702326 710801 721232 734475 749452 764878 781594
58437 781594 800994 822546 845211 869924 898320 930320 965265 1003960 1047128 1093165 1139791
58426 1139791 1186512 1232963 1276259 1312669 1340832 1361087 1373072 1376488 1372606 1362177 1343104 1313013
58414 1313013 1273136 1227178 1177642 1125814 1073897 1024111 976597 930794 887808 848993 813602
58403 813602 780537 751036 726736 706416 687632 670388 656177 644511 633516 623112 614638 608108
58391 608108 602550 598281 596152 595398 594734 594541 595614 597036 597812 599186 602674 607308 611567 616354 623096
58376 623096 630585 636891 642858 650484 659286 667501 675293 683315 689698 692069 691121 688717 683998 675240
58362 675240 664089 653950 645332 636647 628327 622123 617477 612684 608622 607261 607601 607336 607541 611307
58348 611307 618547 626521 634774 645053 656900 667938 678203 689750 702039 711959 718366 722608 724844
58335 724844 723889 720482 716661 712143 705264 697034 690255 685131 679914 675277 673592 674362 674892 675183 677496
58320 677496 681276 683106 681799 679172 675925 671284 666607 664665 665095 664904 663520 663045 663716 663698 663346 665092
58304 665092 669103 673444 678365 685793 694833 702631 709580 718763 730302 741294 751310 762850 776291
58291 776291 789548 802893 818838 836973 854040 869329 884822 899873 911243 918653 924842 929797
58279 929797 930584 927393 924065 921972 918952 914861 912457 912131 911446 910592 912572 917359 921753 925656 932472
58264 932472 942566 952595 962215 975078 991958 1009161 1025080 1042222 1061443 1080394 1099042 1120543
58252 1120543 1145192 1169513 1192629 1217390 1244020 1268851 1290459 1310815 1329491 1343455 1353634
58241 1353634 1364823 1378094 1390254 1401624 1416628 1435493 1453360 1469259 1487997 1511373 1535673
58230 1535673 1559886 1588027 1620971 1654369 1687286 1724530 1767508 1811276 1853818 1900058 1953361
58219 1953361 2011149 2072176 2139904 2215296 2294450 2376772 2467292 2567459 2671729 2776380 2883075
58208 2883075 2990331 3090242 3177372 3252455 3314185 3356664 3378826 3387505 3387759 3379385 3366015 3357229
58196 3357229 3357370 3362103 3369891 3386614 3414970 3450182 3490652 3542061 3606561 3679061 3758710 3852600
58184 3852600 3963526 4085881 4218094 4366552 4532472 4708206 4891915 5092285 5313217
58175 5313217 5548141 5795396 6064328 6359572 6674535 7007230 7366550 7755293 8163339
58166 8163339 8585641 9030204 9500357 9987161 10488474 11017110 11580731 12172996 12794740
58157 12794740 13463781 14193056 14980016 15828556 16758353 17779576 18881494 20059346 21328766
58148 21328766 22701936 24178442 25775955 27541677 29517495 31724324 34195817 36989953
58140 36989953 40146482 43672229 47593052 51981661 56913738 62446259 68663424 75682546
58132 75682546 83581191 92390823 102212395 113278756 125896887 140469029 157560264
58125 157560264 177493410 199291604 219932171 235161373 241657309 238749933 228295936
58118 228295936 213184086 195969991 178399667 161491279 145710924 131180972 117920883
58111 117920883 105961231 95289443 85806222 77387913 69939187 63362689 57538521 52368803
58103 52368803 47803083 43797990 40288616 37214985 34538046 32212024 30174334 28378346
58095 28378346 26807149 25443870 24256628 23221488 22331970 21577743 20940387 20416267 20017670
58086 20017670 19746953 19594704 19565192 19677692 19942340 20360343 20944794 21713643 22668315
58077 22668315 23810964 25178740 26838580 28874073 31407739 34555649 38204525 41789184
58069 41789184 44419285 45375341 44531523 42318776 39351588 36120179 32921462 29904966
58061 29904966 27115417 24542766 22181874 20047480 18143086 16448368 14942072 13612325
58053 13612325 12441171 11402360 10479664 9669470 8962888 8341668 7792477 7309249 6881084
58044 6881084 6492928 6138495 5818777 5528382 5256657 5001222 4767225 4554221 4356326
58035 4356326 4174102 4013704 3874767 3750239 3636688 3533467 3433278 3325246 3206973
58026 3206973 3083663 2956839 2824107 2688413 2556867 2431036 2307767 2188414 2077859
58017 2077859 1975744 1877909 1785244 1702148 1627494 1556054 1487665 1426293 1371258 1318001 1266422
58006 1266422 1220062 1178180 1136930 1097225 1063130 1033457 1003142 972059 944428 920365 896050
57995 896050 871587 850728 833235 815149 796380 780574 767718 754100 739436 726915 716318
57984 716318 703979 689544 676154 664071 650690 636665 625455 616801 607006 595609 585582 577036
57972 577036 567011 555592 546106 539017 531451 522871 515529 509285 501676 493173 486824 482658 478004 473240
57958 473240 471605 473210 474791 475556 477881 482115 486183 490533 498029 508551 518940 528620 540181 554178
57944 554178 568563 583528 601644 622755 643863 664512 687153 711649 734514 754250 772391
57933 772391 788481 799048 802610 801078 795295 783813 766951 747463 726150 701220 673054 645244
57921 645244 619712 594881 569812 546182 525084 505631 487709 472492 459470 446591 434049
57910 434049 424294 417732 412129 406808 403609 403090 403492 404058 405617 407461 407551 406449 407120 410127 412787 413649
57894 413649 413848 413513 410950 406292 401879 398052 392502 384816 377657 372332 367108 361261 356889 355202 354606
57879 354606 354008 354639 357212 360517 364126 369190 375353 380258 383352 386863 391728 395950 398294 400184 402338
57864 402338 402846 400228 395414 389157 380591 369841 359081 349353 339141 327635 316521 307003 297884
57851 297884 288227 279194 271718 264953 258539 253756 250933 248284 244841 241999 240759 239948 238580 237512
57837 237512 237321 237035 236325 236473 237817 238786 238816 239624 242168 244938 246817 249007 252482 256033 258570 261035
57821 261035 264288 267371 269496 271509 273745 274601 272960 270078 267498 265057 262288 259761 257592 254699
57807 254699 250921 247840 246284 245155 243894 243689 244919 245931 245840 246057 247489 248824 249395 251100 255349
57792 255349 260520 264664 268506 273377 278257 281390 283243 285433 288130 290553 292660 294339 294314 291899 288545
57777 288545 285825 283204 279574 275555 272361 269689 266654 263696 261716 260365 258878 257561 256908 256300 255074
57762 255074 253836 253253 252671 251278 249476 247797 245726 242929 240302 238456 236436 233247 229300 225114 220164
57747 220164 214385 209149 205191 201167 195962 190808 187290 184752 181713 178540 176638 176040 175802 175940 177063
57732 177063 178863 180654 182714 185602 188933 192197 195883 200459 205286 210014 215891 224098 233788 243341
57718 243341 252557 262031 271315 279336 285780 290583 292995 292693 290954 289212 287269 284334 280828 277588
57704 277588 274211 269771 264424 258902 253258 247433 242066 237304 231871 224873 217584 211878 207855 204536
57690 204536 201756 199679 197494 194500 191672 190398 190387 190530 190895 192035 193162 193087 192408 192837 194730 197051
57674 197051 199334 201899 204464 206262 207349 208311 209103 209602 210788 213777 218084 222373 226446 230948 235722
57659 235722 240190 244949 251107 258304 265098 271208 277682 284923 292156 298896 305461 311998 318378 325072
57645 325072 332787 341179 349145 356422 363806 371856 380566 390241 401556 414644 429066 444673 461669
57632 461669 479914 498831 517800 536161 553460 570421 588924 610216 633879 659416 687812
57621 687812 720381 757080 797303 841540 890783 945144 1004566 1070160 1143183 1223219 1308896
57610 1308896 1399793 1496053 1596679 1699921 1804817 1910466 2013770 2109216 2190430 2250507
57600 2250507 2281847 2278648 2240705 2173809 2086202 1985404 1877581 1767699 1659405 1555490
57590 1555490 1458367 1369255 1287459 1211788 1142514 1080766 1026471 978255 935064 896603 862582
57579 862582 832929 808311 788972 773439 759847 748155 739538 733997 730317 728066 727941 730292 734964
57566 734964 742370 752969 765837 779537 794332 811774 832216 854618 878845 906222 937500 972091
57554 972091 1009658 1050735 1095386 1142837 1192777 1245394 1299709 1353406 1404650 1452510 1495242
57543 1495242 1529823 1553742 1565855 1565104 1550168 1521148 1480328 1430563 1374071 1313190 1250804 1189055
57531 1189055 1128544 1069295 1011650 955961 902552 852320 806275 764257 725190 688768 655584
57520 655584 625499 597383 570834 546642 525071 505147 486192 468610 452476 436822 421146
57509 421146 406439 393822 383211 374055 366388 360321 355383 351108 347602 344966 342847 340979 339470
57496 339470 338265 337105 336225 336185 336906 337818 339079 341467 344996 348918 353269 358990 366108 373266 379656
57481 379656 386093 393501 401587 409732 418121 427245 437238 448290 460761 474417 488559 503365 519991
57468 519991 538883 559190 580403 603353 628861 656519 685539 715832 747564 780642 815228
57457 815228 851788 890039 928832 967554 1006521 1045366 1082234 1115152 1143029 1164609 1177839
57446 1177839 1181244 1174980 1159764 1135888 1104143 1066566 1025243 981288 935822 890874 848216 808131
57434 808131 770234 734659 701607 670714 641838 615655 592538 571738 552616 535815 522190
57423 522190 511409 502617 495693 490820 487515 485178 483952 484114 485369 487702 492135 499434 508633 518056
57409 518056 527396 537773 550108 564467 580701 598769 618549 640025 663509 689219 717017 746929
57397 746929 779323 814160 850781 888895 928847 970212 1010951 1048720 1082197 1110334 1131239
57386 1131239 1142875 1144316 1135555 1116829 1089084 1054415 1015032 972255 927146 881316 836191 792095
57374 792095 748998 707538 668556 632315 599008 569225 542986 519109 496444 475007 455079
57363 455079 436214 418195 401945 388171 375997 364296 353549 344869 337900 331312 324902 319611
57351 319611 315725 312512 309428 306345 302873 298835 295207 293204 292561 291912 290711 289531 288702 288042 287808
57336 287808 288566 290059 291390 292351 293448 294716 295771 297017 299502 303401 307726 311658 315162 318327 321147
57321 321147 324046 327539 331315 334613 337501 340736 344415 347893 351045 354405 357946 360901 363032 365019
57307 365019 367297 369529 371432 373204 374904 376382 378038 380686 384363 388132 391380 394490 398007 401893
57293 401893 405845 409667 413172 416369 419787 423885 428176 431766 434722 437961 441749 445298 448115 450875
57279 450875 454614 459677 465688 471992 478070 484025 490560 497966 505505 512476 519389 527086 535179 542620
57265 542620 549541 557116 565670 574329 582630 591053 599828 608566 617377 626955 637144 646737 655179 663285
57251 663285 671822 680557 689192 697995 706939 715371 723144 731034 739460 747947 756440 765999 777322 789534
57237 789534 801331 812542 823784 835294 846862 858364 869730 880863 892032 903755 916049
57226 916049 928480 941171 954808 969384 983954 998130 1012739 1028459 1044799 1061034 1077160
57215 1077160 1093333 1109320 1125204 1141577 1158271 1173822 1186984 1197916 1207136 1214355 1219243 1222425
57203 1222425 1224654 1225728 1225216 1223624 1221943 1220547 1219320 1218288 1217379 1216183 1214660 1213469 1212981 1212755 1212637
57188 1212637 1213446 1215707 1218628 1221304 1224147 1228007 1232569 1236692 1239834 1242177 1243822 1244793 1245400 1245854 1245984
57173 1245984 1245905 1246235 1247049 1247579 1247681 1248569 1251231 1255253 1260215 1266954 1276161 1286937 1298300 1310996 1326039
57158 1326039 1342422 1358265 1373565 1389763 1406920 1423207 1437076 1448239 1456771 1462971 1468006 1472960
57146 1472960 1477252 1479485 1479706 1479200 1478250 1475857 1471646 1466301 1460059 1452450 1443667 1434535 1425018 1414409
57132 1414409 1403136 1392627 1383195 1373780 1363971 1354505 1345435 1335673 1324818 1313719 1302733 1291219
57120 1291219 1279328 1268533 1259606 1251588 1243447 1235203 1226761 1217283 1206575 1195634 1184897 1173167
57108 1173167 1158931 1141540 1120766 1096698 1070459 1043198 1013777 979165 937710 890181 837105
57097 837105 777471 711197 640625 568009 493372 416311 338079 260133 182083 102753 22055
57085 -59615 -142544 -226788 -311375 -395524 -479458 -562987 -644887 -724852 -804673 -886533 -971833 -1062441
57073 -1062441 -1160804 -1267548 -1381352 -1502674 -1635338 -1783018 -1946854 -2128404 -2332167 -2562948
57063 -2562948 -2823491 -3117170 -3450230 -3828417 -4253674 -4726695 -5250041 -5825959 -6454237
57054 -6454237 -7135853 -7876284 -8682077 -9557376 -10507820 -11545120 -12683964 -13937723 -15321794
57045 -15321794 -16858421 -18574238 -20497421 -22663296 -25120143 -27924934 -31138129 -34829026
57037 -34829026 -39081771 -43989397 -49647265 -56159694 -63645572 -72226394 -82014550 -93123356
57029 -93123356 -105676663 -119786515 -135519912 -152895337 -171896830 -192477665 -214589710
57022 -214589710 -238259714 -263568254 -290335317 -317621367 -343527546 -365665312 -382051339
57015 -382051339 -391748813 -394838109 -391929720 -383721719 -370860525 -354007584 -333918573
57008 -333918573 -311448893 -287493788 -262899173 -238388467 -214538644 -191794853 -170486554
57001 -170486554 -150831968 -132945828 -116856743 -102524257 -89854177 -78719951 -68984949
56994 -68984949 -60511908 -53161851 -46797043 -41289367 -36523172 -32392029 -28799234 -25661997
56986 -25661997 -22910406 -20482510 -18324950 -16397682 -14672513 -13125996 -11736864 -10488701
56978 -10488701 -9368947 -8363910 -7458414 -6640358 -5901466 -5233285 -4626595 -4075203 -3576335
56969 -3576335 -3126367 -2719464 -2350811 -2017735 -1717064 -1444578 -1197510 -974405 -772059
56960 -772059 -585732 -412918 -253895 -108151 26674 151872 266870 372210 470342 562609
56950 562609 648067 726014 797031 860778 915488 960707 998334 1030228 1056932 1079316 1099125
56939 1099125 1117075 1132436 1145082 1156098 1166028 1174546 1182072 1189642 1197038 1203210 1208528 1214371 1220660
56926 1220660 1226369 1232388 1241194 1253756 1269551 1289417 1315400 1348270 1388526 1438155 1494613 1541329
56914 1541329 1550773 1502742 1398883 1258425 1103493 950272 808351 681412 568270 466783
56904 466783 377220 300762 236611 182927 139178 105245 79489 59903 45962 37253 31487 25951
56892 25951 19758 12752 3612 -8574 -22046 -34100 -44359 -54179 -63656 -71563 -77639 -82691 -86733 -89058
56878 -89058 -89870 -89955 -88820 -84960 -77939 -68755 -58199 -46033 -31664 -14695 4554 23939 39563 48424
56864 48424 50655 48324 42924 35288 26842 19030 11850 4508 -2761 -8847 -13337 -16694 -19286 -21389
56850 -21389 -23692 -26485 -28824 -29714 -29638 -29745 -30152 -30303 -30323 -30560 -30396 -29045 -27124 -25914 -25339 -24177 -21998
56833 -21998 -19476 -16876 -13681 -9733 -5613 -1761 1863 5441 9503 15120 22830 31551 39360 45042
56819 45042 48317 49331 48946 48780 49783 51339 52808 55151 59784 66567 74317 82633 91848 101852 112531
56804 112531 124775 139457 155957 173361 192618 215649 242344 269995 295415 316102 329756
56793 329756 334900 332533 325709 317011 307408 297376 287691 278896 271218 265213 261588 260497 261974 266747
56779 266747 275450 287445 301736 318733 339751 365109 394100 426248 460594 493804 520901 538385
56767 538385 545526 542959 531807 514309 493361 470856 447601 424943 404913 388506 375258 364817
56755 364817 357589 353641 352356 353463 357216 363483 372011 383535 399148 418470 439814 461893 483439
56742 483439 501140 510341 508715 497830 480751 459802 437007 414495 393324 373372 355133 340049
56730 340049 328329 318260 308695 300698 295612 293063 292092 292830 295702 300214 305934 313610 323755 334702
56716 334702 343380 347615 346828 341239 331517 318879 304559 289351 274014 259506 246303 234116 222771
56703 222771 212593 203521 194761 185974 177960 171459 166051 160923 156002 151675 148018 144904 142241 139629
56689 139629 136500 133045 130252 128591 127491 126515 126052 126307 126607 126421 126153 126200 126159 125681 125286 125456 125701 125347
56671 125347 124586 123961 123394 122496 121341 120301 119525 119104 119215 119662 119872 119718 119689 119944 119954 119465 118957 118759 118570
56652 118570 118350 118750 120141 122051 124037 126260 128696 130744 132118 133245 134240 134484 133782 132917 132490 132219
56636 132219 131956 132268 133316 134306 134805 135484 136719 137635 137484 136853 136482 135964 134768 133585 133378 133913 134323
56619 134323 134411 134321 133700 132391 131307 131475 132715 134216 135806 137676 139530 141088 142791 144908 146516 146503
56603 146503 145183 143888 143347 143325 143420 143237 142278 140543 138916 138168 138000 137715 137295 137063 136939 136837 137176 138190
56585 138190 139270 139748 139786 139878 140212 141131 143271 146433 149279 151030 152437 154126 155118 154324 152484 151181
56569 151181 150611 149776 148323 146809 145580 144695 144553 145386 146538 147296 147906 148718 149056 148267 147259 147522 149026
56552 149026 150481 151324 152072 152945 153530 153759 154056 154527 154964 155518 156463 157593 158651 159971 161771 163356 164011
56535 164011 164158 164641 165431 166135 167148 169048 171340 173091 174343 175725 177125 177952 178299 178673 179045 179363
56519 179363 180378 182671 185356 187091 187877 188589 189385 190046 191168 193300 195432 196177 196117 197217 200062 203417
56503 203417 206368 209187 212163 215386 219683 226008 233617 240478 245731 250359 255276 260318 265361 270879
56489 270879 276995 283193 289308 295614 301800 307012 311065 314431 316981 318041 317760 317213 317015 316979 317049 317264
56473 317264 316821 314519 310247 304832 298541 291177 283566 277331 272913 269171 265101 260695 256023 250912
56459 250912 245733 241150 236947 232340 227433 223022 219060 214873 210836 208076 206306 203780 199836 195882
56445 195882 193312 191932 190926 190003 189019 187734 186398 185459 184501 182698 180430 179037 178830 178892 179002 180048
56429 180048 182109 183825 184286 184106 184052 184074 184246 185175 186821 188230 189045 189990 191310 192146 192087 192103 193241 195468
56411 195468 198317 201533 204623 206882 208329 209575 210581 210760 210470 211005 212831 215207 217747 220897 224630
56396 224630 228248 231757 235855 240250 243674 245939 248282 251234 253900 255816 257693 259765 261256 262108
56382 262108 263354 265133 266250 266548 267688 270613 274109 276899 279287 281593 282857 282503 281625 281229 280646
56367 280646 278983 276701 274452 271776 268266 264743 261980 259482 256677 254026 251908 249735 247316 245704
56353 245704 245450 245372 244297 242727 241493 240091 237715 234776 232049 229392 226528 223999 222167 220362 218111
56338 218111 216073 214712 213328 211471 209926 209159 208213 206409 204753 204219 203986 202820 201023 199613 198772
56323 198772 198453 199240 201153 202815 203270 203477 204538 205757 206037 206029 207095 209050 210629 211415 211776 211720 211269
56306 211269 211234 212252 213785 215251 217200 220127 223111 224977 225889 226575 226973 226941 227219 228359 229654 230421
56290 230421 231265 232887 234826 236693 239333 243241 247090 249457 250959 253075 255896 258554 260841 262909
56276 262909 264423 265491 267333 270563 273971 276431 278687 281671 284498 285961 286718 288102 290006 291838
56262 291838 294348 298381 302942 306627 310009 314555 320043 325152 329803 334859 340257 345371 350507 356136
56248 356136 361435 365424 368782 372682 376727 379966 382946 386685 390486 392919 394270 395973 398324 400717
56234 400717 403379 406745 409829 411253 411325 411294 411358 411325 412178 414830 418154 420484 422304 425277 429442 433671
56218 433671 438083 443596 449725 455237 460580 467408 476137 486029 497111 509898 523839 538100 553221
56205 553221 570020 587796 605764 625160 647453 671622 695886 721181 749933 782162 815858
56194 815858 850668 888088 928265 969662 1011797 1055474 1100236 1144276 1186878 1228361 1267711
56183 1267711 1302842 1333086 1358881 1379317 1392725 1399559 1401902 1400232 1393487 1382249 1368941 1354689
56171 1354689 1338762 1321281 1303660 1286069 1267207 1247000 1226953 1207503 1187486 1166511 1145437
56160 1145437 1124233 1101833 1078307 1054846 1031415 1006758 980864 955129 930053 905093 880642
56149 880642 857694 835683 813209 790758 770124 751296 732621 713924 696760 681652 667877
56138 667877 655750 646200 638186 629506 620164 611992 605111 597910 590444 584519 580234 575722 570616 566481
56124 566481 563558 560341 556852 555026 555293 555923 556254 557463 559687 561480 562678 564745 567871 570726 573450
56109 573450 577795 583955 590380 596910 604877 613938 622214 629810 638762 649256 659410 668950 679469
56096 679469 690916 701640 712037 724022 736654 746656 753797 761398 770924 780642 790349 802529
56084 802529 817533 832411 846171 861710 880899 902191 924876 951288 982778 1017709 1055503
56073 1055503 1098728 1149098 1205277 1266625 1335388 1413282 1499621 1594539 1700158 1816525 1939752
56062 1939752 2065452 2190174 2308478 2413555 2503091 2580627 2649529 2709773 2761929 2808908
56052 2808908 2851087 2884308 2905408 2915674 2916776 2908010 2890127 2867143 2841166 2809187 2767399 2714603
56040 2714603 2649327 2568644 2473009 2368183 2259672 2149382 2039828 1936381 1842155 1755299
56030 1755299 1674498 1602525 1541181 1487462 1438198 1394163 1356297 1322335 1290556 1262557 1239034
56019 1239034 1217213 1195570 1176645 1162053 1149355 1136959 1127207 1121397 1116848 1112216 1110473 1113047
56007 1113047 1116371 1117956 1120527 1126314 1132798 1138137 1145132 1155496 1165915 1174269 1184008 1197688 1211954
55994 1211954 1223921 1236679 1253263 1270874 1286509 1302669 1321954 1341577 1358881 1376743 1397830
55983 1397830 1419164 1438191 1458483 1483321 1509333 1532736 1556234 1583339 1611567 1637936 1665606
55972 1665606 1698371 1733868 1768756 1805102 1845261 1886291 1926023 1968566 2017097 2067492 2115919
55961 2115919 2166030 2221583 2279083 2335419 2395387 2463405 2535028 2605253 2677898 2757871 2841668
55950 2841668 2924968 3012098 3108208 3209656 3312347 3421988 3545493 3679751 3819626 3969177
55940 3969177 4133724 4308894 4489457 4681099 4891300 5116807 5352713 5605371 5883025
55931 5883025 6182238 6497264 6833779 7198770 7585929 7986323 8404381 8847759 9311312
55922 9311312 9787952 10285576 10815820 11376438 11963192 12588400 13268276 14003286 14791409
55913 14791409 15648205 16590936 17614990 18709902 19886110 21161689 22538701 24022343
55905 24022343 25649806 27470358 29512348 31801236 34390127 37333110 40646267 44337747
55897 44337747 48459802 53089737 58285880 64116073 70703243 78183728 86658912 96270536
55889 96270536 107290412 120046570 134815612 151884130 171488806 193147445 214734583
55882 214734583 232530430 242813761 243843179 236495654 223231474 206626483 188633386
55875 188633386 170567705 153252816 137119128 122358387 109078535 97317822 86990397
55868 86990397 77925441 69964104 62977353 56825629 51372616 46534470 42267858 38516418
55860 38516418 35207167 32286175 29715793 27443302 25408347 23576223 21932983 20453978
55852 20453978 19105995 17873511 16754268 15733520 14787987 13910002 13103200 12358861 11659576
55843 11659576 11002068 10394318 9833720 9308780 8818638 8370613 7961239 7578672 7221031
55834 7221031 6894195 6594212 6309590 6038709 5788064 5555415 5331090 5114087 4911056
55825 4911056 4720931 4535820 4355668 4187237 4029777 3876075 3726673 3589129 3463947
55816 3463947 3344687 3231320 3130235 3041310 2957824 2879279 2812164 2757771 2710825 2670385 2640773
55805 2640773 2621113 2604378 2586996 2569344 2546966 2511735 2462182 2403341 2336699 2259874 2175657
55794 2175657 2091231 2008133 1922402 1834741 1751158 1673374 1597860 1524652 1458002 1397836 1339551
55783 1339551 1282873 1232383 1188838 1148438 1111126 1081102 1058633 1039765 1024610 1017214 1016277 1014516
55771 1014516 1008530 1001325 994016 983238 968376 953415 939660 923832 905081 886769 869653 850250
55759 850250 827650 805166 783641 759875 733461 708588 687156 666348 644823 625229 608752
55748 608752 593102 577605 564581 554179 543541 532571 524740 520718 516980 512170 508993 508226 506738
55735 506738 503320 500757 500151 498732 495240 492035 489827 485704 478594 471565 466408 460831 453237 445535
55721 445535 439086 432439 425246 419996 417749 416365 414729 414367 415129 413813 409080 403411 398334 392030 383539
55706 383539 374976 367530 359543 350562 343089 338216 333573 327624 321946 317262 311423 303576 296304 291303
55692 291303 286784 281452 277157 275086 273021 269003 264381 260707 256810 251381 245504 240249 234627 228022
55678 228022 221804 216521 210455 202993 196580 193243 191867 190794 190293 190589 190183 188199 185923 184258 182090
55663 182090 178686 175158 172151 168734 164903 162355 161394 159988 157264 154980 154140 153298 151747 151140 152162
55648 152162 152752 151615 150497 151044 152248 152949 154019 156067 157738 158197 158672 159691 159598 157685 155994 155993 156231
55631 156231 155280 154284 154486 154976 155044 156144 159224 162602 164807 167163 171353 176646 181725 187013 192982 198283
55615 198283 201651 203636 204619 203355 199470 195099 191959 188943 184599 179687 175219 170358 164534 159355
55601 159355 156077 153329 149779 146888 146474 147450 147664 147302 147839 149085 149775 149889 150182 150523 150657 151368 153026
55584 153026 154286 153967 152842 151975 150819 148661 146288 144454 142259 138860 135177 132215 129351 125969 123062
55569 123062 121419 119924 117560 115294 114146 113163 111273 109351 108308 106911 103760 99931 97407 96197
55555 96197 95091 93874 92747 90893 87763 84610 82834 82021 81276 80997 81503 81510 80061 78473 78232 78421 77430
55538 77430 75854 75300 75498 74941 73457 72016 70855 69813 69591 70720 72086 72328 71812 71553 71295 70434 69777
55521 69777 70521 72398 74505 76876 79640 81880 83134 84847 88458 93178 97359 100889 104552 108348 112295
55506 112295 117533 124717 132543 139731 147004 155134 162570 167322 169803 171446 171803 169575 165439 161204
55492 161204 156960 151543 145067 138605 132049 124697 117360 111506 106785 101684 96216 91733 88408 85101
55478 85101 81469 78271 75785 73710 72319 71974 71883 70963 69507 68496 67889 67139 66612 66813 66986 66178 64919
55461 64919 64178 63582 62451 61594 62140 63487 64300 64668 65342 65825 65285 64441 64399 64569 63901 63167 63695 64796
55443 64796 64884 64328 64625 65463 65205 63758 62374 61109 59060 56677 55196 54137 51974 49048 47145 46335
55427 46335 44906 42434 40315 39223 38498 38151 38867 39915 39550 37798 36418 35879 34872 33085 31893 31744
55411 31744 31315 29987 28895 28806 29014 29021 29286 29627 28897 26959 25203 24452 24065 23656 23815 24550 24857 24569 24922
55392 24922 26500 28160 28644 27887 26278 24121 22259 21710 22244 22682 22821 23510 24720 25320 25102 25125 25602
55375 25602 25357 24004 22818 22644 22634 21936 21123 21075 21733 22797 24415 26439 28041 28698 28648 28087 27089 26470
55357 26470 27367 29572 31568 32580 33284 34160 34559 33894 32570 31321 30660 31095 32721 34563 35535 35971 36756
55340 36756 37306 36293 34348 33836 35552 37732 38935 39868 41512 43360 44578 45341 45922 45827 44841 43742
55324 43742 43126 42624 41910 41330 40947 40220 39228 38923 39544 40021 39554 38521 37336 35752 33875 32461 31596
55307 31596 30414 28736 27541 27154 26541 25218 24357 24973 26342 27288 27831 28495 29045 28995 28562 28219 28046 28171
55289 28171 28920 29911 30035 29005 27896 27487 27118 25993 24585 23835 23842 24162 24635 25242 25786 26328 27164 27983
55271 27983 27884 26672 25263 24378 23796 23294 23259 23839 24434 24589 24568 24708 25030 25658 26609 27112 26396 25255 25358
55252 25358 26697 27411 26545 25308 24932 25033 24986 25245 26106 26593 25835 24412 23237 22259 21341 21231 22399 23920
55234 23920 24754 25261 26320 27718 28579 28754 28727 28708 28722 29028 29627 29927 29513 28645 27536 26025 24506 24151
55216 24151 25390 27071 27936 28085 28258 28560 28772 29106 29758 30350 30515 30393 30035 29095 27669 26535 26030 25596
55198 25596 24973 24787 25369 26074 26401 26673 26965 26582 25363 24282 23924 23628 23026 23034 24202 25377 25352 24683 24474
55179 24474 24407 23528 22223 21815 22622 23732 24340 24239 23471 22534 22480 23868 25949 27630 28631 29007 28470 27172
55161 27172 26361 27070 28724 29990 30441 30396 29872 28809 27830 27668 28181 28733 29058 29049 28407 27345 26915 27734 29076
55142 29076 30055 30848 31875 32700 32935 33332 34619 36016 36248 35475 34797 34350 33349 31742 30386 29715 29390
55125 29390 29213 29276 29270 28698 27791 27348 27701 28533 29600 30890 32201 33219 33838 33962 33313 32003 30806 30268
55107 30268 29980 29349 28522 27940 27539 27109 26923 27327 28207 29422 31064 32639 32911 31424 29448 28482 28544 28876
55089 28876 29525 31002 32951 34349 34705 34130 32675 30545 28563 27434 26973 26761 26990 27781 28400 28214 27838
55072 27838 28254 29233 29725 29395 28778 28317 28195 28716 29926 31227 32220 33400 35253 37258 38679 39693 40805
55055 40805 41863 42656 43730 45523 47361 48519 49544 51306 53388 54802 55651 56717 57828 58094 57444
55040 57444 56618 55927 55166 54428 53769 52504 50132 47621 46533 47136 48424 49544 50111 49717 48504 47686 48179
55023 48179 49159 49344 49046 49433 50389 50890 51040 51819 53035 53453 52951 52671 52914 52712 51661 50492 49506 48145
55005 48145 46507 45723 46241 47096 47338 47011 46408 45647 45296 46059 47461 48070 47417 46527 46225 46188 46055 46180 46749
54986 46749 47260 47478 47901 48819 49777 50408 50940 51542 52008 52337 52755 52981 52455 51422 50847 51114 51769 52610 53881
54967 53881 55314 56233 56854 58175 60273 61936 62436 62493 63017 64076 65590 67834 70539 72544 73106 72776
54951 72776 72462 72435 72782 73881 75744 77591 78686 79073 79138 79032 78895 78962 79126 78973 78398 77539 76104 73637
54933 73637 70573 68065 66592 65678 65104 65264 66036 66488 66237 66051 66617 67642 68684 69850 71101 71791 71601
54916 71601 71148 71021 70941 70408 69505 68513 67364 66045 64959 64413 64295 64634 65822 67881 70169 72180 74074
54899 74074 76047 77822 79168 80306 81479 82657 83926 85593 87668 89861 92279 95380 99053 102609
54885 102609 105982 110062 115408 121410 127242 133026 139514 147089 155467 163973 171826 178516 184009 188250
54871 188250 190649 190654 188577 185084 180095 173250 165258 157524 150351 142788 134470 126327 119134 112609 106500
54856 106500 101347 97537 94658 92406 91149 90974 91050 90633 89905 89325 89020 89292 90801 93583 96717 99518
54840 99518 102385 106025 110617 116119 122504 129302 135825 142234 149346 156974 163648 168499 172232 175480
54826 175480 177366 176621 173114 167406 159841 150998 142176 134347 127304 120668 114887 110356 106422 102318
54812 102318 98377 95281 92784 90184 87534 85373 83787 82690 82468 83335 84529 85098 85161 85477 86160 86676
54796 86676 86765 86458 85551 83933 82153 80804 79615 77893 75671 73658 72284 71466 71018 70579 69400 66989
54780 66989 63959 61581 60492 60219 59837 58700 56706 54288 52108 50551 49633 49342 49594 49907 49757 49398
54764 49398 49551 50133 50184 49358 48625 48997 50408 52301 54467 56723 58589 59858 60797 61325 60917 59750 58986
54747 58986 59292 60177 61370 63552 66842 69833 71347 72105 73424 75255 76851 78413 80586 83055 85223
54732 85223 87740 91742 96978 102219 107320 113319 120609 128451 136389 144832 154065 163788 173714 183556
54718 183556 192342 198848 202921 205464 206961 206861 204538 200081 194040 187146 180356 174457 169576 165553
54704 165553 162572 160773 159574 158310 157389 157852 159874 162591 165343 168191 171254 174495 178255 183062 188820
54689 188820 194971 201531 209004 217083 224382 229794 233438 235985 237779 239033 240242 241852 243767 245446
54675 245446 246298 245854 243860 240352 235474 229223 221503 212316 201805 190411 179164 169298 161130 153680
54661 153680 145869 137692 129842 122786 116896 112856 110910 109915 108122 104915 101123 97783 95308 93730
54647 93730 92915 92400 91629 90432 88937 87185 85288 83717 82871 82600 82629 83055 83893 84552 84563 84449 85059 86273
54629 86273 87205 87450 87312 87058 86763 86707 87101 87602 88006 89114 91911 95986 99811 102547 104652 106772 109080
54612 109080 111782 115124 118661 121524 123718 126288 129884 133923 137553 140657 143508 146094 148233 149963
54598 149963 151518 153208 155366 158025 160715 163067 165537 168930 173355 178326 183778 190151 197486 205340
54584 205340 213766 223452 234625 246645 259011 271954 285542 298846 310564 320018 327047 331249
54572 331249 331881 328483 321396 311688 300563 288664 275999 262696 249608 237818 227749 219136 211625
54559 211625 204942 198702 192695 187233 182628 178424 173762 168525 163539 159612 156821 154732 152866 150919
54545 150919 148912 147028 145102 142622 139553 136640 134311 131852 128474 124692 121675 119577 117572 115337
54531 115337 113342 111671 109660 106970 104130 101789 100103 98966 98183 97342 96220 95271 95043 95207 94963 94314
54515 94314 94076 94656 95650 96585 97185 97006 95773 94109 92976 92490 92211 92407 93722 95618 96582 96185 95605
54498 95605 95689 95840 95484 95350 96398 98373 100261 101525 102229 102577 102995 104093 106000 108205 110402 112882
54482 112882 115783 118705 121489 124600 128308 132181 135900 139851 144451 149521 154794 160413 166398 172244
54468 172244 177483 182126 186175 189378 191748 193539 194357 193158 189687 185026 180083 174432 167426 159727
54454 159727 152765 147185 142648 138777 135524 132845 130630 128733 126713 124031 120893 118281 116702 115626
54440 115626 114700 114620 115866 117338 117500 116481 115846 116386 117304 117719 117866 118424 119467 120637 121889 123474 125290
54423 125290 126679 127044 126602 126366 127188 128905 130675 132047 133272 134515 135357 135384 134856 134385 134280 134464 134781
54406 134781 135057 135106 134961 134895 135023 135154 135206 135448 136133 137151 138224 139107 139500 139118 138111 137062 136418 136128
54388 136128 135889 135380 134218 132255 130068 128595 128076 127821 127213 126344 125444 124326 122792 121072 119399 117601
54372 117601 115503 113418 111868 111120 111176 111824 112473 112459 111845 111452 111790 112410 112651 112511 112433 112659 113228 114244
54354 114244 115721 117435 119171 120824 122129 122810 123212 124241 126344 129051 131788 134587 137613 140589 143169
54339 143169 145452 147652 149680 151499 153529 156195 159356 162458 164988 166536 166912 166497 165997 165450 163942
54324 163942 160796 156630 152758 149861 147668 145674 143650 141561 139319 136713 133571 130212 127539 126287
54310 126287 126173 126267 126134 126010 125988 125866 125893 126747 128441 129994 130619 130607 130711 131284 132249 133308 133962 134021 134239
54291 134239 135614 137909 139826 140827 141725 143169 144794 146344 148301 150644 152260 152587 152765 154062 156090
54276 156090 157636 158403 158728 158361 156783 154210 151178 147621 143417 139303 136117 133587 130934 128192 125832
54261 125832 123567 120778 117850 115817 114788 113788 112040 109532 106527 103495 101249 100112 99133 97104
54247 97104 94174 91470 89401 87435 85367 83542 81817 79551 76824 74612 73425 72671 71682 70562 69759
54232 69759 69445 69557 69863 69854 69132 67898 66570 65057 63089 61106 59961 59734 59670 59346 59086 59082 58930 58329 57583
54213 57583 57166 57263 57886 58931 59985 60544 60513 60153 59634 59122 59102 59939 61180 61942 62014 61998 62402 63163 63996 64621
54193 64621 64694 64190 63834 64459 65879 67035 67323 67151 67124 67293 67380 67263 67051 67029 67531 68581 69729 70623 71470
54174 71470 72523 73412 73554 72969 72093 71065 69896 69030 68890 69042 68682 67854 67316 67204 66783 65603 64108
54157 64108 62889 62080 61681 61761 62122 62266 61896 61021 59650 57939 56622 56610 57993 59893 61265 61449 60195
54140 60195 57840 55348 53504 52162 50848 49785 49487 49612 49259 48360 47804 48063 48678 49156 49484 49594 49260
54123 49260 48727 48599 48879 48904 48381 47664 46963 46219 45880 46693 48345 49413 49186 48600 48777 49511 49882 49571 48784
54104 48784 47526 45848 44480 44349 45502 46999 47862 47870 47537 47536 48069 48748 49139 49261 49299 49172 48878 48977 49981
54085 49981 51415 52287 52385 52305 52202 51561 50314 49180 48589 48186 47724 47499 47436 46676 44782 42698 41854 42802
54067 42802 45090 47886 50251 51457 51713 52110 53320 54756 55499 55563 55652 56001 56088 55446 54363 53775 54500 56408
54049 56408 58387 59428 59643 59761 59867 59388 58315 57465 57345 57597 57897 58539 59685 60841 61565 62092 62800
54032 62800 63659 64652 66040 67810 69452 70703 71861 72933 73278 72664 71949 71993 72529 72818 72793 72775 72631 72090
54014 72090 71472 71223 70996 70073 68490 66957 65777 64665 63619 63220 63843 65138 66459 67465 68157 68649
53998 68649 69055 69433 69737 69891 69883 69776 69780 70266 71415 72828 73866 74457 75160 76292 77456 78211 78779 79738 81341
53979 81341 83421 85718 87981 89979 91706 93419 95379 97702 100488 103771 107263 110459 113068 115090
53965 115090 116616 118024 120256 124199 129656 135455 140655 145146 149137 152825 156585 160641 164378 166796
53951 166796 167946 169094 171128 173583 175533 176634 176909 176355 175284 174258 173202 171355 168524 165508 162830
53936 162830 160100 157292 155418 154902 154290 151872 147866 143761 140142 136605 133399 131521 131061 130742 129455
53921 129455 127291 124832 122247 119454 116530 113652 111017 108847 107063 105082 102590 100360 99597 100388 101529
53906 101529 102033 102108 102386 102860 103082 103050 103270 103983 104790 105209 105396 105971 107107 108155 108489 108429 108783 109661 110477
53887 110477 111173 112590 115246 118474 121266 123368 124977 125964 126164 126092 126648 128261 130802 134136 138214 142789
53871 142789 147480 151984 155954 159023 161315 163597 166398 169293 171456 172683 173439 174233 175399 177143 179306
53856 179306 181312 182857 184419 186746 190135 194486 199568 204741 208929 211590 213480 215931 219642 224526
53842 224526 230249 236268 241850 246742 251512 256577 261301 264752 266957 268555 269627 269769 269082 268075 266731
53827 266731 264636 262038 259736 257801 255406 252249 249199 246995 244989 241866 237259 232125 227596 223821
53813 223821 219960 215130 209310 203290 197835 193071 188777 184886 181436 178277 175209 172263 169532 166875
53799 166875 164036 160956 157768 154636 151697 148887 145836 142373 139157 137119 136066 134672 132317 130105
53785 130105 129318 129505 129025 127050 124204 121516 119575 118477 117800 116780 115215 114018 114210 115534 116759
53770 116759 117118 116733 115819 114355 112561 110975 109957 109582 109987 111235 112915 114410 115504 116289 116631 116339
53754 116339 115746 115597 116342 117874 119775 121435 122308 122587 123283 125069 127356 129089 130142 131218 132749 134670
53738 134670 137069 140231 144044 147980 151606 154707 157235 159628 162741 166787 170797 173811 176132 178611
53724 178611 181256 183507 185389 187245 188710 189164 188987 189213 190064 190998 192062 193916 196479 198785 200292
53709 200292 201191 201344 200137 197671 194972 192690 190524 188168 185733 183080 179877 176721 175049 175332 176280
53694 176280 176380 175431 174089 172783 171655 170853 170226 169203 167428 165100 162463 159516 156437 153699 151523
53679 151523 149754 148374 147504 146794 145578 143788 142030 140639 139378 138128 137069 136149 135206 134655 135038 135865
53663 135865 136036 135587 135758 137043 138488 139422 140539 142488 144577 145787 146086 145857 144994 143574 142609 143030
53647 143030 144414 145707 146710 147995 149750 151658 153632 155853 158227 160436 162409 164259 165963 167536
53633 167536 169205 171060 172864 174608 176817 179870 183412 186899 190324 193936 197592 200866 203581 205898
53619 205898 208113 210525 213186 215652 217423 218729 220313 222411 224621 226869 229524 232287 233977 234014 233281
53604 233281 232892 232903 232850 232778 232911 233029 232986 233309 234398 235552 235650 234584 233252 232348 231787 231209 230557 230163 230474
53585 230474 231446 232141 231465 229541 227731 227011 226944 226563 225536 224072 222429 221097 220688 221117 221546 221681 222318
53568 222318 223982 225887 227016 227480 228000 228774 229696 231029 232863 234538 235524 236377 237948 240253 242967 246330
53552 246330 250510 254738 258243 261454 265070 268551 271018 273234 277034 282772 288909 294314 299495 305120
53538 305120 310634 315110 318544 321623 324816 328277 332208 336795 341922 347195 352108 356315 359984 363680
53524 363680 367581 371100 373817 376358 379635 383536 387149 390068 392623 394980 396965 398714 400550 402095
53510 402095 402486 401691 400832 400851 401509 401940 401637 400689 399581 398962 399081 399339 398820 397364 395647 394247 393181
53493 393181 392314 391521 390428 388701 386755 385447 384925 384458 383609 382821 382539 382482 382236 382030 382433 383650 385540
53476 385540 387989 390886 394000 397180 400529 404144 407933 411856 416139 421029 426535 432570 439165 446448
53462 446448 454574 463690 473819 484713 496050 507788 520159 533276 546996 561217 576217 592573
53450 592573 610669 630138 649962 669554 689698 711848 736324 761952 787791 814371 842550
53439 842550 871986 901838 932407 964776 998991 1033854 1068601 1103692 1139675 1176298 1213098
53428 1213098 1249978 1286731 1322824 1358207 1393738 1430316 1468076 1506869 1546946 1588623 1631578
53417 1631578 1675015 1718315 1761185 1803317 1844201 1883167 1919476 1952673 1983027 2011331 2038049
53406 2038049 2062868 2085290 2105393 2123870 2141562 2159190 2177266 2195890 2214548 2232241 2247895
53395 2247895 2260806 2270836 2278237 2283277 2286068 2286663 2284951 2280361 2272112 2259994 2244537 2226141 2204539
53382 2204539 2179592 2152103 2123168 2093081 2061533 2028585 1994621 1959611 1923371 1886494 1850097
53371 1850097 1814499 1778966 1742883 1706444 1670047 1633929 1598672 1565294 1534329 1505427 1478235
53360 1478235 1453171 1430948 1411852 1395780 1382534 1371720 1362905 1356331 1353164 1354604 1360900 1371375
53348 1371375 1385091 1401366 1420027 1441374 1465594 1492156 1520295 1550190 1582995 1619379 1658519
53337 1658519 1699009 1740395 1783467 1829317 1878402 1930322 1984183 2039377 2096213 2155616 2218199
53326 2218199 2283922 2352623 2424346 2498990 2576142 2655550 2737352 2821571 2907766 2995407 3084167
53315 3084167 3173594 3262989 3351986 3440849 3529753 3618000 3704278 3787416 3866648 3941477 4011714
53304 4011714 4077493 4138957 4196100 4249125 4298694 4345463 4389512 4430418 4467708 4501021 4529998
53293 4529998 4554232 4573191 4585987 4591382 4588116 4575064 4550994 4514601 4465191 4403363 4330978 4250533
53281 4250533 4164423 4074311 3980887 3884344 3785156 3684295 3582768 3481255 3380184 3279793
53271 3279793 3180063 3080915 2982550 2885276 2789057 2693682 2599420 2507021 2416998 2329436 2244632
53260 2244632 2163393 2086391 2013688 1945161 1881008 1821628 1767383 1718644 1675458 1636912 1601483
53249 1601483 1568580 1539324 1515162 1496019 1480404 1467140 1456276 1448253 1442816 1439144 1436801 1436154
53237 1436154 1437821 1441872 1447729 1454769 1462775 1471751 1481637 1492502 1504801 1519079 1535574 1554431 1576062
53224 1576062 1600762 1628109 1657295 1688036 1720648 1755297 1791737 1829723 1869016 1908919 1948489
53213 1948489 1987383 2025916 2064187 2101781 2138422 2174186 2208870 2241922 2273289 2303603 2333201
53202 2333201 2361658 2388600 2414225 2438544 2460896 2480746 2498217 2513164 2524395 2530561 2531310 2526832
53190 2526832 2516832 2500818 2479046 2452317 2420983 2384879 2344093 2299121 2250359 2198082 2142841
53179 2142841 2085346 2026027 1965263 1903939 1843308 1784293 1727338 1672689 1620321 1569670 1519975
53168 1519975 1470849 1422180 1373587 1324507 1274777 1224705 1174557 1124360 1074234 1024655 976344
53157 976344 930152 886942 847287 811193 778185 747590 718836 691926 667701 647152 630101
53146 630101 614929 599901 584406 568665 552875 537230 522267 508462 495639 483356 471638
53135 471638 460864 451144 442320 434272 426656 418625 409531 399753 390236 381319 372624 363936 355490 347458
53121 347458 339786 332570 326014 319976 314039 307993 301853 295574 289292 283597 278915 274775 270389 265827
53107 265827 261763 258180 254285 249812 245410 241464 237519 233291 229381 226351 223831 221231 218709 216703
53093 216703 214965 212900 210575 208606 207142 205691 203934 202038 200062 197709 194903 192149 189957 188198
53079 188198 186410 184577 183261 182928 183348 183759 183573 182841 182081 181736 181849 182136 182252 181940 181082 179765 178348
53062 178348 177296 176842 176802 176847 176956 177482 178673 180234 181507 181991 181543 180191 178086 175715 173827 172952 173080
53045 173080 173855 174906 175907 176585 176910 177121 177385 177508 177145 176259 175182 174322 173904 173960 174453 175413 176918 178866
53027 178866 180784 182077 182541 182506 182464 182749 183542 184906 186669 188505 190201 191639 192495 192304 191010 189162
53011 189162 187327 185474 183149 180103 176637 173429 171073 169637 168644 167633 166558 165426 163751 161013
52997 161013 157579 154543 152488 150969 149406 147828 146457 145151 143675 142026 140107 137546 134246 130670
52983 130670 127205 123689 119998 116555 113820 111742 110190 109416 109538 110050 110389 110487 110245 109133 107077 105116
52967 105116 104190 103700 102290 99753 97095 94963 93171 91694 90913 90625 89943 88555 87181 86374 85741 84822
52951 84822 83948 83556 83239 82202 80399 78640 77692 77653 78112 78674 79327 80347 81763 83041 83512 83071 82086
52934 82086 80751 79024 77192 75971 75825 76520 77500 78384 79032 79462 79811 80131 80243 80084 80100 80787 81900 82637
52916 82637 82657 82405 82380 82625 83030 83496 83635 82888 81291 79683 78820 78685 78916 79440 80326 81349 82106 82357 82009
52897 82009 81016 79605 78410 78145 79223 81742 85499 89841 93826 96861 99053 100851 102562 104384 106547
52882 106547 109182 112184 115399 118776 122183 125322 128015 130386 132601 134627 136483 138481 140894 143375
52868 143375 145010 145096 143818 142050 140412 138714 136471 133888 131851 130771 129885 128164 125565 122853 120409
52853 120409 117897 115091 112321 109917 107771 105736 104026 102944 102464 102331 102346 102356 102181 101709 100959 100035 99158
52836 99158 98657 98661 98829 98706 98276 97884 97643 97294 96613 95585 94252 92776 91648 91303 91514 91581 91159 90470 89718
52817 89718 88901 88256 88273 88999 89821 90206 90198 90033 89715 89257 88888 88731 88650 88651 88991 89623 89925 89357 88089 86752
52797 86752 85859 85703 86449 87943 89679 91200 92382 93167 93356 92918 92268 91966 92310 93300 94734 96214 97356
52780 97356 98185 99125 100532 102497 105002 107793 110110 111185 111299 111740 113320 115378 116606 116482 115578 114805
52764 114805 114794 115656 116918 117932 118683 119897 122001 124298 125640 125745 125411 125588 126591 128146 129801 131249
52748 131249 132441 133446 134129 134129 133209 131492 129302 126995 124964 123457 122281 120943 119191 117124 114816
52733 114816 112270 109836 108095 107129 106334 105178 103657 101797 99292 96076 92733 89909 87640 85749 84478
52718 84478 84132 84352 84272 83387 81957 80654 80017 80003 79913 79058 77679 76785 76814 77051 76746 76256 76412 77164 77611
52699 77611 77168 76087 74925 74055 73609 73366 72809 71753 70783 70568 70861 70758 69869 68616 67420 66198 64844
52682 64844 63597 62652 61824 60932 60268 60308 61040 61828 62011 61591 61230 61480 62064 62122 61192 59704 58486 58064 58540
52663 58540 59718 61039 61721 61393 60537 60049 60489 61870 63824 65658 66571 66272 65346 64686 64664 65021 65365 65471
52645 65471 65308 65049 64950 64980 64801 64281 63797 63714 63886 63956 63862 63722 63520 63287 63334 63875 64691 65534 66613 68144
52625 68144 69671 70403 70202 69787 69997 71165 73008 74756 75649 75790 76347 78352 81434 84251 86012 86970
52609 86970 87602 88091 88720 89992 92011 94219 96090 97664 99123 100211 100536 100285 100197 100735 101451 101350 99894
52592 99894 97505 94966 92478 89686 86543 83639 81478 79987 79059 79059 80193 81708 82404 81751 80018 77602
52576 77602 74933 72901 72475 73685 75493 76843 77410 77262 76448 75216 74168 73810 74142 74846 75605 76053 75750
52559 75750 74553 72950 71804 71658 72287 72934 73077 72958 73197 73875 74351 74156 73703 73738 74364 75062 75501 75805
52541 75805 76105 76272 76163 75839 75510 75430 75728 76157 76244 75936 75741 75925 76024 75734 75827 77326 79872 81845 82199
52522 82199 81466 80730 80363 80149 80043 80261 80877 81774 82872 84160 85507 86593 87032 86641 85684 84752 84292 84383
52504 84383 85032 86266 87683 88406 88021 87225 86924 87008 86754 86200 86206 87102 88170 88673 88687 88639 88749 89228 90375
52485 90375 92003 93299 93685 93471 93259 93134 92834 92513 92768 93936 95583 96772 96816 95879 94854 94484 94666
52468 94666 94761 94397 93676 92769 91834 91244 91436 92463 94027 95902 97875 99392 99903 99592 99262 99417 99940 100651
52450 100651 101500 102199 102378 102273 102599 103476 104176 104222 104067 104289 104689 104650 103994 103099 102501 102669 103681 104898 105481
52431 105481 105464 105783 106905 108122 108642 108718 109056 109652 109935 109693 109133 108249 106884 105328 104256 103982 104175 104247
52413 104247 103734 102469 100775 99369 98752 98795 99164 99843 100870 101837 102215 102076 102013 102337 102775 102937 102754 102413
52395 102413 102152 102155 102460 102926 103368 103614 103438 102710 101828 101639 102594 104201 105635 106576 107074 106943 105942 104521
52377 104521 103704 104012 104902 105506 105621 105704 106047 106302 105928 104937 104000 103748 104081 104332 104100 103653 103540 104026 105012
52358 105012 106253 107506 108662 109808 111012 111983 112237 111722 111025 110746 110854 110836 110305 109377 108561 108361 108812
52341 108812 109419 109740 109898 110277 110841 111278 111675 112434 113436 113964 113685 113034 112430 111803 111264 111416 112423 113468
52323 113468 113897 114330 115774 118082 120191 121649 122907 124156 124805 124331 122995 121517 120539 120498 121415 122649
52307 122649 123335 123293 123184 123595 124411 125227 126056 127345 129430 132073 134501 136001 136636 137200 138239 139368 139913
52290 139913 139952 140192 141005 142245 143951 146452 149594 152518 154533 155775 156715 157543 158340 159396 160828 162180
52274 162180 162934 163234 163633 164196 164362 163815 163123 163257 164632 166758 168764 170063 170548 170328 169540 168463 167613
52257 167613 167452 167967 168741 169476 170299 171475 173038 174831 176747 178709 180481 181837 182933 184261 186018
52242 186018 187711 188680 189001 189599 191413 194648 198845 203362 207620 211229 214270 217310 220807 224610 228384
52227 228384 232273 236623 241105 244803 247375 249563 252272 255563 258980 262453 266380 270972 276024 281254
52213 281254 286527 291673 296404 300528 304155 307674 311518 315822 320258 324364 328112 331986 336410 341333
52199 341333 346446 351496 356212 360277 363759 367370 371907 377390 382966 387684 391264 394124 396813 399490
52185 399490 401949 404114 406223 408410 410386 411968 413682 416212 419330 422118 424349 426814 429970 433038
52171 433038 435051 436160 437298 439028 441422 444599 448551 452621 455977 458606 461275 464558 468495 473128
52157 473128 478750 485382 492425 498995 504469 508828 512728 517091 522278 527784 532980 537833 542589 547138
52143 547138 551238 554991 558462 561075 562137 561890 561388 561461 562420 564541 567845 571337 573429 573531 572571 571705
52127 571705 571189 570782 570497 570407 570273 569860 569210 568178 566229 563208 559970 557565 556035 554528 552500 550205
52111 550205 548038 545951 543741 541485 539385 537346 535091 532699 530755 529754 529447 529017 527875 525969 523386
52096 523386 520171 516779 514196 512991 512558 511807 510404 508753 506972 504682 501811 498892 496379 494310 492722
52081 492722 491668 490602 488553 485405 482323 480340 479098 477585 475623 473783 472152 470150 467601 465195
52067 465195 463623 462789 462093 461102 459710 458053 456478 455253 453984 451685 447821 443128 438934 435743 432970
52052 432970 430081 427418 425610 424619 423930 423384 423209 423305 423224 423002 423346 424632 426261 427463 428246 429019 429695
52035 429695 429918 429935 430557 432266 434983 438669 443409 448852 454223 459168 464093 469440 475103 480805 486561
52020 486561 492463 498388 504237 510167 516303 522488 528597 534775 541138 547462 553449 559071 564466 569754
52006 569754 575166 580997 587127 592894 597764 601922 605877 609761 613391 616830 620426 624314 628233 631858
51992 631858 635019 637650 639804 641631 643039 643413 642165 639708 637403 636179 635450 633871 631043 627943 625543
51977 625543 623541 620882 617184 613022 608910 604760 600508 596594 593328 590295 586994 583685 580963 578715
51963 578715 576323 573846 572180 571787 571931 571529 570264 568477 566447 564247 562064 560191 558851 558189 558261 558768
51947 558768 559061 558756 558136 557628 557082 555987 554331 552734 551589 550410 548276 544781 540258 535122 529297
51932 529297 522507 514962 507361 500100 492792 484820 476085 466889 457297 447153 436705 426677 417472
51919 417472 408654 399431 389474 379066 368717 358805 349442 340467 331635 322856 314151 305405 296402 287157
51905 287157 277995 269226 260901 252954 245371 238143 231224 224614 218360 212485 207065 202308 198347 195001
51891 195001 191954 189076 186293 183318 179950 176562 173796 171746 169902 167982 166281 165019 163889 162565
51877 162565 161204 160058 158860 157006 154278 151131 148366 146538 145529 144644 143350 141921 141077 141056 141421
51862 141421 141704 141685 141004 139187 136371 133468 131271 129832 128963 128757 129150 129468 129022 127927 126837 126091 125515
51845 125515 124913 124317 123871 123748 124002 124279 123986 123002 121951 121437 121299 120976 120301 119552 118998 118770 118982 119516
51827 119516 119861 119561 118669 117540 116411 115516 115254 115755 116512 116909 116898 116762 116477 115889 115250 114945 114813 114399
51809 114399 113840 113805 114440 115003 114794 113982 113264 113089 113470 114217 115020 115459 115242 114476 113685 113542 114452 116233 118235
51790 118235 119886 121004 121521 121211 120023 118518 117480 117128 117042 116888 116867 117346 118402 119839 121429 122981
51774 122981 124314 125308 125953 126335 126592 126812 126942 126892 126806 127028 127676 128429 128944 129350 130135 131651 133829 136167
51756 136167 137894 138454 138171 138211 139553 142058 144783 147004 148688 150186 151863 153867 155936 157612 158946
51741 158946 160778 163885 168005 172148 175861 179699 184440 190223 196538 202698 208260 213197 217746 221978
51727 221978 225570 228167 229781 230612 230614 229541 227279 223863 219349 214027 208519 203301 198307 193412 189110
51712 189110 186108 184354 183033 181571 180106 178884 177746 176458 175144 174155 173715 173818 174228 174507 174267 173443
51696 173443 172148 170369 168127 165882 164339 163766 163799 163908 163765 163191 162175 161055 160287 159908 159542 159024 158683
51679 158683 158822 159177 159098 158217 156861 155846 155772 156403 156875 156636 155946 155293 154703 154010 153448 153381 153695 154009 154295
51660 154295 154655 154717 154063 153162 153031 153829 154653 154979 155375 156371 157454 157823 157596 157489 157679 157648 157053 156206 155664
51641 155664 155687 156120 156629 157063 157581 158256 158651 158194 156993 155804 155029 154266 153104 151800 150827 150173 149545 148909
51623 148909 148426 148154 148146 148536 149106 149201 148592 148131 148892 150729 152274 152380 151120 149357 147765 146454 145143
51606 145143 143487 141367 139020 136866 135217 134176 133706 133660 133825 134061 134289 134282 133744 132783 132085 132272 133195 134152
51588 134152 134663 134747 134513 133913 132983 132014 131306 130906 130740 130791 130981 130995 130504 129653 129111 129456 130564 131821 132841
51569 132841 133652 134167 133993 133094 132240 132257 132987 133553 133594 133667 134460 136124 138472 141208 143853 145952 147619 149367
51551 149367 151186 152320 152297 151669 151457 152265 154159 156777 159178 160275 160015 159623 160079 160825 160696 159592 158359
51534 158359 157473 156890 157025 158614 161422 164112 165813 166948 168144 169182 169699 170183 171360 172903 173621 172901
51518 172901 171334 169824 168631 167526 166475 165757 165444 165122 164315 163183 162506 162799 163647 164234 164391 164667 165282
51501 165282 165619 165087 164036 163253 162823 162116 160847 159512 158539 157569 155953 153700 151514 150055 149508 149777
51485 149777 150647 151676 152278 152153 151496 150726 150216 150337 151396 153214 155023 156136 156669 157235 158070 158900 159646
51468 159646 160707 162297 163982 165256 166238 167353 168573 169568 170525 172162 174659 177100 178406 178592 178590 178980
51452 178980 179393 179295 178874 178796 179368 180341 181451 182714 184102 185302 186043 186439 186880 187739 189313 191765 194767
51435 194767 197400 198825 199119 199132 199481 200000 200286 200451 201011 202141 203318 203771 203199 201973 200722 199729 198702
51418 198702 197025 194230 190394 186251 182788 180430 178649 176690 174666 173411 173149 172974 172095 171019 170752
51403 170752 171218 171373 170812 170294 170476 170952 171001 170589 170086 169461 168374 166879 165457 164372 163364 162048 160422
51386 160422 158874 157742 156881 155784 154213 152492 150931 149242 147036 144729 143238 142715 142355 141646 141024
51371 141024 140884 140700 139810 138518 137662 137389 137089 136326 135199 133937 132799 132305 132893 134197 135127 134773 133037
51354 133037 130519 128224 127197 127789 129141 129832 129240 128010 127222 127451 128664 130458 132204 133272 133449 133060
51338 133060 132549 132114 131727 131337 130940 130579 130302 130095 129896 129807 130088 130754 131355 131459 131219 131146 131439 131888 132366
51319 132366 132978 133782 134773 136118 137929 139710 140589 140358 139852 139953 140515 140674 140057 139176 138605 138124 136987
51302 136987 134927 132619 130982 130156 129427 128164 126518 125078 124102 123352 122454 121170 119525 117927 116935 116512
51286 116512 115738 113808 111167 109101 108178 107661 106590 104893 103149 101771 100801 100196 99895 99700 99375 98843
51270 98843 98191 97561 97113 96915 96829 96636 96310 95991 95737 95581 95729 96295 96856 96807 96261 96042 96554 97225 97410 97271
51250 97271 97285 97381 97195 96885 96928 97288 97468 97305 97095 96896 96360 95386 94336 93483 92807 92516 93105 94513 95776
51231 95776 96016 95466 95035 95166 95658 96317 97211 98276 99216 99838 100130 99997 99303 98242 97292 96725 96445 96291
51213 96291 96141 95754 95009 94391 94672 95887 97109 97535 97289 96762 95799 94185 92525 91787 92112 92793 93333 93741
51195 93741 93756 92737 90717 88801 87966 87993 88125 88231 88620 89057 88894 88213 88011 88923 90311 91049 90942 90875 91656
51176 91656 93084 94316 94890 95165 95834 97235 99169 101135 102600 103229 103111 102702 102341 101937 101325 100761 100637
51159 100637 100831 100858 100724 101033 102044 103168 103806 104179 104805 105471 105431 104560 103706 103802 105038 106976 109076 110859
51141 110859 111957 112317 112291 112325 112547 112750 112758 112711 112973 113782 115067 116593 118206 119846 121385 122624 123403 123562
51123 123562 122887 121386 119594 118280 117750 117680 117639 117434 116959 116202 115567 115602 116155 116268 115312 113733 112249 110827
51105 110827 109103 107374 106282 105695 104830 103607 103033 103860 105455 106477 106328 105531 104887 104664 104586 104327 103915
51088 103915 103681 103830 104187 104446 104596 104890 105444 106044 106363 106278 105958 105743 105802 105860 105428 104439 103443 102994 103067 103381
51068 103381 103957 104943 106014 106512 106244 105771 105789 106489 107586 108719 109728 110722 111944 113480 115149 116747
51052 116747 118260 119748 121202 122654 124176 125510 126044 125536 124609 124163 124525 125512 126997 128827 130446 131287
51036 131287 131490 131625 131713 131129 129570 127565 125881 124881 124574 124832 125355 125780 125961 125950 125804 125712 126094 127065
51018 127065 127905 127700 126435 124876 123483 122157 121058 120695 120963 120933 120086 119130 119108 120136 121423 122108 121789
51001 121789 120724 119895 120400 122396 124977 127309 129290 130849 131339 130333 128483 126921 126074 125620 125244 124799
50985 124799 124007 122734 121483 121015 121461 122257 122912 123450 124114 125013 126104 127237 128261 129245 130467 131975
50969 131975 133384 134365 135132 136125 137388 138573 139412 139915 140239 140611 141208 141921 142482 142992 143952 145514 147158
50952 147158 148500 149931 151915 154068 155666 156812 158319 160508 162825 164704 166172 167515 168936 170639
50938 170639 172738 174943 176850 178637 180924 183834 186762 189375 192276 196261 201280 206529 211291 215322
50924 215322 218706 221761 224973 228647 232703 237052 242045 248208 255515 263186 270283 276419 281935 287525
50910 287525 293700 300424 307347 314476 322565 332647 345076 359120 373540 387565 401392 415896
50898 415896 431871 449406 467905 486678 505446 524187 542644 560321 576990 592889 608233
50887 608233 622848 636542 649486 661722 672519 680939 687157 692575 698355 704360 709879 714793 719440
50874 719440 723793 727542 730818 734051 737085 739067 739305 737733 734472 729452 722607 713945 703351 690783
50860 690783 676706 661811 646168 629259 611028 592273 573705 555216 536507 517940 500268
50849 500268 483871 468707 454699 441710 429430 417753 407076 397836 389971 383159 377382 372885
50837 372885 369732 367766 366805 366573 366646 366750 366947 367254 367408 367312 367388 368052 369123 370173 371283 372938 375314
50820 375314 378065 380742 383062 384955 386764 389139 392308 395632 398415 400935 404067 408030 412262 416572
50806 416572 421614 427874 434863 441802 448734 456436 465403 475388 485883 496693 507929 519712 532166
50793 532166 545598 560497 577247 595958 616685 639586 664642 691400 719410 748943 780835
50782 780835 815518 852569 891335 931538 972961 1015008 1056948 1098340 1138863 1178048 1215517
50771 1215517 1251159 1284577 1314683 1340476 1362214 1381387 1399485 1417004 1433584 1448774 1462661
50760 1462661 1475988 1489639 1504044 1519312 1535842 1554116 1573547 1592209 1608308 1621480 1632091
50749 1632091 1639819 1643738 1643390 1638731 1629243 1614248 1594319 1571439 1547354 1522476 1496706 1470621
50737 1470621 1445324 1421595 1399707 1379895 1362553 1348125 1336995 1329384 1325257 1324512 1327417 1334691
50725 1334691 1347100 1365090 1388702 1417497 1450465 1486271 1523768 1562320 1601703 1641649 1681151
50714 1681151 1718099 1750137 1776333 1797675 1815451 1829485 1838573 1842185 1840725 1834217 1821712 1802326
50702 1802326 1776185 1744100 1706907 1665340 1619974 1571047 1518813 1464251 1408986 1354441 1301549
50691 1301549 1251297 1204695 1161956 1122453 1085932 1053141 1024817 1000645 979756 961775 946869
50680 946869 935165 926727 921751 920251 921728 925677 932263 942094 955415 971926 991240 1013217 1037868
50667 1037868 1065143 1094691 1125715 1157312 1189058 1220906 1252387 1282421 1310264 1336109 1360247
50656 1360247 1382078 1400622 1415699 1427881 1437405 1443964 1447683 1449600 1450922 1452236 1453712 1455654 1458505
50643 1458505 1462622 1468433 1476598 1487602 1501230 1516695 1533323 1550917 1569395 1588238 1606381 1622541
50631 1622541 1635662 1645308 1651835 1656061 1658562 1659354 1658458 1656669 1655402 1655695 1657770 1661687 1668054 1677729
50617 1677729 1691076 1707839 1727612 1750176 1775585 1804311 1837298 1875665 1920410 1972470 2032696
50606 2032696 2101426 2178308 2262808 2354613 2453043 2556348 2662002 2767481 2870308 2967770
50596 2967770 3057488 3138403 3210673 3274603 3330157 3377322 3416122 3446083 3466273 3476030 3475206 3463697
50584 3463697 3441351 3408468 3365908 3314750 3256426 3193178 3127672 3062019 2997790 2936818 2880958
50573 2880958 2830782 2785473 2744433 2708117 2676844 2649744 2625621 2604108 2585124 2567745 2550509
50562 2550509 2532543 2513678 2493774 2472667 2450626 2428210 2405732 2383352 2361643 2341617 2324273
50551 2324273 2310369 2300363 2294234 2291513 2291728 2294487 2298919 2303540 2307156 2309564 2310888 2310581 2307503 2300528
50537 2300528 2288644 2270911 2247086 2217971 2184447 2146302 2102678 2053617 2000608 1945707 1890696
50526 1890696 1836926 1785228 1735708 1688000 1641853 1597308 1554525 1513828 1475812 1440932 1408973
50515 1408973 1379308 1351720 1326682 1304890 1286783 1272437 1261584 1253781 1248751 1246544 1247261 1250799
50503 1250799 1257041 1266010 1277585 1291363 1307024 1324550 1343911 1365063 1388591 1415833 1447790 1484271
50491 1484271 1524619 1568862 1617670 1671547 1730836 1796080 1867586 1944733 2026338 2111488 2199318
50480 2199318 2288167 2375766 2460245 2540388 2615234 2684403 2748807 2810073 2869034 2925444 2979124
50469 2979124 3030372 3078974 3123779 3163869 3199576 3231892 3261534 3289162 3316086 3344047 3374371
50458 3374371 3407677 3444161 3483657 3525364 3567910 3609890 3650300 3688320 3722606 3750941 3770917
50447 3770917 3781093 3781157 3770856 3749298 3715797 3670943 3616237 3552980 3482244 3405725 3325782 3244659
50435 3244659 3164404 3087526 3016842 2954360 2900857 2856632 2822017 2797023 2781165 2773782 2773758 2778681
50423 2778681 2785098 2790019 2791586 2787939 2776314 2754009 2719736 2673468 2615495 2546451 2467967 2382531
50411 2382531 2292577 2200053 2106657 2014027 1923675 1836992 1755007 1677894 1604951 1535539 1469939
50400 1469939 1408988 1353122 1302159 1255831 1214049 1176602 1142924 1112225 1083843 1057698 1034542
50389 1034542 1015353 1000109 987439 975940 965647 957672 952490 949164 946489 944421 944044 946279 950955
50376 950955 957196 964538 973433 984574 997993 1013085 1029440 1047223 1066693 1087794 1110489 1135135
50364 1135135 1162191 1191722 1223466 1257166 1292579 1329441 1367782 1408045 1450435 1494229 1538208
50353 1538208 1581711 1624862 1667825 1710433 1752735 1795345 1838822 1882916 1926826 1970076 2012844
50342 2012844 2055467 2097935 2139881 2180739 2219684 2255596 2287317 2314112 2335878 2352827 2364905
50331 2364905 2371399 2371140 2363157 2347151 2323334 2291948 2253211 2207725 2156615 2101129 2042406 1981885
50319 1981885 1921574 1863371 1808181 1756186 1707983 1664906 1628111 1597849 1573824 1555730 1543123
50308 1543123 1535196 1530967 1529334 1528652 1526792 1522099 1513910 1501754 1484578 1461511 1433028 1400620 1365484
50295 1365484 1328230 1289654 1250824 1212314 1174092 1136319 1099634 1064482 1030793 998529 967989
50284 967989 939380 912630 887794 865161 844782 826414 810140 796425 785224 775586 766496 757748
50272 757748 749789 743193 738532 736149 735609 735778 735873 736082 736852 738071 739386 740867 742803 745169 747854 751096
50256 751096 755181 759837 764493 769034 773907 779574 786253 794001 802659 811808 821160 830944 841586 853196
50242 853196 865681 879148 893668 908703 923240 936545 948422 958770 967307 973818 978326 980848
50230 980848 981239 979439 975709 970515 964256 957047 948597 938338 925906 911639 896494 881407 866784
50217 866784 852484 838101 823287 808056 792900 778557 765530 753778 742888 732499 722594 713366
50205 713366 704882 696990 689551 682579 675989 669413 662553 655629 649187 643424 638012 632651 627527 623183
50191 623183 620069 618249 617317 616636 615864 615236 615081 615220 615188 614911 614716 614748 614959 615638 617271 619683 621993 623716
50173 623716 625394 627733 630594 633192 634965 635892 636398 637219 638947 641325 643381 644502 644936 644959 644206 642364
50157 642364 639939 637658 635513 633089 630504 628300 626624 625182 623870 622791 621746 620394 618881 617734
50143 617734 617131 616848 616917 617733 619382 621298 622767 623510 623813 624398 626063 629057 632847 636760 640671 644725
50127 644725 648760 652607 656758 661985 668234 674527 680051 684778 688980 692686 695836 698461 700566 702222
50113 702222 703863 706039 708769 711580 714319 717437 721331 725818 730531 735471 740935 747153 754231 762256
50099 762256 771308 781475 792815 805136 817900 830631 843345 856277 869428 882835 897098 912992
50087 912992 930496 948801 967280 985953 1005034 1024728 1045535 1067949 1091604 1115475 1139390
50076 1139390 1164658 1192706 1223659 1256859 1292306 1330895 1373501 1420420 1471674 1527442 1588271
50065 1588271 1655151 1729216 1811147 1901107 1999477 2107230 2225190 2353210 2490501 2636388
50055 2636388 2790063 2949540 3111256 3270608 3422608 3562458 3686476 3793133 3883269 3959377
50045 3959377 4024655 4082181 4134009 4180476 4220183 4250529 4268143 4269181 4249821 4206845 4138042
50034 4138042 4042758 3922748 3782432 3627707 3464125 3296188 3127927 2963293 2805579 2656744
50024 2656744 2517545 2388131 2268447 2158465 2058302 1967967 1886839 1813706 1747573 1688240
50014 1688240 1635786 1589594 1548273 1510576 1476230 1445767 1419667 1397653 1378615 1361235 1344799
50003 1344799 1329517 1315942 1304143 1293572 1283801 1275133 1268266 1263400 1259871 1256708 1253467 1250550 1248829
49990 1248829 1248971 1250980 1254293 1258306 1262831 1268100 1274583 1282968 1294064 1308225 1324765 1342405 1360517
49977 1360517 1379646 1400631 1423543 1447785 1472841 1498519 1524860 1552395 1582247 1615221 1650835
49966 1650835 1687906 1726124 1766237 1808566 1852322 1896943 1943346 1993049 2046528 2103373 2163783
49955 2163783 2228911 2299609 2375699 2456923 2544094 2638887 2742829 2856874 2981787 3118548
49945 3118548 3268391 3432671 3612648 3809262 4023023 4253928 4501054 4761824 5031582
49936 5031582 5304040 5572374 5830387 6073460 6299125 6506952 6697764 6872830 7033674
49927 7033674 7182086 7319398 7445022 7555543 7645331 7708010 7737483 7728264 7676169 7579702 7440953
49916 7440953 7264844 7057302 6824048 6570544 6302217 6024137 5740600 5455205 5171221
49907 5171221 4891721 4619628 4357884 4109334 3875975 3658296 3455700 3267605 3093883
49898 3093883 2934310 2788128 2654395 2532336 2421043 2319188 2225533 2139542 2060977 1989047
49888 1989047 1922531 1860720 1803577 1750690 1700691 1652225 1605068 1559782 1516581 1475176 1435551
49877 1435551 1398068 1362674 1328668 1295587 1263859 1234257 1207035 1181970 1158894 1137839 1118896
49866 1118896 1102278 1088297 1076893 1067382 1059066 1051909 1046194 1041739 1038053 1035193 1033792 1034062 1035432
49853 1035432 1037510 1040849 1046162 1053121 1060599 1068085 1076317 1086344 1098347 1111648 1125619 1140273 1156051
49840 1156051 1173393 1192618 1214082 1238217 1265434 1296086 1330475 1368767 1410895 1456834 1507113
49829 1507113 1562918 1625442 1695212 1772285 1857033 1950537 2054125 2168771 2294984 2432969
49819 2432969 2582560 2742919 2912359 3088330 3267349 3444944 3616012 3775654 3920073
49810 3920073 4047016 4155703 4246708 4322086 4385279 4440151 4489282 4532732 4568138 4591674 4598679
49799 4598679 4583744 4541201 4466666 4358830 4220080 4055526 3871464 3674377 3470638 3266257
49789 3266257 3066318 2874499 2693140 2523673 2366881 2222905 2091360 1971672 1863247
49780 1863247 1765336 1676900 1596828 1524220 1458400 1398683 1344283 1294496 1248950 1207582 1170293
49769 1170293 1136613 1105848 1077565 1051768 1028462 1007235 987465 968763 950911 933608 916735
49758 916735 900760 886364 873535 861508 849685 838150 827151 816616 806425 796663 787351 778402
49746 778402 770133 763205 757634 752454 746909 741382 736421 731449 725460 718768 712949 708929 706014 702984
49732 702984 699399 695485 691422 687181 682690 677925 673092 668751 665298 662309 658950 655171 651828 649465
49718 649465 647667 645947 644592 644039 643863 643058 641137 638482 635780 633595 632378 632382 633429 634980 636452 637387
49702 637387 637487 636699 635280 633664 632344 631813 632336 633620 634899 635589 635693 635534 635321 635187 635388 636137 637240
49685 637240 638108 638178 637312 635950 634917 634901 635882 637075 637465 636511 634549 632637 631782 631959 632002 630849 628797
49668 628797 627066 626201 625572 624525 623338 622548 621926 620691 618504 615708 612732 609763 606977 604659 602883
49653 602883 601269 599234 596517 593487 590821 588814 587133 585434 584011 583428 583550 583430 582269 580134 577708
49638 577708 575746 574820 575035 575715 575882 575329 574855 575197 576182 577201 578000 578590 578870 578874 579063 579862 581142 582516
49620 582516 583864 585158 586127 586606 586968 587689 588673 589484 590057 590682 591501 592528 594021 596270 599067 601938
49604 601938 604815 607986 611400 614550 617138 619429 621859 624636 627749 631022 634147 636953 639635 642418
49590 642418 645115 647432 649588 652141 655158 658101 660716 663510 667136 671563 676121 680160 683553 686735
49576 686735 690405 695029 700569 706697 713118 719507 725381 730472 735139 740008 745228 750517 755905 761874
49562 761874 768663 775951 783410 791049 798685 805580 811186 816072 821573 828470 836318 844129 851470 858758
49548 858758 866638 875213 883977 892390 900345 907970 915224 922036 928774 936177 944666 953985 963726 973910
49534 973910 984772 996271 1008198 1020685 1034108 1048427 1063047 1077528 1092106 1107172 1122599
49523 1122599 1138071 1153902 1170871 1189135 1207886 1226414 1245050 1264637 1285453 1307188 1329664
49512 1329664 1352950 1376845 1400851 1424648 1448169 1471311 1494171 1517464 1541960 1567397 1592637
49501 1592637 1617078 1641209 1665546 1689812 1713532 1736686 1759284 1781003 1801842 1822471 1843228
49490 1843228 1863365 1882088 1899830 1917574 1935256 1951781 1966474 1979581 1991414 2001859 2010854
49479 2010854 2018609 2025253 2030840 2035716 2040238 2044108 2046713 2048258 2049892 2052482 2055816 2059200 2062284 2065090
49465 2065090 2067836 2071058 2075454 2081240 2087929 2094926 2101981 2108941 2115552 2121810 2128188 2135110 2142425 2149643
49451 2149643 2156513 2163065 2169241 2174767 2179462 2183537 2187502 2191629 2195510 2198335 2199695 2199870 2199163 2197279
49437 2197279 2193671 2188260 2181444 2173587 2164878 2155402 2144946 2132981 2119302 2104479 2089177 2073338
49425 2073338 2056608 2039301 2022129 2005095 1987442 1968746 1949389 1929904 1910512 1891293 1872181
49414 1872181 1852740 1832709 1812788 1794171 1777212 1761288 1745961 1731352 1717234 1702871 1688185
49403 1688185 1674159 1661463 1649502 1637427 1625375 1614012 1603435 1593214 1583134 1573280 1563788 1555004
49391 1555004 1547479 1541257 1535542 1529596 1523621 1518281 1513760 1509791 1506229 1502983 1499697 1496108 1492549 1489564
49377 1489564 1487235 1485319 1483808 1482882 1482469 1482276 1482124 1481953 1481754 1481818 1482723 1484668 1487173 1489775 1492668 1496214
49361 1496214 1500247 1504467 1509172 1514943 1521817 1529389 1537558 1546453 1555636 1564019 1570760 1575905 1580107 1584062
49347 1584062 1588189 1592560 1597098 1601959 1607593 1614262 1621772 1629855 1638455 1647400 1656266 1665000 1674218 1684320
49333 1684320 1694702 1704394 1713178 1721440 1729302 1736676 1743923 1751507 1759040 1765470 1770408 1774552 1778704 1783094
49319 1783094 1787901 1793629 1800490 1807884 1814985 1821632 1828321 1835508 1843201 1851109 1858959 1866713 1874572 1882817
49305 1882817 1891672 1901303 1911745 1922792 1934227 1946288 1959537 1974000 1988909 2003719 2018912 2035221
49293 2035221 2052524 2070272 2088724 2108714 2130216 2152114 2173669 2195384 2218086 2241927 2266741
49282 2266741 2292704 2319996 2348275 2377076 2406480 2436795 2467729 2498418 2528372 2558091 2588653
49271 2588653 2620756 2654148 2687880 2721113 2753700 2785951 2818070 2850070 2882062 2914144 2945963
49260 2945963 2976861 3006577 3035441 3063664 3090849 3116424 3140256 3162565 3183612 3203753 3223470
49249 3223470 3242821 3261058 3277244 3291254 3303808 3315567 3326595 3336780 3346303 3355386 3363898 3371599
49237 3371599 3378621 3385277 3391426 3396552 3400644 3404539 3409030 3414050 3419273 3425180 3432776 3442284 3452867 3463732
49223 3463732 3474711 3485564 3495633 3504838 3514265 3524938 3536398 3547274 3556927 3565764 3574242 3582423
49211 3582423 3590347 3597953 3604571 3609270 3611805 3612491 3611141 3606915 3599483 3589611 3578241 3565561 3551298
49198 3551298 3535351 3517760 3498513 3477698 3455498 3431833 3406407 3379369 3351493 3323502 3295546
49187 3295546 3267585 3239774 3212244 3184947 3158034 3131909 3106550 3081187 3055102 3028474 3002080
49176 3002080 2976488 2951836 2928102 2905129 2882563 2860103 2837711 2815447 2793381 2771797 2751091
49165 2751091 2731190 2711482 2691637 2672081 2653325 2635244 2617522 2600395 2584355 2569272 2554415
49154 2554415 2539290 2524017 2508910 2494132 2479759 2465848 2452380 2439387 2427009 2415204 2403556
49143 2403556 2391683 2379699 2367930 2356340 2344574 2332496 2320395 2308714 2297870 2288126 2279272 2270594
49131 2270594 2261626 2252877 2245315 2239090 2233237 2226768 2219640 2212504 2205792 2199348 2192717 2185593 2178106 2170802
49117 2170802 2164278 2158730 2153891 2149410 2145143 2141026 2136815 2132124 2126823 2121349 2116462 2112553 2109279 2106087
49103 2106087 2102964 2100309 2098093 2095684 2092740 2089826 2087777 2086780 2086493 2086741 2087531 2088580 2089444 2090214 2091617
49088 2091617 2094237 2097915 2102049 2106329 2111073 2116890 2123938 2131499 2138574 2145008 2151622 2158973 2166438 2173039
49074 2173039 2178719 2184086 2189173 2193353 2196509 2199376 2202526 2205777 2208934 2212378 2216449 2220728 2224459 2227313
49060 2227313 2229404 2230965 2232392 2234171 2236264 2237857 2238232 2237691 2237162 2237103 2237257 2237366 2237552 2237988 2238578 2239086 2239353
49043 2239353 2239372 2239305 2239363 2239524 2239526 2239331 2239392 2240259 2242094 2244778 2248107 2251539 2254169 2255578 2256495 2257990 2260128 2262076
49025 2262076 2263458 2264818 2266605 2268447 2269854 2271033 2272590 2274770 2277396 2280193 2282888 2285319 2287834 2291161
49011 2291161 2295460 2299756 2302802 2304297 2304914 2305360 2305903 2306683 2307828 2309180 2310274 2310699 2310290 2308994 2306830
48996 2306830 2303977 2300695 2297136 2293368 2289383 2284914 2279505 2273152 2266659 2260900 2255896 2251046 2246038 2240996
48982 2240996 2235899 2230542 2225087 2219960 2215151 2210285 2205515 2201554 2198631 2196203 2194075 2192995 2193562 2195303
48968 2195303 2197560 2200638 2205155 2210751 2216501 2222481 2229852 2239348 2250521 2262705 2275907 2290412 2306246
48955 2306246 2323435 2342311 2363076 2385409 2408904 2433620 2459855 2487591 2516556 2546714 2578307
48944 2578307 2611414 2645731 2680851 2716691 2753535 2791605 2830543 2869412 2907381 2944338 2980726
48933 2980726 3016958 3053318 3090192 3127907 3166189 3204353 3242244 3280609 3320149 3360474 3400376
48922 3400376 3438885 3475635 3510299 3542267 3571171 3597391 3621745 3644692 3666109 3685831 3704133
48911 3704133 3721383 3737301 3750928 3761580 3769588 3775773 3780298 3782403 3781387 3777513 3771771 3764905 3756963
48898 3756963 3747716 3737266 3726097 3714639 3703006 3691292 3679957 3669613 3660390 3651800 3643407 3635405
48886 3635405 3628413 3623010 3619667 3618806 3620437 3623922 3628556 3634330 3641729 3650924 3661557 3673356 3686460
48873 3686460 3701161 3717646 3736053 3756374 3778344 3801793 3827052 3854630 3884574 3916698 3951272
48862 3951272 3988728 4028636 4069814 4111693 4154815 4199688 4246009 4293555 4343070 4395422 4450379
48851 4450379 4506999 4564876 4624273 4685343 4748009 4812523 4879354 4948561 5019938 5093799 5171006
48840 5171006 5252055 5336647 5424181 5514139 5605917 5698835 5792610 5887443 5983515 6080712 6178915
48829 6178915 6278107 6377953 6477611 6576255 6673580 6769569 6863924 6955889 7044534 7129167 7209610
48818 7209610 7286071 7358564 7426430 7488663 7544674 7594491 7638144 7675206 7705032 7727152 7741265
48807 7741265 7747135 7744777 7734692 7717664 7694353 7665095 7629998 7589094 7542404 7489972 7431908 7368473
48795 7368473 7300114 7227301 7150321 7069430 6985339 6899264 6812160 6724029 6634374 6543294 6451795
48784 6451795 6361031 6271651 6183906 6097948 6013781 5931269 5850469 5771843 5695933 5623033 5553326
48773 5553326 5487175 5425064 5367349 5314226 5265775 5221790 5181622 5144460 5109916 5078367 5050748
48762 5050748 5027917 5010002 4996285 4985924 4978873 4975908 4977669 4983932 4994005 5007585 5024851 5045876
48750 5045876 5070323 5097813 5128265 5161746 5198220 5237612 5280000 5325523 5374122 5425466 5479068
48739 5479068 5534460 5591362 5649847 5710219 5772544 5836332 5900944 5966337 6033139 6101867 6172301
48728 6172301 6243875 6316416 6390136 6465010 6540663 6616955 6694246 6772829 6852380 6932229 7011911
48717 7011911 7091185 7169728 7247135 7323104 7397252 7468860 7537088 7601435 7661713 7717694 7769180
48706 7769180 7816302 7859191 7897192 7928935 7953559 7971628 7984525 7993137 7997409 7996952 7991633 7981532
48694 7981532 7966710 7947164 7922894 7893790 7859486 7819315 7772504 7718472 7657025 7588199 7512007
48683 7512007 7428581 7338701 7243941 7145964 7045723 6943607 6840330 6737396 6636508 6538721
48673 6538721 6444195 6352618 6263696 6177468 6094347 6014852 5939172 5867110 5798543 5733827 5673505
48662 5673505 5617667 5565863 5517688 5473236 5432879 5396784 5364753 5336422 5311538 5290077 5272148
48651 5272148 5257730 5246535 5238210 5232547 5229222 5227461 5226432 5226080 5227057 5229503 5232357 5234364 5235411 5236302
48637 5236302 5237415 5238327 5238715 5238895 5239264 5239817 5240575 5241921 5244055 5246469 5248472 5250046 5251748 5253904 5256304
48622 5256304 5258634 5260854 5263069 5265277 5267374 5269333 5271388 5273991 5277434 5281484 5285611 5289727 5294442 5300352
48608 5300352 5307264 5314333 5320782 5326293 5330887 5334815 5338536 5342424 5346362 5349767 5352020 5352807 5352108 5350024
48594 5350024 5346541 5341293 5333606 5322917 5309096 5292260 5272460 5249773 5224558 5197238 5167732 5135389
48582 5135389 5099623 5060479 5018462 4973939 4926820 4876794 4823781 4768224 4711000 4653073 4595114
48571 4595114 4537349 4479759 4422533 4366294 4311629 4258320 4205375 4152121 4099007 4046909 3995948
48560 3995948 3945610 3895942 3847804 3801754 3757398 3714289 3672856 3633870 3597376 3562739 3529525
48549 3529525 3497840 3467989 3440137 3414135 3389342 3364966 3341013 3318655 3299152 3282676 3268597
48538 3268597 3256651 3247157 3240304 3235904 3233849 3234130 3236319 3239606 3243531 3248261 3254096 3261167 3269672 3279849
48524 3279849 3291499 3303996 3317029 3330956 3346111 3362095 3378111 3393919 3410137 3427570 3446374
48513 3446374 3465999 3485956 3506477 3528171 3551005 3573993 3596121 3617243 3637927 3658793 3680306
48502 3680306 3702666 3725304 3746900 3766600 3785015 3803334 3821656 3838995 3854795 3869561 3883918
48491 3883918 3897939 3911612 3925108 3938268 3950590 3962202 3974175 3987315 4001163 4014734 4027820
48480 4027820 4040912 4054172 4067115 4079288 4090838 4102347 4114296 4126643 4138824 4150269 4160937
48469 4160937 4171117 4180764 4189445 4197071 4204170 4211122 4217533 4222723 4226547 4229313 4231079 4231467 4230142 4227241
48455 4227241 4223271 4218694 4213511 4207207 4199286 4189885 4179655 4168996 4157652 4145119 4131204 4116096
48443 4116096 4100167 4083777 4067037 4049711 4031558 4012813 3993960 3975053 3955630 3935367 3914434
48432 3914434 3893171 3871802 3850563 3829657 3808970 3788170 3767142 3745964 3724548 3702880 3681593
48421 3681593 3661534 3642669 3624144 3605660 3587923 3571376 3555343 3539004 3522566 3506738 3491699
48410 3491699 3477330 3463998 3452220 3441730 3431572 3421073 3410236 3399351 3388708 3378541 3368710
48399 3368710 3358558 3347446 3335368 3322780 3310110 3297653 3285561 3273536 3260918 3247507 3233891
48388 3233891 3220540 3207003 3192562 3177233 3161516 3145515 3129065 3112349 3095599 3078392 3060045
48377 3060045 3040639 3020942 3001347 2981591 2961452 2940974 2919976 2898120 2875590 2853027 2830669
48366 2830669 2808156 2785384 2762890 2741046 2719384 2697078 2673885 2650341 2627205 2604797 2582705
48355 2582705 2560256 2537446 2515193 2494279 2474290 2454146 2433537 2413173 2393632 2374716 2356081
48344 2356081 2337814 2320019 2302411 2284765 2267437 2251089 2236019 2222012 2208675 2195765 2183295
48333 2183295 2171431 2160189 2149332 2138727 2128702 2119702 2111665 2104094 2096709 2089694 2083250 2077268 2071490
48320 2071490 2065751 2060083 2054811 2050429 2047042 2044025 2040646 2036877 2033209 2029772 2026160 2022095 2017740 2013332
48306 2013332 2008918 2004539 2000288 1996117 1991963 1988005 1984419 1980966 1977264 1973420 1969906 1966958 1964549 1962737
48292 1962737 1961361 1959588 1956646 1953090 1950432 1949355 1949043 1948547 1947967 1947954 1948799 1950467 1952817 1955300 1957076
48277 1957076 1958073 1959352 1961897 1965500 1969369 1973284 1977475 1981739 1985520 1988694 1991663 1994702 1997752 2000716
48263 2000716 2003489 2005676 2006725 2006446 2005138 2003159 2000458 1996548 1990925 1983666 1975562 1967359 1958864 1949213
48249 1949213 1938069 1925996 1913475 1900197 1885691 1870147 1854179 1838166 1822287 1806808 1791830
48238 1791830 1777066 1762230 1747319 1732181 1716329 1699741 1683355 1668096 1653771 1639650 1625855
48227 1625855 1613283 1602213 1591799 1581137 1570230 1559698 1550037 1541342 1533437 1526060 1519092 1512630
48215 1512630 1506677 1500978 1495388 1490156 1485489 1481191 1477207 1474223 1473022 1473388 1474378 1475620 1477561 1480287
48201 1480287 1482971 1484870 1486250 1487822 1489743 1491680 1493571 1495762 1498442 1501375 1504206 1506804 1509287 1511833
48187 1511833 1514493 1517136 1519647 1522106 1524642 1527163 1529456 1531574 1533835 1536358 1538826 1540849 1542381 1543628
48173 1543628 1544712 1545564 1546093 1546354 1546617 1547241 1548368 1549636 1550345 1549946 1548358 1545886 1542984 1540078 1537350 1534605
48157 1534605 1531422 1527494 1522789 1517457 1511718 1505819 1499934 1494081 1488205 1482241 1476058 1469500 1462610 1455644
48143 1455644 1448630 1441225 1433338 1425618 1418763 1412410 1405327 1396831 1387434 1377919 1368377 1358526 1348455 1338463
48129 1338463 1328441 1318028 1307274 1296603 1286104 1275429 1264616 1254527 1246082 1239239 1233045 1226651
48117 1226651 1219920 1213126 1206445 1200027 1194299 1189773 1186502 1184000 1181861 1180320 1180065 1181627 1185050 1190058
48103 1190058 1196396 1204127 1213725 1225762 1240490 1257883 1278207 1302186 1330448 1363256 1401183 1445233
48091 1445233 1494666 1544040 1583414 1603064 1598916 1573911 1534813 1488139 1438370 1388293 1339778
48080 1339778 1294035 1251639 1212636 1176808 1143988 1114251 1087796 1064640 1044469 1026764 1010926
48069 1010926 996312 982401 969155 957113 946852 938310 930818 923798 917202 911253 906040 901602 898109
48056 898109 895587 893529 891191 888389 885749 884034 883422 883493 883690 883676 883411 883074 882732 882136 881043 879797 879122
48039 879122 879149 879043 877984 876176 874394 872832 871044 868953 867248 866544 866663 866986 867148 867108 866883 866586 866583 867264
48021 867264 868655 870413 872158 873737 875204 876596 877696 878101 877753 877285 877459 878151 878267 876913 874337 871500
48005 871500 869048 867111 865769 865101 864783 864180 863030 861651 860287 858603 856160 853175 850438 848432 846810
47990 846810 844793 841927 838382 834638 831018 827490 823854 820050 816268 812750 809537 806453 803334 800218
47976 800218 797273 794572 792002 789420 786823 784258 781632 778770 775742 772953 770731 768939 767251 765819
47962 765819 765290 765936 766997 767252 766215 764488 762917 761706 760458 758744 756337 753080 748889 743979 738925
47947 738925 734373 730654 727544 724327 720282 715292 709957 704943 700355 695851 691224 686636 682346 678501
47933 678501 675132 672106 669114 665985 662957 660326 657852 654964 651547 648096 644936 641748 638156 634366
47919 634366 630817 627476 623879 619700 614915 609620 604065 598776 594139 589824 585002 579247 573001 567084
47905 567084 561916 557244 552422 546871 540456 533507 526463 519583 513060 507189 502137 497600 493011 488068
47891 488068 482876 477592 472229 466881 461864 457465 453684 450307 447120 444010 440930 437779 434330 430391
47877 430391 426158 422228 418978 416029 412656 408697 404762 401517 399146 397573 396756 396466 396075 395032 393529
47862 393529 392370 392134 392613 393138 393305 393282 393510 394222 395337 396749 398580 401065 404207 407700 411168 414413
47846 414413 417425 420241 422894 425471 428164 431143 434324 437325 439812 441854 443807 445874 448073 450650
47832 450650 454061 458256 462283 465037 466296 466725 467038 467556 468495 470146 472585 475528 478568 481341 483493
47817 483493 484845 485733 486830 488449 490267 491881 493406 495311 497908 501150 504775 508450 511880 514976
47803 514976 517918 521009 524539 528774 533791 539202 544225 548269 551440 554414 557810 561701 565656 569249
47789 569249 572543 575954 579540 582702 584885 586400 588083 590176 592059 593139 593446 593130 591995 589975 587609
47774 587609 585465 583306 580364 576352 571738 567116 562766 558879 555660 552999 550320 547072 543256 539393
47760 539393 536058 533521 531673 530169 528701 527202 525758 524428 523264 522485 522367 522895 523691 524439 525263 526492
47744 526492 528100 529636 530749 531674 533010 535054 537525 539953 542224 544614 547360 550310 552989 555045
47730 555045 556568 557922 559156 559726 559144 557861 557123 557700 559102 560295 560844 560980 560916 560701 560548 560619 560518
47713 560518 559702 558465 557794 558065 558500 558311 557746 557535 557809 558093 558038 557601 556798 555818 555191 555329 555999 556675 557205
47694 557205 557690 557927 557517 556491 555312 554310 553587 553377 553859 554502 554235 552572 550225 548354 547510 547450 547613
47677 547613 547517 546973 546232 545749 545582 545202 544106 542455 540848 539528 538092 536012 533241 530197 527174 523907
47661 523907 519805 514654 508900 503231 497989 493106 488391 483638 478694 473763 469577 466842 465459 464637
47647 464637 463818 463193 463211 463974 465301 467073 469318 472119 475623 479882 484553 489041 493137 497235 501664
47632 501664 506083 509941 513350 517033 521317 525548 528720 530526 531653 533083 535254 537922 540688 543394
47618 543394 545909 547831 548839 549322 550200 551922 553998 555726 557031 558262 559607 561275 563991 568511 574466
47603 574466 580301 584741 588039 591416 595556 600028 604076 607582 611135 615363 620306 625398 629995 633915
47589 633915 637461 640906 644071 646500 647955 648652 649021 649424 650065 651039 652308 653692 654995 656145 657169
47574 657169 658077 658832 659435 659916 660184 659969 659004 657199 654605 651337 647682 644142 641006 637912 634071 629043
47558 629043 623050 616430 609196 601351 593237 585115 576612 567200 557235 547944 540166 533444 526590 518858
47544 518858 510360 501696 493460 485934 478977 472352 466257 461321 457849 455336 452979 450467 447982 445673
47530 445673 443503 441418 439293 436863 434134 431719 430227 429323 427929 425412 422098 418540 414858 411005
47516 411005 407199 403699 400505 397566 394972 392634 390157 387357 384595 382192 379826 376926 373435 369721
47502 369721 365907 361862 357787 354238 351463 349081 346562 343726 340667 337473 334134 330608 326914 323301
47488 323301 320206 317853 315952 314107 312408 311296 310865 310652 310163 309368 308584 308174 308367 309062 309750 309917 309634
47471 309634 309519 310044 311094 312256 313279 314259 315616 317855 321050 324529 327429 329595 331635 334115 337126
47456 337126 340599 344521 348633 352372 355323 357380 358395 358210 357197 356126 355210 353834 351616 349089 346777
47441 346777 344250 340878 337091 333966 331746 329629 327038 324261 321657 318950 315712 312070 308592 305747
47427 305747 303736 302619 302410 303112 304693 306841 308843 310034 310384 310393 310433 310527 310683 310969 311255 311334 311413 311991 313070
47408 313070 313984 314303 314431 314962 315821 316559 317212 318314 320123 322297 324416 326490 328832 331691 335089 338833
47392 338833 342615 346246 349850 353708 357857 361961 365628 368755 371517 374106 376615 379134 381859 384981
47378 384981 388354 391289 392883 392822 391877 391380 392021 393237 393907 393597 392894 392549 392534 392110 390637 388134 385163
47361 385163 382456 380629 379913 379994 380203 379987 379189 377957 376668 375887 376039 376940 377906 378531 379149 380372 382426
47344 382426 385155 388345 391663 394500 396357 397392 398293 399629 401574 404091 406912 409423 411054 411935 412790
47329 412790 414073 415557 416860 417906 418651 418817 418279 417438 416749 416063 414846 413051 411322 410243 409613 408667
47313 408667 406893 404479 401990 399730 397492 394916 392005 389186 386903 385233 383920 382651 381317 380100
47299 380100 379387 379458 380163 380989 381525 381837 382379 383577 385535 387985 390425 392364 393636 394574 395856 398057
47283 398057 401216 404721 407684 409509 410185 410090 409666 409331 409480 410264 411294 411774 411053 409045 406119 402704
47267 402704 399102 395590 392487 389928 387550 384615 380679 376115 371710 367799 364097 360440 357219 354728
47253 354728 352432 349387 345301 340784 336592 333038 330129 327867 326184 324889 323808 322848 321885 320855 319944
47238 319944 319437 319293 319128 318647 317873 316873 315598 314097 312596 311215 309857 308543 307635 307509 308101 308944
$$ [...]
##END NTUPLES=NMR SPECTRUM
##END=
