
##TITLE=UV1154_M4-1010-1000_6301887_lp42QUdC8l
##JCAMPDX= 6.0         $$ Bruker NMR JCAMP-DX V2.0
##DATA TYPE= NMR SPECTRUM
##DATA CLASS= NTUPLES
##ORIGIN= BRUKER
##OWNER= Administrator
$$ 1.72 TOPSPIN		Version 2.1
$$ 2012-06-06 01:41:39.781 -0500  Administrator@TOPSPIN
$$ Compression mode = diff/dup
##.OBSERVE FREQUENCY= 400.13188235
##.OBSERVE NUCLEUS= ^1H
##.ACQUISITION MODE= SIMULTANEOUS (DQD)
##.ACQUISITION SCHEME= undefined
##.AVERAGES= 8
##.DIGITISER RES= 22
##SPECTROMETER/DATA SYSTEM= spect
##.PULSE SEQUENCE= zg30
##.SOLVENT NAME= COFFEE_meoh
##.SHIFT REFERENCE= INTERNAL, COFFEE_meoh, 1, 14.98061
##AUDIT TRAIL= $$ (NUMBER, WHEN, WHO, WHERE, PROCESS, VERSION, WHAT)
$$ ##TITLE= Audit trail, TOPSPIN		Version 2.1
$$ ##JCAMPDX= 5.01
$$ ##ORIGIN= Bruker BioSpin GmbH
$$ ##OWNER= Administrator
$$ $$ C:\Bruker\TOPSPIN/data/COFFEE/nmr/UV1154_M4-1010-1000_6301887_lp42QUdC8l/10/pdata/1/auditp.txt
$$ ##AUDIT TRAIL=  $$ (NUMBER, WHEN, WHO, WHERE, PROCESS, VERSION, WHAT)
(   1,<2012-06-06 01:41:31.593 -0500>,<Administrator>,<TOPSPIN>,<go>,<TOPSPIN 2.1>,
      <created by zg
	started at 2012-06-06 01:40:24.718 -0500,
	POWCHK enabled, PULCHK disabled,
       configuration hash MD5:
       D5 CA 7A 23 FE 6B EE E2 50 67 74 61 24 F7 5E 3B
       data hash MD5: 64K
       F4 FB 34 1D D2 26 04 DF A7 26 A6 6C 84 29 B0 BA>)
(   2,<2012-06-06 01:41:35.093 -0500>,<Administrator>,<TOPSPIN>,<proc1d>,<TOPSPIN 2.1>,
      <Start of raw data processing
       efp LB = 0 FT_mod = 6 PKNL = 1 PHC0 = 0 PHC1 = 0 SI = 32K 
       data hash MD5: 32K
       98 0D A3 5D C3 ED 89 FA 10 45 CA 43 2B E3 EE 94>)
(   3,<2012-06-06 01:41:35.515 -0500>,<Administrator>,<TOPSPIN>,<proc1d>,<TOPSPIN 2.1>,
      <pk PHC0 = 208.9435 PHC1 = 0 
       data hash MD5: 32K
       6F 67 78 20 A0 7D 13 1B 55 06 F0 B9 42 5D B4 36>)
(   4,<2012-06-06 01:41:35.687 -0500>,<Administrator>,<TOPSPIN>,<proc1d>,<TOPSPIN 2.1>,
      <abs ABSG = 1 
       data hash MD5: 32K
       36 C8 39 A2 DD EA C4 83 F0 63 2F 09 A7 D7 47 11>)
(   5,<2012-06-06 01:41:35.796 -0500>,<Administrator>,<TOPSPIN>,<proc1d>,<TOPSPIN 2.1>,
      <abs ABSG = 2 
       data hash MD5: 32K
       D6 F6 3B F7 0C B0 9C 70 51 D0 29 CB 7B 49 E6 0D>)
(   6,<2012-06-06 01:41:35.843 -0500>,<Administrator>,<TOPSPIN>,<proc1d>,<TOPSPIN 2.1>,
      <abs ABSG = 3 
       data hash MD5: 32K
       74 2D 78 18 81 FF BE EB 4F A6 64 B1 F0 FB 63 21>)
(   7,<2012-06-06 01:41:35.875 -0500>,<Administrator>,<TOPSPIN>,<proc1d>,<TOPSPIN 2.1>,
      <abs ABSG = 4 
       data hash MD5: 32K
       FF CA 82 47 89 1F 6C 90 85 06 CE BA 8C 57 56 92>)
(   8,<2012-06-06 01:41:35.906 -0500>,<Administrator>,<TOPSPIN>,<proc1d>,<TOPSPIN 2.1>,
      <abs ABSG = 5 
       data hash MD5: 32K
       94 4B A5 3A 27 B1 F9 3D 43 3A B5 37 7C 10 B7 A8>)
$$ ##END=
$$ 
$$ $$ hash MD5
$$ $$ 16 F3 93 87 5C F8 90 30 1D FF 23 3D 75 B5 AA 09
##$RELAX= 
##$RELAX= 
##$RELAX= 
##$RELAX= 
##$RELAX= 
##$RELAX= 
##$RELAX= 
$$ Bruker specific parameters
$$ --------------------------
$$ [...]
150 150 150 150 150 150 150 150
##$TP07= 0
##$TPNAME0= <>
##$TPNAME1= <>
##$TPNAME2= <>
##$TPNAME3= <>
##$TPNAME4= <>
##$TPNAME5= <>
##$TPNAME6= <>
##$TPNAME7= <>
##$TPOAL= (0..7)
0.5 0.5 0.5 0.5 0.5 0.5 0.5 0.5
##$TPOFFS= (0..7)
0 0 0 0 0 0 0 0
##$TUNHIN= 0
##$TUNHOUT= 0
##$TUNXOUT= 0
##$USERA1= <user>
##$USERA2= <user>
##$USERA3= <user>
##$USERA4= <user>
##$USERA5= <user>
##$V9= 5
##$VALIST= <valist>
##$VCLIST= <CCCCCCCCCCCCCCC>
##$VD= 0
##$VDLIST= <DDDDDDDDDDDDDDD>
##$VPLIST= <PPPPPPPPPPPPPPP>
##$VTLIST= <TTTTTTTTTTTTTTT>
##$WBST= 2048
##$WBSW= 25
##$XGAIN= (0..3)
0 0 0 0
##$XL= 0
##$YL= 0
##$YMAX_a= 506906
##$YMIN_a= -621691
##$ZGOPTNS= <>
##$ZL1= 120
##$ZL2= 120
##$ZL3= 120
##$ZL4= 120
##$ABSF1= 14.98061
##$ABSF2= -5.57192
##$ABSG= 5
##$ABSL= 3
##$ALPHA= 0
##$AQORDER= 0
##$ASSFAC= 0
##$ASSFACI= 0
##$ASSFACX= 0
##$ASSWID= 0
##$AUNMP= <proc_prof1d_extract_pilot.lims>
##$AXLEFT= 0
##$AXNAME= <>
##$AXNUC= <1H>
##$AXRIGHT= 0
##$AXTYPE= 0
##$AXUNIT= <>
##$AZFE= 0.1
##$AZFW= 0.1
##$BCFW= 0
##$BC_mod= 0
##$BYTORDP= 0
##$COROFFS= 0
##$CY= 15
##$DATMOD= 1
##$DC= 0
##$DFILT= <>
##$DTYPP= 0
##$F1P= 0
##$F2P= 0
##$FCOR= 0.5
##$FTSIZE= 32768
##$FT_mod= 6
##$GAMMA= 0
##$GB= 0
##$INTBC= 1
##$INTSCL= 1
##$ISEN= 128
##$LB= 0
##$LEV0= 0
##$LPBIN= 0
##$MAXI= 10000
##$MC2= 0
##$MEAN= 0
##$ME_mod= 0
##$MI= 0
##$NCOEF= 0
##$NC_proc= -8
##$NLEV= 6
##$NOISF1= 0
##$NOISF2= 0
##$NSP= 0
##$NTH_PI= 0
##$NZP= 0
##$OFFSET= 14.98061
##$PC= 1
##$PHC0= 208.9435
##$PHC1= 0
##$PH_mod= 1
##$PKNL= yes
##$PPARMOD= 0
##$PPDIAG= 0
##$PPIPTYP= 0
##$PPMPNUM= 2147483647
##$PPRESOL= 1
##$PSCAL= 4
##$PSIGN= 0
##$PYNMP= <proc.py>
##$REVERSE= no
##$SF= 400.13
##$SI= 32768
##$SIGF1= 0
##$SIGF2= 0
##$SINO= 400
##$SIOLD= 32768
##$SPECTYP= <>
##$SREGLST= <1H.CDCl3>
##$SSB= 0
##$STSI= 32768
##$STSR= 0
##$SW_p= 8223.68421052632
##$SYMM= 0
##$S_DEV= 0
##$TDeff= 65536
##$TDoff= 0
##$TI= <>
##$TILT= no
##$TM1= 0
##$TM2= 0
##$TOPLEV= 0
##$USERP1= <user>
##$USERP2= <user>
##$USERP3= <user>
##$USERP4= <user>
##$USERP5= <user>
##$WDW= 1
##$XDIM= 32768
##$YMAX_p= 433292504
##$YMIN_p= -690674
##$CURPLOT= <Network HP LaserJet P1505>
##$CURPRIN= <$Network HP LaserJet P1505>
##$DFORMAT= <normdp>
##$LAYOUT= <+/1D_H.xwp>
##$LFORMAT= <normlp>
##$PFORMAT= <normpl>
##$SURQMSG= 1
$$ End of Bruker specific parameters
$$ ---------------------------------
##NTUPLES= NMR SPECTRUM
##VAR_NAME=  FREQUENCY,     SPECTRUM/REAL,   SPECTRUM/IMAG
##SYMBOL=    X,             R,               I
##VAR_TYPE=  INDEPENDENT,   DEPENDENT,       DEPENDENT
##VAR_FORM=  AFFN,          ASDF,            ASDF
##VAR_DIM=   32768,         32768,           32768
##UNITS=     HZ,            ARBITRARY UNITS, ARBITRARY UNITS
##FACTOR=    0.250966925370066, 1,           1
##FIRST=     8223.43324360095, 88656,        -104004
##LAST=      0,             -178110,         -76740
##MIN=       0,             -690674,         0
##MAX=       8223.43324360095, 433292504,    0
$$ Real data points
##PAGE= N=1
##DATA TABLE= (X++(R..R)), XYDATA
$$ [...]
23833 -63740 94725 127279 -96128 -253328 -122006 -185729 83037 156098 -172143 -175795 -219449
23822 -219449 -366349 19620 15957 110019 18391 234357 -53881 28746 185141 -128836 -38818
23810 -165246 96775 -171471 -10324 -84692 171180 -226258 -40923 210629 -360873 -116000
23799 -102289 -347984 52684 -79874 -163810 92404 -35371 -27494 23568 3531 -164045 -129524
23788 -129524 2604 -236542 -169853 306171 -63028 -208358 101856 -36887 34509 24228 5291
23776 146928 -74326 242256 173160 115694 -27968 -348444 153564 14905 -45454 -118741 -59906
23765 -59906 -45511 -24109 43710 141007 -170548 -12304 36333 -110938 128129 205059 128527
23754 128527 -180577 -125213 -146608 -30874 -18569 -5411 -459324 -29218 -193567 44906 -388218
23742 295870 281181 -196367 -212320 -114811 -42512 -22185 -146323 -22944 168628 -297490 45975
23730 156861 16556 -10862 43829 -219120 -45895 25053 139746 131818 170525 -371827 3213
23718 -218985 -12106 93233 -242710 104892 -630004 10206 61130 113269 -66661 -119570 -60727
23707 -60727 30603 59000 27175 24883 -12173 -29698 -162341 -36507 -117747 -56212 62374 19983
23694 -121689 -176917 20436 226079 92689 -156500 121268 12191 121967 121282 -11671 -72646
23683 -72646 66784 127492 140519 278200 -434822 -119347 -171599 271430 71245 -145386 -166312
23672 -166312 -56589 125419 202990 -76726 -73949 -145933 59230 252160 145737 -104300 136889
23660 38731 -249269 177050 171380 275815 -185271 -94278 32406 297054 315780 224495 -211215
23648 81218 1388 296711 148872 136473 -62512 -10196 -14413 -51234 10707 4624 78643 -308877
23635 -3125 -30204 92418 -108270 210418 118588 -73578 85735 139246 -140255 -228813 364431
23623 136728 148663 201828 -81398 2132 38018 140964 -1410 218216 194886 -17796 322781
23611 -27500 -28076 -123994 191627 66028 27158 309326 198954 62395 4082 -95461 158062
23599 69691 -90974 22303 -92144 -175002 -180321 179314 -302537 -33291 -47923 -92567 38962
23587 -169002 185405 -294599 313918 7891 -25528 -113201 -149005 -120288 -2592 91394 -37002
23575 -10556 176198 -102693 -42542 -196380 -146092 -129872 -55701 36004 35219 -25992 -68842
23564 -68842 -281832 -112243 -189482 -64257 -181229 38906 5531 76598 57672 -277334 -75444
23552 260209 -100211 237563 -327480 287722 -219357 121423 -155646 -156222 143876 150858
23542 150858 344194 -171448 -125353 -53254 549677 59005 -328653 279795 -88749 -124403
23532 -124403 71368 -85178 -312530 -327825 -214763 -134415 9668 87587 36696 201115 -156077
23520 -124612 -100365 65986 -63495 89508 108201 47391 97681 -156131 376188 200693 57342
23508 73689 -45074 -176530 -205994 -17412 451620 45631 -303762 22445 313892 42204 239046
23497 239046 -94376 -391707 -329019 -133288 -369007 -37070 67159 -19126 -73813 -48737 -354938
23486 -354938 227193 -106701 -79604 -90751 -191556 320220 -135674 -106450 -37597 122004
23475 18580 84912 -289072 -276778 51123 5137 45738 252849 -214513 151390 446136 24764
23463 40472 -265319 42002 -132617 -152297 -227624 -165926 8759 -161866 139289 -495004 79800
23451 84519 -227593 86332 141509 209853 72787 -55663 71660 -316758 493 66083 1991 -22258
23438 149492 -70730 80338 98291 -12597 -122141 106245 -129107 -135892 -99576 -131122 -321925
23427 -321925 -100612 -29699 -248388 -62926 -48296 142927 -49311 -6161 -169625 -193872 81478
23415 204437 59486 116107 -46816 150672 99510 -95907 -229527 -50551 273994 -305058 -138503
23403 257120 89761 181309 177708 247922 -334421 227734 -122884 -40261 75605 -186580 54117
23391 -62170 -98234 250257 -125462 42639 -161323 -48524 289999 52239 -187041 16864 281182
23380 281182 54149 -202299 -50406 -130327 -132296 -118601 -14825 -27332 -1176 -10486 132797 -60444
23367 -9075 265675 240484 117659 -143161 -165147 -25403 -91804 -198144 -9025 91738 15814
23355 -2020 -407175 -129362 -128013 -83119 395913 193630 59520 -326057 68462 -343129 97946
23343 -204521 174784 282659 -86323 35016 400522 18117 -98773 -9097 32613 -283696 239486
23331 -125626 16106 131469 -74869 153874 -28446 38885 51323 208607 29507 -162226 -55874
23319 65399 -148114 -145471 -94882 64798 -145664 162829 -204377 44472 24593 -342111 -152916
23307 -247982 54748 -152285 -248594 322755 158663 -27605 188917 -48104 20247 5874 71960
23296 71960 -305241 -188100 161197 -132922 39680 -163659 -101404 -30976 -50864 93934 122668
23285 122668 -57425 55809 207742 -191707 -65263 -106957 47780 83800 -150470 -55488 46480
23273 -161824 73211 -6316 -226678 21219 -392073 -299140 -48205 -304852 -187079 -156952 -56652
23261 261949 -199995 -28501 123989 -261572 -80789 23005 10927 -61287 37137 -13532 5545
23249 229877 -11452 150420 415833 -31772 110859 -268243 -119840 -59425 -126071 -221248
23239 -221248 -272596 -188808 -103083 389217 -31030 64757 -162908 -317092 -76282 38274 -22728
23227 118795 279578 53108 -139181 45346 -24223 9166 78725 -98162 130337 -26510 -68698
23216 -68698 -11307 120819 91565 62574 -90400 -24477 275727 -225388 -156098 264378 -7183
23204 -30873 56601 -113189 -56513 -373061 -114618 -198124 81895 -168748 30683 78643 -131842
23192 162067 -194241 -96371 89077 -132669 207760 43266 15082 -122598 191243 82729
23181 141862 12171 -183111 -348250 -202524 272859 359080 -199571 18616 210975 -116126
23170 -109101 -222289 70796 58777 85602 41659 -107125 -145589 -157996 -124867 -254634 18149
23158 -95020 -193006 -167324 226827 -145314 -54036 144414 -111610 -52534 -45225 -128330 -172441
23147 -172441 -51851 -107427 7303 -167919 227301 39935 47489 140755 -182739 149494 140570
23136 140570 -2360 -19712 442845 348373 -178789 86869 -141353 -1741 -165669 13148 389590
23125 389590 -11664 -73586 -154936 -276363 119070 146953 -175756 145015 165150 -372278
23114 156592 -150450 102072 195747 6484 -53412 -86714 214597 -106863 -21316 -152409 -86538
23103 -86538 -154667 113786 -56228 -200111 -97449 47383 -125010 267785 361260 40647 282574
23092 282574 -95926 -234538 259645 164780 -137998 118923 174844 -108260 -48049 367518
23081 135367 -5408 118737 -62379 805 287753 41285 -100925 166624 -94522 -17951 98085
23069 -118887 -17003 -59553 157611 166694 -159199 6363 -132452 186843 28138 141455 -27140
23057 -222026 -101302 -52586 237385 -126405 -405945 -148882 -178782 -236508 -146872 -316194
23047 -316194 -14934 -344753 -146625 104764 -193940 168934 -120386 -36289 -140466 41185
23036 282480 -303643 18327 -92142 157101 -33415 -28577 -31405 221017 261049 25788 209501
23025 209501 -152236 -74579 -193651 -74041 -140883 -182746 -7603 -95524 -27382 57517 229521
23014 229521 104795 15064 -83339 183512 231482 20931 70350 360827 232725 -97568 -162677
23003 -162677 286260 1780 44226 -78615 -442231 183223 120557 11789 33316 -105476 39179
22991 -68061 -95123 -213576 -342590 -4647 209688 13636 69694 -261806 -117396 22543 -142231
22979 -31516 -95628 -138179 -279570 -51695 -143522 28672 -245135 -17981 -149942 -110845 303075
22967 -64962 135148 -302786 -140858 -229565 -241214 -152652 -150166 -149433 -275489 182353 -178990
22955 -187030 368104 63318 146737 -19722 334182 126195 -88294 -51749 -93771 167144 171454
22944 171454 -25818 4770 -246707 -255891 -300916 -73312 99557 124938 -46077 104928 -112070
22932 -102870 -60441 -61762 4793 77787 -48458 -21670 30737 -7178 15236 96811 49445 -292643
22919 -191257 107720 -38306 65567 -138421 -77833 -132237 195493 -57920 -107338 176068 6412
22907 99091 -60446 -82488 -18985 85679 -69202 -5761 108007 153900 -40699 -20730 -169639
22896 -169639 -17749 -50936 -151430 -88277 -346201 -226053 64567 202367 -164138 -34005
22885 21545 24355 49118 -116661 -285686 -251020 240 -414394 -112767 -2717 119803 36931
22873 32392 262910 -235973 195754 361329 -104263 62202 131645 -257841 -87510 770 43650
22862 43650 168874 -120626 242995 13831 -290870 -170364 -105137 18772 172871 40420
22851 -233500 -141341 -66759 -54916 -183227 38072 169083 -251458 -288629 -12713 202808 176411
22840 176411 -15948 -210317 -34703 -43530 370349 -25321 -51413 405108 -131982 84420 -281113
22828 186808 -298587 -68280 -82005 -128227 32726 -277230 -216878 141137 -610522 525493
22817 -302143 272014 -117454 -170419 -104694 -137439 -221289 6632 -183845 -93843 56780 -133486
22805 59040 4353 258041 26871 109538 -29565 -311878 -58809 69344 -90746 -146103 150785
22793 218912 -187511 -81348 -220967 -129596 -93505 24645 -208857 -96406 99771 213365 242654
22782 242654 -320926 182445 75187 -238970 51322 -54399 -86685 -208522 82404 -194280
22771 -114423 -161220 48545 -192540 -46389 129100 221059 -40315 -169714 -172975 -118723 -139891
22760 -139891 -46957 -129128 33590 -19215 -202836 -102596 72261 -59554 54129 166023 -88711
22748 94670 -4769 154342 40451 191887 225255 88582 167791 46269 127361 77682 -247665
22736 -272288 92238 -226308 234520 -226542 -48611 122063 51346 69496 -170224 -167392 93340
22724 -377218 -87212 -317434 79195 -49778 -23122 -223890 85124 -84007 182031 -156592 -204734
22713 -204734 198493 126703 -262527 -288760 -214872 14952 126483 -332564 -182697 20329
22702 -305739 -62900 35547 223600 106542 16364 -102838 -331002 114640 -58313 -25099
22691 -172145 -39410 -8604 -132444 137354 218440 76711 -219088 11875 90865 105482 -25113
22679 209498 89485 -180879 -50292 260306 -284158 76295 -70926 -25522 -43748 -202740 -339442
22668 -339442 -45706 -157054 -351963 -228189 60791 71418 -145660 288992 -144869 -63602
22657 -31977 -18647 -78842 -235797 -295160 11621 265307 -238747 -358618 -193218 263656
22646 192021 -268649 92137 52733 -54150 -285359 202346 -144225 -190434 -121720 -303472
22636 -303472 187554 -161384 -130399 36907 -12521 -49356 35457 381021 24576 -139081 -91448
22625 -91448 247880 -65164 -48898 207601 207285 67729 201277 -67716 -196088 179297 -403712
22613 -36615 31405 110415 158718 -40794 -51051 -71221 191369 -183700 164810 166020 15550
22601 -4084 -177385 -74237 -95389 4068 -174970 -116116 -358853 64543 -441928 -45774 171881
22589 -287704 277757 -217757 -173404 61738 -76455 67230 -56778 16752 -232475 -177045 -230860
22578 -230860 -269682 -224188 -296833 199424 -31861 56645 -124516 101028 80121 -60539 -2946
22566 -127760 87236 -221276 254648 -100633 22286 -98462 53137 -144904 -129966 259336
22555 70294 -348707 -98479 120149 -84461 305850 -102745 113906 -59792 189609 -22062
22544 116582 334482 -26764 15110 -412958 -39330 170706 -38554 -255711 146290 -133129
22533 22157 294925 253314 121131 -54816 -79392 -135674 259675 -167218 127103 -100984
22522 -266028 -331748 -276241 55244 -59796 97034 -349580 -376324 -344405 -31911 -148987 -167522
22511 -167522 -238660 -51465 161486 54067 -307340 -232595 32870 13822 149386 -5488 94353
22499 45073 -179671 247746 -303214 67718 -64722 -72668 89172 270139 -170452 -485888 73650
22487 235508 72852 -186526 -247044 -98418 396436 36389 -32573 -128139 108596 -467577 -12411
22475 -105220 -151559 42144 -178281 -101249 68113 -67609 -17163 -250895 -380821 -76408 -137212
22464 -137212 -236233 -11698 45726 -136931 -8326 137296 64754 -109699 212488 62421 -94804
22452 -158182 160903 -257879 -181595 -283875 -275359 -238954 21795 121254 139083 -49619 99218
22440 189929 3628 -225447 -148601 8381 52334 -66335 -123600 -60830 5983 -54091 105614 50452
22427 13327 154298 204456 91690 -41574 134384 12885 156465 -319891 239327 304033 -228273
22415 -77437 324401 -53047 -107213 -871 79631 -70093 -155480 172092 52790 32142 79337 93495
22403 93495 238799 -305869 -244914 -13669 18999 37068 -117920 -185785 -35844 169060 36568
22391 250564 -10151 -116022 65946 192077 66166 40032 -118750 -52906 70055 -91095 79692
22379 -41224 60598 -188230 -195162 27153 -53270 -168897 -183348 -216770 142755 -136401 -92752
22368 -92752 308236 37853 -169024 -79528 203571 -388419 -140723 -8321 152102 -131955
22357 -202367 84311 -57786 -273865 95995 91036 40659 237345 184022 86676 106687 236571
22346 236571 -295563 93281 -222979 33948 390725 -9478 -428370 -21809 -97182 -13198 61714
22334 -137630 -195987 101518 -204994 -173302 121718 -329825 87578 10771 -191856 -227454
22324 -227454 62071 -58520 -63470 -73114 -181388 143246 -154693 118081 -40386 194565 -29495
22312 -177378 163405 149649 -155682 -328456 253647 -128171 -300306 39675 82976 -304202
22301 -284987 -316457 -44801 103147 33095 -132809 25460 -201646 -31333 161028 37333 -56583
22289 35360 178724 133442 -205699 -318108 90784 -254005 -100991 -214171 58666 -53643
22278 -168861 -82506 355529 -128587 -130736 269929 80614 -135660 -37108 -83572 233735 -228354
22266 -153745 -7733 -221960 -382969 -131248 -347987 37318 -17462 61041 -31548 28874 27432
22255 27432 -96114 227739 -11258 54595 -113714 5087 -99004 -401979 135630 -79413 -224211
22244 -224211 -67348 -116322 -178139 -142621 -256158 -16894 -204299 -279394 45694 224808 -108392
22232 132057 127968 132651 -108376 -62 -53213 -29785 124320 -175176 153899 -166046 42662
22220 -98843 186102 -330202 -210157 -234977 101510 -253912 -223206 -105602 295845 194690
22210 194690 62924 196552 141034 -83830 77229 64484 -378616 -448214 96294 232085 328179
22199 328179 -144936 -153116 -202016 -291023 21888 -431884 293401 -62167 191260 -128178 114826
22187 96528 63096 205563 -110386 84516 -82001 -287424 27581 -318753 -304572 -131216 -86022
22176 -86022 -203011 275728 41436 16468 -29560 48673 -102966 -58683 -149838 52707 54975
22165 54975 -265403 -301032 -76439 400 -472570 -25904 -94499 -194870 -106996 -90953 11215
22153 149640 -14286 2872 -28183 99539 -64864 -126794 61293 -182444 229174 -257916 175733
22141 -59454 110418 -347480 -437601 68924 128797 -262132 220474 83823 80210 -11266 -25179
22130 -25179 164885 310607 -168993 -73604 109717 5581 107549 -72125 -92319 -217213 -41146
22118 63206 26321 -376322 36263 23821 26949 -167945 -103157 9311 -103099 211575 -106375
22106 37390 -191046 -297363 228541 -215657 -65942 -67760 -23338 70714 54547 -4920 -143780
22095 -143780 -65857 30602 -124332 -202767 165261 -274282 -61374 -150811 316889 -49285 -106491
22084 -106491 -11424 -275854 -14549 43782 -268129 13873 149699 2481 59043 92419 -289207
22072 -138190 121245 227799 -93197 -36089 -63123 9927 249537 -227598 -21784 -207089 -364402
22061 -364402 133627 -23263 -69118 -8153 -102656 53993 -83977 34980 -137586 -63301 79726
22049 125158 107526 -253850 -116890 -137033 197610 63496 12462 -245946 9960 188130 -10909
22037 -202895 89370 -130120 218218 154789 -207858 -350909 -305853 -62101 -318086 100552
22026 -105076 -93118 -218769 -52477 203776 50740 172271 -20882 80295 -7823 -312960 25396
22014 170587 -200594 20988 -129938 200197 68938 36196 -191856 -220184 -108226 -244512
22004 -244512 120909 148060 -81303 -253238 -311588 16440 249519 -181270 7859 163455 7665
21992 301563 46604 207843 7131 15936 -29661 79042 32866 -164537 -125533 -145618 306306
21980 73010 -181156 -150421 -137454 -155700 123053 -58108 176251 -173810 -190417 22433 151060
21969 151060 90557 -80339 -197895 418854 -44903 -126977 55797 -211813 6877 -266627 -17498
21957 57416 149623 -112292 -185343 44628 269989 -119048 67240 -149527 127916 36510 201747
21946 201747 -59713 -310255 -142674 -268082 -295813 -194209 17676 -120887 -48694 60259
21935 -235 50532 247937 -11231 27919 -176385 -32286 163823 -78859 123107 34894 -136345
21923 4432 238223 -7626 -183619 118445 -74131 -204718 -31946 96501 139850 -17423 -97537
21912 -97537 -218502 -34633 -146354 -55375 79988 -261908 -80251 -456032 -76474 -27517 -172748
21901 -172748 136336 -145234 -99148 -180212 90250 97021 24136 120356 -85068 -174824 120871
21889 -134751 -228574 -252503 -28928 123572 280363 -88952 212007 254133 -110351 122203
21878 -382063 -18807 136108 -93086 136876 152145 -81112 8261 -301726 15717 -452033 -14824
21866 184592 -434717 204541 -128305 -324523 10912 109952 -68668 142564 196627 83869
21855 -92662 -468873 47374 179088 -149438 -399325 -402361 -72910 46062 -145802 188232 47256
21843 -67597 209834 -61798 28866 -102992 -128397 -60474 -94234 -37039 -264712 263538 -124556
21831 51069 -210966 -132714 -134254 -240319 393036 -21336 37704 -55097 -68807 -96156 -117948
21820 -117948 12071 -2210 137052 -59027 125748 -38843 -229315 55288 -282517 -226970 -352682
21809 -352682 61234 -40828 -135173 15799 255159 -169275 -317061 -112904 -124441 -122603 -65836
21798 -65836 31443 -96896 -149576 85005 -97926 -165995 306582 93779 -127340 89639 -205492
21786 144249 400906 -10410 -229101 152216 323832 -141280 -172423 -172796 -83859 -23839 230927
21774 36789 9256 -307051 2552 -223698 -77719 25600 -142096 277637 -37939 -27940 -119175
21763 -119175 -245005 30815 251351 -133496 306991 -119695 -35537 246069 -195247 102170
21752 -305843 -102479 -96190 -161197 60087 188312 -184697 137778 69495 154251 -170381 59606
21740 79121 -180291 -123040 -98230 -14665 -190595 -64642 -52287 -78718 -151720 -14558 -120554
21729 -120554 5503 15814 218210 -250253 9372 -15088 -39042 -74117 30915 24048 -52964 75470
21716 -155821 -146408 -251182 112992 133255 138864 228795 -122854 -86516 305016 -122520 -361557
21705 -361557 -30862 260528 3846 35886 -70914 -387482 80124 -190771 -61367 102196 -96475
21693 -310484 -99739 36084 -170119 -134728 36264 -152028 88848 -314654 210960 -190222
21682 315804 19189 80729 -342418 7855 118626 -217078 70193 -46753 -429696 -106125 516
21670 -240264 -67566 94570 13638 142481 99002 -235360 177635 -118744 217333 -218197
21659 -117554 109403 180371 344377 -193764 176751 -28696 121605 -68221 147577 -198847
21648 26656 141354 -199008 -266010 -116532 -20672 -62923 -44547 -274445 -12080 -44046 -7633
21636 -93875 20775 -96133 248153 -34241 -87988 -226036 -18950 78967 -263349 -133918 12650
21624 33206 -200380 -138060 -93594 147838 114467 -337034 -133649 -186694 -310657 -43578 50852
21612 101606 -69225 -121850 -66243 -164563 -90802 -129860 16689 -339197 -125280 -80353 -1882
21600 -268017 -44671 108045 -48422 185216 -50614 64894 -110021 107339 -54141 -84705 -104311
21589 -104311 -171429 -6427 -12658 35795 58973 459479 -115185 55021 -177568 -259113 -95044
21577 106549 -136913 -50385 -182925 -276832 -16178 -246588 -68245 369189 -312337 -121155
21566 33805 -11668 -6757 -266268 87482 236530 -305027 -80989 117541 -279675 -262934 -342729
21555 -342729 98117 -219800 -240395 11883 252974 -167754 -179611 -50753 142245 138431 223961
21544 223961 -41611 142304 -275175 86374 -312683 -91608 65640 192030 461 -39671 -147315
21533 -147315 -215306 -204762 -50243 -191429 -5473 49843 136086 -248782 -193397 -44651 -9813
21521 -16863 170540 -254322 42571 -60007 232581 -176081 -283816 337564 -193764 -62429
21510 -9740 -102168 -152963 6236 -84782 84399 -11976 107168 265159 -15513 368360 -172091
21498 88025 -44532 -286168 314006 207919 55755 -73623 -250645 190270 -240211 195663
21487 79735 -393714 -162632 -4520 144716 -250370 -244886 147648 2166 13856 141241 69856
21475 -139854 90062 -299226 170030 -108817 55813 23829 -134250 -107443 116847 -343785
21464 82468 41016 -242246 -180033 -263740 -84196 -237348 112288 -96426 -4125 240775 -309673
21452 -22336 12917 177129 146910 -153875 169241 78414 310599 -194387 -19610 126010
21441 -70755 22953 10604 -166776 -241814 48957 -145745 -370689 153958 -127518 -98794 -404648
21430 -404648 18884 -9214 231519 511141 247772 150627 467565 371741 162798 371664
21420 371664 210486 176977 315736 -31056 163265 225973 -29440 155428 84928 70764 -133510
21408 228525 -152141 -48654 -143447 34240 137668 -169011 -89532 113431 -19727 60450 1523
21396 -189097 -243654 123820 -40274 -54756 -121291 -15847 -197035 67004 -125030 -236026 195895
21384 37172 -84930 -327991 -51751 -171040 -94133 -287875 -13415 -78821 190761 -57223 -49821
21373 -49821 57876 -129734 -119435 -127005 -30722 -65901 142828 -14639 98624 -231465 -159130
21362 -159130 -37677 33879 198226 -68696 192519 162343 18642 -256636 121909 383194
21352 383194 -149303 143178 -8099 -273467 4334 -244123 -169835 -346450 270055 -164826
21341 85848 -174082 -4552 -21213 15751 67190 -99984 -242022 19489 -72857 173306 -414908
21329 134432 22275 -165854 -281508 183726 -140169 -372850 -361426 -108001 -388988 106990
21318 -26078 -280724 239170 83030 -355147 -151239 -154147 128480 47700 -156381 169668
21307 -122422 -282447 -22400 58614 -235153 -26889 -186036 -106913 -258386 -35111 -77939 12022
21295 107079 104910 -10488 -213735 36686 -15963 -205427 100533 -207777 -92165 -105012 134913
21283 -414865 -288979 86245 19570 -26874 244735 -216412 150032 -570563 -25408 172716
21272 -179091 237374 307675 -201341 160211 -333795 -179516 204629 -47650 113323 -206647
21261 -163942 -367256 -193190 40634 41501 188228 107718 -74831 -55255 -6272 83009 37771
21249 -114096 -26273 89277 -31884 -15688 -164605 -121742 -144926 -24137 -102330 295605 111114
21237 111888 -332316 -60027 -192671 -82874 -99417 -280711 70109 155062 -60313 -182305 -200516
21226 -200516 177753 -107009 323485 -13944 -102319 9684 -176046 -80939 105568 250976
21216 250976 -120053 62079 -74629 -192341 -46170 -174265 -72817 186505 -53702 -51330 -73222
21205 -73222 -168208 220148 103713 -367445 213843 -256579 -129250 17479 -6594 50839 245836
21194 245836 -224526 -192770 226941 257935 -17785 173492 -158811 94392 139674 -110269
21183 274231 6433 -174328 -43974 -291283 -209352 310298 -26013 -252833 102564 -102192
21172 13980 62817 217952 -1438 -150000 -250423 -254723 33216 -52440 141597 -215927 34467
21160 107153 -47680 75793 -396084 74411 -326642 -198012 -91823 -89822 -261863 -9929 -109795
21149 -109795 195012 75333 -224149 -71593 -411911 45853 -166296 139032 -302029 88049
21138 -111180 -185740 85611 -98288 103837 -225367 97409 -35060 -279177 -199042 -173952 -269830
21127 -269830 -77658 37654 348560 -105864 -43281 149250 47996 -248579 154522 76402
21116 148515 -3623 -69125 -72771 -29076 -190918 -261987 -233362 40508 -115559 -464118 12300
21104 -504210 -376177 -215468 -133566 78175 131482 146952 -164878 287297 -202459 179424
21093 63529 -165617 -6617 -32022 -83742 90245 -100943 50312 49290 -101391 51977 -44754
21081 -231296 -96958 -69039 66812 -137101 -262121 -253902 -142003 54341 -195975 -255297 -133630
21070 -133630 -51086 -98725 -6929 -98964 198032 -149211 83001 128856 -18476 69539 152990
21059 152990 -30122 -107671 109397 123368 208050 -86674 -174436 203194 80986 93813 -90372
21047 5878 -119472 259174 123974 -364 69181 -66950 -198466 114228 -60617 75057 -285150
21035 134794 -178720 -220966 143497 -290281 171141 32794 270398 69060 14056 42278
21025 42278 40826 54492 261364 48779 77976 160132 -127523 226258 -297525 -77940 -141250
21014 -141250 67802 104921 -103708 38305 92311 127221 -73521 -234505 315434 -104136 171834
21002 -3265 -255418 293652 -455084 -174688 8034 -149494 5937 140082 40079 5761 64072
20991 64072 73052 -31937 122780 -63293 -208368 -231134 37839 399078 130262 114831 -101480
20979 -26530 -133925 95733 -349742 -259286 56448 -24854 -454722 -105684 -258966 192507
20968 -172254 -87181 -100441 214623 45906 -193664 -234769 -77535 217243 -185671 33775 -11961
20956 159651 -208345 -150327 -87356 31643 215986 5559 -278872 78145 181303 -14688 162115
20944 -189594 -60332 363282 -144269 -15937 -207918 -239019 -119227 -24906 9084 -422014 45634
20932 -16991 -310186 -130804 -172292 -76309 32151 -342543 -204482 -450553 133368 -227810
20921 164071 80115 -31313 23696 7109 -21223 11423 -62062 105981 -236733 -174155 241328
20909 -120849 -356237 22389 -154222 -406638 -132878 -221625 172430 82070 -142187 -175302
20899 -175302 -219384 -58463 -45986 -169011 -52170 188146 -130028 238331 -256653 280572
20888 -30194 -461499 -354795 144929 163090 -41269 -140082 64850 -39376 -8513 -177691 112736
20876 -149546 -84502 16906 49135 -308925 -206289 -145101 131897 104237 -59013 -152970 -137628
20865 -137628 532025 -530584 -381128 -167101 -231591 -276518 152144 -94682 19928 133810
20855 133810 -262489 5810 218277 -91374 168917 167678 95711 126517 223522 -210661 -70011
20843 -264103 56198 85169 -232645 -22254 -24823 -278867 -2299 36531 176046 127594 152039
20832 152039 -250299 -134275 -101425 -204053 -133616 -216991 -231087 -195711 302744 -124715
20821 153166 -95862 369006 -156647 -271702 -63296 199338 -38863 134894 -116826 134652
20810 91480 155156 -199578 -61646 -69229 86599 -339309 -64180 -34987 7673 -187328 -184101 377412
20797 69848 212458 -134046 -16029 -307582 -184566 -150048 -125014 -84627 -326040 -8138 -28720
20786 -28720 -68343 13129 -138018 188235 194449 58668 -228463 -432 32992 -1186 -258649 36156
20773 239560 -153454 -135206 220189 347721 -322272 -353005 -290811 160337 -60239 228318
20762 -75322 -47980 83213 -99126 -106039 119696 -42803 -20668 127498 58587 -34609 -46913
20751 -46913 13073 126430 -45135 -88974 25276 -43653 243298 -292359 203261 150904 29544
20739 141443 43595 -382165 122255 -245459 25985 -201563 -65889 -151817 -288602 -310131
20729 -310131 20216 249536 -337441 28193 -98747 -230313 -269669 186261 229398 -57265 -85476
20718 -85476 167301 -29499 -81874 -176982 -60856 85214 -259201 74326 -33134 55 -177309 -51067
20705 -4241 182504 318288 26936 32003 -152260 183874 -73297 -14476 16357 -10039 -93571
20694 -93571 -55377 65808 173564 208107 -234775 36073 -5166 -326256 321145 -193554 -9601
20682 -350730 -124347 -44255 222223 77616 -41396 -234394 -153869 70444 97926 -215870 -102723
20670 268549 79286 -5916 -207894 13763 -53798 -225862 -98489 -9138 -54229 82993 -510481
20658 -72275 48415 -23760 -60319 -21093 -97300 -271517 -10435 129800 146496 487997 -279424
20646 -22508 85762 -19403 -106365 -82654 100852 -157233 -27279 102916 -97940 -128684 119125
20634 -130344 112173 -97124 -41116 -192557 -8576 56046 -74520 -447235 -257442 215524 7030
20622 150398 -10741 69729 90101 348225 72678 -141074 -113320 -104883 -126441 130548 -270509
20610 -241250 -104412 87734 -202948 -273092 42562 -143136 95526 -85622 235930 91728 4506
20598 -260793 28827 -29912 -337456 -149270 89303 -92196 -13719 267496 -29551 123690 -155415
20586 -33403 -52809 14525 -104302 182765 156857 44674 97495 25803 122026 211568 -56338
20574 303084 -220974 -166160 -57976 255837 148228 20826 134705 -146567 52784 141939
20564 141939 -240688 -125891 50252 -201456 400 -196363 57471 -12552 248025 79094 -286732
20552 27715 -110204 218598 28531 -423949 -211365 164118 -29510 -170012 -9755 63721 16446
20540 -19873 -218517 58056 19843 -13003 -221437 154794 154039 273752 47075 210662 -6677
20528 -412742 127830 -34035 -158550 113699 -24150 56544 -43043 -196040 206620 -229161
20517 -303293 8685 -285546 -54141 8337 144613 -85322 -212730 65067 -296408 -84850 38282
20505 226823 214650 -53953 -404574 -80606 -361682 -242212 31339 -177136 -163652 275893
20494 207505 112241 -194088 -271121 -354807 15784 72914 -54042 -320827 -19813 -328030 254273
20482 -325770 275929 -359836 -3283 -80034 96131 290023 195035 -192775 46884 -105946 -111268
20471 -111268 -34675 172380 -285005 -110300 134377 -292247 94238 -79001 -171205 63582
20460 129574 -72828 179619 -151896 -408601 -42704 -343554 -332517 -94419 -109092 200963
20449 -199033 64153 163517 193340 24241 111257 -22004 -271260 145013 122676 27513 158672
20438 158672 96839 206103 225309 29952 -237032 57108 26043 -130787 95146 -104421 -240743
20427 -240743 -122534 55399 38961 -136270 37586 228194 313573 344826 -139367 -452822
20417 -452822 -28766 -35376 -196088 91783 44359 -150989 128325 166532 197495 42781 91374
20406 91374 -225842 -235475 -174348 69855 -193841 -354233 366078 -100604 234211 -266992
20395 75046 171553 -102156 37576 -27649 -129646 42062 -149766 293988 58666 -265295 114760
20383 167645 -180245 -294506 26304 147759 -101440 -148646 -48376 -128047 12049 -120830
20372 63484 234667 -150365 376808 -116735 187207 -167443 -13165 79444 -53418 94826
20361 -34218 7402 216788 -64948 -14591 30516 -27103 -14787 105731 -228730 -359360 -275909
20350 -275909 93959 159084 -2968 -203992 244988 80846 203850 -173046 -71149 95324 111788
20339 111788 -430818 -175242 -73216 -67156 -207371 2823 -210605 243452 9714 47223 114727
20328 114727 -212943 4241 -13398 302549 90855 -145083 -22969 5308 -90831 -72770 45146
20316 111434 34043 -248 -165640 -322143 -280969 -179755 -54433 121300 -89380 364017 -66026
20304 164253 -252274 -394368 -216469 29423 -177281 -59471 -226460 -144401 -158372 -121856
20294 -121856 338260 130659 231587 -134331 -63483 -180528 -111050 64277 -212951 -55329
20283 -250811 -113545 -72043 106590 98234 -10273 -231941 -93325 -34212 -111317 96911 -428873
20271 126789 -152982 -164765 -216594 -59962 -36525 -21213 -386290 -275496 -52583 68383 131650
20260 131650 -71077 -120798 -229321 21743 -31235 23699 13211 -289150 -109418 -22710 49097
20248 -26902 147543 11715 86717 -59001 -116826 120172 -70723 -110926 143815 -258891 96938
20236 48166 -84901 68817 99672 173336 89536 -88754 -32290 -357471 19525 -274224 -30352
20224 163951 49449 -36988 -171792 122429 43462 -99824 339563 160389 -29375 -32780 -284263
20213 -284263 -102736 -213801 170617 18875 -163332 -127776 -82927 -193280 -52851 -172441
20203 -172441 -4237 93181 -47845 129834 48476 -83666 -214973 -31663 -365550 -2009 -289742
20192 -289742 -8938 -117693 -86385 170849 158536 -12397 16859 -186207 -215244 -212578 464190
20180 45897 221313 19065 -29462 -31646 -69667 267312 62465 229983 -33689 -112082 -40039
20168 5128 -36883 -384261 -262476 303163 -161457 279005 -2154 154957 161733 380309 -228734
20156 -384151 92435 -95221 -91701 -340830 183227 -71641 187555 -58537 17613 66116 124048
20145 124048 -52179 -131545 -11692 -53817 128599 -225902 -223977 -87276 296769 -135795 335574
20133 316788 -21354 -197700 -143345 132113 13074 -118105 -183180 23356 100945 35389 -375251
20121 -97179 -23916 -328868 -47313 73192 16126 -39425 13454 -119629 54487 2715 -131862
20109 71897 110491 -151180 77279 -166121 356042 -522796 -164826 -76968 -138634 -117539 -337163
20098 -337163 -29374 -36707 36123 -62997 72672 83591 -147240 -93373 -235223 24293 247694
20087 247694 -113996 229559 -149696 -346192 -11708 -277437 65211 238539 -94126 -208838
20077 -208838 296554 -148548 109848 103013 -204066 50300 45458 -135107 -598958 -302713
20067 -302713 -11149 116556 -316630 151188 -155125 -74651 131472 -123769 -218901 -191240
20057 -191240 77011 -145207 -62751 -13299 -290397 -18489 294721 -67855 135070 -213238
20046 61792 -84264 -86085 -334952 145674 -468425 -143420 -81065 49035 -340496 -418894 241173
20034 -60591 -381849 -357765 97525 -134234 -204799 149062 -212406 185193 -73022 -60533 84313
20022 -120599 -363336 205304 -139210 -151058 -12889 -13245 118444 -11536 -273669 -224228 70710
20010 -233457 -285576 -117285 49206 -134855 79284 -70679 -81273 -124092 76735 -191516 77749
19998 2573 -151684 42909 -216976 -18937 146021 225342 65646 -199264 99342 42636 -161294
19986 -78765 -188272 -94323 -95946 170437 147166 -281977 94930 -117271 -298009 -183964 -81481
19974 -56808 32306 26695 -197957 -200574 -221381 207563 55475 135520 -116482 71899 76698 -12227
19961 -272682 -17454 28047 107515 -152210 -45141 147386 -259308 -58053 -140688 -71028 79243
19949 174358 73684 -265872 -219578 41503 37371 38707 -374924 116986 -220702 214740 -119930
19937 362010 -341098 -23315 190659 -25680 -54610 -170920 -55951 64842 -129633 -166279 -83177
19926 -83177 81717 -96445 -27639 -46783 -143277 -2878 11334 105251 -217521 -252498 -121481
19914 -100730 -152666 -29704 -28974 -246055 -140659 -271699 -132550 -245717 79494 -397038 -102513
19902 24320 -74743 -91128 -9760 5480 -116848 -207595 -311022 -181887 78472 -218982 -423830
19891 -423830 -143447 -113441 -449992 -88631 50770 -100497 -199209 -78328 273276 34875 -133088
19879 108580 -122630 -220708 -577109 75137 12860 -82177 -282341 -126631 558071 143348
19868 63541 -143278 -70128 53099 -106468 106984 -101406 21004 -29151 -46855 -20093 -16440
19857 -16440 -84530 -147439 52008 -176111 -111890 79170 394399 59449 -184102 -86387 282842
19845 -242008 371891 293705 -10550 -128460 174149 -294135 155128 -115971 -121458 62968
19834 -259915 742 10369 31103 -9458 -87132 -195765 -249179 -169075 -33147 -27286 119549 -215345
19821 -103669 44280 57972 -25635 -44872 -273191 17958 -337811 39472 164420 -339385 -39144
19809 278949 -92721 202592 -34519 -55263 -228180 280217 69870 89785 -110187 270004
19798 140382 -140925 -70299 -2167 7753 219959 -200239 -195549 -72967 -281940 -31819 167006
19786 73929 -15561 98387 -54313 184448 -178609 125483 -209614 25264 142680 96944 201204
19775 201204 -275386 223663 -39370 -8234 -64355 -609 -238714 -64583 -153243 -38754 179613
19763 22030 -123837 -161548 -44438 166743 -525354 6350 -426404 -4274 -50259 -279088 144599
19751 -53148 -186344 103630 -144642 202865 -275748 -13051 -195305 -92276 30271 260746
19741 260746 -61474 -237866 -86317 105131 -22782 -96150 -197677 -217299 -58487 137229 -38093
19729 194215 124027 65015 -262672 -166112 -223813 -32081 -42852 234110 258384 11925 -2795
19717 61328 75694 -133920 18997 -230842 768 -323863 -97701 134640 249454 25421 -8019
19705 -207015 -169716 30876 86951 -102770 -79142 -287674 -49019 -172984 -79750 112502 -290506
19693 -203050 23949 373066 -182990 57807 -422021 211308 159802 401826 -69374 -123913
19683 -123913 12785 -272427 -204932 99359 142586 129735 54519 -82819 300184 5017 287481
19672 287481 124693 -533910 -341796 -33398 -165891 -104990 110980 -187914 51333 71200
19662 71200 -38539 1368 150661 -161008 70418 -272199 -433278 -175892 28520 -67485 -145980
19651 -145980 -123670 214850 83753 -54944 -66640 27452 -422703 -154416 -107490 166465 -58248
19639 -105544 -242920 -84388 -8503 -167921 -53046 -96546 -280039 433053 284426 108529
19628 -110581 -32187 -133851 -395306 -320536 -13216 32515 180472 -25095 189606 -205537
19617 -267995 -49557 -72746 -257516 121885 313321 -43881 -44842 -112560 -252610 1929 -52081
19605 -1215 -48482 -626715 -188952 -349330 -124689 -296389 276960 -328646 -50250 257093
19594 -213529 122805 -210791 14381 -179940 78064 -42851 -380749 -393636 -100540 3600 981
19582 -24038 -342374 65289 -65725 -36225 382870 -318441 74934 87648 256065 -623524 112432
19570 113754 100449 -231397 -103758 -234235 77050 -60729 -352295 -9469 27860 -181556 -175634
19559 -175634 -150068 30704 -14093 60575 35287 -309777 15762 184803 25518 223226 -107328
19547 110920 -67937 219215 148788 148457 97777 -88577 82347 58792 -75763 -140119 5245 -4171
19534 -2549 14534 -66550 -125032 118596 28401 -111975 202513 -22782 -78607 153604 14064
19522 -61515 -22049 -72546 -47371 294545 -235762 -67901 -186010 -87680 210740 41079 253805
19511 253805 117883 -59741 -23392 -128771 -172319 -31086 63482 -321235 -4208 -216949 57114
19499 -98653 -133322 -174351 -153186 491256 -40674 -173687 205284 -120067 -210516 -154743 -279087
19488 -279087 -538714 -118694 81519 34141 19311 -22521 -23388 -85291 102561 197998 172557
19477 172557 260256 900 198331 66049 -92044 238019 -26114 -104808 31300 -53745 -83554
19466 -83554 -148345 -63792 -6366 37427 -207034 229958 -92214 59352 140590 111468 -130428
19454 -59655 141057 -310012 -256029 53216 -98908 119121 -177376 -266409 -13571 49425 -73300
19442 -30794 -193474 157910 -107942 99524 -215199 81555 200107 72426 -145648 -168266
19432 -168266 -97740 -28249 -129371 -83872 -150067 237315 -178329 -383041 104784 75969
19422 75969 135364 -127756 -318078 -65571 -123239 -52700 -45356 -92814 -183691 198172 63575
19410 -174185 -245246 -125495 190799 -327883 -80636 -162654 190067 -194562 19840 -488572
19399 -2607 427 -105247 -129529 87926 381562 -267545 -330823 -408128 -159080 -40063 -23030
19388 -23030 170786 87506 -245645 -307934 24358 -238168 -142510 -130182 -452289 220034 124705
19377 124705 47956 -38533 -225630 -131685 -534319 -237213 172355 -208224 275974 -163492
19366 -60187 -56811 55212 -349567 -25344 219252 -84390 53767 84080 17909 -83426 231348
19354 -115110 26887 -244232 -5066 111896 109865 -75034 95479 -118768 -30196 -95982 -247208
19343 -247208 136469 176221 -142614 -138899 40828 -25503 143007 -14827 -41867 65441 26555
19331 -148295 309188 -82112 -136400 5782 38621 -319171 14033 58651 -9560 268519 103173
19319 -135199 268903 77673 -59620 -52720 140111 -37946 133003 -93565 43623 -61250 -63211
19308 -63211 -15974 -44763 -88591 -176512 -194190 -73670 -196457 -205480 97099 -22352 -36226 -269341
19296 -269341 76290 265893 -281121 63150 -28112 -105359 110438 -44238 100762 -26956 -150968
19285 -150968 -22775 53972 -191110 -50839 -241024 41969 46206 32563 -281505 -58100 100497
19273 -178325 79507 -258330 -145699 -243068 -132951 -38603 -12302 160539 128746 85559 -328093
19261 13287 19123 47983 65553 17461 25521 16008 -135781 -217534 159398 -392483 164788
19249 -146961 66584 255813 -79067 -60989 -339817 44627 -285939 83392 -38091 425730 -73372
19237 27729 -177940 46117 68437 340376 -12823 -220761 -325116 125774 71120 59871 107498
19226 107498 -32237 36398 391682 -263914 29806 196767 -147270 -147168 -78131 -99935 112310
19214 -8022 -166225 72185 52139 71947 -85410 -237654 -113137 -129681 -345862 -79882 -152523
19203 -152523 5181 -148431 28295 -339927 41401 74051 -1177 -5344 90160 -162360 -131556
19192 -131556 -41358 -564210 233746 -278311 47352 -55713 61843 -135271 -120559 -314714
19182 -314714 709 -158793 -145369 -49967 -127846 -513876 211202 -268551 129409 -63435 115066
19170 254383 145773 -58226 -198922 172007 277215 -133562 21372 -311635 22466 180799
19160 180799 -33021 -115130 71975 -23214 187309 -132546 -243641 -205507 -77963 -58384 112115
19148 -145375 -271088 -36571 -307786 -83425 -355870 -211961 -434909 125318 157464 -195068
19137 -116641 89477 -43914 -106987 63145 66554 -130872 -254515 -285368 153408 -119129 39427
19125 68607 -340096 3077 1798 -101717 -43036 58056 -29053 -113460 -201592 -152348 180574
19113 -266778 -184376 33063 -39553 -196040 79523 -307648 36368 306393 -191487 11262 -290609
19101 -124272 -75950 -115702 15585 11065 -369071 128014 75247 256710 -29747 -246778 -259729
19090 -259729 -43812 -325308 -439032 75315 34540 -321503 -232418 -107295 42906 -244744
19079 168389 -73570 -280148 -156942 -9903 43321 -37296 35193 -120935 34030 -42957 -194481
19068 -194481 35824 -85983 -119922 -308975 -269919 99231 -74625 -125647 119229 -164416 152885
19056 187638 75539 -84356 -154297 -278109 68640 575 155494 -51642 27929 213100 169887
19045 169887 -4442 -317881 -30149 -108947 -210622 46975 -204629 -154953 136905 110170 -31326
19033 -13956 -117009 92870 14712 100405 113419 151284 -82468 119345 -201279 -212862 -53797
19021 -355054 -7583 -168200 -197894 -328382 2017 39197 49369 -284794 -117509 -4034 -8522
19010 -8522 -35456 -38195 106820 -19032 317708 -333008 -296286 14951 143809 193343 8949
18998 -54886 -286957 -145411 -191138 -64598 327118 -55812 153979 -122469 -178899 -130918 -105859
18987 -105859 167322 54248 162798 164647 179661 -103518 -289043 -128660 29237 -50187 309883
18975 6073 -202360 -120771 -102925 70158 -42251 -101929 -172053 -80164 15187 112225 -152486
18963 36977 -326763 -112705 -382779 10297 -37917 -104497 -375108 204244 11400 -29323 -115065
18952 -115065 114556 -324601 157865 -52674 31478 -55418 176974 400694 39520 -196236
18941 26339 -161595 -31080 73643 -228086 178897 44341 109843 -89590 -322679 -202823 121929
18929 286448 -66502 -109360 77016 52596 -55424 120044 -65019 173795 -442472 376468 -197276
18917 229856 164901 -164058 -116096 -169300 -80765 -64097 -57823 112901 -127367 178207 -18262
18905 18344 40576 -249735 100484 213359 -46924 186430 -270783 17750 65026 149632 -171104
18893 -127003 -298012 14002 -1594 -225143 147147 -348341 -31746 -19362 -162437 71314 -20524
18881 -174491 -234369 163323 -191966 -233398 112675 -282402 -237311 -82906 -58603 -68468 -317926
18870 -317926 46612 -429324 61430 -22931 -16950 -206114 -101803 106643 -333784 186859
18859 -222096 -64252 6956 237901 -177160 -201886 44705 277507 122960 -112350 -377035
18849 -377035 93078 -216104 -132429 15388 -91960 318872 103518 -41008 -63271 223316 -121188
18837 16449 21368 50608 52137 159911 -76817 -114470 56508 -148965 -91583 -8347 -145135 -174643
18825 -174643 -73121 212245 230722 82487 -355787 61137 -88922 -13674 188365 -207390 -142534
18814 -142534 141995 158919 -205795 -348577 -295783 -24303 -418363 -313947 388561 -3019
18803 179128 17751 -115704 82320 -111972 -91576 -78553 -152171 -163260 181474 -583275 -123298
18791 1035 -105891 64701 131203 190161 -300941 -284445 -93911 -272863 -152661 -198684 53775
18779 -268440 -62321 77253 114946 -99891 211443 -290699 -325822 -266894 -23496 -43847 -223857
18768 -223857 -70362 -227085 115873 66842 -150709 -54166 -188526 -4483 39689 619135 257827
18756 -92727 33693 66905 38492 379571 279845 -246546 -151653 -215595 -38310 59495 -114292
18744 101855 112856 -980 53121 -136287 -55043 111338 -205758 -16138 89994 -76388 6424
18732 -316970 -140917 119422 -108998 2991 59125 33985 -274590 23703 -98653 166870 47449
18720 180667 -372546 -61217 -104766 -239451 -204374 -141796 109235 -20508 -100453 43809 -103766
18708 -264732 195159 -272901 -260970 -336686 -21848 39586 -32888 276457 121383 -56367 -102436
18697 -102436 -267170 -9206 -90143 -47805 59878 -184825 -262990 -39411 -445629 23875 93077
18686 93077 -255961 91724 14975 2905 -265793 47349 -92665 -89582 113706 169683 -135658
18674 6739 -68424 10438 16020 -211210 -69765 81757 92173 -184150 209740 -348478 100208
18662 169814 -204497 -167081 -172699 -21397 -178355 -17388 -303035 138466 29866 198871 -116792
18650 25511 55332 153498 -118976 218156 97521 96079 -170306 -77574 225482 72084 -7164
18638 -139709 62566 -119582 -126672 -245822 -67458 67706 -374130 131099 -140375 -30986 -291697
18627 -291697 124636 369953 171878 -127551 -364404 -97582 -209047 -36482 155461 -89497
18616 176736 134834 -68661 -3617 -157478 43657 97761 19003 71905 185890 -133061 27743
18604 -159902 226185 -169188 56751 -294047 -146990 -66347 74230 -182162 -212183 175634
18593 32713 -98227 -173589 -198566 -294598 36691 260107 115078 -110557 -14258 -91312 5991
18581 -118555 -203754 -192965 -55504 -281597 -24194 -51686 28368 -160624 -60498 -190493 -258560
18570 -258560 -374540 2162 -1568 30017 -180435 -261557 -100578 -176145 -3285 20669 -78768
18558 88370 -184394 -159542 -133871 106171 -163213 78578 -38789 -327185 -106637 -31663 -96920
18547 -96920 -170559 100219 67866 108431 13593 -123921 335127 -171223 -916 -206819 -128086
18536 -128086 -51557 -90706 64417 -19223 -325463 -168798 -143933 46618 -177437 150356 -44664
18524 46625 144575 -135728 -401870 -115659 -3754 -147430 97723 171218 -15370 175331 -278325
18512 -16978 350612 276393 -269033 -453252 -146742 212366 -85518 49671 68850 218927
18502 218927 16618 174349 158986 -116524 -224744 -61137 125878 300506 -138796 11321
18491 -8957 -264597 -271587 -334284 -28026 147109 -162062 -20829 1048 -250867 114886 -216794
18479 -33121 169690 40904 72310 56808 -35411 7971 -102460 169481 -54961 4348 80073
18468 80073 -328961 33214 -412153 111444 -7525 -14648 -33510 -230442 -22013 -15454 -110717
18457 -110717 -159194 -302743 -40121 164396 -225424 174438 -15558 -245950 105783 -130994
18446 -114406 -103699 -53461 -11507 -163597 74192 -180913 9242 85101 -145497 -86224 188273
18434 44027 -23776 -155810 46653 -220314 302116 225499 112351 97085 6190 -324613 -159847
18422 -128636 -30161 28381 -6841 215516 73156 -427034 -61092 21044 168262 68988 56630
18411 56630 -186527 -123368 -219147 -269566 -25001 -110090 156946 112623 12387 53945 -141964
18399 -325976 202512 50311 -177684 -27088 -124705 -59751 -471392 -499975 -239275 -199292 -226970
18388 -226970 164360 76488 -156583 -158681 30625 -155184 -88060 25828 194268 -427439 227086
18376 -218776 195280 67605 -85513 113718 -123124 149649 -347758 -304617 -242144 -418368
18366 -418368 130266 -250005 84001 -216326 -176320 -49481 -8224 -54310 322016 47157 -99141
18354 59455 -26113 -61136 813 75990 -95603 -63437 -223547 36687 -363534 -194572 -72877
18342 70433 92004 -20683 -133585 99998 -221528 -24011 -182668 163888 -15620 -335814 -99720
18330 54931 93889 346976 -173090 -47366 -373072 130476 -178998 -124465 128359 33342
18319 157286 55076 438462 -256293 -194970 139950 -62108 99036 170190 -31450 -260549 -59052
18307 -146890 36 127670 -154389 89047 -45031 -234042 -29210 -54956 202094 -129826 -175208
18296 -175208 190877 -189944 215782 -17427 -114481 30758 -192363 68125 118194 226912
18286 226912 -186521 61270 -90677 -91694 121609 95709 -49580 -133407 -5432 -165639 -85609
18275 -85609 -100520 -132528 213105 -69455 -129260 -98479 -381259 -212380 193764 11215 -180858
18263 142911 -72003 -445622 128482 38555 -293007 -10033 -301239 320902 212042 -101470
18252 79739 -333794 -135055 -147064 -244630 112192 116637 -31238 -97049 -182741 116918 143414
18241 143414 -68201 256910 231527 -51952 -96227 -76349 131588 63683 -158882 -46907 -27098
18230 -27098 167974 -117227 -214270 95008 -69435 -47566 -324623 291802 146305 -27850 -161453
18219 -161453 93641 137123 -195460 200885 -134701 -261949 -158953 -163097 -65519 216601
18208 2781 10557 -1274 56913 -130172 25925 -257897 -245427 206319 189437 -56549 -204825
18197 -204825 -154979 171419 8031 -149336 -117663 -489825 -193518 161141 141574 -118537
18186 259182 6034 -220868 -26044 -272573 -173201 -266303 -193136 -253100 -103575 -102501 -176323
18175 -176323 -124550 -81107 -53226 63267 -437401 -181430 -204227 -118844 -114718 -104137 -230105
18164 -230105 -250669 -32860 -14249 -229880 -155784 171294 -196406 -162372 43468 297674 -222603
18152 124201 -24637 -2218 -267510 -58502 -133034 -41887 464921 37671 272986 189098 -91894
18140 107969 -491082 70758 -9007 -98686 84975 -76138 -122794 -35089 2798 309734 1084 -49180
18127 -285639 162932 -110313 9596 -315307 -13122 16717 282311 -168168 -148712 -354927
18117 -354927 -90500 -24661 -17862 60614 -212757 10337 -127538 832 -53963 -115953 -74754 104721
18104 112210 -317431 -172352 277361 -73579 145133 -36032 391887 170294 188610 -171772
18093 -155736 327581 9069 -351958 -117748 1001 -194703 -78328 95082 -138184 -163015 -352855
18082 -352855 245974 -178567 -9974 -98923 115256 61225 -257763 77148 155248 -62826 314962
18070 23085 329484 196748 78179 -178607 75566 267797 -16144 149971 -46051 100177
18059 82027 -115750 54965 -121887 -12878 42375 50470 -73295 -167603 135544 341654 -184036
18047 -43405 -73951 74534 -25854 14775 25312 34861 -89911 -50512 88758 -91636 -171954 -273821
18035 -273821 -325506 57851 -140176 35075 331031 -116665 -93005 211140 -171620 102059
18024 -77027 -11884 -327828 40606 29034 -157748 56656 -48190 18647 -109304 21354 -31061
18012 151890 -83855 -34037 234164 9521 71221 29148 -80933 -95171 -53040 -132956 -453725
18001 -453725 33301 -237464 -73015 19598 -220178 26597 -32073 -156074 -162617 -173238 339542
17989 -16645 -270175 28443 -95110 57118 -261729 -245641 -120384 23337 -141040 245183 194434
17978 194434 216839 61454 -134665 45081 6240 347126 93918 -32014 -126835 -148951 126687
17966 64661 92759 -84341 96430 -15677 -166258 29174 78959 -24520 -7638 229963 -192661
17954 -140596 437937 16720 -94246 99550 44720 104558 92703 -68584 45621 -246500 33420
17942 140185 -76832 -164693 100504 -60993 -185317 -3137 -23078 266810 -79809 -135617 -48611
17930 120098 -251766 126828 -261868 -306566 -35658 9484 12710 -31277 -138416 -245121 126061
17918 -125593 -162099 -29826 358394 -155545 -116187 -199765 38015 200230 2026 -133812 -417124
17907 -417124 71499 -271113 9795 270428 229901 52791 287982 223129 -93582 331476 -6041
17895 -139760 99105 -174903 427655 -118623 266230 -326206 125343 -58502 -126835 -404877
17885 -404877 82585 293493 -82876 -364725 45335 238654 -5173 63284 -83646 -50534 -37232
17874 -37232 -239392 318025 -38829 42689 -146164 -81990 131152 -176292 98212 -206329
17863 75963 276879 54527 -101894 -46093 149535 -287958 -169649 -54251 53525 189322
17853 189322 -26836 -117508 97886 148132 97155 34464 -18213 -297801 -109026 142235 193247
17842 193247 80539 -241600 61126 96225 -279351 -34923 9224 68179 -82540 -393943 -334441
17831 -334441 121480 267634 35610 -129219 198413 -113639 -272957 -182065 -116978 -690674
17821 -690674 132406 99177 -238377 -312668 -220690 195153 65427 -46893 247804 -166362
17810 -14648 80581 -383969 100642 110070 -24440 62246 259090 207956 88880 102462 -175749
17798 290259 18477 13111 -11122 60870 159950 -229746 -138594 186071 -12604 1052 244627
17787 244627 -120062 -391510 175806 -31713 -62733 -280956 -52797 133499 43972 -138527
17776 129012 26570 -22086 295791 -32882 235156 -84131 161399 -173225 -15512 -399420
17766 -399420 -19531 -36064 389360 -407544 -236304 200698 -44373 -26362 -24034 -90870 -251740
17755 -251740 68744 448960 89613 -67002 143063 -55868 -230187 -237129 176518 -99088 -4939
17743 -129773 33393 103457 74071 -101184 -11616 -95940 -134393 -81277 -182099 115283 260749
17732 260749 -30087 59528 106202 10162 57624 -56201 -234346 -46357 28098 -105758 1030
17720 223555 -147651 145025 199655 365145 -83810 -33857 263748 122951 -85743 -220263
17710 -220263 -207682 119081 -52407 -5078 504 104782 180360 -309662 17869 -824 286644 -109942
17697 362296 187090 269016 105345 -136614 241702 191074 254159 18969 -160935 -71335
17686 124177 95505 315543 254137 -188558 23531 -219871 7286 -144363 18075 -174053 124313
17674 -108785 39417 15663 45382 273990 245749 183228 -39273 -227009 -108082 -85711 -2866
17662 257572 -38987 -21883 204009 142011 48505 44565 214979 173228 -187390 211716 12430
17650 -190145 -144978 302689 -103111 64247 25892 123391 184462 555961 180474 113384 -71953
17638 166041 168467 76913 -35501 243187 -221045 122542 -185105 141430 -125407 -44159
17627 -34693 -38281 -205149 256709 -215022 -130454 295076 138036 173110 -258980 -98963 -157483
17616 -157483 -186802 125884 -146490 10124 103870 837 131510 -89710 185356 70272 -68466
17604 -66957 77025 59851 26502 90600 -133090 104251 152259 28617 74726 50562 -7224
17592 109725 -120544 -31780 7645 166286 373390 82959 -28202 101173 137231 -1198 462751
17580 -253503 123625 -176622 -13034 239352 129445 22321 -312892 -174060 -366697 -70611
17569 216366 -168494 -285258 -121851 156039 84745 -52031 191826 159761 150293 -247000
17558 -70328 116135 -380432 259999 -11187 133117 -124252 45097 36080 -287593 -74145 156858
17546 -42121 -113962 252569 -241628 207072 -94236 92489 -66779 215996 -9996 -304634 271455
17534 262569 105593 -282839 66930 -17348 296164 -169275 49848 -181686 -251823 -130830
17524 -130830 -176338 -5777 -45420 -57736 -97586 -40486 79905 93025 17382 215395 159121
17513 159121 44690 225440 322753 97322 -270264 -117968 -158897 67949 -71904 -42604 -23788
17502 -23788 -23952 97674 -262788 60896 -18958 -104507 8988 -230934 -155789 337105 110199
17490 161479 156271 114043 82423 228214 -139695 -79370 37243 252663 363974 189067 196641
17479 196641 190953 275788 406434 -73617 -206024 -108326 110563 16965 -50422 122901 -172752
17467 75272 -225511 61880 23943 -140258 -14463 -100816 224161 387845 117769 84682 25944
17455 303696 281924 453835 30819 224604 -41005 126084 -16139 181701 -15719 347738
17444 188273 118555 37641 421059 254125 244719 132102 325310 88528 165425 23477 250527
17433 250527 118210 457110 41586 285195 173783 44782 430508 229388 429922 321252
17423 321252 111955 -104783 197333 564382 245716 412445 197518 344376 73981 52493
17413 52493 -36489 343203 154521 367437 263081 572752 34477 251286 117808 58623
17402 125012 645554 322999 18489 206906 147928 277494 60694 368954 -178964 268607
17391 -47730 -213452 160927 103647 123404 335207 27243 -44367 436732 404548 -191916 74612
17379 107118 100671 154455 270529 93650 256097 84824 5818 25994 111295 213839 373754
17368 373754 197435 34651 328022 17580 285430 190039 -64730 -29505 210216 336969
17358 336969 -6195 128525 254792 -168088 103846 -50244 -145236 148136 -115498 306880
17347 -541 163487 153555 -81565 208639 328265 82486 253041 189169 91341 207470 92828
17335 173651 151763 -45982 -47618 223691 348276 285963 -1806 163696 213158 102151 -86942
17323 142385 99520 -89519 378536 122803 83279 127332 135559 410005 281827 348922 69201
17311 280673 69857 392163 423418 296974 -1428 -222916 232265 92208 253145 224564 114178
17300 114178 278967 396920 166187 78073 337513 198297 283204 -38419 57303 52095 -194420
17288 -107790 -71591 214708 485518 21060 -31136 -24103 184976 15337 365057 -37771 19263
17276 16136 139757 358299 34514 34277 148537 299945 247605 430791 512081 367220 411746
17265 411746 91808 -10752 57943 311246 208770 303208 152639 -224236 490156 397675
17255 397675 210819 33798 62778 -174913 64499 328581 331147 148508 57224 -47159 260814
17243 235495 90262 274428 204299 50428 429174 136839 174173 244473 -517397 -88890 -43996
17231 -61254 -108254 68856 -167650 245956 -30609 -18373 431383 130152 193001 384097 21640
17219 405749 11546 -234782 -1196 129303 302022 262046 534758 259796 93682 409670
17209 409670 485001 -29516 321283 287063 276363 -160512 341556 574358 316939 271108
17199 271108 271347 192331 488988 272979 175461 -107135 373330 271156 385338 387288 364592
17188 364592 348787 242998 202496 165306 346630 142645 102410 -40560 302263 523568
17178 523568 126565 128716 425879 -98433 157577 306414 -104221 187278 299611 503509
17168 503509 345569 128701 190475 112306 46084 232278 36768 158979 -17344 246075
17157 277607 146180 137206 272320 385245 213664 124810 189019 249861 -44089 387579 219476
17146 219476 287832 239059 383049 249944 358074 277853 636690 171625 230447 219531
17136 219531 63604 -108676 313052 -112979 83005 641330 -88613 119300 97478 235396
17126 235396 396573 414000 463221 310730 626106 604349 145143 334633 118531 467647
17116 467647 604944 170842 434666 397558 307483 362935 -34931 383724 281460 245787
17106 245787 655843 331864 -94845 747355 64231 482612 209333 82597 180470 145033
17096 145033 150777 331685 265535 410094 444465 207908 327218 467288 18298 90105 324240
17085 324240 486198 453818 208358 260376 116610 357378 551291 521681 423529 322855
17075 322855 134651 39752 336063 356415 252751 507805 490424 350187 106106 188101
17065 188101 11972 334600 525678 404227 95895 452958 300935 458434 335398 622453
17055 622453 247721 668976 621914 551395 230715 688716 332243 600973 866874 503568
17045 503568 193957 508367 179229 321528 675000 443404 509210 770757 715655 652970
17035 652970 359495 438452 531198 471860 696562 430182 242717 331168 705034 616361
17025 616361 576485 818745 534732 345360 373339 834003 486812 546770 414969 541089
17015 541089 799185 780138 704125 577020 833984 439467 797932 583114 515245 325354
17005 325354 414460 732928 639017 662542 628664 946944 283941 303289 938905 769297
16995 769297 865826 792022 1040897 1005521 665137 682070 443921 1018063 845579 837846 710569
16984 710569 732856 460263 553515 680579 353824 546228 862257 1042075 1017310 767389
16974 767389 580308 981521 881460 718385 821325 1051964 1083469 699680 810118 636448
16964 636448 700563 1088688 721938 777973 843422 740203 754028 708274 792741 970938 822980
16953 822980 866977 930680 686495 702944 854458 963832 834553 815522 798706 1128517
16943 1128517 992505 1007406 948570 1101674 1300286 1201027 611859 788979 1101693 831888
16933 831888 1334552 1162389 1012519 836148 997971 1054905 893500 1208885 1272830 1300765
16923 1300765 859478 820139 1278456 987595 1142659 1273344 1101527 1087309 1301144 1247958
16913 1247958 1041607 1398365 1086769 1441110 1527133 1338773 1462851 1234858 1284971 1533777
16903 1533777 1347732 1262455 1568971 1239786 1641736 1800454 1636740 1422716 1399560 1370615
16893 1370615 1550959 1562766 1067031 1516510 1463490 1636390 1768188 1686338 1706628 1718386
16883 1718386 1602495 1834156 1406952 1855551 1587155 1862262 2011334 1685963 1862931
16874 1862931 1783961 1917382 1973735 1815320 2017173 2209128 2142537 2265986 2232897 2087533
16864 2087533 2077464 2259114 2228402 2288873 2051978 2232792 2415628 2254840 2332099 2409837
16854 2409837 2157330 2542153 2470306 2675297 2329939 2607162 2529487 2697339 2834589 2918586
16844 2918586 2922941 2878305 2577385 3249668 3211147 3004414 3067168 3067651 2852671 3271909 3178806
16833 3178806 3325780 3511919 3494047 3604673 3732761 3477307 3556656 3792136 3789023 3905229
16823 3905229 3872517 4065024 3941772 4158539 4092167 4173476 4403882 4492222 4959352 4635579
16813 4635579 4700638 4902738 4610838 4777489 5245813 5187992 5328143 5175498 5508875 5760145
16803 5760145 5658163 5690442 5860501 6245675 5945401 6425964 6148924 6721402 6756607 6772618
16793 6772618 7043477 7347114 7348830 7488385 7801012 8000270 8161526 8106828 8276194 8694136
16783 8694136 9110687 8939316 9300425 9575947 9850104 10178766 10053990 10301661 10871165
16774 10871165 11314457 11585287 11797897 12318208 12594239 12923400 13386166 13804837 14157430
16765 14157430 14640349 14897212 15738271 16068891 16669871 17150811 17594594 18420836 19167833
16756 19167833 19780293 20351830 21206261 21786030 23157130 23839817 24713100 25806144 26902538
16747 26902538 27866122 29064284 30673970 31856526 33232944 34754946 36431284 38129506
16739 38129506 39592374 42012824 44057352 46142374 48767665 51010309 53891793 57020470
16731 57020470 60046135 63551375 67316874 71059244 74777756 79553267 84173409 88922658
16723 88922658 94196984 100049557 105632469 112197031 118103418 124832419 130878786 137630706
16715 137630706 143874667 150330768 156765737 162608033 167954736 172764849 176557642 179869661
16707 179869661 181998412 183127616 182616505 181608452 179516784 176269189 172257029 167278976
16699 167278976 161743075 155882626 149035439 142694621 135994011 129192802 122932468 115951552
16691 115951552 110124929 103885231 98439347 92663672 87707222 82840999 78032797 73917420
16683 73917420 69868817 65762886 62451858 58783325 55735820 53141152 49855130 47506005
16675 47506005 45140963 43246454 40507273 38580364 36915788 35124201 33513466 32066995
16667 32066995 30618141 29357981 27837540 26465201 25318259 24299143 23424985 22373790
16659 22373790 21757628 20527234 20023904 19454473 18514654 17799998 17135495 16597116 16263880
16650 16263880 15210192 15173651 14335876 13963317 13457295 13583309 13078740 12761664 11985974
16641 11985974 11537759 11112240 11075329 10707188 10150975 9959544 9627596 9658974 9322275 8912962
16631 8912962 8565234 8696678 8295734 7737503 7714682 7673996 7209330 7157468 7095723 6895106
16621 6895106 6773222 6583868 6315161 6294859 6290354 5917315 5662987 5901307 5446049 5729708
16611 5729708 5388155 5380126 5124328 5055294 5092518 4862607 4743836 4869213 4463067 4641631
16601 4641631 4218678 4575821 4292436 4102843 3967050 3997358 3668747 3547883 3734631 3678550
16591 3678550 3378131 3635018 3605561 3409886 3585279 3494063 3261816 3082925 3281281 2939972
16581 2939972 3080304 3057655 3121468 3158530 2770788 2816828 2932645 2787351 2527189 2600303
16571 2600303 2754149 2648072 2363768 2600576 2202769 2234583 2496720 2587156 2477644 2575613
16561 2575613 2448586 2445929 2359850 2379386 1844588 1979032 2282608 1746566 1945160 2237194
16551 2237194 1825294 1779307 1990902 2322253 2000506 2031622 1857929 1844242 1892842 1873075
16541 1873075 1789665 1674620 1656938 1957181 1598636 1673411 1651451 1544625 1495543 1783940
16531 1783940 1665390 1664374 1452702 1298119 1414771 1662299 1398577 1447071 1417213 1341890
16521 1341890 1612315 1572438 1590591 1275573 1443035 979841 1124693 1135684 1265821 1169035
16511 1169035 1082449 1097420 949848 965797 950243 1103603 900338 919114 1083374 999814
16501 999814 1185768 1274955 1249651 1154995 1046956 930130 979068 940256 990203 833769 957654
16490 957654 988327 893286 738080 951320 1157874 868674 776138 1221277 1050684 722145
16480 722145 740424 790743 1015327 740027 914244 1183678 602004 813211 1015348 812982
16470 812982 508813 1045494 852072 997183 556113 650730 784496 839068 849240 753314
16460 753314 504090 930947 965288 342964 960418 524224 794848 852364 689566 430476
16450 430476 826891 784760 823376 406130 456178 672530 550371 608544 745502 751692 659003
16439 659003 595433 671153 528449 519451 267101 625982 379347 325733 455629 374095 548744
16428 548744 614607 290794 570739 460586 577128 527765 688921 532972 346634 535358
16418 535358 388954 594256 236354 801357 195952 648650 258197 816152 223692 418327
16408 418327 479381 602969 313473 522790 520140 432984 495602 379027 552305 626392 484204
16397 484204 372638 266713 619400 393782 561772 436734 395530 391196 510698 170624
16386 293250 399022 294251 -13690 399530 344574 417593 287080 314916 567410 358205
16376 358205 312453 240446 302213 284483 166822 362511 313455 371527 604520 276474 493078
16365 493078 530999 460974 382163 273592 115950 704155 682776 338404 158542 -26408
16354 150956 487199 298580 462570 239097 142176 463289 158750 148328 552008 436805
16344 436805 321699 364163 445276 389709 167573 336021 146770 180534 384747 513187
16334 513187 420298 180363 7176 463174 237290 503622 167154 313981 386189 243453
16324 243453 229843 259215 184426 311557 196846 217707 575235 254423 101558 211844
16314 211844 194834 176150 230336 -18655 219398 265720 172220 125757 213506 -10834 375043
16302 56633 29881 118742 43907 -120791 91256 174477 298895 280755 188168 37440 45072
16291 45072 50774 282473 363263 -247214 69756 171167 255614 817262 111129 -28422 210058
16279 -48167 95818 -295146 257196 186062 174049 404657 317329 9679 84065 -73313 157297
16267 -37045 247843 67096 186421 126530 123170 149156 158375 511597 -177598 130940 -201374
16255 303875 -158222 -9792 107783 327698 289965 299961 -98616 317862 -70244 -6952 376905
16243 337584 -67504 239099 -235996 25404 -69857 340025 184457 67433 224180 204388
16233 204388 -33672 -202238 -301237 7155 222416 283778 345566 -23864 163254 258760 205432
16222 205432 159526 -151089 170328 105952 572761 -307797 104339 150569 -194708 225205
16211 135267 94784 -32865 110675 425619 14587 29955 712 94560 268067 162594 60161
16199 95783 317138 83561 204492 159889 54476 49767 86812 95123 209671 253357 -294 255620
16186 266913 171228 72077 -257441 -375117 227379 -88795 479715 190844 177640 30720
16175 -87135 120891 372011 -176557 174252 98717 295369 74261 211385 150805 62221
16164 -68432 139947 271475 89930 -44347 89372 -370232 129346 -15381 75335 145009 144577
16153 144577 232020 -264075 23915 239989 -209314 102811 236970 -217213 124961 19473
16142 12308 55222 -103076 -265565 86316 -234428 155264 185138 90298 -38764 -19926 -20659
16131 -20659 -90568 -583 74901 73430 -188721 -157023 -26711 407113 300706 108391 -54887
16119 139235 19958 183345 -91302 169397 -119165 167856 73978 34131 -131370 93914
16108 -39888 325772 -64168 143153 -87739 43939 -114092 165559 73739 174034 83315 -153904
16096 -19348 302099 227991 -30700 -223907 194939 36327 323766 -224516 143061 -39385
16085 284424 197642 265228 33501 61793 -72257 155448 -140670 133304 -313788 -57133 125454
16073 187036 3100 112467 319074 133445 -233248 -243624 -26812 -37964 109822 -44682 153387
16061 61754 377329 -82944 -50065 -236615 -228557 123633 -132237 252212 -203367 -136133 102287
16049 -127049 150522 -254633 -90114 75710 309950 -92231 -16489 -164139 167113 -48480
16038 -101208 4189 125710 -57609 -107347 120050 167859 126687 40618 -198803 -187255 -145542
16027 -145542 -418194 -113180 326499 -13880 -145374 242861 62236 145754 130038 165228
16017 165228 -259071 -163226 -56447 -474171 -40340 182386 -50550 193979 -136924 57905
16006 21688 170109 -82377 167993 119434 -475144 49083 226126 -59366 46557 2726 99033
15995 99033 73120 -70739 -100117 -75389 -48953 147455 18146 -150948 -200866 13841 26878
15984 26878 335456 288485 -335933 58234 -205031 -139470 -95402 -54193 261857 86246 157827
15973 157827 -61849 -70511 -167195 185536 131239 157536 398255 -160507 111862 112503 -135108
15961 237872 21429 -172905 243490 204671 205289 -272895 259098 -273890 114039 -103519
15950 -192747 -162913 -763 -218172 -196908 -160055 53838 -8027 -246969 -142427 180410 -37625
15938 126409 76180 -78618 -158588 -30036 -271473 -360884 133390 -7 216375 -46596 -54207 -221975
15926 -221975 -201772 -136245 86018 33781 -280851 -98645 169067 18690 -79478 -192081 -159876
15915 -159876 -298322 -71839 79767 140440 119222 -119932 139281 128148 -49539 -185303 -199512
15904 -199512 -303483 -222372 23214 310444 -6748 138310 -166098 129380 23 -816 -213475
15893 -213475 -203578 -43072 178157 10013 -134023 128185 -151985 -222138 49373 -71378 121412
15881 -217380 -20424 -64913 29672 5419 64004 -423103 -6732 185422 266464 194995 206209
15870 206209 -236092 -250909 -478146 -276283 -187765 127751 314867 -210740 -91541 264329
15859 -252123 -120043 -84243 217479 -36411 165980 -131469 265549 184066 181326 20039 -10210
15847 -281410 265390 -139425 -273864 66897 -160346 288696 -3783 -25735 -130815 137407
15836 -67217 168265 -110321 112103 95587 15269 -2272 -150159 -231896 -105113 58369 -118247
15824 131216 -240109 -29688 97431 18768 -109797 298925 -169215 23510 -227313 -58844
15813 95370 -292080 -102561 76282 -222106 -126337 63771 -94557 -38107 -240060 417358 379492
15802 379492 -215740 -56090 154336 82867 -13702 190200 41445 130565 149142 -66670 194391
15790 -156941 -92470 -174655 -324944 -129990 -42196 7508 180595 -138027 180964 94620 -153714
15778 -161547 123985 -319346 841 -221150 36809 -112549 -42136 -14340 -67024 -16583 141214
15766 -172757 -293500 -217926 -116838 153346 341682 -144574 -223500 81640 93670 18345
15755 -124820 -150766 36871 -90187 -33957 138636 -10565 -94017 55074 -192765 244961 -12360
15743 -183955 190156 -145977 64083 -329411 78557 -85718 -30042 163171 -123223 -197050
15733 -197050 19649 -177987 -48230 -199922 -224102 28113 -82582 67704 -181329 159103 -84524
15721 116275 -546959 21599 -53100 93732 -94290 111126 13868 -208092 -209228 142365 -109226
15709 102526 -41247 48672 60730 320003 11912 -39924 -206444 -413555 -18799 -17344 323285
15697 -168809 -302535 -18422 -154376 -454410 -325923 -1786 29212 262603 -245342 -161818
15687 -161818 -80263 84716 -101293 -383680 248221 -77001 180738 92325 -89650 -226228
15677 -226228 -340561 -287705 -365471 -52039 -123928 -41597 -154109 16885 -222140 359293 137259
15665 -30562 -21178 17238 -254786 -372068 -76609 58175 -133975 5245 20196 -396282 -37545
15653 22232 178828 74830 -211926 38332 72300 161124 -171068 64782 120271 101547 -16027
15641 -201336 -366295 -64001 -274073 33423 57897 -2509 -343849 -614886 -52520 -55678 200976
15629 -201859 -148779 126252 14944 -116844 -92183 -30465 -40157 -51855 322452 -35485 103810
15617 -67926 278785 -102340 271353 25258 -12673 -80263 -57039 -409548 35258 56490 202035
15606 202035 238720 -41505 -41041 -196805 94186 31478 -18412 878 56204 299180 44740 -132440
15593 18303 1250 -181331 -139754 -163243 -79260 2760 -208592 -408610 -33578 -30648 123944
15581 -286927 -213352 -83871 -39478 125455 -158075 341116 -153599 -47661 -39418 -110225 126276
15569 226576 75494 41974 82632 -26724 -127652 -102501 -11937 -46159 -141946 -37601 26908
15557 -364965 -50509 112164 152983 178383 -22068 208359 181063 -122959 237038 -63998 -143685
15546 -143685 92005 131516 -99100 114094 24122 -400280 -159970 -69590 -244866 -26190 -11448
15534 -105438 167938 78207 28458 -142728 -22131 -169260 362865 79156 156993 152753 -20818
15522 -51257 -214172 52287 130917 301371 -108260 -243343 -22694 160870 90013 67822 161121
15511 161121 -30044 80932 -334980 -312737 -110595 -87604 -90898 -44952 -264814 65629 27375
15499 -148294 -309650 30286 357120 -114366 353519 -195156 189534 -287894 -372591 -103864
15488 53678 120817 -179812 -215919 -133910 223743 -94896 -35677 146162 -149108 264892 -27421
15476 12111 220379 150272 118385 -64841 -20841 -56698 -55151 -170981 213642 150819 194844
15465 194844 -15228 -178463 -224593 138965 168382 42694 155295 -6846 129633 99775 -26898
15453 123675 310541 -84427 176990 73130 390166 68143 -87495 149876 -21277 20621 -206507
15441 556765 47821 -29875 -512699 269250 -79165 -8406 107715 40625 -416771 10477 140635
15430 140635 -200016 102454 159670 -76909 -94063 -299565 134327 -30331 -310141 78878
15419 206922 -159633 484504 -55402 -71800 -52659 -244940 81129 -78468 91261 -233724 -115743
15407 -174799 -130825 49278 454106 -293628 -45108 78716 -102554 -67397 186687 -226925
15396 -320726 -174196 -265569 131834 79389 41603 60339 42337 62487 -6585 7752 -34325
15384 -40485 163014 28667 -137440 -158569 40041 -23442 -184137 46270 -120144 22643 -158690
15372 4783 -139633 93503 204592 -137814 37014 163964 69310 -104552 15867 -54415 -154657
15361 -154657 440433 -283186 165322 115230 50228 -24157 -368345 -280518 351456 3315 8979
15350 8979 -176617 150351 -202965 -198251 -27138 -28482 -65834 -58344 47587 56636 -176354 -135736
15338 -135736 -64255 35536 -60428 93650 -155428 -167553 -94076 -23523 87790 382164 152782
15326 214375 82705 -71963 -143223 -258986 196493 322516 177239 -132033 213000 62894
15315 -7618 -147397 112603 -23327 -237365 127471 -92375 87310 449912 -50344 88644 79400
15304 79400 -242880 30187 725 -160395 323377 3787 -12459 298927 -51365 238648 -121471
15292 408333 260527 96790 -166601 99183 62142 -278261 -117594 -189725 -108271 -3116 -163594
15281 -163594 -127417 -133165 14950 120198 -168937 -266139 -65076 -222118 177155 -62725 -25817
15269 150406 259877 -210038 190391 -87095 196202 -15848 -111516 67920 34322 -19508 -361635
15258 -361635 -171106 158931 -149396 242954 -69299 165483 330154 -142409 156882 174117
15248 174117 -130916 -100863 349366 -174304 113893 126648 64610 148775 -161923 213453
15237 -68512 266936 389682 590586 975980 890719 1608110 1258267 1582409 1243775 739796
15227 739796 119879 399281 308446 -63486 27888 -300377 106072 -41155 186013 223697
15217 223697 426990 179277 -39437 244606 131769 -71805 198656 110398 113447 -104616
15206 229925 -64827 449447 127105 -58836 245397 254488 63237 194750 -117181 424045
15195 -59478 55466 -85968 -1739 18569 70195 -146241 214923 313215 -44930 -173402 222487
15183 369133 44293 574731 -137705 160129 91624 232694 29620 -21747 194296 107113
15173 107113 35591 83761 282883 193543 439166 -62835 179220 -16837 21966 141916 -162903
15161 121490 177066 -260239 190990 229830 -238638 128814 86685 106283 -110862 139272
15150 78162 399714 214296 328519 107022 164049 -231849 192381 164734 -5023 281745
15139 76853 266074 66982 -111288 -68769 225619 285010 -86542 176781 133160 -265479 2538
15127 -142049 86930 103803 210593 120411 130999 -183621 194250 320890 241419 135032
15117 135032 29270 -254374 338117 -106127 224733 145186 304979 357879 56667 241402
15107 241402 360468 -2127 92346 272496 65309 103679 -190647 77592 61645 212778 -251490
15095 107546 384750 56734 131599 324677 7326 -123479 92090 -3893 100799 506832 194541
15083 -152637 42855 352371 350679 -68462 133514 87241 79817 225425 44442 136531 -45563
15071 55198 185812 192569 173552 38187 -23493 388409 41802 -86767 195209 -288599 66909
15059 274443 232695 141616 -16773 230004 -162163 -120093 -79029 157547 248458 32486 94358
15048 94358 331490 172539 -155833 234584 -37231 169418 271501 392954 104259 234845
15038 234845 210400 340876 214607 74308 199911 100145 273395 52482 319969 60024
15027 186806 393718 -97946 155472 -9851 -23973 95096 195873 438351 84859 356801 143339
15015 59615 172540 -19582 220121 -1276 14214 -179510 -155838 268246 117355 -47977 11203
15003 271176 -268148 -79447 139574 72108 289467 -101905 434210 22326 205337 -58279
14992 -61916 76461 220752 474299 33654 70375 278887 360863 609565 -173242 290578
14981 280730 107073 -17067 -48047 123884 552404 235863 501867 313966 50879 577049
14971 577049 337320 65457 257314 358910 341621 244538 455621 366116 372661 299095 145989
14959 211282 255973 29027 304613 -94272 221300 257017 329467 113463 233564 152293 106973
14948 106973 233651 317587 253515 205139 310953 452610 301135 495149 220122 230464
14938 230464 303183 400260 208862 237990 250215 154147 400980 153222 -152927 185537
14927 387310 43329 212450 361559 224688 93089 164797 -26622 246469 167768 434722
14917 434722 135482 468798 81451 -79501 293790 395350 638987 285364 452146 414508
14907 414508 196495 534694 178473 297929 411163 52833 284583 -330987 -25490 506955
14896 347657 382957 396689 210861 240430 468975 643650 186357 219089 285864 368536 8850
14884 353771 359908 391494 -107514 202425 366747 44202 256777 432189 454337 499909 259407
14873 259407 444861 202154 355377 96742 459839 -128121 534331 13779 386881 486332
14863 486332 434318 241115 147778 507049 328475 173758 364971 409305 329304 109794
14852 468603 321661 251716 270912 367298 32247 264584 575843 368473 261743 322928
14842 322928 93680 490315 691123 350270 324274 580506 336817 331158 280273 361257 397751
14831 397751 432937 372317 112344 833497 -76680 495778 713231 255802 623115 591799
14821 591799 193192 549761 788515 -126746 -16991 664524 439479 345729 670521 383293
14811 383293 616265 172401 310641 700198 708112 432489 747698 443336 670435 631103
14801 631103 840317 538185 310651 216590 672345 248613 562442 565282 608951 481767
14791 481767 290763 618280 195073 262843 619617 403037 346985 551697 597388 437976
14781 437976 604602 483676 417336 321258 270432 608978 480366 762397 854818 131972
14770 569997 775067 668782 543507 468883 504371 374062 442206 414375 376061 725799
14760 725799 513395 663719 280674 561752 672844 265443 452113 638337 682919 595781
14750 595781 497578 691547 493478 395153 672710 533299 620628 636778 603609 672161 552429
14739 552429 590432 892967 641580 911548 438929 727578 898263 453909 733706 428257
14729 428257 700985 777240 1003119 794070 739304 793432 618995 710110 557960 596094
14719 596094 991283 592244 558816 638132 683029 866933 359536 694104 846431 675894
14709 675894 688917 521596 732078 713905 716451 650763 861912 810838 698530 434937 827510
14698 827510 989465 670296 683228 670477 922674 574125 788005 851205 825047 888929
14688 888929 909562 439143 859915 1041570 703579 1071790 879494 709862 1198657 758136
14678 758136 834800 779643 758177 920161 786159 752831 1145655 666736 940177 1038316
14668 1038316 991401 1003666 690060 786007 972880 908569 870994 814592 742762 726676 944122
14657 944122 896341 978301 1241305 928877 1371485 1036947 779163 1053636 1124435 893753
14647 893753 1199623 990237 1164519 851393 1248194 1056443 1221219 978563 954573 1004242
14637 1004242 1200064 1289335 1482427 1099704 1185645 1119591 1044095 1115887 1055560 773594
14627 773594 1079043 1165555 1460132 1320525 1462704 1362848 1241434 1286990 1417686 1315492
14617 1315492 1380136 1208255 1071719 1452081 1455708 1383505 1422932 1112518 1514135 1461795
14607 1461795 1469327 1400207 1850914 1286511 1181034 1618324 1318865 1489468 1267569 1486570
14597 1486570 1487158 1064581 1574754 1401925 1584044 1402332 1473644 1749696 1487337 1790725
14587 1790725 1863695 1830496 1445561 1722523 1762482 1622097 1393161 1865574 1603803 2036785
14577 2036785 1756232 1755257 1742873 1858453 2052805 1671195 1793341 1747702 1975182 1842813
14567 1842813 2033315 1810528 1828673 2023129 2093931 1760388 1704502 2328032 2058426 2015808
14557 2015808 2463438 2104250 2154515 2115486 2640101 2368578 2193520 2499216 2651955 2548172
14547 2548172 2605389 2881071 2752825 3153396 2973698 3546398 3611043 4311680 4414639 5086299
14537 5086299 5921827 6950341 8279698 11075529 14763794 20756236 28954614 26641011
14529 26641011 16580363 11679157 7822905 5159440 3723686 3034065 3269798 2867017
14521 2867017 2426006 2244750 2157829 2479666 2586658 2485716 2700379 2514916 2001118 2109478
14511 2109478 2287642 2447522 2339713 2405409 2417715 2067864 2648005 2353011 2533001 2652823
14501 2652823 2578577 2474284 2578482 2458789 2529336 2623107 2727876 2895595 2945931 3000473
14491 3000473 2979272 2883564 2771589 3255684 2888716 3143745 3053041 3093430 3419673 3396404
14481 3396404 2782172 3036825 3347289 3428278 3378413 3347233 3426398 3707466 3685849 3431893
14471 3431893 3551596 3598764 3461653 3703594 3775201 3771077 3760718 3819803 3982541 3865615
14461 3865615 4120318 3699989 3954010 4283783 3956151 4136932 4251262 4332867 4527585 4737107
14451 4737107 4241738 4504757 4443263 4631396 4860632 4537195 4892446 4867812 4461807 5008307
14441 5008307 4862710 4995985 5350716 4849400 5565215 5329286 5605703 5516603 5469891 5243926
14431 5243926 5929887 5850518 5808875 6039040 5917209 5648880 6074773 6307295 6300300 6396303
14421 6396303 6529121 6458775 6516874 6418505 6268758 6975740 6906646 7445990 7137143 7320034
14411 7320034 7559996 7488815 7826294 7421646 7317851 7611237 8065018 7811263 8018731 8359498
14401 8359498 8852290 8683139 8677704 8904295 8966748 9224684 8882130 9354444 9456441 9170807
14391 9170807 9766362 9699079 10103831 9999826 10094363 10473579 10816724 10537492 11120187 10835051
14381 10835051 11184038 11576072 11765591 11818647 12412955 12338606 12258609 12391199 12796224 13252524
14371 13252524 13472408 13745469 14048375 14260684 14295321 14753884 15041087 15321364 15638595
14362 15638595 15938213 16055437 16738624 17022228 17263295 17535058 17679279 18329271 18322454 18928555
14352 18928555 19095993 19448219 20052246 20448056 20486691 21216481 21781542 22556897 23203824
14343 23203824 23114293 24040357 24674226 25435125 25711518 26234290 27019185 27336205 28276127
14334 28276127 29100775 29640151 30405513 31304492 32281555 33045994 33846348 34566489 35901465
14325 35901465 36313774 37755512 38760822 39945909 40823361 42077492 43203374 44553168
14317 44553168 46225065 47682015 49157687 50535271 52306251 54162744 56146744 57914223
14309 57914223 59740728 61915920 63954845 66252619 68567538 71191410 73864662 76671844
14301 76671844 79919620 82774182 86143644 89775971 93020962 96974764 101361403 105043942
14293 105043942 110032739 114720580 119679612 125298836 130730183 136672908 143477277 150288242
14285 150288242 157618321 165237703 173066290 181855037 190712657 200863277 210704094 221366424
14277 221366424 232533140 244403991 256706010 269535718 283061366 297063965 311427379
14270 311427379 325262740 338689966 350671126 361954767 372565562 382182147 391414543
14263 391414543 399637746 407566497 414311284 420856236 425135601 428098907 429771050 431436830
14255 431436830 433292504 430496554 424913368 417961429 408884152 399629245 388326133 376644868
14247 376644868 363921514 350866442 337780979 324240420 311190649 298778741 286252925
14240 286252925 274022688 262181202 250879534 239543841 228817563 218097189 208302367
14233 208302367 198677020 189415215 180858764 172416397 164465623 156952666 149489465 142403122
14225 142403122 135500307 129329667 123503464 117835068 112697924 108063042 102913000 98891962
14217 98891962 94888011 91503029 87640439 84027550 80599887 77895750 74623578 72129096
14209 72129096 69251383 66748441 64735057 61985226 60401496 58190945 56265290 54643982
14201 54643982 52898256 50897546 49599137 48588946 46577967 45142765 43989872 42779375
14193 42779375 41399709 40744668 39540748 38209312 37192301 36215641 35374241 34563760 33719110
14184 33719110 32477492 31862899 31134589 30137372 29535344 28907918 28142462 27235883 26784681
14175 26784681 25864719 25605877 25018978 24006931 23928947 23174172 22947103 22112028 21647010
14166 21647010 20968656 20815735 20252513 19875496 19331868 18997572 18828973 18508467 17926186
14157 17926186 17687720 17199463 17074463 16905700 16212755 15767969 15967990 15284312 15152474
14148 15152474 15021831 14405550 14279189 14293996 13775568 13704658 13189642 13364269 12961874 12700113
14138 12700113 12471928 12697618 12332504 12090685 11721674 11694465 11194352 11232761 11117067 10879637
14128 10879637 10598275 10512541 10169447 10178320 9964149 9792897 9681143 9955104 9443678 9461522
14118 9461522 9082430 9400247 8984173 8827392 8717335 8732311 8642440 8337378 8471334 8157992
14108 8157992 8264481 7718791 8283611 7957762 7799023 7356641 7482063 7355242 7186862
14099 7186862 7153732 7089365 6915596 7074578 6900494 6849424 6371362 6451358 6356433 6590625
14089 6590625 6611404 6197189 6405519 6199382 6244418 6067652 5695286 6004130 5932285 6046476
14079 6046476 5773377 5497420 5573054 5317557 5678310 5605866 5169446 5115612 5176867 5180285
14069 5180285 5056909 5007981 4706306 4948550 4829056 5108144 4864019 4465470 4683748 4457951
14059 4457951 4518395 4300509 4564527 4294637 4145957 4514707 4623305 4097093 4427834 3891110
14049 3891110 4042469 4220205 3993757 3766120 4144468 3650716 4100807 3952038 3931000 3840069
14039 3840069 3714147 3775715 3906223 3539867 3692092 3604695 3572855 3323206 3443579 3451913
14029 3451913 3301269 3325764 3502486 3306752 3217543 2876303 3199166 3139497 3055736 3220094
14019 3220094 3156418 3252136 3157849 3069959 3179284 3217873 3348040 3035132 3070099 2712915
14009 2712915 2708064 2922097 2770239 2595965 2382514 2389082 2556866 2503716 2835379 2354822
13999 2354822 2524108 2595555 2563047 2372373 2264969 2369980 2115701 2414852 2130969 2646667
13989 2646667 2640586 2242742 2034910 2169089 2094023 2151006 2738971 2475045 2683739 2764620
13979 2764620 2885572 3260012 3836603 4303628 5777799 7743199 10683048 16234946 25703723
13970 25703723 27897211 19201531 12392146 8833418 6870408 5731105 4509328 4071850
13962 4071850 3789070 3344915 3333232 3537951 2980769 2959982 2959770 2684486 2415738 2778110
13952 2778110 2566186 2858008 2426316 2414601 2573876 2132794 2074566 2144801 1997341 2162362
13942 2162362 2094523 1853033 1811489 2208007 2148377 1755841 2105274 1924455 1928563 1763498
13932 1763498 1989576 1877199 1647053 1837464 1674489 1756365 2014544 1880758 1636729 1752664
13922 1752664 1744622 1648725 1651508 1585970 1658614 1819935 1753431 1629698 1724812 1557520 1810681
13911 1810681 1614935 1740653 1805679 1581335 1401446 1825949 1112903 1615586 1341301 1719767
13901 1719767 1606734 1516676 1678827 1450627 1452364 1551855 1622537 1171533 1494917 1290568
13891 1290568 1416950 1550115 1383597 1562357 1397506 1408819 1186523 1244084 1495908 1545564
13881 1545564 1077515 1183827 1339448 1477305 1281249 1073079 1364616 1412503 1000682 1271115
13871 1271115 1296891 1312868 1544317 1294548 920025 1640622 1344530 1451844 1120748 1436902
13861 1436902 1240564 1424077 1104109 1349945 946635 1054007 1268944 1095135 1215150
13852 1215150 1209927 975000 1066645 1093976 1176529 1072404 1289194 842429 1217146 1163960
13842 1163960 907746 1352974 1364460 850001 856206 1002607 967731 1026863 1184427 1102377
13832 1102377 1099718 1076310 859578 854463 895835 868200 1192853 801293 1015141 1009619 1391693
13821 1391693 936303 878751 1042969 1112950 929653 843721 1088120 981803 917201 863403
13811 863403 1018684 1110360 1118492 823307 725498 1074856 364491 1012014 1067635 790439
13801 790439 1030755 1092830 902935 740780 758904 701864 738634 835234 916283 725797 797783
13790 797783 485937 793284 1176186 912795 651976 693913 642969 495346 854147 807059
13780 807059 769351 688860 514226 736860 806901 895423 869081 514560 598221 806425 635665
13769 635665 729522 833209 752731 1033389 771325 808204 727023 916096 522284 896301
13759 896301 783695 632797 670928 420978 471580 542409 526513 905665 701234 552428
13749 552428 571000 783251 995480 615703 759058 693712 574962 687568 572961 788366
13739 788366 668795 952957 693502 569239 830194 707286 967661 702572 183495 798652
13729 798652 634815 674161 623181 856156 625602 549211 811073 731980 753615 750980 456410
13718 456410 510431 730904 717293 603562 336506 394873 935534 660564 623796 641129
13708 641129 732949 245670 560483 405130 419843 399873 385870 655190 559512 603926 525741
13697 525741 353088 720578 989790 531147 497159 691836 744377 629997 351716 598760
13687 598760 608377 475835 398555 314985 613893 604773 663584 801832 287114 500625 714282
13676 714282 455679 484273 732318 243057 349043 566347 498297 642290 209695 541062
13666 541062 776205 602658 663284 243971 466731 509079 416586 183384 429291 359462
13656 359462 858017 589547 377306 627890 476737 432435 489180 482558 158481 655380
13646 655380 258912 208058 564448 320291 126947 470817 536461 744030 508228 534728
13636 534728 127995 364330 339383 229885 581717 339859 557428 486746 158124 375866
13626 375866 641380 526017 467854 447935 244805 420741 594926 449563 343102 479370
13616 479370 517592 426877 447022 513000 363212 311759 271993 347269 265559 185311 559022
13605 559022 266607 304536 383717 589550 448549 274180 506102 266449 294300 447617
13595 447617 224866 422000 25598 409904 644293 267536 228971 225488 736509 697340
13585 697340 443074 258150 174139 489416 466152 505600 206484 208528 548903 628591 541364
13574 541364 283852 245312 493847 292413 514204 158071 235335 61171 436873 559522
13564 559522 97145 190478 606009 443516 205655 335641 517356 379270 460432 390689
13554 390689 516838 286212 365066 335327 391162 -6507 541110 -9866 416714 148238 92951
13543 92951 50977 167041 152829 375791 566237 226036 175974 304978 32979 244928
13533 244928 380871 453823 93766 406797 624106 -78183 511793 169758 554105 540126
13523 540126 13659 149778 107141 273158 369885 211746 197673 517949 -12011 546227
13512 178511 375263 300663 260512 572696 312661 200025 327208 164453 500820 282796
13502 282796 403331 220898 601230 415303 217330 276216 274519 709610 407796 501553
13492 501553 727725 139464 199519 323924 171006 272467 323705 145105 283074 137289
13481 57810 210679 534150 355332 576349 394066 241769 418899 485141 457659 9655
13470 515964 22668 183885 393849 390189 318085 193974 291675 266063 -54142 178087 406857
13459 406857 255456 414479 146871 123644 408647 -168051 283651 138828 369759 370831
13449 370831 106024 156795 357501 353121 -28056 506794 389904 309252 -2001 215314 123292
13438 123292 574656 96840 138399 217338 -9891 384166 220311 370101 225294 42763 119170
13427 119170 278020 407634 520514 208709 303711 340484 322368 92281 383678 296566
13417 296566 95311 274439 250965 531260 259067 231743 200032 443834 278201 338283
13407 338283 169849 292888 306036 287920 19806 79006 185421 79503 315448 375755 514635
13396 514635 265699 64430 -48126 57204 215236 270259 506185 204774 -61244 180368
13385 220387 484517 285980 112689 413140 293900 119840 123264 410182 69639 -94997
13374 267989 567379 400882 -87630 163855 83998 -54263 167089 226469 -17124 79303 271974
13363 271974 64429 289879 309561 289160 -84979 -104350 359076 250489 50085 186976 354007
13352 354007 139713 203661 372668 79692 262685 266487 28285 264518 121736 296327
13342 296327 185284 -139075 90157 -29049 351664 223525 97234 123372 341823 268302
13332 268302 527034 156506 182103 53657 93639 399797 684126 7323 436313 207021
13321 216202 514045 484866 305788 149051 266342 210575 210780 175942 98901 31187 346726
13310 346726 376492 482256 161641 91026 394851 559528 77638 -28878 159489 267883
13300 267883 232071 47205 55567 321272 276255 222757 96221 279778 430184 382228 -290069
13288 192237 32963 -61170 872 264470 273583 -90871 -42131 -160685 -92609 25104 162758
13277 162758 83770 53366 90864 -198201 -195721 -48888 192761 153338 181859 -8183 126791
13265 374972 256026 192652 -166057 66486 142169 -183542 222457 15362 29846 -10053 -15707
13254 -15707 47687 75165 329143 366282 421381 131111 186760 38765 126261 201855 81944
13242 289250 93549 -17528 181768 93602 108393 76546 304430 -161246 433845 -93807 106117
13230 253994 201716 -128310 113312 191886 -129206 -4378 287862 -67857 122099 -48019 74129
13218 34232 247536 268347 51782 66391 124385 -48860 70676 -193751 414016 297847 237526
13207 237526 102132 -61724 69748 185894 10252 -176989 130166 54720 -16485 -18727 -114673
13196 -114673 6151 -8688 217036 2177 154748 304339 422693 -137741 -40428 219483 -58245
13184 74393 160579 172284 -92161 85649 329790 281070 155964 -12049 79391 148527 2091
13172 133809 96108 -129718 154913 -57561 38031 158772 11734 93196 -236432 261870
13161 122460 189035 160970 462669 -121101 -66169 -64002 25718 283243 123163 349699 -202466
13149 -125626 275513 255165 -35128 -88143 297390 85569 95524 170084 60289 -38220 104972
13137 -129239 49842 41840 275688 252297 316632 179510 297881 48119 428513 20925 235343
13126 235343 189110 -30350 118661 256788 -130108 102742 13397 132008 271809 161960
13116 161960 114403 -1985 246874 -305715 -137749 93441 108735 26797 172786 352797 37861
13104 46153 143719 -47914 33107 -156236 55546 437305 -1945 -123150 55482 214061 205641
13093 205641 125288 136765 111641 -54356 218680 89448 -53121 -155469 -137068 29959 399534
13082 399534 -207293 156801 51054 -257061 -6716 -33941 104765 -56284 398562 13679 371254
13071 371254 -221878 136659 334211 119979 -51093 -52152 -48880 173679 20760 244825 -134563
13059 93160 237112 181997 -31691 108646 245736 304111 -82870 159982 125694 -202282 172184
13047 300386 231853 319678 -386912 -190677 157528 -177418 99351 -147506 169013 -56892
13036 190665 483907 -228401 203456 95995 -71983 -3345 256965 90963 44525 172503 284305
13025 284305 167448 -173341 7606 288115 78025 112514 343224 -18592 -26613 255566 90678
13013 228265 -113157 140510 338435 32457 97155 -128513 226755 475828 24832 260226
13003 260226 82431 103816 -7380 -181896 -3346 -13528 -82500 -42044 68515 -240098 28667
12991 168540 -88381 397426 280781 -18143 358462 -46262 -171798 -241443 287604 -229777
12980 47627 279546 -81742 268327 396879 285126 -116045 -51586 96733 250788 -196124
12969 366659 277999 98646 -103308 -242892 55634 -248929 107733 104398 -114447 -361317
12959 -361317 144420 -98229 -435236 128988 -60898 381745 142798 -172159 237197 198945
12949 198945 98166 35393 -44431 57841 337534 91675 247516 45487 -202292 -3258 -171076
12938 -171076 42791 -119723 -252449 -50697 279219 -98739 1321 -20330 372725 11695 -45083
12926 -23922 352018 -53640 500081 249734 -39017 -150630 364719 -100351 59071 -57290
12915 264485 121571 44591 -23753 146496 385054 -109870 -24921 -195248 172426 69927
12904 -158888 -35569 -250578 355281 -128451 109110 -29486 45845 37823 -48213 101216 68200
12893 68200 33774 -5365 -140140 -91246 25296 56942 -32933 52213 -11348 204682 -136709
12881 12010 68759 -84831 208961 -338079 41200 202359 164377 29409 163686 138745 -138329
12869 -137768 89783 250884 212307 -229473 -63241 88845 144892 190625 172448 -78468 75102
12857 63365 280085 -134410 -314175 -104953 62594 4831 402320 10174 -209705 294167
12846 -27308 -23148 -140731 -321228 17602 76332 -40957 -14004 -106680 75501 -296648 -120929
12834 -157075 -18785 -163768 -90440 207195 184906 -173822 72245 -432 323946 -60371 -3373
12822 137774 37419 -179706 44160 62614 -10145 28871 -11633 -243216 198446 350802 -380040
12810 326319 97126 22642 250712 132871 134301 264018 414821 186122 -65098 296272
12799 -4583 185892 -358100 -74428 81235 -128448 183689 201629 -108708 -85946 -34481 17450
12787 -136941 155378 -142301 -78044 -125210 150152 -101155 -55853 -18269 192923 177453
12777 177453 151702 166206 85776 110827 -326097 177464 -161127 -119597 146927 240841 -231830
12765 -37082 -26129 -138834 153243 55100 -65030 77736 77032 -431602 -49790 -87027 243606
12753 -930 209463 23722 264357 -42754 -253586 163392 -202813 -31827 -287511 -73479 172594
12741 -119103 156321 206398 24737 -76795 -383936 151121 395176 93659 -101270 153822
12730 -238877 -545 -93160 -8808 228636 -44989 246831 75948 -230506 98233 285140 271815
12719 271815 392546 16584 163398 26319 305973 142716 -172119 -174027 -77660 -306436
12709 -306436 -104079 -40330 214003 33038 202511 14107 -168073 -37241 -53461 169683
12698 -121772 -70999 -200212 49041 230704 132083 -140245 92067 162454 -191120 389044
12687 109332 233362 -217656 -31782 119299 -186994 -190250 216487 49306 128802 -63672 -176595
12676 -176595 41403 23187 88282 279919 -10478 193446 137221 51601 103868 66994 -284312
12664 -198526 97208 -114920 139661 -378546 -10464 127548 80108 335032 197078 434509
12654 434509 298895 126109 152951 341143 176495 294993 203281 104364 252830 -112701
12643 138125 -86983 28415 75351 188303 -9089 -140977 80248 213153 167894 262899 49259
12631 149779 -22948 -85998 12128 -285670 -89110 -70228 191828 -29786 -204750 222573 44035
12619 141695 81504 106888 100888 405840 73674 25110 116723 364261 201298 246900 309345
12608 309345 -66609 152230 539664 343860 -59928 -146413 296012 -9569 -107129 -18362 15567
12596 -139603 97562 8628 -35221 164341 -14643 -180235 -37607 363053 218701 296924 190256
12585 190256 366201 6516 244604 87521 333493 526295 174636 -229594 214407 155659
12575 155659 -238891 264865 197428 -191976 326130 -186165 141294 -46360 235796 49652
12564 -56964 58035 -74924 54657 15958 58148 -85142 240171 -68767 -111732 -11658 26126
12552 298954 112674 37965 -315576 -117739 78574 7759 -168917 49956 -82199 221832 162918
12541 162918 216303 -136974 163038 -66812 156409 -39208 78635 -133006 -298335 30081
12530 93925 -117852 -22246 96433 -183895 -185425 -192903 147880 92365 -35723 176949 -142419
12518 212763 161229 109976 -264653 182249 92975 75616 -103113 39985 635402 294252
12507 -43944 -5318 84494 78901 -31058 170267 -73433 -107345 5332 -278415 -22766 -242411 94832
12494 -75140 200524 -135711 225617 326647 -24038 -38745 -40905 -44067 -6366 220483 192010
12483 192010 60432 -31608 158760 -14248 70845 157873 -119310 63711 126304 96196 210971
12472 210971 67223 320809 141352 46839 52647 -44453 -62257 165753 -66272 -2712 -281604
12461 -281604 246109 -240538 70710 -8986 -31774 -346834 -22063 -385584 167615 -65035 157679
12449 -189543 -21502 -5381 18824 -103665 123640 -139181 -261345 -95630 148690 106042 152355
12438 152355 189338 72381 242922 172665 -271105 -338548 -93695 -128648 109606 -94494 91807
12426 -118786 143172 142320 -116964 20286 -128514 -63189 35339 -25097 -16511 22317 250250
12415 250250 149413 240495 248678 -210604 -132261 -107565 -61740 20181 -246262 -165722 134152
12403 -15402 154941 93171 -54276 75224 -147495 169915 125379 -15885 21838 31268 -212704
12391 224040 -159085 -61768 141359 100781 -297083 -220844 43003 13512 185544 254385 -251422
12379 -181214 -110128 -153591 -141745 -71335 -186298 -229526 -218012 -102600 87738 184471 82751
12367 163169 -71892 -26108 -62890 146816 -5565 -156669 -12539 -261260 176342 -9063 -409380
12356 -409380 67816 -408335 -204497 69565 -213913 104107 -220942 -164949 -197897 72937
12345 -199087 367457 156669 -220058 -268459 31328 -75377 16424 72655 94052 -39937 -43031
12334 -43031 74618 -117487 299150 66484 15475 -348603 252667 -191913 -47801 -122994 154916
12322 -81264 -57684 122882 -113317 -27262 377066 4907 6012 58680 336533 214937 262049
12311 262049 198172 -310771 101461 -6025 115301 -68490 -166252 -50469 -236985 -176528 -148038
12300 -148038 -11884 -9909 101721 590212 26557 301919 -150952 -268905 35662 224968
12290 224968 69435 -127182 200177 159428 -82108 122762 54369 -499365 177855 98684
12280 98684 82228 191090 30700 30514 -244286 -89479 -15160 348610 -94707 57142 53764 29934
12268 29934 -5913 91858 -121310 40762 26185 -348538 41697 73838 -140887 -88869 370849
12256 304939 137200 -98227 -19369 323920 338601 112377 -1257 -20937 134262 -17405 -93077
12245 -93077 72021 -126842 85334 -52722 110568 -9801 -350004 101346 -65363 -130241 -90191
12234 -90191 -201215 14700 -42536 -349506 150530 189955 152353 311690 127262 431445
12224 431445 -101517 456731 117129 -244007 115736 -23311 141990 80472 -49239 -36815
12214 -36815 82407 222912 56087 478661 143000 230862 116968 -329380 240941 32877
12203 351449 55366 169596 235339 325067 -38267 401852 173708 167 492083 152758 126903
12192 126903 88127 94706 -103600 -44822 76008 109476 110499 81146 194022 185943 82366 334316
12180 334316 274540 -25499 16612 52748 422028 231318 263016 35793 184079 128694 76484
12169 76484 51427 168548 -29613 -47994 285207 26702 -7248 -6020 119703 -170415 132867
12157 240622 158667 120365 152990 268111 187462 -100110 409369 238002 -140658 216090
12146 -204797 37293 -159941 9179 -131416 88142 180407 248885 -121766 36758 128407 55528
12134 -1520 47683 70950 64359 268803 51228 42970 -353255 158300 61487 -135295 98000
12122 41154 -1768 72221 59391 94750 137058 -3650 -88768 -100628 -81311 -94651 -40749 91308
12109 -141049 -247248 -27560 86425 196431 -14202 -56703 177612 -13961 -87764 -121626 44035
12097 42176 -199535 -362954 24022 234210 -325357 -113093 215665 -195802 86821 181133
12087 181133 215434 -66231 122451 69809 -276682 111016 -222311 192626 -243395 120923
12076 -38660 -30341 72394 -97624 7486 -127806 321040 -75784 174639 -423923 -91460 83769
12064 -258999 30897 37319 149106 9211 -164462 -290939 70260 96882 89834 312250 406914
12053 406914 586499 510245 346248 133869 -91475 25713 -21825 309144 372213 199726
12043 199726 4161 171086 150037 113078 -74275 -62354 261678 164779 -267581 -132837 149367
12031 -146138 127060 91569 51751 96166 -221052 -43630 149475 286641 322248 213434
12021 213434 -240089 74482 67455 54753 106609 89987 -103692 -44639 76925 -322250 -144746
12009 -152172 -2025 -55214 -45427 -186229 66024 -28800 215429 -134869 -60373 107131 -141197
11997 9596 229631 141567 -285536 103630 241885 -63443 -168736 -52924 -53976 -332617 54063
11985 -139295 -36768 4507 201065 -213194 237206 157645 -53721 -53044 -240712 16346 44446
11974 44446 120884 -87040 171918 -341890 145964 204094 172477 -89112 129505 -122346 135718
11962 134247 -202115 94456 -159819 -59932 -137630 -56047 188685 -263374 -293085 112925
11951 -207650 -310174 244130 79380 106967 -268463 -535691 155988 241845 129425 -200286
11940 319660 65390 82388 -25946 -134978 91062 -39537 105944 123346 -155165 -213498 96478
11928 -268789 -9235 -142072 19606 100043 -82480 -154436 -249088 -78066 -176479 -16904 198562
11916 11993 -393934 -79141 205317 -44103 68574 -32879 -215687 -43656 150318 65920 -185775
11904 -34065 14428 -207493 -69573 -141564 368569 136647 -134323 -385909 1433 217530 -327902
11892 -125949 21143 -11635 -131703 -99916 -93243 -93850 -125755 -33472 83858 -131476 96228 58053
11880 58053 24778 331931 -37555 -78883 -8660 -25390 240087 17462 82249 137836 -152061
11868 169898 31791 -320723 167669 151588 -278784 -78012 -120592 -32529 -44487 119690 -133910
11856 157582 60257 -45994 80808 193847 69971 289478 -87836 117084 -129862 45347 -352469
11844 -232453 -178631 -54598 -117171 -104080 37387 3143 1244 12156 55078 -133857 152910
11832 -10068 -149475 -56640 11000 -203397 120440 -20924 56883 305188 64927 90074 -55028
11820 164158 105517 -43674 -28676 -194069 -15787 -116337 18944 77435 -107442 -167115 138081
11808 -155589 136550 -430016 -194871 143391 101182 -139693 7801 -131986 -43423 -5883 241436
11796 -291243 121081 -150312 -41760 66047 -262051 161118 159296 -205834 -201410 -279126 6761
11784 -286908 -266072 41046 8011 -250507 -256843 -151382 -69394 -88177 -6444 -136301 113787
11772 166992 187373 -19745 52649 97528 286 -70330 -189132 113626 38337 128099 -169491
11760 -229628 90131 -415411 64875 53418 34499 -207529 321834 -357271 -1127 -90580 63583
11748 122190 -187387 299380 -109595 191601 98061 -58311 137225 -101904 -159188 100064
11737 -22309 313190 -27244 -192184 95088 -118943 22989 -90463 -11644 -5442 147199 120705
11726 120705 -170771 121414 -9349 -108296 66281 -227052 -222190 -37734 -152955 109896 -148848
11714 -285159 191606 -82158 -154199 -111303 -59638 195748 -211309 104546 -271750 134627
11703 103285 -147483 -156890 330315 99618 202774 -12632 19759 -102357 203388 -50125 -73491
11692 -73491 243846 -205532 138753 -67712 174958 -57649 -136604 -296305 271178 40427
11681 -62287 51545 -110071 161624 -142523 -33720 354075 -211728 -151607 107088 -58157
11670 127892 94055 -82611 20880 180041 -27133 59415 100546 220224 -70226 170205 61813
11658 -148057 -246071 60691 37866 -45245 -145465 212729 164503 327277 62638 64645 -2994
11646 -66826 123464 -23276 -155158 60131 85008 -231460 76456 -49307 16339 48117 359204
11635 359204 -299832 -23908 -149864 -398218 181248 168240 -90292 -67090 313345 146091
11624 298435 229226 -12877 150858 -110724 355136 -277446 -99719 -35236 -139511 51071
11613 182160 -236701 33802 133953 90815 -80062 -371675 14357 258496 173533 78450 -116697
11601 -246256 -139336 3694 -193197 94477 279171 -216776 173564 -124852 -197680 -284046
11591 -284046 -166282 288068 198175 98585 158598 -32113 -142638 -201879 -126053 135243 238687
11580 238687 259212 127650 -99554 302385 464302 324225 237175 258460 289133 -72854 -120266
11569 -120266 218742 -21343 177163 36440 42496 125828 -144834 193374 43942 -56268 150720
11557 6155 -123256 140560 92533 325817 -275781 -43855 109111 30412 121668 218403 77867
11545 35303 197227 134491 -80057 -58639 155693 -64399 9007 6295 -149451 -144392 -168672 121060
11532 65056 -11679 144017 216011 -79734 56137 -177447 -60585 -26417 112548 43507 124049
11521 124049 -388767 215348 78669 -301575 149220 -77917 350121 272654 92498 265077
11511 265077 99550 206684 30881 98379 244400 -205143 101511 267102 50110 225674
11501 225674 -21998 22315 -10055 -44091 348667 -28885 -276856 359554 34892 158139 379089
11490 379089 240969 83629 133034 303906 304649 -193100 -107445 -13858 189006 75110 -133544
11478 51638 84176 -141678 -47893 -116184 -33223 280253 404629 -90503 -120600 45012 110340
11467 110340 -58633 181685 -402616 124076 -4175 155231 7858 453172 -5638 14501 283476
11456 283476 182700 171781 -13158 293708 103626 -6848 260768 121142 166837 31163 264572
11445 264572 90800 88758 141628 -79925 -324218 169959 242890 409609 156199 178077 -198637
11433 -75237 158367 132437 -57432 -63213 -130047 178070 -1557 258945 -96260 454735 210516
11421 53607 68038 69088 -19643 107312 -91186 142394 36311 -287103 37475 194107 -161221
11409 27003 35458 49574 220416 -186940 93295 266748 -52712 -114497 129741 -230041 245747
11397 -59745 104635 -223558 -37862 38522 323514 -50007 -398213 -106633 34830 309578
11387 309578 161435 95339 -58920 264896 -41117 67473 172941 -250186 218636 18231
11376 141157 190377 73560 -371669 -81895 -318403 28903 142243 -98540 -209904 -63396 703
11364 336712 37126 -29573 -92959 33802 297202 -38058 43382 58290 24058 -164531 30768
11352 -123366 -87221 -16968 -157739 33086 -33219 -297892 206478 1212 -100642 36586 277792
11341 277792 -154918 -25966 -119381 82480 249104 -65119 -304852 -58232 -27977 324661 -102252
11329 -12559 -123826 -140971 -181720 -94696 3836 90706 124257 9242 -135954 -106607 -225254
11318 -225254 -22112 -35403 61485 244710 11231 100079 -38217 -251733 -543229 80228 -161890
11306 5569 -288471 -271042 163988 117856 -106778 115307 -191631 64948 -71506 133553 -301679
11294 121994 106159 -97827 85844 -34848 -61470 -76068 115647 15991 238566 -41894 119761
11282 -11955 157368 122934 10191 111520 82533 148095 2146 -79960 -102589 -151544 -94203
11271 -94203 -219053 -265064 -73482 -310836 244781 -95022 -336807 83415 -187636 68517 -17182
11259 139311 -152744 -89243 -71088 88596 14299 -106043 17777 53609 45933 -235959 -493005
11248 -493005 -84291 59573 287689 62412 -81978 -232428 -149595 -164310 -363338 -214568 160286
11236 -48987 -22202 113410 -492717 59875 359075 -49966 141165 -337922 -259548 -306574 -13175
11224 68042 -43503 -282635 -212136 155084 25305 7350 -139717 -72466 -184999 72844 -24454
11212 95360 -357926 -99605 -61651 294350 -160686 -63440 -147553 158284 30586 278006 -37538
11200 -267268 -201425 -21641 126589 34116 -66784 52674 -331445 -145651 250904 -65853 193480
11188 185935 -20824 -247527 -179829 280467 433056 -62009 -69167 156067 104300 -243636 -26211
11176 -199552 30715 -223910 -62931 -201891 -29274 -78554 12956 54842 38730 -336609 -232226
11165 -232226 -141059 83600 -45283 17311 267849 -210653 155716 -210543 19383 73746 50537
11154 50537 -27303 -30901 -148497 -193119 64132 119134 -144753 145188 22284 -18278 -111405
11143 -111405 -64225 -28623 126358 307798 368860 62194 -189426 -81970 -177266 25943 -109644
11131 -191789 36279 -206423 123267 141900 139238 -149872 -93653 -209182 149382 143685 357998
11120 357998 150228 -177932 -386270 196188 16885 227602 97597 -18697 -4416 98182 54487
11109 54487 420557 -86514 9121 337245 9250 -87752 159499 98948 -41096 272061 336918
11098 336918 -88412 94993 -67860 398378 402787 74385 506451 44916 280766 213666 100750
11086 238253 353016 51905 54133 239349 227669 341195 103029 55949 -58466 284045 397413
11075 397413 -125993 -123791 369276 15470 -65813 348787 31948 305180 287236 194444 34496
11063 376397 233700 72806 257348 107197 146465 211532 171386 530635 346063 530410
11053 530410 289432 345208 577103 311074 558619 484202 515922 443570 573694 653504
11043 653504 448217 677784 429675 464530 666599 549696 581061 755937 600999 921400
11033 921400 746887 409794 843640 888185 534010 753613 955220 885034 678501 1292402
11023 1292402 794713 693108 820358 932896 1050983 932576 960967 871937 801293 835330
11013 835330 708489 757103 776343 912332 801132 1101826 772390 651449 722581 734976
11003 734976 883959 752207 945321 670965 660042 920507 694878 548170 677272 644801
10993 644801 716053 566964 747245 395993 736168 858150 510554 566122 684799 614733
10983 614733 758190 809682 615100 609763 645614 675171 431608 891862 829493 965527 751196
10972 751196 1081573 1042637 1175506 1397078 1291209 1373632 1573678 1600785 1663440 1480820
10962 1480820 1840711 1902833 2272843 2760648 2874651 3150419 2882169 2794570 3280070 2826291
10952 2826291 2889129 2366727 2191549 1686133 1811358 1379233 1559275 1297410 1418302 1162038
10942 1162038 1210666 1408150 1051712 1095409 678738 642218 1011520 478077 622846 333295
10932 333295 440086 295374 393060 114843 369245 538214 340661 338600 249454 409544
10922 409544 279372 229165 60123 -19532 152363 49020 102608 -122187 156039 30290 -74057
10910 229029 124669 33084 -7632 178423 -211288 -247138 187249 -227574 53143 347710
10900 347710 302831 156643 403094 -46691 210317 84523 -500917 3606 -145859 74065 -12933
10888 11641 -126578 -154033 -90877 103426 -46424 116316 125934 -87749 -35941 -139307 -5036
10876 -232235 -69798 81360 157989 12158 -275112 316060 178012 -54955 2676 129745 -162299
10864 -345390 -41870 -135374 -5236 -206653 202688 121605 75919 50688 174845 -108964 278719
10852 103572 46400 266827 71751 -143396 221693 157900 -145668 136336 -169629 -293635
10842 -293635 198354 -40894 -263012 215861 146157 52055 -281923 -16544 17853 177474
10832 177474 110858 69981 -12147 -90803 34341 -63917 -61595 -289921 56560 50275 51304 -9342
10819 -271292 -128564 165424 162439 121154 52415 -266033 98643 -178487 -268894 -183772 -198330
10808 -198330 -287616 -231911 189586 26156 63165 -91760 180599 228007 -80892 71 -154563
10796 135216 3820 -305910 -37477 -138882 323616 353431 -182729 33830 31264 -128356 -41876
10784 -118857 -259676 -273329 -32839 66103 -74114 -252633 113099 -108223 -75631 76508 313985
10773 313985 -232969 -11780 -62909 126486 -27205 -270394 144831 241981 121565 -109330
10762 -190055 -61830 -255303 59790 188487 -99229 2396 -329610 35407 -185278 -313055 86174
10750 329744 -126718 -82638 -64332 -35882 274297 -76169 -456007 65470 87087 67642 -59012
10738 -32745 5260 -330788 301041 -81930 -40881 -61544 -22022 83615 188555 -65018 -299394
10727 -299394 5470 -43651 -459047 168757 -152224 48291 -234560 -23985 -214442 57077 -256587
10715 91539 94690 -366166 -173141 -305489 259594 -85620 -193882 -223425 -155281 197762 -92300
10703 -166099 -20499 -190883 85052 -33201 -150633 11242 -18899 330799 -92384 108954 144033
10692 144033 -36773 -21810 -6732 -116672 -107760 336540 -406071 -4555 94890 -288102 362565
10680 43014 -56855 -272193 -129763 94311 -71207 -4842 -43727 -114860 -375944 -155074 -2074
10668 -215838 -317314 474296 -582189 185957 113876 -203210 -285427 126679 -190922 -81510
10657 -265493 196085 -102912 265528 42419 42342 -171413 38397 243134 -290501 -279290 -340848
10646 -340848 -387442 -156759 -17490 -39887 -266311 -178963 144619 -168213 -83035 57884 80322
10635 80322 -52683 113777 -98573 338175 -137947 -25620 -76117 60543 -126776 -327570 40443
10623 182251 -174176 -3814 158188 -58794 -88054 -75451 43603 -130369 53888 -147858 57416
10611 3432 -1436 275630 149802 60822 42030 78929 29681 -81114 -78788 110173 125371 -467781
10598 153603 129711 -144807 -16477 -194123 -112275 -88291 -61143 164964 423860 100401
10587 -76627 18729 -303963 -217477 71426 -310344 71615 -5234 -70080 -207466 -161363 -109178
10576 -109178 234759 -314641 282868 -31680 -271044 8408 -44575 -324590 114729 -36804
10565 473030 -149107 -124224 107726 -362708 321693 -243732 -272968 -307741 234516 193834
10555 193834 -36647 164228 39139 88346 132375 66538 -104491 65986 -125242 112710 103144
10544 103144 129579 -238068 -265060 71819 -227723 117760 172032 -10274 -80450 -26861 -152251
10533 -152251 51873 -180051 77313 258899 123569 7689 -126185 -295503 -384444 -27918 -152720
10522 -152720 -16420 -311258 64977 337722 -117906 -76383 210121 -61099 18521 50452 -203597
10510 68899 62023 -69913 -48294 -64855 -33924 -50002 -174110 -220684 195025 -46320 172468
10498 28782 -156814 -76241 129540 -174694 -251772 -174842 194530 -176229 -59777 34168 135344
10487 135344 -96792 -21837 -116893 14038 79231 -137203 58816 -123347 94528 -584 -3470 -9290
10475 -9290 45062 22970 -143038 202599 11087 -23683 136722 88503 -26288 -32473 397792
10463 249475 -138636 295010 -23121 85371 -209938 -38811 -104569 363873 133228 68126
10453 68126 -30440 -123892 -184524 -353945 18939 75100 45941 30927 103182 28475 -248975
10441 -70877 122734 215728 -53440 266214 -289498 -174792 -203555 -104348 -170193 -285820 -64540
10429 -48100 -137396 82410 -36077 155232 -115562 -296777 -27765 -78015 97332 -139730 -265420
10418 -265420 -58455 270306 -152595 -150610 -139543 155824 -206009 -119253 39014 87618 148478
10407 148478 -178257 -119225 -51415 69379 -1872 -10436 -7338 -101623 255139 160568 368401
10396 368401 -290687 -52305 -3163 124275 -3512 61124 -354040 -209919 -327240 -137711 -34808
10384 172182 50303 -99973 -18781 246109 181095 -58479 -89147 291211 41958 252305 -44352
10372 236935 75304 174792 278239 43217 -109260 32522 360901 -27588 45461 105410 244387
10361 244387 307883 387926 81266 338498 410335 382384 347641 307053 84177 285951 217889
10350 217889 420325 477370 279023 356853 -9449 224035 46751 91831 -114637 267705 387328
10339 387328 71702 177025 252591 176211 678481 436415 183199 186242 234244 44946 136437
10328 136437 362692 203754 432552 5535 7491 137815 94610 167659 303663 87458 257374
10317 257374 167584 199395 192177 138059 7884 287173 38559 254497 -51289 307687 283155
10306 283155 95046 169609 244787 475158 316674 22250 80559 -35810 52137 171024 2779
10294 -130723 -168805 166491 230742 -228320 -151184 -94375 -79836 -107682 353334 36713 -207500
10282 -256842 -172148 -53192 -40694 82554 45737 -256017 -186429 77901 -226169 -130262 109879
10270 83754 -121843 -382868 368381 88056 126589 -100379 162112 -201503 176088 -151387
10259 -6851 -10587 -41911 -29968 -110781 -365701 -208712 306382 -184122 -48653 178268 126504
10248 126504 151654 188323 -98689 114939 -324744 74309 152784 98830 -199402 23962 128861
10237 128861 272628 284253 36225 117915 78677 276163 117810 25704 -277980 -77346 -70460
10226 -70460 6734 -2569 112707 -105443 117155 -284977 -61594 78056 228933 -91611 -300936
10215 -300936 100211 92945 -31731 -128400 185990 -260224 173648 -238435 -193456 193145
10204 65002 -149427 -421377 41438 -50146 -35852 -258789 43478 20987 -80362 184996 249120
10193 249120 -57085 14018 270446 -41456 -170193 -281452 197813 -12071 -248312 -71789
10182 -179253 -5419 -74739 -41172 199350 -116407 -17787 -246932 -157481 -170749 -253315 -147713
10171 -147713 -241025 82422 -29555 -248567 -259945 -572014 145780 -101181 183272 173045
10161 173045 -138956 -63503 -254112 -179015 -119903 -44476 71498 -94808 -252422 -177214 -209546
10150 -209546 -166814 394182 -237988 -220986 -33459 14978 -352643 -212922 -150606 116910
10139 260999 -156531 -288886 186471 85572 210767 115290 82740 -346031 -255357 -125887
10128 -116819 -230875 -169405 -30763 -326926 -193742 -181695 -153466 72123 -350316 -134753
10117 -247625 -144492 120928 -148219 15371 -206193 -165632 290650 -129234 125843 -295900
10106 -374519 172543 -148243 -45029 -2464 314959 -253529 -340421 -350078 -209283 -306439 -293327
10095 -293327 -96096 46120 137981 -14128 41532 -146941 163376 368364 -252086 -31183 -251247
10084 -251247 18793 227776 -54233 -107339 -259933 24299 228774 18042 -246585 155280
10073 103517 84538 133412 152686 -102722 -63803 96676 -160521 -44097 172058 -125138 -222453
10062 -222453 -9053 -299796 -432288 -143308 235630 78228 119458 -179353 -338593 -272583
10052 -272583 421325 -38049 -212637 46535 -79325 179670 25765 -2361 -862 -240878 -39269
10040 216554 -278570 85155 -73690 137391 92446 221676 -139942 -156217 -312608 -34662
10029 24196 -116813 -293365 -93987 -41879 87633 -78508 42487 -255036 -58131 -349241 -16162
10017 130804 -300236 77585 -167957 95912 -34795 50882 -250947 299743 -434394 88078
10006 -173216 -165307 -187042 3994 -45250 -319206 14530 -25121 -49280 -87271 -98442 152725
9994 -56609 192189 -90122 112119 -19579 -125371 -12634 -142959 -24343 -193497 16589 -274986
9982 314324 127634 -188626 -36576 51645 137152 -249104 -271549 -201634 -85783 13291 -131947
9970 23539 -15423 43690 -264647 -236475 -68107 -34243 -230314 184428 342362 -225051 4948
9958 19434 -189632 154384 -4351 156360 187922 -27432 -25549 155806 -232275 114792 -31866
9946 -239487 -185068 -291666 -79070 -299207 57591 12787 -6690 52330 -248133 19500 -113648
9934 -23962 -66268 -135554 -265830 89661 -267677 38175 -120726 -171623 -147840 -62223 74872
9922 178711 -140137 -209030 -18886 108379 170305 61774 -237208 -69158 151093 219466 -320609
9910 100487 -122967 213852 -78088 405 15280 -78253 -79376 -121333 -89666 -224499 -96104 -93913
9898 -93913 -107062 -87113 -53571 -26184 69563 -203812 130644 193015 19757 -321224 -383228
9887 -383228 55687 -208417 93382 -71002 149322 26749 88172 156927 121273 -6366 62374
9875 -86698 -189793 -435924 -84097 19560 395138 -119933 221641 -159921 165505 153150
9865 153150 85650 -111595 23577 264527 -21301 79399 -96538 95025 -25544 57081 -118058
9853 130205 -1053 -297685 35318 288469 -28834 -299125 -245332 161993 180358 -186722 -28193
9841 30302 166894 -296978 24048 8465 214592 -93682 18023 28973 -56675 3352 213182
9830 213182 -18220 -152174 -218404 182112 65402 -146174 45612 -47117 5782 -19816 -6198
9818 126030 -205285 18685 -215400 13141 -117905 98320 -98776 106740 36151 -256248 26645
9806 -259832 -262915 -33283 -293390 -274108 -432429 6872 -128341 -5358 -22220 -9390 -289875 -176843
9794 -176843 35588 -155008 -41912 48985 -227945 -231900 -293525 -17123 -897 -153504 271204
9782 15082 37099 -75618 278994 -244407 108617 -57373 74592 16301 201958 236333 131406
9771 131406 20085 -28539 -268939 -394421 -68172 76113 -137161 2232 -258596 -467731 -213395
9759 -366620 -94496 194626 155148 -331893 -105981 56585 -132344 -83435 411141 -136495
9748 53627 -128418 -82752 -56250 -63896 -229937 -199627 -102348 -98635 -249338 -122239 -12387
9736 -166929 217756 37352 -106102 -17436 -206802 -171688 -97283 -90558 9724 205973 -251795
9724 -173175 -44454 80385 -484433 -237046 -64188 44196 7900 68507 177873 -162654 -218182
9713 -218182 167597 -114807 248279 26243 -166835 225800 127011 -199281 -77521 -272602
9703 -272602 -181401 -237599 -40369 68773 204277 -60522 -62194 57191 21560 12089 -98563 -240611
9691 -240611 79774 13094 -72754 108155 152842 -241765 98680 -223061 99654 134600 120060
9680 120060 257610 -140496 -213902 -79118 -330607 -211212 -68627 -245866 25881 -101931
9669 -99633 -194079 150575 -201738 -281601 79543 -124293 62840 -154264 -120699 -145580 -336713
9658 -336713 28511 -183670 -88464 -177699 101957 -168175 -40000 103501 -123701 -57494 10170
9646 -120241 -14499 -158179 -260146 -185793 81878 -22761 75777 -192220 22947 -101556 -132540
9635 -132540 -253981 -135562 99713 102969 -223086 43576 -13489 37614 -38961 41862 -258088
9623 253536 -541641 207506 -203698 -160412 -37001 -475371 -84558 52 -122709 -45280 231536
9611 -149095 94938 -174798 337693 -74137 257216 -118496 -119669 -361119 69984 -211180 -183010
9600 -183010 -152243 -41692 84226 166501 -163589 -203762 -257155 -307335 39588 128626 -274685
9588 -329132 -215041 -399962 58128 67647 -213477 -53336 146071 -180699 -159351 329063 -85600
9576 -38236 124455 -42449 -121437 -328381 75759 -164296 -102476 -102459 -52920 -13454 -267268 113109
9563 165989 -103196 225636 -206928 -18330 -27006 114660 239035 -104326 -176004 -237415 -175238
9552 -175238 -53817 -67465 72716 -47232 -81804 114724 213277 -150452 33140 -272539 -205165
9541 -205165 93726 -47257 -3657 -130706 -315422 144009 127740 -39551 -98788 251533 197508
9530 197508 559 -185752 106277 -18678 -179216 -163221 48552 -398136 -225262 -128039 30397
9518 -45170 -196996 201713 -138981 264573 76710 -206061 60862 101291 -64939 16327 59287
9507 59287 189454 -222491 -335823 -14438 -10460 45129 -67716 -44980 144673 -119123 -70605
9496 -70605 202884 -138493 109714 262735 167855 137875 200093 -290881 -68107 252549 39029
9484 53126 -52804 -177552 -53971 112682 -238510 65543 -199217 -154334 -308459 -51705 83196
9472 -251482 -152000 -386623 -91515 -217961 -286742 -171641 156008 -113142 -181725 41228 -19355
9460 18079 94164 -374905 101730 -67330 -392003 -146411 12584 -402611 175564 -99987 51872
9448 -26811 103347 -209903 -344972 -37952 -99439 250781 -304629 -135261 -57995 -1412 256016
9436 -9202 97167 -21434 -159370 -336892 -394658 -144548 33888 -43525 20243 -78289 -43991
9425 -43991 91396 -50850 -193193 -24283 -2518 14684 -298787 287563 -153494 -255939 -144817
9414 -144817 255566 -95580 17142 15004 -110339 207191 -126763 -99136 -477413 3273 -300560
9402 -107659 -290314 -86554 183435 -262733 -143760 316786 19656 -211263 -213398 -213055 -114153
9391 -114153 49504 -56112 52337 -115267 -346393 221922 -300417 18917 179906 -117177
9380 72506 114845 -131499 -58742 -152502 -188651 -251539 -36678 -136820 142883 -206374 -176789
9369 -176789 -15061 -99083 -401371 -53586 -56821 -68551 -361960 -60949 -77556 243515 -204057
9357 13921 82897 -288088 -2619 -8544 -126894 -197241 267418 -150238 -1410 57218 -124438
9345 -198364 -71600 188859 -407159 -252402 -156249 174413 125676 -238138 -51517 -22765 108723
9333 -248232 233946 -121139 -96371 197935 -53850 44626 76558 -72969 -185008 -370926 246282
9321 -242565 9029 -279506 206275 60999 -155347 -237171 -89240 98263 73499 -315350 112292
9309 98850 -54576 143433 -281531 -22572 104379 42987 -173560 37431 -114043 -69776 149998
9297 57702 -311809 -143667 117457 -159559 67891 -140920 -267544 -134914 -273645 -131664
9286 -61003 92036 50898 -60411 -19499 210220 -97101 -36737 -77070 129960 56611 56466 -54280
9273 -96199 -17528 30647 -75340 -21485 -59580 260414 -23481 -106870 -337473 -396469 7952 -257184
9260 -143221 39806 -95395 -227526 -237667 -73608 23111 44364 -204819 129727 -5732 -138016
9249 -138016 36625 -83802 -114717 -255950 -56355 -202876 -210287 59474 -16821 132876 -82925
9237 -164293 -32256 -99556 -341202 107955 107006 23010 -119821 21822 24578 -88988 29520 318333
9225 318333 -64501 167030 -13399 -170770 31141 126275 76570 -376000 -7937 -315570 -171607
9214 -171607 11970 -57586 -402147 -405881 -76304 -146593 -63434 182435 135036 -157616 -145974
9203 -145974 -13484 -245245 -75552 33935 -372909 142221 -142884 -116285 -41221 62465 157727
9192 157727 -101903 7196 43326 178517 64349 -34597 -81456 100365 310586 -356349 -33424
9180 -4408 97287 -62455 -109167 -310447 -59682 -106631 -173642 -200131 -286553 55082 -176752 -57938
9167 140245 -251036 40385 114723 -45964 -152206 141273 300960 133084 -29809 -148373
9157 -148373 328994 169664 101628 -153784 -338317 -348834 228032 -188465 105610 47768
9146 -186901 141283 -310044 -52215 -10360 -297002 -85713 421384 29234 -5252 -80435 211542
9134 88496 -606115 -271498 178042 71282 -120728 58510 -322478 353355 128397 -249025
9123 -187680 -262294 -67147 -195820 -329992 5527 -89630 -37924 -148055 -158208 -307562 301288
9111 251766 -253106 242095 16138 118194 -134917 -237838 -412060 -114920 83331 229868
9101 229868 -96899 -152309 -281924 117083 24761 94036 260997 48252 311541 -314304 -220717
9090 -220717 -20719 223307 83746 137553 -106169 6314 -225592 -24710 -122732 -286421 -113758
9078 -139280 290733 144879 -301759 -206372 188970 21927 -108906 -24636 165837 5031 -140941
9066 -112725 308936 48067 305500 -391800 -90316 232922 155206 16344 198683 -25291 -215341
9055 -215341 -41041 -230836 154388 89125 135158 -445411 105421 16312 162968 297955
9045 297955 -3051 -61015 374773 -133443 -39310 -246976 -49074 -374749 317283 -91394 -332081
9034 -332081 179627 -206959 -104899 -45976 -13512 -323354 43732 -168390 -253297 83368 -353619
9022 111714 -80678 -81419 180395 -147535 -429774 -397615 -406145 -27231 -286554 -49235 -307324
9011 -307324 -278099 295973 -363552 284342 378004 22021 263916 78359 -25182 123085 -237684
8999 -353813 -39643 -361558 42772 80442 32629 -95560 -383264 -339762 103380 -107089 -20507
8987 147661 -118130 -318807 -84190 -193798 22365 -292939 -278434 -50638 168265 301420
8977 301420 -9678 50033 53839 163738 234134 -408757 -161279 -233380 24015 164697 182615
8966 182615 -181198 -10378 -223523 69569 -11995 -170910 -231467 -113500 -53392 -71982 8118
8954 -15741 147107 -475410 -86565 5284 -111613 87905 -117792 57199 -126155 -66216 117044
8942 -103649 35668 -155428 -403251 -225359 -88940 -153079 -67444 -27084 73190 -39403 -215658
8931 -215658 219443 -81508 -107412 -141120 -221010 -157107 -313628 -22561 -452408 109486 321409
8920 321409 -127162 379204 196749 -40083 575809 175583 217858 346510 420241 757807
8910 757807 1079504 1212976 1958932 3078464 6612208 7451814 3196263 1491599 1024969
8901 1024969 480834 257471 371136 5417 219563 174822 186911 234734 729261 48996 352554
8890 352554 134643 135230 -46559 7534 131182 27141 -201995 -37192 106653 -22696 -241255
8879 -241255 -137099 224379 -59353 153889 -52525 -262804 110290 7106 29489 -221760 220013
8867 211530 257421 187122 -170785 23846 -199312 137071 -16865 -67037 -116095 83886 169373
8856 169373 312342 -119146 71898 -66052 54065 155625 39045 -102935 155805 -182679
8845 -187410 -108621 -26092 -162844 -142211 -132665 -70425 -155983 -160059 139143 -45686 -210576
8834 -210576 -288964 -34368 -61320 -278194 -251003 46038 39540 -346203 163103 -290232 -173405
8823 -173405 223963 -191499 -70207 -199074 -64247 38278 638 335769 -61620 53491 -10820
8811 -221684 -156079 42130 -11164 306473 167629 -230445 58415 4926 103867 196797 -128886
8799 -321483 -68846 -92963 -96440 4324 -52335 -91800 28395 217584 -436602 -110086 -80482
8788 -80482 -147484 76637 -181266 84877 46519 141370 -233120 134986 -193572 -57868 -191861
8777 -191861 -1342 100525 99380 -49503 -166927 -63147 10424 -15004 -169095 36199 -208143
8765 -116156 -335222 -184289 -34925 253800 185562 116873 -144276 238552 -97292 11887 -37450
8753 -160356 -469729 -232896 -235958 159014 -116299 -123896 36282 -45398 -225482 386613 -355516
8741 -53705 211165 -231106 -81884 -120421 125640 -1074 44252 -150609 -42777 -56053 -69827
8730 -69827 -225848 75635 -89249 108712 66140 -82729 -16381 70990 -148359 54340 59937
8719 59937 -68143 19235 -27752 -97748 211967 35917 29006 -14386 -43080 87194 -28050 156500
8706 -281063 107385 -202182 -43339 -412454 150102 -20393 61001 -358384 -85304 -2332 129987
8694 -101749 -132561 72827 230138 -323972 -302399 -186701 206789 -133597 91147 -233890
8683 30127 -237952 112384 -168574 83952 -158888 -206713 62945 -244776 130412 -1077 -161220
8672 -161220 24237 -38447 -240990 -323861 -285169 122105 -316019 -164022 68301 254518 65817
8660 -72289 -97615 119636 198933 -238626 135916 -81699 241126 -201814 150812 -98428 -223138
8649 -223138 -56655 104087 293654 16593 -127281 -224968 -8062 220607 -10437 -264949 -233262
8638 -233262 -31841 255436 55446 -205597 106153 -106417 -156123 -197142 142320 -77306 180850
8626 184558 113714 115935 -185298 56519 -72710 110107 -84440 63056 -250125 55571 -183314
8614 -183113 -146641 -236959 -136744 76083 -231839 23986 -80372 -97352 68687 -197014 -36653
8602 -151993 -28613 -159823 32837 20398 -152144 210433 -537263 63722 -124885 26206 -77522
8590 -37399 47199 -48786 -39495 -83791 74511 901 -234670 -165751 -234822 -364556 -109832 -69998
8578 -69998 -156954 -117137 148512 -264863 -60084 -287179 21206 -354477 148846 -273440 -14397
8566 23501 -159788 344040 110546 98038 -20145 416364 -352510 164666 93316 -328503
8555 195893 60972 -22583 -79792 251204 290500 -70346 56741 109210 -122610 -179379 -133653
8544 -133653 -20984 -81576 52270 182915 -131748 -18649 69071 -302156 -147823 52781 -166020
8532 -306102 -90435 292375 -82995 -52389 77270 -213885 221666 450148 -90979 225910 -228419
8520 -290219 46927 -99957 -165897 207910 -122464 -48907 -28032 -28933 407546 -170736 24821
8508 367315 180911 134151 194383 363532 -100741 112010 -157535 -7882 49095 -545733 -109484
8496 154617 170867 -139991 154369 -89963 42353 290269 188024 -111972 -140522 21203 -800
8484 225958 56570 120137 20349 -52595 186998 -157635 -61585 87547 33548 -381429 -208480
8473 -208480 66276 -258396 42426 -298453 -256237 -221442 -35825 -23043 -146520 -108383 23969
8461 -4452 190299 3937 -43549 -439348 -187900 254695 -59788 -332828 -95286 52742 -111741
8449 -15719 -68109 -74780 -224512 -273632 23701 -204339 5557 -147263 -105880 110878 64771
8438 64771 -188645 95414 -57144 99791 -230490 -103715 38977 -255863 157184 -184194 169029
8426 270391 -103013 -91610 226063 61501 -60849 -125572 73642 -149792 -326426 4748 157124
8415 157124 166425 123348 212058 -53820 -91350 -62084 -82819 -109978 127467 -336229 119348
8403 1315 -90951 51960 -229590 266108 -166975 -9600 -41533 -261051 -64404 -274306 17147
8391 5634 -89492 -273939 -125851 151368 128041 19759 -72932 -73561 1476 119782 -138044 -253417
8379 -253417 -113195 107473 177386 -241818 186797 -83188 33068 99210 62193 -120501 -82026
8368 -82026 -111930 32379 244166 175957 30817 -94055 184626 370297 71860 -67392 134170
8356 -189021 109829 306634 -41577 375812 -284280 -290449 199757 -117604 359640 -91524
8345 10074 201332 -276245 -211658 -188376 104440 -349767 -17241 -107881 166507 -110155 -112533
8334 -112533 -270230 -230046 88047 -258432 -161079 -48582 -89404 -26310 -57266 125088 -50545
8322 -46343 40306 -186233 244707 76318 -406569 -108135 -214599 132600 153763 -65801 255587
8310 -79447 41801 -3083 137528 -436733 -135921 -111009 -237855 221560 47600 -201047 -66853
8298 20204 -514647 -280571 125274 -72650 -92009 -150824 -121752 474493 -79724 123115 -20714
8286 134774 -40256 171143 -212625 3215 290230 -178407 61899 39347 -77523 -248068 226763
8274 155271 77646 -331941 87460 23081 -317826 329161 116530 38618 -65378 -458576 70131
8262 115347 18847 -89369 96399 -112187 -145407 -198264 -234884 -139380 -47436 155153 204053
8251 204053 -49061 -354093 -160458 86363 -122105 -128160 -44559 -318894 61327 -22793 39099
8239 141629 95473 -178064 98011 -85852 -160354 -341372 121748 257916 -17761 523768 28385
8227 49437 -278283 -71547 -99580 -25516 -358052 -33041 -235129 161868 -49910 134740 273824
8216 273824 156652 79836 136168 119173 281106 30472 38587 -265718 190871 -310782 75753
8204 -148797 -17967 -145795 225408 66279 -451514 -254131 -183292 -101141 -157449 -56854 122536
8192 182188 -102804 -169527 21819 44913 -139384 -120826 -65246 -11208 222262 -33893 -63137
8181 -63137 299020 343292 -248067 3655 278985 -121983 -114384 178545 147350 -34605 -128208
8170 -128208 -53215 -83901 -224645 -294480 -26453 -147654 -139853 360822 -145701 -7409 262390
8158 -174865 -179771 -49481 -263352 -269840 -96321 142796 62745 126612 -109949 228131 -157940
8146 -115126 144137 -151672 189118 -104020 -407969 13772 -130561 80587 -167980 -323559
8136 -323559 -14763 -33761 -24605 -212559 57800 -135305 71866 334440 -323248 313258 39788
8124 91625 -77636 -77237 140858 79660 36819 -193832 -103155 -114003 -196462 -141810 -31876 31562
8111 193305 -80856 -182715 -63470 -135237 -439063 -69916 6227 -378967 -203899 -323081 200474
8099 60333 6700 -240885 -6556 -208618 -143395 -52120 -344605 -143760 -12869 -76375 -218342
8088 -218342 220823 31303 -34344 -106044 38600 -161994 -59215 -174062 185716 -109392 -170667
8077 -170667 -135934 -118762 44970 67437 -31468 168675 127289 119560 308131 -51378 98276
8065 111098 -166788 74486 187388 -163602 -71730 -64601 -277805 -18122 97419 -167740 -293249
8054 -293249 256507 -136694 -199668 -119499 -12666 -252266 -36458 101052 132330 -255022 -184140
8043 -184140 231763 -305359 -115504 -63762 -148832 -192581 -197506 -56726 -292963 -36649 205589
8031 36809 -401065 -125084 -231301 -183499 40109 -50115 180916 -207109 -44245 -187248 -46088
8019 -240181 -180034 -7607 -92184 -260064 -48474 166474 240953 38434 181675 -183922 81131
8007 -137883 -283447 -470532 48731 -94046 28501 -72723 280692 -241214 -52128 -163013 246910
7995 24083 94473 -22272 4929 33395 165874 165668 43724 37833 -86340 -92386 21796 38338 -95417
7981 -142439 -133727 -285597 356167 -80709 -39849 -35479 -247553 191470 -169112 -66326 234890
7969 -5180 59819 -190516 440847 -29171 -347586 180265 60160 -42391 269742 134908 411781
7958 411781 -16728 115130 57752 98706 149642 8393 -233318 -396527 146369 458050 26761
7946 -78029 -57156 -59921 -381883 353149 89047 65496 255125 -276000 -246078 -596266 -275177
7934 -67968 70002 15725 294456 -43431 68979 -59484 -40488 -192073 167624 -158582 71724
7922 -161875 -176504 -150444 -264906 -236732 -521597 204699 23226 -205893 32956 32962 158039
7911 158039 -11263 352772 -146576 -238843 277939 -318338 399204 -15416 49342 163455
7901 163455 -224220 2597 -90936 111461 48395 218514 43963 -91425 -294944 110521 -111335
7889 101492 -71880 -204867 -52944 -190291 -66762 -215612 109107 12332 27624 -63997 -136432
7878 -136432 -251685 189995 -99891 -175552 150781 -70610 -61142 -109120 -257120 -179856 34018
7866 54825 -169417 -175810 -231716 -99532 -209307 141541 -263239 -114232 -294847 -93726 -96419
7855 -96419 -149282 92834 -112026 -145090 -681 83907 -209986 -359864 -41287 39690 31764 151628
7843 151628 -132892 -46994 70720 -12415 63794 207826 36001 105491 22765 -172118 -150688
7832 -150688 -401760 -236836 73944 -271962 -328378 142799 -63970 60124 167408 -153758
7821 -343876 -124268 -241692 -4944 -138286 424228 -57354 -55963 -102115 -149695 -291892 -215832
7810 -215832 -2812 -260634 -30978 -125120 118547 -15603 -118212 78243 -39964 67521 -77982
7798 -49949 381352 -107514 146635 -23178 -26528 -47330 -256832 73435 -10890 -91758 -42217
7786 64882 -210136 -74785 -200154 36459 -100163 -82644 203543 -258952 158740 216779 -162942
7774 25564 17098 116418 -166801 -343285 431361 10653 -370130 -307702 63456 64098 -106112
7762 77629 -116596 271550 -259924 -98113 246351 289971 -11774 -114412 130800 -108564
7751 65297 305608 -62881 136133 169289 -209289 216990 159000 -136250 193215 -108678
7740 261630 -20467 94505 -85139 -105627 -28367 -24771 -339453 343233 -139909 95785 198229
7729 198229 -162447 87652 -156518 -38366 -80144 21973 -341227 118276 93302 104891 -367249
7717 119025 -55415 -91451 -13098 -345298 -196981 69372 57797 17033 167690 495628 -146236
7705 285719 35138 -364555 -90369 125680 106614 -8606 204614 82714 101913 69693 115814
7694 115814 -97501 -24209 39026 109053 23133 166326 -307009 -364072 74030 -47371 -300262
7683 -300262 15018 109056 -6653 31112 -88817 -31936 -37659 35440 -8134 -189188 98732 86307
7671 86307 -87389 -448433 62013 -123137 -310222 16531 278197 -23999 40733 -79288 -52492
7660 -52492 -59569 -39154 43675 -188930 146872 190532 88724 -256295 172947 265446 -59101
7648 -218045 -29840 -258414 -44368 -72104 1553 31219 -77758 117358 -164269 181007 68907
7636 -231002 88791 -208733 41708 204446 110397 -158532 266055 -310597 106815 122691
7626 122691 -72409 165604 -12628 -167975 116226 -10526 -135590 -66433 57934 231374 -2929
7614 180878 -195449 62213 -449119 -231421 -186165 -239199 -499779 16359 -191939 73528 308047
7603 308047 -169399 17522 296323 34756 33242 -76498 59182 144440 -440622 -51019 -127282
7592 -127282 52518 -107816 102354 -90733 -124522 24767 -127952 109881 -141381 -103024 -55827
7581 -55827 -22276 32415 -25267 -22297 75048 112771 -49113 -242258 46674 -168102 -98513 -61146
7569 -61146 74092 131504 -46937 87577 50764 -397432 -74142 -127970 -78639 59331 -141217
7557 108789 -68365 48109 -417682 -169275 138689 13629 -308075 -247357 135418 -95658 185352
7545 -308358 162504 -221808 148489 94566 341443 223343 324584 57016 91343 -369752
7534 341438 -99456 -14139 -132503 -322647 -202371 -17379 -307265 63465 -56134 -79767 -214090
7523 -214090 -60078 313401 158514 -168923 -51510 31446 -78059 296106 -112747 -211470 -85172
7511 110075 18635 -73524 -256091 -208131 -185841 12564 -21243 179609 105951 -34185 -276704
7500 -276704 105338 -191133 47606 63112 41941 -225484 22381 51872 321861 -328434 166777
7488 101424 -93623 -28661 -71251 -149136 179729 -164111 -153067 236452 4833 -137465 53766
7476 -117211 -258857 37661 -242655 101921 18681 -91868 -144080 53717 -386812 -306056 148250
7464 -105834 -89566 279033 -152679 7561 119447 -91813 187554 260796 -48806 -96724 -86853
7453 -86853 103619 -55362 116777 116710 -193828 19614 -132889 261882 105240 58234 -180146
7441 36167 109 150703 124866 74857 65890 -125434 9912 -96137 -260254 -11939 -106038 -56977
7429 -56977 263049 -25366 98047 318373 2119 -48666 65529 36339 102907 -301414 -95345
7417 98720 -100999 -442609 -126767 110341 81870 247575 -78027 -68889 61488 18324 -161666
7405 173385 376323 222893 114251 -5370 -199166 -148379 -111077 -33756 76703 -66951 -66525
7394 -66525 -5160 46027 -50249 123062 -225997 3325 116884 -364588 63587 206593 -104397
7382 -136726 -3177 -125320 -287960 -133164 85437 175290 160631 -31946 219491 31507 -77545
7370 223139 -136940 -224904 15613 164662 -136179 61492 -302490 -285655 -69592 34727 -160411
7358 -18513 -85421 211769 -127010 97638 -344249 9833 -43951 58856 40191 -156791 17793
7346 214234 -57055 -119092 -174540 3628 -56361 106577 -123052 52583 -132015 38696 213568
7335 213568 371695 -45610 89425 -130584 27266 289617 -21262 -98078 152972 -223312 -258683
7324 -258683 126146 -24511 104273 -202322 -61398 -190984 -83038 53605 -229931 -80722 -323299
7313 -323299 127385 -77982 -30233 91719 -236424 -21061 -385441 30985 180711 -21104 -485235
7302 -485235 -249563 -174888 -19467 95940 -97862 91117 181657 -151400 -124673 -27499 131753
7290 297385 -319841 -167013 -32921 -5000 -69746 226210 -15010 -189465 -182928 346464 19624
7278 -69132 141544 44651 -318209 173168 70992 -265947 -100022 -187452 -127318 129227 100680
7267 100680 -124424 -9282 286499 -229199 -87832 -138762 97998 38376 -185623 1769 -88848
7255 238058 -223553 -72887 116167 65162 -193109 -237083 167800 -155225 20545 68120 203953
7244 203953 -76083 57257 -84930 -265745 306848 223324 -67131 -238353 130040 121179 -117364
7232 -321133 -143684 -28620 -3250 -203141 77673 -104567 61308 30712 -248800 51391 -79448
7220 -218265 -94620 42698 224935 -257189 248613 105703 -153112 284242 182944 -21604
7209 -176352 -227805 -66584 5990 135200 3215 116306 -5649 -55204 275077 -215117 -111733
7198 -111733 15483 70768 -4472 218652 -191038 -56493 278232 138567 32476 43832 68985
7187 68985 -107776 272784 -298161 -365056 -252368 -62315 37155 -140444 12222 -72895 -148495
7176 -148495 -45194 -215542 -336846 -8230 -208057 223031 -38317 -4155 124744 -56269 104986
7164 3918 -202965 101474 17691 -15366 -13828 42109 -314932 -171292 -135862 -183026 -83429
7152 -38459 -346908 -25817 57900 74953 -67357 -119496 -170476 162264 -190574 -109848 -9062
7140 10204 105506 -86516 -70818 233262 -108438 -27446 52436 -220814 113027 -332537 129427
7128 66220 -88576 38146 -250712 -19427 215286 -28980 -135137 258183 -10520 -12979 298166
7116 78850 -328668 -74316 -35867 -259232 -152878 92347 94161 -573380 43549 -596 101763
7104 -407126 137519 -18753 431200 -226621 -95533 -16958 79809 -519 -135695 59947 3205
7092 200926 -154653 147399 -285932 -142004 15163 153917 100505 -124557 84956 -30923
7081 -45282 329650 -115650 471723 -41470 -79608 70196 -32996 -71694 -183033 -12241 -166153
7070 -166153 -134104 148388 -160124 208402 120761 -153434 189345 -233469 -142351 -48783
7059 -255027 23203 159483 111994 -129109 264016 194772 -114351 34064 -101543 -57184 -105592
7048 -105592 -72826 107181 -149795 -282331 -225819 -1739 89783 175954 -160212 108527 187111
7037 187111 133362 -189977 141845 319715 -112076 -24290 59920 283797 243624 95621 -338443
7025 132296 -25123 -315605 114084 -123234 109799 -259897 120961 258921 -115267 -29809
7014 -87267 168350 -192000 51389 -48443 -43469 185545 14819 73979 26923 -133306 -47569
7002 -145175 180283 -317310 52158 -66736 -79218 150146 67195 -180160 -200646 -93671 -18976
6990 -220020 -99837 -25232 -60692 -44295 65643 -26028 -95301 4921 -27717 70855 329134 99104
6977 91874 105274 -15656 -34992 -140570 -141958 -145558 78489 -268740 -119705 53670 -122828
6965 242971 -244602 181262 68761 251128 189150 148246 -165593 -318525 -245034 -42546 63270
6953 -130441 156699 -142053 1332 -276141 -88523 213557 -130432 -216003 -252502 -11622 -23575
6942 -23575 26341 -56387 -303625 -76181 158624 -135214 -232799 22903 -69908 298021 -137574
6930 28710 -313090 61465 -9835 -474948 71334 -158463 330061 -119662 -152499 -37216 250940
6918 47287 18091 -33441 464055 -340788 22346 -62673 -73585 202164 -88637 -193934 81126
6906 107702 31733 84788 7302 -363350 -64854 18394 61837 217745 -295957 108633 362732
6895 362732 -56498 425862 -123646 -25892 -125372 77327 104636 -238466 -69474 -54102 -131699
6884 -131699 -118975 150143 -90252 -123218 31419 132150 58444 -57474 367070 296960 -66921
6872 279275 -199276 -78131 46800 -325219 32467 33978 175537 -176190 2197 2109 140378 -143619
6859 -207870 -117198 -70976 -90583 -40150 -855 -192836 -368992 3148 -135710 -87069 -139107 -36315
6846 151797 67441 33380 -190535 -22029 -108516 111475 -160896 114114 -99713 15841 -106670
6834 74046 -153516 -68598 28833 72537 161530 224171 -358839 54829 63636 20078 -35210 47154
6821 19775 -20862 -368577 152749 -79681 207805 245858 -86025 129017 92044 82969 -219343
6809 -18531 -9163 -202039 44690 66262 -108613 -176949 115215 37206 -23630 1304 -131210
6797 109092 -25769 -164916 371335 259553 -156874 730 -83155 13557 44085 -204384 7249
6785 -3427 -177572 -220536 49036 -423099 -104846 280792 -136187 -343753 -378159 298778 -87713
6773 113184 -72243 170026 -246407 -151609 -312969 170292 -116503 -103656 -129165 78764 -14991
6761 8402 -283525 232818 -256566 437127 297003 -307483 2424 -135605 -212045 -31144 -127215
6750 -127215 290766 -76360 -327918 -16204 272678 187700 121556 69140 -103929 4024 -51543
6738 -21771 -233588 -31465 186122 39665 -155386 206045 -208737 -235757 218360 -17261 -73119
6727 -73119 34739 -46598 163953 20483 92966 -257085 -72338 174802 -52003 18408 136730
6716 136730 312280 7461 169907 148651 -39661 -62684 322928 -254517 77561 -77367 -152885
6705 -152885 -374599 -67152 -328425 -43260 51591 349815 -26148 -269494 35599 54047 -403361
6693 -100790 136892 443870 -194102 -167345 -95741 -356621 32641 245096 -230116 -166492
6683 -166492 146331 -50104 -191903 -139954 -8598 -362967 -64605 -200772 18710 -75451 -219382
6672 -219382 92744 -207476 -123367 296983 -184307 55555 -297841 -13860 296734 38731 33110
6661 33110 51726 103498 -123880 -63512 -172098 32736 64328 94378 -260182 -42314 20108
6649 -366463 -148552 -51771 -372770 -130470 169072 4741 355714 -403820 46003 -85780 -364677
6638 -364677 -93952 69107 21702 -14811 -90314 -155739 -177917 243163 -96166 -97283 146836
6626 -212967 -219383 -160027 -262135 135615 102419 -31782 171952 -65397 11976 -122881 -105133
6615 -105133 -136002 -317745 -319125 48889 -239161 69579 401200 443335 -7372 -101307 -92598 207291
6602 -89936 7711 273386 197189 -27440 -87756 -172303 58716 -56440 21549 -138109 74573 193599
6590 193599 78548 -121928 -141846 -305175 540 180612 -272407 350592 225944 148896 -13988
6578 -9434 -84338 199273 83849 -18662 -58817 -381977 -154513 339793 -128548 -422073 373468
6566 107096 135601 89292 144690 268842 12553 145995 40171 -169443 174326 -58057 -234245
6555 -234245 117568 47637 180453 -238922 -136520 -53623 156630 116117 -36044 -44133 -79665
6544 -79665 -52891 -396484 -262454 8198 -50368 -128228 16699 -67532 -53440 165976 -128401
6532 443432 30129 260564 -42754 -127702 -215223 145223 -158814 -227226 37705 21888 115155
6521 115155 -52657 -263753 -375765 298333 78937 42929 -83664 62229 132036 37986 84981
6510 84981 -77556 -187088 115154 15345 -178810 146148 -80006 -360055 -200724 -83855 7096
6498 -20216 90098 131047 -207772 158667 -205224 104515 -14109 -371702 174956 -59838 -96747
6487 -96747 -177120 -7418 -104426 -6818 150051 -98229 -126701 -243648 -194246 -98537 319010 193416
6475 193416 -113324 273504 -185911 -375138 -401909 50852 -14208 -109244 -113691 204335 -200182
6463 82062 93484 -198136 -95331 3156 -123888 115550 -41931 3053 -87220 -89289 37091 27720
6451 27720 -330764 -5675 126281 -184787 -34467 -172515 -13818 -45474 32856 383195 167023
6439 89266 -58647 167488 -276334 -182839 86658 -327852 -107849 -105359 52364 38619 9899
6427 5094 -75022 184716 -230808 -84369 -418918 -26149 -119544 90833 -83007 -9068 -264285
6416 -264285 -258226 216003 122366 227742 82221 -83447 -48999 -7208 56635 -150769 -292453
6405 -292453 437477 -13543 -190621 36479 189689 96151 305188 8267 225520 253453 31915
6393 -124583 217610 354089 -46628 261350 150883 -215776 -111753 -482358 32331 200778
6383 200778 -339227 -136249 97668 -450074 35 -38719 -136687 -46076 -45089 347706 -94612 -10825
6370 -239100 153619 121452 130011 242103 124195 122901 92774 -175228 -148659 -243848 -201779
6359 -201779 -66619 -87984 39226 -196229 -11354 -105729 -241973 172895 87381 61073 82955
6348 82955 -181990 -124365 -75339 -192342 -53739 31006 56518 144746 -44667 -232623 165249
6336 47980 157788 234780 13774 5340 90119 11505 64242 -73137 -111122 -244759 -257020 -161311
6324 -161311 26444 17689 -227151 231144 5242 375674 -83011 -51158 18131 101901 127664
6313 127664 84813 58955 143711 -83650 27978 307656 -359723 25950 320369 194362 197267
6302 197267 -462848 23980 -30407 46685 -96255 126502 87491 -242151 -207699 172098 -215475
6290 19342 -206797 -269750 88229 137734 -328325 -142565 84100 -107903 147619 -26813 71684
6278 -178494 211500 -65962 -90990 13313 -113841 -106772 -31305 -23288 -202511 -58713 -47361
6267 -47361 -76153 828 71795 238683 -86706 282893 -159066 169568 24710 -173229 203540
6255 262062 -173412 12736 -53709 174606 -298850 -43798 -217244 168586 -296220 177287
6244 42664 -631 -24811 204152 351289 -190857 60638 46345 40872 168019 -248707 -132989
6233 -132989 -32099 -102250 -10123 16998 241832 207787 192580 -101559 -139513 115962 167233
6222 167233 -7604 44626 -220299 164285 237694 88318 76331 34835 58479 253688 -70537
6210 -97143 -129236 220142 -35102 -233206 -270598 83051 121105 164969 3116 23982 172395
6199 172395 57151 194573 200986 245393 117880 -89464 -32434 -240931 148598 -75701 -160355
6188 -160355 244653 -366791 61019 269671 -81342 -224342 -135981 85850 -25667 59254 -15674
6176 -7173 -33753 -59964 -212897 10676 -301426 -175502 93189 -79704 -299812 -134394 -109550
6165 -109550 -439899 71441 -324379 -7713 127203 196507 68122 71504 425788 -128050 -8522
6153 246180 -47282 -122283 173263 -361100 146940 52551 220858 3196 94730 6969 219145
6142 219145 192493 -300408 -125153 73216 -82901 82737 22670 48109 -28737 68395 -87432
6130 95805 178533 322960 -88465 9631 159067 -148339 -90813 -407286 23003 87547 -102181
6118 -135431 -36760 -10595 304455 -79274 -191866 -70888 80953 13312 -93589 -189642 7223
6106 -184465 52543 -3207 -138493 -247163 -58432 -205018 130085 -76332 13001 46037 -106931
6094 230330 43689 -75715 240418 10317 58060 83386 34030 72313 -330510 -41354 -205583
6083 -205583 271957 -10669 -269033 -252540 39385 -208512 -9503 72574 124015 -229788 -143000
6072 -143000 -16320 -89192 -44433 -116064 67385 62491 -132432 -66956 -43957 -82111 -213872
6061 -213872 129500 -177787 116415 -23913 -197434 195137 171636 56795 -300011 -60964
6050 -158235 126560 136436 -35639 -189485 60084 30323 -215542 366717 49839 63439 -388705
6038 -2420 -110493 279982 -48023 -101374 -77477 -202433 -195801 175959 -179389 -162248 -195288
6027 -195288 -106063 -14208 -111428 88144 -200107 57203 85394 -156604 -2295 -241276 82456
6015 10874 -67457 -71765 139549 157771 269989 -20422 -33288 -8149 -117773 -58964 -91402 -44766
6002 -516850 116688 -87422 -53089 -63041 248134 -188532 -6983 214843 -380949 52890 -74074
5990 -150209 -327191 -401879 -157158 72586 -97736 -174883 43898 -40777 -69684 -12923 245970
5978 59232 187109 74024 210193 -168034 -111473 -425212 -360698 108279 -178641 14713 360026
5967 360026 240406 -167917 -26932 -327402 -17340 41695 43953 191532 29629 -317575 -182466
5956 -182466 -137116 315496 149800 1410 -15656 64737 -131351 -68529 -82919 161302 -113565
5944 -203746 17194 -64463 -41876 22654 -169913 -2845 -35652 76150 -12762 -31683 -100828 -62459
5932 -62459 77514 -77495 67458 3100 -97391 -99465 60679 -38418 -338606 290997 411532 -66094
5919 -355375 -265753 213933 136116 289004 -531 16692 -207862 -85101 209290 -19190 -19020 45014
5906 6574 10367 88487 -95822 127611 127909 121362 -48956 -56949 -331981 -176838 20964 162668
5894 162668 147284 299551 55814 -33138 248473 177490 -5797 83248 20853 -19187 291989
5882 -21195 -57563 93663 -152163 -162114 -32106 -3919 -131941 181784 -91312 -79892 -48829 -29354
5870 -29354 30671 -169758 74649 -70806 272498 119240 95616 -118541 -93281 -2016 -50067
5859 -50067 -111486 -177862 56251 -220712 -277741 -113825 24818 -72767 14717 -267708 40953
5847 -198321 89127 -28732 14859 40401 -195615 -228076 357161 -234058 148753 122919 451234
5836 451234 -73954 -15453 61942 122811 166349 182747 157301 -39352 -201290 87721 -62030
5824 66478 262065 221333 527 313751 -247842 -152705 -9880 438396 43551 139204 141566 288652
5812 288652 -41690 62763 62326 161867 204750 -25051 347 19460 59631 -101435 -166241 -336 -327996
5799 -327996 -16620 74156 -294029 190256 -10954 273544 323075 287514 36771 92931 -143405
5787 347167 25641 -44562 177880 867 -89345 -317330 -71309 56742 176167 -12799 204639
5775 151841 20932 -163723 -335390 -201034 -173652 -122439 235850 87996 -23959 82610 212267
5764 212267 21360 -229158 162366 -31371 -177222 -162786 -312 -82515 -247631 -117708 -228079
5753 -228079 -75104 -326406 152418 31516 -18967 -264824 272836 901 -61104 -12994 -381723
5742 -381723 48983 -257982 -317727 6676 -296658 96063 -168897 134720 -66639 -233236 -455830
5731 -455830 166683 51777 -50601 -95176 -21556 -48656 -279971 173683 68292 283410 204886
5720 204886 308933 6329 -239202 336242 -128570 -28552 -21555 -175638 17596 -191006 143719
5708 347846 -87470 174955 -142150 100868 195189 -295698 -184277 -13902 -129742 70515
5697 392836 -292756 -25656 -74286 20042 280093 -5402 -57527 178261 195287 184270 36286
5685 61586 11039 -104600 -77857 -280127 -9169 -214827 250167 -142956 52471 -126502 -234315
5674 -234315 -277063 -281182 -95034 -60170 182104 179694 158962 355300 313072 290392 -131516
5662 307910 119030 115160 -49816 155782 136631 -242995 -106343 158988 199475 227003 -142992
5650 305545 243356 -189634 248389 -436890 40333 -100712 144378 257403 24168 -296320
5639 75907 179227 -248524 -168712 -128529 91485 -106312 -221913 243060 10381 222170 -83758
5627 -75362 -53082 179456 -148147 -133854 108732 253402 -197322 11439 -70601 35189 -288598
5615 -52738 -70791 59147 91937 292989 -120664 -39553 379883 -311015 -24396 239015 198696
5604 198696 73136 38587 40907 -146906 -95981 -177754 29835 18455 358910 -150461 159046
5592 14568 -170175 18357 31403 240773 99489 -140705 71587 163014 -184450 10348 -16438
5580 310971 54377 -93345 -40909 -16186 -41084 115643 -151744 -349110 -282359 -287878 -27358
5568 262511 -38199 -36950 -11574 34341 -292593 143177 10995 -163702 -70243 -177236 161640
5556 283855 100088 43098 106861 27049 224595 18319 520371 -20300 -55452 -208023 -183990
5545 -183990 49702 299425 -80124 -430932 -147181 -421782 -32235 22773 -14621 1798 -202816
5533 -269601 135588 17939 -187476 -35413 -222042 166149 17770 136551 -216778 -177631
5523 -177631 250104 -61980 98507 -186638 -74623 -114660 -2952 59055 182660 115630 -316139
5511 68209 50420 65131 106037 143043 31492 3120 -42971 -233192 109080 -62030 -47625 9854
5498 160166 68470 -173573 -107524 133067 -33235 122302 -78153 -12833 71910 -104336 -152016
5487 -152016 -133391 -47757 -93411 -186467 -266981 262023 97934 266833 32925 6529 -89505
5475 31165 24889 -14929 -164965 -228166 -157117 121255 388034 -14607 -3245 134268 -94839
5463 -99865 -132421 109368 -41741 160479 -186874 27327 -299554 44644 101164 15654 79742
5452 79742 -85786 289780 -492 -111514 -273193 -36559 -58730 -29979 -72078 85268 280928
5441 280928 115905 174135 9159 -191180 -82852 -241040 -113879 -301703 253091 89923 92493
5430 92493 -139814 155528 104488 -92885 59555 232436 264307 -134171 295697 128285 -1343
5418 -84643 -196261 -277408 178953 -54314 42581 -204790 -272606 -163517 11084 -42216 -119214
5407 -119214 -88631 -372264 100697 144816 -88327 -118661 101233 76767 -251309 337726 -324976
5395 243577 222298 -21504 -265400 -137246 515847 -118877 -115491 -153897 16106 49701 -82286
5383 26652 -242597 6573 -131057 -276823 -13485 267525 -152753 104078 -294907 -73771 21458
5371 48470 263545 192811 -410222 -72454 65981 21262 3191 -294403 178164 107447 -178057
5359 -163633 84193 -45097 -308571 -140563 239499 -141815 297431 -45606 19694 110851 -7376
5347 -232880 368322 169923 174408 75173 75764 -90712 -16541 88245 -89737 229455 27268 -89691
5334 288654 -164087 29527 -116207 353771 -74562 -39819 -250972 -224804 -76865 121899 74129
5323 74129 33263 100804 48734 -83045 -65982 5287 -125132 -155419 131380 -241200 -103669
5311 -52353 -118546 -2637 241490 -51584 -123533 62806 -206774 -19637 62172 209980 -51579
5299 174024 210870 156234 -86394 -18801 -196927 -182859 334672 -331640 146701 34180 -60525
5287 -79602 177854 -38400 -217940 -126236 -119585 40726 30438 -5590 -247529 28500 -20686 53257
5274 110701 71359 -17573 45379 246032 25619 59927 -66999 -95502 101317 230627 30487
5262 75145 -51317 94197 48661 -304906 -384782 149222 66474 -24906 -301197 17323 -105430
5250 -163807 259938 65592 -68919 -96532 -202615 373791 29001 98636 -26122 209593 434145
5239 434145 -87071 -105076 79581 -107969 73768 50783 -191904 -72736 183629 -16647 -113701
5228 -113701 96028 216913 -57933 40680 129757 -143097 71619 327131 151092 -245353 -357559
5217 -357559 -187327 44823 -57895 -14934 54113 272330 -35439 -194878 284251 -73211 -23391
5205 181669 65671 -399527 355104 -48775 -160028 218293 -154799 -181343 -21520 46236 143299
5194 143299 -114967 78764 232834 286575 -186113 -44460 111111 219965 -102489 64629
5183 -31811 105076 372433 44910 263855 -13723 35914 63774 -98951 45522 125104 -29959
5171 4897 -81385 -46439 -346403 -65887 -154557 -253161 108451 7589 -173558 42427 234983
5160 234983 -34668 158187 20574 269885 -128378 79284 248046 184618 -147063 -360711
5150 -360711 96562 -139856 -91108 366347 29573 -304083 -29381 -170340 -469827 -67887 244965
5138 15140 -77853 43434 20632 -245941 -112644 -68507 -276599 153696 -52360 195123 17708
5126 -189913 51521 16912 -161055 36332 270241 -208995 -195833 -269650 216451 20721 -210307
5114 -45749 -55813 -367101 91046 14429 -175356 112634 -118939 -63446 -290699 69589 309296
5103 309296 17661 -84045 -174562 273389 -64625 -44948 -76477 -32151 273486 288225 23896
5091 -19709 33345 -203627 -117851 125518 119303 -122998 -199962 59208 -300352 -79228 42312
5079 119185 46792 -70753 109674 261619 71982 -234950 34877 -114424 -106093 117330 223460
5068 223460 -195317 89715 -139140 -144149 -193878 15181 -38083 -170073 105350 114711 218859
5057 218859 -14437 -211074 329181 -125766 7976 -54848 -155973 299099 117690 -33469 38411
5045 116289 -51532 -114891 -102723 -107428 108164 332503 -182305 81020 -15401 -27225 -110782
5034 -110782 98949 7744 97146 -179616 172699 -160803 7878 -40631 -73979 -182345 448883
5022 92133 158103 -147618 -1868 54631 134259 378654 -326604 -49176 -154910 98206 -100814
5010 136531 81222 222440 63905 90762 -118275 -65040 73247 -37975 1227 -71132 -40798
4999 -40798 -138245 106157 -59349 -304300 215394 220841 107819 35256 -22031 37403 282989
4988 282989 -34504 104543 101136 19968 275189 40165 -96904 -3840 -55360 15557 14611 -333447
4975 -218405 -133855 -129982 96801 -113776 -28624 40194 -17808 125591 292567 -197757 104847
4963 -132498 247069 144807 112619 293825 -57526 107867 -28391 256402 189193 -11240 156917
4951 81804 235267 -172974 -249849 -36763 -112173 9926 231321 -252904 214285 24135 223238
4940 223238 8124 -266055 -307576 -64760 181856 168250 134267 300032 77993 -44076 98649
4928 152102 -228068 139295 39696 69904 63267 28904 185043 57794 -3767 -210539 -139483
4917 -139483 -37626 30670 194869 -266737 -258764 221873 -123262 -1636 79491 109077 -86144
4905 -171674 -160172 142200 -354070 42766 -6077 193342 -202639 207563 135667 229043 -86410
4893 77116 -270361 -93481 -61394 46639 -95201 61343 -180689 66212 311641 -272858 -172824
4882 -172824 -149501 214152 -65937 40502 -77552 170615 -194544 5221 169549 140392 -67458
4870 -126830 149388 -112709 -69352 68959 -19206 -178149 19928 -301559 -157826 -106070 30665
4858 35026 -104082 182287 90602 -112910 -166006 278631 172013 -24449 -384954 -240871
4848 -240871 34952 179621 -219891 -64778 -74179 326553 48270 199145 -109291 -33461 302465
4836 -119930 124817 -71379 186765 102682 -50224 -212826 29980 -178970 232280 240930 337428
4825 337428 139771 -194681 85314 -169776 60367 -41375 -115910 219507 133999 -1292 50433
4813 11044 -215803 -9793 -174040 185131 128842 66494 141365 -89567 31688 -86349 -149290
4802 -149290 255515 68746 -132264 139981 -150954 109636 402078 -173823 -215926 -150397
4792 -150397 69147 42566 -173857 368171 -53971 139493 -199042 -105391 13931 -132164 120620
4780 -89087 30555 -111476 -169600 -270237 22584 -177709 19190 -254806 47728 -158159 143318
4768 282573 -98595 -110481 -151727 -374233 -269576 -22355 157334 -2719 6409 166969 -14701
4756 33525 -133474 81462 83852 -83405 234275 282970 295835 -461554 -72759 -92635 -347636
4745 -347636 -87522 10851 -229227 14392 -152237 109787 189350 7240 119957 196698 -166507
4733 -83480 -55612 -118973 -155948 336109 -162165 -107003 -223845 129084 69438 -140240 27031
4721 -119420 369734 158995 -8062 -40016 -22419 -141047 -155479 -141044 95043 166794 36904
4709 -24365 122611 -240504 161432 -18627 14317 53609 56406 95206 2833 -180202 -44853
4697 92601 -204877 211211 -105700 139937 -88320 134101 210181 117866 -21398 20364 11454
4686 11454 -327883 -202708 82694 118555 108290 132701 50643 -112831 2154 121022 112785
4675 112785 7313 -83441 253718 152980 132906 -271089 -65293 190156 -187705 -66660 -60361
4664 -60361 74608 -17480 337394 266295 164498 -127507 101582 71093 79784 24674 283382
4653 283382 189013 132674 -158528 -139160 -101231 136106 -190896 226014 -23678 -114920 39125
4641 -160304 47310 -168523 73152 227306 -21909 48305 -142385 -38203 -14940 51041 -161404
4629 38512 10234 28592 -175936 99724 226723 -310804 -133754 -48911 144579 159974 -1756
4617 102953 269061 -52546 53699 -193246 -128483 -90156 -200118 215078 -133952 164208
4606 145535 -366229 68002 -160930 225023 -57812 207940 -172320 68568 31013 -372434
4595 98427 10147 -203071 92792 -153324 -90435 142134 41732 149278 -168112 -37023 87947
4583 166684 -59557 -211557 -331254 182341 -30815 246534 151047 -37817 -49289 197030 231800
4572 231800 -349337 48177 -169864 96143 44970 -97126 175957 62311 -110309 343112 -131075
4560 -199550 -124479 99767 -153400 257565 -283508 112067 -86661 -174058 123610 -151222
4549 -66727 81607 213544 -7326 -35916 -179473 -195463 -245088 -86224 23558 -203577 -146190
4538 -146190 -145183 241798 102214 -417 20048 97042 193962 421933 -39106 44172 -69566 161020
4525 56798 232812 -113278 179847 -47148 -31360 181707 -107893 -152665 203290 -14219 -323725
4514 -323725 -26512 237794 196608 -228593 60943 -51932 -126353 -284323 -25768 -120142 -28169
4502 -182550 319617 -87723 176957 -278076 -4471 -187614 -158477 -15943 55707 -104838 -163037
$$ [...]
##END NTUPLES=NMR SPECTRUM
##END=
