
##TITLE=UV1155_M4-1010-1000_6301843_UsI1x6hxBm
##JCAMPDX= 6.0         $$ Bruker NMR JCAMP-DX V2.0
##DATA TYPE= NMR SPECTRUM
##DATA CLASS= NTUPLES
##ORIGIN= BRUKER
##OWNER= Administrator
$$ 1.72 TOPSPIN		Version 2.1
$$ 2012-06-05 23:14:14.062 -0500  Administrator@TOPSPIN
$$ Compression mode = diff/dup
##.OBSERVE FREQUENCY= 400.13188235
##.OBSERVE NUCLEUS= ^1H
##.ACQUISITION MODE= SIMULTANEOUS (DQD)
##.ACQUISITION SCHEME= undefined
##.AVERAGES= 8
##.DIGITISER RES= 22
##SPECTROMETER/DATA SYSTEM= spect
##.PULSE SEQUENCE= zg30
##.SOLVENT NAME= COFFEE_meoh
##.SHIFT REFERENCE= INTERNAL, COFFEE_meoh, 1, 14.98061
##AUDIT TRAIL= $$ (NUMBER, WHEN, WHO, WHERE, PROCESS, VERSION, WHAT)
$$ ##TITLE= Audit trail, TOPSPIN		Version 2.1
$$ ##JCAMPDX= 5.01
$$ ##ORIGIN= Bruker BioSpin GmbH
$$ ##OWNER= Administrator
$$ $$ C:\Bruker\TOPSPIN/data/COFFEE/nmr/UV1155_M4-1010-1000_6301843_UsI1x6hxBm/10/pdata/1/auditp.txt
$$ ##AUDIT TRAIL=  $$ (NUMBER, WHEN, WHO, WHERE, PROCESS, VERSION, WHAT)
(   1,<2012-06-05 23:14:06.531 -0500>,<Administrator>,<TOPSPIN>,<go>,<TOPSPIN 2.1>,
      <created by zg
	started at 2012-06-05 23:13:00.015 -0500,
	POWCHK enabled, PULCHK disabled,
       configuration hash MD5:
       D5 CA 7A 23 FE 6B EE E2 50 67 74 61 24 F7 5E 3B
       data hash MD5: 64K
       BD AE 1C 01 83 20 A7 3F DC D5 9C 79 91 E4 E4 61>)
(   2,<2012-06-05 23:14:09.750 -0500>,<Administrator>,<TOPSPIN>,<proc1d>,<TOPSPIN 2.1>,
      <Start of raw data processing
       efp LB = 0 FT_mod = 6 PKNL = 1 PHC0 = 0 PHC1 = 0 SI = 32K 
       data hash MD5: 32K
       40 D9 D7 22 27 68 45 31 B4 89 ED 7E 5E 08 4C 41>)
(   3,<2012-06-05 23:14:10.125 -0500>,<Administrator>,<TOPSPIN>,<proc1d>,<TOPSPIN 2.1>,
      <pk PHC0 = 211.3605 PHC1 = 0 
       data hash MD5: 32K
       59 9F 5F FD 26 C1 F2 1B 5B E3 C1 37 A8 A3 88 C5>)
(   4,<2012-06-05 23:14:10.203 -0500>,<Administrator>,<TOPSPIN>,<proc1d>,<TOPSPIN 2.1>,
      <abs ABSG = 1 
       data hash MD5: 32K
       A3 78 A7 F0 CD FD 76 28 9B A4 EB 45 E5 B7 C0 08>)
(   5,<2012-06-05 23:14:10.234 -0500>,<Administrator>,<TOPSPIN>,<proc1d>,<TOPSPIN 2.1>,
      <abs ABSG = 2 
       data hash MD5: 32K
       42 19 54 F5 1D 6F 28 F7 9A 4D B2 0B 35 71 1C 94>)
(   6,<2012-06-05 23:14:10.250 -0500>,<Administrator>,<TOPSPIN>,<proc1d>,<TOPSPIN 2.1>,
      <abs ABSG = 3 
       data hash MD5: 32K
       BD E5 F7 78 B6 1D 48 E9 02 09 08 29 E8 00 76 97>)
(   7,<2012-06-05 23:14:10.296 -0500>,<Administrator>,<TOPSPIN>,<proc1d>,<TOPSPIN 2.1>,
      <abs ABSG = 4 
       data hash MD5: 32K
       0F E5 82 11 E2 6D 23 A8 74 72 39 7F 83 34 FB 94>)
(   8,<2012-06-05 23:14:10.312 -0500>,<Administrator>,<TOPSPIN>,<proc1d>,<TOPSPIN 2.1>,
      <abs ABSG = 5 
       data hash MD5: 32K
       F3 7D 4C EF 88 5B B8 0E 6B 1A B2 34 19 A8 35 A2>)
$$ ##END=
$$ 
$$ $$ hash MD5
$$ $$ 24 BE 3A 6D 9D 11 76 9C A3 EA 71 A9 7B E4 FD 76
##$RELAX= 
##$RELAX= 
##$RELAX= 
##$RELAX= 
##$RELAX= 
##$RELAX= 
##$RELAX= 
$$ Bruker specific parameters
$$ --------------------------
$$ [...]
150 150 150 150 150 150 150 150
##$TP07= 0
##$TPNAME0= <>
##$TPNAME1= <>
##$TPNAME2= <>
##$TPNAME3= <>
##$TPNAME4= <>
##$TPNAME5= <>
##$TPNAME6= <>
##$TPNAME7= <>
##$TPOAL= (0..7)
0.5 0.5 0.5 0.5 0.5 0.5 0.5 0.5
##$TPOFFS= (0..7)
0 0 0 0 0 0 0 0
##$TUNHIN= 0
##$TUNHOUT= 0
##$TUNXOUT= 0
##$USERA1= <user>
##$USERA2= <user>
##$USERA3= <user>
##$USERA4= <user>
##$USERA5= <user>
##$V9= 5
##$VALIST= <valist>
##$VCLIST= <CCCCCCCCCCCCCCC>
##$VD= 0
##$VDLIST= <DDDDDDDDDDDDDDD>
##$VPLIST= <PPPPPPPPPPPPPPP>
##$VTLIST= <TTTTTTTTTTTTTTT>
##$WBST= 2048
##$WBSW= 25
##$XGAIN= (0..3)
0 0 0 0
##$XL= 0
##$YL= 0
##$YMAX_a= 530546
##$YMIN_a= -640393
##$ZGOPTNS= <>
##$ZL1= 120
##$ZL2= 120
##$ZL3= 120
##$ZL4= 120
##$ABSF1= 14.98061
##$ABSF2= -5.57192
##$ABSG= 5
##$ABSL= 3
##$ALPHA= 0
##$AQORDER= 0
##$ASSFAC= 0
##$ASSFACI= 0
##$ASSFACX= 0
##$ASSWID= 0
##$AUNMP= <proc_prof1d_extract_pilot.lims>
##$AXLEFT= 0
##$AXNAME= <>
##$AXNUC= <1H>
##$AXRIGHT= 0
##$AXTYPE= 0
##$AXUNIT= <>
##$AZFE= 0.1
##$AZFW= 0.1
##$BCFW= 0
##$BC_mod= 0
##$BYTORDP= 0
##$COROFFS= 0
##$CY= 15
##$DATMOD= 1
##$DC= 0
##$DFILT= <>
##$DTYPP= 0
##$F1P= 0
##$F2P= 0
##$FCOR= 0.5
##$FTSIZE= 32768
##$FT_mod= 6
##$GAMMA= 0
##$GB= 0
##$INTBC= 1
##$INTSCL= 1
##$ISEN= 128
##$LB= 0
##$LEV0= 0
##$LPBIN= 0
##$MAXI= 10000
##$MC2= 0
##$MEAN= 0
##$ME_mod= 0
##$MI= 0
##$NCOEF= 0
##$NC_proc= -8
##$NLEV= 6
##$NOISF1= 0
##$NOISF2= 0
##$NSP= 0
##$NTH_PI= 0
##$NZP= 0
##$OFFSET= 14.98061
##$PC= 1
##$PHC0= 211.3605
##$PHC1= 0
##$PH_mod= 1
##$PKNL= yes
##$PPARMOD= 0
##$PPDIAG= 0
##$PPIPTYP= 0
##$PPMPNUM= 2147483647
##$PPRESOL= 1
##$PSCAL= 4
##$PSIGN= 0
##$PYNMP= <proc.py>
##$REVERSE= no
##$SF= 400.13
##$SI= 32768
##$SIGF1= 0
##$SIGF2= 0
##$SINO= 400
##$SIOLD= 32768
##$SPECTYP= <>
##$SREGLST= <1H.CDCl3>
##$SSB= 0
##$STSI= 32768
##$STSR= 0
##$SW_p= 8223.68421052632
##$SYMM= 0
##$S_DEV= 0
##$TDeff= 65536
##$TDoff= 0
##$TI= <>
##$TILT= no
##$TM1= 0
##$TM2= 0
##$TOPLEV= 0
##$USERP1= <user>
##$USERP2= <user>
##$USERP3= <user>
##$USERP4= <user>
##$USERP5= <user>
##$WDW= 1
##$XDIM= 32768
##$YMAX_p= 456564416
##$YMIN_p= -663124
##$CURPLOT= <Network HP LaserJet P1505>
##$CURPRIN= <$Network HP LaserJet P1505>
##$DFORMAT= <normdp>
##$LAYOUT= <+/1D_H.xwp>
##$LFORMAT= <normlp>
##$PFORMAT= <normpl>
##$SURQMSG= 1
$$ End of Bruker specific parameters
$$ ---------------------------------
##NTUPLES= NMR SPECTRUM
##VAR_NAME=  FREQUENCY,     SPECTRUM/REAL,   SPECTRUM/IMAG
##SYMBOL=    X,             R,               I
##VAR_TYPE=  INDEPENDENT,   DEPENDENT,       DEPENDENT
##VAR_FORM=  AFFN,          ASDF,            ASDF
##VAR_DIM=   32768,         32768,           32768
##UNITS=     HZ,            ARBITRARY UNITS, ARBITRARY UNITS
##FACTOR=    0.250966925370066, 1,           1
##FIRST=     8223.43324360095, -210460,      -107313
##LAST=      0,             -80012,          -33616
##MIN=       0,             -663124,         0
##MAX=       8223.43324360095, 456564416,    0
$$ Real data points
##PAGE= N=1
##DATA TABLE= (X++(R..R)), XYDATA
$$ [...]
23832 90989 204782 -133443 -95633 -25748 -23873 166729 -86358 -159264 -92864 234457 195424
23821 195424 -118136 -160888 -212466 -178196 184012 145551 -133447 336870 -180569 -160249
23811 -160249 -194070 -237743 60657 154081 88035 248688 -73238 70387 -112126 -202102 276843
23799 -174591 293971 -28804 -40801 -335500 -172823 18609 192304 64705 -9625 314464 129907
23787 -380056 145913 186127 154627 137202 -156819 -156539 116678 68783 121989 -121164 59231
23775 112360 25486 -412901 -111494 59932 60493 218686 126727 14873 212352 119480 -97668
23763 -157740 143286 -129917 -254293 201834 -61696 119068 -179630 -137813 -117240 230696
23752 28299 210064 -149216 -167747 23541 95178 120323 -169398 80693 292413 202846 -223166
23740 90551 -121328 -42115 -206257 -243993 137949 -240949 60130 159888 -45009 -43235 122767
23728 -62508 -125372 254085 -270686 -43278 6425 -226116 -35791 -297392 25996 -46476 382138
23716 304614 -37758 23932 114651 -135069 257329 -107186 -159986 -13675 -139875 -18052 182943
23704 419203 38054 -202678 249565 -83681 -51449 69567 -114328 -66773 -26783 -110921 -305879
23693 -305879 318231 -84145 -127879 -124239 87909 86934 134016 -214138 -48142 -239702 40375
23681 307202 -1142 138342 165551 7889 25726 -24162 -104645 32537 -84098 -5703 216503 190464
23669 190464 -83732 -31098 -194940 100898 -192022 -72562 -178412 -105811 161460 364564
23659 364564 -116753 -156649 270480 -272306 -140582 -21349 -261822 -147017 -95183 -93622
23649 -93622 232256 96909 -43896 -10227 343838 256358 -354977 -294433 204356 -22623 -261389
23638 -261389 43238 155106 -81257 -166926 171668 80360 157284 118889 129167 -55638 63265
23626 31220 -70960 -159178 332127 -130690 200212 216 49228 -210710 55029 -113813 -187650
23615 -187650 -131371 -136639 -21022 120929 273897 -355564 146954 -362061 135696 151493
23605 151493 -46549 -228428 -79918 -109794 315854 -46920 -92895 222853 57831 23356 -225695
23593 166363 -201510 -22352 -406145 225707 -10570 -122083 -247772 -156788 111118 -236696
23582 22590 238624 151359 41782 -14869 -182001 152373 -54943 325582 6708 -145028 -76872
23571 -76872 -145461 133066 102438 -284492 57462 172770 197417 -208618 74884 167186 -260638
23559 2736 40400 28351 -65994 149906 -105877 306561 -133912 64389 -263269 -147402 48507
23547 -92890 -163789 -21735 -163540 -400814 -73614 -185131 441784 -69165 -185158 -251472 -297891
23536 -297891 -181755 -18107 -128096 -167603 -12220 -245973 307473 214485 -118339 95473
23525 -118974 -305517 -93549 -63936 -137856 -247070 124338 -440080 6540 -204898 148010
23514 117612 108432 -58187 -89907 -104549 -225892 -243445 -178923 148106 -20030 -260138 -285475
23503 -285475 -84534 -498898 31104 -93484 -307624 67621 121451 -143284 10014 216951 188836
23492 188836 5223 296887 -150994 64508 331174 -178256 4842 -199739 -8703 -160064 -209004
23481 -209004 -97238 9946 37789 -9200 -2880 219281 51842 -387167 -82882 -172013 55429 203138
23469 203138 75046 -351643 116634 136608 108479 73172 -47770 -160034 158460 -133373
23458 148096 207850 84900 -227345 248975 178590 -159913 -146136 243449 131885 148414
23448 148414 -349490 -138684 -268479 101785 150616 173939 -47131 -144336 73335 450967
23438 450967 -209919 -188953 34191 30795 -219478 242226 80382 -19821 -177754 -40963 138360
23426 -23371 227643 165211 41484 -219648 -72940 6957 -386244 -353939 -301784 -49473 14094
23414 -8681 -340128 -133868 -229421 2486 117193 398810 -41435 100762 84745 190940 -4836
23402 68325 28566 121151 276638 -26551 218236 -189932 -35319 -10698 293110 45330 -260220
23390 91231 303761 132030 -68139 -20014 -404141 -269790 -182140 307845 142516 -1859 44380
23378 -340906 -46687 -49878 -22855 52131 256239 216790 29235 -82459 -109300 13718 -35382
23366 -75958 -205400 11732 174905 -38134 232831 41684 -139235 7020 96296 -11724 -290400
23355 -290400 -52947 176585 -190421 -48587 -243429 259876 37618 -60346 -199410 30190
23344 -46473 -252986 171064 -11054 -36266 94031 123749 155506 -59329 -299166 -198518 -2059
23332 31522 -26599 -89588 -32939 24514 -134938 36765 323584 -360897 49630 28847 201004
23321 201004 -123098 241524 -272897 225786 -78013 -175345 -334912 98280 -80786 -4362 65068
23309 -189630 -61914 -141651 30889 -238862 -182535 -103729 -372833 -1776 -122315 -164915 278977
23297 -211561 -213993 107083 -212228 -530152 285933 -88017 -226995 91200 55136 -115292
23286 -88397 287846 49358 -24081 -169399 72798 443667 -122458 -31228 -399423 -27635 -53165
23275 -53165 123109 -308305 -282622 -19384 146099 86265 -125390 -18035 -123590 123029
23264 95931 290633 -231105 -69124 22472 -109153 288647 420353 12841 -208405 99093
23253 -251706 66471 -34079 52629 81648 -323724 -110223 -220905 -47190 125466 130561 146047
23242 146047 9385 -125398 -155945 89716 -170476 -7001 6387 161555 296415 -100719 19013
23230 185502 53910 242203 -267283 -193866 -222165 -237136 -123333 -86270 -42193 1136 335827
23219 335827 -113218 223055 52814 6411 -38313 -360968 7065 -14112 97722 -116958 -73973
23208 -73973 72338 -52890 -297599 -41917 -149614 249548 94580 -248218 -68801 37146 38875
23197 38875 233019 -73654 196099 54909 -31914 -94167 348513 -246115 373962 167873
23186 49329 273417 14420 92763 153835 247624 3714 -109951 -142099 77864 -23292 -83807
23175 -83807 216106 210883 270466 -138382 -49052 -5914 -193519 -6909 -256271 -232841 198414
23163 -116774 212305 -225790 -168501 121717 230642 19685 -175045 -47396 -115687 54425
23152 40311 330087 2930 -257259 100047 180980 -280661 41132 9546 98203 -110353 56164
23140 -232605 116308 -252146 -198476 -162772 24328 -229914 -20129 -280783 30645 71398 155596
23129 155596 -332862 -152399 -188931 24165 -212056 -170413 364827 -234074 -194592 214702
23118 29525 55931 -123362 25344 -102696 -176689 248178 290862 -151862 56020 -163180 -38545
23106 61670 -329181 78341 -176994 -28894 -59930 168542 -81059 124230 222407 22193 -42269
23094 -139307 -336707 -127877 -204336 6379 219278 105365 -297936 -174151 -36968 -126142
23084 -126142 -215460 -112982 -105433 65622 -131560 -452394 -76658 -97171 -44088 -102510 106502
23072 -25379 194012 -134301 -148370 -183195 -64093 49189 28813 83987 267825 -27459 97488
23060 -111497 -67274 -159418 -348839 184239 -126821 -162699 2651 171753 -26668 -140569 -43479
23048 211341 -98225 -197282 -144528 -44138 -214274 158977 91768 228778 -19311 -46849 -24392
23037 -24392 -79725 -162861 169036 -41873 -81558 195245 52445 -1152 -6791 81114 114889 -108679
23024 -54865 -97842 277273 -101037 -285124 87446 189748 -120723 -100441 -24009 186239
23013 124977 384065 228363 -319521 11797 319777 -23833 -125594 131389 -389793 -6433
23002 -11573 -51493 -65998 -148619 80920 -222141 -29460 23821 -210340 219463 129101 -447591
22990 -14609 -50734 135138 -129969 -14714 -134703 -52095 84481 -219329 -114549 269379
22979 301407 -87820 -410095 -60697 -464827 -48373 35147 -33169 301694 20031 -297851 -251650
22968 -251650 -122420 178782 55869 -365368 -273869 -101048 -834 191608 -46719 32302 45535
22957 45535 -31629 447626 -71158 142127 -413175 -499275 97343 -113125 24487 142314 247890
22946 247890 -191504 -119190 116436 67252 108850 80625 -285026 48641 -289980 87692 278222
22935 278222 225463 93535 172775 49921 107235 -84272 -87174 -108315 54386 -17877 -31775 104357
22922 -41181 96608 161926 229541 -232166 -285339 47474 -39345 36259 286069 -262961 497013
22910 55627 87086 -188005 174572 -45270 71215 174455 76063 241149 118055 66509 -41256
22898 -251694 90512 48043 -12933 -100392 -357146 51658 -117939 -223157 -17886 -46112 -248537
22887 -248537 -110792 181265 236596 -29987 119773 -75567 5793 -343418 263263 48525 115592
22876 115592 -186829 116947 -11594 -87273 -57448 53695 305303 71862 -491256 260731
22865 -40948 342731 -74516 110074 -96534 -211461 116509 -170851 -431258 5240 -137388
22854 -39669 -92769 -34014 -242633 -376133 -212497 -254164 -37567 -180139 256947 -296156
22843 -270584 -86189 -116680 -108599 70518 85066 -26058 103321 44194 -273445 -175117 20771
22831 -208567 -40324 65156 46067 -135135 75996 -376015 -248400 -141674 -340295 -97349
22820 321855 -64555 -101299 -220555 59993 207424 80872 -352968 53458 -30177 -18840 -129257
22809 -129257 -17489 79487 -112495 90114 116950 -167786 -184924 46690 200057 273979 119612
22797 -71762 49359 -102583 221231 -182613 -48747 83965 122658 51750 -93960 -78683 241252
22785 -332312 115167 -145950 88084 -30007 -11528 119470 7963 67390 320161 153825 -110107
22773 2050 56190 -271274 199428 -272440 110378 -146850 -42761 91281 -261790 -164962 143118
22761 -292686 250755 -43290 -73073 21487 -71222 -43550 29477 60840 569906 -71176 -288519
22750 -288519 -109014 -93730 112228 -163925 -125445 52209 -352525 373 -190653 -18194 -8259
22738 -41916 109861 23802 -156101 183780 -64418 -255274 92167 -218541 49282 -215484
22727 -216650 1111 43887 -45339 -13636 -99905 -55420 -113144 -130625 -155131 -216708 -121470 88022
22714 -76601 197054 -144572 128301 -161051 -305514 141879 105265 132006 -270664 -20953
22703 -341602 -24621 -104686 -25174 244106 -41225 -133472 87776 50259 -186178 177028 -50646
22691 -252999 348119 -48647 144792 -240679 -128171 40910 -33211 -160029 156796 115557
22681 115557 -7198 142329 -43312 -189516 16151 -30317 -296660 -137511 17483 63034 -30154
22669 -311748 132707 -89343 -136140 34831 245177 -46886 14100 -126624 -151025 -106730 23981
22657 -35732 -4820 -5975 29594 313 9313 -40519 -84446 46811 -51573 -169073 128264 90316
22645 90316 214168 230995 32299 -93692 273511 -193113 63513 -233065 -31108 160553 199602
22634 199602 235713 245757 -291631 -7050 -282707 -107708 228092 2341 261782 -210470 -104212
22622 14752 -92342 134592 -22631 175846 241565 96975 173551 -235654 123731 -75290 -131665
22611 -131665 10193 -4774 -17535 146477 -201857 -79343 -56345 -89129 -155263 -131324 -345500
22600 -345500 -92648 -30751 -61882 -153902 -113949 48655 177540 124832 -80659 -328377 4867
22588 -87738 -63240 98439 -36345 87958 86893 -143770 -29228 -239564 -9659 -231956 -132136
22577 -132136 -9019 -48534 -167380 4453 246177 -184388 113823 -64076 -428137 -63923 43586
22565 -257913 -58165 -69515 67149 126040 -197196 108137 67361 -63633 208289 54450 -95381
22553 110770 -214940 -22454 53316 -38373 178339 162046 36587 232861 -38590 -252348 137847
22541 -72123 -27078 -35767 -216434 103787 -269616 226673 122248 -217398 -62506 -464448
22531 -464448 323104 -79506 -266695 -71434 -22894 -41168 58765 -96965 -432160 8491 -191291
22519 40880 -257805 16828 -55565 -48201 313967 -95710 109996 -14321 146729 306402 -5062
22507 -223790 -145560 -22297 -55697 -272053 230877 -98650 -155990 -376127 25854 87318 -170532
22495 -91768 -163462 -102881 -22775 -212832 -159143 -1953 -303561 33561 326897 33777 -405427
22483 92270 134425 -3261 -103476 -114168 -245679 -136589 -25842 -68168 351569 177748 -130657
22471 -52263 146564 -139175 -94277 13942 -3421 -40390 -377484 -10297 53787 100999 165591
22460 165591 -174627 -113539 -147753 -194368 -438349 -176499 -91803 -89065 -165397 -152046 89199
22448 10252 -178102 60627 -78715 141523 130932 4749 -188500 -11417 104519 9649 108308
22437 108308 -135145 -40992 -95318 232935 31838 79189 -56820 -312863 -181627 231851
22426 -32381 -122054 -4974 176788 65811 83773 -217507 13821 211337 -49659 -44379 51844
22414 247557 134210 -110939 274181 -41108 -161269 -330785 51332 125585 141966 -56960
22403 206298 -31591 34019 -308781 58267 -202203 285001 -167918 -123838 318770 -131252
22392 117608 95886 -82265 -203686 186954 61200 -51342 -35153 -318613 -251171 272423 -321209
22380 354610 -304060 126675 -335575 157777 -158365 -47994 -52524 3858 -61632 353875 43655
22368 69757 66483 -24114 -301504 -307165 -192081 -139060 -264066 12401 -264932 -167991 -214303
22357 -214303 -73595 -230352 9653 91834 -119805 -321088 203975 214660 233393 -317469 -72115
22345 -103262 -75673 -89041 -229586 16160 -153605 258165 -1591 67977 -477591 -103186 262779
22333 -256053 105505 78137 420107 15560 -149583 89936 -164959 -122900 164675 55140
22322 248113 22050 -114874 77502 185861 36034 207722 -397062 76324 -254751 -98436
22311 -120488 -72245 -23568 31773 -136671 -19559 -129095 -274706 150709 14964 -37492 197718
22299 -139902 -241716 109990 -240894 -343586 314193 -143608 -97853 -13967 165721 72092
22288 -45463 -269758 -41283 -164004 -320995 168568 -48318 -111834 287102 -150531 64910
22277 339936 56374 265641 -192918 -21618 146151 -8925 112416 -237602 228517 -192607
22266 109714 76746 -216550 -29837 -140069 32713 57801 -180271 -14684 -261119 -197821 205116
22254 91165 -140975 308832 183480 168557 231345 -138493 -13708 -201142 -151949 -71588 30263
22242 198672 25666 -236712 -71220 -89216 -48857 286183 81668 214287 -269710 -72353 9505
22230 -191596 112942 -141992 63881 -54395 6475 -21038 -166904 30379 307971 -197993 121410
22218 -157191 66425 -171484 -150359 -52890 13817 -115166 -87313 -67109 152990 -32763 -383298
22207 -383298 -3767 -124431 133811 33496 117623 280868 -18923 38744 -51290 -333834 14588
22195 -83144 -16097 -42945 -216855 3092 -237707 -915 322366 -56216 9251 -239934 89750 111765
22183 111765 142883 61716 144493 -81552 -201337 -104876 -276131 -269574 251311 -40302 -272514
22172 -272514 52639 -21031 -80770 -191088 55360 -456704 175205 154170 268461 -110555
22161 96331 -203974 -33378 -81273 77872 51223 243423 -115692 23504 -178432 171046 -93508
22149 -203820 -72833 -8497 23008 66870 195868 22425 192834 -97491 501108 -294610 431625
22137 -145625 133945 -350111 167036 -7770 -119126 -368472 114941 -197854 -90019 173562
22126 298881 -260204 -268457 86903 -269742 -59077 61732 47593 28119 -243287 3669 -225267
22114 131526 -302680 87613 -653 43186 158954 -209395 110368 -90344 297251 75825 -272590
22102 -117214 27722 -83366 73992 -15022 -106302 76267 149656 97211 -121992 -205154 -294548
22091 -294548 81927 148238 -14512 39824 -175925 102782 -98840 -4942 71026 175695 330816
22080 330816 -53856 -217887 -9812 -102420 -105405 44182 224 -14845 -226030 98170 -213736 66928
22067 56122 -202061 2729 -350696 -97033 -166803 69649 -173541 123650 -178380 52500 -188533
22055 3997 -27958 189059 515966 71685 -150110 -41525 -216396 -123085 -145902 -228012 119071
22043 5535 347359 -85163 -304691 207141 -236159 -185053 57728 307555 210556 58071 86526
22032 86526 37269 -221128 87618 -152350 -103734 -81579 -164411 173303 -79087 183125 -87681
22020 -18031 133770 -446249 -131062 -27058 -21391 17048 -253825 -88477 119035 -32734 -222009
22009 -222009 27850 -42919 95374 104819 67238 -74633 -191335 -114980 -213889 -84500 223284
21997 -181956 38646 -201257 -270799 119296 -105061 -183434 -136526 94250 -221461 -361783
21987 -361783 -75824 208076 -75527 -138790 -109205 -311494 -292909 30592 -243576 -157334 -199713
21976 -199713 4378 -70576 112330 276197 -211151 283197 -588110 -91344 15041 -163047
21965 -6784 112671 107719 54365 94646 -102178 -11642 -79552 -152233 -112044 -309047 45709
21953 -267783 128434 -285873 -217469 10144 112277 -241948 -486339 -57173 46654 -72030
21942 -34864 17625 -250006 -6948 -59603 -222336 122229 160956 59113 267779 -23634 -56329
21931 -56329 -328065 -182937 66130 281084 -96476 -76610 34592 14349 187250 -65640 -272525
21920 -272525 -78937 -34832 -180805 -56970 -368063 108393 -207799 6809 69554 13028 2056
21908 -102672 -348849 -80394 -92024 -36244 -136753 102043 13826 -299990 -315171 -288623 -8149
21896 -147669 41651 -9000 227623 -224456 -225855 -102904 6880 11032 -173992 350970 34402
21884 -161514 -77119 -145460 -58982 -112912 -410149 -94226 109799 108322 -10004 294675 281389
21873 281389 -140873 60366 -30907 -251777 25612 59014 -155190 -54509 67877 -48786 245889
21861 8806 -31866 354335 -99618 12071 226176 -125060 -177032 39902 -106205 -248811 -71332
21849 -366214 136999 143964 -118497 -99661 -185183 34972 115354 77930 -103367 -68991 257671
21837 -148096 -140812 -199412 252958 -43602 175017 -307149 -187472 183441 -219967 75595
21826 -46417 23789 -117023 103268 -161486 -148350 216909 -29652 436749 23449 -43398 -53169
21815 -53169 -7845 -72018 -102276 3037 -26944 -25665 -206010 -85661 -40804 91032 22443 -49749
21802 -277765 -289553 -98046 239169 -166858 -44014 -270139 76764 -18154 -192467 -189887 -83607
21790 -36080 22700 -137992 84888 67204 -123646 -179309 54024 61649 453284 181392 261812
21779 261812 -33284 -320151 37068 -113792 103969 23311 -411844 63445 64582 -270155 70540
21767 -99182 -173331 -154708 -33215 -146307 44183 -14556 -338605 226664 -88953 188385 -44232
21755 5800 238171 -134348 -22276 -230555 164601 23601 82042 236036 116657 65204 -38379
21743 -242588 -373695 -438063 -160313 49301 72579 -201861 217846 469863 228248 -112497
21732 -76056 -59607 8520 -174493 -73494 -180375 3456 316925 168621 62651 -199973 -70195
21720 -123687 -64898 6171 114444 -41790 15649 130486 143564 37065 -51589 39634 104911
21709 104911 -10746 -38522 -2541 -270244 -202924 -71829 -120589 -208519 -449080 -477297 284670
21697 108134 121620 -44725 -94835 -49988 200810 -323866 -34963 26489 -26583 -445783 -145387
21685 -291657 -15955 -181243 -100679 62886 116775 -13541 77113 207437 -15550 -252790 -59288
21673 -35712 116896 35697 -65111 187585 -114942 -39485 106672 -89081 -113149 6914 98792
21662 98792 -275444 211277 149035 -128907 -14746 -232235 7042 159947 -470570 -59323 115770
21650 277516 -55293 129166 -17008 -316132 -27835 -49869 -63220 74758 -156109 237429 -227655
21638 30457 -189330 163551 126214 -76420 -59491 -265136 -140309 130672 -74208 6731 84610
21627 84610 90475 -90797 -370620 -205805 -209040 -114787 -16656 -281390 -24947 -148658 -24505
21615 -219013 116300 13499 -37833 -135471 -9925 116583 -103748 -308593 -136364 -66645 -52500
21604 -52500 -152231 193989 120393 -322608 -220233 -57186 -362980 36217 37869 -61144 -233839
21593 -233839 -130279 244533 -64116 74478 7693 -50688 -248815 157976 62047 -435167 -51563
21581 -100720 -73459 -130864 301014 -296050 122224 -156917 83453 -101074 53131 -128707
21570 -101816 -455377 -215264 17132 120320 145853 -238474 104376 128394 137391 25606 -40207
21558 26015 -163203 -18147 34694 -99368 209075 142994 44050 56343 -220101 -4367 -126554
21547 -126554 -70518 52863 204677 42737 -187683 -239120 -168134 -163360 70442 -379747 193604
21535 124411 -303900 -330552 -179703 -236257 -177982 79197 -111686 153897 -168929 -208886
21525 -208886 -137221 137201 -80226 -109990 -1774 -176529 -80419 -67148 47387 -63957 -85551
21514 -85551 51502 -163694 -87917 -118203 -251473 -136950 488215 283200 -166775 101657
21503 -9790 454372 -190103 149252 -115984 -128742 -125133 -359537 21240 2276 21069 -122159
21491 77063 65341 -177091 -83792 187872 -76994 167508 -165056 1853 28389 -441603 -267603
21480 -267603 41380 206516 176217 -119910 85595 170953 -239013 43659 -48908 185963 185145
21469 185145 -74962 299408 139716 -175922 92363 186716 -242670 -99468 -327510 -388230
21459 -388230 -127541 68100 120529 9850 199015 -348583 73842 -137358 -189999 -24748 -279629
21448 -279629 -15573 -58380 -67566 91541 -142545 -554 -17068 61339 -34146 -133953 -9188 -119256
21436 -119256 40594 -146492 -218240 -14887 155963 -178082 -131139 37876 -202501 -45821 -158121
21425 -158121 267498 243833 136477 366772 320577 343121 236778 30394 224000 74936
21414 59619 438081 -152878 -9231 393116 26421 139277 2501 -108015 -190647 -1158 37995
21402 299788 133656 -142466 -363974 76961 -13589 6020 -517446 73348 -184911 168630
21391 -146074 283307 -167418 -83333 -35708 152993 125414 -324646 -319501 281883 341363 31772
21379 -23668 -369530 -50994 -76154 -138809 -120150 123598 214191 -6258 51124 -97650 -111147
21368 -111147 32710 -36430 -310338 215978 -140192 -64343 101468 113392 237566 -123733
21357 -78570 -156984 120409 -209032 25321 200992 -377618 5895 91217 -430547 -39728 162211
21345 -17823 -120191 140916 -161585 42068 115077 12399 161909 35033 -204382 -239785 -232579
21334 -232579 -166826 235671 -144794 105675 69099 -458669 118038 -161937 -255295 122105
21323 -141352 -288310 -277606 -341460 -45663 -190144 91375 27118 243371 31824 -55855 36376
21311 -220586 -392533 210094 34742 25905 311309 -81949 212944 -88620 46383 -534462 -15616
21299 40671 -12142 -378367 161887 82000 223051 70393 127348 -213339 -199714 -67465 -143028
21288 -143028 88781 146794 -29403 129410 -303779 -68851 49493 -99802 -241823 -99294 33847
21276 -177681 4720 1230 63913 65811 24049 3640 -219201 -10484 30311 139140 -274106 28146
21263 -85142 -4792 -84887 -138798 -396433 327325 -419420 90480 79222 114519 -320453 -22844
21251 -60666 374809 -393258 -76668 51270 -85262 -10829 50587 -224578 250267 -157020 -18777
21239 -206843 9362 12196 -115271 -112651 -80571 -74371 -218442 -302583 -41522 -101265 -166379 -271543
21227 -271543 -208473 94355 -84868 56689 218621 -9118 -5212 217247 -92396 -60532 140962
21215 -115031 -157296 -41497 110661 -190589 -152584 207694 -247365 20723 -55668 -27277 -136540
21204 -136540 -124816 -80979 135971 -63008 262185 21597 133674 -242234 -131941 -98684
21194 -98684 -72890 -218945 -46512 -189701 167095 -271287 64829 -85090 307749 -140628
21183 -73865 78270 9846 -282590 -106757 67087 -487965 -198750 -307979 14461 84766 -317945
21171 -132298 175397 -170075 208293 1676 -224820 92081 376404 93986 -135555 348986
21160 300780 -244811 -221966 -154830 110458 -71881 -135703 168748 -232944 23074 -208845
21149 -187353 -329825 94265 27397 -165976 -51652 102863 -110488 -62631 192088 -159890
21138 -19177 -325909 87140 85344 129373 -190415 -325919 -265532 -66151 54162 -237502 -229978
21127 -229978 6846 105228 78625 -390657 -31940 25235 -127933 -172441 -1207 267739 -185921
21115 242916 32137 -93722 -215512 -217043 -68526 -25685 34721 -39339 -300437 -25675 329226
21103 -131047 170789 -181189 -248897 -2298 -130618 151801 -34965 -160640 299968 -340672
21092 -54487 211370 8031 -201566 179660 -540944 -230491 339068 -33192 78034 -316190
21081 104741 78508 -156965 117104 -183493 -99458 -119275 167428 266093 -66429 31013 51182
21070 51182 -266110 -442458 -39845 40893 -49618 -82953 216615 -36882 117166 -93623 -88221
21059 -88221 464940 178115 213404 -322721 267404 -398034 163886 180928 131297 -140850
21048 -62063 -168985 -135555 118539 54959 -84645 14524 -187254 -210308 69837 -215934 51310
21036 -205565 52031 -43017 136390 -95691 61213 -84111 -185175 10732 56185 -60216 -112827
21025 -112827 -148282 22557 133624 248265 16119 -53144 -115953 -126059 55087 241752 7597
21013 -233863 119610 -136555 -124755 70942 -153817 -156167 -1707 -306348 4371 7517 -181226
21001 323331 84730 111120 112688 -388885 -168247 -30835 206094 -166002 -200028 -208905 266848
20989 34136 -63078 -108117 146559 55062 -323396 -69458 161548 -48308 -95002 -219884 -134491
20978 -134491 277217 -53671 -163686 -148517 175156 -97728 -176537 -196234 -353214 -191669
20968 -191669 -14293 -161692 -303763 -46331 303829 -375215 -13614 286228 188008 -177745
20957 -190285 -160462 -154284 -24794 -159208 -124803 89732 -145669 -113570 -348255 -441931 51056
20945 36493 -163935 125747 102105 -114593 -163976 -62725 -91888 -61978 -1003 84826 53388
20934 53388 128897 -59435 -31499 41321 53293 210522 -206517 -292673 -253196 -141250 -253503
20923 -253503 -28716 281502 -218687 55343 132242 -72705 -206198 -203531 43470 25533 24953
20912 24953 60401 -19416 -137732 -21943 82612 226140 -184243 -234025 -372072 -230307 -159588
20901 -159588 -294451 104371 -43219 28987 -180122 -340523 334143 -36928 -31769 -260466
20891 -260466 -11454 -25718 -23897 92507 -51755 -141197 60756 -66020 -196380 -150337 -472564
20880 -472564 331778 -72540 41614 -116699 79656 -28743 46562 -191202 -22013 -61513 98801
20868 167369 126700 -61779 202904 -142705 -174112 -5239 -37384 113959 -101091 -239673 -158126
20857 -158126 26910 -2296 -305360 -314793 -61128 61682 -266662 -94014 245284 -136414 -297936
20846 -297936 -10288 -78700 -182430 -103904 -121976 40831 -207627 -65993 -202284 252299 193475
20835 193475 -316230 -301985 -63997 14302 -45623 -157526 -196167 -107323 148349 -174805 -5109
20823 187589 -106611 -195445 -117422 -102664 -96317 -62902 -156652 153856 -297634 -406117 -268905
20812 -268905 -131065 338916 93184 -4921 -289789 129557 -174139 -303344 80153 -46903
20801 -292822 -364396 54167 -113010 87656 45221 -57172 -168784 -337099 -34668 3957 -187056
20789 110797 -77123 -201772 -63777 79800 -277058 93851 -107270 -176934 -80381 -214421 29814
20777 -156932 130602 -205041 -137718 17703 -48114 -194294 9731 -304043 262193 254772 21814
20765 -10360 -19680 50013 -114508 -129012 -142020 159953 55562 64897 -238039 235569 -282781
20753 2478 132784 99799 -173011 -116707 -104419 148 -57016 -218935 -136027 -131116 45408 -56362
20740 -149027 -346079 -62738 42310 -262405 -75576 -157240 35203 -113530 -155082 23179 389108
20729 389108 -125554 142078 120309 -162619 184401 -174580 115095 424647 166954 18855
20718 529214 104235 -273408 66010 -87960 236731 -9853 -120348 -114716 -28289 61585 -35771
20706 68367 -324976 242430 -163269 -105271 -121934 -189394 -262400 -241188 -124767 -41596 -192267
20695 -192267 163976 151981 291359 54294 -129855 -123152 -203731 262500 37732 -186532 -150546
20684 -150546 -48054 36375 -76783 -138164 285518 36816 -295775 211968 -139136 16055 48757
20673 48757 -483237 8966 -116549 -218916 -44663 -30401 -583100 93684 -25562 -134066 -310338
20662 -310338 121014 125250 -38067 -98839 -11522 -379512 269181 -295693 51284 -250629 64343
20650 76296 131260 -37802 -137829 -326338 -82226 -355746 -212620 58496 -140715 111060
20639 63235 -176313 -194760 120373 -67872 11414 59347 -100106 -160635 -215874 260759 120588
20627 -97232 -228640 -264944 -5010 201344 -333632 -313244 -181762 -26309 -62835 -25150 -127305
20616 -127305 -266846 -293461 -64465 -84917 -64768 45298 20969 39370 68687 35897 21322
20605 21322 -267745 -15157 -94341 -49309 -422102 54130 -72378 -96618 -146065 -127820 -185406
20594 -185406 -200239 245912 -253337 -210151 219930 -10406 -117956 -255727 -463638 297389
20583 118404 44518 107495 -301110 -127087 -109797 243429 -78206 203493 -223432 -174393
20573 -174393 52190 71615 -198631 -304287 154645 -100893 -43937 -229720 -147383 -74132
20563 -74132 221162 -196205 -131991 211731 -85566 -64729 -37079 -226552 -93162 -104083 -12173
20551 -230069 -205613 67082 -104830 52951 158761 -202826 65440 -223256 -86558 103848
20540 223334 -43198 166838 -206369 -233384 -96278 139462 206128 -120894 -103908 -27091 -35698
20529 -35698 -183128 -42443 -162304 -59577 39410 453997 -150001 -234621 -390008 188006
20518 -153310 -111881 217431 98928 -350055 -203885 161226 -30447 118391 -41598 -407716
20508 -407716 -211793 113915 -7904 67410 81362 -89050 -314872 -200492 -138184 -70465 84713
20496 144088 71159 -9529 25053 102378 4131 207739 -335483 109968 -181780 30933 -103438
20484 109872 211960 -116094 86357 204212 381521 -89459 30674 -229680 -172073 -220164
20474 -220164 8701 -296530 200806 -278834 -4634 -106685 -128936 46995 -100827 80871 -91752
20462 -52690 32827 -60588 -61014 -5667 -178756 149976 -261554 -28537 -23769 116299 -104180
20450 -15418 -227717 -14394 203437 -50244 -33963 -310177 25504 290330 8843 -45214 78704
20438 119419 209554 41222 163111 13983 209766 -304982 35275 -146623 7223 225761 -169578
20426 -75980 44571 95830 -8553 -149755 171029 -145270 112830 285798 -176041 -38238 195126
20414 -77240 -8296 -210865 4910 80645 -463487 268010 -110037 -530098 108787 -150962 -179997
20403 -179997 152744 -34899 -205779 -544359 186958 300543 -298455 -90884 -103489 -366909
20393 -366909 -532472 -50158 -224636 125876 185768 -134932 156677 -205179 -74513 -119534
20383 -119534 60504 -23163 163415 24032 -49980 -77103 -31160 -52617 127373 -145969 16478
20371 -60252 55457 219024 -242369 168132 122478 362509 180087 -77666 -59842 -215759
20361 -215759 25782 -180525 -125319 -319769 50467 -89335 92781 -15390 221685 -58980 -53165
20350 -53165 115614 -245891 -14176 62088 -59477 -128873 -63737 -51133 -273004 232970 -2920
20338 -335181 47636 -281589 35285 79588 -93450 -243967 97660 -369746 -115163 191612
20327 -100216 105077 -54823 114021 -260631 193643 -189049 45 217225 35202 134583 -253977
20315 -170605 -66005 -161551 -154071 -146594 224488 -327740 -222331 -125298 298727 -131128 -95920
20304 -95920 147233 -3152 -253695 -94404 -167905 130875 -272418 198454 -472494 -211767
20293 44305 -169509 -383824 12392 -5602 -83663 325617 81603 -166507 18289 200157 -148293
20281 371047 -100568 -57331 -375717 146696 -88531 272553 -83616 97877 -3657 8123 -141968
20269 -90335 -426651 219797 43332 -138587 -99309 -45581 77772 -117689 -23129 -107812 656
20257 -117251 -458249 -131157 -388756 -202679 -348387 312997 105478 -252424 170995 37041
20246 -332782 -279390 60567 -147058 -115719 -70758 113832 179482 -118873 -303444 -248430 24413
20234 -494529 -421434 338746 -194178 26203 -53238 177751 -217736 -62285 -60256 -59301 -237989
20223 -237989 46968 -108840 120764 -129876 -279190 -39375 -114003 190063 191037 -70423 30766
20211 -53833 -65779 43902 20570 -134932 175455 26999 103319 -71059 236202 -150203 -293932
20200 -293932 -209924 -22812 -292336 -196979 -112479 84487 -84763 -129487 -179305 -68139 462560
20188 -80306 -62847 -100086 -215628 21365 29676 -60001 -53770 -61497 129101 -338206 -270327 -23101
20175 -139073 249095 139702 -350682 81442 60837 -195414 61370 251992 -94704 41476
20164 -53136 -161082 22882 62945 132949 152173 -78011 262417 -36395 284992 -41176 -141855
20153 -141855 -175683 -84627 145914 -156500 -49533 284724 -273505 101993 -107435 -62169
20143 -62169 -76834 -169840 21776 249489 135100 42647 53177 -152045 30937 -100704 48896
20131 -15763 -249671 -750 -277788 289137 -104577 60781 -164319 -158882 135855 -181688 -157564
20120 -157564 -213100 201839 -199420 -307939 -20379 253060 -99004 -207913 89618 -229706
20109 -211150 -1221 11066 -224224 34341 79087 -6153 -96170 -158010 -196385 -6916 -98664 -41286
20096 -178895 -71058 264058 294271 43298 34829 18479 -49530 271445 13543 194911 -108580
20084 -445702 -20326 -305604 -188978 -175940 50566 -206158 -137020 8499 -212434 -96098 -58281
20073 -58281 -73993 192820 48260 75641 221389 -85326 -302871 69515 -28802 -101742 -134891
20062 -134891 -326602 -345215 15684 -84315 -147762 17024 196133 -131311 -133228 -184087 129977
20050 133255 -87705 12908 78443 -89675 -33259 -88519 -404970 -183423 -146476 -68638 -53966
20039 -53966 -149632 -132835 -67225 152666 -129447 -96200 -203718 59356 -168142 -156194 167082
20027 -4626 184070 1932 61386 -208568 -101080 -14857 -160294 -440214 -200627 191138 -75534
20015 -229955 34300 -132625 81562 25113 -211966 -59255 30247 7829 -210736 -429841 -346843
20004 -346843 -80917 -41730 26335 -41434 -77652 9286 71011 -218316 21682 -143592 104503
19992 460982 359028 -102747 -180746 -23495 67106 89188 97800 167036 124124 -81689 -114716
19981 -114716 -144628 -103582 95201 -276104 -75783 -103211 -163873 290545 138077 -141626 88165
19969 133101 -120030 -78875 -185983 -411906 22766 -77047 -59364 -144135 -188385 -14253 -58058
19958 -58058 68191 13086 127470 -148347 -139275 -237947 -72198 -28415 -422309 129966 -210478
19946 -90397 -2060 195486 262159 93055 -102140 25720 304900 -48739 110366 164102 -92215
19934 173718 -181346 133457 -263528 -46215 -331843 92482 -190695 269550 -84196 234571
19923 7568 -152070 -68852 -197643 180660 -239438 -244574 113412 -63919 -78595 -275272 3530
19911 -198714 -63662 232572 -352810 91033 129879 -253414 227770 169946 -101811 -215522
19901 -215522 -208286 -376886 -69600 -60526 137954 -312838 -5152 152658 -90630 230422 -184578
19889 158679 -277124 254314 28256 -132920 -86983 -42004 -87900 35623 -92802 -17123 -161404
19878 -161404 69454 353818 -190520 108245 159792 187650 -279757 -293813 -87275 -91791 -64975
19867 -64975 -146580 313195 152103 -293032 -444311 -90414 -162566 198246 9825 -364826 -44734
19855 -49974 -161356 121145 -153500 15618 -404310 -226618 -6118 -228568 314455 -12000
19844 158268 -21295 -134917 3376 -53763 -88828 161969 156094 -84221 83059 -112791 -281606
19833 -281606 53714 -29685 -1262 -60733 -51386 135955 50807 -11729 86857 167504 65125 -194293
19820 200149 -159458 -18540 -291211 -22809 -388785 73827 16366 -180400 133881 -61069
19809 -171187 -75170 156824 207511 38058 -258059 -298309 -117048 274586 -195072 -95283
19798 -182455 -174774 -135470 -204029 -288821 136306 -190734 -175524 23211 -200165 18896 -43318
19786 -32561 123508 -44910 104456 91507 62062 172163 63628 191725 115489 224268 41156
19774 -210437 -169954 -18509 3591 -94609 -288641 -239047 -35171 -166455 -245093 -159291 161053
19762 79974 -137704 8120 -219539 -150965 65905 -129917 148658 -225203 -155614 61097 8616
19750 -348514 260668 -208771 39094 53683 298906 -330616 157752 -94182 132046 -200445
19739 -235804 79756 -208892 61350 32390 111242 115799 -102346 -43388 -180902 -9498 69439
19727 104749 -236539 -82547 58438 526641 -33846 -195926 -127888 462639 88733 -52768 -173609
19716 -173609 -12082 -164820 21734 -35601 16768 -308273 9656 377555 11573 194461 210337
19705 210337 -348343 74016 -182545 -89990 -200299 10839 -198626 217188 -153833 -19982
19694 146511 247582 -116882 114898 -2570 -180730 -156327 -298259 -6092 61267 72633 51970
19683 51970 122333 -178933 -62055 -232455 559 -25438 11661 -181014 -89590 81182 155472
19672 155472 110582 5071 -314198 -70758 118020 -76985 -34663 58710 -53746 131226 60305
19660 -275953 -131046 124341 -243277 16040 -294634 45753 66430 -72087 -200644 37063
19649 -69372 -86350 26914 184826 68277 -75918 -116763 92552 -17767 -140732 68031 -310800
19637 -246143 122133 59696 -120241 104801 30927 -58149 114749 -184607 -9993 -25887 -200126
19626 -200126 25738 -300461 31974 175313 -122074 -20929 96610 31348 -273784 -173590
19616 -173590 -25689 -41718 -316444 172121 -100046 -201183 78790 -64264 -22763 27299 -75419
19604 -170080 174585 -207747 -290631 177718 -106360 61524 -55219 31266 -88820 -251972
19594 -251972 30969 105435 36899 -303782 -33698 71479 282873 171593 -119741 133110
19583 -126512 -297173 -180280 -65240 43258 -24901 14989 -73975 -17818 28925 196058 -308565
19571 -138624 -430659 26274 214585 176799 -71542 -58257 209026 -541801 -371180 -71602
19560 -103045 -95473 -94214 -24298 99040 133364 -68876 -237111 -447296 -284563 -55967 111998
19548 84811 -85937 -110555 -134873 -300265 -75089 -550236 -36046 -137088 -151597 -102991 178801
19536 -56764 -217470 -273689 -89155 -152834 62568 -212695 -115271 -151694 -168649 -373386 -65914
19524 -211522 -10965 88136 210315 -7855 277048 10886 -144264 -162777 -361384 -241736 -156660
19513 -156660 -250852 262053 130095 -51129 -68274 -74677 115797 214484 -16069 -280660 -143284
19502 -143284 -47105 16725 30727 20085 -6811 232346 -323343 -54607 -54098 83468 -105678
19490 33299 -330079 417082 -51382 109436 47233 -63620 -102607 -17057 -86202 -61878 11256
19478 43501 -89290 182097 130806 -36596 -226964 72070 226037 -165042 -178792 117892 -81038
19466 -7153 -103822 52826 -134333 122009 -291167 -24266 57602 322088 30252 102007 -142395
19454 26249 -330690 -25288 -115021 -5426 102268 206834 60011 92844 65756 -127172 118377
19442 -17413 -33995 61934 -27546 20940 61842 142355 89196 -241866 54091 119542 -242800
19430 42003 246431 -252548 -179698 -261696 35687 -215075 -41129 -124200 -150811 20071 -223335
19418 -234556 105703 -80715 -174682 -339625 184255 -86149 251308 84050 9339 -10363 355481
19406 -205722 21947 101677 106162 -50336 -83909 47878 11809 124042 -166122 83964 85660
19395 85660 -16063 -210687 -121650 -205083 -44027 101099 -24871 -271248 27354 -10714 -122437
19384 -122437 -22017 -363696 11353 190117 -393686 -63914 -148719 147752 -225636 -389439
19374 -389439 108000 -14421 -87991 -165862 -172062 36533 213775 -129602 -31541 20523 138859
19363 138859 -110255 130467 -145917 -93716 -81301 48292 -182285 -51911 -26081 -190236
19353 -190236 72475 -461754 150354 -121173 137701 -57053 81704 -203660 -47146 -103564
19343 -103564 50867 -112945 -217527 11529 22152 243908 -162259 -75244 -266274 140523
19332 187647 -318778 -118857 -7038 -44832 30471 310929 148342 346375 -64106 -273912
19322 -273912 -134159 -89901 -115863 -169124 2577 -138077 891 -3012 -250389 -51638 -466173
19311 -466173 55013 261063 -46149 -106979 78457 -6274 232960 3189 -352772 -130937 -21847
19299 -80593 157258 23829 -51738 -325062 -313837 -248285 -266112 -131842 69078 279727 -5832
19287 -184458 -322652 -226908 45206 -297104 -124454 -225058 -267156 -280614 -280931 -298721 -36183
19275 -74405 13800 -54333 139316 -36446 341346 132355 -168759 -9612 257161 -26654 20221
19263 3631 96202 -261484 23881 41401 32657 243714 -99528 -15284 82938 -233560 -84948
19251 -71284 149191 -75476 -103835 -94243 -18872 -58398 -23575 -145810 -148887 -64460 397134
19239 75668 -256612 69596 -72768 262383 -58980 -45502 177371 -227650 -163075 -105256 3278
19227 151114 -245978 -290705 -127934 176186 115089 17536 139237 66757 -133874 -266623
19217 -266623 142053 161887 65435 -97023 -117846 435456 253955 -285372 14738 -479837
19206 -187152 -86518 -227910 -108950 -391557 -166876 4990 117631 -36564 -172624 -294488
19196 -294488 -153228 19724 186489 180326 -349644 115960 -88563 -290703 227612 -113149
19185 -123357 6771 75370 -286703 -54976 191407 176758 -304038 -446714 -69646 219668 320341
19174 320341 -95076 404828 -253454 103187 9065 -35687 -1258 -65981 -78786 -137656 -261332
19163 -261332 -247835 -121171 -106119 66317 -193793 -145424 -117229 53912 202684 -148858 -357132
19152 -357132 365925 -16841 -43690 -3906 -460259 215304 -225604 -90408 -47285 23510 -148842
19140 189245 116228 138943 -220930 -129651 -64911 118934 -252330 8981 69966 185824 -267633
19128 115455 54303 59494 201706 145087 -249154 -216060 29663 106448 119479 253296 27284
19116 -217030 -5830 -231742 -132100 -214455 -67554 -441184 4160 -124148 341464 -156473 -441698
19105 -441698 -37492 -83744 -174008 62419 -131842 -442941 -19375 -28221 10209 -181488 -52566
19093 49995 -63829 27974 -73539 132336 288976 -77965 -196266 -75161 -74577 -138864 -258482
19082 -258482 -234915 -169352 -24826 -382601 -109757 106716 58015 -101633 213107 -127796
19071 -351690 -227825 -385891 -95799 -288496 -15068 -22853 241565 -95882 -70092 -318037 -182344
19060 -182344 9135 63330 80928 -213043 -195951 -195176 -136079 -28066 -51810 -35893 -168011 128879
19047 -124438 -273793 -1014 -35340 -132610 -232743 270258 -230790 -29785 -371521 30765 236691
19036 236691 -114422 -11436 -220734 26239 -177581 24469 -6535 -169312 -221658 353908 -16960
19024 -54957 -176297 -262886 87340 -29940 -62284 -96030 264853 112371 -18748 29761 -78748
19012 36940 148427 -87374 219857 -43474 -140334 131404 -227678 -133134 976 51638 -172080
19000 33503 -66350 -15089 20321 95418 94063 -16026 159244 108928 18863 -96410 179696
18988 -231183 45581 171309 52015 -437340 -226388 43516 -121433 -7230 -75205 -77545 -90279
18977 -90279 60083 100263 -153777 -44666 126433 355999 -216742 45175 -93714 61650 -253088
18965 12505 13879 -286957 68744 -256060 170546 10033 -21597 -68447 62149 -19061 -267486
18954 -267486 64863 169158 68918 -278400 -102334 -248821 128880 10608 -147351 -17079
18943 72838 -190645 -298781 87487 251400 -9753 238832 -207168 43008 -76113 -217054 -494257
18932 -494257 36296 245619 113967 -96553 -44417 203611 -90590 166604 -85594 -92070 128245
18920 16746 -208049 -20153 -14328 -339099 -81572 -262705 -92129 -147297 115840 -296961 78051
18908 -432603 152412 -158941 -108854 -305840 20279 -109086 -154896 -24243 98642 -195194
18897 132541 -44240 67210 64552 121458 -333459 88287 -152937 -18449 -71810 -23028 183941
18885 198260 -2699 -281492 -128319 -78065 205070 15044 -126210 95947 -117898 -37527 155239
18873 -118751 -65694 93063 17904 169912 -331095 -168016 258431 35091 57873 77780 32500
18861 41895 -15244 -66275 -174615 -99874 -44232 201 38304 23079 -32776 -221391 83558 -141089
18848 -113319 63923 197647 109918 221319 -371967 -62270 -33605 95876 -298343 -71278 -372013
18837 -372013 -90014 -71928 -49817 232989 -66753 -431592 -88510 197130 79737 -21013 -220241
18826 -220241 -106691 -97670 -73921 -150323 -35979 35280 -239454 -131639 -328880 -480446 321520
18814 -195391 182727 68134 100415 -94869 -222913 -118156 -7468 8460 -3467 -143641 -331199
18803 -331199 92198 -69835 -291486 111502 -53031 139981 200265 70786 -144329 359037
18792 -202209 22507 -69666 138578 -286027 -96714 152489 -151241 -304747 19874 -246297
18781 137444 145139 37099 -306724 -299759 -154247 -110970 -237168 178881 -184619 118592 -153368
18769 -143010 -84822 276406 48100 -88213 -98990 -117572 -303945 72904 54328 -401223 -34913
18757 -174436 -14712 -280491 -43880 115086 -45368 28425 -83676 -293342 24404 97972 -49421
18745 -175977 -68372 95281 91879 -228558 -116917 -29312 -44506 131098 132955 -40476 90037
18733 -21298 -417460 -182634 -196226 -176457 317158 -77069 -73627 -74664 156848 -44910 40320
18721 -132594 -106430 78495 -42126 -111630 -232167 -6090 -45992 -120368 44490 -257600 162612
18709 -191179 -49370 -159571 -10520 -134414 73570 -160385 350940 -140075 83243 49373
18699 49373 128478 -295034 160562 205360 -127986 111116 -52456 -320431 318686 -110468
18688 152624 -23875 -28574 -151896 -136844 -219560 121582 131803 -61714 -27618 26933 27103 40925
18676 40925 124670 -35221 -99463 34301 37899 97561 45273 -48568 48077 -114278 -119549 -125952
18664 -125952 142687 192364 -54166 -392356 -122871 126678 -170066 -183266 58186 -223584
18653 209798 -101267 67287 -341845 813 184895 -151385 -122269 61145 -119353 -231442 86132
18641 151547 -262444 137852 -262587 121393 -69198 260785 -32841 164500 -16615 362853
18630 -60259 199608 54872 11907 -67338 -238936 36845 -209507 -287083 165614 -10963 -120272
18619 -120272 -15252 -280136 -7036 456166 -129131 -79626 22781 -174177 -97723 72807 -351534
18607 -210888 156987 -10333 44624 -203246 -266598 -17059 -108893 128654 17177 42720 -641297
18595 -62349 -156956 -30835 61384 -162929 222637 -143752 93203 94841 -201160 -184278 -230337
18584 -230337 83402 -118250 -122453 10509 -17394 -19899 -123357 102687 2319 -18409 -67103
18573 -67103 -27153 66623 -10056 -124776 -150272 171148 -96631 -94016 219543 -30746 65784
18561 -223951 -216812 -77603 45767 -186879 51846 250690 -219518 176942 -21198 -79435 -331547
18550 -331547 78891 12996 -31567 -343258 115016 -25208 -51166 67393 199484 -89739 -109975
18539 -109975 97262 -45481 -180410 -164075 35476 -169358 295270 125175 -77528 -280993
18529 -280993 8550 -276603 32133 -48629 19242 173068 -156524 -382162 159438 217997 -211028
18517 -373514 -267114 44844 -6127 -160529 -93784 -98257 -81735 -126741 4257 -56405 -271140
18506 -271140 -187728 -58777 90189 -9520 61592 -432093 -287155 -152586 -252974 9789 -120128
18494 -252002 -97675 76425 -224953 -123588 -171688 -124288 -38355 -130995 -21837 168625 0 98793
18481 -172116 136659 -3390 -435666 -3940 -6516 -117594 -10037 -58396 44921 -273161 -353753
18470 -353753 -39083 9821 27657 46923 -2507 44366 -200117 110722 105182 130543 -245794
18458 312088 -263791 141147 -32981 -17172 475949 138507 -55279 99351 -216219 -272557
18448 -272557 -55645 -248455 99782 96205 21239 -255786 91999 221042 -116564 380707 -156891
18436 -96004 282643 40476 -273914 251978 104605 -305691 217102 -235600 54534 -85773
18425 168707 -90198 274666 94168 -67550 -288403 -109047 91050 -368923 -16991 120776
18414 -167006 -134632 25120 -49598 -87451 -11473 282790 47026 -14240 -297763 -101043 -1273
18402 18805 257401 -143851 -124199 -154017 -69773 106108 -126516 -260512 -32502 -188706
18392 -188706 -82039 -193638 -5638 114526 -88429 17274 -206797 -178481 103007 -142854 -47669
18380 -140485 36156 -136750 -136059 11308 -46542 379035 20294 101649 -164249 -145892 -174027
18369 -174027 176489 6422 -299950 -102385 -24413 248073 34138 -286401 47115 52821 -405659
18357 281337 -117508 218867 41404 -277057 58338 66815 34436 39611 38174 -144422 -76090
18346 -76090 -79851 57895 186092 -398087 91950 -180910 -190140 -49611 -115929 7328 247611
18335 247611 -127541 65444 -47413 8363 -128968 68085 238307 106245 68470 200553 -121127
18323 -218004 144734 -163795 -188713 -161382 -192973 79853 -50952 -361152 -289258 275827 -11563
18311 36273 -87243 215348 -312415 124215 -80282 -149805 67511 -97631 -76420 -16252 -152270
18300 -152270 -405672 82525 -130128 130487 457 -224352 -203787 32425 52217 1855 -78894
18288 -378044 -326912 -270719 83960 -13593 117531 -363591 -337774 -6626 -249363 -359297 85263
18276 -117430 -38326 453974 22940 -211571 197799 53706 -281427 -106208 -33222 -64500
18266 -64500 122679 -172121 -154985 -103833 99051 -126120 142571 -152593 -33466 83712 254320
18255 254320 -360063 129792 119492 -122826 -338328 -121009 273710 -199111 300068 -458089
18244 -97243 65794 93234 76995 -171731 -368540 57389 -32065 -130983 162665 -168544 -184397
18233 -184397 33829 -158308 278916 60940 -127809 -74062 -28164 113745 299045 -234340
18222 -29523 -223147 35782 152881 -155653 -87070 138848 6235 82257 58479 -17345 38109
18210 62273 -20674 37782 52160 -168522 -108692 -111034 -159800 -420494 62419 -119671 269682
18198 -63093 207344 44984 -105055 146331 -117168 -95803 136799 266775 -218788 124422
18187 119945 7314 267974 -186198 18082 -60402 -125251 -129849 86356 268431 101306 -33698
18175 352967 -96728 102389 -11751 19562 -21632 -228045 -172603 -119256 -372708 159469 -63625
18163 227140 -17173 28836 -236362 142138 100106 -88626 84691 8601 40266 -88706 -1604
18151 13278 -148770 208455 -53747 -91508 -228447 -72165 236621 96010 -84853 122730 -182717
18139 156135 189284 2674 -107433 203402 19202 27940 -40642 -222072 -299437 6990 -663124
18127 92166 -108169 -15840 14281 13517 -189972 -206412 -191910 100488 224768 28714 -379638
18115 274446 36052 128053 -195767 -211868 -305123 301429 80959 321725 -95263 -91623 75557
18103 129582 23917 -120518 143446 -403541 218018 49618 -2322 -168900 -297664 49063
18092 -575 -257691 363675 258547 122794 -306343 2620 -192520 136751 -114233 -315196
18082 -315196 -74619 313136 93167 -11100 31221 -130880 154180 -219064 15434 -2777 160242
18070 222876 -206823 -114554 -131538 -165297 -284243 -14736 -193296 -123179 41772 38160 -132419
18058 -137293 -180594 -247318 364376 39529 -75641 66678 -103979 166443 -126907 -22054 177876
18046 -348742 202089 -300879 -152861 122489 -67819 65218 -193146 169512 74047 131354
18036 131354 87709 139676 11951 357528 112390 205418 201029 -142299 -52218 188958 85503
18024 -80566 -149584 166946 66415 161131 52704 61801 99132 69008 5178 193503 -1043 87943
18011 -90555 -139787 -169866 159595 36425 -182108 -243077 -259912 33426 -159311 -189347 -145801
18000 -145801 299255 -76687 22537 -159227 43111 -571813 -114828 55523 101086 177735 12634
17988 -57521 75344 -108907 -86173 -141247 62124 174611 -117745 -51159 91406 120860 171669
17977 171669 -265602 370370 -28045 -231796 180433 -386358 -14828 31532 51287 50227 -144601
17965 -65975 110075 -118564 -24099 202470 -421342 2000 -63275 148326 -3991 -90892 23222
17953 -103623 15553 -3423 -17741 55156 530767 186930 -218900 -57785 -30401 79021 -166733
17941 23687 -273768 52598 -477637 -336916 146306 149760 -331631 -77737 236998 245328 -156495
17929 -155214 -100698 -13621 -19190 104979 152785 259924 -73624 -168409 -2532 -62928 -185691
17918 -185691 299253 -120249 66355 -287698 -152025 -139889 -139456 -67319 -43681 -131184 233481
17906 -305188 -142434 78653 -127108 51986 222084 84457 -124680 53226 -82867 176522
17895 83616 -173564 -133636 -112510 -54168 28434 -63097 39305 45837 -188363 -59550 -10625
17883 176719 -92252 -70040 213339 21086 -179457 -32223 78874 -172887 50994 -159578 274020
17871 -309903 40168 -97920 -84582 -109124 -120461 51959 452104 340833 187191 164929 4726
17859 227873 -199016 -42195 41903 101090 -41389 79907 3321 -69106 -276370 -38623 -54394
17848 -54394 127646 -295660 136570 179281 -340531 -328340 -68160 125276 66281 -25515 25112
17836 290782 11176 -469375 4916 10663 -252154 -133036 -107186 47790 2027 -234838 -183307
17825 -183307 21793 101121 142561 87328 248547 -80302 -209453 -203310 326151 95866 72113
17814 72113 109352 -31043 -247053 362915 -117243 278895 33157 -370726 70586 202208
17804 202208 446362 309053 -206034 -71340 395472 211589 -51922 53274 -139113 168512
17793 205149 96745 -216122 -128171 318363 135232 203823 -52129 78134 -269681 36855 152616
17782 152616 126443 32204 241997 -61321 14369 9438 -70777 53726 256643 -69058 174514
17770 -70928 -90710 84564 -72699 -268465 -190373 80914 267637 -416098 238882 -463053 -115027
17758 76204 -121508 -82649 123993 -13164 -173737 -86898 391167 -96501 313681 41293 -111822
17746 137450 -95348 271432 60442 -18125 48808 -77556 -278003 91834 -116942 -89952 -328672
17735 -328672 -277049 247713 35555 -50365 -176115 309777 45611 -401790 40735 266082
17725 266082 5675 430715 -54440 93281 10524 1822 27632 -100182 193902 404750 213332
17714 213332 -108960 -100670 62794 -46717 140646 438633 -75808 70922 -93453 94994 77862
17703 77862 -168752 -49448 65226 -149219 -63411 120576 -149795 166689 116582 276083
17693 276083 218881 149388 193300 -98191 90579 173336 128691 -1407 162738 92816 106014
17682 106014 35451 107618 -139840 -98801 -246540 -114047 -354648 108739 344148 111947
17671 154857 61147 -139442 183074 -74836 -132078 -114507 17522 116419 850 132043 -2239
17659 401836 263720 56243 -69913 59860 115266 -328641 222066 213563 -205770 78086 55201
17648 55201 -16101 17818 -169082 204832 122683 -122332 -39634 -33280 -16583 132992 -175659
17636 -319549 83413 32727 157827 200572 156422 -145957 -230506 -334675 79395 47377 -128140
17624 -4833 -82827 7007 101892 204068 83803 57978 128881 1852 -57400 -69466 -169358 120198
17611 388314 -102834 -197660 -4821 -155208 -99420 67638 116738 45533 61058 -85866 115985
17599 -158299 55659 422751 -16268 -372393 51654 22732 119341 -283961 32994 -83545 -12071
17587 136999 -89672 198385 60899 -77331 181249 94411 180063 43990 -302486 -44064 -21508
17575 19848 9509 -57476 245579 30442 -305019 153832 82651 -81994 100902 70474 -236082
17563 324673 -107288 -153123 -366347 29371 -17055 8802 -33769 195440 -92052 -32569 126703
17551 -32145 -164392 282209 562805 -41445 36583 170714 217697 185806 -101217 26254 224986
17540 224986 -111186 -77699 150138 -38391 39696 367637 -41212 67995 68564 399114 301440
17529 301440 -122791 420034 116601 204967 -288327 -269834 90170 435864 -132535 147415
17518 164192 187883 179240 313241 165151 159531 -51100 271288 -20549 140800 413728 25479
17506 212275 316999 67874 256734 -146744 21936 -178672 -63626 179863 101508 -9589 -16140
17495 -16140 -133485 222173 39836 -90039 302627 270808 198495 -188370 319348 103728
17484 197998 -105367 -47923 177025 349096 163515 174541 94437 -78940 306924 154649
17474 154649 186464 299674 -140628 222788 -87544 -296896 293154 132258 46825 445412
17464 445412 65786 -90461 19651 160925 -2476 134500 415261 96372 218540 -82152 248544
17452 278542 -175955 409051 -69873 -58777 336286 142459 -220868 356315 228085 292854
17442 292854 346729 94923 435465 -105994 305913 344253 261680 376463 117350 432791
17432 432791 -8961 203692 345733 194150 492125 144757 609132 303179 550733 369711
17422 369711 420239 176874 160249 116567 338175 212787 211959 248937 -19952 279509 138673
17410 196369 254850 253310 -4587 200660 390662 342072 410117 392292 316720 424224 111034
17398 476377 119497 198281 406300 330008 93511 123762 93178 -113147 402422 -282096
17387 163795 404010 197478 295792 428341 54595 214784 160784 275023 274824 -19891 253730
17375 71030 181011 134783 93538 -46082 402885 165876 244347 169621 -48494 89423 138024
17364 138024 47870 62490 -135970 323657 -45603 319867 165554 342602 163458 -100058
17353 257818 318991 171804 35276 -91837 112782 412690 189730 121140 179151 136284 340605
17342 340605 105304 296777 -9012 34337 -123510 -17890 -11625 135690 99044 233606 475910
17331 475910 315137 116400 239034 110149 83478 21060 210377 268812 19005 159203
17321 159203 -51542 -16238 34721 -208177 385420 388342 303404 248410 10305 86682 93750
17310 93750 24071 335792 -19268 378580 -69878 358213 83835 155631 169493 -194380 119451
17298 214972 390343 -100324 213397 36421 155995 40247 331019 247626 407212 -10773
17287 121193 386802 65979 198935 -92015 -48925 18681 30578 65355 21103 117732 -148276
17275 15419 283080 -180056 405249 17014 182090 353504 37288 295722 -14494 29467
17264 -238342 27010 -464479 322732 269207 240115 200117 362522 22949 -169369 -106282 334515
17252 342539 147028 39116 -26283 322689 470761 183125 -1542 96802 200632 32184 201257
17241 201257 161342 495004 12647 186672 53145 181458 -19545 385213 48034 307577
17231 307577 -24623 416782 418479 271207 300283 -90352 40740 3820 154090 -122985 203782
17219 364408 -38017 206520 315338 409032 182727 270380 322083 287683 386378 -6310 599042
17207 143005 415578 40538 202157 437294 106394 236173 175353 395761 332075 188331
17197 188331 225077 476812 86574 63536 509863 274588 443338 12557 304742 172080
17187 172080 -36279 -77208 184599 185973 76056 290657 291051 120968 303727 386881 446422
17176 446422 233823 58607 -10022 417687 333665 52650 354415 318428 347073 290036 150780
17165 150780 111005 97298 375658 394589 72687 185786 192102 316372 494885 481655 241985
17154 241985 216414 184463 315221 221221 436852 274798 62161 271329 267961 127537 341149
17143 341149 407342 257392 404738 319364 507911 291083 -161922 37694 155282 86874
17133 86874 374490 684189 176375 451142 467386 195399 397528 162759 125886 299560
17123 299560 400431 454051 -43579 141271 185433 432157 174129 143263 464454 414069
17113 414069 229430 135576 351005 54673 280022 344910 222863 363020 461713 27490
17102 -32851 276367 494535 257539 213650 79071 500466 44761 250048 306359 695865
17092 695865 395353 387624 639729 550417 320363 399690 384198 243254 574048 583643 461475
17081 461475 149091 534125 304284 355181 312998 257386 488293 199511 257826 272697
17071 272697 588867 589671 123779 222668 476976 260671 376215 452217 547672 386793 398948
17060 398948 252308 271636 410952 315427 432870 506123 467378 365562 145335 513949
17050 513949 495002 295468 677880 76347 508842 607669 386890 460312 346974 515833
17040 515833 563090 295299 511202 595313 694985 434670 821311 529695 170192 540130
17030 540130 407334 811582 530338 705107 413441 587068 830437 667195 555399 874756
17020 874756 540575 545319 618819 583719 578393 595111 689298 739858 510879 375568 655010
17009 655010 672483 771862 990673 676163 903336 356512 917300 539568 394464 650201
16999 650201 777477 935527 572425 419616 683329 495097 594605 699008 584658 666200
16989 666200 642857 586632 634399 369512 295805 596363 486476 534590 543899 521205 649385
16978 649385 783976 1124186 742413 888168 593755 1002715 915586 751940 806467 928366
16968 928366 851245 746527 930220 1057438 1010484 960830 850421 627759 857283 928647
16958 928647 775649 912193 1098124 1183957 1044907 862234 867856 996186 966852 1058707
16948 1058707 970346 909818 981968 1037181 1243126 1076612 1038406 1114176 1121793 1113398 1025900
16937 1025900 789848 1013130 888440 1045805 1277458 1081684 1197228 1032100 1412140
16928 1412140 1071241 1341215 1394728 1144840 1143643 1030693 1404821 1467966 1235771 950537
16918 950537 1095593 1215457 1269666 1330844 1455985 1266075 1309378 1397834 1650812 1567616
16908 1567616 1521817 1309585 1421278 1347919 1433339 1715221 1331161 1618521 1726737 1333126
16898 1333126 1805007 1427902 1652858 1158579 1657767 1514946 1502111 1680740 1805842 1712005
16888 1712005 1669649 1720525 1552956 1513905 1921763 1818458 1813244 1994150 1888569 1990435
16878 1990435 2020028 2103918 1920926 1903679 1883327 2319180 2288645 2264508 2096968 2163221 2333489
16867 2333489 2394849 2296997 2026549 2112395 2611200 2230781 2465761 2246016 2541955 2281579
16857 2281579 2433381 2455790 2923505 2566913 2632196 2485248 2703913 2799439 2749574 2767474
16847 2767474 3129246 2513756 2782981 2953639 3064696 3137855 3072531 3024068 3217369 3554605
16837 3554605 3524377 3396134 3427998 3190902 3881206 3345248 3692048 3720422 3568378 3969948
16827 3969948 3658641 4111874 3903656 4142962 4597400 4093341 4298277 4488174 3892008
16818 3892008 4451306 4624931 4647971 4844026 4735708 5043475 4958798 5210562 5517945 5335064
16808 5335064 5356762 5625068 5888284 5655684 6156492 6081047 6152319 6224528 6323289 6310371
16798 6310371 6770660 6968398 7048673 6881120 7177514 7630902 7510044 7534748 7837525 8158881
16788 8158881 8055145 8510863 8725637 9057366 9115272 9322302 9767578 9856522 10216179 10627207
16778 10627207 10265013 10728325 11433887 11550208 11863758 12218046 12532421 13107090 13338028
16769 13338028 13722847 14224534 14612600 15120628 15482883 16018362 16421659 17053677 17690622
16760 17690622 18273545 19132551 19680775 20037075 20882169 22057949 22753089 23594019 24443560
16751 24443560 25511457 26267137 27269086 28584601 29613922 31316298 32498254 33731073
16743 33731073 35575800 37077690 38714012 40229692 42609585 44667064 47108103 48905619
16735 48905619 51743878 54760073 57354048 60264374 63912103 67361627 70772306 74838434
16727 74838434 79369259 83996660 88699141 93691842 99203407 104740589 110571490 117146944
16719 117146944 123265996 129574647 136168093 142635725 149358232 155345455 161387463 166755271
16711 166755271 172305942 176663019 179997590 182917317 184957432 186133486 185356017 184365072
16703 184365072 182081201 178685331 174716573 169884823 164165603 158673673 152139693 145714960
16695 145714960 139215770 131904813 125672263 119343417 113245001 107153213 101489105 95735677
16687 95735677 90553866 85773702 81165095 76515086 72316020 68430015 64830477 61304472
16679 61304472 58175338 54904397 52209678 49519701 47340146 44879138 42875257 40479303
16671 40479303 38895570 37007709 35341539 33693838 32266817 30927969 29305143 28223910
16663 28223910 27268970 26316392 25118808 24208575 23150426 22214010 21321002 20664116 19824523
16654 19824523 19197182 18360715 17725245 17310756 16828477 15909258 15483374 15088852 14744955
16645 14744955 14172226 13665719 13482344 12857973 12385111 12380655 12091784 11348313 11252713 10953090
16635 10953090 10474784 10345408 9950160 9591724 9388348 9536275 8748538 8694819 8777254 8570481
16625 8570481 8118294 8218378 7938815 7440612 7016883 7283290 6815426 6690848 6832942
16616 6832942 6697603 6687396 6138488 6083200 5752312 5809734 5796907 5480565 5577974 5493095
16606 5493095 5642854 5241313 4936865 5108293 5276417 4844577 4726857 4725237 4533563 4359442
16596 4359442 4454481 4389073 4083697 4414078 4266327 4115138 4190834 4081765 3780842 4031453
16586 4031453 3898184 3819611 3460280 3681103 3553607 3172503 3269383 3355406 3326691 3213362
16576 3213362 2765436 2892470 2988908 2983687 2998792 2893761 2545684 2884819 2938772 2682801
16566 2682801 2733445 2726932 2322637 2301098 2495633 2407441 2424383 2479011 2752738 2457777 2050739
16555 2050739 2478025 2203346 2299492 2324673 2227430 1951159 2123980 2089158 2188851 2120494
16545 2120494 2079495 2057022 1657436 2113135 1721843 1944305 2193782 2029594 1712165 1900653
16535 1900653 1612154 1617172 1283988 1803188 1955952 1721388 1659742 1437295 1732672 1483731
16525 1483731 1501186 1373519 1713495 1767123 1299386 1746648 1410122 1251962 1305300 1248198
16515 1248198 1530136 1410292 1353706 1178041 1201953 1414121 1389475 1570578 1674337 1453391
16505 1453391 1255196 1215136 1180774 1206987 1533508 1174188 1521535 998175 1099544 1106514
16495 1106514 1093846 1046304 807933 1201312 1184881 1219153 1576503 1159468 1516535 1017764
16485 1017764 911784 813013 1125805 822692 1088680 1092981 1114928 933765 1285138 1112905
16475 1112905 816231 744941 1178719 688903 992862 608419 823971 1140548 845306 973399
16465 973399 834210 1048057 970094 640992 675540 585851 1242985 437635 956932 708197
16455 708197 885883 1046539 727597 545256 648117 744381 1124523 709368 836337 231302
16444 866429 546182 439351 338134 788165 953105 870153 822885 578370 812149 611122
16434 611122 716640 575642 845381 721774 692028 698267 637819 567484 849992 804777 632734
16423 632734 858825 332799 648968 697945 760328 158641 541922 569543 838251 815762
16413 815762 415718 536679 563441 537415 665253 690842 633586 911429 439353 434909 318757
16402 318757 540765 361715 521226 408204 876839 252503 381417 613702 631716 759401
16392 759401 632825 501805 664364 377531 501420 584772 310113 588951 539227 210195
16381 636697 531937 444019 251921 445419 636795 623452 569897 700762 344028 554978
16371 554978 275074 383166 180521 462689 883233 387976 486590 246768 108395 622284
16361 622284 39115 125193 458262 454020 322576 249125 210937 522704 651660 499020 588892
16350 588892 353861 182107 368180 374603 123640 365018 112012 579407 238365 -18148
16339 471063 546434 441995 487100 168154 -5220 426526 246149 277872 417600 430309 331395
16328 331395 403691 300175 738101 222551 352760 136115 -14287 214886 407621 237420
16318 237420 307901 186167 649929 464075 388999 541469 36533 344851 234750 272978
16308 272978 237127 225592 91159 396366 111150 244301 228028 350576 199319 164849
16298 164849 436615 155744 289474 371521 5813 366936 175789 330844 261502 354730
16288 354730 350921 277377 151559 103733 317185 -35079 246514 284939 110356 202039 12169
16276 263432 451819 220302 212745 248795 267281 593352 504258 110969 301237 535207
16266 535207 501831 112023 163670 423583 70913 -8145 169805 486981 436138 488087 230
16254 10324 31490 140799 -131320 177908 53741 468436 277905 147172 270548 143937
16244 143937 224477 167750 407571 315748 276922 553416 -142888 378479 278384 410145
16234 410145 266222 385018 261391 -198602 -147931 237142 321620 -39069 -107298 -242122
16224 -242122 26849 302042 -112641 272850 819674 223639 239509 314733 104877 286154
16214 286154 474282 325987 150849 300889 -226127 -28518 140281 203683 561110 119887
16203 63233 -57909 306896 72509 8229 -30928 317504 -198222 349114 184036 187987 298283
16192 298283 126171 354699 384942 23791 45666 -80477 -72638 171361 89604 -89197 74688
16180 277523 -146355 182435 105624 82895 30485 113306 117998 -83430 22679 180781 106447
16169 106447 -104564 347222 42230 99172 -181598 129588 45687 102345 95165 278992 203716
16158 203716 189237 51396 26214 -292800 260207 -55964 272053 31817 46301 407453 160781
16146 -195864 235562 329141 -3439 -112921 202449 159050 -3300 -215737 221988 66406 184026
16135 184026 229942 64093 63687 84882 -193366 -253399 -143860 -254104 -198743 -44312 94646
16123 -36272 -70483 -701 257679 17593 253523 183144 -22222 129361 -249395 145271 145877
16112 145877 163685 -27213 -221998 -44721 -237634 325 57102 109426 51234 -5773 234690
16100 -262356 34490 84451 43838 77526 6877 -176032 -139989 274883 376068 -52995 133876
16088 -64495 174644 95860 25082 318549 123677 -245669 -165591 38799 21411 -85133 65849
16076 337632 151175 99367 -58852 158854 79512 211679 223694 -182976 -28862 417047
16065 343500 -185493 204308 164072 67910 50033 -218871 396701 -42923 -244358 300696
16054 13978 -45359 146648 -8529 44811 -2045 -55647 -95823 115116 -200669 -375712 -127509
16042 -146870 -164457 -376305 9015 -84458 73256 -177038 235258 -73625 150361 -95010 142663
16030 -75974 50950 -48083 -209283 -1238 72537 -71294 -146072 -195173 -199261 197214 54338 -99503
16017 -13036 27274 -181881 10560 184100 90218 -248496 -93197 126299 -336226 291989
16006 10219 -204568 -53871 92606 -72807 -160529 3230 -115728 -341691 -42348 -185463 202730
15994 -48260 -262692 -183530 122447 380460 110950 132566 -127385 -204883 80078 -1700 34082
15982 -87180 -98604 -36643 -23084 -143293 108306 -24418 300195 -200726 193036 -249799
15971 74764 119377 155709 17414 64219 292889 440006 141127 6088 -49769 111244 -264756
15959 -264431 119027 -61071 33502 -457728 -168627 -104318 116265 19484 -219850 110928
15948 -61675 50707 89671 106360 312429 -6537 -84549 -91491 -53012 187269 -22125 50561 -247608
15935 46770 -69855 -85867 165959 45997 163620 -217534 -61970 -56153 306953 -458703 765
15923 -150128 -250751 -54379 106838 -382796 -48836 54780 -253535 92735 128068 -40598 293411
15911 -267486 -230781 -1518 -129671 -162943 227609 -222311 -98312 -112125 -60844 -49431 148755
15899 -232735 188469 5341 -227704 -50633 -356895 -275058 -229099 -231686 -19423 37600 213543
15888 213543 141076 -71110 316807 235309 166364 102105 102637 -322683 37706 -84848 -197128
15877 -197128 -246606 -223900 -251553 -13453 -61711 -93756 212387 -160547 4938 34751 -153446
15865 160537 65706 -108549 -166344 29729 -253976 -264282 192548 -142762 -114301 13021 -7465
15853 -207102 -128395 -546 -256549 -147201 378267 103096 19431 -88440 70601 -290 278895
15841 -11600 -397997 -7565 -115255 -75216 -74426 329637 288364 247185 -18705 -28710 -67308 44749
15828 -93134 -41386 51058 -18071 -98727 13794 -108227 319617 27714 424189 -107609 -28319
15816 -92797 -16171 -34933 -86422 -136831 -90787 -47285 -114121 128489 19299 -159328 66420
15804 53607 49806 -248818 -44379 -352758 -175627 346457 -29659 -397526 231426 50634 -270744
15792 -95355 -24143 -84191 -135355 33189 3637 -377027 142995 -20657 -209826 -422829 -108869
15780 -171352 -106230 393175 263669 30430 115774 -15296 -256277 -283636 -39695 83151 -45449
15768 -101228 151210 58589 219354 -115292 166694 394302 -278633 -177453 -10284 -47203
15758 -47203 -149691 -311205 -329648 -160415 -91737 -243813 -112697 177407 -183150 153082
15747 -299418 -289063 48629 -43715 -160493 141931 -204580 -120118 -114145 111427 -313001 -9375
15735 124977 143697 -214474 44546 72897 59958 -266435 335474 150210 -149027 -82243
15725 -82243 101117 18229 199906 -220479 -5911 -59998 -67108 -307576 -318219 -1201 -324724
15714 -324724 282500 225497 -80530 -121688 66751 36065 72542 -36465 -394462 -216315 -196726
15703 -196726 26414 47671 -262522 168147 11653 -44694 -170047 23909 366910 -284549
15692 122442 270318 -245827 -94675 167884 33795 -202416 213476 -113876 60840 4888
15681 -65588 -115030 -85489 -93684 -234066 -97402 72278 -317870 -13182 85180 -253816 -173911
15670 -173911 1618 -209660 -450165 -29893 -207007 -118815 -80899 462305 -32610 -54174 8005
15658 267398 -33192 171346 127535 -60486 1812 -271747 10740 13690 -458879 35006 -66335
15646 -182054 -131185 59837 -223836 -362762 -105795 217183 165543 177847 -114602 25520
15635 -52455 183982 41409 -7821 -345706 -273361 127898 248130 -33390 85665 295874 272007
15624 272007 72990 -363320 132233 -234784 97696 104057 -9656 121099 23916 -163535 30113
15612 -59960 -31515 115676 -55182 -118300 200891 -144809 159249 387113 -108901 -87883
15602 -87883 204372 543821 -247856 -112181 35204 -289756 104229 35580 -23530 -230621
15592 -230621 -12368 -58056 246769 127741 47787 -78099 -59009 152640 -127214 -37754 258760
15580 -251045 -22860 -288926 34168 179638 -105365 103660 -307649 -15520 25446 -16652
15569 172380 18861 -192244 127953 -27621 285039 -57112 -119727 70343 56174 -103954 -141796
15558 -141796 49953 -120926 56423 -218558 164577 -138613 -101205 -62174 -104128 155462
15547 -53837 56480 407293 109073 -196710 -72430 -120303 225026 -101027 226450 -213538
15536 -239121 -106020 199250 43186 11530 120379 -102134 -18111 84722 -152144 -147713 128592
15524 270103 -21574 -83232 -53024 -194995 -52032 -77076 -98115 -82870 95964 14816 -138397
15512 -308719 303914 26003 -92832 -45568 -194456 19431 -162440 -69486 -175868 -10715 198157
15500 -100000 214658 218967 -218494 -15203 276937 252582 104946 168364 67139 122939 -205933
15488 -99121 12952 77231 182574 -16 -98130 -95108 162880 5014 118577 99436 -34435 -211834
15476 -211834 -105017 -119263 89235 35410 -65911 192701 -197697 283858 -44262 -134392 240291
15464 -37892 -157641 -251029 51216 186927 65518 194351 9446 111558 13054 -17007 234711
15452 -228438 -193836 8278 99873 -64838 219765 -45791 324562 -301978 15473 258232 133266
15441 133266 -224779 2883 401900 156534 119557 282968 -70424 115284 34742 -67827 103459
15429 9734 78959 -199286 84798 -220352 -294874 202373 13652 44707 -170672 -34846 -72681
15418 -72681 237437 -113349 -402336 -63511 -202132 155003 159808 64756 252997 -271911
15407 -299690 -136009 -88838 -60556 -80571 163366 -106548 -126630 -81599 -81598 -471000 166963
15395 183534 -372571 -125706 117875 -278956 -31962 -144856 -38499 94654 102718 -83084 193377
15383 199390 -860 -212831 -132874 41419 141990 -117054 -465544 20935 -154328 -186138 17412
15371 46631 -1667 1680 163891 -115644 52990 226773 135731 108451 -202899 -223495 8834
15359 -63979 -48331 117065 -612700 -205336 231554 109300 20185 32084 221879 -95136
15348 156729 -11540 222789 -149925 -75674 172144 -58796 -43284 -222569 2233 -24115 209493
15336 -190719 38660 84666 -413010 134897 251582 -51311 52154 21259 -120413 230725
15325 79913 299258 172330 -6999 -15634 -37576 26476 112046 -36764 343451 31373 211693
15314 211693 356911 -145746 -41361 -23840 39459 126535 79340 22774 174461 42479 28193
15303 28193 282244 -296331 40499 -46025 153607 245049 -82851 177568 25618 158896 -75153
15291 62654 -81443 373563 194892 -168189 37191 160326 86239 18054 118443 -103017
15280 20902 25040 177830 15160 -159897 107965 -21716 -204458 204582 -42351 -154488 -85308
15269 -85308 -183359 -61832 148843 -20620 212775 -77800 185593 -76830 82148 135747 411245
15258 411245 72579 3459 285709 -24853 226910 -50398 107855 -79345 -144576 118811 -71310
15246 249068 61463 -48195 41714 264944 263223 190193 5749 51272 157661 233853 291426
15235 291426 677826 617077 824917 1679518 1943802 1667877 1714150 1461680 627573 775056
15225 775056 466362 374433 69614 -53741 -81400 147672 102487 213508 121469 -4580 9985
15213 -279762 -373115 288748 -90052 72037 163458 -17655 150916 170334 -71301 117713 215988
15202 215988 -224497 -147532 -188439 202992 167670 31129 -46864 203781 180764 -96307 277806
15190 -45828 -171618 158720 -50607 -134115 121243 102968 -252650 51787 -67151 252885 75740
15178 134328 190694 43726 15070 160401 -249830 -400550 -9119 76522 -17074 -68416 213393
15166 100208 -187954 -126873 122561 -58126 -20581 84817 4516 102372 -19629 -442992 334080
15154 -33689 213864 147347 315545 -27976 270743 -47943 -75534 32995 -116537 135150 62348
15142 119376 202587 -53068 212377 234992 233946 33304 117833 236025 135737 168715 -119843
15130 -43857 487569 -19110 235995 206727 316093 -165371 -96102 287342 46984 233975
15120 233975 243439 -19668 328663 326395 161778 162508 302613 18908 418586 15924 434747
15109 434747 157148 135777 59298 382750 148421 127167 363831 -8454 359195 63860 -103111
15097 -72903 -95594 254755 -298953 292937 313721 330534 159365 231592 253305 -75951 216474
15085 144398 174216 193567 -59306 76147 -325537 35531 62665 387455 -42200 492183 309780
15074 309780 187850 329362 -157804 96833 -9200 324484 184124 84392 2931 218728 142420
15063 142420 70279 140546 -13562 217368 -119799 182942 59126 182727 430264 -208215
15052 102980 101314 126899 -94091 196939 188656 -26889 486780 175439 132719 185100 172535
15041 172535 105205 207707 98938 160681 -6730 486687 15739 199300 53026 -26571 584002
15029 -55248 342023 -56611 -93063 118651 363290 6111 60602 319920 162691 64372 113733
15018 113733 373215 312184 8661 24282 246302 276139 22281 148441 206965 -10645 56120
15006 180935 3201 164668 279386 -87029 475043 290786 360027 -5 -21366 128954 35237
14994 172954 377823 264537 285082 -25856 237726 212822 140000 -31306 -228946 -31710 196350
14982 178332 136632 142316 340880 702122 130046 17151 223858 357609 66179 341952
14972 341952 186575 454076 282718 377331 465139 -63709 103974 205442 237143 299946
14962 299946 435398 267353 242621 343683 91461 -149982 231148 291846 284775 314037 11663
14950 -80066 64910 290493 188478 317925 513150 323916 25912 -23486 -266513 421191
14939 482208 159138 140112 214661 210831 169499 11009 272401 358924 402769 187836 73965
14927 572620 201270 152971 210853 319312 356376 299396 97227 332725 239200 474780 369286
14916 369286 372412 645592 443359 582375 480779 143537 385316 301132 170706 416951
14906 416951 35690 318843 433754 304029 266037 493754 374984 363804 350930 315593
14896 315593 191435 337229 296295 61440 316748 311690 248459 501306 444050 325797 520978
14885 520978 218976 373344 115877 399093 619595 397884 308688 604711 230282 -55570
14874 375801 348671 262541 483638 276375 711070 285836 106221 395602 485592 231613
14863 395524 525775 463954 553690 560324 171046 190700 447729 382533 119927 459567 301673
14852 301673 235796 58527 57925 530688 543222 333322 81429 332895 487208 388891 464216
14841 464216 667265 267857 267912 443544 365040 683403 568420 444430 344345 582326
14831 582326 174522 727838 426750 264578 275845 466531 520117 556599 536991 219387
14820 511931 469019 327497 334960 486845 575868 618684 312834 475719 380672 416963 538442
14809 538442 446731 541851 691982 243112 287397 427374 597703 574211 281758 338750
14799 338750 530690 461075 501064 408441 170402 782323 444631 -99201 573629 159959
14788 -83844 613661 535571 484892 546693 524696 677316 517699 578860 577948 556796 366453
14777 366453 586348 139294 499661 672754 374614 209011 476396 423044 711182 616988
14767 616988 819808 678143 965060 556640 274193 628528 492699 422944 466925 798706
14757 798706 709041 560541 140789 733752 650173 824167 756927 746246 590121 705385
14747 705385 475978 632623 820359 549089 366145 775290 525253 737546 801105 779285
14737 779285 971496 722606 492806 642765 660967 640523 659530 870608 514505 642783
14727 642783 812370 415009 814724 968781 742789 558272 894121 576228 936047 1098449
14717 1098449 1042371 960332 1138117 938978 875924 487194 687874 713515 613057 719667
14707 719667 876638 576791 694685 643174 692927 682760 707521 666199 891937 737526
14697 737526 891902 934116 908030 958058 1068317 1014439 781049 738576 879387 902988 546548
14686 546548 1320136 754088 712390 1009577 826000 675924 1139901 700816 719684 682229
14676 682229 922845 685665 1165263 887662 675786 1017878 1061264 1160126 674934 860060
14666 860060 1061201 1228606 1075597 903067 894548 868680 1042906 805785 1045599 822968
14656 822968 917208 1212870 911453 1105728 1427984 851558 1140358 822939 1259312 1179148
14646 1179148 990179 982271 950369 1252078 953221 1201995 1169617 1290833 1097402 1356850
14636 1356850 938988 952384 1177447 1023517 1196460 1248456 1199651 1144425 1197923 1054975
14626 1054975 1163969 1277672 1522771 1415338 1343356 1460472 1324072 1273924 1472647 1309810
14616 1309810 1338585 1286298 1384221 1366964 1624495 1174324 1063018 906509 1607316 1318854
14606 1318854 1654092 1481475 1510607 1594474 1506229 1232724 1625083 1609223 1932580 1568831
14596 1568831 1447536 1664104 1421399 1445752 1670243 1470674 1631785 1579909 1804190 1893074
14586 1893074 1515124 1776622 1791253 1640539 1564318 1785504 1536327 1819817 1908781 1668007
14576 1668007 1727482 2013228 1891953 1661724 1929933 1749807 1738283 1847256 1980743 2070120
14566 2070120 1874208 1915001 2320458 2318579 2088198 1980525 2017038 2274263 2243436 2330582
14556 2330582 2304059 2445016 2441634 2446178 2614969 2614586 2402911 2224609 2557887 2887759 2865308
14545 2865308 3088880 3378974 3458300 3492074 3781817 4107104 4788813 4903919 5629596 6707291
14535 6707291 7932484 10132515 13466767 18670828 27540923 32210834 20720182 13047924
14527 13047924 10017069 7340139 5060239 3498725 3217789 2694510 2632391 2507564 2126943
14518 2126943 2415432 2538246 2067193 2580100 2396888 2338927 2555096 2578396 2391061 2191070
14508 2191070 2527947 2599538 2371126 2512712 3014070 2730272 2799340 2670591 2830639 2933630
14498 2933630 2824024 2900646 2762445 2827848 2899499 2892997 3225923 2861110 3078161 3155335
14488 3155335 3172177 3200009 3294109 3224925 3048369 3301959 3208005 3059994 3424728 3621343
14478 3621343 3349670 3617087 3430794 3273945 3433472 3641417 3758293 3615594 3829786
14469 3829786 3799533 3775109 3839263 4127980 3947897 4041736 4245611 3863971 4286160 4166305
14459 4166305 4442355 4223138 4281021 4323939 4183933 4786548 4519184 5045060 4768828 4787945
14449 4787945 4491139 4761444 4926315 4623066 4876900 4843251 5034885 5151306 5091044 5068505
14439 5068505 5464443 5620644 5405657 5331007 5550727 5659146 5547800 5553937 5669575 5948605
14429 5948605 5775170 5860163 6135642 6133293 6133518 6151924 6400169 6418257 6396761 6784545 6571889
14418 6571889 6692664 6906907 6895696 7136092 7408437 7562969 7291309 7389404 7428366 7773366
14408 7773366 7821731 7632413 7993882 8382539 8169673 8062757 8184072 8317303 8820888 8450419
14398 8450419 8570569 9214795 8947730 9481804 9700451 9725028 9440643 10131720 10084580 10220276
14388 10220276 10278062 10287927 10607553 11017001 11370992 11133138 11425546 11509549 11510381 11805678
14378 11805678 12163574 12281091 12756573 12528529 13243531 13132649 13486183 13660268 13834932
14369 13834932 14206524 14505666 14904983 14822495 15523363 15639723 15921204 16349997 16511458
14360 16511458 16875342 16743990 17295780 17901042 18412191 18690893 18605471 19349882 19383148 19851120
14350 19851120 20434114 20864778 21716890 21415197 22194640 22788732 23522954 23748887 24483008
14341 24483008 24815646 25118821 26174539 26639030 27631123 28016561 28567799 29505764 30258324
14332 30258324 30901404 31631669 32698147 33325814 34179222 35248759 36126684 36960188 38328423
14323 38328423 39173778 40165849 41586853 42780539 44002241 44968661 46597129 48273506
14315 48273506 49668962 51370955 52965682 54333485 56653764 57921612 59996523 62494402
14307 62494402 64553797 66533659 69522248 71924578 74289458 77143522 80301619 83443424
14299 83443424 86531573 90040123 93745631 97740248 102042832 106222367 110851388 115485056
14291 115485056 121027097 126108589 132061393 137839164 144629111 151457295 159068462 166107941
14283 166107941 174472295 182946171 191882580 201905141 211773877 222533830 234277321
14276 234277321 246497083 258580698 271975458 285569773 299642065 314560972 329190986
14269 329190986 343486952 357385634 370842779 384492788 397092994 408175082 418036817
14262 418036817 426766300 434224182 440923805 446675201 449882374 452372563 454619639 456564416
14254 456564416 456190832 450610909 444537335 435970152 426170426 414656026 402446242 388645927
14246 388645927 375687029 362626162 349362106 334972755 321390265 307607409 294294059
14239 294294059 281208048 268676996 257709085 246099921 234780218 223707333 213405988
14232 213405988 203740198 193786797 184077668 175447164 166859024 158601181 151098869 143819642
14224 143819642 136938660 130956689 124966511 119501898 114283335 109143719 104812477 100589125
14216 100589125 96775502 92947603 89243689 85775986 82266251 79013874 76225944 73101524
14208 73101524 70824617 68159301 66058392 63705588 61513639 59594321 57448140 55725198
14200 55725198 53906046 52334901 51245110 49193362 47461882 46423753 45293178 43825528
14192 43825528 43116211 41784841 40392184 39079163 38476061 36847303 36355787 35240019
14184 35240019 34275315 33290962 32610717 31898341 30603088 30210394 29749121 28876616 28150279
14175 28150279 27366774 26487702 25975923 25398015 24913260 24066050 23470150 22736538 22535216
14166 22535216 22377743 21674234 21139574 20824300 20203254 20118745 19809913 19267574 18547654
14157 18547654 18493245 18040263 17716933 17402449 17087221 16640223 16196146 15901028 15715500
14148 15715500 15588274 15315211 14836093 14853818 14545030 14096599 13869949 13696445 13500289
14139 13500289 13495107 13035820 12767992 12556760 12607056 12205614 11933107 12270510 11584750 11502959
14129 11502959 11233177 10993313 11093009 11113140 10725387 10743389 10532899 10109732 10186855 9466312
14119 9466312 9672772 9525046 9745685 9384839 8991527 9322175 9130443 8886615 8654241
14110 8654241 8673992 8247946 8551956 8208191 7782337 8177279 7735454 7453703 7460867 7546416
14100 7546416 7741832 7442512 7222146 7343929 7216599 7138486 6952141 7171801 6623004 6495751
14090 6495751 7019499 6602499 6407871 6399687 6504821 6077514 6373960 6291616 6118694 5994019
14080 5994019 5903694 5775303 6074402 5852733 5433285 5528253 5447084 5565241 5127016 5299974
14070 5299974 5500617 5181317 5441235 5161616 4988913 5033567 4969866 4970489 4703260 4952588
14060 4952588 4594518 4550847 4588997 4523751 4490128 4541293 4505582 4426344 4505801 4188680 4273721
14049 4273721 4414455 4310125 4043443 4129214 4231137 4133584 4027363 4064660 4084725 3713611
14039 3713611 3728070 3825740 3566233 3546051 3462351 3759765 3568081 3626832 3398644 3491710
14029 3491710 3510647 3385651 3383765 3225993 3368819 3457039 2867198 3248202 3125160 3157258
14019 3157258 3396319 3431760 3138294 2858469 3109969 2904508 2960940 3185370 3218883 2965494
14009 2965494 2472716 2462819 2962911 2797068 2829537 2624923 2729216 2872398 2695892 3090014
13999 3090014 2868509 2755001 2681121 2449027 2639344 2372911 2309025 2337825 2518007 2540290
13989 2540290 2269625 2623082 2341042 2239614 2389800 2377469 2293803 2461450 2396705 2583461
13979 2583461 2870279 3190065 3718812 4222476 5291358 6806067 9674037 13827845 23073377
13970 23073377 32047358 23500196 15090111 10385406 7502105 6169352 5120487 4745767
13962 4745767 4310860 3848183 3369531 3169863 2885027 3062833 2837378 3127577 2717746
13953 2717746 2833069 2596757 2383116 2627037 2341047 2620377 2213412 2402034 2033939
13944 2033939 1998933 2303838 2030529 2229660 1911516 1813034 1900900 2198153 1868122 1699925
13934 1699925 1841359 2013145 2100486 2162343 2424059 1785586 1801906 1898427 1868390 1727605
13924 1727605 1820243 2004622 1708325 1856358 1874137 1572265 1586086 1868913 1578640 1439437
13914 1439437 1600898 1686296 1748506 1616214 1958744 1574553 1819665 1588748 1703570 1592108
13904 1592108 1419306 1616053 1931247 1644511 1556865 1349005 1441816 1531050 1734511 1541611
13894 1541611 1413501 1625656 1716418 1779919 1555854 1614517 1329911 1379901 1033128 1239257
13884 1239257 1258666 1569017 1448176 1583501 1258269 1327102 1536475 1343844 893980 1341993
13874 1341993 1304363 1265230 1315214 1148132 1330685 1391246 1403138 1132791 1331668 904048
13864 904048 1401298 1159697 1155356 1371419 1148498 1156080 798321 1418460 995059 1180583
13854 1180583 1121439 1119176 1242589 1000152 1089382 1228212 1266029 1033396 1186670 1215144
13844 1215144 1174976 675469 1007982 1263982 1016045 1197543 893666 1040615 1166649 868747
13834 868747 986684 1148240 956865 709812 1189560 807362 1017319 694973 933108 1103912
13824 1103912 847555 1049112 854051 1068955 956834 1070905 1069373 1088194 842475 766752
13814 766752 1176945 1057024 1022347 1217791 701447 836787 728898 817809 862469 1020298
13804 1020298 755740 1071205 1079987 683273 701956 867288 919271 905979 794943 801201 854858
13793 854858 811243 1114374 993022 1099830 919751 941165 994995 800933 1028586 605998
13783 605998 817966 703406 832359 929242 905834 824132 1059225 1081032 778075 967792
13773 967792 856607 675451 588201 950344 1017135 810973 691148 523008 735216 491564
13763 491564 754694 742936 780774 959035 840739 960384 513416 784762 548055 924729
13753 924729 463643 697694 736456 1162325 1019831 698837 1081201 665709 1028105 990629
13743 990629 752306 707854 515690 275996 505514 461943 977002 874490 754118 701263
13733 701263 778700 750798 808311 392112 473085 887772 479830 371921 561949 676099
13723 676099 941595 516185 309979 538848 843084 499232 710881 390583 828774 659155
13713 659155 556019 404333 758832 350867 822180 639595 405646 544090 591532 659954
13703 659954 596081 425114 719811 766676 504500 789180 819802 441064 236372 317394
13693 317394 584641 466170 613194 603274 517971 512842 226720 773406 435161 590895
13683 590895 690824 504925 660452 762783 460962 583994 642010 846868 708530 584649
13673 584649 506159 305056 639016 470217 688922 559072 499559 715772 504537 569107
13663 569107 269062 404096 703746 759179 545963 73501 520752 614784 498815 391550
13653 391550 266024 411924 321431 425852 63393 489346 315189 585880 281114 435580
13643 435580 719059 419851 170156 759625 110946 53923 398817 405062 347559 695109
13633 695109 477085 829340 478532 419373 444951 518393 305204 371138 346181 350173 575994
13622 575994 128750 599284 481507 308892 570021 713446 632930 545511 287187 613275
13612 613275 268576 302221 563666 333524 733121 59080 508677 256051 268141 405279
13602 405279 287633 323073 285434 515769 331558 99038 269443 557341 308331 694885
13592 694885 594499 187242 565993 310299 524088 207799 386804 540205 325538 195107
13582 195107 474865 40309 15581 -45540 417791 526122 307294 386977 301734 274334 166321
13571 166321 303444 699791 499497 357877 192872 527040 677845 65505 334104 289669
13561 289669 331554 622740 255733 639153 132848 235706 700804 277308 450288 106713
13550 490227 252073 167366 30212 369445 557535 375675 336182 227213 252912 240423
13540 240423 34365 155819 577475 528568 544771 266194 118085 429052 294592 455102
13530 455102 424897 668423 512302 430077 82601 316232 207401 28862 181409 264041
13520 264041 337344 153462 163022 318940 310343 213042 345162 554372 18115 440437 58025
13508 294882 447468 155823 442043 210577 170375 288662 313130 433489 534649 176661
13497 499083 424071 471264 -130421 435272 -357 12240 265206 256133 404741 87482 485990
13486 485990 263430 410943 5279 266503 278754 669701 348413 93453 186008 189674 87779
13474 -75366 320686 268970 215310 290646 184745 296214 413709 452128 173529 163125 231186
13463 231186 410553 301379 124872 646466 225632 184827 498256 324890 239242 238792
13453 238792 390815 -250416 572076 368752 473893 529878 431473 233207 -30746 257692
13442 16951 346038 371070 39143 162617 226817 -61159 280204 508171 141995 522455
13432 522455 -56035 49378 -213553 187845 120954 -44406 82047 105781 197168 100693 461166
13421 461166 199585 411057 572871 633826 331272 143899 241272 406791 215048 422741
13411 422741 130633 325754 315524 377662 10492 55770 309430 -14807 -10329 282523 78618
13399 279995 226159 -17849 76084 317174 491508 75584 476199 176149 379129 522034
13389 522034 73946 -11811 131379 394906 -43484 36541 206642 -189519 273748 -101475
13378 388109 19550 187400 18936 -118888 38721 25676 291476 474856 304336 -15728
13367 404969 101475 196471 59445 513426 298554 -358761 -17832 530203 73283 227715
13357 227715 -345504 300339 -85438 392299 -71912 453309 4003 116278 363239 214461
13347 214461 216659 363734 85176 204614 54514 5616 33750 137045 317423 353409 289937
13336 289937 72932 256322 386586 212096 137285 279583 262417 282842 172730 248032
13326 248032 455200 524323 80380 308012 354298 395325 488588 239141 151239 131653 304632
13315 304632 373042 158399 92257 126665 207692 151862 65420 129776 299405 115784 239622
13304 239622 76444 262515 -112114 232732 152003 277861 123955 422510 409519 -54078
13293 165134 190103 477034 89134 240308 -19269 81841 11113 74835 394247 -126224 -61793
13281 13881 488107 3233 -41600 -191397 210527 167077 304312 132838 430906 201818
13270 -22369 -85742 -223810 118416 8168 393629 -44021 220108 301266 118967 388587 348687
13259 348687 418160 26665 50206 -163398 -45182 102968 149443 329595 483337 -331031
13248 166827 -45921 55812 178479 69978 49248 154735 -65332 160531 31911 216518 118506
13237 118506 266319 270883 186198 60758 143634 173655 418075 -202228 212716 198583 132122
13226 132122 196742 41872 161593 -329772 187666 196137 52338 -91038 124933 283559 184050
13215 184050 -32778 331721 305233 157907 -134239 134165 223532 151195 208625 273104 264512
13204 264512 369303 187053 125957 -31496 -34721 463526 139516 264789 271317 412892 247462
13193 247462 162531 172298 -82109 283968 206154 -302911 154128 436758 -8253 -31158 217707
13181 153301 155495 -127654 120407 167493 -48732 -38432 257043 -84197 -13751 -8376 40048
13169 -59737 -69041 66339 142672 -117450 8098 320749 276983 286580 -146923 340931 69020
13157 -208327 -354978 114497 162713 294218 223486 313112 -155605 44466 -42381 25176 -42124
13145 209287 -60062 340404 -243445 73426 32050 -178539 168023 -7312 221460 79789 65774
13134 65774 96293 -12895 47821 216555 179512 -172988 -165733 522448 -54632 39634 -34142
13122 26284 87970 172308 194668 -345 -255151 230290 276963 -37101 171104 -7448 129064
13110 62068 229023 81206 228073 124997 166598 -199173 159963 131161 34194 267088
13100 267088 -71694 267986 172677 -35993 -217355 -83877 82190 100569 -186852 60479 15604
13088 339988 -140917 128774 357286 14705 -76427 123552 114830 418056 -89486 -11338 65241
13076 -312463 153663 108201 81315 153336 -280490 183175 -139194 84197 11124 128515
13066 128515 157952 -219398 411470 191129 233183 -8186 -162500 -91647 89556 297759 145580
13054 -220134 253484 -245646 29278 -90324 -186215 -129394 -120966 196624 83191 7572 -51813
13042 117647 224382 228855 -13185 143108 273621 -109577 -197288 400097 -222256 -238624
13032 -238624 28753 179229 -71959 -46423 191018 -62081 194661 233852 71255 -349187 424595
13020 -145510 91746 215912 -235539 26445 162454 302088 133861 -34190 40604 156613
13010 156613 276435 49766 112542 88450 132169 125597 -129164 167256 -19963 -19155 -203281
12999 -203281 224360 75344 -336683 93657 60256 43072 -137748 8664 -31614 -226219 27689
12987 255318 188408 45154 -203511 230017 4617 286071 119447 416773 -5669 232610 485579
12976 485579 171362 162063 232034 400166 223859 288851 -89768 144954 247397 228008 -8431
12964 -7248 -77584 -37180 -45075 -156872 8574 89581 -65101 36268 150627 285396 -34685 412999
12951 370951 115828 -75787 151197 -164590 128093 55436 83603 -18645 -118961 268486
12940 -421334 335543 5424 97162 93543 -37664 -51925 -213928 250952 -30523 -81168 15464
12928 98466 103740 89620 115748 -225427 -76347 147396 166409 15484 150733 120638 147715
12917 147715 267522 290342 -143131 -181606 -113187 -277154 -99547 -16469 277569 100219
12906 170387 126013 305657 -58629 -6241 110243 -20514 -211680 193874 200727 -86565 67106
12894 207473 -72256 86754 -281741 296110 216415 -192953 38188 143631 -98129 110029
12883 205995 343852 -131687 167101 101386 -44222 -36026 205853 -338060 160887 -88667
12872 4342 181427 29523 88673 -137077 -209952 -61803 256735 -154190 -33616 152273 -110390
12860 187243 -466646 -119514 30735 103868 222884 17343 96717 109595 -269919 152856
12849 -227223 -84634 231457 124706 101578 375831 326544 -159982 -185989 -78636 -43214 130372
12837 -131063 122124 -231991 -96882 -80487 141445 -10781 -235650 -17361 -177839 69865
12826 86321 -2407 476372 -119148 -328063 -209786 179145 115465 -108236 -78151 -370609
12816 -370609 -72576 -119463 61803 118951 201934 -343849 -32442 210234 -22660 -12369 -59849
12805 -59849 -154816 272042 66419 164679 -117479 24525 -154372 113696 194693 -134043 130263
12793 -319287 56388 48767 -71919 91411 -227942 -145745 38572 116788 -210627 -171416 78301
12781 -26958 -62061 69651 -46614 45652 -32115 386 -85248 284046 172684 -38056 -295672
12770 -295672 123944 166613 -156072 18612 410782 -178809 306009 184551 -32140 218804
12759 -195207 367397 129551 23488 72683 226373 -109985 142506 169959 -212197 -218261
12749 -218261 -56629 -116300 210255 -117964 217492 32013 165042 219771 396477 -109146
12738 -61299 23337 -59570 124234 5952 -307018 -62381 -47698 42460 147121 140193 -201965
12726 203040 1420 118893 466273 -208271 88770 160480 -77319 -85998 316288 95731 -121584
12714 153854 58281 38700 -45048 274330 443222 35899 -17625 90521 -92326 -130510 142437
12702 173684 49771 203557 -352053 83600 -57637 -95550 -106869 389756 71984 165104 -232711
12690 90867 343746 -22685 262361 -53433 -276680 -102311 -41018 94770 52039 64568 -78084
12678 121238 -148858 -528118 131115 31507 94306 58810 64124 170983 218227 -203086 -99883
12666 213463 167937 -167102 33057 71584 -201159 177125 223869 268790 79405 36136 -147679
12654 76312 326905 346284 100338 239919 219494 94435 79447 175878 124322 174258 381603
12643 381603 -193018 16845 455139 351197 9766 -36609 98851 30347 336028 -30110 65785
12631 -258376 136157 -67681 378389 -74353 -178683 286302 -92547 355181 -311713 372108
12620 298859 -4115 172232 -185760 235653 211311 283124 260427 274983 594366 17534 -46
12608 117593 -390062 104148 458028 -78132 113540 79386 258374 12839 15601 -138881
12597 160932 272039 208446 207814 -96178 -276899 269248 18234 256687 -165 143125 101666
12586 101666 -67798 27188 369445 285653 53822 -145163 406831 98352 -99278 -101748 -23968
12574 -84876 127816 -4436 37125 -46473 -218178 -183256 -110816 -20011 -63989 84155 -72153
12562 -6177 80564 443315 81269 -26463 -17859 227211 159413 108578 244557 -182709 -159463
12551 -159463 362 47690 91038 123298 118652 -110429 -71579 -145007 95054 -86647 -172863 -274080
12539 -274080 247423 564227 348212 -108127 278426 -215764 172553 53336 37874 -196623
12528 -90020 -17545 34450 -319403 146580 28970 -259722 -124767 103918 -13860 149564
12517 -146678 4102 87795 368691 -23111 24776 79142 -219705 261311 98309 -103471 112369
12505 40398 -41490 341317 284274 177497 -14099 -12864 78334 126365 -68212 302589 203007
12494 203007 -204972 -187229 110059 -91471 -57937 226518 90633 7274 -37496 -93633 -29494
12482 169562 12778 59730 -35897 -174183 359185 366448 200709 -118073 386996 -54868 -87835
12471 -87835 76019 221424 -27924 53341 73766 -35632 -133181 53835 331242 -105686 -74977
12460 -74977 -141303 -170685 -26269 -125160 -178338 525035 -58478 11804 481004 144997 -294436
12448 80848 -84116 196857 37256 190653 -150598 133671 -15808 378543 -119288 -225072
12438 -225072 -137253 -82310 6398 155384 156352 -155228 -89781 -8762 -241559 111867 19888
12426 106588 -580 117683 46736 232447 -38366 369706 -4388 -83273 185694 -312961 -132254
12414 69996 -40848 110519 69622 34141 184654 -29545 326241 -161333 20869 -70014 618827
12402 -57032 202109 -242617 255002 106439 -51317 -121215 -188702 -86230 85337 180242 -43410
12390 59516 -171359 46192 -160897 434776 -39115 -51778 -91988 -242427 -171385 -336541 -189170
12379 -189170 102357 69867 -114993 -157400 -53950 -107330 -161456 154587 -341460 -129132
12368 15364 -383312 167106 196875 -209499 366477 -60018 52855 298897 91284 -61334 -33588
12357 -33588 357423 60219 26393 176112 -50464 -56189 -49801 444668 24745 -84653 -27134
12345 98507 42468 -22164 172179 31540 -82795 150157 72698 -67863 -81690 41427 14884
12333 -36060 230421 -102290 248365 -101492 218117 145088 -16318 -17367 -155515 -93491 75596
12321 3740 11751 3435 -26136 418523 -203887 -177055 447348 249624 187543 -175357 -224399
12310 -224399 -236974 -40612 -196476 30807 201608 -165683 182286 419768 167311 -301274
12299 -102541 -207192 -192201 -361516 72622 -89948 1044 -146018 25009 -464215 131719 -118681
12287 -67684 151339 334122 37092 196825 -318838 -13802 331640 -285814 249743 181203
12277 181203 -150515 -188274 -50077 -152408 -60077 249386 39530 -297200 -74314 53428 377694
12266 377694 69485 -286660 -121469 -138571 -305138 165072 102460 384163 276637 -49248
12255 163158 182265 130812 -20139 64118 -56832 323867 -172442 -146005 -83092 31529 93772
12244 93772 -23175 426170 -224112 176716 -91744 -193223 161648 212685 -336380 317147
12233 319437 -189834 -189548 -49417 58302 -152665 -25766 248760 104982 -358344 209616 191051
12222 191051 90229 -12760 486790 84017 258151 -94157 147457 46114 189154 385584
12212 385584 204761 144638 -132385 347621 320280 316330 -63800 188579 368003 197736
12202 197736 123075 243893 184635 306959 47559 294189 -162295 242437 285362 84777
12191 -14186 160280 99134 382107 129591 -27525 132908 153998 340850 -26682 239662
12180 292864 -141603 277831 143653 474391 305790 121434 546373 273444 131814 -62181
12169 -76364 228484 242298 219625 -56137 127108 199707 122912 232978 427932 339106 282412
12158 282412 84163 251315 259483 -2511 50286 305849 227444 -3912 -264796 -175964 177633
12146 69351 -131929 45338 -23816 19338 159182 130656 46585 194124 353276 49115 350648
12135 350648 203762 -135094 -52278 -62317 346444 300861 209659 106956 217950 285794
12125 285794 173021 51553 63706 -117642 176125 83257 -121455 154476 -123482 -288315
12115 -288315 -138751 72530 181935 -25788 61654 528831 -125631 179268 452235 101056
12104 6905 -185732 91099 -196870 168795 -139194 -23415 72484 105375 20156 -502626 98152
12092 -32042 524804 228876 319197 -333699 -391323 -33154 -275202 -83958 -62585 95504 16072
12080 25850 -326594 -44049 251852 15387 45193 -62492 -187768 255340 -93650 -304382 -185030
12069 -185030 272136 -209004 -228217 -227575 75429 -16261 -3547 11005 272168 -18307 -94962
12058 -94962 -125232 226512 -344563 7644 381723 -143368 -124606 178723 278774 240891 687227
12047 687227 521629 127505 83059 159881 120287 -44978 -33482 94354 -49758 264870 -40299
12035 59093 -200633 59295 34839 -66074 254039 -268110 -215076 -117601 -291205 -86103 -80814
12024 -80814 190231 -42988 299698 241452 -102671 -118043 -130827 -86482 -258109 -162036 67089
12012 181385 -21210 252016 250423 155689 144002 -69656 -327949 -20477 -102339 -46731 55888
12000 -75711 25285 15297 -169685 67297 -7257 -180621 42061 -28721 185039 -201591 370523
11988 -192540 -204228 -42108 21995 16775 -155115 147871 -172031 92373 112804 14395 -22478
11976 95668 107314 -506826 72618 -276433 -302892 -361387 129508 -8196 88927 -218719 422949
11964 64210 40678 388584 -195580 -71974 -247600 -25573 -393476 -77552 -264035 30861 309061
11953 309061 182329 -269119 -63624 -6713 -289341 -308882 -25601 94650 276431 -125289 14019
11941 -422 134476 214432 -207602 -106816 -68637 99193 -107520 105473 220352 -162452 47729
11929 98591 59571 -15938 -273077 -27512 -135578 -116509 -176473 -44127 -61531 -17375 -260421
11918 -260421 -70009 92541 -245429 29694 174108 110436 -137132 64738 23282 220875 -15596
11906 -60741 -368285 -193865 96505 67733 -431433 -205486 -184663 -181669 -16512 -22614 54226
11894 -48276 -123324 -135951 -161283 -73704 6653 -33167 -68430 143855 116319 -97781 -3916 14438
11881 -128519 267938 -44472 121231 165111 -82588 -277166 229627 57150 135709 -13670 -145152
11870 -145152 -2069 90974 -273434 41395 -86564 -113575 -99316 29901 99888 -351962 -5620
11858 -541088 130493 -115623 -29396 -120875 278719 -334520 -68132 340538 20862 -320854
11847 48838 -256490 41988 -188306 102239 102728 276606 -109202 105893 47062 18741 -13472
11835 79662 27221 10348 34109 -244427 -198080 -16659 -255423 -397565 -308562 -18509 -176705
11824 -176705 330868 48858 -223594 247072 -320569 -244387 -55102 67569 592 116536 115177
11813 115177 -164935 -148354 187447 -39060 493599 154296 -178137 -296688 193845 -68213
11802 145605 197597 7296 99399 110547 116019 76427 111720 -169971 252626 -100269 69142
11790 -37139 38622 147347 -55854 -36804 -150438 47592 -98409 176903 -249445 -236607 -17764
11778 18527 40296 -30067 14289 61204 48565 -45359 148895 -252683 161056 27091 43860
11767 43860 173223 -90210 363561 56246 7155 267764 40557 -7938 12670 143687 23117
11755 113634 11590 -9864 -118401 -448399 91767 -46258 48432 -140021 -159269 128254 -190403
11743 71778 -154561 -280178 -430635 377273 -9831 21911 252720 342297 -24720 54399 -148829
11731 -92477 28183 -71626 124043 -20955 165370 230180 193526 45722 28862 -94843 -143810
11720 -143810 -99681 -196451 144758 -58371 169402 132761 -84478 -16559 -194952 88677 -447545
11708 133951 -116229 -4377 -145248 45932 -65916 -82730 -71507 147807 -38326 -82265 -27584
11696 -137398 227633 -47489 115030 -69615 15310 -80421 102917 -147235 -17883 106883
11685 7803 -337118 -36221 -86566 -161784 168498 25547 -6018 -549592 212813 31649 60634
11674 60634 -84046 -89606 -203227 60430 42028 126094 129445 17534 -239424 234423 175906
11663 175906 -14738 85143 28612 -575798 58493 -197300 -6240 -62546 49678 -160887 92186
11651 -21805 -202657 -151906 -164420 13920 -205289 -23775 107846 -132384 -29979 -58438 -81073
11640 -81073 141967 -114088 42527 -219531 -59795 140255 -97483 89949 -146167 -137869 -161205
11629 -161205 -159231 -127050 -128364 -178666 73090 141563 -401420 -122727 -232069 -272007 -107833
11617 2820 -311350 -315053 -160779 -121993 118707 209528 -95173 73774 285170 345067 265812
11606 265812 38695 120131 14877 4373 -179434 48140 -160703 -196645 6119 -50251 -148345
11595 -148345 -189106 -362907 154780 -172118 -86379 192946 29148 -273810 -79349 -378687
11585 -378687 100445 276990 12682 40253 -170260 -242067 67723 26081 212168 -448845
11574 -128162 138742 87347 168498 -24235 16376 -251923 188962 -14553 -321097 -97962 83611
11562 104080 -20250 240569 229329 -107676 110259 35338 156826 -65724 -35579 70940 -169207
11550 251255 220712 -147375 25778 -147835 -6408 82169 -251640 189099 28051 -211614 -10680
11538 -25769 136230 -150465 -499950 -73217 -108157 -22069 20660 116504 263055 -116539 -70522
11527 -70522 -95759 21481 23819 1699 6398 57801 373799 -192916 100019 -39361 -82056 82007
11514 -20062 110609 103538 -271351 246988 262688 168175 -8286 -62175 311638 198108 138512
11503 138512 -81744 -63021 362304 154436 153429 133911 416472 -68444 58709 -47822 125319
11491 32756 162431 184441 -96886 151623 387686 144658 216023 111595 352498 322967
11481 322967 160360 31525 144990 146613 97198 11552 314609 51878 181558 292989 356397
11470 356397 198211 -44875 67483 140895 17159 194512 121312 277641 -1644 43360 99165
11459 99165 -5042 -9381 132687 278939 -56737 115238 -107143 -21853 271626 344953 272419
11448 272419 153985 309896 191526 877 328814 -8309 207918 18973 19184 280214 163729
11437 163729 -252 233904 283482 -15548 161739 -91869 215211 -38044 195004 303114 176826
11426 176826 -22564 311688 -110303 37858 244839 -41859 -231871 21462 -54376 -202966
11416 -202966 136902 138508 65398 -45025 294493 137291 -166553 134393 107492 -238078
11405 -46319 21811 79366 -9533 96826 -140368 50390 -103255 -125845 327075 -57078 230443
11393 319674 139212 118438 213559 -203298 129770 -38719 172817 103893 43438 90753 157429
11382 157429 2422 183367 -134389 296352 91389 -228752 -334571 -88188 5183 -2081 29564
11370 82514 -26239 208938 -91246 130885 12690 62632 -245503 174116 25862 256590 -54806
11358 -150566 56347 -106167 -113053 -237603 227146 2458 -46193 -182966 -27695 9819 178334
11347 178334 -69070 -154549 -16393 -38556 -185117 -26475 182851 3957 -274615 79238 232400
11336 232400 -18922 -184302 -32986 96999 -81134 154209 244150 139893 -37052 -188298 -164158
11325 -164158 -14398 -169064 -58629 -66230 169263 68163 190937 299033 -338317 101130
11314 197403 -199276 18728 -57089 -215890 -155822 6470 326951 -149610 -172760 121506 -227636
11302 -207160 -112567 -84024 162491 -92696 -196259 -154513 -365757 -8246 -15304 101497 172427
11291 172427 216764 -172489 148996 224252 -120431 40772 32234 -29545 63547 237126 127921
11280 127921 -121878 -152268 -78735 -3885 -190340 -123768 -193304 -203610 -202486 69729 -109498
11268 -42229 19576 -264100 26110 305650 116602 -289182 -296539 -96452 -1694 254228 -198818
11256 -256493 -155090 179691 102020 -118745 53822 299 63116 244323 39440 -169451 -93985
11245 -93985 67753 339294 98054 12530 -221223 305773 346512 -88443 -260851 37226 27722
11234 27722 21281 -10734 -55651 14165 -172998 -11255 268023 32638 51734 -148888 185369
11222 -36481 -63289 -34188 138113 -104343 -431055 23866 -187712 151124 -117341 214227
11211 153493 115220 -198726 7828 -128436 -176411 -66087 -163717 79492 204764 136949 -94092
11199 252475 -52111 93787 141051 -149993 -17151 -141274 127829 35649 -85140 -149026 -2491
11187 59642 352033 131802 -134480 24272 -116 71012 -33176 -404531 82066 -221720 -83027
11175 -34779 -181061 -43575 -152703 -125285 -528266 -82564 200885 -258854 -137101 35134
11164 98510 -161347 -96382 -372613 -151980 -169848 -152040 -183923 -64013 61609 30390 -99043
11152 4585 -12518 -407857 147040 -229692 -27609 -83833 -18810 21981 -26490 -36249 333689
11140 61203 10092 167383 269379 69185 36763 -80569 98911 187280 15587 115373 -89866
11128 104338 -83061 122626 49443 -70079 -220287 -62812 -129062 117574 -52300 -296336 -31502
11116 202387 -108953 18314 24524 -96627 151063 -245996 -188669 179447 118825 42275 -22359
11104 -84004 154444 -195645 191746 60733 60935 -73864 -197813 76012 -31022 122715 129420
11093 129420 163564 251281 56512 203944 216658 295217 527160 152791 200182 370375 166716
11081 319462 -43753 392952 285090 119170 315822 389726 20960 266190 323872 308514
11071 308514 152719 146507 165931 164665 323071 137197 17338 238071 501084 259406 323628
11060 323628 303585 410267 344443 374105 289531 232343 361964 423535 698431 742277 533614
11049 533614 619720 510304 644918 519495 699669 552465 472245 682613 733522 667776
11039 667776 803308 937970 928833 519993 741752 600166 1045689 1014118 912468 899144
11029 899144 863862 888782 1110268 510742 918021 1233169 1222567 956308 1015917 897394
11019 897394 982472 1070847 832505 923008 625615 757204 1196185 900638 713980 860394
11009 860394 443146 899988 874174 962915 675169 718908 675808 642840 789055 884132 465145
10998 465145 597127 1230292 580960 677620 967069 749973 686227 1008727 714367 526555
10988 526555 1014747 461191 715387 933656 696832 1142596 1129599 828116 637853 1056910
10978 1056910 1020475 749907 838048 889190 1307087 1066132 1093296 1089756 1074758 1256671 1415716
10967 1415716 1406539 1316597 1928230 1724427 1657922 1770021 2216702 2580305 2656174 3209815
10957 3209815 3182562 3608799 3646533 3763487 3462936 3318023 3186803 2745374 2267683 2152697
10947 2152697 1609033 1368521 1283990 1155803 1211117 1152458 1178821 1108552 1056158 1116154 564760
10936 564760 503740 419488 240910 450300 358078 310313 482547 213135 81449 308436
10926 308436 225911 340867 54290 360129 128279 214247 381806 282382 8080 81965 477309
10915 477309 512431 255227 169008 139450 -218831 42936 -51879 -8872 190748 177147 25065
10903 58046 35056 -45244 35916 251108 6743 -21990 -43028 -283131 253030 283088 -78549
10891 224151 -84790 128885 -145811 98654 -14884 52817 170165 -188856 94774 -67587 -278886
10880 -278886 -18710 -72361 249469 -206708 228456 -556 -63908 -30704 125771 100840 -95163
10868 22606 -58394 151738 -120346 -235710 55792 -4448 -120721 -47010 -94892 -235288 -237969
10857 -237969 64092 68495 143327 -216225 122523 118118 -42181 -201869 35189 105823 -4496
10845 -304543 -258112 6778 -70111 -214321 -17365 -216734 214086 -49647 -172238 340703 63721
10833 -138946 -167724 -150711 -30617 12887 200502 54858 -157191 -103305 122584 -9632 27431
10821 839 -281807 -22237 117556 -294087 39041 128721 90242 -236692 218765 -127757 -165083
10810 -165083 -64527 25506 100674 -107659 439215 92644 263479 -258732 -226500 -363816
10800 -363816 17908 21364 -71331 51591 -247024 255850 -9540 177691 30909 90358 -146826
10788 200127 -237575 -174679 -6940 111144 -115433 -60348 -465138 143654 132233 -34826 -99192
10777 -99192 -193779 -26857 -167831 -24854 -81102 -34053 30293 231447 150568 -21684 -185457
10766 -185457 -72459 -24053 -294020 -318454 -112115 -20996 -70409 -89384 -139568 -216315 13277
10754 54078 225816 6273 31117 -231201 -102354 -180922 200780 -296225 -37177 227081 15332
10742 7862 -257946 21442 51843 -245164 28524 -10636 9598 28149 -51003 -164853 144474
10730 25529 -61113 -52017 -195943 87720 88041 -52275 182332 102770 -423246 195308 -154081
10718 119130 60550 235067 31285 -411809 -55384 208266 45158 244042 17142 -204261
10707 -147642 16169 76493 -93142 -110225 63661 13958 57473 -217710 -114854 -243111 -88633
10695 253330 -416803 339137 459183 -60001 -66441 -3877 -70443 -442431 -258137 -11504 66175
10683 45265 -64314 207853 -143207 205334 -317669 -342194 -218269 -222612 111440 -178544
10672 78699 -19079 -193630 209743 -204661 263231 -30952 178531 56879 -317041 -134260
10661 60104 334364 -243327 317662 33340 10299 16340 -48633 60198 -47665 -71345 -124539
10650 -124539 -93892 49661 -213638 -280751 -406767 -194176 24644 -24559 87262 -88358 137226
10638 -188939 -73909 -301286 -13901 45006 162850 -120279 -20730 274022 296285 215898 -981
10626 -40872 -230266 -77712 -101087 -128843 -159203 58731 -21752 -221120 -118908 200927 -108982
10614 164704 101941 -247836 -184650 72967 29524 150555 78422 -23931 -295545 -83776 89943
10602 -48576 151429 37816 -107356 -262353 -177219 110502 -279080 -73677 -164935 -133508 181613
10590 16569 -14734 -203767 -81824 162730 -204290 143133 284056 32016 -420263 -41448
10579 -45676 101530 -243616 181763 28952 -495149 -202674 102343 -363587 -328013 -40627
10568 126818 -81912 162552 81930 -20540 146313 -327478 -12343 -71798 19364 -99218 -202162
10557 -202162 -21510 -326328 104736 271643 96017 128464 -71543 17577 64583 -116164 7032
10545 107940 -181486 -160120 -126066 -562810 -162443 -142021 -39688 -332226 140434 -77355
10534 -25405 -199495 -302750 -55748 68538 -126424 -71298 191756 -184904 39782 62235 -93062
10522 174814 -56515 -28079 -189957 -367504 -141994 38621 -125320 3057 -81420 90413 268080
10511 268080 -72699 -92834 -277859 116970 55542 7618 262407 36049 95257 -80665 32120
10499 -94043 -401824 -103803 -8058 -323151 49485 -358240 2276 -27817 -268997 -185636 -26958
10487 270532 141552 144280 -132804 -109296 -161878 73093 -470133 50580 -19108 110198 -254823
10475 151949 -420466 -18850 -67797 358720 -302201 5553 -75114 135914 5807 -126672 435626
10463 67159 -101825 120085 56971 -255096 73580 -265622 18484 -106469 34393 -183341
10452 -218779 272071 13350 -155159 61052 -202482 -147573 -111453 -441727 234301 65256
10441 96206 -131890 -245680 -209239 122121 -35795 67035 -520825 182066 -162098 121176
10430 -124838 110656 -112320 179936 -617105 143629 11943 385918 33480 -269717 19177
10419 164616 -353093 -193026 -231270 -241943 -147537 84967 -191077 5143 138011 -35937 293084
10407 -266660 -199553 -126211 238789 -15923 -493212 -379 -296261 -284624 115908 129170 143559
10396 143559 27592 -101563 63863 168402 166738 158080 52075 130094 58169 -249927 38680
10384 -289500 23857 -59441 49933 -52268 308117 -95513 6788 45072 261311 352747 160092
10372 80976 520159 254342 -89938 353006 325602 93489 -163882 214882 344191 366794
10362 366794 193136 183338 213560 317272 377386 142216 197002 363214 249880 444167
10352 444167 645335 544512 414791 437176 445124 277990 490446 103610 137474 317729
10342 317729 -65642 229249 480274 543405 343182 714572 921140 878352 720632 351902
10331 666276 157785 281225 187776 175044 324070 375201 111947 136516 107558 262996
10321 262996 299955 66889 202098 265083 192378 55838 267789 -73792 68028 488295 285888
10310 285888 84819 198059 179858 453973 -223670 182910 82033 165659 163402 187537 144814
10299 144814 193101 57444 294872 44006 160575 -100137 120722 -35715 137528 -45555
10288 44366 -184918 -292783 -56851 -263720 120793 -116627 -457702 -174966 -433944 -465726
10278 -465726 29856 2694 -144139 95142 -37398 48212 30681 98746 -138753 248101 -153081
10266 -208148 -95121 -167870 294564 27906 -125647 2955 5380 -176450 262070 63516 -203947
10254 52071 -24831 -81938 46879 -30239 94340 166013 11900 -139546 -83950 -121894 29523
10242 141175 -200512 94572 272830 147496 98250 293442 187446 36536 36334 -104540 186527
10230 82894 -24374 -125483 134861 -30586 -78688 388456 -61040 -203859 -476002 -179864
10219 28267 88886 69901 55592 26369 33337 204327 -218530 -81717 57472 19115 -585 -75184
10207 -75184 -170339 -231554 -268647 -624631 -38711 93305 -438859 66538 -126191 11756 72925
10196 72925 66291 -224900 -121396 -31395 -91275 153571 -18693 -229710 -69114 105586 -81321
10184 -98353 -79153 -322008 44302 131124 172108 -147317 -372128 -155510 -64336 -28859 323626
10172 -281027 -285678 -223608 48207 -27238 133768 -237886 -281271 -50459 -10538 142475 -178594
10160 97937 55765 -115777 -117614 -163169 259535 71705 -191728 109320 151061 -169336 31712
10148 125466 -172700 -241709 -198442 14 -18231 116462 216096 -115152 -47156 94152 -227854
10136 119797 -171763 -44945 46538 -162131 289415 -177876 -130550 57519 -2803 -150046 356186
10124 186822 -340710 65375 140613 -145402 -277828 -56907 -104939 -142916 -293788 66515 218288
10113 218288 -15752 -98180 105964 -6266 -31560 -75804 -411980 112391 105638 -168371 127713
10101 -259680 -320412 101446 159394 -329946 53707 203618 -61911 -179387 76410 -37154 -158039
10090 -158039 -233242 -68975 118768 -263974 -78251 7174 -97522 -414913 129358 7936 -58359
10078 182974 249876 290016 44604 -90810 16495 1493 -85858 -134083 52390 -108990 -240635
10067 -240635 119633 59681 -101634 -146411 102701 41758 -4764 -184866 18687 232 -21128
10055 -308474 286566 12251 58893 65902 38890 20928 -43155 -313920 67810 -27797 213040
10043 -98609 228495 132053 -69102 -294823 -119043 -97501 -333867 4285 -24378 -340395 -447968
10032 -447968 97858 -86208 -128251 -83362 136548 -188488 -425571 -57981 -107118 150886 3432
10020 -65422 -26927 -98841 -62818 35496 -313358 -158192 -27240 -350187 70081 -43308 -283746
10009 -283746 -125184 60503 -183971 94737 240025 -145876 51025 -174874 -70125 -248484
9999 -248484 97974 -108688 128039 -30550 -210516 -226842 62932 33332 -125338 -72443 54839
9987 17834 -54967 143702 -29624 -39293 -28128 -43693 -99182 -183140 97757 -255989 -9782 -2772
9974 -9158 -423606 -19303 -86780 -64566 121202 -320847 30584 -276700 -96447 24353 -300569
9962 -148921 66769 -26760 23706 -314248 -142268 -486738 -212558 54885 142182 -111768 -114280
9951 -114280 -327778 31680 106609 91264 22373 -14783 167631 -173446 97607 -300904 78742
9939 5071 -143300 -9436 -123603 156743 132313 -179988 47709 10008 -223923 128724 -233444
9927 -32171 -155371 -233246 7225 -133167 -292332 197137 376556 -28487 -524222 124365 203844
9916 203844 -43017 9034 -146535 -154037 170718 -148643 160960 211939 40015 247998 -101258
9904 106224 -154892 -181654 -393245 -282939 -90902 -188798 205587 -294430 165337 -49381
9893 -64228 188362 68422 66345 -109667 -218416 -429948 -522355 26708 58466 -328783 -107405
9881 -111819 -9945 -83828 264663 -152896 -162331 -542244 -165931 -271101 -173597 11316 -4994
9869 184274 251963 159196 160282 120136 -95023 -220769 -64454 -31494 165783 1260 -101461
9857 -67518 387493 207400 -253060 -125989 -203929 -273050 -46614 54621 -162716 122936 -25007
9845 -4440 -41170 199431 -114952 -81372 -89295 -259878 -49756 -10310 -319759 76193 -263611
9833 -40169 -80248 95718 326831 -18806 -134342 -167212 -78805 -43269 -316655 92119 -314012
9821 -161218 4701 -185098 66399 -80765 91407 -154080 240916 -154847 -87282 287812 226538
9810 226538 443239 -113629 -2669 105258 18364 -207347 39564 -97940 264714 59508 -93094
9798 -69078 -251179 -156715 289531 438977 -58158 -321802 96899 -49168 -254096 -157960 -180394
9787 -180394 -175187 -48247 -212688 123877 -100344 294103 -19154 -130184 -491017 -56810 297086
9775 -260136 -251506 114997 106620 -287945 79561 86643 -385763 -285108 75686 2126 106991
9764 106991 212121 -30986 76097 -87620 -413980 -157353 217633 -75695 12566 21942 -24439
9752 -347921 -99529 64794 322479 -264400 304803 44074 134801 101556 171151 -323560 -235905
9741 -235905 -284376 -91784 -172276 -249222 -102764 58183 -127604 -293376 -36462 2344 172594
9730 172594 -188872 -368898 -4660 86226 -328599 -32556 -97310 -102888 -188917 -389041 50339
9718 -193191 -98572 -279819 -146435 -185551 45342 -334774 -288428 -119766 -23845 -117342 -253809
9707 -253809 -146129 -93371 -347520 -86516 -55132 103810 -20473 -249027 -173436 168554 278349
9696 278349 61894 -108189 -256922 -130111 -224454 -97101 -76058 112315 -43235 809 -99843
9684 -222464 100804 -326245 -285880 30392 -67226 -169451 98479 -95823 -377756 -279419 209661
9672 -54782 -316715 -109950 -219642 -12396 -58066 -13711 -85450 70520 -409625 -77159 -90268
9661 -90268 154238 46871 135976 -339380 -219162 13415 153154 -255214 -88736 -288606 -249844
9650 -249844 -95505 14564 -133999 -268965 129070 53851 121275 -36154 -106766 -99684 -35320
9638 -273715 46580 104361 -35782 137169 52774 165418 -104037 -80848 -402634 -190274 190709
9626 -74239 98438 -370268 544921 98702 129769 -104564 92249 -159127 31540 5498 -52862
9614 61855 -77262 -298623 -234167 2845 -172622 -147893 -220498 164562 -466961 9356 38387
9603 38387 -139250 -42438 -525366 -144244 15849 13699 -202150 130683 -126122 25627 -21654
9591 -242989 -234413 25432 -42999 138234 -390213 5689 176817 -103549 205829 171337 -292982
9579 -172515 -26616 -112677 -186119 51224 -309457 157836 57373 -132562 77925 -18963 -215122
9568 -215122 -131089 146662 -62353 700 -99729 104751 -139252 263045 -58245 107362 -89186
9556 293949 114180 -551031 184473 142749 -83995 165056 81734 13266 270911 160626
9546 160626 -339267 -28330 -208866 -161961 -57018 -343755 -207655 11501 139225 79808 59178
9535 59178 -184992 18380 -258031 -28530 229417 -266612 -125097 -171119 158742 218697 74723
9523 -160436 48614 170517 -32498 78599 -245646 -330413 -217166 123298 216888 -137625 -269288
9512 -269288 -132357 -210976 -18529 266739 42095 -39030 -149783 159463 -226903 -84635 -25703
9500 14976 -290644 4349 116400 66159 -199313 243399 -323323 -115685 -88187 -89852 -276232
9489 -276232 -75384 -98965 -145935 -82164 -225953 138232 59988 -276622 -126110 -54883 -208927
9478 -208927 328513 -58484 -153215 -51403 135396 162765 -10332 -166020 -179869 -128865 -13579
9466 31560 -108789 41515 -37836 -52275 -160816 -50496 -58319 191901 -224180 -36147 -231266
9455 -231266 -144290 17209 -135265 48090 -442002 -229171 -227792 -160033 -244635 -43477 197578
9443 -474283 -18693 72524 -60335 -338274 203793 -151142 -364120 -45094 156938 -46957 84686
9431 -273409 247304 56255 -109137 335344 42846 251920 16128 -105190 32718 -86490 126795
9419 -160186 -206914 -393480 -234060 -168731 27032 327698 76715 -272615 -110188 -105162 -146816
9408 -146816 183451 -39541 -256521 -145939 -113008 -81565 -104154 -18207 -376841 180295 122919
9397 122919 -905 -18483 -167272 -51331 140185 155570 68215 -44115 -102915 -307289 -99017
9385 -69755 -50842 27714 65177 -171879 -107308 -329991 105242 -247450 -32790 94503 -32671
9373 306124 -244308 -169340 -133067 -180650 164599 -93187 -94798 -159962 213915 -80480 150001
9361 -98885 68444 -76258 -195407 -213416 -235845 49747 -268122 201167 -162186 34929 -31868
9349 192483 47810 -284766 -448085 36322 166053 -122075 -180068 -273363 142774 -53104 -349999
9338 -349999 -86111 57278 -123644 30655 -163548 41010 170619 -55029 -103615 52407 311632
9327 311632 18455 -53271 -143382 -227715 69136 -95915 159514 -436630 -122976 -42915 -150658
9316 -150658 88995 -286286 -313425 7884 -155544 -49776 -39752 80908 86866 -235736 236570
9304 -107484 -164288 -68649 59098 -39968 -353060 88078 -150903 -19756 -32233 -239471 -254351
9293 -254351 -69296 115412 310285 -3010 -198341 -364102 -29297 90494 -105935 -54439 138827
9281 -68763 -65739 101592 -14306 5881 -144728 -13780 -244430 -112426 53868 -237328 96630
9269 39129 225691 -112134 -195874 -184918 -222620 -322175 -437185 -204577 -298176 114638 -109624
9257 -23675 -106109 -309820 386195 -258144 -23602 95292 -413324 -211393 30697 215265 360168
9246 360168 -363153 -115782 100074 241930 56143 -238236 -286863 22801 -81238 31756 -94018
9234 13935 87697 -29685 -197841 162836 -440096 102304 65912 -33577 -151758 -244497 346595
9222 -126721 -15369 135415 -118771 39321 -125322 212428 -109955 23906 -101386 11484
9211 141153 345037 10336 46806 -270246 33208 50839 -2210 2792 -104833 188001 28227
9199 164390 -140732 154796 414561 -154987 -78972 -207893 14904 135830 1329 -259790
9188 13782 -19454 210314 -108331 40455 -45211 -165562 -154351 42566 338246 45590 -40024
9176 83776 175251 -417430 -279252 98087 -291694 2497 127793 135598 -345460 95239 -100892
9164 44706 107983 111283 85027 200544 102075 342391 -194856 -245981 -310909 -226161 -84091
9152 142785 -23360 11271 -60684 446462 306216 -124159 -154518 -33104 -87809 -66633 148180
9140 -112370 199247 -67031 50219 -57833 9894 -250617 -265670 -40479 -153976 -334198 -239468
9129 -239468 -75843 24727 -104523 -218884 -74623 191917 -76457 -364475 21500 -13185 115128
9117 -285690 -280850 -176681 12348 -201821 -31137 83700 -169378 62989 -59003 78763 -8089
9105 77110 69133 9676 -83761 -190512 -112214 201052 -397642 -329168 90362 304965 126877
9093 57441 -84811 -144414 110282 75850 95542 39312 112195 -34280 -107359 89431 141822 -106937
9080 142861 -64607 -274025 81903 157447 -88800 -180424 222614 -284563 -212290 -306195 -278778
9069 -278778 175495 -190937 103659 160358 -101902 -55781 174727 -195704 2735 35639 13399
9057 -61595 -252131 -238615 -181851 -236511 297689 14729 -151159 -185620 -260199 -311670 207883
9045 93638 81214 12403 -215334 -184170 -91312 -317260 99121 12721 -50188 -72238 -179596
9034 -179596 -94558 -78277 -105840 -246467 -179081 -42325 120868 -314012 -232821 189074 -184203
9022 -136474 -136058 -24372 -240338 -97255 221893 -329343 -78125 100071 224896 172794 -205415
9010 -146198 165078 8679 29397 -29820 -86549 -326164 -82752 460542 112451 -46924 47140
8998 -170904 76429 5609 -158712 89584 -95923 -252596 -16270 -130360 60349 -217711 -202570
8987 -202570 60204 -377410 -31272 -150554 -250768 -106195 67338 25844 -135489 -88371 241199
8975 324647 162194 -305930 -117273 -392836 -99304 154753 16993 -286805 163568 -223639
8964 -94163 -94043 51726 18742 -307660 -327777 -10996 -175118 -451835 87543 -84902 -282493
8953 -282493 -194059 -252669 263990 292179 -43263 88323 -56050 -178557 58926 32414 -291425
8941 -21944 21686 -184336 139887 167223 195717 59484 -73299 161165 -56564 -141672 7202
8929 -233554 109358 87903 -355908 116802 -162230 166590 295985 -68194 84496 383136
8919 383136 49855 59415 16468 103990 110615 -62125 295032 389668 481710 1094323 1057869 1835592
8907 1835592 3056839 5055358 11223968 5074399 2469172 1299182 779678 298510 315447
8898 315447 82274 38141 344659 303890 295691 -2858 336610 369659 214248 -3307 13171 -46274
8885 -373435 208645 116191 20419 -232881 -84079 -110312 71692 -102716 -110331 49979 -13532
8873 63771 28012 2151 -330445 -233692 183814 -11640 -66087 -78995 -10182 184638 162151
8862 162151 54816 164132 -64421 -73451 81469 256452 -103236 -337940 104711 -58895 -37488
8851 -37488 17136 -288145 -123888 -65637 34460 -22799 -113173 -153890 -64009 -126753 -110560
8840 -110560 -202535 59920 -203952 -230329 -74994 -208985 -180574 -157840 287971 -92975 -476656
8829 -476656 -15326 58797 219051 -217981 -283777 88537 47954 92947 -82684 222332 -81895
8817 55014 196881 112194 33023 -82725 -163241 -214427 -146241 -387679 -115927 23916 -75316
8805 -334638 -156923 272033 71513 34757 196717 -147004 37635 -425628 25273 66356 -68157
8793 -20035 389323 -373233 -41037 -115767 -131285 167871 -364427 -99147 182650 -52274 43945
8781 -132742 69267 -38010 -26045 125476 19639 533286 -57718 -243995 54122 4147 483539
8770 483539 -210252 101521 -272201 190030 -170572 -314498 -234356 -99110 -180096 -244702
8760 -244702 216831 -15428 -178276 84247 -183812 -64100 1228 26477 -222284 -87340 87550
8748 35016 -134327 -145629 48992 -224163 161691 137029 34585 -322227 -156916 140764 143518
8737 143518 -80218 -114696 217427 80006 -23865 -136354 -388731 -64245 88116 261751 -334257
8725 6716 70206 -226668 -114128 82804 79449 -194276 51188 -257082 6596 5565 -182322 -59076
8712 -10222 -149559 -77652 -371782 -161091 19608 181777 -191664 89189 -155430 240134
8701 -390804 -79925 -24118 -30363 117376 13937 -139414 130406 228099 -115968 -147829 87797
8689 -18587 -17436 167958 38978 89068 -267992 217306 186725 -27959 52949 110507 -265470
8677 1260 -85981 -34096 -143044 -348680 -96242 236985 -64250 305288 31306 -174997 -122250
8666 -122250 27024 -164675 -34032 -114840 165616 32533 30315 -77577 85620 -15668 -107463
8655 -107463 16787 -43705 82871 -53289 61593 200036 -194074 172264 -41147 337195 7743
8643 184478 -36656 62957 17463 -84194 -71778 -4530 -232553 217272 -43499 -39447 153355
8631 -223223 -358156 141032 -4632 68137 -73727 -64005 -89512 -221099 -138184 -172615 -220310
8620 -220310 -299682 526228 -33463 -46285 -256331 -178872 -38940 -89309 -213683 -307343 61048
8608 -112805 -3514 154341 -136658 -85499 -48442 -1808 -62444 239813 189306 -55256 -3768 -42841
8596 -42841 -106093 157079 -217170 -84517 -13934 149894 251885 179936 131264 -76079 -161388
8585 -161388 61727 -178712 -237613 146848 110234 -128907 120955 -145295 -256328 30551
8574 -237580 76789 -128974 4478 -87757 54936 -151607 -85233 -59929 -242724 76327 18088
8562 -34738 67015 -109070 -213382 15662 -83096 -175597 -23490 137320 -129625 -221145 -16228
8550 -277913 75194 117892 -424236 23709 75288 -149094 -119090 131582 -55852 -149896 -81347
8539 -81347 250644 -112750 -221521 -39193 -324640 -189799 159077 59201 -87442 -264936
8529 -264936 -235058 -239385 -108336 -48132 -147045 65994 35209 -331536 -368714 -21159 43807
8517 40632 -161982 333341 -252925 -167777 -264048 -70165 -143552 100988 -247084 98757 -176413
8505 -64144 117538 76868 -192972 96550 124902 -95863 99420 -95810 -167045 -129734 -40634
8493 8167 98222 -7981 -235993 194052 -199608 -2939 -232693 194093 168484 77700 76139 -281562
8480 -70629 174558 -24297 32162 -70537 265453 108331 -11218 25514 -366947 -71452 -354248
8469 -354248 -80184 -74442 -186136 -206258 -176684 90324 -40716 -213503 -52923 22028 -131750
8457 -149424 201422 -191222 217452 2514 -303881 155678 -237236 72429 -20487 -321572
8447 -321572 -80400 276099 -70652 -33248 -338192 112051 -184503 68444 -183066 -134002 14384
8435 -60943 -194079 357968 -207248 -339747 154114 -25253 33134 -217148 -85554 74902 -136972
8423 -28163 68316 -167381 -106403 262251 56269 120412 -63270 -154591 -57489 -198594 222339
8411 269397 24717 -40332 169068 119947 -106327 99129 -341407 348100 -119526 93763 -59947
8399 -210429 48976 230888 -192676 -38144 105658 2070 30193 121642 44289 -229380 85321
8387 -96225 -1043 -26908 -51371 -180247 -112520 40315 -17886 122174 -104247 -107736 79800 -162502
8374 28308 -54391 48431 -30602 97647 19174 -125611 -141632 19922 376010 -148509 95102
8362 -269286 246768 -210460 173754 -235902 -42848 -106538 -89451 -155352 -207312 38287 187974
8351 187974 -248708 90750 -278240 -144490 -102476 8446 -132633 -215180 -173547 -195698 46050
8339 -130788 38122 4491 -57717 254283 111104 -121357 295738 244383 31442 -196785 -172249
8328 -172249 -156664 84950 37882 -96422 -63005 32573 47887 -149842 143486 217938 15254
8316 -206640 -182395 54567 -189204 -97257 295000 131041 -148338 139700 23281 -5552 -233670
8305 -233670 -219213 -359853 -112247 -259294 -108990 -122923 -225918 210208 78956 -9170 87706
8293 -101323 36025 -138459 56588 -178569 48476 -154795 114704 266292 -226019 102990
8282 81394 -13086 -21035 2899 -232331 61230 269996 -256398 -219579 -81007 -73572 199338 -213982
8269 84160 172257 67964 -82823 -123256 -95664 -240721 97637 76908 -238250 118070 165335
8258 165335 -117027 -118786 -423074 -109304 -17432 -21403 -13945 -369031 58698 -68436 -139439
8247 -139439 -75902 -168026 -193692 -209210 63207 -143781 -120824 -214333 -79251 -165956 269241
8235 -206461 -266005 -93509 370606 -31500 -94454 183428 28046 -338713 -103196 -142603 -16578
8223 -279344 -355724 68114 115413 44603 144260 -197068 -65313 -78086 -258548 -56324 -281301
8212 -281301 -238688 -234446 114956 414571 110531 208950 44752 92699 54553 -47747 -156434
8201 -156434 -84324 -30967 -88061 -43270 42667 -13738 -149954 -36992 -148032 50913 -105508
8189 261561 338656 13323 36309 212558 -164223 163836 -126868 -120013 258218 192147 132114
8178 132114 -132246 -21608 57027 -75554 100807 -243881 94044 -46984 -122686 27033 -89143
8166 -74939 -200169 15064 235903 -80132 -185483 -346409 -113907 -132791 -2763 -3970 238053
8154 -129426 -211716 -78504 273510 -72461 -228366 -7112 182119 52119 -62255 113620 -244519
8142 -39051 226028 115687 -95108 -107140 -52461 -22055 -57363 -76111 -78407 154796 -317821
8130 -197238 71617 -144814 24661 56681 -417355 49543 -105102 -4573 7693 -132966 -375556
8119 -375556 -76943 -216699 100325 50022 -36204 33561 -6317 24846 -16586 235142 -47902
8107 92874 -43878 12015 -242044 28407 219105 -83 -266236 -52929 -56524 120616 -204965 66110
8094 242961 -114876 -86649 45747 27398 -19917 -135900 3313 -104874 10728 66745 -9226
8082 -125309 -266589 -347168 53703 239833 -195435 87446 -270017 18153 352631 -145631
8071 -194820 269915 55554 14460 10034 120663 71664 -102438 -74799 24936 36809 -258288
8059 -231290 -240552 -240429 73595 -42198 48600 -79166 -9195 -137289 -48154 122107 -152448 -227255
8047 -227255 -35770 -310230 -88383 162963 -191607 -6381 -127519 -92794 28742 -10844 171960
8035 15764 71278 96250 -368999 170117 336002 191734 -140175 163962 -265235 48925
8024 -293662 29015 -145971 -62819 -59960 -117977 -180218 143188 64202 -185401 -102346 -28289
8012 3398 32224 -48731 92847 139854 53252 -404001 -119584 -71013 -233205 6431 112911
8001 112911 -80383 95567 -35543 -176914 298254 19392 -247405 71878 -177910 -106514 -92382
7990 -92382 -14582 49529 -108799 30572 68699 -134222 25906 -138767 11546 -189575 -254081
7979 -254081 211589 -197898 -131116 -141119 27984 144097 -412529 10198 6959 -533066 53815
7967 -215206 -173212 -2594 -237635 -120521 -163057 -169996 132185 118199 275698 -211619 -686
7955 108789 162528 12259 209341 206587 292404 -281536 69387 -111700 -211916 70524 -140545
7943 -25168 -398572 99470 -204288 -154814 -80621 -14770 197016 101714 -212385 14019 137523
7932 137523 -345550 -198756 -186845 394494 -181585 -316912 -105719 -12056 -17035 9773 117593
7921 117593 155330 212671 -106740 -206745 -66039 -51976 290250 144102 -255234 235789
7910 -169148 -63972 -77509 71464 23910 -69642 125935 -317827 -148614 106932 -110956 -40152
7898 -15788 -112646 -310168 56847 -252162 127350 -333605 164775 -144774 -183955 279522
7887 221111 -329456 -577537 115767 -114168 -39571 188223 60143 117493 93656 -19791 67522
7875 -53586 -236932 274455 -280276 61122 -262104 68972 18892 -157311 -136595 -307630 -93176
7863 -12576 -77845 152916 -179343 -88737 -117552 -260557 117296 -247236 -303072 -326189 -43284
7851 -144681 108913 -180716 7850 -41829 152780 166036 -288558 223336 -209765 126866
7840 -217880 -31571 -126848 -87645 85300 233991 50267 -166026 -124412 121171 136051 78778
7829 78778 16570 -73210 -53162 230187 -269117 -61657 -99934 125862 -22470 134411 65659
7817 165133 16970 -156754 -15197 -156285 183202 364258 -428657 191367 -10331 -40345
7807 -40345 167478 100068 -152627 -183514 172538 -126237 189963 8251 -4818 99647 -149139
7795 2064 -96834 -457598 -64508 107042 170996 -225983 -88036 -212111 -10288 127671 104309
7784 104309 57898 -278978 -152822 -349892 52288 130848 12419 229110 86878 -116555 -86182
7773 -86182 -269622 25123 -142492 -149543 -248946 -316582 40101 -192630 -36489 -83327 -34567
7761 112113 140526 -11230 -32522 -211415 -220448 -106835 -398898 -109607 28544 -23728 -156507
7750 -156507 -220084 -28878 -76552 -149420 -58718 177437 -166058 -428499 64183 -24248 24164
7738 -151400 88715 136624 143485 -250512 18166 169899 -143427 214792 -251761 -118207 -259065
7727 -259065 -258262 52211 -18709 3305 352237 -57253 4612 -37743 -213774 300632 155028 302463
7715 302463 -33991 -140780 -104386 50408 -152798 17925 -68036 50786 96803 41724 -218598
7703 23989 -50342 -283309 -30202 -185327 208481 116933 -291538 -359820 142755 84067 -13326
7691 101820 3142 -325652 -165248 -187927 -372829 146566 424287 56548 -116626 -116537 60484
7679 -204791 119353 185926 101854 16525 -121980 -52787 26317 -305362 -486 -8749 215913
7667 297678 104592 -104515 152810 -32750 8503 143833 112426 -18690 21607 11253 11372
7656 11372 -171678 -49057 85652 -267064 -84736 -140435 -120003 -178625 35763 138458 -5310
7644 89053 83391 -316390 7866 -197162 247765 -56743 223501 102848 51309 -20947 -53773
7633 -53773 -68501 44359 155833 -210545 -50799 -80427 -64141 104233 -82346 -151380 250744
7621 199862 29099 181569 87967 44232 -88646 165225 -53261 9089 163525 -298694 -20294
7609 286122 -10576 39940 -249596 -112641 92510 50359 -46990 -106760 -69047 120736 103338
7598 103338 -181975 219854 154779 168869 -109939 -222391 164349 -120592 243562 -224833
7587 -32902 -171075 -3470 161213 -135020 -151007 -204715 -40349 357658 -297246 -100738 -9973
7575 41384 109688 -21991 92638 70548 -203407 -18936 -110855 -125927 115622 79178 -272633
7563 -98951 41719 -8132 35216 -123168 -246651 -125850 -279976 362228 187230 -145378 114163
7551 110771 -139277 -38607 -146804 -20740 -88280 -430783 44671 106014 -142218 74094 179626
7540 179626 -115724 -444453 -144642 -266785 -204915 154651 -134736 -86042 -168896 85221
7529 96574 -301056 80129 -231265 -206214 -8745 -134528 134917 -304587 -295095 21142 -114303
7517 -84784 -326574 -104463 -200440 -207560 -296743 62795 -72237 -51168 146844 92275 -303721
7505 -305379 114666 -68452 61703 184165 144007 -155731 -376169 -102728 247496 -327803
7494 99290 222331 46966 52414 -249584 20394 204813 127395 45661 -152813 -31879 2927
7482 -73979 -228621 291977 46706 -27891 -156214 44826 139113 139373 -60921 132964 -42458
7470 -162891 145217 -46010 176237 -80057 -213627 -97502 346565 -68210 -147656 -87557 194740
7458 -136807 -135610 -56991 -34372 -49138 64827 -228747 -2748 -55583 231593 -83989 -127531 142822
7445 -32677 -314080 -185057 49787 193573 213162 32609 -255036 167426 52540 201840 -94429
7433 -21614 -61295 -160516 -168755 -77217 -158565 -16433 52120 89140 -132381 55516 -133729 66814
7420 -38238 -101489 -175748 -305772 -232307 -124069 -100304 -77088 -104986 -182355 -9993 39032 104322
7408 104322 -141593 99065 107223 20144 87276 -137637 103552 -103524 -87081 -309107 -21587
7396 262038 362940 -201533 -186016 175754 -108945 174674 -5327 -267723 -25740 18745 -11304
7384 139846 -70329 43104 356438 33356 14071 128163 63637 19036 124422 -19353 126780
7372 40667 -255936 -167829 18885 -136883 124062 -281902 -439392 -206455 83839 -61762 -90856
7361 -90856 -75804 -251869 -298375 -36446 125054 -49105 -45274 290584 69191 56338 243605
7350 243605 -101907 -200919 55911 -15288 114937 26711 -169171 -236324 303805 40936 -154121
7338 -160422 -56187 -116311 20794 251949 -96071 130324 -157240 -259490 -161096 -174998 55125
7326 -31760 -57095 -219779 -123434 12584 -138451 -381560 -258882 -303279 67816 17894 -84622
7314 -247502 237913 22437 -109559 1529 77868 241367 -81743 14303 61267 -194338 -139284
7303 -139284 -179306 -170721 -78942 -223633 -26760 47130 42899 -50698 -249289 -108654 -220256
7292 -220256 -224952 263643 145899 -59319 77787 -262889 -39963 -258324 95438 122890 166178
7281 166178 -40340 -84283 216473 116467 -100276 4571 115291 65573 -72499 -97592 -207041
7270 -207041 106270 -185860 -267509 -84964 -214165 -92248 185271 -87969 318032 -155746
7259 114233 204995 -74262 -79915 -106284 142666 -177758 -170933 -110779 -171546 -323703 -284869
7248 -284869 -212793 -158588 139436 29948 27232 -148241 53067 43398 -15493 -135760 -45227
7236 35181 91502 101653 -3932 -99144 80209 -228693 -549432 482959 -98221 -134578 186707
7224 18290 -141417 -93961 -369342 305915 1553 -278043 -88186 -14909 -42187 68568 -32121
7212 20401 -342511 -293011 39573 -298428 -15624 30932 115489 53626 -249897 -51170 -60495
7201 -60495 3651 1067 -2581 -138511 40469 -172440 191751 -201522 243272 156378 131397
7190 131397 -62933 -119973 95195 -34019 176156 -76924 150571 124049 -54832 -521931 -329522
7179 -329522 -69941 -175646 -79633 160068 -185027 -24312 309888 43521 -230600 -180618 65956
7167 -137557 -122587 117601 -120279 -233196 -188175 -384284 191150 15468 58308 19888 62811
7156 62811 65869 -181756 226276 66792 -8132 -101600 149685 -243851 194073 -47141 175403
7144 55777 -241685 -83731 -17603 -299508 -192382 -274849 -81852 22471 -171498 -103264 67012
7132 -91716 78950 210993 47994 -531227 -160026 -266276 51838 -31915 -99292 -35428 89507
7120 -64225 24716 52743 -203232 265013 56940 146366 -71208 -482561 -142896 328694 -177127
7108 180623 -184587 -28271 -98725 -15030 268033 42815 50630 134993 137 -161351 322246
7096 -34260 41112 62731 175253 -41654 -127498 -165918 -768 -222348 -207323 -155088 176488 91499
7084 91499 106909 54772 43448 -19395 53624 -322866 52457 13854 2203 -79160 -13483 -232589
7072 -232589 -104212 236159 40790 -352420 -71082 308811 -32905 -169152 -87849 -91038 -321782
7061 -321782 -193 -44020 -234964 -6125 -186245 365562 -65912 -71437 -202136 126582 -74746
7049 212748 172165 184478 -275217 -193516 -54905 103945 -299144 -162607 162417 -19868 108025
7037 -259831 60572 242994 201592 -169098 -115974 325577 -11142 -305302 -6353 -98491 -112846
7026 -112846 178419 -6591 -33038 -116207 97446 -203273 68909 98285 -278461 -199494 -49647
7014 -28882 -27396 3897 -79237 197479 -119146 87409 -66303 -164960 22768 -141071 -131543 53345
7001 298987 366925 116337 77696 -201196 -79279 217099 54209 -8119 -21756 -97179 -33222
6989 -164791 13345 110773 104012 -61917 -122508 154282 50738 97314 59332 -23908 -80529 31467
6976 6719 -363397 70508 129367 23514 -289686 270191 -198798 -160129 36196 13079 -399327
6964 197056 -200629 231439 14103 115500 96237 266816 57085 -43833 230012 -116531
6953 -289224 -148226 84293 122637 -225516 43570 -201631 37122 -24987 -3417 -62080 -85890
6942 -85890 -87408 46336 134073 220900 -281235 35568 46646 -128927 -252512 -127052 -249024
6931 -249024 -85632 46214 -55917 298744 256614 -118054 305642 -195154 91161 28552 134112
6920 134112 -54701 170454 38179 -234408 187844 -63311 -179449 -10516 -103724 -18984 -31418
6909 -31418 -68119 -117938 135970 -47759 45083 -93056 132708 -154803 131897 284472 -41635
6897 124817 121753 302012 -51172 2008 -74186 405565 -149563 -86892 -158257 3546 324182
6886 324182 -143094 372767 140214 -77931 186206 -105655 -7999 73027 -89201 282469 -63892
6874 -182812 286275 -24989 -261090 -301271 204559 -99805 -56330 -86670 -98901 -52194 18517
6862 72682 -376090 -175679 158110 -196717 119257 324713 -73856 -56459 -186177 149798
6851 219097 -87664 -10074 395177 -298985 -240157 -373125 166702 -148245 -59790 -57681 -168893
6840 -168893 66282 -125739 184310 275586 39928 157164 -34586 36326 131725 14545 -97396
6828 -39751 -84306 219635 86784 -124876 128589 96112 -122961 102198 173813 178213 -1946
6816 296108 -320565 226321 -104045 -34158 -148830 -73171 -189394 -144399 -97053 43919 190073
6805 190073 -97746 85577 215579 -29854 -249869 73312 -144045 1303 -32873 -268004 302973
6793 138456 -39235 -43991 -134904 -208963 -382622 -134976 129321 91304 -144024 -173679 -155076
6782 -155076 59665 -251851 93852 -94979 48314 -236926 223564 -134548 -5523 234109 -191255
6770 -269950 65762 73077 -198831 156561 90034 168304 58697 127749 387876 20831 -252010
6758 -11461 45651 7975 147339 144235 141503 -45354 -74619 -145743 -70754 110495 -125863 57278
6745 11668 -95414 -114019 29854 145533 30628 124448 303555 297672 51898 262874 8739 51017
6733 51017 197292 -47308 -125800 -166355 150372 -133369 -89593 50421 -30944 -34633 40124
6721 258231 -135804 -12339 185804 182251 -174067 155571 164265 275171 106359 -351003 -307333
6710 -307333 -105576 137428 274644 -22922 122964 203353 -146380 -70205 -232158 10830
6699 -222842 -8917 -63593 -152093 -77252 -197748 107649 -292103 -124597 -118823 194909 129737
6688 129737 226204 -106271 -154989 -150839 -240058 -421739 -334061 -237412 274146 -61848 -186268
6677 -186268 -45160 373004 -345748 -218649 54781 -175287 -412355 222772 -293825 221996
6666 -315285 199688 -58498 398081 524713 -73073 -187990 -241548 -73065 35812 -190826 -119450
6655 -119450 -293317 30093 -123728 76524 30625 221992 -11652 70591 227762 -50173 81750
6643 -55933 119331 -386503 -128683 -50739 195821 266236 -294046 103929 336236 48874
6632 -69450 -109624 -57583 -100782 -118426 -123015 -211665 137955 -276869 26983 -321130 -185669
6621 -185669 -53488 -186904 -235616 -23494 44551 -146633 201303 58618 -238530 61233 237456
6610 237456 -61279 22264 -70893 -49535 -30970 136967 103331 -152750 -156353 32113 -113749
6598 25770 80283 -2514 57661 -46365 -107826 72500 -110642 -299193 248676 23213 118035
6587 118035 -191261 -129952 130950 115626 -107967 127433 -4857 -304314 -90751 -23828 -206518
6576 -206518 -201656 -290723 -183971 -28768 415545 71614 -175543 -281809 -134647 -45863 28567
6564 -96361 -277649 -133777 156039 -222375 -209843 -303802 35112 -18866 -293489 103342 -137711
6552 236474 130927 -167838 -296661 -254843 -151050 -106712 97652 188079 -64657 88502 217055
6541 217055 100750 19569 -94942 -112209 -105053 -153670 65761 -187847 384392 -177516 259089
6529 -18150 -225261 -109425 348198 47603 46316 162838 41041 -62721 -173741 13946 -197406
6517 -119998 63554 -63218 -79545 110380 142243 -70124 -126482 93494 -53859 113831 -68546
6505 -76066 80357 -396314 14887 -219831 -289333 -150539 -134983 193991 -380404 -79371 -387182
6494 -387182 -182684 197033 26525 171776 -26505 127437 93558 245568 -45674 -174351
6484 -174351 482652 61278 131268 -164813 179652 257768 -40007 104606 -140312 -251939
6474 -251939 -128809 17787 -87145 -237361 122690 114066 -316406 233939 -142031 166932
6463 69597 -20807 -199386 -402740 40023 -253650 -68368 -39061 12890 196343 44680 -80802
6451 -73687 81844 107728 66930 196453 62424 -30981 -324401 76746 157467 -138283 14855
6439 -218432 -109478 68498 33848 -215731 163797 -44292 75496 -8667 -150412 49650 -202729
6427 -29913 164614 -279569 89407 -1025 29730 -64294 4376 152051 159498 268048 -5502 -76125
6415 -76125 -342049 -122458 11454 -241829 -256660 -36524 -285656 48015 -98859 35784 -126510
6403 70583 200582 110538 59069 -116877 187268 -82972 41777 -8212 132986 -114963 -222559
6392 -222559 253115 -64627 59287 436214 123967 200484 -128511 -145593 75106 225259 -318068
6380 -135713 -77184 27135 -164543 169358 -76951 -251564 -131644 -43170 -48044 -28344 225076
6368 -201136 -34575 -38621 -127556 119547 -69361 -200812 18148 -202723 163057 -237146 54194
6356 71276 336703 -322288 -160155 -40987 8471 -226737 -146104 -227866 35592 188736 56132
6344 80470 -249613 55562 267359 -138371 -156988 -357533 -416447 86325 41557 -74535 146375
6332 -253830 86536 -179892 -6826 -45586 27573 261643 10110 32396 10557 -177889 -156913
6321 -156913 96601 -93382 39548 104898 119143 -128922 -3662 135869 -36058 -126157 -279601
6310 -279601 12493 -170181 -252122 54140 -124006 75709 -4769 65593 230267 -86144 -191845
6299 -191845 26757 110881 13797 -166953 -44921 -283963 121746 -60520 105684 -127764 77330
6287 21337 -279944 -292110 -91773 77261 -31442 -104144 223984 -73661 28803 -2173 98779 -134730
6274 -316198 237995 281528 -95041 74376 -238469 205529 -123776 -269119 5401 -69106 20809
6262 -52278 -142874 152164 -28745 -41728 -125122 116819 -237044 467424 -28255 341742 -81645
6250 -107677 -32133 -245772 77045 20637 319464 102888 185766 -456757 131917 127447 -88082
6238 -289936 -11829 -292805 -23963 221798 31296 -61818 42304 -444 9541 50891 -214261 -73496
6225 59224 -206524 -92542 -323176 51638 -24625 178742 4763 -39274 -2860 -81059 360080
6213 99260 253054 -62741 270104 132749 172000 92934 313059 112034 -65822 -402488 65302
6201 334304 -79393 -89769 -156978 182038 408005 -117432 6544 103679 -119863 -116210 -60530
6190 -60530 -191652 70705 -92921 20780 -105765 -411350 72208 -213523 -9789 358677 72527
6178 260888 63678 341113 -219208 4463 -25452 -57786 137979 58963 35068 -111091 -393186
6167 -393186 167013 -175849 1592 90913 103155 -66319 -125930 107040 -179994 -350543 -303474
6156 -303474 -396139 -109100 -142651 -151411 -153410 46606 -88898 29493 -129195 322 4747 -132747
6143 203441 229379 -343356 157468 148352 -32977 112895 13809 -100820 184375 -13370 -317141
6132 -317141 -242032 -377900 218890 -181059 -7645 -85089 -175073 188998 -48602 -100227 89292
6120 137660 -153061 -47574 81899 -236088 -159866 -118982 -93735 186597 -307519 -77081 52065
6108 281945 156664 286025 255939 119801 -166971 -63113 199784 -28224 -150134 167072
6097 37865 -132747 -62028 92825 28527 -26830 -248652 -29486 -7698 -102827 -60725 -16366 -57298
6085 -57298 -83461 289798 227535 14130 -75048 243352 -96001 183992 -138027 66600 75952
6074 75952 7400 -295398 -27164 14933 -72536 -106358 20808 48451 -228396 213786 25975
6062 -96890 128293 -39068 94959 -318772 2190 9332 181512 -162810 -44161 -31260 -56040
6051 -56040 113274 -206585 -181413 25510 142781 -86522 -71630 -77602 -451780 -7577 -63213
6040 -63213 156344 -18085 -73810 114487 61784 -53722 -94205 158760 137756 69354 135199
6029 135199 421634 71957 -172159 -342680 33657 210451 188219 9338 2077 79602 57509
6018 57509 -60425 30736 -179180 -130970 -484706 24349 -211699 -58928 70302 281561 238418
6007 238418 500732 291830 -38703 73622 89202 130389 -151652 -321854 107102 -265880
5996 -175929 -124562 -146801 -286642 143101 77132 -81155 -17985 -80134 144260 41200 108773
5985 108773 -63708 -26286 201529 -54576 210939 185087 -72642 75516 106844 80348 -8467
5973 464979 -129236 -52735 35282 -59373 -30140 126398 -359089 -3736 91088 -63822 193155
5961 -70472 2166 -167597 93673 215746 -88641 220640 -156843 -284626 -118172 -47942 83128
5949 -118191 280004 168998 193149 116555 -144869 321617 193776 206300 78088 47499 -51719
5937 -31292 -30721 80117 -56331 363123 61719 27333 -306702 -95010 -50004 -220233 -2218 15921
5924 1237 127387 200039 130119 110148 275946 -334012 205733 -247317 205 106939 164068
5913 164068 136496 -516855 146987 -302451 75877 -77221 -89341 123006 -103633 129699
5902 -105895 15524 -38444 17076 -38871 76518 -10694 104241 -11691 27847 -58659 177803
5890 240042 -222578 -42792 -10650 -46830 -296872 -49553 -127766 55289 209692 -68759 113088
5878 -289643 -176860 -197199 -258261 -65782 190653 59345 137720 -257744 -142436 -13368 -402301
5867 -402301 -264283 8186 -79465 -202366 -116690 -71803 -55863 196229 177773 164044 98746
5856 98746 -24514 -73884 -3667 250184 95021 138080 51840 108279 -38965 -131388 236469 188786
5844 188786 114494 -355790 -40749 -175409 -163351 26010 51343 -42645 -76613 -115331 -98143
5833 -98143 215929 46291 137070 -83385 -14481 -289699 63654 -73056 -5848 69901 57808 304954
5821 304954 52735 -78641 -103494 148671 10619 16457 -70146 88640 267020 5257 -93425 -62381
5809 -62381 46550 269831 -280549 238030 -124552 -196662 -17639 -42970 401165 258328 132222
5798 132222 -296003 -372906 -197652 -48246 15698 -110677 -80055 48035 134790 211688 -216097
5786 -17249 -26080 -232474 -42700 1584 -166086 52802 -80412 -10803 -20680 158166 103478 -67450
5773 238424 284129 2056 54838 116589 -223642 316234 6555 -300992 -240537 129223 -190815
5761 8817 -203583 478412 179497 -254466 -260628 185032 4832 370442 68483 86901 80043
5750 80043 -70972 -175345 40175 -275622 -265671 151205 -37539 125299 -56146 196133 78380
5738 -8625 -270867 103422 -363081 330263 6745 -138014 28310 -238923 12631 -11786 -15578
5727 -15578 102484 256449 122812 -139269 66463 -118311 -108712 30848 -154942 39578 45092
5716 45092 -137911 -80078 -202695 -159872 -193086 -146934 161520 -28973 -238827 -2599 -41552
5705 -41552 -66497 97325 55438 14246 75658 91382 287842 -16064 -363936 -6971 -18152 138883
5692 104095 -12625 -223160 108096 86893 -314257 143353 -227738 -120237 89238 315518
5682 315518 70613 62341 -115919 98066 -107620 -49457 -61433 219556 -142120 -13998 298015
5670 -148120 106168 -14392 90048 -143980 184395 62199 210063 168402 -150126 129266
5659 -173871 265588 -212042 -558 -153511 100539 79599 -99291 -248327 143626 -187589 -186911
5648 -186911 -253471 284730 -208725 356988 38845 8377 -191639 -146360 -171792 -330515 32607
5636 2406 -338179 -37178 -1111 -32962 -76352 182253 170651 97917 58558 82405 308485 144619
5623 3773 -126909 122180 -125666 -160925 -131597 -207990 203469 10042 115731 102817 -207907
5611 -447614 -218690 -461454 -84723 188321 -101943 -46641 -16225 161930 139127 208689 -276955
5599 40378 -133257 -79686 -46550 -17637 175838 -100373 52906 -79696 -184696 -242212 -88474
5587 117063 -234012 15029 -38576 72606 -206340 -113112 -53734 69419 19324 -219486 -46371
5575 218904 44414 -496518 184685 -374456 203786 -88756 -257892 70315 58398 -22615 38599
5563 292865 -73371 -2943 74786 36961 -134261 -49362 -49005 156300 58597 376844 -37935 -362946
5551 -362946 256459 58739 116132 -39682 -230210 -210390 -275424 -210985 941 39961 77631 82332
5539 82332 -113386 -101203 -182048 -44922 313825 291441 -14654 -158032 -69311 206708 -14130
5527 -47202 -110856 46869 -166032 -118670 221599 -194633 -45759 64235 119750 -19029 -273992
5516 -273992 -149303 -112224 -21786 272054 -58937 179837 -147551 183685 -118452 -86999
5506 -86999 198016 -209422 -157499 -81666 -273040 -76367 -127940 -134385 95729 -30846 -71675
5495 -71675 -233022 202277 16331 46187 -16951 -72915 -51132 -13426 14449 66792 83716
5484 83716 -167816 2261 -103711 156941 -43749 -208945 -58386 95238 70450 -343731 -32928
5472 147253 257516 -254467 30599 -165949 -61442 -157706 160485 -207843 -134755 12498 144325
5461 144325 106190 24040 261992 -267042 -466511 -161921 -162063 -46336 161197 90448 65362
5450 65362 38425 -345255 190090 17140 -268194 401235 -20573 96222 -78427 346990 232196
5439 232196 117983 -126185 -138781 269500 -68415 82107 126059 62552 161835 2299 -18917
5427 -133756 264241 -59880 449528 -60987 -56595 26637 35553 34163 188130 -136159 182159
5415 -146638 -50596 -92226 132387 -136235 -20508 -76670 -277570 -102895 -89987 -197361 250754
5403 -250863 42298 -31441 -191107 -209949 162204 -246105 483559 -188777 -99139 73999 177337
5392 177337 -35819 -173834 -192124 327336 107001 -209754 -177071 -124163 -330416 -111996
5381 -82428 36034 -85941 146965 231037 360681 99396 101811 114381 16897 -151915 -168493
5370 -168493 11498 -2508 303719 -200670 65353 74374 -136924 -45486 420757 -125075 -237725
5359 -237725 -888 -76407 57573 37168 94847 480641 -207134 238949 183977 -51515 -249389
5348 -249389 352059 83930 -140969 153492 180948 -155946 -132255 -131916 -51912 -65935 148106
5336 -210504 141288 -117690 80886 18027 314939 144099 43618 -238852 -37212 -202926
5326 -202926 -133590 56219 123092 -145480 -159990 60582 50818 26235 -204962 99919 288605
5315 288605 72529 -148906 -118479 108533 61016 -64260 14611 -69361 -73860 -1005 194711
5303 -104619 328603 43796 -27187 93635 -19536 -34133 -126601 62882 -138175 86497 -116939
5291 -250274 -8637 -128633 -157977 206020 60233 105186 -163682 102581 -109206 -106450 -223628
5280 -223628 354769 -153838 142417 37594 -61611 -30528 -77823 85952 -150246 81212 -75740
5268 -173823 245496 191849 112031 -70914 -282410 -399968 67795 197600 38003 15044 -124786
5256 275709 -1743 -75459 -78693 -66660 -30746 -153184 133940 138108 -96246 -65227 27582 -23089
5243 149580 -130384 62419 86217 -205262 -122619 161710 -49505 -146350 -74444 259209 -308912
5231 -139932 -10097 -82119 42360 7580 253773 28496 128819 -85951 55187 37402 -52473
5219 -149157 -32772 -18746 86983 -49519 48839 -267457 275641 33916 -12196 7193 128689
5208 128689 -61257 122450 250831 -112532 123 -86744 -98987 -125766 153851 -237883 45208
5196 -105238 -214795 12243 216795 238378 -123077 -161489 -74194 77288 34782 -200368 -171132
5185 -171132 -1082 127700 -228651 -417849 123943 230595 187746 64565 11148 -20671 -109680
5174 -109680 -189083 113178 -46839 214906 -293851 286139 2271 -18050 -153915 -51470 -149340
5163 -149340 3903 -254826 78220 372851 -88898 -25417 -14626 -102977 215123 -66240 80687
5151 -98596 28914 -256481 -129633 330024 -40917 -177334 266144 63930 -130342 56358 114101
5140 114101 -163268 65330 258794 29337 -86986 237492 89048 -73260 335571 -153717 138219
5128 239328 27732 129519 -98930 -115945 45489 -33652 369196 3422 -196870 200198 140002
5117 140002 99142 -123874 -227463 186503 198183 108824 106274 -208613 -15607 -132828 113620
5105 -224411 66249 -224701 -214327 254701 -87093 255431 -319161 123681 142802 -90645 435400
5093 -178692 165254 335244 134574 123335 -404803 -92688 8078 -23924 -78982 305540 252566
5082 252566 9882 111242 130993 171869 153363 158861 -53990 68489 -107472 -57558 207962
5070 -378437 -52569 66437 163102 54702 45234 -32138 -55067 115367 -333740 -69817 -4595 99458
5057 67508 293961 46694 -18980 218004 -162765 150800 -342287 37683 447173 92785 -249062
5045 175287 15530 -66360 -102623 -156617 216775 -340326 33630 -96592 -77045 -83551 40878
5033 -142706 -62654 -57479 -186348 -12566 -53186 -24574 83247 109175 5816 116540 109456 -92347
5020 37863 59105 11883 62703 96269 -68161 -34532 -31751 163234 -157004 -121920 -122254 -248574
5008 -248574 269764 135503 -18993 74165 247165 -188252 -103000 218478 261727 42034 -125103
4996 -67507 131115 39436 -276521 -133881 -207549 -34344 50681 20950 64829 -107255 78505
4984 38453 18561 -165379 95245 11774 148240 -65906 -167671 87578 -259403 -196327 330
4972 -2628 -215950 -93596 -116902 -160307 157092 -67313 -399854 -129154 65516 79138 100381
4961 100381 -223550 121880 209342 22586 345721 267433 -31578 277541 -134120 462614
4950 112792 130602 233778 23743 -166035 123410 -136987 -110886 -133553 45096 230305 -154780
4938 -58628 82395 -159687 198455 -79519 117307 -309746 62102 105758 174329 -191769 -195511
4927 -195511 257597 -46852 197207 147714 -14281 251594 283162 297187 165127 238703 350509
4916 350509 99856 -76978 353155 -26330 -45963 -2317 339429 31185 79096 -55465 -70241
4905 -70241 19270 19107 -165142 281890 -174163 -60859 -72277 -242060 43420 -363484 306142
4893 -20900 -32527 214675 -40800 87820 37641 -126531 -120697 182760 -329578 47354 -123549
4881 49899 -61195 265328 -66423 72640 -7510 245412 -59836 138211 3524 315703 118482
4869 -373459 -240936 -205276 -12385 -34246 170335 63593 120614 225712 77992 351232 -215575
4857 -192049 -141764 -39343 -122501 -27686 99689 333038 -106993 -210559 -323924 -432288 224539
4845 48097 -368790 -316714 292238 114906 -298561 -10980 206748 265149 165622 108010 72399
4834 72399 203275 -210406 120706 -81774 85895 8314 -185724 -123694 -76021 123150 19874
4822 -93429 345839 -224408 153152 -294265 129895 -95739 160784 -111424 -66737 51162
4811 -220946 155061 75071 58067 9394 -145080 66542 268500 249626 -33614 -165684 -176092
4800 -176092 -103409 -148041 -51658 23608 -191760 -8236 248970 89685 -257089 -32055 -15316
4788 261613 -30282 -123699 251345 73890 26918 96528 196640 10396 23372 201745 -103271
4776 -47734 -175533 -29555 25923 -126979 129559 96714 -15818 20648 62082 -31554 37117
4764 158620 -126908 -150998 95313 151140 54029 205893 -194548 196126 -29671 24511 -80776
4752 76059 6138 -216429 94364 79080 95515 -194657 -110974 100679 -87570 -292782 -146113
4740 47012 -114130 51756 129941 93512 -51795 11810 -386840 -43460 134542 -100078 83534
4728 -22343 -68389 259313 -48682 220689 -124127 156289 179863 -367668 -13286 -13768 -110967
4717 -110967 61678 -19530 -59930 -213809 12912 252825 9211 -36959 246189 49307 -429746
4705 111575 374224 -219541 107532 51501 -520401 199932 -7471 -153249 91815 -112356
4694 99969 197474 99102 -125983 -210997 -136406 41985 -163166 -13419 232771 -197974 207724
4682 228227 84449 -183285 -77478 198682 18092 484936 157070 -147848 -68158 273317
4671 -130615 258286 182514 212066 219969 -149881 237517 23086 -257662 71329 -219864 64752
4659 -235105 -111836 -141855 113426 -107458 -93027 235923 171964 156297 212438 60643 -188722
4647 427069 5122 225914 351579 29788 -82806 -144593 -230091 -104507 27370 56595 119911
4636 119911 -163021 -113841 120608 -48641 330869 38965 118794 -12016 36427 158634 159460
4625 159460 5563 -169676 35868 -200380 -104628 -51437 -1721 142468 -259301 -66262 192947
4613 -29033 -146055 135649 235318 -10648 -149559 -74875 465165 -95723 103510 -258094 226509
4601 195723 -36246 -141838 -42403 -190805 -315954 222074 179580 131326 56748 -189773 183051
4589 -613588 62258 -36480 308845 -9438 -74750 13358 -145150 35241 -59358 -156971 -413500
4578 -413500 94033 -157376 -41922 -96554 227572 -223895 -407864 -142048 187067 79234
4567 25436 -120903 -36318 358873 -14074 -158249 623 -179410 -152570 -151555 23510 -135690
4555 -10336 -101653 198160 -109202 -18495 238439 151587 -144664 123161 169353 -65134 139115
4543 47088 60152 -176077 327210 115227 53043 -128532 88352 309370 16183 62195 90805
4532 90805 -182281 -378888 -108024 320832 -70618 -125721 -65495 -420299 135882 62410 73061
4521 73061 -66485 -268283 134628 139916 -245236 157736 188455 140345 -165679 82601 -212275
4509 -175489 155936 -37422 -66894 -21657 193425 25371 58909 -147012 138513 -121976 29215
4497 -112892 91288 41071 -71267 2252 150036 38813 -143932 287381 -68198 60386 138394
$$ [...]
##END NTUPLES=NMR SPECTRUM
##END=
