
##TITLE=UV1158_TORI02-ROVE100C_6302075_nG3mZDOj67
##JCAMPDX= 6.0         $$ Bruker NMR JCAMP-DX V2.0
##DATA TYPE= NMR SPECTRUM
##DATA CLASS= NTUPLES
##ORIGIN= BRUKER
##OWNER= Administrator
$$ 1.72 TOPSPIN		Version 2.1
$$ 2012-06-06 06:13:29.109 -0500  Administrator@TOPSPIN
$$ Compression mode = diff/dup
##.OBSERVE FREQUENCY= 400.13188235
##.OBSERVE NUCLEUS= ^1H
##.ACQUISITION MODE= SIMULTANEOUS (DQD)
##.ACQUISITION SCHEME= undefined
##.AVERAGES= 64
##.DIGITISER RES= 22
##SPECTROMETER/DATA SYSTEM= spect
##.PULSE SEQUENCE= noesygpps1d.comp
##.SOLVENT NAME= COFFEE_meoh
##.SHIFT REFERENCE= INTERNAL, COFFEE_meoh, 1, 14.98061
##AUDIT TRAIL= $$ (NUMBER, WHEN, WHO, WHERE, PROCESS, VERSION, WHAT)
$$ ##TITLE= Audit trail, TOPSPIN		Version 2.1
$$ ##JCAMPDX= 5.01
$$ ##ORIGIN= Bruker BioSpin GmbH
$$ ##OWNER= Administrator
$$ $$ C:\Bruker\TOPSPIN/data/COFFEE/nmr/UV1158_TORI02-ROVE100C_6302075_nG3mZDOj67/12/pdata/1/auditp.txt
$$ ##AUDIT TRAIL=  $$ (NUMBER, WHEN, WHO, WHERE, PROCESS, VERSION, WHAT)
(   1,<2012-06-06 06:13:23.937 -0500>,<Administrator>,<TOPSPIN>,<go>,<TOPSPIN 2.1>,
      <created by zg
	started at 2012-06-06 06:01:53.718 -0500,
	POWCHK enabled, PULCHK disabled,
       configuration hash MD5:
       D5 CA 7A 23 FE 6B EE E2 50 67 74 61 24 F7 5E 3B
       data hash MD5: 64K
       40 BE 48 C3 BF 47 8B 72 0A E7 BD 3D C5 B3 1E 8F>)
(   2,<2012-06-06 06:13:26.703 -0500>,<Administrator>,<TOPSPIN>,<proc1d>,<TOPSPIN 2.1>,
      <Start of raw data processing
       efp LB = 0.3 FT_mod = 6 PKNL = 1 PHC0 = 0 PHC1 = 0 SI = 128K 
       data hash MD5: 128K
       6B 9A 8C AF 19 2C 6C DC EA 14 F2 2E AF 02 D9 9A>)
(   3,<2012-06-06 06:13:27.937 -0500>,<Administrator>,<TOPSPIN>,<proc1d>,<TOPSPIN 2.1>,
      <pk PHC0 = 31.23962 PHC1 = 0 
       data hash MD5: 128K
       01 D7 A8 5A 85 CF FC E7 FA 91 61 3B 7C 2E 0B B5>)
(   4,<2012-06-06 06:13:28.750 -0500>,<Administrator>,<TOPSPIN>,<proc1d>,<TOPSPIN 2.1>,
      <abs ABSG = 1 
       data hash MD5: 128K
       01 49 A2 AB B9 0B 48 CA 2A 95 03 63 7B 85 2E 0B>)
(   5,<2012-06-06 06:13:28.828 -0500>,<Administrator>,<TOPSPIN>,<proc1d>,<TOPSPIN 2.1>,
      <abs ABSG = 2 
       data hash MD5: 128K
       29 CE 0C C0 9B 29 0F 88 93 C1 1F F1 25 E4 72 A0>)
(   6,<2012-06-06 06:13:28.875 -0500>,<Administrator>,<TOPSPIN>,<proc1d>,<TOPSPIN 2.1>,
      <abs ABSG = 3 
       data hash MD5: 128K
       84 AA EA BB D5 B4 60 1C 44 BA E5 26 10 92 73 C4>)
(   7,<2012-06-06 06:13:28.953 -0500>,<Administrator>,<TOPSPIN>,<proc1d>,<TOPSPIN 2.1>,
      <abs ABSG = 4 
       data hash MD5: 128K
       68 65 C2 06 A0 9B C2 43 9C 13 C3 A0 57 DA 1B DB>)
(   8,<2012-06-06 06:13:29.015 -0500>,<Administrator>,<TOPSPIN>,<proc1d>,<TOPSPIN 2.1>,
      <abs ABSG = 5 
       data hash MD5: 128K
       08 F7 03 BB 47 29 BE 6A B1 D4 F1 35 59 3D 2C AC>)
$$ ##END=
$$ 
$$ $$ hash MD5
$$ $$ 76 9C B4 4F D9 EA B8 AE 83 52 C1 B6 60 0B 67 B4
##$RELAX= 
##$RELAX= 
##$RELAX= 
##$RELAX= 
##$RELAX= 
##$RELAX= 
##$RELAX= 
##$RELAX= 
$$ [...]
150 150 150 150 150 150 150 150
##$TP07= 0
##$TPNAME0= <>
##$TPNAME1= <>
##$TPNAME2= <>
##$TPNAME3= <>
##$TPNAME4= <>
##$TPNAME5= <>
##$TPNAME6= <>
##$TPNAME7= <>
##$TPOAL= (0..7)
0.5 0.5 0.5 0.5 0.5 0.5 0.5 0.5
##$TPOFFS= (0..7)
0 0 0 0 0 0 0 0
##$TUNHIN= 0
##$TUNHOUT= 0
##$TUNXOUT= 0
##$USERA1= <user>
##$USERA2= <user>
##$USERA3= <user>
##$USERA4= <user>
##$USERA5= <user>
##$V9= 5
##$VALIST= <valist>
##$VCLIST= <CCCCCCCCCCCCCCC>
##$VD= 0
##$VDLIST= <DDDDDDDDDDDDDDD>
##$VPLIST= <PPPPPPPPPPPPPPP>
##$VTLIST= <TTTTTTTTTTTTTTT>
##$WBST= 2048
##$WBSW= 25
##$XGAIN= (0..3)
0 0 0 0
##$XL= 0
##$YL= 0
##$YMAX_a= 10795407
##$YMIN_a= -7208152
##$ZGOPTNS= <>
##$ZL1= 120
##$ZL2= 120
##$ZL3= 120
##$ZL4= 120
##$ABSF1= 14.98061
##$ABSF2= -5.57192
##$ABSG= 5
##$ABSL= 3
##$ALPHA= 0
##$AQORDER= 0
##$ASSFAC= 0
##$ASSFACI= 0
##$ASSFACX= 0
##$ASSWID= 0
##$AUNMP= <proc_prof1d_extract.lims>
##$AXLEFT= 0
##$AXNAME= <>
##$AXNUC= <1H>
##$AXRIGHT= 0
##$AXTYPE= 0
##$AXUNIT= <>
##$AZFE= 0.1
##$AZFW= 0.1
##$BCFW= 0
##$BC_mod= 0
##$BYTORDP= 0
##$COROFFS= 0
##$CY= 15
##$DATMOD= 1
##$DC= 0
##$DFILT= <>
##$DTYPP= 0
##$F1P= 0
##$F2P= 0
##$FCOR= 0.5
##$FTSIZE= 131072
##$FT_mod= 6
##$GAMMA= 0
##$GB= 0
##$INTBC= 1
##$INTSCL= 1
##$ISEN= 128
##$LB= 0.3
##$LEV0= 0
##$LPBIN= 0
##$MAXI= 10000
##$MC2= 0
##$MEAN= 0
##$ME_mod= 0
##$MI= 0
##$NCOEF= 0
##$NC_proc= -2
##$NLEV= 6
##$NOISF1= 0
##$NOISF2= 0
##$NSP= 0
##$NTH_PI= 0
##$NZP= 0
##$OFFSET= 14.98061
##$PC= 1
##$PHC0= 31.23962
##$PHC1= 0
##$PH_mod= 1
##$PKNL= yes
##$PPARMOD= 0
##$PPDIAG= 0
##$PPIPTYP= 0
##$PPMPNUM= 2147483647
##$PPRESOL= 1
##$PSCAL= 4
##$PSIGN= 0
##$PYNMP= <proc.py>
##$REVERSE= no
##$SF= 400.13
##$SI= 131072
##$SIGF1= 0
##$SIGF2= 0
##$SINO= 400
##$SIOLD= 131072
##$SPECTYP= <>
##$SREGLST= <1H.CDCl3>
##$SSB= 0
##$STSI= 131072
##$STSR= 0
##$SW_p= 8223.68421052632
##$SYMM= 0
##$S_DEV= 0
##$TDeff= 65536
##$TDoff= 0
##$TI= <>
##$TILT= no
##$TM1= 0
##$TM2= 0
##$TOPLEV= 0
##$USERP1= <user>
##$USERP2= <user>
##$USERP3= <user>
##$USERP4= <user>
##$USERP5= <user>
##$WDW= 1
##$XDIM= 131072
##$YMAX_p= 234726269
##$YMIN_p= -366481052
##$CURPLOT= <Network HP LaserJet P1505>
##$CURPRIN= <$Network HP LaserJet P1505>
##$DFORMAT= <normdp>
##$LAYOUT= <+/1D_H.xwp>
##$LFORMAT= <normlp>
##$PFORMAT= <normpl>
##$SURQMSG= 1
$$ End of Bruker specific parameters
$$ ---------------------------------
##NTUPLES= NMR SPECTRUM
##VAR_NAME=  FREQUENCY,     SPECTRUM/REAL,   SPECTRUM/IMAG
##SYMBOL=    X,             R,               I
##VAR_TYPE=  INDEPENDENT,   DEPENDENT,       DEPENDENT
##VAR_FORM=  AFFN,          ASDF,            ASDF
##VAR_DIM=   131072,        131072,          131072
##UNITS=     HZ,            ARBITRARY UNITS, ARBITRARY UNITS
##FACTOR=    0.0627417313425165, 1,          1
##FIRST=     8223.62146879498, -2928,        -36418
##LAST=      0,             -1628,           -36489
##MIN=       0,             -366481052,      0
##MAX=       8223.62146879498, 234726269,    0
$$ Real data points
##PAGE= N=1
##DATA TABLE= (X++(R..R)), XYDATA
$$ [...]
62152A064996K870L672M876O190P530Q997J0293J0879J0692J0345J0521J1419
62140A163280J2743J4037J5030J5859J6900J8294J9762K0990K2032K3167K4553
62129A366647K6148K7836K9427L0708L1688L2596L3401L3525L2343L0023K7517
62118A701859K5665K4486K3471K2458K1986K2726K4584K6647K8174K9509L1647
62107A983212L4844L8155M0579M2259M3918M5366M5276M2747L8525L4206L0527
62096B419614K6936K2826J8494J4659J1462Q445N398K696O69r34k634m537o204
62083B516890p139p176o431n016k977m66K055L932M848N222N820O927Q093Q809
62069B533391R164R640J0465J1464J2337J2866J2948J2741J2691J3147J3911J4464
$$ plain form
62152 1064996 1067866 1071538 1076414 1082604 1090134 1099131 1109424 1120303 1130995 1141340 1151861 1163280
62140 1163280 1176023 1190060 1205090 1220949 1237849 1256143 1275905 1296895 1318927 1342094 1366647
62129 1366647 1392795 1420631 1450058 1480766 1512454 1545050 1578451 1611976 1644319 1674342 1701859
62118 1701859 1727524 1752010 1775481 1797939 1819925 1842651 1867235 1893882 1922056 1951565 1983212
62107 1983212 2018056 2056211 2096790 2139049 2182967 2228333 2273609 2316356 2354881 2389087 2419614
62096 2419614 2446550 2469376 2487870 2502529 2513991 2522436 2527834 2530530 2531199 2530265 2527631 2523094 2516890
62083 2516890 2509751 2502575 2496144 2491128 2488151 2487685 2489740 2493672 2498520 2503742 2509562 2516489 2524582 2533391
62069 2533391 2542555 2552195 2562660 2574124 2586461 2599327 2612275 2625016 2637707 2650854 2664765 2679229
62057B679229J4590J4606J4930J5544J5862J5159J3327J1271J0180J0273J0554
62046B825525J0053Q907P815O958O126N559N796O661P249P104O747O820P282P749
62032B926351Q153Q722R652J0987J2517J3712J4248J4673J5979J8299K0641K2273
62020C096207K3665K5579K7853K9726L0925L1586L1367K9550K6125K2137J8672
62009C393392J5989J3803J2007J0691R542P573L813j655p543j2599j6859k1312
61997C406842k6336l1086l4618l7022l9051m1171m3381m5613m7796m9784n1574
61986B959410n3289n4640n4915n3988n2761n1995n1208m9507m7049m4731m2727
61975B402600m0490l8035l6108l4875l3559l1708k9896k8693k7846k6981k6370
$$ plain form
62057 2679229 2693819 2708425 2723355 2738899 2754761 2769920 2783247 2794518 2804698 2814971 2825525
62046 2825525 2835578 2844485 2852300 2859258 2865384 2870943 2876739 2883400 2890649 2897753 2904500 2911320 2918602 2926351
62032 2926351 2934504 2943226 2952878 2963865 2976382 2990094 3004342 3019015 3034994 3053293 3073934 3096207
62020 3096207 3119872 3145451 3173304 3203030 3233955 3265541 3296908 3326458 3352583 3374720 3393392
62009 3393392 3409381 3423184 3435191 3445882 3455424 3462997 3466810 3465155 3457612 3445013 3428154 3406842
61997 3406842 3380506 3349420 3314802 3277780 3238729 3197558 3154177 3108564 3060768 3010984 2959410
61986 2959410 2906121 2851481 2796566 2742578 2689817 2637822 2586614 2537107 2490058 2445327 2402600
61975 2402600 2362110 2324075 2287967 2253092 2219533 2187825 2157929 2129236 2101390 2074409 2048039
61964B048039k6298k6326k5890k5221k4972k5197k5317k4913k4040k2960k1988
61953A774917k1442k1215k0593j8935j6494j4183j2639j1750j0940r638p629n328
61941A604131l527k693k635l114m369o640r531j2432j5273j8330k1432k4048k6112
61928A453995k8121l0230l1858l2375l1796l0645k9427k8391k7406k6018k3920
61917A133808k1458j9365j7950j6879j5756j4493j3121j1717j0555r884r329q141
61905I65160o294m784m442m801m608l159q42J426K935L656M279N598P621R641
61891I71386J1342J3287J5909J8623K0689K2495K5093K8566L1773L3842L5086
61880A228091L6302L7763L9289M0628M1443M1378M0571L9756L9429L9238L8501
$$ plain form
61964 2048039 2021741 1995415 1969525 1944304 1919332 1894135 1868818 1843905 1819865 1796905 1774917
61953 1774917 1753475 1732260 1711667 1692732 1676238 1662055 1649416 1637666 1626726 1617088 1609459 1604131
61941 1604131 1600604 1597911 1595276 1592162 1587793 1581153 1571622 1559190 1543917 1525587 1504155 1480107 1453995
61928 1453995 1425874 1395644 1363786 1331411 1299615 1268970 1239543 1211152 1183746 1157728 1133808
61917 1133808 1112350 1092985 1075035 1058156 1042400 1027907 1014786 1003069 992514 982630 973301 965160
61905 965160 958866 954082 949640 944839 940231 937072 936230 937656 940591 944247 948526 954124 961745 971386
61891 971386 982728 996015 1011924 1030547 1051236 1073731 1098824 1127390 1159163 1193005 1228091
61880 1228091 1264393 1302156 1341445 1382073 1423516 1464894 1505465 1545221 1584650 1623888 1662389
61869A662389L7084L5379L3652L1887L0158K8774K7968K7709K7880K8539K9946
61858B001365L2447L6328M1737M8603N6572O4942P3005Q0711Q8851R8050J07738
61847B730349J16649J24376J31774J39654J47902J56250J65156J75072J85327
61838D072509J94583K02010K07037K07977K02042J87090J62678J29173Q6890L6993
61828E688982j7212p0861j19600j60898j93724k17806k33474k41702k43767k40843
61818C949095k33924k23935k11647j97587j82233j66372j50962j36564j23030
61809B322841j09941r7327q5690p5330o5886n6796m7922l9482l1488k3612j5765
61798A673602q423k096L382Q747J4435K0071K4987K8995L2395L5232L6971L7095
$$ plain form
61869 1662389 1699473 1734852 1768504 1800391 1830549 1859323 1887291 1915000 1942880 1971419 2001365
61858 2001365 2033812 2070140 2111877 2160480 2217052 2281994 2354999 2435710 2524561 2622611 2730349
61847 2730349 2846998 2971374 3103148 3242802 3390704 3546954 3712110 3887182 4072509
61838 4072509 4267092 4469102 4676139 4884116 5086158 5273248 5435926 5565099 5651989 5688982
61828 5688982 5671770 5600909 5481309 5320411 5126687 4908881 4675407 4433705 4189938 3949095
61818 3949095 3715171 3491236 3279589 3082002 2899769 2733397 2582435 2445871 2322841
61809 2322841 2212900 2115573 2029883 1954553 1888667 1831871 1783949 1744467 1712979 1689367 1673602
61798 1673602 1665179 1663083 1666465 1675212 1689647 1709718 1734705 1763700 1796095 1831327 1868298 1905393
61786A905393L5732L3365L0167K5945K0678J4691Q308J822m137q654j1206j2016
61774B040088j1598j0223p967m989j531K071N209P224P957P669O299L330j228
61761B042311o452j1602j7046k3295k9617l4501l7303l8600l9016l8655l7691
61750A728533l6518l5007l2466k8662k4249j9812j5172j0016m666L19M884R380
61738A536548J4042J8905K3845K8467L2364L5854L9968M5278N1165N6747O2160
61727A945343O8268P5377Q2935R0527R8520J07583J18023J29753J42676J56810
61717C015815J72154J88598K06088K24896K45510K68082K91923L15903L39348
61708E268317L62095L83441M01272M12488M14067M03345L77585L33997K70980
$$ plain form
61786 1905393 1941125 1974490 2004657 2030602 2051280 2065971 2074279 2076101 2071964 2063310 2052104 2040088
61774 2040088 2028490 2018267 2010300 2005311 2003780 2005851 2011060 2018284 2026241 2033910 2040209 2043539 2042311
61761 2042311 2035859 2024257 2007211 1983916 1954299 1919798 1882495 1843895 1804879 1766224 1728533
61750 1728533 1692015 1657008 1624542 1595880 1571631 1551819 1536647 1526631 1521965 1522284 1527168 1536548
61738 1536548 1550590 1569495 1593340 1621807 1654171 1690025 1729993 1775271 1826436 1883183 1945343
61727 1945343 2013611 2088988 2171923 2262450 2360970 2468553 2586576 2716329 2859005 3015815
61717 3015815 3187969 3376567 3582655 3807551 4053061 4321143 4613066 4928969 5268317
61708 5268317 5630412 6013853 6415125 6827613 7241680 7645025 8022610 8356607 8627587
61699H627587J89889R5854l446j00326j88953k65291l26372l70675l99024m14016
61689F845227m18159m13134m00756l83447l63125l40490l16104k91409k67806
61680C650797k45415k23755k03134j84329j67261j51155j35970j22482j10870
61671B106426j00240q9949q0458p2399o5548n9272n3421m8248m3828m0165l7550
61660A415348l6279l6117l6413l6755l7173l7683l7920l7354l5874l3963l2193
61649A017624l0568k8664k6468k4623k3582k2930k1998k0848j9943j9118j7753
61638G61129j6004j4916j4932j5092j4344j3038j2317j2359j2124j0945r559r151
61626F06348r772j0266r702q408p394p056o858o254n529n417o135p059p373o762
$$ plain form
61699 8627587 8817476 8913330 8909884 8809558 8620605 8355314 8028942 7658267 7259243 6845227
61689 6845227 6427068 6013934 5613178 5229731 4866606 4526116 4210012 3918603 3650797
61680 3650797 3405382 3181627 2978493 2794164 2626903 2475748 2339778 2217296 2106426
61671 2106426 2006186 1916237 1835779 1763380 1697832 1638560 1585139 1536891 1493063 1452898 1415348
61660 1415348 1379069 1342952 1306539 1269784 1232611 1194928 1157008 1119654 1083780 1049817 1017624
61649 1017624 987056 958392 931924 907301 883719 860789 838791 817943 798000 778882 761129
61638 761129 745125 730209 715277 700185 685841 672803 660486 648127 636003 625058 615499 606348
61626 606348 596576 586310 576608 568200 560806 553750 546892 540638 535109 529692 523557 516498 509125 502363
61612E02363n542m302l464l023k725k466k359k375k190j646j113j039j268j207
61598D67644o23J45P14J055J381J932K906M195N186N253M598M213M807N987O706
61583E16099O373N313M239L482K821K004J256J039J328J567J428J276J629K459
61569E52313L397M221M804M952M818N092O046O676N551K482j287m529o901q509
61555E79126r499j0255j1251j2387j3046j3005j2652j2200j1394j0246r223q441
61543D45527p411o032n006m751m652m013l051k283j597o89O0R3k91k66L60J081
61527D07079J588J904J854J211M60N88J873L495M520M846N038N637O728P915Q712
61512D63448R154R830J1031J2209J2762J3041J3817J4958J5497J5091J4463J4165
$$ plain form
61612 502363 496821 492519 489055 486032 483307 480841 478482 476107 473917 472271 471158 470119 468851 467644
61598 467644 467021 467166 467880 468935 470316 472248 475154 479349 484535 489788 494386 498599 503406 509393 516099
61583 516099 522472 527785 532024 535506 538327 540331 541587 542626 543954 545521 546949 548225 549854 552313
61569 552313 555710 559931 564735 569687 574505 579597 585643 592319 597870 600352 599065 594536 587635 579126
61555 579126 569627 559372 548121 535734 522688 509683 497031 484831 473437 463191 453968 445527
61543 445527 438116 432084 427078 422327 417675 413662 410611 408328 406731 406042 406102 406195 405904 405638 405998 407079
61527 407079 408667 410571 412425 413636 414096 414684 416557 420052 424572 429418 434456 440093 446821 454736 463448
61512 463448 472602 482432 493463 505672 518434 531475 545292 560250 575747 590838 605301 619466
61500F19466J3806J2908J1824J1167J0910J0675J0567J0965J1670J1916J1297
61489G47171J0254R491R181Q854P962O461M865L658K701J555L18l30k52m29j821
61474H09639l895n102m775l813l238k830j818k94Q80J466K289M130O782R515J1945
61459H20881J4107J6093J8086K0505K3627K7168L0618L3890L7213M0632M4101
61448A126921M7997N2840N8396O3670O8136P2396P7204Q2270Q6502Q9157R0137
61437A915626Q9298Q6031P9736P0399N8533M4745K9581J3654k094j6516k8777
61426B340216l8838m7238n4277n9621o2713o3343o1704n8280n3890m9533m5710
61415A745069m2062l7970l3404k8843k4539k0313j6039j1880p974m204l99L468
$$ plain form
61500 619466 633272 646180 658004 669171 680081 690756 701323 712288 723958 735874 747171
61489 747171 757425 766916 776097 784951 792913 799374 804239 807897 810598 812153 812471 812141 811889 811460 809639
61474 809639 805744 800642 795867 792054 788816 785986 784168 783874 784754 786220 788509 792639 799421 808936 820881
61459 820881 834988 851081 869167 889672 913299 940467 971085 1004975 1042188 1082820 1126921
61448 1126921 1174918 1227758 1286154 1349824 1417960 1490356 1567560 1649830 1736332 1825489 1915626
61437 1915626 2004924 2090955 2170691 2241090 2299623 2344368 2373949 2387603 2385509 2368993 2340216
61426 2340216 2301378 2254140 2199863 2140242 2077529 2014186 1952482 1894202 1840312 1790779 1745069
61415 1745069 1703007 1665037 1631633 1602790 1578251 1557938 1541899 1530019 1522045 1517841 1517442 1520910
61403A520910P355J1199J4711J7480J9348K0643K1877K3293K4718K5777K6211
61392A733522K6148K6082K6427K7024K7260K6746K5816K5171K5068K5029K4446
61381B018739K3287K2015K0840J9302J6826J3526J0268P928O691N956M810K757
61369B172945K15j846l025l985n489p310q698r701j1089j2906j4139j4233j4030
61356B066709j4434j4971j4515j3014j1493j0599j0044r388q533p416o102n250
61344A940950n696p233q535q661q068p762p887p625o190l447K12M228Q194J2144
61330A894624J6524K1686K7526L3692M0026M6639N3612O0774O7742P4157P9942
61319B416944Q5307R0336R4629R7423R8051R6089R1123Q2832P1362N7442M1956
$$ plain form
61403 1520910 1528265 1539464 1554175 1571655 1591003 1611646 1633523 1656816 1681534 1707311 1733522
61392 1733522 1759670 1785752 1812179 1839203 1866463 1893209 1919025 1944196 1969264 1994293 2018739
61381 2018739 2042026 2064041 2084881 2104183 2121009 2134535 2144803 2152731 2159422 2165378 2170188 2172945
61369 2172945 2173160 2171314 2168289 2164304 2158815 2151505 2142807 2133106 2122017 2109111 2094972 2080739 2066709
61356 2066709 2052275 2037304 2022789 2009775 1998282 1987683 1977639 1968251 1959718 1952302 1946200 1940950
61344 1940950 1935254 1928021 1919486 1910825 1902757 1894995 1887108 1879483 1873293 1869846 1870058 1874286 1882480 1894624
61330 1894624 1911148 1932834 1960360 1994052 2034078 2080717 2134329 2195103 2262845 2337002 2416944
61319 2416944 2502251 2592587 2687216 2784639 2882690 2978779 3069902 3152734 3224096 3281538 3323494
61308C323494K5600R056o811k1236l4005m5430n5877o5370p3635q0327q5204q8055
61296B802200q8757q7498q4956q1885p8433p4157o8839o3068n7681n2895m8336
61285B015695m3786l9506l5843l2909l0649k8916k7387k5692k3680k1324j8466
61274A687537j4920j0833o660k755O87L391N187O508Q203J0505J2577J3387J2907
61261A725721J2030J1434J0905R846Q203O649N855N726N530M788L783L102K833
61248A816405K492J651M18p64j559j971k138k096j836j737k668n208q747j1930
61234A780312j4180j6186j8577k0738k1629k1260k0495j9728j8653j7196j5709
61223A575961j4171j2173r941q488q313q599q236p003n326l435j445K05J066J411
$$ plain form
61308 3323494 3349094 3358150 3351339 3330103 3296098 3250668 3194791 3129421 3055786 2975459 2890255 2802200
61296 2802200 2713443 2625945 2540989 2459104 2380671 2306514 2237675 2174607 2116926 2064031 2015695
61285 2015695 1971909 1932403 1896560 1863651 1833002 1804086 1776699 1751007 1727327 1706003 1687537
61274 1687537 1672617 1661784 1655124 1652369 1653056 1656447 1661634 1668142 1676345 1686850 1699427 1712814 1725721
61261 1725721 1737751 1749185 1760090 1769936 1778139 1784788 1790643 1796369 1801899 1806687 1810470 1813572 1816405
61248 1816405 1818897 1820548 1820966 1820202 1818643 1816672 1814534 1812438 1810602 1808865 1806197 1800989 1792242 1780312
61234 1780312 1766132 1749946 1731369 1710631 1689002 1667742 1647247 1627519 1608866 1591670 1575961
61223 1575961 1561790 1549617 1539676 1531188 1522875 1514276 1506040 1499037 1493711 1490276 1488831 1489036 1490102 1491513
61209A491513K141L915O597R471J1807J3392J4663J6256J8285K0285K1857K3018
61197A653200K3853K4293K4477K4902K5795K6637K6782K6340K6062K6377K6881
61186A935599K6800K5747K3886K1378J7778J2227M416m884j4529k3945l2930m0819
61174A950724m6694n0529n3259n5417n6387n5454n2949m9825m6677m3675m1013
61163A398845l8733l6408l3641l0696k8118k5983k3972k2032k0320j8676j6678
61152A103588j4223j1593r010o556m486l193k709k540k102j158P9J139J767K296
61138A051299L346M924O252O680O441O169O087O159O558P265P551O569M410J910
61124A131620m70k805m902o215o820p592r009j0422j1050j1160j1682j2969j4591
$$ plain form
61209 1491513 1493654 1497569 1504166 1513637 1525444 1538836 1553499 1569755 1588040 1608325 1630182 1653200
61197 1653200 1677053 1701346 1725823 1750725 1776520 1803157 1829939 1856279 1882341 1908718 1935599
61186 1935599 1962399 1988146 2012032 2033410 2051188 2063415 2067831 2062947 2048418 2024473 1991543 1950724
61174 1950724 1904030 1853501 1800242 1744825 1688438 1632984 1580035 1530210 1483533 1439858 1398845
61163 1398845 1360112 1323704 1290063 1259367 1231249 1205266 1181294 1159262 1138942 1120266 1103588
61152 1103588 1089365 1077772 1068762 1062206 1057720 1054527 1051818 1049278 1047176 1046018 1046097 1047236 1049003 1051299
61138 1051299 1054645 1059569 1065821 1072501 1078942 1085111 1091198 1097357 1103915 1111180 1118731 1125300 1129710 1131620
61124 1131620 1131150 1128345 1123443 1117228 1110408 1102816 1093807 1083385 1072335 1061175 1049493 1036524 1021933
61111A021933j6131j7595j8945j9820j9976j9755j9780k0250k0699k0498j9462
61100H09022j7965j6597j5756j5409j5090j4209j2559j0552q785p466o399n322
61088F62913l988k108K80K423L401L191K665K374J935Q93m83j753k990m290n102
61073F59361m821l753k697j843p98L41R33Q19P02J147J819K008J515P47J93N9
61057F55732J70J15l56j046j578j816j831j630j267j075j274j482j059k0R59J393
61041F43935J392J141N56l68j346k210l147m300n457o391p190q005q769r313r544
61026E80984r342q551p299o112n506n553n923o158n844m819l373k107j420j223
61012E07754j241j333j446j418j036k85N68J127J197R96J009J438J908J851J138
$$ plain form
61111 1021933 1005802 988207 969262 949442 929466 909711 889931 869681 848982 828484 809022
61100 809022 791057 774460 758704 743295 728205 713996 701437 690885 682100 674634 668235 662913
61088 662913 658925 656817 657097 659520 662921 666112 668777 671151 673086 673979 673496 671743 668753 664463 659361
61073 659361 654540 650787 648090 646247 645449 645790 646723 647542 648244 649391 651210 653218 654733 655480 655673 655732
61057 655732 655902 656017 655661 654615 653037 651221 649390 647760 646493 645418 644144 642662 641603 641583 642542 643935
61041 643935 645327 646468 647024 646656 645310 643100 639953 635653 630196 623805 616615 608610 599841 590528 580984
61026 580984 571642 563091 555792 549680 544174 538621 532698 526540 520696 515877 512504 510397 508977 507754
61012 507754 506513 505180 503734 502316 501280 500995 501563 502690 503887 504883 505892 507330 509238 511089 512227
60997E12227K84O1Q86K373L496L496K744K314K669L298L822M700O268P758Q145
60982E64541P619P240P405P587P592Q015R177J0439J1055J1111J1190J1497J1761
60969F86229J1785J1758J2031J2663J3324J3693J3959J4551J5322J5622J5457
60958H36394J5803J7178J8619J8954J8476J8360J8864J9328J9611K0279K1520
60947A043386K3082K5164K8104L1262L3621L5464L8091M1790M5598M9156N3148
60936A447866N7607O1659O5541P0958P8504Q6467R3379J00156J08325J17560J26452
60925B414474J34568J42333J49855J57360J65937J76577J89219K03808K21100
60916C955231K41234K62820K85005L09352L38144L72129M11554M57843N12176
$$ plain form
60997 512227 512511 512572 513458 515831 519327 522823 525567 527881 530550 533848 537670 542370 548638 556396 564541
60982 564541 572160 579400 586805 594392 601984 609999 619176 629615 640670 651781 662971 674468 686229
60969 686229 698014 709772 721803 734466 747790 761483 775442 789993 805315 820937 836394
60958 836394 852197 869375 887994 906948 925424 943784 962648 981976 1001587 1021866 1043386
60947 1043386 1066468 1091632 1119736 1150998 1184619 1220083 1258174 1299964 1345562 1394718 1447866
60936 1447866 1505473 1567132 1632673 1703631 1782135 1868602 1961981 2062137 2170462 2288022 2414474
60925 2414474 2549042 2691375 2841230 2998590 3164527 3341104 3530323 3734131 3955231
60916 3955231 4196465 4459285 4744290 5053642 5391786 5763915 6175469 6633312 7145488
60907G145488N73863O42586P20830Q11839R17358J040810J189735J369699J577955
60898A5990163J809475K063257K322422K517744K530208K264792J740803J103471
60890C2342335N35048J50934k6495k4173J12223K97209L89313K45477j81197p97646
60880C3043028j430209j930311k234790k353726k329642k211715k046355j868835
60872A6637445j696716j533678j379432j234278j097649r68195q46604p35824
60864G145069o38111n53745m82351m23320l74708l33659k98373k68432k43194
60855C529176k21288k01753j84294j68318j53045j38801j26923j18023j11218
60846B105513j05284r9646r4158q8820q3845p9326p4795o9817o4819o0475n6523
$$ plain form
60907 7145488 7719351 8361937 9082767 9894606 10811964 11852774 13042509 14412208 15990163
60898 15990163 17799638 19862895 22185317 24703061 27233269 29498061 31238864 32342335
60890 32342335 32877383 33028317 33001822 32977649 33089872 33387081 33776394 34021871 33840674 33043028
60880 33043028 31612819 29682508 27447718 25093992 22764350 20552635 18506280 16637445
60872 16637445 14940729 13407051 12027619 10793341 9695692 8727497 7880893 7145069
60864 7145069 6506958 5953213 5470862 5047542 4672834 4339175 4040802 3772370 3529176
60855 3529176 3307888 3106135 2921841 2753523 2600478 2461677 2334754 2216731 2105513
60846 2105513 2000229 1900583 1806425 1717605 1633760 1554434 1479639 1409822 1345003 1284528 1228005
60835A228005n2288m8102m4968m2772m0229l6780l3388l0996k9339k7679k5791
60824H15673k3769k1682j9866j8737j8024j7009j5729j5052j5198j5236j4536
60813F20835j3644j3157j2666j1614j0354r502q923q164p325o699o076n168m273
60800E03270l713l061j753j74P48Q25P16Q78J118J183J131J094J104J214J393
60785E05973J429J235J056J019P65k1r91j552j695j827j987j875j500j215j127
60770D97687j072j144j638k392k774k445j751j217j059j221j463j409r78o99j133
60755D75292j890j964j154m28n26q75n28L47Q12O68P73J652K650K970K935L486
60739D84220M589N043M201L132L343M699N533M861L604L141L514L743L438L099
$$ plain form
60835 1228005 1175717 1127615 1082647 1039875 999646 962866 929478 898482 869143 841464 815673
60824 815673 791904 770222 750356 731619 713595 696586 680857 665805 650607 635371 620835
60813 620835 607191 594034 581368 569754 559400 549898 540975 532811 525486 518787 512711 507543 503270
60800 503270 499557 496496 494743 494569 495317 496142 496858 497736 498854 500037 501168 502262 503366 504580 505973
60785 505973 507402 508637 509693 510712 511477 511456 510465 508913 507218 505391 503404 501529 500029 498814 497687
60770 497687 496615 495471 493833 491441 488667 486222 484471 483254 482195 480974 479511 478102 477124 476425 475292
60755 475292 473402 471438 470284 469856 469330 468455 467927 468274 469086 469754 470527 472179 474829 477799 480734 484220
60739 484220 488809 493852 498053 501185 504528 509227 514760 519621 523225 526366 529880 533623 537061 540160
60725E40160L022K756J883O09o20j573k126k209k090k253k703k845k356j705j473
60710E26477j571j543j302j093r18o42m38o19j068j320j273j290j463j282l65
60695E10290Q30J354P27o51j862k167j478l85L96P76J271K148K918L029K733K698
60679E22627K879K447J117k32o65n05q75k167l600m265m050l468l134l486m488
60664D98135n430n534m970m724n197n559m991l982l661m224m792m699m122l516
60650D32734l157l331m198n235n534n015m657n065n475m845l484k723l137l940
60636C72938m200l937l696l624l466l091k552j791p62J74M41L2k96J50J143J854
60620C49317J871J552J405J473J528J556J790K294K773K814K367J978K386L726
$$ plain form
60725 540160 543182 545938 547821 548430 547810 546237 544111 541902 539812 537559 534856 532011 529655 527950 526477
60710 526477 524906 523363 522061 520968 520050 519408 518970 518351 517283 515963 514690 513400 511937 510655 510290
60695 510290 511120 512474 513201 512550 510688 508521 507043 506658 507054 507830 509101 511249 514167 517196 519929 522627
60679 522627 525506 527953 529070 528838 528173 527668 526793 524626 521026 516761 512711 509243 506109 502623 498135
60664 498135 492705 487171 482201 477477 472280 466721 461730 457748 454087 449863 445071 440372 436250 432734
60650 432734 429577 426246 422048 416813 411279 406264 401607 396542 391067 386222 382738 380015 376878 372938
60636 372938 368738 364801 361105 357481 354015 350924 348372 346581 345819 345993 346434 346466 346170 346320 347463 349317
60620 349317 351188 352740 354145 355618 357146 358702 360492 362786 365559 368373 370740 372718 375104 378830
60606C78830N186N785N516N298N759O490O748O423N934N561N340N383N822O541
60592D60616P355Q229R004R274Q977Q725R037R534R581R275Q969Q184O185L535
60578E76480J840J643J757J038l23j733l290n041o173o001n119m601m635m846
60564E40996n394o495p339o760m967l497l279l715l819l354k575j698r86p23o88
60549D85707k47Q45K118L062L692M289N073O171P487Q500Q795Q765R192J0011
60535E63460J0225R322Q000P117O530N520L858K016O15N8L25Q20P93J89l49n56
60519F17943r99k049l112l444l269l296l608l778l800m077m589m853m710m503
60505E67856m426m245l851l514l479l675l871l743k868j179N61J338J072P83J428
$$ plain form
60606 378830 384016 389801 395317 400615 406374 412864 419612 426035 431969 437530 442870 448253 454075 460616
60592 460616 467971 476200 485204 494478 503455 512180 521217 530751 540332 549607 558576 566760 572945 576480
60578 576480 578320 579963 581720 582758 582435 580702 577412 572371 566198 560197 555078 550477 545842 540996
60564 540996 535602 529107 521768 515008 510041 506544 503265 499550 495731 492377 489802 488104 487118 486395 485707
60549 485707 485460 486305 488423 491485 495177 499466 504539 510710 518197 526697 535492 544257 553449 563460
60535 563460 573685 583007 591007 598124 604654 610174 614032 616048 616663 616721 617046 617866 618659 618848 618499 617943
60519 617943 616944 614895 611783 608339 605070 601774 598166 594388 590588 586511 581922 577069 572359 567856
60505 567856 563430 559185 555334 551820 548341 544666 540795 537052 534184 533005 533566 534904 535976 536759 538187
60490E38187K923M438N217N022M292L996M835O428P730Q409R189J0625J2246J3488
60476F37025J4719J6647J9117K1415K3483K5980K9158L2519L5774L9365M3679
60465I38881M8344N2716N6573N9859O2070O2382O0287N5745M8921M0177L0271
60454A516226K0188J0747K592l674p720r852j0876j1475j1974j2610j3656j5145
60442A452771j6778j8148j8881j8511j6653j3520r890o285k414K240P580J3055
60430A354566J8579K4711L1849L9615M7242N4125N9762O3418O4378O2625N8991
60419A879861N4517M9858M5380M1635L9555M0117M3950N1192O1561P4511Q9473
60408B471610J06111J24404J44415J66087J89275K13739K38927K63828K87302
$$ plain form
60490 538187 541110 545548 550765 555787 560079 564075 568910 575338 583068 591477 600666 611291 623537 637025
60476 637025 651744 668391 687508 708923 732406 758386 787544 820063 855837 895202 938881
60465 938881 987225 1039941 1096514 1156373 1218443 1280825 1341112 1396857 1445778 1485955 1516226
60454 1516226 1536414 1547161 1549753 1546079 1538359 1528507 1517631 1506156 1494182 1481572 1467916 1452771
60442 1452771 1435993 1417845 1398964 1380453 1363800 1350280 1340390 1334105 1331691 1333931 1341511 1354566
60430 1354566 1373145 1397856 1429705 1469320 1516562 1570687 1630449 1693867 1758245 1820870 1879861
60419 1879861 1934378 1984236 2029616 2071251 2110806 2150923 2194873 2246065 2307626 2382137 2471610
60408 2471610 2577721 2702125 2846540 3012627 3201902 3415641 3654568 3918396 4205698
60399D205698L08265L24947L33767L29566L07755K66601K07630J34324N1141l6349
60389F433345j21369j97147k58753l03992l32835l46599l47673l39349l24963
60380C860665l06805k86010k63553k40812k19002j98458j78991j60640j43585
60371A862809j27645j12594r8900q7396p8118p0197o3104n7162n2511m8394m4115
60360A022673m0009l6713l4026l1313k8635k6515k4864k3083k1189j9829j9096
60349G17401j8195j6596j4717j3159j2017j1283j1196j1619j1670j0641q976p729
60337E69603p273p045o508n812n335m958m166k829j600j305j924k542k443j925
60323E13938j689j794j707j239q40r81j702k722l571l725l129k543k747l502l874
$$ plain form
60399 4205698 4513963 4838910 5172677 5502243 5809998 6076599 6284229 6418553 6469694 6433345
60389 6433345 6311976 6114829 5856076 5552084 5219249 4872650 4524977 4185628 3860665
60380 3860665 3553860 3267850 3004297 2763485 2544483 2346025 2167034 2006394 1862809
60371 1862809 1735164 1622570 1523670 1436274 1358156 1287959 1224855 1167693 1115182 1066788 1022673
60360 1022673 982664 945951 911925 880612 851977 825462 800598 777515 756326 736497 717401
60349 717401 699206 682610 667893 654734 642717 631434 620238 608619 596949 586308 577332 569603
60337 569603 562330 555285 548777 542965 537630 532672 528506 525677 524077 522772 520848 518306 515863 513938
60323 513938 512249 510455 508748 507509 506669 505688 503986 501264 497693 493968 490839 488296 485549 482047 478173
60308D78173l475k680j756p34j75q64k446l370k782j570r98j183j531j818j960
60293D50831j541n18K09m5n86l34M56N87k72j221j479j041r1J239K417K778K386
60276D53775J900J551J013L87L38J058J850K125K108K224K447K640K995L641M290
60261D84342M584M577M455M169L634L003K480J991J263J69j076k005k260k085
60247E07241k209k966l738l713k963k169j579r14k00J79L36Q35J575J636O87l25
60231D91713m30R9M06L66M39O50N25q5q25j397j699j454l65J276K594L025K942
60214D97780L195M217N636O616O557N628M711M706N735O945P220O268N008M694
60200E74916N579O752P413P914R046J0729J2121J2865J3495J4492J5744J7118
$$ plain form
60308 478173 474698 472018 470262 469528 469353 468489 466043 462673 459891 458321 457323 456140 454609 452791 450831
60293 450831 449290 448772 448981 448936 448350 448016 448472 449059 448787 447566 446087 445046 444955 446194 448611 451389 453775
60276 453775 455675 457226 458239 458626 458964 460022 461872 463997 466105 468329 470776 473416 476411 480052 484342
60261 484342 488926 493503 497958 502127 505761 508764 511244 513235 514498 514667 513591 511586 509326 507241
60247 507241 505032 502066 498328 494615 491652 489483 487904 486990 486790 486969 487305 488140 489715 491351 492038 491713
60231 491713 491283 491382 491788 492154 492593 493243 493768 493683 492858 491461 489762 488308 487943 489219 491813 494838 497780
60214 497780 500975 505192 510828 517444 524001 529629 534340 539046 544781 551726 558946 565214 570222 574916
60200 574916 580495 587247 594660 602574 611620 622349 634470 647335 660830 675322 691066 708184
60188G08184J8836K0879K2738K4198K5829K8134L0761L3106L5341L8092M1347
60177A027445M4354M6547M7994M8926M9302M8958M7912M6375M4579M2550L9952
60166A534894L6358L1809K6868K1987J7106J2052P017K316j959n689q473j0062
60154A664224j0778j1051j0758r500p327m705j887J252M860Q960J3469J7975K1830
60141A676564K4990K8459L3170L8631M3358M6571M8677N0035N0239M8816M5878
60130B135388M1752L6616L0897K5275J9831J3791O687p28p333j2950j8098k2838
60118B248290k6549k8742k9373k8490k6181k2820j8768j3843p698p21O102J2351
60106B063558J8593K5373L2429L9148M5154N0060N3174N4102N3186N0767M6379
$$ plain form
60188 708184 727020 747899 770637 794835 820664 848798 879559 912665 948006 986098 1027445
60177 1027445 1071799 1118346 1166340 1215266 1264568 1313526 1361438 1407813 1452392 1494942 1534894
60166 1534894 1571252 1603061 1629929 1651916 1669022 1681074 1688091 1690407 1688448 1682759 1674286 1664224
60154 1664224 1653446 1642395 1631637 1622137 1614810 1610105 1608218 1609470 1614330 1623290 1636759 1654734 1676564
60141 1676564 1701554 1730013 1763183 1801814 1845172 1891743 1940420 1990455 2040694 2089510 2135388
60130 2135388 2177140 2213756 2244653 2269928 2289759 2303550 2310237 2309509 2302176 2289226 2271128 2248290
60118 2248290 2221741 2192999 2163626 2135136 2108955 2086135 2067367 2053524 2045826 2045105 2051207 2063558
60106 2063558 2082151 2107524 2139953 2179101 2224255 2274315 2327489 2381591 2434777 2485544 2531923
60095B531923L9407L0382K0819J1793L404m364j1050j6260k0093k2669k3744k3179
60083B516369k1258j8146j3469p046L88P819J5028K2493L0382L8454M6810N5945
60071B673769O5837P5777Q5400R5269J05935J16857J26881J35535J43166J49808
60061C774234J54533J56328J55256J52243J47705J40805J30351J16200R9341Q0792
60051E107788O0860L9560J7240n526k8228n0227p0626q8747j04429j17517j27319
60040D632829j33189j35394j34797j31728j25833j17063j06226r4397q2181o9662
60030C502359n6640m2951k8844j5070k273R551K0454K9727L6426M0649M3351M4843
60018C581582M4407M1659L7320L2218K6448K0040J3655P858K360l248q677j3641
$$ plain form
60095 2531923 2571330 2601712 2622531 2634324 2637728 2633364 2622314 2606054 2585961 2563292 2539548 2516369
60083 2516369 2495111 2476965 2463496 2456450 2456838 2464657 2479685 2502178 2532560 2571014 2617824 2673769
60071 2673769 2739606 2815383 2900783 2996052 3101987 3218844 3345725 3481260 3624426 3774234
60061 3774234 3928767 4085095 4240351 4392594 4540299 4681104 4811455 4927655 5026996 5107788
60051 5107788 5168648 5208208 5225448 5219922 5191694 5141467 5070841 4982094 4877665 4760148 4632829
60040 4632829 4499640 4364246 4229449 4097721 3971888 3854825 3748599 3654202 3572021 3502359
60030 3502359 3445719 3402768 3373924 3358854 3356581 3366132 3386586 3416313 3452739 3493388 3536739 3581582
60018 3581582 3625989 3667648 3704968 3737186 3763634 3783674 3797329 3805187 3807547 3804299 3795622 3781981
60006C781981j8759k4820l1514l7838m3516m9017n4255n8383o0976o2481o3211
59995C277211o2711o0629n7531n4218n0595m5844l9651l2690k5777j8956j1706
59984B816903l872M067J1590J8569K4835K9726L2575L3397L2566L0047K5626J9821
59972C075850J3645P350K07q212j7313k6325l4978m2892m9251n3812n7389o0465
59960B746415o2112o1255n8384n4829n0824m5529l8784l1606k4797j8205j1476
59949B288614m745J818Q363J5014K1693K8403L5184M1742M7638N2830N7560O1791
59937B655905O5201O7463O8002O5871O0756N3803M6504L8898K9970J9624R016
59926C181013j206j1580k2353l2479m0767m7090n1813n4850n5928n5117n2524
$$ plain form
60006 3781981 3763222 3738402 3706888 3669050 3625534 3576517 3522262 3463879 3402903 3340422 3277211
59995 3277211 3214500 3153871 3096340 3042122 2991527 2945683 2906032 2873342 2847565 2828609 2816903
59984 2816903 2813031 2817098 2828688 2847257 2872092 2901818 2934393 2967790 3000356 3030403 3056029 3075850
59972 3075850 3089495 3096845 3097052 3088840 3071527 3045202 3010224 2967332 2918081 2864269 2806880 2746415
59960 2746415 2684303 2623048 2564664 2509835 2459011 2413482 2374698 2343092 2318295 2300090 2288614
59949 2288614 2283869 2285687 2294050 2309064 2330757 2359160 2394344 2436086 2483724 2536554 2594114 2655905
59937 2655905 2721106 2788569 2856571 2922442 2983198 3037001 3083505 3122403 3152373 3171997 3181013
59926 3181013 3179807 3168227 3145874 3113395 3072628 3025538 2973725 2918875 2862947 2807830 2755306
59915B755306m8084m2174l5762k9386k2628j5121p457m52N902J2101J8246K4147
59903B614638K9732L4791L8773M1512M3682M5852M7476M7512M5734M2797L9290
59892C071789L5414L1331K7204K3002J8803J5094J2369J0667R950J0563J2828
59881C279014J6568K1587K8154L6360M5462N4667O4335P5455Q8021J00842J12942
59870C923407J24310J35116J44851J52521J57112J57672J53390J43855J29011
59861E221245J08888Q3824N4920K3833p882l8955o8080r3993j15833j33002j44797
59850D890168j50868j51967j49649j45025j38335j29663j19398j07860r5206q1891
59840C620306o8638n5669m2588k9313j6562m986N586J5700K5482L4694M3076N0110
$$ plain form
59915 2755306 2707222 2665048 2629286 2599900 2577272 2562151 2554694 2554242 2560144 2572245 2590491 2614638
59903 2614638 2644370 2679161 2717934 2759446 2803128 2848980 2896456 2943968 2989702 3032499 3071789
59892 3071789 3107203 3138534 3165738 3188740 3207543 3222637 3235006 3245673 3255623 3266186 3279014
59881 3279014 3295582 3317169 3345323 3381683 3427145 3481812 3546147 3621602 3709623 3810465 3923407
59870 3923407 4047717 4182833 4327684 4480205 4637317 4794989 4948379 5092234 5221245
59861 5221245 5330133 5413957 5468877 5492710 5484828 5445873 5377793 5283800 5167967 5034965 4890168
59850 4890168 4739300 4587333 4437684 4292659 4154324 4024661 3905263 3797403 3702197 3620306
59840 3620306 3551668 3495999 3453411 3424098 3407536 3402550 3408136 3423836 3449318 3484012 3527088 3577198
59828C577198N4844N6483N4918N0332M2589L1544J7615J519j6228l4950n3301
59817C782563o9875q4201r6468j06369j13140j16820j18463j18748j17252j13679
59807B727548j08974j04326r9589r3729q6580p9134p2068o5014n7567n0157m3344
59796A867066l7017l0941k5588k1620j8838j6345j3733j1451r997r310r055q989
59784A654182q893q510p736o605n151l567k479k527l588m918o161p769j0212j3212
59770A562854j6016j8034j9028j9085j8666j8324j8110j7563j6445j4993j3367
59759A373223j1324q801o249l942j503J454M700P948J1464J5503J9567K3037K6175
59746A451252K9599L2963L5044L5181L3813L1639K9006K6290K4023K2367K0929
$$ plain form
59828 3577198 3632042 3688525 3743443 3793775 3836364 3867908 3885523 3887042 3870814 3835864 3782563
59817 3782563 3712688 3628487 3532019 3425650 3312510 3195690 3077227 2958479 2841227 2727548
59807 2727548 2618574 2514248 2414659 2320930 2234350 2155216 2083148 2018134 1960567 1910410 1867066
59796 1867066 1830049 1799108 1773520 1751900 1733062 1716717 1702984 1691533 1681536 1672226 1663171 1654182
59784 1654182 1645289 1636779 1629043 1622438 1617287 1613720 1611241 1608714 1605126 1600208 1594047 1586278 1576066 1562854
59770 1562854 1546838 1528804 1509776 1490691 1472025 1453701 1435591 1418028 1401583 1386590 1373223
59759 1373223 1361899 1353098 1346849 1342907 1341404 1342858 1347558 1355506 1366970 1382473 1402040 1425077 1451252
59746 1451252 1480851 1513814 1548858 1584039 1617852 1649491 1678497 1704787 1728810 1751177 1772106
59735A772106J9270J7133J4218J0426O469L556K240K152L002N054Q348J2303J6609
59722A892886K1805K8388L5822M3167N0207N7399O5046P3274Q2455R2898J04112
59711B547459J15028J24894J33411J39859J42630J39729J29457J10699Q3378M9222
59701C715766J2002k3481n3207p5264q9854r8181j01278r9887r5046q8155q0164
59690B923251p1166o1155n0717m0503l0435k0110r772j50Q589J6962K5258L3279
59678B723331M1196M9738N9115O8411P6749Q4497R2729J01827J11366J21161J31618
59667C661738J42993J54973J67235J79967J93584K08202K23545K39088K54129
59658E425454K67942K80046K90216K98159L03371L05342L03711K98262K89169
$$ plain form
59735 1772106 1791376 1808509 1822727 1833153 1839622 1843178 1845418 1847570 1850572 1855626 1863974 1876277 1892886
59722 1892886 1914691 1943079 1978901 2022068 2072275 2129674 2194720 2267994 2350449 2443347 2547459
59711 2547459 2662487 2787381 2920792 3060651 3203281 3343010 3472467 3583166 3666544 3715766
59701 3715766 3727768 3704287 3651080 3575816 3485962 3387781 3286503 3186616 3091570 3003415 2923251
59690 2923251 2852085 2790930 2740213 2699710 2669275 2649165 2639393 2639243 2647832 2664794 2690052 2723331
59678 2723331 2764527 2814265 2873380 2941791 3018540 3103037 3195766 3297593 3408959 3530120 3661738
59667 3661738 3804731 3959704 4126939 4306906 4500490 4708692 4932237 5171325 5425454
59658 5425454 5693396 5973442 6263658 6561817 6865188 7170530 7474241 7772503 8061672
59649H061672K77434K64803K53008K43152K35816K31249K29215K28932K29541
59640A0254822K30461K30941K29422K23849K12746J95869J73908J47855J18666
59631A2018539Q7272N4821K3009o016l0458m9587o3415p1805p4270p0700o1710
59620A1755680m8078l0203q392J6673M4142P3504J04550J36935J70058K03192
59610A2418061K35380K65195K90917L11050L24352L29215L23275L03988K69708
59601A5071141K20291J56908Q1751j924q9678j76281k56597l26412l82819m24475
59591A3871905m51724m66150m69444m62721m47144m25058l99965l75167l52929
59582A0021603l35094l23857l21024l26320l36900l48785l58674l64510l65024
$$ plain form
59649 8061672 8339106 8603909 8856917 9100069 9335885 9567134 9796349 10025281 10254822
59640 10254822 10485283 10716224 10945646 11169495 11382241 11578110 11752018 11899873 12018539
59631 12018539 12105811 12160632 12183641 12177625 12147167 12097580 12034165 11962360 11888090 11817390 11755680
59620 11755680 11707602 11677399 11669007 11685680 11729822 11803326 11907876 12044811 12214869 12418061
59610 12418061 12653441 12918636 13209553 13520603 13844955 14174170 14497445 14801433 15071141
59601 15071141 15291432 15448340 15530091 15528167 15438489 15262208 15005611 14679199 14296380 13871905
59591 13871905 13420181 12954031 12484587 12021866 11574722 11149664 10749699 10374532 10021603
59582 10021603 9686509 9362652 9041628 8715308 8378408 8029623 7670949 7306439 6941415
59573F941415l59508l48276l32842l15133k96359k76876k56961k37366k18827
59564D299267k01387j84596j68247j52580j37836j23989j11030r9165q8640p9518
59554B952279p1679o4841n8623n2936m8183m4711m2113l9577l7046l5413l5376
59543B421781l6501l7851l9012m0144m1336m2441m3352m3965m3962m2994m1099
59532A969124l8682l6164l3828l1745k9609k6887k3493k0114j7405j5044j2085
59521A684068q306m620j965j90J721M438P584J0182J1615J2131J2465J3115J4121
59508A756359J5353J6716J8015J9014J9828K0930K2567K4471K6371K8513L1320
59497A999457L4793L8570M2395M6248N0260N4768O0186O6414P2664P8312Q3677
$$ plain form
59573 6941415 6581907 6233631 5900789 5585656 5289297 5012421 4755460 4518094 4299267
59564 4299267 4097880 3913284 3745037 3592457 3454621 3330632 3219602 3120437 3031797 2952279
59554 2952279 2880600 2815759 2757136 2704200 2656017 2611306 2569193 2529616 2492570 2457157 2421781
59543 2421781 2385280 2347429 2308417 2268273 2226937 2184496 2141144 2097179 2053217 2010223 1969124
59532 1969124 1930442 1894278 1860450 1828705 1799096 1772209 1748716 1728602 1711197 1696153 1684068
59521 1684068 1675762 1671142 1669177 1668987 1670708 1675146 1682730 1692912 1704527 1716658 1729123 1742238 1756359
59508 1756359 1771712 1788428 1806443 1825457 1845285 1866215 1888782 1913253 1939624 1968137 1999457
59497 1999457 2034250 2072820 2115215 2161463 2211723 2266491 2326677 2393091 2465755 2544067 2627744
59486B627744Q9520R5957J02392J08279J13300J16941J18634J18495J17261J15297
59476C723820J12180J07443J01277R4134Q6043P6587O5442N2741L9238K6222J5027
59465D500154O291l45n740j0498j4538j7099j7176j4267q778j599O680J6017K6527
59452D465629L7998M9640O0027O7504P1033P0513O6029N7122M3288K4977L453
59441E017213k0184m5249p0801r5418j17727j36597j50945j60129j64612j65529
59431C890022j63389j58041j49941j40502j30622j19809j07449r4344q2112p1459
59421B672354o1790n2267m2605l2944k3541j4569n882K928J1925K0582K8437L5741
59409B538369M3010N0287N7354O4290P1170P7412Q2171Q5334Q7391Q8197Q6593
$$ plain form
59486 2627744 2717264 2813221 2915613 3023892 3137192 3254133 3372767 3491262 3608523 3723820
59476 3723820 3836000 3943443 4044720 4138854 4224897 4301484 4366926 4419667 4458905 4485127 4500154
59465 4500154 4506445 4506100 4500360 4489862 4475324 4458225 4441049 4426782 4418004 4416405 4423085 4439102 4465629
59452 4465629 4503627 4553267 4613294 4680798 4751831 4822344 4888373 4945495 4988783 5013760 5017213
59441 5017213 4997029 4951780 4880979 4785561 4667834 4531237 4380292 4220163 4055551 3890022
59431 3890022 3726633 3568592 3418651 3278149 3147527 3027718 2920269 2825925 2743813 2672354
59421 2672354 2610564 2558297 2515692 2482748 2459207 2444638 2438756 2441684 2453609 2474191 2502628 2538369
59409 2538369 2581379 2631666 2689020 2753310 2824480 2901892 2984063 3069397 3156788 3244985 3331578
59398C331578Q1548P3165O2192M9001L3581J6253k126k0731l9096n6710p2626
59387C456029q5873r6182j03998j09621j12779j13351j12144j10295j07964j04334
59377B399488r9090r3169q7580q2079p5702o8347o1040n4705m9347m4558m0214
59366A643657l6305l2456k8114k3211j8392j4419j1447q976o526m123j972J38
59354A457854K669N551Q180J0423J3060J6668K0302K1964K0506J6735J2686J0135
59342A616733R721J0978J3006J5358J8503K3195K9277L5238L9114L9922L8297
59331A889342L5979L4724L5526L8551M3465M9608N6086O2264O8383P5362Q3682
59320B472972R2793J01881J10933J20570J31119J42401J54328J67141J80976J95664
$$ plain form
59398 3331578 3413126 3486291 3548483 3597484 3631065 3647318 3645192 3624461 3585365 3528655 3456029
59387 3456029 3370156 3273974 3169976 3060355 2947576 2834225 2722081 2611786 2503822 2399488
59377 2399488 2300398 2207229 2119649 2037570 1961868 1893521 1832481 1777776 1728429 1683871 1643657
59366 1643657 1607352 1574896 1546782 1523571 1505179 1490760 1479313 1470337 1463811 1459688 1457716 1457854
59354 1457854 1460523 1466074 1474254 1484677 1497737 1514405 1534707 1556671 1577177 1593912 1606598 1616733
59342 1616733 1626454 1637432 1650438 1665796 1684299 1707494 1736771 1772009 1811123 1851045 1889342
59331 1889342 1925321 1960045 1995571 2034122 2077587 2127195 2183281 2245545 2313928 2389290 2472972
59320 2472972 2565765 2667646 2778579 2899149 3030268 3172669 3326997 3494138 3675114 3870778
59310C870778K10945K26371K40839K52894K61744K67598K70601K69974K64777
59301F136521K55248K42751K28534K13069J96697J80192J64307J49080J34049
59292G900448J19035J04292Q9851P4977N8497L9621J8345m817k9372n5009q1234
59281H234634j06949j30624j51050j67931j81671j92646k00812k05945k07991
59272F689015k07189k04157j99921j95541j91399j86989j81654j75385j68717
59263D978063j61981j55029j47645j39956j32343j25149j18451j12039j05627
59254C779843r9134r2630q6006p9053p2018o5644o0204n4901m8873m2480l6883
59243C042017l2383k8046k3093j7862j3067q839m926j241K287N958R857J3580
$$ plain form
59310 3870778 4081723 4308094 4548933 4801827 5063571 5331169 5601770 5871744 6136521
59301 6136521 6391769 6634520 6863054 7076123 7272820 7453012 7617319 7766399 7900448
59292 7900448 8019483 8123775 8213626 8288603 8347100 8386721 8405066 8400249 8370877 8315868 8234634
59281 8234634 8127685 7997061 7846011 7678080 7496409 7303763 7102951 6897006 6689015
59272 6689015 6481826 6277669 6077748 5882207 5690808 5503819 5322165 5146780 4978063
59263 4978063 4816082 4661053 4513408 4373452 4241109 4115960 3997509 3885470 3779843
59254 3779843 3680709 3588079 3502073 3423020 3351002 3285358 3225154 3170253 3121380 3078900 3042017
59243 3042017 3009634 2981588 2958495 2940633 2927566 2918727 2913801 2912560 2914847 2920805 2930662 2944242
59231B944242J6789J9716K2660K5454K7894L0289L2927L5324L6732L7203L7470
59220C266700L7831L7883L7404L6673L5803L4428L2396L0246K8471K6729K4195
59209C628759K0487J5890J0756N097j336q857j7703k7735l8185m7970n6428o3597
59197C419178o9725p4612p7671p8472p7026p3718o9401o5578o3873o4782o7116
59186B637204o8944o8964o6834o2652n6778m9994m3151l6497k9871k3390j7415
59175B112714j1796n944J82N905J0954J6088K2102K8834L5624M2290M9102N6323
59163B362378O4295P3530Q3957R4491J04179J13560J24049J35957J47929J58433
59153C462758J67076J74109J79212J81236J78894J71401J58585J40739J18426
$$ plain form
59231 2944242 2961031 2980747 3003407 3028861 3056755 3087044 3119971 3155295 3192027 3229230 3266700
59220 3266700 3304531 3342414 3379818 3416491 3452294 3486722 3519118 3549364 3577835 3604564 3628759
59209 3628759 3649246 3665136 3675892 3680989 3679653 3670796 3653093 3625358 3587173 3539203 3482775 3419178
59197 3419178 3349453 3274841 3197170 3118698 3041672 2967954 2898553 2832975 2769102 2704320 2637204
59186 2637204 2568260 2499296 2432462 2369810 2313032 2263038 2219887 2183390 2153519 2130129 2112714
59175 2112714 2100918 2094974 2095156 2101061 2112015 2128103 2150205 2179039 2214663 2256953 2306055 2362378
59163 2362378 2426673 2500203 2584160 2678651 2782830 2896390 3020439 3156396 3304325 3462758
59153 3462758 3629834 3803943 3983155 4164391 4343285 4514686 4673271 4814010 4932436
59144D932436R2317O3101L1530j330l3806o3739q9283j09686j25073j35548j40937
59133D419982j41473j38110j31955j23778j14353j04631r5165q5795p6330o7102
59123C341290n8455n0218m2314l5314k9753k5301k1348j8078j6216j5903j6586
59112C011804j7814j9451k1314k3313k5726k8629l1355l3291l4931l7095l9341
59101B699544m0314l9717l8714l8167l7552l6066l3759l1052k8010k4712k1641
59090B329840j9053j6556j3770j0902q137n183j872J336M086O832J0097J3533
59078B290251J6399J8657K0857K3192K5326K7080K8638L0129L1522L2803L3822
59067B578676L4039L3046L1292K9730K8681K7579K5886K3738K1432J8876J5933
$$ plain form
59144 4932436 5024753 5087854 5119384 5118054 5084248 5020509 4931226 4821540 4696467 4560919 4419982
59133 4419982 4278509 4140399 4008444 3884666 3770313 3665682 3570517 3484722 3408392 3341290
59123 3341290 3282835 3232617 3190303 3154989 3125236 3099935 3078587 3060509 3044293 3028390 3011804
59112 3011804 2993990 2974539 2953225 2929912 2904186 2875557 2844202 2810911 2775980 2738885 2699544
59101 2699544 2659230 2619513 2580799 2542632 2505080 2469014 2435255 2404203 2376193 2351481 2329840
59090 2329840 2310787 2294231 2280461 2269559 2261422 2256239 2254367 2255703 2259789 2266621 2276718 2290251
59078 2290251 2306650 2325307 2346164 2369356 2394682 2421762 2450400 2480529 2512051 2544854 2578676
59067 2578676 2612715 2645761 2677053 2706783 2735464 2763043 2788929 2812667 2834099 2852975 2868908
59056B868908J2953J0394Q068N387K463L13l31l1P5k47j89P56K095L277M588O530
59040B925009Q780J0604J2053J4053J7145K0770K3812K5307K4505K0795J3938
59029C116771M245p664k1146l5597n0423o4855p7772q8083r5582j00997j04779
59018B474118j06305j04950j01446r7229r2767q7587q1802p6346p1523o6580o1165
59007A526418n6089n2068m8641m5024m1241l7675l4249l0806k7713k5351k3432
58996A104129k1448j9337j7166j4737j2116r980q714p781o681n989o411p355p506
58983I58908o586n455m587l521j940k07J447L427O063R012J1652J3603J4703J4895
58969A011414J4363J3349J1772R503P022N151M083L219K184J273O62j61j547k900
$$ plain form
59056 2868908 2881861 2892255 2900323 2905710 2908173 2908486 2908155 2908124 2908199 2907952 2907763 2908519 2910614 2913891 2918479 2925009
59040 2925009 2933789 2944393 2956446 2970499 2987644 3008414 3032226 3057533 3082038 3102833 3116771
59029 3116771 3121016 3113352 3092206 3056609 3006186 2941331 2863559 2775476 2679894 2578897 2474118
59018 2474118 2367813 2262863 2161417 2064188 1971421 1883834 1802032 1725686 1654163 1587583 1526418
59007 1526418 1470329 1418261 1369620 1324596 1283355 1245680 1211431 1180625 1152912 1127561 1104129
58996 1104129 1082681 1063344 1046178 1031441 1019325 1009345 1000631 992850 986169 980180 973769 966414 958908
58983 958908 952322 946867 942280 938759 936819 936612 938059 941486 947549 956561 968213 981816 996519 1011414
58969 1011414 1025777 1039126 1050898 1060401 1067423 1072574 1076657 1079876 1082060 1083333 1083995 1083834 1082287 1079387
58955A079387l349k924k398k088j520l65Q92J521J479J322J389J438J160O80L03
58940A076927j06j090k946n291p451r085j0356j1619j3056j4412j5080j4633j3394
58927I58408j2213j1514j0828r517p675n972m777l803k607j029Q26K761M497N781
58913I02338O625P364Q402R911J1687J3286J4336J4868J5236J5692J6149J6412
58901A052306J6445J6260J5738J4820J3720J2804J2275J2116J2239J2585J3178
58890A204486J4229J5954J8194K0396K2178K3646K4979K6015K6569K6968K7760
58879A451374K9030L0394L1685L3176L5069L7277L9756M2671M5902M8851N1084
58868A876269N3046N5717N9600O4363O9468P4733Q0188Q5759R1436R7538J04434
$$ plain form
58955 1079387 1076038 1073114 1070716 1068628 1067108 1066743 1067635 1069156 1070635 1071957 1073346 1074784 1075944 1076624 1076927
58940 1076927 1076821 1075731 1072785 1067494 1060043 1050958 1040602 1028983 1015927 1001515 986435 971802 958408
58927 958408 946195 934681 923853 914336 906661 900689 895912 892109 889502 888473 889299 892060 896557 902338
58913 902338 908963 916327 924729 934640 946327 959613 973949 988817 1004053 1019745 1035894 1052306
58901 1052306 1068751 1085011 1100749 1115569 1129289 1142093 1154368 1166484 1178723 1191308 1204486
58890 1204486 1218715 1234669 1252863 1273259 1295437 1319083 1344062 1370077 1396646 1423614 1451374
58879 1451374 1480404 1510798 1542483 1575659 1610728 1648005 1687761 1730432 1776334 1825185 1876269
58868 1876269 1929315 1985032 2044632 2108995 2178463 2253196 2333384 2419143 2510579 2608117 2712551
58857B712551J12095J20257J28956J38475J48772J59418J70302J81859J94344
58848D067029K07305K20155K32754K44987K56170K65513K72820K78020K80161
58839F324914K77599K69113K54265K32736K04181J68847J27738Q2155L3608j5853
58829G959303o4010j09301j50669j86760k16220k38862k55471k66266k70705k69295
58819E931744k64298k57803k49926k39836k27853k15478k03804j92828j82040
58810C897878j70989j59480j47929j37276j27993j19558j11307j03375r6170q9497
58800B634304q2895p6501p0822o6042o2094n8989n6341n3137m8808m4060l9885
58789A974730l6154l2140k7887k3987k0402j6676j3037j0041p211l425J296N645
$$ plain form
58857 2712551 2824646 2944903 3073859 3212334 3361106 3520524 3690826 3872685 4067029
58848 4067029 4274334 4494489 4727243 4972230 5228400 5493913 5766733 6044753 6324914
58839 6324914 6602513 6871626 7125891 7358627 7562808 7731655 7859393 7941548 7975156 7959303
58829 7959303 7895293 7785992 7635323 7448563 7232343 6993481 6738010 6471744 6201039 5931744
58819 5931744 5667446 5409643 5159717 4919881 4692028 4476550 4272746 4079918 3897878
58810 3897878 3726889 3567409 3419480 3282204 3154211 3034653 2923346 2819971 2723801 2634304
58800 2634304 2551409 2474908 2404086 2338044 2275950 2216961 2160620 2107483 2058675 2014615 1974730
58789 1974730 1938576 1906436 1878549 1854562 1834160 1817484 1804447 1794406 1787195 1783770 1785066 1790711
58777A790711Q946J1917J5225J8458K1182K3954K7500L1617L5630L9366M3081
58766B067587M6880N0806N5201O0411O6334P2496P8447Q3916Q9029R4465J01036
58755B866608J08813J17088J25293J33621J42547J52269J62782J74118J86153
58746D169292J98447K10531K22131K33104K43335K52595K60126K64452K64134
58737F318147K58558K47534K30298K05820J74145J36602R4550M8758L65m8482
58727G666295r5433j38833j77417k09906k35556k54608k67592k74688k76281k73649
58717E462332k68339k61062k51790k40684k28346k15373k02246j89525j77665
58708C427302j66600j55986j45693j35833j26372j17226j08649j01013r4210q7637
$$ plain form
58777 1790711 1799657 1811574 1826799 1845257 1866439 1890393 1917893 1949510 1985140 2024506 2067587
58766 2067587 2114467 2165273 2220474 2280885 2347219 2419715 2498162 2582078 2671107 2765572 2866608
58755 2866608 2975421 3092509 3217802 3351423 3493970 3646239 3809021 3983139 4169292
58746 4169292 4367739 4578270 4800401 5033505 5276840 5529435 5789561 6054013 6318147
58737 6318147 6576705 6824239 7054537 7260357 7434502 7571104 7665654 7714412 7714777 7666295
58727 7666295 7570862 7432029 7254612 7044706 6809150 6554542 6286950 6012262 5735981 5462332
58717 5462332 5193993 4932931 4681141 4440457 4212111 3996738 3794492 3604967 3427302
58708 3427302 3260702 3104716 2959023 2823190 2696818 2579592 2470943 2369930 2275720 2188083
58698B188083q0923p4349o8398o3125n8101n2890m7431m2017l6983l2415k8166
58687A603285k4110k0333j6954j3811j0504o858l312n72J196K593M080N050M307
58674A524057J439k796p587j2830j8373k3218k6254k7469k7802k7981k8148k8399
58662A294639k8890k9447k9748k9908l0319l0962l1405l1495l1410l1129l0443
58651I59483k9499k8604k7533k5798k3648k1972k0961j9732j7680j5424j3921
58640G14711j3240j2726j1876j0640r252q226q066q543q691p914o820o422o790
58627E95505o977o171m584l151k578k659k501j493Q7J553K680L697M704N620O607
58612E90339P841Q949R345R180R233R712R928R316Q056O421M399K301Q75K46n09
$$ plain form
58698 2188083 2107160 2032811 1964413 1901288 1843187 1790297 1742866 1700849 1663866 1631451 1603285
58687 1603285 1579175 1558842 1541888 1528077 1517573 1510715 1507403 1506831 1508027 1510620 1514700 1519750 1524057
58674 1524057 1525496 1522700 1515113 1502283 1483910 1460692 1434438 1406969 1379167 1351186 1323038 1294639
58662 1294639 1265749 1236302 1206554 1176646 1146327 1115365 1083960 1052465 1021055 989926 959483
58651 959483 929984 901380 873847 848049 824401 802429 781468 761736 744056 728632 714711
58640 714711 701471 688745 676869 666229 656977 648751 640685 632142 623451 615537 608717 602295 595505
58627 595505 588528 582357 577773 574622 572044 569385 566884 565391 565478 567031 569711 573408 578112 583732 590339
58612 590339 598180 607129 616474 625654 634887 644599 654527 663843 671899 678320 682719 685020 685895 686141 685632
58597F85632k072l832m778m975n344o353p592q475q758q538q160p931p645o606
58583E94573m626k574j437j055l69J239L320N118O434P665R145J0632J1514J1607
58569F51186J1645J2612J4566J6564J7876J8830K0180K2037K3817K5029K5854
58558H60196K6998K9063L2018L5277L8443M1739M5458M9336N2938N6420O0264
58547A328150O4455O8633P2748P6751P9755Q0596P9270P6648P2697O6178N6440
58536B122321M4285L0648J5705j5j4964k8001l9439m9626n7479o1758o3127o3539
58524A835011o3870o3338o1168n7676n3545m8957m3765l8073l2395k7399k3352
58513A321473j9779j5962j1889q239n302k571L54L302O250R650J3340J6115J7121
$$ plain form
58597 685632 683560 679728 674950 669975 664631 658278 650686 642211 633453 624915 616755 608824 601179 594573
58583 594573 589947 587373 585936 584881 584512 585751 589071 594189 600623 608288 617433 628065 639579 651186
58569 651186 662831 675443 690009 706573 724449 743279 763459 785496 809313 834342 860196
58558 860196 887194 916257 948275 983552 1021995 1063734 1109192 1158528 1211466 1267886 1328150
58547 1328150 1392605 1461238 1533986 1610737 1690492 1771088 1850358 1927006 1999703 2065881 2122321
58536 2122321 2166606 2197254 2212959 2212944 2197980 2169979 2130540 2080914 2023435 1961677 1898550 1835011
58524 1835011 1771141 1707803 1646635 1588959 1535414 1486457 1442692 1404619 1372224 1344825 1321473
58513 1321473 1301694 1285732 1273843 1265604 1260302 1257731 1258085 1261387 1267637 1277287 1290627 1306742 1323863
58500A323863J6873J6013J3765Q730P34q974j8987k8291l6031m1747m5681m8140
58488A152127m8926m8018m6316m4769m3174m0722l7414l3960l0653k7318k4149
58477G26708k1585j9463j7243j5027j3487j2753j2160j1142r751q267o932n969
58465E72929n368m736l841l130l140l672m029l858l345k850k752l172l433k440
58451E23163j60J888K311J423N17L59J091K786M931O189N866N091N400O661P636
58436E75152Q027Q565R478J0296J0994J2101J3709J5522J7584J9769K0972K0097
58424G42266J7616J4825J1898Q229M277J316o85l204o915j0896j4330j7329j9816
58411G27252k1096k1163k0956k0818j9980j8141j6209j4892j3765j2379j1094
$$ plain form
58500 1323863 1340736 1356749 1370514 1379244 1379978 1371004 1352017 1323726 1287695 1245948 1200267 1152127
58488 1152127 1103201 1055183 1008867 964098 920924 880202 842788 808828 778175 750857 726708
58477 726708 705123 685660 668417 653390 639903 627150 614990 603848 594097 585830 578898 572929
58465 572929 567561 562825 558984 555854 552714 549042 545013 541155 537810 534960 532208 529036 525603 523163
58451 523163 523003 524891 527202 528625 529142 529501 530592 533378 538309 544498 550364 555455 560855 567516 575152
58436 575152 583179 591744 601222 611518 622512 634613 648322 663844 681428 701197 722169 742266
58424 742266 759882 774707 786605 794834 799111 800427 799742 796538 789623 778727 764397 747068 727252
58411 727252 706156 684993 664037 643219 623239 605098 588889 573997 560232 547853 536759
58400E36759j0139r007p467o162n509m907l776k452j483q02j80L24Q24J723K912
58385D90658L683L867M154M920N623N833N841N906N877O012P018Q684R670R303
58371E77049Q550Q392Q324P391N660L681J339j595m431o246p162p991q919r407
58357E74635r104q102o494m374k175m01Q33J664K234K803L775N150O408P192P757
58342E81801Q348Q701Q508P852O797N024K393m85k730m062m841n491o140o635
58328E99040o712o286n553m711l798l091l132l812l968k715q00L66O23R11J479
58313E57841J675J473J725K627L289L240L195L860M989O030O795P131O924O647
58299F17441O985P773Q309Q678R534J0501J0349R072Q290R025J0477J1536J2190
$$ plain form
58400 536759 526620 517613 510146 503984 498475 493568 489792 487340 485857 485055 484875 485199 486023 487746 490658
58385 490658 494341 498208 502362 507282 512905 518738 524579 530485 536362 542374 549392 558076 567746 577049
58371 577049 585599 593991 602315 609706 615366 619047 620386 618791 614360 608114 600952 592961 584042 574635
58357 574635 565531 557429 550935 546561 544386 543985 544818 546482 548716 551519 555294 560444 566852 574044 581801
58342 581801 590149 598850 607358 615210 622007 627031 629424 628939 626209 622147 617306 611815 605675 599040
58328 599040 592328 586042 580489 575778 571980 568889 565757 561945 557977 555262 554462 554828 555451 556362 557841
58313 557841 559516 560989 562714 565341 568630 571870 575065 578925 583914 589944 596739 603870 610794 617441
58299 617441 624426 632199 640508 649186 658720 669221 679570 688642 696932 705957 716434 727970 740160
58286G40160J2731J2866J2263J0979Q880N767K416J53r50k061l477m128l610k919
58272G89070k530j615P5J375J782K512M328O110O815P181Q071Q788Q630Q654J0143
58257H59389J2469J4124J4913J5626J6428J6974J7339J7641J7503J6890J6471
58246A035767J6262J5169J2842J0597R415Q492P119O418P553R581J0817J1270
58234A161302J2081J3477J4890J6246J7653J8645J9019J9565K0909K2518K3878
58223A360183K5445K7464K9238L0707L3151L7126M1286M4609M8047N2538N7141
58212A786935O0840O4355O8405P1761P2906P2064O9894O5922O0114N4218M9671
58201B497085M5845M2140L9896M0228M2070M4383M8176N4190O0874O6990P3867
$$ plain form
58286 740160 752891 765757 778020 788999 797879 803646 806062 806215 805265 803204 799727 795599 791989 789070
58272 789070 786540 784925 785000 786375 788157 790669 794997 801107 807922 815103 823174 831962 840592 849246 859389
58257 859389 871858 885982 900895 916521 932949 949923 967262 984903 1002406 1019296 1035767
58246 1035767 1052029 1067198 1080040 1090637 1100052 1108544 1115663 1122081 1129634 1139215 1150032 1161302
58234 1161302 1173383 1186860 1201750 1217996 1235649 1254294 1273313 1292878 1313787 1336305 1360183
58223 1360183 1385628 1413092 1442330 1473037 1506188 1543314 1584600 1629209 1677256 1729794 1786935
58212 1786935 1847775 1912130 1980535 2052296 2125202 2197266 2267160 2333082 2393196 2447414 2497085
58201 2497085 2542930 2585070 2624966 2665194 2707264 2751647 2799823 2854013 2914887 2981877 3055744
58190C055744Q2511R0982R7520J03758J11787J20467J27921J35220J44084J53312
58180D223306J61210J69309J79918J92193K04471K18177K35308K54349K72876
58171F111117K91908L13318L35463L56027L76679M00038M24618M48008M72440
58162I529616N01623N34627N68662O05180O47054O92446P38151P86333Q41079
58153A5444771R01183R63591J030865J107437J192055J282567J384693J506857
58145B4814019J650771J817687K018983K267678K563146K897619L273874L702643
58137D5006420M188383M734737N357309O069834O863653P726140Q677488R772087
58129I8396051J1085065J2720961J4747214J6933093J8475657J8154578J5049781
$$ plain form
58190 3055744 3138255 3229237 3326757 3430515 3542302 3662769 3790690 3925910 4069994 4223306
58180 4223306 4384516 4553825 4733743 4925936 5130407 5348584 5583892 5838241 6111117
58171 6111117 6403025 6716343 7051806 7407833 7784512 8184550 8609168 9057176 9529616
58162 9529616 10031239 10565866 11134528 11739708 12386762 13079208 13817359 14603692 15444771
58153 15444771 16345954 17309545 18340410 19447847 20639902 21922469 23307162 24814019
58145 24814019 26464790 28282477 30301460 32569138 35132284 38029903 41303777 45006420
58137 45006420 49194803 53929540 59286849 65356683 72220336 79946476 88623964 98396051
58129 98396051 109481116 122202077 136949291 153882384 172358041 190512619 205562400
58122B05562400R289630K120698m782639j0150102j3488668j4958262j5067659
58115A58525398j4407975j3457137j2478701j1549794j0662353r792414q915577
58108G7261447q019007p119591o254088n449525m717261m068708l513804l044467
58100C5074996k639656k288055j989775j737982j517648j322511j155010j008442
58092B1415917q66788p23894n85856m52973l16809j76688m0035R7050K50331M24481
58082A9024736O08975P99998J003925J218737J448647J746488K181891K704245
58074C0737642L056015K901052K089124P93295o10886j781539k547939k900169
58066C1736595k923597k746350k494316k249526k038228j854882j689581j534874
$$ plain form
58122 205562400 214852030 216972728 212190089 202039987 188551319 173593057 158525398
58115 158525398 144117423 130660286 118181585 106631791 95969438 86177024 77261447
58108 77261447 69242440 62122849 55868761 50419236 45701975 41633267 38119463 35074996
58100 35074996 32435340 30147285 28157510 26419528 24901880 23579369 22424359 21415917
58092 21415917 20549129 19825235 19239379 18786406 18469597 18292909 18252874 18349924 18600255 19024736
58082 19024736 19633711 20433709 21437634 22656371 24105018 25851506 28033397 30737642
58074 30737642 33793657 36694709 38783833 39577128 38966242 37184703 34636764 31736595
58066 31736595 28812998 26066648 23572332 21322806 19284578 17429696 15740115 14205241
58058A4205241j383207j230643j080974r41174q14988p03687o09437n33684m73863
58049F433584m24967l83636l48780l19473k94384k72579k52995k33760k13499
58040C689511j92815j73190j55034j37926j22137j08546r7520q9062q3515q0780
58030B448986p9382p7693p5906p5358p6085p6489p5500p3676p1908p0365o8951
58019A627673o7660o6014o3258n9491n5635n2016m8085m3804m0069l7263l4609
58008A059769l1690k9342k8220k7517k6078k3920k1712j9656j7830j6890j7201
57997G99713j7885j7830j7155j6667j6328j5451j4056j2915j2301j1765j1112
57986F36248j0688j0572j0293r532q560p862p688p931q115p675o563n369m557
$$ plain form
58058 14205241 12822034 11591391 10510417 9569243 8754255 8050568 7441131 6907447 6433584
58049 6433584 6008617 5624981 5276201 4956728 4662344 4389765 4136770 3903010 3689511
58040 3689511 3496696 3323506 3168472 3030546 2908409 2799863 2702343 2613281 2529766 2448986
58030 2448986 2369604 2291911 2216005 2140647 2064562 1988073 1912573 1838897 1766989 1696624 1627673
58019 1627673 1560013 1493999 1430741 1371250 1315615 1263599 1215514 1171710 1131641 1094378 1059769
58008 1059769 1028079 998737 970517 943000 916922 893002 871290 851634 833804 816914 799713
57997 799713 781828 763998 746843 730176 713848 698397 684341 671426 659125 647360 636248
57986 636248 625560 614988 604695 595163 586603 578741 571053 563122 555007 547332 540769 535400 530843
57973E30843l995l541l555m289n276n907o208o472o655o655o685o685n938m134
57959D54848k282j631j990k073j285j95N82J024J271J343J449J863K468K988L564
57944D61944M598O044P403Q304Q653Q451Q006P970Q605R235Q979P689N694L110
57930E64685J70k323l833n016o797q829r955j0033j0103j0713j1248j1100j0548
57917D64357j0046r551q872q104p343o463n428m413l524k770k272k081j882j359
57903C90249p19k63K41J142K086K400K126J923J907J538N49o97j858k853l499
57888C94272l666l724m080m356l927l166l040l388k821p19J709K997L158L236
57874C72485L775M495N055N471N871O163N921M683K543K79j473k933m504n793
$$ plain form
57973 530843 526848 523307 519752 515463 510187 504280 498072 491600 484945 478290 471605 464920 458982 454848
57959 454848 452566 450935 448945 446872 445587 445392 445974 446998 448269 449612 451061 452924 455392 458380 461944
57944 461944 466542 472586 479989 488293 496946 505397 513403 521373 529978 539213 548192 555881 561575 564685
57930 564685 564855 562532 558699 553683 546886 538057 528102 518069 507966 497253 486005 474905 464357
57917 464357 454311 444760 435888 427784 420441 413978 408550 404137 400613 397843 395571 393490 391608 390249
57903 390249 389530 389267 389508 390650 392736 395136 397262 399185 401092 402630 403179 402482 400624 397771 394272
57888 394272 390606 386882 382802 378446 374519 371353 368313 364925 362104 361385 363094 366091 369249 372485
57874 372485 376260 380755 385810 391281 397152 403315 409236 413919 416462 416741 415268 412335 407831 402038
57860D02038o172o058o659q263r766j0096r288q022o932o508o760o775n560l572
57846C01607k422k740l445l464l060k780k279j078L30J135J309J248R65N17O00
57831B86443J682K975L292K665K143K195K338K250K355K959L567L410K276O00
57817C21150r37j743j619r53m77o79j406k109k394k352k311k339k139j567r71
57802B97154p10n93j70N25J039J160J066Q98Q00J205K438L938M671M415L892L530
57786C25258K921J857J012R97J396J330N80l84j104j471j618j842k358k944l146
57771C20484k936k664k344j621n98Q8K61M63Q64P79k40j586k483k948l263l196
57755B99060k551j862j822k403l192m035m786m963m462m015m203m516m129l204
$$ plain form
57860 402038 395866 389808 383149 374886 365120 355024 345736 337714 330782 324274 317514 310739 305179 301607
57846 301607 299185 296445 293000 289536 286476 283696 281417 280339 280669 281804 283113 284361 285326 285843 286443
57831 286443 288125 291100 294392 297057 299200 301395 303733 305983 308338 311297 314864 318274 320550 321150
57817 321150 320213 318470 316851 315898 315421 314742 313336 311227 308833 306481 304170 301831 299692 298125 297154
57802 297154 296444 295851 295681 296206 297245 298405 299471 300369 301169 302374 304812 308750 313421 317836 321728 325258
57786 325258 328179 330036 331048 332045 333441 334771 335351 334967 333863 332392 330774 328932 326574 323630 320484
57771 320484 317548 314884 312540 310919 310321 310409 310670 311133 311997 312776 312536 310950 308467 305519 302256 299060
57755 299060 296509 294647 292825 290422 287230 283195 278409 273446 268984 264969 260766 256250 252121 248917
57741B48917k495k154j786j371j184j113q41n32n26n51n9Q78J732K340K843L130
57725B47228L225L769N175O578O824O325O590P813Q355P061M834L196K328J393
57711C20694J26q93j260j218j189j406j968k807l543l753l547l589m374n496n904
57696B79873n067l624k672k470k330j742j067q89j165j390j192n12L81Q34K92
57681B57260q07j240n44M02P57Q70J281J524J021M75R89K199K720K262J893K163
57665B73225K347J915J374J247J241J072J120J654K198K263K122K305K880L649
57651C00612M539N350N654N353M942M876N188N804O769P868Q596Q823Q926R052
57637C92352Q983Q965R930J2255J4977J6797J7392J7275J6942J6775J7308J8846
$$ plain form
57741 248917 246422 244268 242482 241111 239927 238814 237973 237441 236915 236364 236305 237183 238915 241255 244098 247228
57725 247228 250453 254222 259397 265975 272799 279124 285714 293527 301882 308943 313777 316973 319301 320694
57711 320694 320820 319927 318667 317449 316260 314854 312886 310079 306536 302783 299236 295647 291273 285777 279873
57696 279873 274806 271182 268510 266040 263710 261968 260901 260012 258847 257457 256265 255753 256134 256968 257260
57681 257260 256453 255213 254669 255071 255828 256698 257979 259503 260524 260999 261988 264187 266907 269169 271062 273225
57665 273225 275572 277487 278861 280108 281349 282421 283541 285195 287393 289656 291778 294083 296963 300612
57651 300612 305151 310501 316155 321508 326450 331326 336514 342318 349087 356955 365551 374374 383300 392352
57637 392352 401335 410300 420230 432485 447462 464259 481651 498926 515868 532643 549951 568797
57625E68797K0960K2896K4423K5943K7975L0855L4657L9080M3668M8335N3414
57614I41003N8940O4419O9553P4774Q0645Q7066R3418R9084J03396J05400J04054
57603A881752R8324Q6858O8267M2579J2280j8650m6715o9805q6773r7181j01536
57592A769400j01219r7864r2811q6959q0731p4231o7640o1442n5987n1045m6025
57581I53446m0680l5304l0380k6127k2351j8745j5356j2662j0879r338p129m285
57569G20210j665L83K453M828O803P864Q808J0809J3812J6801J9333K1866K4731
57556H57036K7649L0360L3034L5801L8499M1062M3663M6319M8621M9996M9928
57545A301968M8002M4098L8505L1529K3024J2772J166j0818k2344l2848m1618
$$ plain form
57625 568797 589757 612653 637076 663019 690994 721849 756506 795586 839254 887589 941003
57614 941003 999943 1064362 1133915 1208689 1289334 1376400 1469818 1568902 1672298 1777698 1881752
57603 1881752 1980076 2066934 2135201 2177780 2190060 2171410 2124695 2054890 1968117 1870936 1769400
57592 1769400 1668181 1570317 1477506 1390547 1309816 1235585 1167945 1106503 1050516 999471 953446
57581 953446 912766 877462 847082 820955 798604 779859 764503 751841 740962 731624 724495 720210
57569 720210 718545 718928 721381 726209 733012 740876 749684 760493 774305 791106 810439 832305 857036
57556 857036 884685 915045 948079 983880 1022379 1063441 1107104 1153423 1202044 1252040 1301968
57545 1301968 1349970 1394068 1432573 1464102 1487126 1499898 1501064 1490246 1467902 1435054 1393436
57534A393436m7975n2024n4579n6079n6179n4772n2813n1399n0385m8628m5566
57523H23037m1890l8472l5327l2130k9195k7196k5988k4435k1811j8774j6550
57512E11269j5491j4960j4309j3399j2218j0740r237q122p368o586n746n241n074
57499C82778m643l702k846k587k545k089j297o20J0R43J971K439K200J835J862
57484C73709K270K843L508M208M831N423O171P144Q185R105R766J0083J0133J0225
57470D67604J0644J1429J2543J4031J5789J7415J8625J9665K1060K3060K5559
57459F57424K8387L1350L4206L6830L9254M1275M2323M2028M0604L8331L4926
57448A066938K9874K3165J5272O632k415j1330j9541k6754l2776l7230l9913m1222
$$ plain form
57534 1393436 1345461 1293437 1238858 1182779 1126600 1071828 1019015 967616 917231 868603 823037
57523 823037 781147 742675 707348 675218 646023 618827 592839 568404 546593 527819 511269
57512 511269 495778 480818 466509 453110 440892 430152 420915 412793 405425 398839 393093 387852 382778
57499 382778 378135 374433 371587 369000 366455 364366 363069 362449 362459 363402 365373 367812 370012 371847 373709
57484 373709 375979 378822 382330 386538 391369 396792 402963 410107 418292 427397 437163 447246 457379 467604
57470 467604 478248 489677 502220 516251 532040 549455 568080 587745 608805 631865 657424
57459 657424 685811 717161 751367 788197 827451 868726 911049 953077 993681 1032012 1066938
57448 1066938 1096812 1119977 1135249 1141881 1139466 1128136 1108595 1081841 1049065 1011835 971922 930700
57436I30700m1686m1331l9972l7960l5973l4139l1984k9257k6274k3373k0577
57425E68174j7849j5280j2959j0966r392q029o299l945j660l42O6M34J218K121
57411D85292K912L859N203O834Q595J0343J1685J2370J2991J4602J7427K0574
57399F12687K3264K5525K7560K9172L0353L1624L3226L4454L4415L3061L0901
57388I46242K7965K3662J7578R948J411p412j6037k4041l0952l6282l9840m2016
57376H30226m3361m3935m3393m1732l9532l7351l5321l3431l1668k9721k7104
57365D23677k3945k1219j9802j9469j9216j8280j6637j4731j3028j1681j0444
57354B35225r031p599o647o402o543o634o409n705m538l366k826k999l365l500
$$ plain form
57436 930700 889014 847683 807711 769751 733778 699639 667655 638398 612124 588751 568174
57425 568174 550325 535045 522086 511120 501728 493699 487400 483455 481795 481453 481519 481953 483171 485292
57411 485292 488204 492063 497266 504100 512695 523038 534723 547093 560084 574686 592113 612687
57399 612687 635951 661476 689036 718208 748561 780185 813411 847865 882280 915341 946242
57388 946242 974207 997869 1015447 1025395 1026806 1019394 1003357 979316 948364 912082 872242 830226
57376 830226 786865 742930 699537 657805 618273 580922 545601 512170 480502 450781 423677
57365 423677 399732 378513 358711 339242 320026 301746 285109 270378 257350 245669 235225
57354 235225 226194 218595 211948 205546 199003 192369 185960 180255 175717 172351 169525 166526 163161 159661
57340A59661l383k949k003q42k70o37j352j757j938k251k574k567k264j898j498
57325A31478j118j102j595k076j927j317r72j275j994k680k940k567j857j600
57311A06458k233l138l317k592j680j180j073j225j756k620l278l142k318j541
57297G5365j381j629j625j187q86j222j793j832j369j180j517j698j216n76m78
57282E5776p76q44n95m93p97j325j784j916j509p36k68n78j358j899j904j495
57266C7499q14n0M62O39Q94J454J802J403O87N55J144J723J827J649J411J037
57250E3322O00M56P51J257J765K161K122J434O09N42J317K014K044J971K558L489
57234G8412L737L002K159K146K889L515L501L305L747M869N706N377M139L182
$$ plain form
57340 159661 156278 153329 151326 150484 150214 149577 148225 146468 144530 142279 139705 137138 134874 132976 131478
57325 131478 130360 129258 127663 125587 123660 122343 121371 120096 118102 115422 112482 109915 108058 106458
57311 106458 104225 101087 97770 95178 93498 92318 91245 90020 88264 85644 82366 79224 76906 75365
57297 75365 73984 72355 70730 69543 68657 67435 65642 63810 62441 61261 59744 58046 56830 56254 55776
57282 55776 55000 54156 53561 53068 52271 50946 49162 47246 45737 45001 44733 44155 42797 40898 38994 37499
57266 37499 36685 36635 37097 37736 38630 40084 41886 43289 43976 44531 45675 47398 49225 50874 52285 53322
57250 53322 53922 54378 55129 56386 58151 60312 62434 63868 64477 65019 66336 68350 70394 72365 74923 78412
57234 78412 82149 85151 87310 89456 92345 95860 99361 102666 106413 111282 116988 122365 126504 129686
57220A29686L388M564N765O101N362M125L285L204L386L158K458J594M55j490
57206A75041m269p013q754r377r554r904j0424j0675j0375r705r007q260p100
57193F0624n439l827k919k767k855k690k163j457r27q75j186j254n49P61K009
57178C4486K733L003L204L728M821O452Q329J0172J1779J2867J3182J3054J3293
57165A41103J4219J5182J5517J5531J5932J6617J6856J6535J6393J6946J7850
57154C18681J8559J8925J8939J8464J7622J7077J7470J8616J9570J9493J8417
57143E21833J7184J6611J6663J6574J5826J4786J4118J3956J3983J4183J4937
57132F90654J6424J8194J9446J9573J8590J7205J6283J6093J6191J6124J5742
$$ plain form
57220 129686 133074 137638 143403 149504 154866 158991 162276 165480 168866 172024 174482 176076 176531 175041
57206 175041 170772 163759 155005 145628 136074 126170 115746 105071 94696 84991 75984 67724 60624
57193 60624 55185 51358 48439 45672 42817 40127 37964 36507 35580 34705 33519 32265 31716 32477 34486
57178 34486 37219 40222 43426 47154 51975 58427 66756 76928 88707 101574 114756 127810 141103
57165 141103 155322 170504 186021 201552 217484 234101 250957 267492 283885 300831 318681
57154 318681 337240 356165 375104 393568 411190 428267 445737 464353 483923 503416 521833
57143 521833 539017 555628 572291 588865 604691 619477 633595 647551 661534 675717 690654
57132 690654 707078 725272 744718 764291 782881 800086 816369 832462 848653 864777 880519
57121H80519J4828J3038J0671Q791P963P456O367M924L862K994J507n89k448l768
57107I56115n129o856q544r937j1404j3295j5377j7176j8303j8490j7956j7716
57095G95932j8760k0876k3008k4783k6869k9720l2940l6115l9420m3012m6643
57084D53786n0324n4789o0836o8589p7686E3967d3680j07285j16551j26071j36253
57073e29840j46897j57588j68055j78257j88639k00203k13869k29832k48047k69067
57063b530294k93659l21963l53808l89553m29821m74751n24506n80195o43247
57054f541797p14229p93528q82773r84251j099172j227933j371868j533545j715967
57045a6865063j923206k161341k436921k755045l121062l543643m033927m602351
$$ plain form
57121 880519 895347 908385 919056 927847 935810 943266 949633 954557 958419 961413 962920 962331 959883 956115
57107 956115 950986 944130 935586 925649 914245 900950 885573 868397 850094 831604 813648 795932
57095 795932 777172 756296 733288 708505 681636 651916 618976 582861 543441 500429 453786
57084 453786 403462 348673 287837 219248 141562 53967 -43680 -150965 -267516 -393587 -529840
57073 -529840 -676737 -834325 -1002380 -1180637 -1369276 -1569479 -1783348 -2013180 -2261227 -2530294
57063 -2530294 -2823953 -3145916 -3499724 -3889277 -4319098 -4793849 -5318355 -5898550 -6541797
57054 -6541797 -7256026 -8049554 -8932327 -9916578 -11015750 -12243683 -13615551 -15149096 -16865063
57045 -16865063 -18788269 -20949610 -23386531 -26141576 -29262638 -32806281 -36840208 -41442559
57037d1442559n258807o014710o880645p861317q954454j0151827j1435969j2778186
57029a10778474j4147450j5520253j6872782j8167243j9366171k0465792k1480778
57022b36798943k2344792k2804636k2435594k0809925j7713485j3274293p944061
57015c64125729k355323K884047P373484J0991492J3828135J6045453J7768712
57008b97589729J9054569J9911874K0338047K0353966K0021987J9428940J8643120
57001a59837226J7686792J6552657J5245015J3804718J2302432J0816211R412453
56994f4016948Q135696P006292O025036N181472M460602L846350L323722K880081
56986b3157697K504484K186201J914924J682242J481927J308932J158995J029108
$$ plain form
57037 -41442559 -46701366 -52716076 -59596721 -67458038 -76412492 -86564319 -98000288 -110778474
57029 -110778474 -124925924 -140446177 -157318959 -175486202 -194852373 -215318165 -236798943
57022 -236798943 -259143735 -281948371 -304383965 -325193890 -342907375 -356181668 -364125729
57015 -364125729 -366481052 -363597005 -356223521 -345232029 -331403894 -315358441 -297589729
57008 -297589729 -278535160 -258623286 -238285239 -217931273 -197909286 -178480346 -159837226
57001 -159837226 -142150434 -125597777 -110352762 -96548044 -84245612 -73429401 -64016948
56994 -64016948 -55881252 -48874960 -42849924 -37668452 -33207850 -29361500 -26037778 -23157697
56986 -23157697 -20653213 -18467012 -16552088 -14869846 -13387919 -12078987 -10919992 -9890884
56978i890884R17142Q20644P36588O62476N97041N39722M89852M46462M08456
56969d272501L74777L44680L17850K94112K73092K54259K37104K21101K05720
56960a749806J90802J76620J63269J50269J37172J24199J11834R9938Q7865P5424
56950d32414O3204N1921M1793L2553K3739J4868N616m121j4428k5187l5351m2729
56938c20536m5302m2852l6888k9112k0523j1740l221N085J3505K1924L0154L9097
56926d00409N0216O3436P7094R1172i896A20494J49458J51898J26993P6150J2523
56915F37516m7122r0667j14168j20792j17093C8718f0907r0467q2238p5112o8174
56904c76898o0200n0967m1228l1689k2683j4656q153l178P12L580M933M532K872
$$ plain form
56978 -9890884 -8973742 -8153098 -7416510 -6754034 -6156993 -5617271 -5127419 -4680957 -4272501
56969 -4272501 -3897724 -3553044 -3235194 -2941082 -2667990 -2413731 -2176627 -1955526 -1749806
56960 -1749806 -1559004 -1382384 -1219115 -1068846 -931674 -807475 -695641 -595703 -507838 -432414
56950 -432414 -369210 -317289 -275496 -242943 -219204 -204336 -198720 -202841 -217269 -242456 -277807 -320536
56938 -320536 -365838 -408690 -445578 -474690 -495213 -506953 -510174 -505089 -491584 -469660 -439506 -400409
56926 -400409 -350193 -286757 -209663 -118491 -9896 120494 269952 421850 548843 624993 637516
56915 637516 590394 499727 385559 264767 147674 38718 -60907 -151374 -233612 -308724 -376898
56904 -376898 -437098 -488065 -529293 -560982 -583665 -598321 -606474 -609652 -608940 -605360 -600427 -595895 -593023
56891e93023P86r97j898j713r59m63l11K60J698L356M307M534M771N433O258P012
56875e60949P934R338J1091J2870J4723J6885J8893J9298J6791J1695N966J533
56863d13932j100k576l482l931l918l493k602j229K57J383K145K903L699M208
56849d21668M428M849N677O359O282N553M703L983L356K978L162L803M306M207
56835c58022L732L585M243N496O667P244P300P307P626Q294R137R837R845Q679
56821b59030O458L987K079R15K06k23k61J54P98J339J643J881K413L534N305P527
56805b21275R920J2250J4401J6384J8351K0507K2795K4618K4895K2680a6528d744
56792A014R39d87m511n327n008m038l049k280j405M5K191M751P406a528A1893
$$ plain form
56891 -593023 -592237 -593234 -595132 -596845 -597804 -598267 -598578 -598318 -596620 -593264 -588957 -584423 -579652 -574219 -567961 -560949
56875 -560949 -553015 -543677 -532586 -519716 -504993 -488108 -469215 -449917 -433126 -421431 -415465 -413932
56863 -413932 -415032 -417608 -421090 -425021 -428939 -432432 -435034 -436263 -436006 -434623 -432478 -429575 -425876 -421668
56849 -421668 -417240 -412391 -406714 -400355 -394073 -388520 -383817 -379834 -376478 -373500 -370338 -366535 -362229 -358022
56835 -358022 -354290 -350705 -346462 -340966 -334299 -327055 -319755 -312448 -304822 -296528 -287391 -277554 -267709 -259030
56821 -259030 -252572 -248585 -246506 -245591 -245385 -245608 -245869 -245715 -244917 -243578 -241935 -240054 -237641 -234107 -228802 -221275
56805 -221275 -211355 -199105 -184704 -168320 -149969 -129462 -106667 -82049 -57154 -34474 -16528 -4744
56792 1014 1953 -487 -4998 -10325 -15333 -19371 -22420 -24700 -26105 -26060 -23869 -19118 -11712 -1528 11893
56776B9188K1418K5134K8188L0818L2972L3678L1434K5298J5723M580n613j3012
56764B59806j7419j9939k1555k2217k1439j9293j6468j3603j0917q313n525k282
56752H0836J402N288R355J3812J8404K2267K4786K6046K5770K2569J5364N364
56740B71263m485j2112j7482k1189k3130k3130k1894k0459j9082j7316j4848j1802
56728F4334q521n519l375k169j151O40L478O869J0118J2589J3563J2379Q903L775
56714A15913j874o922j0604j2642j3156j2557j1516j0797j0785j1142B764g706
56701a7098q406p796p576p527p213o262m784l316k300j770j569j597j777k018
56687h1009k319k687k931k715j974j054l70o7l5q5k4K48O27Q44O14j56j151j625
$$ plain form
56776 29188 50606 75740 103928 134746 167718 201396 232830 258128 273851 278431 272818 259806
56764 259806 242387 222448 200893 178676 157237 137944 121476 107873 96956 88643 83118 80836
56752 80836 82238 87526 96881 110693 129097 151364 176150 202196 227966 250535 265899 271263
56740 271263 266778 254666 237184 215995 192865 169735 147841 127382 108300 90984 76136 64334
56728 64334 55813 50294 46919 44750 43599 44239 47717 54586 64704 77293 90856 103235 112138 115913
56714 115913 114039 107117 96513 83871 70715 58158 46642 35845 25060 13918 2764 -7706
56701 -17098 -25504 -33300 -40876 -48403 -55616 -61878 -66662 -69978 -72278 -74048 -75617 -77214 -78991 -81009
56687 -81009 -83328 -86015 -88946 -91661 -93635 -94689 -95059 -95126 -95161 -95246 -95270 -95022 -94395 -93551 -92937 -93093 -94244 -95869
56669i5869j018K50J009P34K77O73J654K058J503P87N62M81l6q20j167p44Q9P20
56651h8857Q54P55Q44J007O04n67j723j975j420p09M1J080K024K077J287N88M64
56634h3626N35O22J167K188K856K697K345K425K526J996J141P69R87J277J425
56619e8670J654J953J902J248K56n30o64j39N06O83M64M52Q81J299J316J071P76
56602d5542L29k63o91q18q92r35n87R3L23l78j459k093k191k128k029j915k031
56585f3207k365k355j661q32n49o42m83M2O71J448K465L219L100K406K109K571
56569e4063L148L162K634K034J641J416J200J007J086J543J912J533N24j56J61
56554c1218J087J801J860J156k02j486j619m50Q09J121Q87R94J348J311J057J302
$$ plain form
56669 -95869 -96887 -96637 -95628 -94894 -94617 -93944 -92290 -90232 -88729 -87942 -87380 -86899 -86935 -87755 -88922 -89666 -89577 -88857
56651 -88857 -88003 -87248 -86404 -85397 -84793 -85360 -87083 -89058 -90478 -91187 -91146 -90066 -88042 -85965 -84678 -84090 -83626
56634 -83626 -83091 -82469 -81302 -79114 -76258 -73561 -71216 -68791 -66265 -64269 -63128 -62359 -61372 -60095 -58670
56619 -58670 -57016 -55063 -53161 -51913 -51657 -52187 -52851 -52990 -52484 -51801 -51337 -50885 -50004 -48705 -47389 -46318 -45542
56602 -45542 -45213 -45476 -46167 -46985 -47877 -48812 -49399 -49306 -48983 -49361 -50820 -52913 -55104 -57232 -59261 -61176 -63207
56585 -63207 -65572 -67927 -69588 -70420 -70969 -71611 -72094 -72052 -71381 -69933 -67468 -64249 -61149 -58743 -56634 -54063
56569 -54063 -50915 -47753 -45119 -43085 -41444 -40028 -38828 -37821 -36735 -35192 -33280 -31747 -31223 -31379 -31218
56554 -31218 -30131 -28330 -26470 -25314 -25516 -27002 -28621 -29071 -28262 -27141 -26254 -25260 -23912 -22601 -21544 -20242
56538b0242K009K421K225J743J137L15l33j70P24J527J695J375Q50L43K95J007
56522c079a093A227J821J171R83J279J808K267K226J521O78L75N73P61Q70J273
56506A8833J982K567K807K764K448K082K437L930N594O001N152M398M473M740
56492G0208M607M466M783N256N476N621N918O039N588M623L377J963P38K63N35
56477A29461P91M81j31o91j387k410l371l809l872l886l792l407k964k729k496
56462I5788j950j330j201j726k605l573m478m998m761l813k680j830j297q57n05
56447E8184n36j153k032k506k276j736j385j191q75n56n91q18o38N2N27J57p46
56430D1881j325j149n07O3K81J62j84o37r45p29J10J034J259O78J5j12J42L64
$$ plain form
56538 -20242 -18233 -15812 -13587 -11844 -10707 -10392 -10725 -10895 -10171 -8644 -6949 -5574 -4724 -4381 -4086 -3079
56522 -3079 -1093 1227 3048 4219 5202 6481 8289 10556 12782 14303 14981 15356 15929 16690 17560 18833
56506 18833 20815 23382 26189 28953 31401 33483 35920 39850 45444 51445 56597 60995 65468 70208
56492 70208 74815 79281 84064 89320 94796 100417 106335 112374 117962 122585 125962 127925 128663 128926 129461
56477 129461 130252 130733 130602 129911 128524 126114 122743 118934 115062 111176 107384 103977 101013 98284 95788
56462 95788 93838 92508 91307 89581 86976 83403 78925 73927 69166 65353 62673 60843 59546 58689 58184
56447 58184 57648 56495 54463 51957 49681 47945 46560 45369 44494 43938 43347 42529 41891 41943 42470 42627 41881
56430 41881 40556 39407 38900 38963 39244 39406 39222 38585 37640 36911 37021 38055 39314 39992 40007 39895 40037 40401
56412D0401N57Q51R93P63N75R90J851K502K650K448J945J201P98J384K636L416
56396F5961L119K335J994K368L049L529L602L433L266K985K325J591J628K599
56382A03784L443L256K585K466K729K435J604J192J430J539J192R62J072Q88J42
56367A30719m74m33k25m90j105j701k348l197l967m296m123l494k509j702j782
56352I8873k668l392l253k525j816j331j047r16o16J97J164J405P15j53n94p69
56336H3274q50n16K55P66O00L35O57J257J326O99r7o08q03r08j236j935k668k820
56318G6728k289j596j201j048q90n54J30J151J977K064J684J548J626J204J89
56303H0723o12o60k03O15J943L277L463K334J244J290J922K071J714J457J393
$$ plain form
56412 40401 40958 41809 42802 43565 44140 45130 46981 49483 52133 54581 56526 57727 58525 59909 62545 65961
56396 65961 69080 71415 73409 75777 78826 82355 85957 89390 92656 95641 97966 99557 101185 103784
56382 103784 107227 110483 113068 115534 118263 120698 122302 123494 124924 126463 127655 128617 129689 130577 130719
56367 130719 130245 129812 129587 129097 127992 126291 123943 120746 116779 112483 108360 104866 102357 100655 98873
56352 98873 96205 92813 89560 87035 85219 83888 82841 81925 81309 81506 82670 84075 84790 84637 84043 83274
56336 83274 82424 81908 82163 82929 83529 83864 84521 85778 87104 87803 87706 87098 86295 85387 84151 82216 79548 76728
56318 76728 74439 72843 71642 70594 69704 69150 69280 70431 72408 74472 76156 77704 79330 80534 80723
56303 80723 80111 79451 79248 79863 81806 85083 88546 90880 92124 93414 95336 97407 99121 100578 101971
56288A01971J302J389J839K170J854J187Q43R36J188J626K361L031L110K603J983
56273A29393J646J662J785J575R89Q39J888L408L757K668J725K029K736K810K873
56258A61783M004N651O335N841N218M902M343L489L228M013N062N393M973M471
56244B28706M298M308M141L724L357L322L431L191K440J504P60L82M92R48J124
56229B66128O00P8O56K169L332L640L966M774N183M544L744L936M909N793O496
56214C19948P397Q329Q945R530J0483J1514J2240J3033J4366J5852J6918J7919
56202D66474J9647K2057K4448K6501K8445L0470L2702L5339L8156M0407M1799
56191H06445M3008M4507M5633M5637M4961M4387M3574M1431L7617L2720K7358
$$ plain form
56288 101971 103273 104662 106501 108671 110525 111712 112555 113491 114679 116305 118666 121697 124807 127410 129393
56273 129393 131039 132701 134486 136061 137050 137889 139777 143185 146942 149610 151335 153364 156100 158910 161783
56258 161783 165787 171438 177773 183614 188832 193734 198077 201566 204794 208807 213869 219262 224235 228706
56244 228706 233004 237312 241453 245177 248534 251856 255287 258478 260918 262422 263182 263564 264056 265004 266128
56229 266128 266728 266806 267462 269631 272963 276603 280569 285343 290526 295070 298814 302750 307659 313452 319948
56214 319948 327345 335674 344619 354149 364632 376146 388386 401419 415785 431637 448555 466474
56202 466474 486121 508178 532626 559127 587572 618042 650744 686083 724239 764646 806445
56191 806445 849453 893960 939593 985230 1030191 1074578 1118152 1159583 1197200 1229920 1257278
56180A257278K1927J6762J1700O010m25o368j0560j3240j5478j7628j9363k0643
56168A209972k1608k2026k1875k1954k2875k4002k4375k4201k4319k4744k4935
56157I53058k5062k5764k6892k7668k7814k7549k6831k5610k4523k4195k4162
56146F66988k3485k2115k0693j9348j7787j6178j4900j3695j2159j0730j0121
56135D85777j0099r809r019q056o933n603m657m608m880m592l995l932m276m126
56121D01192l271k276j386m81J89L11K90O71J217J531K026L110M050L955L366
56106D14494L489M379N246O059P252Q347Q519Q213Q522R283R361Q776Q768R849
56092E20557J1256J2345J3086J3354J3144J3303J4532J5885J5942J5182J5469
$$ plain form
56180 1257278 1279205 1295967 1307667 1313677 1313252 1306884 1296324 1283084 1267606 1249978 1230615 1209972
56168 1209972 1188364 1166338 1144463 1122509 1099634 1075632 1051257 1027056 1002737 977993 953058
56157 953058 927996 902232 875340 847672 819858 792309 765478 739868 715345 691150 666988
56146 666988 643503 621388 600695 581347 563560 547382 532482 518787 506628 495898 485777
56135 485777 475678 465869 456850 448794 441861 436258 431601 426993 422113 417521 413526 409594 405318 401192
56121 401192 397921 395645 394259 393778 393967 394278 394568 395239 396456 397987 400013 403123 407173 411128 414494
56106 414494 417983 422362 427608 433667 440919 449266 457785 465998 474520 483803 493164 501940 510708 520557
56092 520557 531813 544158 557244 570598 583742 597045 611577 627462 643404 658586 674055
56081F74055J7310J9474K1369K3816K7282L1172L5252M0118M5794N1418N6741
56070A043801O2565O9374P6895Q5109R4154J02860J08912J10891J09053J04014
56060A967628R6149Q6529P6866O8101O0205N3373M7853M2380L4500K3205J0088
56049B566877k390j2699k0279k5409k9662l5239m3302n3529o5101p7000q7585
56038B114682r5320j00030j02222j01449r6894q9447q1439p4119o6916n9255n1592
56027A195999m4461l7972l2514k8578k5746k3107k0635j8861j7478j5714j3819
56016I17114j2589j1671j0107q220p132o627n419l449j866q15P08K753M178M715
56002H61573N391O725Q249R810J1603J3003J3229J2974J3506J4511J4804J4730
$$ plain form
56081 674055 691365 710839 732208 756024 783306 814478 849730 889848 935642 987060 1043801
56070 1043801 1106366 1175740 1252635 1337744 1431898 1534758 1643670 1754561 1863614 1967628
56060 1967628 2063777 2150306 2227172 2295273 2355478 2408851 2456704 2499084 2533584 2556789 2566877
56049 2566877 2564487 2551788 2531509 2506100 2476438 2441199 2397897 2344368 2279267 2202267 2114682
56038 2114682 2019362 1919332 1817110 1715661 1618767 1529320 1447881 1373762 1306846 1247591 1195999
56027 1195999 1151538 1113566 1081052 1052474 1026728 1003621 982986 964125 946647 930933 917114
56016 917114 904525 892854 882747 874527 867395 860768 855349 851900 850034 849219 849927 852680 856858 861573
56002 861573 866964 873689 881938 891748 903351 916354 929583 942557 956063 970574 985378 1000108
55990A000108J5602J7134J7844J7733J8134J9136J9595J9490J9865K0677K1167
55979A206485K1902K3928K6353K7603K8392L0534L3466L5268L6436L9073M2805
55968A552245M5322M6678M9018N2306N4330N5092N6894N9971O2359O4238O7878
55957B166331P2910P6395P8176Q1389Q6908R2108R6102J01179J07942J13948J18586
55946C191974J24373J31990J38921J44447J51018J59238J66579J72660J80590
55937D561790J91474K02939K14620K29572K48408K67648K85811L05409L27206
55928F834877L48462L68661L90773M15126M38748M62413M91146N25764N61678
55919A0837648N98033O39673O87684P37013P86425Q41395R03944R69556J037786
$$ plain form
55990 1000108 1015710 1032844 1050688 1068421 1086555 1105691 1125286 1144776 1164641 1185318 1206485
55979 1206485 1228387 1252315 1278668 1306271 1334663 1365197 1398663 1433931 1470367 1509440 1552245
55968 1552245 1597567 1644245 1693263 1745569 1799899 1854991 1911885 1971856 2034215 2098453 2166331
55957 2166331 2239241 2315636 2393812 2475201 2562109 2654217 2750319 2851498 2959440 3073388 3191974
55946 3191974 3316347 3448337 3587258 3731705 3882723 4041961 4208540 4381200 4561790
55937 4561790 4753264 4956203 5170823 5400395 5648803 5916451 6202262 6507671 6834877
55928 6834877 7183339 7552000 7942773 8357899 8796647 9259060 9750206 10275970 10837648
55919 10837648 11435681 12075354 12763038 13500051 14286476 15127871 16031815 17001371 18039157
55910A8039157J115327J204701J301380J406493J530305J678752J850556K053007
55902C0179678K304463K612781K966774L357293L790513M272970M805123N401886
55894E9691481O098786O926845P907202R080594J0501782J2179920J4060916J6071297
55886A42518823J8055075J9532772J9590485J7270939J2298407N459768j773463
55879B32952806q033076j2579029j5306337j6490672j6563110j5960864j5015926
55872A33003792j3914517j2744918j1561243j0400770r280337q210365p208758
55865E9682884o292259n466719m735365m104669l573254l125643k745071k423488
55857B7216416k153717j922818j720617j545758j396913j266200j147052j040486
$$ plain form
55910 18039157 19154484 20359185 21660565 23067058 24597363 26276115 28126671 30179678
55902 30179678 32484141 35096922 38063696 41420989 45211502 49484472 54289595 59691481
55894 59691481 65790267 72717112 80624314 89704908 100206690 112386610 126447526 142518823
55886 142518823 160573898 180106670 199697155 216968094 229266501 234726269 232952806
55879 232952806 224919730 212340701 197034364 180543692 163980582 148019718 133003792
55872 133003792 119089275 106344357 94783114 84382344 75102007 66891642 59682884
55865 59682884 53390625 47923906 43188541 39083872 35510618 32384975 29639904 27216416
55857 27216416 25062699 23139881 21419264 19873506 18476593 17210393 16063341 15022855
55849A5022855r47829q64755p87956p20407o64375o15641n69862n28541m93608
55840H829881m61919m30175m00177l74497l51556l29265l08977k91861k75609
55831E605845k58515k42722k30020k18484k06388j95275j86030j76121j64041
55822C728249j52337j43136j34557j24747j15498j08579j02218r4508q6872q0954
55812B584843p5426o8990o3203n9254n5151m9261m3716m1144m0815m1033m2546
55801B004304m6487n1409n5343n8588o1833o3714o2980o0813n8664n5904n1992
55790A376577m8486m6457m4241m0302l6098l3544l1737k8780k4927k1451j8130
55779A002424j4303j0753q441o968o208p491j1140j4815j6393j6543j6520j5552
$$ plain form
55849 15022855 14075026 13210271 12422315 11701908 11037533 10421892 9852030 9323489 8829881
55840 8829881 8367962 7937787 7537610 7163113 6811557 6482292 6173315 5881454 5605845
55831 5605845 5347330 5104608 4874588 4656104 4449716 4254441 4068411 3892290 3728249
55822 3728249 3575912 3432776 3298219 3173472 3057974 2949395 2847177 2752669 2665797 2584843
55812 2584843 2509417 2440427 2377224 2317970 2262819 2213558 2169842 2128698 2087883 2046850 2004304
55801 2004304 1957817 1906408 1851065 1792477 1730644 1666930 1603950 1543137 1484473 1428569 1376577
55790 1376577 1328091 1281634 1237393 1197091 1160993 1127449 1095712 1066932 1042005 1020554 1002424
55779 1002424 988121 977368 968927 961959 955751 948260 937120 922305 905912 889369 872849 857297
55767H57297j2780r716q318q277q450r169j0882j2355j2650j3224j5579j8470
55755G17427j9943k0469k1476k2248k1168j8877j7425j6989j6040j4155j2360
55744E16277j1167j0224r438q707p276m986l241l054l244k272q04m59j061j270
55730D49074j058j402k227k698l057m170n764o808p275p822q215p729o585n487
55716C78777m344k890j945k378l510m081m166m610n306n667o106p257q281p788
55702C10448o051m596l929l392k936l315m553n712o244o320o026n417n036n218
55688B41703n219m238k921k533l081l549l647l952m549m872m767m562m262l683
55674A85868l111k862k545j808j227j378j614j059l43q36k517l970m378m207m012
$$ plain form
55767 857297 844517 834801 826483 818206 809756 800587 789705 777350 764700 751476 735897 717427
55755 717427 697484 677015 655539 633291 612123 593246 575821 558832 542792 528637 516277
55744 516277 505110 494886 485448 476741 469465 464479 461238 458184 454940 452668 451864 451405 450344 449074
55730 449074 448016 446614 444387 441689 438632 434462 428698 421890 414615 406793 398578 390849 384264 378777
55716 378777 374433 371543 369598 367220 363710 359629 355463 350853 345547 339880 333774 326517 318236 310448
55702 310448 304397 299801 295872 292480 289544 286229 281676 275964 269720 263400 257374 251957 246921 241703
55688 241703 236484 232246 229325 226792 223711 220162 216515 212563 208014 203142 198375 193813 189551 185868
55674 185868 182757 179895 177350 175542 174315 172937 171323 170264 169921 169085 166568 162598 158220 154013 150001
55659A50001l789l563l521l581l547l542l549k998j659l88nm3L31P79N29M3M44
55642A21942J592K236J948J486J240P32k20j099j637k015k034j217P4P02K75l65
55626A23640m47k28j83n0P94K321L715M222M004L995M674N206M346K210K40p94
55610A57665j692l256m930n767n788n487m920m168l876m267m421l537k183j245
55596A02128n34L90R19L76m38k23P49J152P76O16R53R35J76o59j037j225j515
55579A03539j779j915k000j962j756j752k256k840k898k508k178k035j959k016
55565G3685k090j729j008q46j586k215j926j443j618j811j153m16p72j578j301
55550E2193j91O5r17j882k103k015j660n50P81R93O0n72k57J17LK1M07L55m28
$$ plain form
55659 150001 146212 142649 139128 135547 132000 128458 124909 121911 120252 119864 119859 119816 120147 120926 121455 121498 121942
55642 121942 123534 125770 127718 129204 130444 131176 130956 129857 128220 126205 124171 122954 123028 123730 124005 123640
55626 123640 123193 122965 122782 122732 123526 125847 129562 133784 137788 141783 146457 151663 156009 158219 158459 157665
55610 157665 155973 152717 147787 142020 136232 130745 125825 121657 117781 113514 109093 105556 103373 102128
55596 102128 101594 101984 102903 103279 102841 102618 103367 104519 105295 105911 106864 107799 107975 107316 106279 105054 103539
55579 103539 101760 99845 97845 95883 94127 92375 90119 87279 84381 81873 79695 77660 75701 73685
55565 73685 71595 69866 68858 68012 66426 64211 62285 60842 59224 57413 56260 55844 55072 53494 52193
55550 52193 52002 52067 51150 49268 47165 45150 43490 42940 43721 44714 44774 44202 43945 44062 44065 44086 44493 44848 44420
55531D4420j024q44m89m66l88p9p9m66m43J37K16o81j370o64Q54J756J632J146
55513D3168R37J237J944K515K306J555J373K332L711M548M642M137K993J510N41
55498G9449M66N15k60j777l208m040m387m585m854n083m833l835k530j668j430
55483C7940j463j596j807j719r67r8p9r00j589j654j500j339q34o2K62j06n23
55466B1966n48m51l72N0Q11J259J155J120J577K055J986J439P49J55L3O37J350
55449C4971J185K04m95m57l64n87n48r0j64j314k617k971k564k168j885j481j196
55432A7459j362j718j859j850j823j567j060p59q15p73n05n60j026H04J26J440
55416B370J926J797J793J823J348N41L4j38m03q84j397j931k358k191A061l18
$$ plain form
55531 44420 43396 42552 42063 41597 41209 41130 41051 40585 40142 40279 40495 39814 38444 37780 38634 40390 42022 43168
55513 43168 44105 45342 47286 49801 52107 53662 55035 57367 61078 65626 70268 74405 77398 78908 79449
55498 79449 79915 80430 80170 78393 75185 71145 66758 62173 57319 52236 47403 43568 41038 39370 37940
55483 37940 36477 34881 33074 31355 30388 30290 30211 29311 27722 26068 24568 23229 22395 22333 22595 22489 21966
55466 21966 21418 20967 20595 20645 21456 22715 23870 24990 26567 28622 30608 32047 32796 32951 32984 33621 34971
55449 34971 36156 36360 35865 35408 35044 34457 33909 33819 33655 32341 29724 26753 24189 22021 20136 18655 17459
55432 17459 16097 14379 12520 10670 8847 7280 6220 5461 4646 3873 3368 2808 1782 804 930 2370
55416 2370 4296 6093 7886 9709 11057 11598 11632 11494 11091 10207 8810 6879 4521 2330 1061 743
55400G43j04B40b06j9C31R70R66L13o59H58B99J14L04M11R52J456J226N62K54
55381E578L33L45M31R68J531J318M68p2j5l3n36r86p05K74J294J667J162K30l73
55362A2879m70o29j201j705j646j381j451j585j144j95O58J145J298R49P9n98
55346E003l68M07P60N31L50M71N01L24K78L64J73k49l16J32N22M44J41j50o18
55327H700j321j776j531p94j61%k93q20G82c73n48K78A35N71k13c48o83n3P2n59
55307a571r83l74O41P94j10j127j539j423j023l99J79K99K9j40j6J47K50M15M79
55288e472J01n13p04l50l7n9L8N84J113J046M83j95r32j699j936j090M49J465
55270g708J177oj043j359j185j039j006p07O2R47J386J258Q84M61j26q57j289
$$ plain form
55400 743 639 240 -206 -225 331 1301 2267 2580 1921 858 299 413 717 1128 2080 3536 4762 5324 5578
55381 5578 5911 6256 6687 7655 9186 10504 10972 10900 10885 10852 10316 9330 8625 8899 10193 11860 13022 13252 12879
55362 12879 12409 11780 10579 8874 7228 5847 4396 2811 1667 1472 2130 3275 4573 5522 5601 5003
55346 5003 4635 5042 5802 6333 6683 7154 7655 7979 8257 8621 8794 8545 8229 8361 8883 9327 9468 9318 8700
55327 8700 7379 5603 4072 3278 3117 3117 2824 2004 782 -373 -921 -643 135 706 493 -348 -1031 -1084 -1012 -1571
55307 -1571 -2554 -2928 -2287 -1493 -1603 -2730 -4269 -5692 -6715 -7114 -6935 -6636 -6607 -6747 -6763 -6616 -6366 -5951 -5472
55288 -5472 -5371 -5884 -6588 -6938 -6975 -7034 -6996 -6412 -5299 -4253 -3770 -3965 -4897 -6596 -8532 -9622 -9173 -7708
55270 -7708 -6531 -6537 -7580 -8939 -10124 -11163 -12169 -12876 -12814 -11867 -10481 -9223 -8339 -7878 -8004 -8861 -10150
55253a0150j004j43P54J338J649J714J261J01j302k006j527l86M39N07J33k31
55237h853m40m81k39L84J286K115K322J415l97k022k384j600p01k89m3L32M80
55220i115R6l85l76N8M15M25J34l01n35j60O85J249J021K69n29j153j231l25R93
55201h765J080p43k820l026j566m55n80p51J15J322J607R49L72M92J002J251Q42
55184i674j13r62r88j92N64N29q7m22J0Q05J200Q91L10N6J70J49l07q71j058q04
55164a0794l09L27R64J233R34M76M57Q84J217J091O67L69N10i18E71J201K73m38
55146A607l69N6K30L24P70J235J006K17k08J48P24Q70M88k18j017j503j330p49
55128B281l91m98F22c21r42n71J95P36L48o47j177q80m60m17l85m5K45K33L74
$$ plain form
55253 -10150 -11154 -11297 -10543 -9205 -7556 -5842 -4581 -4480 -5782 -7788 -9315 -9701 -9262 -8755 -8622 -8853
55237 -8853 -9293 -9774 -10013 -9629 -8343 -6228 -3906 -2491 -2888 -4910 -7294 -8894 -9595 -9884 -9927 -9595 -9115
55220 -9115 -9019 -9404 -9780 -9722 -9307 -8882 -8748 -9049 -9584 -9744 -9059 -7810 -6789 -6520 -7049 -8202 -9433 -9758 -8765
55201 -8765 -7685 -8428 -11248 -14274 -15840 -16295 -16875 -17626 -17511 -16189 -14582 -13633 -13261 -12769 -11767 -10516 -9674
55184 -9674 -9787 -10749 -11737 -11929 -11365 -10836 -10923 -11345 -11335 -10530 -9330 -8439 -8129 -8073 -7903 -7754 -8061 -8932 -9990 -10794
55164 -10794 -11103 -10776 -9812 -8579 -7645 -7169 -6712 -5828 -4611 -3520 -2853 -2484 -1974 -918 571 1772 2045 1607
55146 1607 1238 1294 1524 1848 2618 3853 4859 5076 4868 5016 5740 6610 7098 6880 5863 4360 3030 2281
55128 2281 1890 1392 622 -321 -1263 -1834 -1639 -903 -555 -1202 -2379 -3259 -3719 -4136 -4521 -4566 -4321 -4088 -3714
55109c714R60J350e78k59r00q01n40n58o18k78M56J154J367e20b3B1d03j041j371
55090b815p93M89J376e22A16N55R11R61M94N9K6J05j03n42r32D37a005j475j051
55071c531k11O58J242b19A690J828J025j99r65q40l28k4K65R71J781J896J214
55054H314N19M37Q07J185J463J733K014K241K203J540K29r61j133m62m0m19j042
55037A8628j346j567j970k026j128K71J089R51M72K76L06J65k77p85j014q05l27
55020A0913J00L63N63O99O04L35K36L78L32j98p72p08m2M72L16k12m31r2M08N69
55000A3833L95L40O41Q91N36l25r84r80n32r4J62L25N02Q12J284J624J450Q11
54982B0691K18J3L1M3N5j4m11r86j085m44L06N25N50J085J981K374J975J376R52
$$ plain form
55109 -3714 -2754 -1404 -578 -837 -1737 -2538 -3078 -3636 -4254 -4532 -4076 -2922 -1555 -520 -23 21 -403 -1444 -2815
55090 -2815 -3608 -3119 -1743 -522 116 671 1582 2543 3037 3096 3122 3227 3124 2582 1650 437 -1005 -2480 -3531
55071 -3531 -3742 -3084 -1842 -219 1690 3518 4543 4344 3379 2539 2211 2187 2452 3423 5204 7100 8314
55054 8314 8833 9270 10077 11262 12725 14458 16472 18713 20916 22456 22685 21724 20591 20129 20089 19670 18628
55037 18628 17282 15715 13745 11719 10591 10862 11951 12902 13374 13650 13956 14121 13844 13059 12045 11240 10913
55020 10913 11013 11376 11939 12638 13242 13577 13813 14191 14523 14325 13553 12845 12803 13275 13591 13379 12948 12856 13264 13833
55000 13833 14228 14568 15209 16100 16636 16311 15327 14347 13815 13721 13883 14208 14710 15522 16806 18430 19880 20691
54982 20691 20909 20922 20953 20996 21051 21037 20626 19640 18555 18111 18417 18942 19492 20577 22558 24932 26907 28283 29235
54963B9235L55o25j346j090j42N61O64O90J075J424J108K45l88l51k8L5k8L82
54945C1776J357K133J854N65p84j227o20L64R45Q93N26K22R4Q1Q7q1o07j320j661
54926C4597j323p29m62m78k85J51L19L4k22q1R2j98p67j022q74p85r82j090p59
54907B5136k22Q5K61Q14J784K394J942P78nK01J023J833K454K878K828K194J575
54890D7953J790K790L577L388K554K051K372L091L465L350L400M226N485O180
54876I5672N916N395N438N956O338O312N865M664K361o00l149m669n432n972o500
54861A17595o939p106o835o280n965o135o270n712m625l688l051k269j172j25
54847E1423N50Q13O29J46jP07J821K474K684L147L839L965L523L667N045O778
$$ plain form
54963 29235 29590 28965 27619 26529 26387 26948 27612 28302 29377 30801 31909 32154 31766 31415 31387 31422 31394 31776
54945 31776 33133 35266 37120 37685 36901 35674 35054 35418 36363 37256 37782 38004 38098 38179 38266 38185 37578 36258 34597
54926 34597 33274 32545 32083 31605 31320 31471 31790 31824 31602 31521 31613 31415 30648 29626 28752 27967 26985 25895 25136
54907 25136 24914 24999 25260 26074 27858 30252 32194 32972 32967 33168 34191 36024 38478 41356 44184 46378 47953
54890 47953 49743 52533 56110 59498 62052 64103 66475 69566 73031 76381 79781 84007 89492 95672
54876 95672 101588 106983 112421 118377 124715 131027 136892 141556 143917 143317 140168 135499 130067 124095 117595
54861 117595 110656 103550 96715 90435 84470 78335 72065 66353 61728 58040 54989 52720 51548 51423
54847 51423 51973 52786 53415 53561 53560 54267 56088 58562 61246 64393 68232 72197 75720 79387 84432 91210
54831I1210P705P734P332O489M943K907Q35j056k633l724m562n710p074p623o683
54816I0090m945l713l591m316n240n549m674l101k040j892j739r31j67k75p42
54801D7175o12m1J34j41k46j29k19m36l61k78q93k039k665k233j308o43m97q44
54783C3724j480j827j399n80k68o99j257j487j519j439j010k86J99J67K3J58L13
54766B1333m0q75j527j355m23N44R11Q50R58J262J200P16N67J042J266N44l82
54749B6591l68L92Q85J025J555K384K453J422K36k23l8M61J216J917J978J462
54733D3348J191J534K020K432L295M698N701N669N395O013P425Q667R290R506
54719A16184R356Q664P605O564N447L813J648n34k322l678m549m751m332l727
$$ plain form
54831 91210 98915 106649 113981 120470 125413 128320 129155 128099 125466 121742 117180 111470 104396 96773 90090
54816 90090 85145 81432 77841 73525 68285 62736 58062 54961 52921 51029 49290 48359 48192 47917 47175
54801 47175 46563 46522 46656 46515 46269 46140 45921 45485 45124 44846 43953 41914 39249 37016 35708 35065 34568 33724
54783 33724 32244 30417 29018 28438 28170 27471 26214 24727 23208 21769 20759 20473 20672 20839 20862 21020 21333
54766 21333 21293 20418 18891 17536 17113 17657 18568 19418 20376 21638 22838 23554 24121 25163 26429 26973 26591
54749 26591 26223 26615 27500 28525 30080 32464 34917 36339 36575 36352 36314 36775 37991 39908 41886 43348
54733 43348 44539 46073 48093 50525 53820 58518 64219 69888 75283 81296 88721 97388 106678 116184
54719 116184 125540 134204 141809 148373 153820 157633 159281 158747 156425 152747 148198 143447 139115 135388
54705A35388l377l346l414l380l256l199l196k839j660K49K080L012K994K771
54691A18827L123M133N146N460N110M714M559M145K974J482O68R40J788K502K704
54676A68275K302J493Q28O81N96k40j891l640n087o449p728q384q256p997q100
54661A16403q149p614o804o355o200n731m757l697k993k721k709k641k230j523
54647E2279q78m83k42k36p73j627j919j185q2N29O88R07J104Q56L92M16R80J331
54629E2057R88K40m76j004j120n10O54J562J642J190P99O36N51O18J046J720K237
54612F2830K398K402K485K586K488K158J811J572J295Q66N71Q39J537J893J462
54597H9193Q38J005K031K931K857K067J508J729K512L343L998M601N325O156O997
$$ plain form
54705 135388 132011 128665 125251 121871 118615 115416 112220 109381 107721 107970 110050 113062 116056 118827
54691 118827 121950 126083 131229 136689 141799 146513 151072 155217 158191 159673 160341 161281 163069 165571 168275
54676 168275 170577 172070 172898 173579 174175 173935 172044 168404 163317 156868 149140 140756 132500 124503 116403
54661 116403 108254 100640 93836 87481 81281 75550 70793 67096 64103 61382 58673 56032 53802 52279
54647 52279 51401 50918 50676 50440 49667 48040 46121 44936 44854 45383 46071 46978 48082 48938 49330 49746 50726 52057
54629 52057 53045 53285 52809 51805 50685 50175 50829 52391 54033 55223 56022 56658 57209 57827 58873 60593 62830
54612 62830 65228 67630 70115 72701 75189 77347 79158 80730 82025 82891 83462 84301 85838 87731 89193
54597 89193 90031 91036 93067 95998 98855 100922 102430 104159 106671 110014 114012 118613 123938 130094 137091
54582A37091P848Q722R358R316Q536P514O628N522L585J004j237k571l521m860
54568A92935o489p591p712p249o867o828o838o394n217l681k662k691l248l366
54554A16102k828k341k380k505k190j768j918k540k892k676k276j915j333n54
54540H5986k51q57j800k143j747j291j296j536j435p69N1L07l06j212j462q35
54524F9404j09p7o76j305j585j440q07J41P52N03k90q08p57n47n43o83q01q58
54506E9514p78m35P6M89P20Q86J077J315J673K000J802Q66j60l69K79R93J261
54489G1209J281J284J151Q90Q35J101J362J430J582J986K352K425K441K735L247
54474I7311L706M035M278M440M560M668M551L932K935K018J260K88r23j782j942
$$ plain form
54582 137091 144939 153661 163019 172335 180871 188385 195013 200535 204120 205124 203887 201316 197795 192935
54568 192935 186446 178855 171143 163894 157027 150199 143361 136967 131750 128069 125407 122716 119468 116102
54554 116102 113274 110933 108553 106048 103858 102090 100172 97632 94740 92064 89788 87873 86540 85986
54540 85986 85735 84878 83078 80935 79188 77897 76601 75065 73630 72861 72912 73219 72913 71701 70239 69404
54524 69404 69295 69218 68542 67237 65652 64212 63405 63546 64298 64801 64511 63703 62946 62399 61856 61173 60372 59514
54506 59514 58736 58301 58377 58866 59586 60472 61549 62864 64537 66537 68339 69205 69045 68676 68955 69948 71209
54489 71209 72490 73774 74925 75815 76650 77751 79113 80543 82125 84111 86463 88888 91329 94064 97311
54474 97311 101017 105052 109330 113770 118330 122998 127549 131481 134416 136434 137694 137982 137059 135277 133335
54459A33335j933k436l354m082m369m420m349m109l774l500l212k675j902j233
54445H7987j011j263j610j547r67m08m35q30q25j84N30Q97J205J697J910J365
54429H6511N07K73R24J836K362K409K222J982J726J398R74O22N75P62Q28O58N99
54412A07168R17J357J517J349J040O78K98M3j8jK3J44K77J20l31o43n37k56m8
54393A13097K05M89L47l75r94q27k49j46o44j078j087r96j095j248j352j561j850
54376A00636j820j222l67J67J89N1J85M87K82q60k347l008k411j274l88K59R31
54359H9490J352J113M60J8m5kP4L23O76R60J244J620J823J634J354J396J652J821
54341A06963K016K406K558K041J304J151J462J485J247J477K078J880M34j106
$$ plain form
54459 133335 131402 128966 125612 121530 117161 112741 108392 104283 100509 97009 93797 91122 89220 87987
54445 87987 86976 85713 84103 82556 81589 81181 80746 79916 79091 78907 79437 80334 81539 83236 85146 86511
54429 86511 87018 87291 88215 90051 92413 94822 97044 99026 100752 102150 103124 103746 104321 105083 105911 106569 107168
54412 107168 108085 109442 110959 112308 113348 114026 114324 114367 114349 114348 114371 114515 114792 114912 114581 113938 113401 113145 113097
54393 113097 113302 113791 114138 113763 112769 111942 111693 111547 110903 109825 108738 107742 106647 105399 104047 102486 100636
54376 100636 98816 97594 97227 97394 97583 97634 97819 98306 98588 97728 95381 92373 89962 88688 88300 88559 89490
54359 89490 90842 91955 92415 92433 92388 92386 92460 92783 93459 94419 95663 97283 99106 100740 102094 103490 105142 106963
54341 106963 108979 111385 113943 115984 117288 118439 119901 121386 122633 124110 126188 128068 128502 127396
54327A27396j521j121j045j593k091k013j506r66o76p82j200j610j860k180k704
54312A04528k968k299p26Q05J248M46p45j296r56k85K10N99J003J031L47n25o67
54295I9750kO43Q18R73J522K066K070J695J422J242P95R1m38n22l81m18q18j364
54277A09144j596j280q03q11j399k037k341k515k770k806k339j718j541j818k041
54262H1329j971j848j834j726j364r81r10j088j113p27j33J41l04j390k494k867
54246F0720k287j392j149j811k560k455j568p81n05k77K42O23M01j34n79j206
54230D5282k308l141k639j109n2j87o50n89m21q35j450j366o32j15j36j32L10
54213B9830Q55J042R31P39K84o92j792k079j146K36Q75N02k3J23P97J375J631
$$ plain form
54327 127396 125875 124754 123709 122116 120025 118012 116506 115540 114864 114082 112882 111272 109412 107232 104528
54312 104528 101560 99261 98535 99340 100588 101034 100289 98993 98037 97752 97962 98561 99564 100595 100942 100417 99750
54295 99750 99748 100391 101209 102182 103704 105770 107840 109535 110957 112199 112994 113085 112647 112125 111744 111326 110508 109144
54277 109144 107548 106268 105465 104654 103255 101218 98877 96362 93592 90786 88447 86729 85188 83370 81329
54262 81329 79358 77510 75676 73950 72586 71605 70695 69607 68494 67767 67634 67775 67471 66081 63587 60720
54246 60720 58433 57041 55892 54081 51521 49066 47498 46717 46212 45935 46177 46800 47201 47067 46488 45282
54230 45282 42974 39833 37194 36085 36033 35846 35196 34607 34186 33351 31901 30535 29903 29788 29652 29520 29830
54213 29830 30685 31727 32658 33397 33681 32989 31197 29118 27972 28208 29083 29585 29562 29685 30482 31857 33488
54196C3488J662J362O96K54O75J533J600M95p59j146r29r77j413j604j165l10
54180C3462O30J511K131K184J574N76l04o49m24n5n4n14j152j722k126k116j467
54163C1485n08J9j16l74l50l16n59p51n18j39l5K9N02J103J110N09M9P9N9n24
54143C0754j361j784j634j241q65n14k31j75l37m27j92K38N23N55N82P58Q28M86
54125B5963j28n95p76q45q15n02J6L53L62L12K95J4o44j198j110m38L59R21J040
54106B2584N75k55q14o62r5K68K19k5k55l59j89K47O58P86P37P31P62P28O38M23
54086B6702j34r30j420j293r49p84m64M77J642K092J527N05l63q04o58K4P17Q71
54068B6758O11M22K65k34p87n97L49J013P76L26N14J050J023K96l77m45j44L0
$$ plain form
54196 33488 35150 36512 37208 37462 38137 39670 41270 41765 41006 39860 38931 37954 36541 34937 33772 33462
54180 33462 34092 35603 37734 39918 41492 42068 41764 41115 40691 40636 40582 40068 38916 37194 35068 32952 31485
54163 31485 30977 30996 30880 30506 30156 29840 29281 28530 28012 27873 27838 27867 28369 29472 30582 31091 31140 31219 31278 30754
54143 30754 29393 27609 25975 24734 23869 23355 23124 22949 22612 22185 21993 22231 22754 23309 23891 24649 25477 25963
54125 25963 25835 25240 24464 23619 22804 22302 22318 22671 23033 23345 23640 23654 23010 21812 20702 20264 20623 21544 22584
54106 22584 23159 22904 22090 21428 21333 21601 21820 21795 21540 21181 20992 21239 21897 22683 23420 24151 24913 25641 26279 26702
54086 26702 26568 25638 24218 22925 21976 21192 20728 21205 22847 24939 26466 26971 26608 25804 25146 25170 25887 26758
54068 26758 27369 27791 28056 27822 27035 26438 26787 27800 28576 28902 29416 30466 31489 31785 31408 30963 30819 30849
54050C0849k5n8P3J74p3o44j049q95m45l02n46o11j44M66O16K47j61j19N24J465
54030B9342K043J755R09M26P56J305J215M20m54r04r22o84l28j0J39J05j11m81
54012C4521p11l45N90J314J209P03O87J173J269N42l32o06m80n76q99r63p10o14
53994C5772q64j066q80m65q8K67O67R22R16R40J306J770J810J412J169J466J981
53977D7035K160J964J827K036K397K502K181J671J412J693K400L107L448L359
53963G9192L010K615K358K347K595L034L528L801L488K508J363P61Q18R51O97
53948A13066K55M2n5m75j193j578j200m50k31j026k410l456l588l063k599k614
53932H9425k925l137l052k658k015j331q95p46o21l61j17K2K23M20N2j174k486
$$ plain form
54050 30849 30824 30766 30839 31013 30940 30296 29247 28352 27907 27605 27059 26448 26304 26770 27386 27633 27472 27353 27877 29342
54030 29342 31385 33140 34049 34475 35231 36536 37751 38171 37717 36813 35891 35207 34879 34869 35008 35113 35002 34521
54012 34521 33810 33465 34055 35369 36578 37281 37968 39141 40410 40952 40620 40014 39534 38958 38059 37096 36386 35772
53994 35772 34908 33842 32962 32497 32409 32676 33343 34265 35181 36121 37427 39197 41007 42419 43588 45054 47035
53977 47035 49195 51159 52986 55022 57419 59921 62102 63773 65185 66878 69278 72385 75833 79192
53963 79192 82202 84817 87175 89522 92117 95151 98679 102480 105968 108476 109839 110600 111418 112369 113066
53948 113066 113321 113363 113308 112833 111640 110062 108862 108412 108181 107155 104745 101289 97701 94638 92039 89425
53932 89425 86500 83363 80311 77653 75638 74307 73412 72666 72045 71684 71567 71589 71812 72232 72284 71110 68624
53915F8624k707j708o09l86q21j048p29k35l4j97m90o02l77O7M90Q36J211J496
53897F2781J291M95k88k64O11J526J665R86J18k80n4M44P39P15O98J058J778K570
53879G6589L257L784L867L168K029J577K492L926M290L202J850J297J201P41J16
53864A13386K11J107J852J801J323R88P76N21N09J088K012K670K883L058L591
53849A37776M382M940M835M103L293K954L111L368L452L357L048K487J949J839
53835A84894K007J740P18m95j153j176r73q39r06j313k039k750l140l218l108
53820A68249k836k529k413k469k500k706l552m811n359m511k999k110k256k927
53806A24271l477l444k623j514j198k061l094l223k743k603k827k701k179j914
$$ plain form
53915 68624 65917 64209 63600 63214 62393 61345 60616 60381 60347 60150 59660 59058 58681 58748 59238 60074 61285 62781
53897 62781 64072 64567 64279 64015 64626 66152 67817 68803 68921 68641 68587 69031 69770 70485 71183 72241 74019 76589
53879 76589 79846 83630 87497 90665 92694 94271 96763 100689 104979 108181 110031 111328 112529 113270 113386
53864 113386 113597 114704 116556 118357 119680 120668 121444 121965 122474 123562 125574 128244 131127 134185 137776
53849 137776 142158 147098 151933 156036 159329 162283 165394 168762 172214 175571 178619 181106 183055 184894
53835 184894 186901 188641 189359 188864 187711 186535 185562 184723 183817 182504 180465 177715 174575 171357 168249
53820 168249 165413 162884 160471 158002 155502 152796 149244 144433 139074 134563 131564 129454 127198 124271
53806 124271 120794 117350 114727 113213 112015 109954 106860 103637 100894 98291 95464 92763 90584 88670
53792H8670k077k229k225k223j909q96J89K31p00j396j310j055r37m59K93K74
53776G2241p80j478o77P85J315P24O6q5n9j26j10Q8L19M67M10Kn18m90L10J150
53756G3554J288R56Q21R05P33L27K18O29J248J763K063J988J491R87J016J540
53740I1527K003K078J948J864J771J536J274J377K118L123L437K494J040M04Q72
53725A18866J476J580J644J968J812P15k33K70J669K190J255Kn96p50q12n96j56
53708A30304j84r17j587j562j301j449j727j502r64p84r44p83k00O9m55j314j805
53691A12895j860j825j751j418r61r35j595k402k516j703n60Q0j45r37j594j532
53675I1241p93r2j04p13j183j105q20q05j011j068q26m46j11J00K26M36P90J007
$$ plain form
53792 88670 86593 84364 82139 79916 78007 77111 77300 77531 76831 75435 74125 73070 72133 71674 71967 72241
53776 72241 71461 69983 69306 70091 71406 72130 72196 72111 72052 71926 71816 71904 72223 72690 73100 73102 72584 72094 72404 73554
53756 73554 74842 75798 76619 77524 78257 78584 78802 79431 80679 82442 84505 86493 87984 88971 89987 91527
53740 91527 93530 95608 97556 99420 101191 102727 104001 105378 107496 110619 114056 116550 117590 117994 118866
53725 118866 120342 121922 123566 125534 127346 128061 127828 128098 129767 131957 133212 133214 132618 131868 131056 130460 130304
53708 130304 130120 129203 127616 126054 124753 123304 121577 120075 119111 118327 117383 116600 116400 116469 116014 114700 112895
53691 112895 111035 109210 107459 106041 105080 104145 102550 100148 97632 95929 95369 95449 95304 94367 92773 91241
53675 91241 90448 90356 90252 89539 88356 87251 86431 85626 84615 83547 82721 82275 82164 82264 82490 82926 83716 84723
53657H4723Q04N58R95J974K260J090o12j349r26k90J36Q65K015K745K494J899
53641I9381J822K072J843J076O01R62J811K515K888L034K923K470J939J749J889
53626A28975J859J394R34R90J339J322R03P57J194J649J523J058Q45R02Q15N17
53610A46976L34M25O45R03J133J053M75j81k07M80J198J326R15L79Qp0J73N93
53592A56558Q75Q12M46J0k18j04J23k6p12j459j683j353q97o11n52o97q55o54
53574A49003l5M80M67K70M62R78J336J500J720J770J230M82M66J309K100K196
53558A65734J911J711J618J706K265K996K960J908Q64P77J283J587J761K279K885
53543A94245K999K887L306M113M316L598K851K903L484L834L733L474L219K848
$$ plain form
53657 84723 85527 86085 87080 89054 91314 92404 91792 90443 89517 89227 89363 90228 92243 94988 97482 99381
53641 99381 101203 103275 105118 106194 106795 107757 109568 112083 114971 118005 120928 123398 125337 127086 128975
53626 128975 130834 132228 133162 134152 135491 136813 137716 138473 139667 141316 142839 143897 144742 145644 146459 146976
53610 146976 147310 147735 148380 149283 150416 151469 151944 151763 151556 152036 153234 154560 155475 155854 155862 155792 155965 156558
53592 156558 157433 158245 158691 158701 158483 158379 158502 158476 157764 156305 154622 153269 152372 151761 151209 150512 149657 149003
53574 149003 148968 149448 149915 150185 150647 151625 152961 154461 156181 157951 159181 159663 160129 161438 163538 165734
53558 165734 167645 169356 170974 172680 174945 177941 180901 182809 183673 184450 185733 187320 189081 191360 194245
53543 194245 197244 200131 203437 207550 211866 215464 218315 221218 224702 228536 232269 235743 238962 241810
53529B41810K304J760J481J657K235K886L227L181L001K916K833K428J554N55
53515B73828J06N08J177J141J80q80j271j195j230j211m39J015J980J493K7j050
53499B74179r82k09L63L40Nk40k93k86k69j42J61N78J035J450J633J371P79M07
53481B79880P70J770K748L127K918K586K525K684K804K919L385M334N309N756
53467C23515N728N734N999O361O892P971R493J0571J0549R950R947J1008J2500
53454D36218J3516J3773J3752J4217J5504J7036J7820J7702J7760J8952K0749
53443F16999K1795K1769K1722K2459K3504K4136K4596K5550K6819K7575K7680
53432H84604K7873K8522K8945K8489K7669K7587K8435K9266K9315K8926K8948
$$ plain form
53529 241810 244114 245874 247355 249012 251247 254133 257360 260541 263542 266458 269291 271719 273273 273828
53515 273828 273934 274442 275619 276760 276940 276060 274789 273594 272364 271153 270714 271729 273709 275202 275229 274179
53499 274179 273197 272988 273351 273691 273696 273456 273163 272877 272608 272466 272627 273205 274240 275690 277323 278694 279473 279880
53481 279880 280650 282420 285168 288295 291213 293799 296324 299008 301812 304731 308116 312450 317759 323515
53467 323515 329243 334977 340976 347337 354229 362200 371693 382264 392813 402763 412710 423718 436218
53454 436218 449734 463507 477259 491476 506980 524016 541836 559538 577298 596250 616999
53443 616999 638794 660563 682285 704744 728248 752384 776980 802530 829349 856924 884604
53432 884604 912477 940999 969944 998433 1026102 1053689 1082124 1111390 1140705 1169631 1198579
53421A198579K9648L0547L1102L1120L0602K9643K8493K7456K6527K5377K3707
53410A512801K1532J9114J6807J5023J4038J3687J3393J2709J1801J1260J1328
53399A673493J1466J0760Q838O233L738J527q55l620o316q441j0085j1673j3385
53386A661680j5192j7162j9262k1116k2452k3585k4912k6134k6645k6533k6461
53375A412226k6594k6483k6096k6046k6502k6717k6097k4968k3787k2322k0282
53364A136332j8199j6865j6202j5385j3792j1416q574n772l484j618N07L206N906
53351A034644Q089J0253J3095J6247J8710K0356K1998K4015K5891K7194K8239
53340A248731K9516L1105L2923L4942L6997L8846M0579M2495M4511M6235M7738
$$ plain form
53421 1198579 1228227 1258774 1289876 1320996 1351598 1381241 1409734 1437190 1463717 1489094 1512801
53410 1512801 1534333 1553447 1570254 1585277 1599315 1613002 1626395 1639104 1650905 1662165 1673493
53399 1673493 1684959 1695719 1704557 1710790 1714528 1716055 1715200 1711580 1705264 1696823 1686738 1675065 1661680
53386 1661680 1646488 1629326 1610064 1588948 1566496 1542911 1517999 1491865 1465220 1438687 1412226
53375 1412226 1385632 1359149 1333053 1307007 1280505 1253788 1227691 1202723 1178936 1156614 1136332
53364 1136332 1118133 1101268 1085066 1069681 1055889 1044473 1035899 1030127 1026643 1025025 1025532 1028738 1034644
53351 1034644 1042733 1052986 1066081 1082328 1101038 1121394 1143392 1167407 1193298 1220492 1248731
53340 1248731 1278247 1309352 1342275 1377217 1414214 1453060 1493639 1536134 1580645 1626880 1674618
53329A674618M9647N2284N5218N7841N9921O1433O2406O3159O4154O5348O6135
53318B332164O6285O6383O7001O7820O7958O6937O4983O2592O0119N7586N4744
53307C034572N1343M7483M3504L9638L6012L2854L0217K7624K4429K0627J6671
53296C404974J2608Q066L186j390n798j1251j8502k6723l4624m1963m9126n5866
53284C183591o1454o5807o9460p2485p4429p5318p5838p6344p6421p5734p4613
53273B385688p3501p2417p1288p0368o9832o9333o8259o6364o3842o1064n8411
53262A641009n6139n4074n1555m8074m3934m0041l6994l4532l1942k8798k5221
53251A189705k1512j7866j4415j1329q677o320m216k644j780j181j15J507L090
$$ plain form
53329 1674618 1724265 1776549 1831767 1889608 1949529 2010962 2073368 2136527 2200681 2266029 2332164
53318 2332164 2398449 2464832 2531833 2599653 2667611 2734548 2799531 2862123 2922242 2979828 3034572
53307 3034572 3085915 3133398 3176902 3216540 3252552 3285406 3315623 3343247 3367676 3388303 3404974
53296 3404974 3417582 3425648 3428834 3427444 3421646 3410395 3391893 3365170 3330546 3288583 3239457 3183591
53284 3183591 3122137 3056330 2986870 2914385 2839956 2764638 2688800 2612456 2536035 2460301 2385688
53273 2385688 2312187 2239770 2168482 2098114 2028282 1958949 1890690 1824326 1760484 1699420 1641009
53262 1641009 1584870 1530796 1479241 1431167 1387233 1347192 1310198 1275666 1243724 1214926 1189705
53251 1189705 1168193 1150327 1135912 1124583 1115906 1109586 1105370 1102726 1100946 1099765 1099650 1101157 1104247
53238A104247M317N583P088Q200Q393Q401R520J1900J4296J5705J6515J7717J9602
53225A251484K1676K3421K4736K5749K6688K7769K9011L0177L0986L1309L1094
53214A554100L0339K9265K8299K7610K6854K5564K3688K1601J9688J8065J6653
53203A821726J5350J4192J3328J2699J1745R752O637L112j56l301o838j0779j4565
53190A872902j7796k0687k3728k7241l1223l5315l8864m1361m2859m3805m4397
53179A505626m4513m4201m3794m3346m2401m0713l8875l7799l7708l8003l8020
53168A056253l7577l6824l5956l5126l4415l3761l3140l2701l2456l1957l0636
53157F81704k8535k6273k4273k2426k0635j9131j7963j6640j4790j2850j1635
$$ plain form
53238 1104247 1108564 1114147 1121235 1129435 1137828 1146229 1155749 1167649 1181945 1197650 1214165 1231882 1251484
53225 1251484 1273160 1296581 1321317 1347066 1373754 1401523 1430534 1460711 1491697 1523006 1554100
53214 1554100 1584439 1613704 1642003 1669613 1696467 1722031 1745719 1767320 1787008 1805073 1821726
53203 1821726 1837076 1851268 1864596 1877295 1889040 1898792 1905429 1908541 1908385 1905084 1898246 1887467 1872902
53190 1872902 1855106 1834419 1810691 1783450 1752227 1716912 1678048 1636687 1593828 1550023 1505626
53179 1505626 1461113 1416912 1373118 1329772 1287371 1246658 1207783 1169984 1132276 1094273 1056253
53168 1056253 1018676 981852 945896 910770 876355 842594 809454 776753 744297 712340 681704
53157 681704 653169 626896 602623 580197 559562 540431 522468 505828 491038 478188 466553
53146D66553j1330j1363j1209j0879j0618j0475j0284r827r006q004p268p063
53134C49227p173p241p249p313p243o742o052n824o236o696o606n994n298m864
53120B58696m820n059n219m969m574m670n387o032n976n393m787m291l790l402
53106A90327l220k934k271j649j741k468k980k733k034j447j160j097j231j511
53092A61851j749j836j896k055k242k271k054j636j168q91r75j300j522j359q71
53077A38026m57o04j418k321k459j623n26O6K21M67Q69R72N62l6m34m97k09K77
53059A30876N17K21j81OO45P44j42j194j368p00p0p4n30r19q75m74k03n02j135
53040A24642j402j094p53q09j000j040j171j498j447o29L03N69N82J249K246K280
$$ plain form
53146 466553 455223 443860 432651 421772 411154 400679 390395 380568 371562 363558 356290 349227
53134 349227 342054 334813 327564 320251 313008 306266 300214 294390 288154 281458 274852 268858 263560 258696
53120 258696 253876 248817 243598 238629 234055 229385 223998 217966 211990 206597 201810 197519 193729 190327
53106 190327 187107 184173 181902 180253 178512 176044 173064 170331 168297 166850 165690 164593 163362 161851
53092 161851 160102 158266 156370 154315 152073 149802 147748 146112 144944 144053 143078 141778 140256 138897 138026
53077 138026 137569 136965 135547 133226 130767 129144 128618 128684 128905 129372 130241 131213 131775 131739 131305 130808 130599 130876
53059 130876 131393 131614 131433 131439 132084 132828 132686 131492 130124 129424 129354 129280 128750 127831 126956 126482 126279 125777 124642
53040 124642 123240 122146 121393 120584 119584 118544 117373 115875 114428 113799 114102 114671 115253 116502 118748 121028
53024A21028J197M74J098K158K292J644J299J440J257M79j32kM01L30k67q72j172
53007A32652j228j156r89q41q99j230j671k007k136k100k070k248k718l268l505
52992A04586l202k528j855j344q64l41J2p0n51j158j687k106k374k374k029j406
52976H0709o82j34n8n51j316j883j997j718j233q58r55j564k089j794p04L52P07
52959F4232M81J21k73p58j093r47m44j10k41o52r92j070q96o34n78r00j359j434
52941E2453q57N7O51N31m9m34k78O7Q5j29JN73R28O02M0n9K98O74J019J512J771
52920E9456J065m96j786j920j173l63J19L32L17O5l12p47j251j538j007L95J670
52903E2826J676N12n33m13O70J728J998J401L96l88n59j96K94O19P78Q70R48J055
$$ plain form
53024 121028 122225 122699 123797 125955 128247 129891 131190 132630 133887 134366 134234 134232 134633 134963 134696 133824 132652
53007 132652 131424 130268 129279 128438 127539 126309 124638 122631 120495 118395 116325 114077 111359 108091 104586
52992 104586 101384 98856 97001 95657 94793 94452 94464 94394 93843 92685 90998 88892 86518 84144 82115 80709
52976 80709 80027 79893 79835 79284 77968 76085 74088 72370 71137 70279 69324 67760 65671 63877 63173 63525 64232
52959 64232 64713 64834 64561 63803 62710 61763 61319 61209 60968 60316 59324 58254 57358 56724 56146 55246 53887 52453
52941 52453 51596 51653 52304 52835 52786 52352 52074 52141 52226 52097 52098 52671 53599 54201 54241 54182 54480 55154 56173 57685 59456
52920 59456 60521 60025 58239 56319 55146 54783 54902 55234 55551 55616 55304 54557 53306 51768 50761 51156 52826
52903 52826 54502 55014 54481 54068 54738 56466 58464 59865 60261 59873 59314 59118 59412 60031 60809 61679 62627 63682
52885F3682J261J547J830K064K255K319K131J752J483J569J957K387K643K614
52871I1494K237J575R00N83P31J026J047P14L18Q9r3m56r23j254j404j512j480
52854I3592j010k21J20o26k054k919k400r82ol64j652k584k252j018r3l05j317
52837G3909k096j933j019j45O6k93n61k74K95N71M25J66j06n69j023q46Q2R80
52819F7629J148Q73P96Q60N74P1k2L06L12m03j297j643j310o80k22k86q00j083
52801F4823m94N38Q11j17j332j803j515r31q6J055J874J736J040Q22J364J944
52785F9729J962J535R42L01n3L69J370J957J531P16M46O75N75j73r61j124o26
52768G9171J51Q49J210J045M40k40o96q69p43k90J36j41j193j937j178Q12K428
$$ plain form
52885 63682 64943 66490 68320 70384 72639 74958 77089 78841 80324 81893 83850 86237 88880 91494
52871 91494 93731 95306 96206 96789 97520 98546 99593 100307 100625 100714 100621 100165 99242 97988 96584 95072 93592
52854 93592 92582 92361 92481 91855 89801 86882 84482 83500 83494 83130 81478 78894 76642 75624 75531 75226 73909
52837 73909 71813 69880 68861 68716 68782 68489 67928 67654 67949 68520 68945 69111 69005 68436 67413 66567 66649 67629
52819 67629 68777 69650 70446 71306 71880 71951 71929 72235 72547 72144 70847 69204 67894 67214 66992 66706 65906 64823
52801 64823 64329 64867 65678 65561 64229 62426 60911 59980 59894 60949 62823 64559 65599 66421 67785 69729
52785 69729 71691 73226 74168 74469 74416 74785 76155 78112 79643 80359 80805 81480 82055 81882 80921 79797 79171
52768 79171 79322 80171 81381 82426 82866 82626 81930 81061 80318 80028 80164 80023 78830 76893 75715 76527 78955
52751G8955K567J751J138J064J132J150J279J413J200O18m6p67j691k518k633
52736H4612k042j441j221j035o97p01j401k185k192j398m89K5K5m89j258j604
52720F6509j108k78K2l71r68j425j669j449o30J76R3q11j583j735j727j997k237
52703D8812k038j471p37J06O70K95r57j969j829q52J38Q68J324J088k2j130j142
52686D1154k07N34N95M89N02J70o35j157q09q9J82j5j48j35l80r64j362j054r3
52667C6578J005J648J558R58L38p9n26j127j467j073j85M18L72J27K27O07Q63
52650D0242Q59P35M73p5p11q96m44R3M9m87p41k33O42J100Q01N1o51j074j318
52631C8415j531j620j273l81O35J201J250J241J353J207N87M6K08P99R86N93K77
$$ plain form
52751 78955 81522 83273 84411 85475 86607 87757 89036 90449 91649 92267 92221 91454 89763 87245 84612
52736 84612 82570 81129 79908 78873 78176 77475 76074 73889 71697 70299 69810 69835 69860 69371 68113 66509
52720 66509 65401 65123 65145 64774 63806 62381 60712 59263 58633 58809 58902 58091 56508 54773 53046 51049 48812
52703 48812 46774 45303 44566 44672 45342 45637 44680 42711 40882 40030 40168 41036 42360 43448 43426 42296 41154
52686 41154 40947 41481 42076 42565 43067 43237 42602 41445 40636 40547 40729 40714 40566 40431 40051 39087 37725 36671 36578
52667 36578 37583 39231 40789 41747 42085 42006 41480 40353 38886 37813 37628 38046 38418 38545 38772 39379 40242
52650 40242 41101 41836 42309 42234 41523 40627 40183 40276 40325 39838 39097 38864 39506 40606 41407 41458 40807 39733 38415
52631 38415 36884 35264 33991 33610 34245 35446 36696 37937 39290 40497 41084 41130 41338 42137 43123 43716 43993
52614D3993M88Q69R42P76O58O30P30J214K100K820K832K330J885J637J354J085
52598F6343J102J255J025M02P0M54R92Q16k15j497k434k813k513j482j13O90K77
52581F2359r89k009k099j635j387j430j138k35N57L14q95j992k060j170j0R45
52565D7126J667K138K075J236q2j090j231p60l93l77l24OK03j28o51p26l03J63
52547D8549M87Q30J061P88J78k0M24P52K61o81j117o39M21J545K249K114J183
52530E8385J74k15j12j12l31l54p9Om61j179j548j275n38K31O56O78N99O42O52
52511E5819M34J50N2L2j24j49L58J140J372P27k49r06j047o78J87J132J394P74
52493F0418L2n2L82O98P09O74P02O69N81M86K06l74q60o75J71J050J402J186O73
$$ plain form
52614 43993 44481 45350 46292 47068 47726 48356 49086 50300 52400 55220 58052 60382 62267 63904 65258 66343
52598 66343 67445 68700 69725 70127 70197 70651 71643 72459 72244 70747 68313 65500 62987 61505 61392 62082 62359
52581 62359 61370 59361 57262 55627 54240 52810 51672 51437 51994 52308 51413 49421 47361 46191 46181 47126
52565 47126 48793 50931 53006 54242 54160 53070 51839 51079 50686 50309 49985 49991 50194 50066 49415 48689 48386 48549
52547 48549 49036 49866 50927 51715 51893 51873 52297 53049 53310 52629 51512 50873 51294 52839 55088 57202 58385
52530 58385 58559 58344 58232 58120 57789 57435 57356 57362 56901 55722 54174 52899 52361 52592 53248 53926 54525 55167 55819
52511 55819 56253 56403 56455 56487 56363 56214 56572 57712 59084 59811 59562 58656 57609 56931 57118 58250 59644 60418
52493 60418 60450 60398 60780 61478 62187 62861 63563 64232 64813 65299 65505 65131 64271 63596 63767 64817 66219 67405 68078
52474F8078J69q6r6j44l96n59k54L51P09O54N66P17Q69O90K62m6K9M59R90J307
52454G4269J271R90O21J92j81j89K51O31L71l55q19p65o50q12r60p64l85r2J92
52435G2816N24N49N1m11p9Q91J479J020j10j110j539j281k74J280K651L040K330
52418H1827J138J20n52r66j084p86j56M88Q82R71P92L70j94o91r44r24o40n4P52
52399H0349J382J346N47n13j112r48l90n8j62l52k73q6j56l84k92J64L88K5m30
52380G9045l39J31L52K32K46N32O34K72k31m47l33j1M48Q68R65P81O74P66P67
52361H5352N66M83O39O50K95L8K37L56l03j424j973j636j124j017j008n59K66
52344G9838R77J277J154P19K00o4J03N25R05J106J170J211J316J387J109L09o37
$$ plain form
52474 68078 68247 68161 68065 67921 67525 66966 66712 67063 67772 68426 68992 69709 70578 71268 71530 71484 71513 71972 72962 74269
52454 74269 75540 76530 77151 77343 77162 76973 77224 77855 78226 77871 77052 76287 75637 74825 73865 73101 72716 72624 72816
52435 72816 73340 73889 73940 73529 73450 74341 75820 76840 76730 75620 74081 72800 72526 73806 76457 79497 81827
52418 81827 82965 83085 82533 81567 80483 79697 79541 80029 80911 81882 82674 83044 82850 82159 81215 80291 79651 79597 80349
52399 80349 81731 83077 83624 83111 81999 81051 80661 80603 80441 80089 79816 79730 79574 79190 78898 79062 79450 79475 79045
52380 79045 78706 78837 79189 79421 79667 80199 80833 81105 80874 80427 80094 80083 80531 81399 82364 83145 83819 84585 85352
52361 85352 85918 86401 87040 87690 87985 88023 88260 88616 88313 86889 84916 83280 82156 81139 80131 79572 79838
52344 79838 80815 82092 83246 83965 84165 84101 84204 84729 85634 86740 87910 89121 90437 91824 92933 93242 92605
52327I2605j099r52o77n73l32L46J113J390J184R49P77L11m85r66n78L54R56Q39
52309I5162M56M16P28Q67M60k45n99j27J001J985K060J233L89M33J340K222K292
52292A10073J508L75n73r60o82q2K90L33N30J128J584J329P58P04J114J022K1
52275A18472r62q10M15J663K125J865J416J205J249J217Q28L01J15K55J35m08
52259A29081n75M04K050L001K571J343K44l41m86k28M12J264K060K587K715K478
52243A48580K105J783J434R87Q07J398K582L438L304K521J931J888K139K390K642
52228A79929K952L305L669M035M311M330M117L968M172M628M821M294L198K265
52214B33994K130K708L381L738L845L888L842L660L478L447L521L600L698L836
$$ plain form
52327 92605 91506 90554 89877 89304 88972 89318 90431 91821 93005 93954 94731 95042 94557 93591 93013 93367 94323 95162
52309 95162 95618 96034 96762 97629 98089 97844 97245 97118 98119 100104 102164 103397 103786 104219 105559 107781 110073
52292 110073 111581 111956 111383 110423 109741 109659 109949 110282 110812 111940 113524 114853 115611 116315 117429 118451 118472
52275 118472 117510 116700 117115 118778 120903 122768 124184 125389 126638 127855 128683 128984 129099 129354 129489 129081
52259 129081 128506 128910 130960 133961 136532 137875 138119 137778 137292 137064 137476 138740 140800 143387 146102 148580
52243 148580 150685 152468 153902 154889 155696 157094 159676 163114 166418 168939 170870 172758 174897 177287 179929
52228 179929 182881 186186 189855 193890 198201 202531 206648 210616 214788 219416 224237 228531 231729 233994
52214 233994 236124 238832 242213 245951 249796 253684 257526 261186 264664 268111 271632 275232 278930 282766
52200B82766L902L786L492L035K429J953K094K930L801L949L359K615K048J515
52186C23674R82P92J118J574J682J509J476J691J810J613J380J569K186K714K677
52171C48447K141J577J313J307J379J512J800K292K929L633M304M924N565O153
52157C89276O245N473M235L537L842M499M674M422M346M518M413L826L103K507
52143D48916J949J413J038O98J26m22l30L35P13M39K57P68J263O88p76j962k318
52126D52795k307k291j939j023k9L79O6o69j460j936j795j147n37l67n17p06r45
52109D35572j377j901k211k139j764j267q33n56l99k99m25j087k307l591m309
52094D11107m245l645k831j941j055l96k55o60j219j474j415j398j539j527j227
$$ plain form
52200 282766 286668 290454 293946 296981 299410 301363 303457 306387 310188 314137 317496 320111 322159 323674
52186 323674 324656 325448 326566 328140 329822 331331 332807 334498 336308 337921 339301 340870 343056 345770 348447
52171 348447 350588 352165 353478 354785 356164 357676 359476 361768 364697 368330 372634 377558 383123 389276
52157 389276 395521 400994 405229 408766 412608 417107 421781 426203 430549 435067 439480 443306 446409 448916
52143 448916 450865 452278 453316 454014 454140 453718 453388 453723 454436 454875 455132 455900 457163 457851 457075 455113 452795
52126 452795 450488 448197 446258 445235 445206 445585 445651 444982 443522 441586 439791 438644 438107 437740 437223 436517 435572
52109 435572 434195 432294 430083 427944 426180 424913 424080 423524 423125 422826 422401 421314 419007 415416 411107
52094 411107 406862 403217 400386 398445 397390 396994 396739 396079 394860 393386 391971 390573 389034 387507 386280
52079C86280j075j479k092k252j979j912k190k193j621j171j565k405k661k024
52065C59661j194q22q57j013j324j902k404k257j374l53J85K27J36n2o74j695
52049C44288k353k027j170p76r88r04J2J078J394J194J446K348L039K832K113
52034C51526J744K075K816L587M119M172L676L035K899L464M187M445M331M539
52020D00615N412O446O933O850O745O864O835O351N702N344N243M955M326L741
52006D82362L741M483N502N862M782K456J94o43N6J137J452R54L88K50K83l7p73
51989E12449j434j547j148o52l83l69n59r42j440j909k363k919l399l301k482
51974D87602j607j489k135k790k886k538k121j779j511j373j345j242r70p34p98
$$ plain form
52079 386280 385205 383726 381634 379382 377403 375491 373301 371108 369487 368316 366751 364346 361685 359661
52065 359661 358467 357645 356788 355775 354451 352549 350145 347888 346514 346161 346346 346573 346709 346657 345983 344288
52049 344288 341935 339908 338738 337962 336974 336070 336082 337160 338554 339748 341194 343542 346581 349413 351526
52034 351526 353270 355345 358161 361748 365867 370039 373715 376750 379649 383113 387300 391745 396076 400615
52020 400615 406027 412473 419406 426256 433001 439865 446700 453051 458753 464097 469340 474295 478621 482362
52006 482362 486103 490586 496088 501950 506732 509188 509382 508739 508795 509932 511384 512338 512726 512976 513259 513222 512449
51989 512449 511015 509468 508320 507668 507285 506916 506357 505415 503975 502066 499703 496784 493385 490084 487602
51974 487602 485995 484506 482371 479581 476695 474157 472036 470257 468746 467373 466028 464786 463816 463082 462284
51959D62284j112j317j094m11M20Q81N62m35j482j934j738j408j376j472j178
51944D49190l65L88L33p08k212l524m325m660m778n032n611o241o390n949n496
51929C94620n696o610p839q977r757r923r472q873q648q763q737q340p782p342
51915B77861p125p204p566p895p807p379p086p156p337p322p053o487n604m714
51901A80126m326m456m490m009l321k904k718k530k487k899l596l998l745k947
51887A31700j984j304j291j842k256j939j186q57j294j970k228j953j465j066
51873A09065q95r48j089j130r99p04l00O6J52p2k84k27j58m51r85j351j566j943
51855I6181k264j803m47Q98J345J004M57k01j098j812j624m92Q53J733J962J536
$$ plain form
51959 462284 461172 459855 458761 458350 458770 459651 460213 459778 458296 456362 454624 453216 451840 450368 449190
51944 449190 448825 449213 449546 448838 446626 443102 438777 434117 429339 424307 418696 412455 406065 400116 394620
51929 394620 388924 382314 374475 365498 355741 345818 336346 327473 318825 310062 301325 292985 285203 277861
51915 277861 270736 263532 255966 248071 240264 232885 225799 218643 211306 203984 196931 190444 184840 180126
51901 180126 175800 171344 166854 162845 159524 156620 153902 151372 148885 145986 142390 138392 134647 131700
51887 131700 129716 128412 127121 125279 123023 121084 119898 119041 117747 115777 113549 111596 110131 109065
51873 109065 108170 107222 106133 105003 104004 103300 103000 103066 103218 103146 102862 102635 102477 102026 101041 99690 98124 96181
51855 96181 93917 92114 91667 92565 93910 94914 95371 95170 94072 92260 90636 90144 90997 92730 94692 96228
51839I6228N76l69o52l45k08o23j060r23l69R1L40N42N94K83k56o65q72j006r75
51820I0331n36K82J162J844K110J683O24l22m16R0K77j54o15p51r81j635k214
51803I0779k101j442p58k21J80K04j78l17M01J597K353K415K218J845R33l62j188
51786I6358j086n47k11j04m2q9k36r5N24J190J419J321J189R02K99j62J42R90
51768A01762J403Q85O1r5O34J544J759J099K79J67P92J294J066N70N90J003J003
51751A15816M16O4O09J615K196K027J451Q83N82P35J321K015K542L031L666M203
51735A43172M232L896L758L972M032L597L103L149L556L476K424P78p22j712k290
51720A78421k651k843k825k639k466k476k589k501k074j586j395j460j476j379
$$ plain form
51839 96228 96804 96435 95783 95438 95230 94607 93547 92624 92255 92346 92686 93228 93822 94105 93849 93184 92312 91306 90331
51820 90331 89795 90077 91239 93083 95193 96876 97500 97178 96762 96852 97129 96975 96360 95609 94628 92993 90779
51803 90779 88678 87236 86478 86257 86437 86641 86463 86146 86547 88144 90497 92912 95130 96975 97908 97546 96358
51786 96358 95272 94725 94514 94410 94368 94279 94043 93948 94472 95662 97081 98402 99591 100493 100792 100630 100772 101762
51768 101762 103165 104050 104111 104016 104650 106194 107953 109052 109331 109498 110290 111584 112650 113220 113810 114813 115816
51751 115816 116232 116296 116905 118520 120716 122743 124194 125077 125659 126394 127715 129730 132272 135303 138969 143172
51735 143172 147404 151300 155058 159030 163062 166659 169762 172911 176467 179943 182367 183145 182423 180711 178421
51720 178421 175770 172927 170102 167463 164997 162521 159932 157431 155357 153771 152376 150916 149440 148061
51706A48061j329j186n73L61P55M0j243k101k231k002j573q26q9j16j047j949
51690A32952j833p92K28N33K59j2J04M52N49J90k21j99P7k4n66q53m74J2r2o24
51670A29666r15q08o87o94n61k10Q0K37N19R39J029M97k42n19k32J28J33j43l15
51651A27902r1N49J357J893J737Q43k84r35q62m59j93q0N8L0m85j274j644j326
51633A26736q08n64n16n37q31j378j552r91l60m72r31o74L34R18M08m23n47J1
51615A17823M68L67j95r16j425j433j135j121j513j646j106n27p33j423j552q38
51599A03095r3K8j52j7M52P86O33m8j039j793j718q50J1J68q5J15J028J973K189
51580A04683J673J009O83P42R43R94P26K48q1J1L73N51L11p5j07M18J217J778
$$ plain form
51706 148061 146732 145546 144973 145334 146089 146129 144886 142785 140554 138552 136979 136153 136064 135948 134901 132952
51690 132952 131119 130327 130555 131088 131347 131335 131439 131891 132440 132630 132409 132210 132287 132263 131697 130844 130370 130382 130290 129666
51670 129666 128751 127943 127256 126562 126001 125791 125871 126108 126627 127566 128595 129092 128850 128331 128099 128227 128360 128217 127902
51651 127902 127811 128360 129717 131610 133347 134190 133906 132971 132109 131650 131457 131377 131435 131465 130980 129706 128062 126736
51633 126736 125928 125364 124848 124311 123480 122102 120550 119559 119199 118727 117796 117122 117456 118374 118782 118359 117812 117823
51615 117823 118291 118658 118463 117547 116122 114689 113554 112433 110920 109274 108168 107641 106908 105485 103933 103095
51599 103095 103002 103030 102878 102861 103313 104099 104732 104684 103645 101852 100134 99284 99295 99463 99378 99493 100521 102494 104683
51580 104683 106356 107365 108048 108790 109733 110727 111453 111701 111620 111631 112004 112555 112866 112791 112684 113102 114319 116097
51562A16097J712J038K52Q2R08K306L230K923J679N96M77J062J425J073L89J2
51546A35261R1M04Q33J354J633J187J03q31r75m99M1M76R69J414J472J167J024
51529A45124J448K200K671K476J681O54k01o31o18l08J25M79N13J09n40j079j346
51512A52757j425j410j245q69l99j31l41j012j706j843j314o52m36o72r75j209
51496A37118j508j828j829j392q32n26m88m48k10J00J58j96o22n56j8K53j83o91
51478A26302l72O28J377J565J732K041J860R79K46L90R37J079R49J172J624J668
51462A44177J346J357J849K118J688R32M30K70L02M66O62P07O74Q92J405J757
51446A61032J609J194R71J065J284J486J717K065K489K706K292J206J49j1P47
$$ plain form
51562 116097 117809 118847 119099 119181 120089 122395 125625 128548 130227 130823 131300 132362 133787 134860 135249 135261
51546 135261 135352 135756 136589 137943 139576 140763 140866 140035 139060 138561 138602 139078 140047 141461 142933 144100 145124
51529 145124 146572 148772 151443 153919 155600 156254 156053 155422 154804 154496 154621 155100 155613 155722 155182 154103 152757
51512 152757 151332 149922 148677 147808 147409 147278 146937 145925 144219 142376 141062 140410 139974 139302 138327 137118
51496 137118 135610 133782 131953 130561 129729 129203 128715 128267 128057 128157 128315 128119 127497 126941 126923 127176 126993 126302
51478 126302 125930 126558 127935 129500 131232 133273 135133 136112 136358 136748 137685 138764 139713 140885 142509 144177
51462 144177 145523 146880 148729 150847 152535 153467 153897 154167 154469 154935 155597 156304 156978 157870 159275 161032
51446 161032 162641 163835 164806 165871 167155 168641 170358 172423 174912 177618 179910 181116 181265 181254 182001
51431A82001J497J451P24n3m75m72j24K20Or25j933k223j773j330j532k318l090
51414A69651l233k571j546q87q48r65p56m28m80q75j115j051r76q79l23O42J104
51397A54464L92q45j408j098q60j347k109k433k392k510k768k604j809r07m34
51382A31332l72n27j066k158l257l352k123m98L14J14k83k52n9k32o44o89k29
51365A16019Q9l43j275j884j731j196r07r89j020o58j38m1n81j166r97q2N88J75
51347A03863r00j478j153o59n97m60N24J983K677K146J268R53R39L83p35j531
51331A07223j381n94J51N68O84M40k38j040j338p83K66J044J090N97J48J03L61
51314A07301O41Q70J134J375J368J013N28J48j41m67p81r18q93r28j143j424j615
$$ plain form
51431 182001 183498 184949 185673 185620 185145 184673 184549 184769 184775 183850 181917 179694 177921 176591 175059 172741 169651
51414 169651 166418 163847 162301 161414 160566 159601 158845 158417 157937 157062 155947 154896 153920 153041 152718 153360 154464
51397 154464 154856 154011 152603 151505 150645 149298 147189 144756 142364 139854 137086 134482 132673 131766 131332
51382 131332 130960 130433 129367 127209 123952 120600 118477 117979 118293 118407 118124 117872 117813 117581 116937 116248 116019
51365 116019 116108 115765 114490 112606 110875 109679 108772 107783 106763 106105 105967 105926 105345 104179 103182 103100 103688 103863
51347 103863 102963 101485 100332 99673 99076 98616 99140 101123 103800 105946 107214 108167 109106 109489 108754 107223
51331 107223 105842 105248 105399 105967 106651 107091 106853 105813 104475 103692 103958 105002 106092 106689 106837 106940 107301
51314 107301 107942 108812 109946 111321 112689 113702 114230 114378 114237 113770 112989 112071 111178 110250 109107 107683 106068
51297A06068j711j773j830j868j900j905j849j764j691j559j246q79p69j040j415
51282H2869j561j449j236r95p70o95q06q39n32k6L11L45J74k13q87j575j816j589
51264F8710j358j367j303r21m99l10q3N35J219J280O03j76n20m79k78J38Q34J452
51246F7477J456P88j6l57j74J04R9j16k07j03j42n77j109j167o46m0K42M20R24
51227F6856J539J428K11j272j687p07O09J076O93L30M28N38J58n35j020j077p96
51210F6772k92K68N10K12l47o53n53l23k22k65m40p56j063j124q94n40j44L77
51192F0523R56J328J348J174R80O85J31n78j126j295j112p26k35K39M71K31l32
51175F2662o22j65O96J079O75J79L27Q76J143J152J514K153K102R23m63q82m00
$$ plain form
51297 106068 104357 102584 100754 98886 96986 95081 93232 91468 89777 88218 86972 86093 85324 84284 82869
51282 82869 81308 79859 78623 77628 76858 76163 75357 74518 73986 73960 74271 74616 74790 74577 73690 72115 70299 68710
51264 68710 67352 65985 64682 63761 63262 62952 62869 63404 64623 65903 66506 66330 65810 65331 65053 65191 66025 67477
51246 67477 68933 69721 69705 69348 69174 69278 69377 69261 69054 68951 68809 68232 67123 65956 65310 65270 65512 65932 66856
51227 66856 68395 69823 70034 68762 67075 66368 66977 68053 68746 69076 69504 70042 70200 69665 68645 67568 66772
51210 66772 66480 66748 67258 67470 67123 66470 65917 65594 65372 65107 64667 63911 62848 61724 60830 60290 60146 60523
51192 60523 61479 62807 64155 65329 66309 66994 67125 66547 65421 64126 63014 62288 62053 62292 62763 62994 62662
51175 62662 62040 61875 62571 63650 64325 64504 64831 65707 66850 68002 69516 71669 73771 74694 74231 73349 72949
51158G2949L1M8J86P47J183R52M11L44Q59J245R63L40O5K52L53m4o31q68p24o47
51138G8014q36r97q82o92o47n09J21J127J888J985J626J304J239J262J096O66
51122H5765J93m0p8l46j103j881j801o26P45J104K52q08r55p2R96J378Q89k8q09
51103H2775j111r12n11l79p72j445j775j408o41o7R7J71L94M82M2p05j027n97
51085G2611M1J98j14l33j80J40M35P55R88P71L0p85j230j337j281r66l39K00K28
51066F9832k6K8M59P51O37M14L62L84M12O72J187J485J201O49L77L87L18K48O98
51047H0475J727K555K402J463O08L09K68J33J25N61J123J095M23j22J6M12L77
51030I3950k2k23j51k51n63n70j15K23k0n22p60p28o36l42K84P93O48J39R1O46
$$ plain form
51158 72949 72980 73028 73214 73961 75144 76096 76507 76851 77710 78955 79918 80258 80323 80575 80928 80884 80253 79385 78661 78014
51138 78014 77178 76181 75299 74607 73960 73451 73572 74699 76587 78572 80198 81502 82741 84003 85099 85765
51122 85765 85958 85918 85840 85494 84391 82510 80709 80083 80828 81932 82184 81376 80421 80349 81345 82723 83612 83584 82775
51103 82775 81664 80752 80241 79862 79090 77645 75870 74462 73821 73754 73851 74022 74416 74898 74940 74235 73208 72611
51085 72611 72652 72850 72736 72403 72223 72363 72798 73553 74541 75312 75342 74557 73327 71990 70709 69743 69404 69604 69832
51066 69832 69806 69834 70293 71044 71681 72095 72457 72841 73253 73925 75112 76597 77798 78447 78824 79211 79529 79777 80475
51047 80475 82202 84757 87159 88622 89230 89539 89807 89940 90065 90626 91749 92844 93267 93145 93161 93573 93950
51030 93950 93928 93705 93554 93303 92740 92170 92055 92278 92258 91736 90976 90248 89612 89270 89554 90347 90995 91134 91225 91871
51010I1871R96N09m14r08o87j45K47L20J17k49o22q84j096j333j509j442j154
50993H3617q59o40k90L43R39R48L01l43k76M76J203J297Q22L12K58O61J009P67
50975I0545O8k53L58J330J552P88p3j80L68J005J476J742J566Q78K06K18Q65J451
50957A03910J506J188R06R19J256J676J703J102K76j05P7L56M38N88J107J783
50941A18686K108J844J228P42P53J272J966K472K727K917L182L467L579L328K718
50926A52989K108J978K417L040L512L885M241M389M311M446N006N419N105M580
50912B07426M899O152P354P914Q257Q787R148R041R062R992J1751J3555J4806
50899C28144J5370J5375J5246J5576J6430J7025J6623J5509J4568J4172J3865
$$ plain form
51010 91871 92867 93376 92962 92054 91367 91222 91469 91789 91906 91657 91035 90151 89055 87722 86213 84771 83617
50993 83617 82758 82118 81828 82171 83110 84058 84359 84016 83740 84216 85419 86716 87538 87850 88108 88769 89778 90545
50975 90545 90613 90360 90718 92048 93600 94388 94315 94135 94503 95508 96984 98726 100292 101170 101376 101594 102459 103910
50957 103910 105416 106604 107510 108429 109685 111361 113064 114166 114442 114337 114414 114770 115208 115796 116903 118686
50941 118686 120794 122638 123866 124608 125361 126633 128599 131071 133798 136715 139897 143364 146943 150271 152989
50926 152989 155097 157075 159492 162532 166044 169929 174170 178559 182870 187316 192322 197741 202846 207426
50912 207426 212325 218477 225831 233745 242002 250789 259937 268978 278040 288032 299783 313338 328144
50899 328144 343514 358889 374135 389711 406141 423166 439789 455298 469866 484038 497903
50888D97903J3084J1697R999Q583P966P959P678O549N108M271M155M205M167M201
50874E97525M141L603K806K486K684K473J221n50j958k919m017n672p859j0315
50860E83649j2597j4244j5216j5951j6692j7169j7193j7093j7109j6822j5761
50849D07802j4242j2893j1707j0304q916q249q225p864o651n310m677m462l806
50836C00496k625j713j570j775j605q20K89J294J867J842J236L18m37n51O6Q98
50820B97210J196Q14M72R34K060K956L005K395J683J297J540K643M413O050O718
50805C35386O305N430M829M919N782P186Q608R595J0234J1021J2138J3181J3806
50792D48420J4361J5545J7485J9574K1263K2647K4130K5808K7497K9200L1083
$$ plain form
50888 497903 510987 522684 532683 541266 549232 557191 564869 571418 576526 580797 584952 589157 593324 597525
50874 597525 601666 605269 608075 610561 613245 615718 616939 616389 614431 611512 607495 601823 593964 583649
50860 583649 571052 556808 541592 525641 508949 491780 474587 457494 440385 423563 407802
50849 407802 393560 380667 368960 358656 349740 341491 333266 325402 318751 313441 308764 304302 300496
50836 300496 297871 296158 294588 292813 291208 290388 290677 291971 293838 295680 296916 297234 296797 296246 296312 297210
50820 297210 298406 299220 299692 300626 302686 305642 308647 311042 312725 314022 315562 318205 322618 328668 335386
50805 335386 341691 347121 351950 356869 362651 369837 378445 388040 398274 409295 421433 434614 448420
50792 448420 462781 478326 495811 515385 536648 559295 583425 609233 636730 665930 697013
50781F97013L2998L4381L4851L4715L4628L4838L5015L4747L3908L2513L0491
50770A070098K7827K4800K1808J8991J6269J3779J2029J1395J1558J1770J1720
50759A252044J1804J2442J3386J3999J4063J3924J3712J2918J0941P795L982j18
50747A380892m388q590j2354j5557j8389k0913k2820k3860k4207k4158k3647k2356
50735A159653k0284j7901j5682j3574j1130q071m584r36L018P627J2658J7139
50723A107933K0371K2813K5429K8249L0226L0606K9788K8447K6492K3426J9321
50712A393101J4777J0127N329N50l743p387j0695j3973j7246k0531k3965k7539
50700A298805l0998l4057l6457l7902l8315l8141l7892l7466l6372l4661l2920
$$ plain form
50781 697013 730011 764392 799243 833958 868586 903424 938439 973186 1007094 1039607 1070098
50770 1070098 1097925 1122725 1144533 1163524 1179793 1193572 1205601 1216996 1228554 1240324 1252044
50759 1252044 1263848 1276290 1289676 1303675 1317738 1331662 1345374 1358292 1369233 1377028 1381010 1380892
50747 1380892 1376504 1367914 1355560 1340003 1321614 1300701 1277881 1254021 1229814 1205656 1182009 1159653
50735 1159653 1139369 1121468 1105786 1092212 1081082 1073011 1068427 1067491 1070509 1078136 1090794 1107933
50723 1107933 1128304 1151117 1176546 1204795 1235021 1265627 1295415 1323862 1350354 1373780 1393101
50712 1393101 1407878 1418005 1423334 1423884 1420141 1412754 1402059 1388086 1370840 1350309 1326344 1298805
50700 1298805 1267807 1233750 1197293 1159391 1121076 1082935 1045043 1007577 971205 936544 903624
50689I03624l1204k8798k5342k1571j8311j5439j2384r247o558m239j666J285
50677G30150M012O101P847R790J2126J4763J7445J9831K1787K3678K5885K8027
50665I21442K9209K9179K8626K8120K7370K5915K3965K2055K0215J8109J5744
50654A189949J3419J1096Q307M841J128k061m021m393l414j924o45O02K545N253
50640A220682P809R415J0393J1535J2851J3501J3026J1952J0948R774P618M375
50628A343879J069j164k155k478k431j726j87J765L581N239P145R564J2460J5707
50614A390268J9143K2538K5851K9524L4136L9753M5967N2555N9582O6734P3023
50603A859074P7508Q0024Q0930Q0416P8379P4749O9576O3002N5523M8086M1510
$$ plain form
50689 903624 872420 843622 818280 796709 778398 762959 750575 741328 734770 730531 728865 730150
50677 730150 734162 740263 748110 757900 770026 784789 802234 822065 843852 867530 893415 921442
50665 921442 950651 979830 1008456 1036576 1063946 1089861 1113826 1135881 1156096 1174205 1189949
50654 1189949 1203368 1214464 1222771 1227612 1228740 1226679 1222658 1218265 1214851 1212927 1212282 1212884 1215429 1220682
50640 1220682 1228491 1237906 1248299 1259834 1272685 1286186 1299212 1311164 1322112 1331886 1339504 1343879
50628 1343879 1344948 1343784 1341629 1339151 1336720 1334994 1334807 1336572 1340153 1345392 1352537 1362101 1374561 1390268
50614 1390268 1409411 1431949 1457800 1487324 1521460 1561213 1607180 1659735 1719317 1786051 1859074
50603 1859074 1936582 2016606 2097536 2177952 2256331 2331080 2400656 2463658 2519181 2567267 2608777
50592B608777L5721K9910K3372J6092Q623J637m496j0064j5773k1854k7519l1682
50580B612744l4082l5179l5178l3817l1191k8018k4792k1282j7225j3012r274
50569B329694o285m176l228l425m131m815n803p782j0624j3431j5589j7249j8749
50556B214407k0029k0697k0293j8460j5293j1507p913m682j491J669M256N751
50544B105718O073N357L791J673p94l961q467j4370k0873k7093l2750l7932m2594
50531A933778m6581m9867n2464n4199n4788n4068n2191m9690m7270m5207m3083
50520A384370m0448l7588l5139l3005l0425k7175k3903k1037j8192j5046j2091
$$ plain form
50592 2608777 2644498 2674408 2697780 2713872 2722495 2724132 2719636 2709572 2693799 2671945 2644426 2612744
50580 2612744 2578662 2543483 2508305 2474488 2443297 2415279 2390487 2369205 2351980 2338968 2329694
50569 2329694 2323409 2319233 2316005 2312580 2308449 2303634 2297831 2290049 2279425 2265994 2250405 2233156 2214407
50556 2214407 2194378 2173681 2153388 2134928 2119635 2108128 2100215 2095533 2094042 2095711 2099967 2105718
50544 2105718 2111791 2117148 2120939 2122612 2121818 2117857 2109390 2095020 2074147 2047054 2014304 1976372 1933778
50531 1933778 1887197 1837330 1784866 1730667 1675879 1621811 1569620 1519930 1472660 1427453 1384370
50520 1384370 1343922 1306334 1271195 1238190 1207765 1180590 1156687 1135650 1117458 1102412 1090321
$$ [...]
##END NTUPLES=NMR SPECTRUM
##END=
