
##TITLE=UV1159_TORI02-ROVE100C_6302119_mGTFKOXWo7
##JCAMPDX= 6.0         $$ Bruker NMR JCAMP-DX V2.0
##DATA TYPE= NMR SPECTRUM
##DATA CLASS= NTUPLES
##ORIGIN= BRUKER
##OWNER= Administrator
$$ 1.72 TOPSPIN		Version 2.1
$$ 2012-06-06 06:50:30.625 -0500  Administrator@TOPSPIN
$$ Compression mode = diff/dup
##.OBSERVE FREQUENCY= 400.13188235
##.OBSERVE NUCLEUS= ^1H
##.ACQUISITION MODE= SIMULTANEOUS (DQD)
##.ACQUISITION SCHEME= undefined
##.AVERAGES= 64
##.DIGITISER RES= 22
##SPECTROMETER/DATA SYSTEM= spect
##.PULSE SEQUENCE= noesygpps1d.comp
##.SOLVENT NAME= COFFEE_meoh
##.SHIFT REFERENCE= INTERNAL, COFFEE_meoh, 1, 14.98061
##AUDIT TRAIL= $$ (NUMBER, WHEN, WHO, WHERE, PROCESS, VERSION, WHAT)
$$ ##TITLE= Audit trail, TOPSPIN		Version 2.1
$$ ##JCAMPDX= 5.01
$$ ##ORIGIN= Bruker BioSpin GmbH
$$ ##OWNER= Administrator
$$ $$ C:\Bruker\TOPSPIN/data/COFFEE/nmr/UV1159_TORI02-ROVE100C_6302119_mGTFKOXWo7/12/pdata/1/auditp.txt
$$ ##AUDIT TRAIL=  $$ (NUMBER, WHEN, WHO, WHERE, PROCESS, VERSION, WHAT)
(   1,<2012-06-06 06:50:25.421 -0500>,<Administrator>,<TOPSPIN>,<go>,<TOPSPIN 2.1>,
      <created by zg
	started at 2012-06-06 06:38:55.234 -0500,
	POWCHK enabled, PULCHK disabled,
       configuration hash MD5:
       D5 CA 7A 23 FE 6B EE E2 50 67 74 61 24 F7 5E 3B
       data hash MD5: 64K
       BB 78 45 8B A5 52 A5 CC 45 4D D8 EB 78 31 2B 09>)
(   2,<2012-06-06 06:50:28.203 -0500>,<Administrator>,<TOPSPIN>,<proc1d>,<TOPSPIN 2.1>,
      <Start of raw data processing
       efp LB = 0.3 FT_mod = 6 PKNL = 1 PHC0 = 0 PHC1 = 0 SI = 128K 
       data hash MD5: 128K
       46 13 23 FA 40 14 08 BF 37 6C 4F 00 11 4E 54 45>)
(   3,<2012-06-06 06:50:29.437 -0500>,<Administrator>,<TOPSPIN>,<proc1d>,<TOPSPIN 2.1>,
      <pk PHC0 = 29.50928 PHC1 = 0 
       data hash MD5: 128K
       7B 34 B0 90 FC 01 B3 28 6B 1F BF 73 8F CE 57 5C>)
(   4,<2012-06-06 06:50:30.265 -0500>,<Administrator>,<TOPSPIN>,<proc1d>,<TOPSPIN 2.1>,
      <abs ABSG = 1 
       data hash MD5: 128K
       40 B5 0E B3 E4 9F 17 B8 41 48 9D BD EE 83 D6 95>)
(   5,<2012-06-06 06:50:30.343 -0500>,<Administrator>,<TOPSPIN>,<proc1d>,<TOPSPIN 2.1>,
      <abs ABSG = 2 
       data hash MD5: 128K
       DD EB E4 C8 74 17 62 81 D5 29 2F 2A CB B1 8F 95>)
(   6,<2012-06-06 06:50:30.406 -0500>,<Administrator>,<TOPSPIN>,<proc1d>,<TOPSPIN 2.1>,
      <abs ABSG = 3 
       data hash MD5: 128K
       CA 3E 33 9B 4E 75 40 D8 2A 7B 7A 03 40 B2 86 93>)
(   7,<2012-06-06 06:50:30.500 -0500>,<Administrator>,<TOPSPIN>,<proc1d>,<TOPSPIN 2.1>,
      <abs ABSG = 4 
       data hash MD5: 128K
       6B 29 50 12 E9 84 DF A5 F9 64 26 9E DE 55 62 15>)
(   8,<2012-06-06 06:50:30.546 -0500>,<Administrator>,<TOPSPIN>,<proc1d>,<TOPSPIN 2.1>,
      <abs ABSG = 5 
       data hash MD5: 128K
       8B F8 D2 84 5B 36 DE BD B2 74 48 86 A3 AD EA 3E>)
$$ ##END=
$$ 
$$ $$ hash MD5
$$ $$ 3F A3 7B 13 3B 61 37 75 AE 3B 67 ED DE 90 C3 29
##$RELAX= 
##$RELAX= 
##$RELAX= 
##$RELAX= 
##$RELAX= 
##$RELAX= 
##$RELAX= 
##$RELAX= 
$$ [...]
150 150 150 150 150 150 150 150
##$TP07= 0
##$TPNAME0= <>
##$TPNAME1= <>
##$TPNAME2= <>
##$TPNAME3= <>
##$TPNAME4= <>
##$TPNAME5= <>
##$TPNAME6= <>
##$TPNAME7= <>
##$TPOAL= (0..7)
0.5 0.5 0.5 0.5 0.5 0.5 0.5 0.5
##$TPOFFS= (0..7)
0 0 0 0 0 0 0 0
##$TUNHIN= 0
##$TUNHOUT= 0
##$TUNXOUT= 0
##$USERA1= <user>
##$USERA2= <user>
##$USERA3= <user>
##$USERA4= <user>
##$USERA5= <user>
##$V9= 5
##$VALIST= <valist>
##$VCLIST= <CCCCCCCCCCCCCCC>
##$VD= 0
##$VDLIST= <DDDDDDDDDDDDDDD>
##$VPLIST= <PPPPPPPPPPPPPPP>
##$VTLIST= <TTTTTTTTTTTTTTT>
##$WBST= 2048
##$WBSW= 25
##$XGAIN= (0..3)
0 0 0 0
##$XL= 0
##$YL= 0
##$YMAX_a= 13247077
##$YMIN_a= -6541564
##$ZGOPTNS= <>
##$ZL1= 120
##$ZL2= 120
##$ZL3= 120
##$ZL4= 120
##$ABSF1= 14.98061
##$ABSF2= -5.57192
##$ABSG= 5
##$ABSL= 3
##$ALPHA= 0
##$AQORDER= 0
##$ASSFAC= 0
##$ASSFACI= 0
##$ASSFACX= 0
##$ASSWID= 0
##$AUNMP= <proc_prof1d_extract.lims>
##$AXLEFT= 0
##$AXNAME= <>
##$AXNUC= <1H>
##$AXRIGHT= 0
##$AXTYPE= 0
##$AXUNIT= <>
##$AZFE= 0.1
##$AZFW= 0.1
##$BCFW= 0
##$BC_mod= 0
##$BYTORDP= 0
##$COROFFS= 0
##$CY= 15
##$DATMOD= 1
##$DC= 0
##$DFILT= <>
##$DTYPP= 0
##$F1P= 0
##$F2P= 0
##$FCOR= 0.5
##$FTSIZE= 131072
##$FT_mod= 6
##$GAMMA= 0
##$GB= 0
##$INTBC= 1
##$INTSCL= 1
##$ISEN= 128
##$LB= 0.3
##$LEV0= 0
##$LPBIN= 0
##$MAXI= 10000
##$MC2= 0
##$MEAN= 0
##$ME_mod= 0
##$MI= 0
##$NCOEF= 0
##$NC_proc= -2
##$NLEV= 6
##$NOISF1= 0
##$NOISF2= 0
##$NSP= 0
##$NTH_PI= 0
##$NZP= 0
##$OFFSET= 14.98061
##$PC= 1
##$PHC0= 29.50928
##$PHC1= 0
##$PH_mod= 1
##$PKNL= yes
##$PPARMOD= 0
##$PPDIAG= 0
##$PPIPTYP= 0
##$PPMPNUM= 2147483647
##$PPRESOL= 1
##$PSCAL= 4
##$PSIGN= 0
##$PYNMP= <proc.py>
##$REVERSE= no
##$SF= 400.13
##$SI= 131072
##$SIGF1= 0
##$SIGF2= 0
##$SINO= 400
##$SIOLD= 131072
##$SPECTYP= <>
##$SREGLST= <1H.CDCl3>
##$SSB= 0
##$STSI= 131072
##$STSR= 0
##$SW_p= 8223.68421052632
##$SYMM= 0
##$S_DEV= 0
##$TDeff= 65536
##$TDoff= 0
##$TI= <>
##$TILT= no
##$TM1= 0
##$TM2= 0
##$TOPLEV= 0
##$USERP1= <user>
##$USERP2= <user>
##$USERP3= <user>
##$USERP4= <user>
##$USERP5= <user>
##$WDW= 1
##$XDIM= 131072
##$YMAX_p= 289225219
##$YMIN_p= -206950385
##$CURPLOT= <Network HP LaserJet P1505>
##$CURPRIN= <$Network HP LaserJet P1505>
##$DFORMAT= <normdp>
##$LAYOUT= <+/1D_H.xwp>
##$LFORMAT= <normlp>
##$PFORMAT= <normpl>
##$SURQMSG= 1
$$ End of Bruker specific parameters
$$ ---------------------------------
##NTUPLES= NMR SPECTRUM
##VAR_NAME=  FREQUENCY,     SPECTRUM/REAL,   SPECTRUM/IMAG
##SYMBOL=    X,             R,               I
##VAR_TYPE=  INDEPENDENT,   DEPENDENT,       DEPENDENT
##VAR_FORM=  AFFN,          ASDF,            ASDF
##VAR_DIM=   131072,        131072,          131072
##UNITS=     HZ,            ARBITRARY UNITS, ARBITRARY UNITS
##FACTOR=    0.0627417313425165, 1,          1
##FIRST=     8223.62146879498, -1331,        -46896
##LAST=      0,             -54,             -46617
##MIN=       0,             -206950385,      0
##MAX=       8223.62146879498, 289225219,    0
$$ Real data points
##PAGE= N=1
##DATA TABLE= (X++(R..R)), XYDATA
$$ [...]
61017E87594p422o586n326m272l847l720l210k182j314j234j669j723j012p0M74
61002E44481P05J004J251R75K43k33P2J004K058K816K998K687K554L325M753N644
60986E76337N287M404M204M948N930O585O964P292P619P913Q051P797P257P151
60972F67739Q093R551J0269R824R099Q905Q831P983O417N103M638M618M333L578
60958G68981K615J763J251J227J664K303K871L375M084N216O611P807Q527R119
60944H27414J0360J2609J5249J7283J8421J9364K0953K3295K5908K8404L0745
60933A050005L2945L4933L6777L8841M1478M4702M8177N1530N4501N6988N9053
60922A549930O0979O3205O6080O9553P3154P6374P9249Q2430Q6535R1509R6919
$$ y = [587594, 580172, 573586, 568260, 563988, 560141, 556421, 553211, 551029, 549715, 548481, 546812, 545089, 544077, 544007, 544481, 545186, 546190, 547441, 548416, 548659, 548426, 548498, 549502, 551560, 554376, 557374, 560061, 562615, 565940, 570693, 576337, 581624, 586028, 590232, 595180, 601110, 607695, 614659, 621951, 629570, 637483, 645534, 653331, 660588, 667739, 675832, 685383, 695652, 705476, 714575, 723480, 732311, 740294, 746711, 751814, 756452, 761070, 765403, 768981, 771596, 773359, 774610, 775837, 777501, 779804, 782675, 786050, 790134, 795350, 801961, 809768, 818295, 827414, 837774, 850383, 865632, 882915, 901336, 920700, 941653, 964948, 990856, 1019260, 1050005, 1082950, 1117883, 1154660, 1193501, 1234979, 1279681, 1327858, 1379388, 1433889, 1490877, 1549930, 1610909, 1674114, 1740194, 1809747, 1882901, 1959275, 2038524, 2120954, 2207489, 2298998, 2395917]
60911B395917J02817J09933J18748J28694J38576J47636J55993J64307J73460
60902C636081J84365J97644K13403K31693K53154K78799L09170L44112L83302
60893F031723M26512M73554N24722N81448O45785P19079Q02043Q96359J005268
60884A2106493J132169J279678J450525J648449J878261K146217K455679K788064
60876B6885535L074569L192710L019648K520960J800278J054891M68898J33305
60868D2150794M3405J37761L17370M42061L55784l6983o98696j465975k142670
60859C9102851k603309k829505k873258k800560k661430k488180k300619k108161
60851A8437829j913216j717587j526079j344517j176715j024674q90094p74126
$$ y = [2395917, 2498734, 2608667, 2727415, 2856109, 2994685, 3142321, 3298314, 3462621, 3636081, 3820446, 4018090, 4231493, 4463186, 4716340, 4995139, 5304309, 5648421, 6031723, 6458235, 6931789, 7456511, 8037959, 8683744, 9402823, 10204866, 11101225, 12106493, 13238662, 14518340, 15968865, 17617314, 19495575, 21641792, 24097471, 26885535, 29960104, 33152814, 36172462, 38693422, 40493700, 41548591, 42017489, 42150794, 42194199, 42331960, 42649330, 43091391, 43447175, 43410192, 42711496, 41245521, 39102851, 36499542, 33670037, 30796779, 27996219, 25334789, 22846609, 20545990, 18437829, 16524613, 14807026, 13280947, 11936430, 10759715, 9735041, 8844947, 8070821]
60843H070821o76100n93739n24626m66875m18606l77509l41303l08489k78647
60834D084927k52007k28579k07732j88790j71948j58137j47837j40234j33684
60825B455979j26795j19090j10967j03250r6517r0624q4939p9069p3205o7793
60815A503730o3090n9029n5211n1137m6715m2561l9372l6994l4577l1752k9094
60804A014198k7181k5681k3848k1607j9609j8374j7766j7359j6940j6526j6066
60793G93241j5373j4398j3397j2652j2044j1148r875q693q015p648p260p025p247
60780F58466p591p375o546n750n417n453n826o618p401p368o437n460n046m889
60766E71289m617m368m089l179j601m68n65j029n83N13J020P91R13J885L022L805
$$ y = [8070821, 7394721, 6800982, 6276356, 5809481, 5390875, 5013366, 4672063, 4363574, 4084927, 3832920, 3604341, 3396609, 3207819, 3035871, 2877734, 2729897, 2589663, 2455979, 2329184, 2210094, 2099127, 1995877, 1899360, 1808736, 1723797, 1644728, 1571523, 1503730, 1440640, 1381611, 1326400, 1275263, 1228548, 1185987, 1146615, 1109621, 1075044, 1043292, 1014198, 987017, 961336, 937488, 915881, 896272, 877898, 860132, 842773, 825833, 809307, 793241, 777868, 763470, 750073, 737421, 725377, 714229, 704354, 695661, 687646, 679998, 672738, 665713, 658466, 650875, 643500, 636954, 631204, 625787, 620334, 614508, 607890, 600489, 593121, 586684, 581224, 576178, 571289, 566672, 562304, 558215, 555036, 553435, 552967, 552402, 551373, 550790, 551303, 552323, 553114, 554027, 555912, 558934, 562739]
60750E62739M495N044M688L294K122K321L449M310M684N260O150O590O147N392
60736F26685N118N345N397M656L144J524O15O04P27l4j794l582m455m433m183
60721F35334m067m016m106m596n268n319m368l104k401k142j620q61p01j394k081
60706E89290k004j528j372j463j289r80j131j711j964j496p67k66K00J013K012
60691E76544K657K785K800L093L543L746L609L456L467L348K820K216K027J926
60677F18037R81j008l062m284m934n664o393o747p063p929q965r085q050o857
60663E38977o367o409o441o317o001n279m274l722m140n010n359m936m418m485
60649D65819n088n615n587n111m701m742n142n582n882n963n658m895l993l370
$$ y = [562739, 567234, 572278, 576966, 580260, 582382, 584703, 588152, 592462, 597146, 602406, 608556, 615146, 621293, 626685, 631803, 637148, 642545, 647201, 650345, 651869, 652484, 653088, 653815, 653781, 651987, 648405, 643950, 639517, 635334, 631267, 627251, 623145, 618549, 613281, 607962, 603594, 600490, 598089, 595947, 594327, 593466, 592765, 591371, 589290, 587286, 585758, 584386, 582923, 581634, 580654, 579523, 577812, 575848, 574352, 573585, 573319, 573519, 574532, 576544, 579201, 581986, 584786, 587879, 591422, 595168, 598777, 602233, 605700, 609048, 611868, 614084, 616111, 618037, 619018, 618010, 614948, 610664, 605730, 600066, 593673, 586926, 579863, 571934, 562969, 553884, 545834, 538977, 532610, 526201, 519760, 513443, 507442, 502163, 497889, 494167, 490027, 485017, 479658, 474722, 470304, 465819, 460731, 455116, 449529, 444418, 439717, 434975, 429833, 424251, 418369, 412406, 406748, 401853, 397860, 394490]
60635C94490l058k832k650k550k202j198J13P76L96l23m62J11R64J814K664L441
60619C89494L912L946L634L246L141L526M279N071N704O099O146N822N490N555
60605D55065N886O008N876N940O361O738O838P059P801Q838R649J0047J0132R962
60591E62200R624R374R345R306Q984Q487Q077P689O996N870M559L365K356J407
60577F57639M09n95j555k602l931n456o761p498p637p176o117m974m692n523o462
60562E87069o530o098o083o240n498l812k396j934j840j581j455j507r60M75J792
60547E43402K095J986K585L900N168O252P574R058J0116J0639J1123J1966J3198
60534F39062J4721J6183J6907J6574J5785J5336J5160J4568J3246J1417R251O726
$$ y = [394490, 391432, 388600, 385950, 383400, 381198, 380000, 380113, 380889, 381285, 380962, 380500, 380611, 381575, 383389, 386053, 389494, 393406, 397352, 400986, 404232, 407373, 410899, 415178, 420249, 425953, 432052, 438198, 444020, 449510, 455065, 460951, 466959, 472835, 478775, 485136, 491874, 498712, 505771, 513572, 522410, 532059, 542106, 552238, 562200, 571824, 581198, 590543, 599849, 608833, 617320, 625397, 633086, 640082, 645952, 650511, 653876, 656232, 657639, 658048, 657453, 655898, 653296, 649365, 643909, 637148, 629650, 622013, 614837, 608720, 603746, 599054, 593531, 587069, 580539, 574441, 568358, 562118, 556620, 552808, 550412, 548478, 546638, 545057, 543602, 542095, 541135, 541610, 543402, 545497, 547483, 550068, 553968, 559136, 565388, 572962, 582020, 592136, 602775, 613898, 625864, 639062, 653783, 669966, 686873, 703447, 719232, 734568, 749728, 764296, 777542, 788959, 798210, 804936]
60522H04936L895P67k747o247q688r486r445r802j0686j1318j1354j1112j0731
60509G07982j0152r752r985j0359r867q536p490p206o781n416l693k722k634k626
60495F10763k128j287m28L63J168J982K689L262L956N085O464P383P499P444Q014
60480F62229R009R517R323R294J0224J1920J3728J5449J7365J9603K1895K3968
60468H33524K6026K8712L2414L6698M0779M4686M9374N5418O2169O8669P4744
60457A353213Q0415Q4793Q6575Q5350Q1413P4576O4304N1115L6865K3428J1926
60446B033973L137k405n188o574p551q230q726r630j1253j3310j5640j8325k0715
60433A909563k1381j9679j6499j2797q319k511M127J0773J7683K5790L5149M4931
$$ y = [804936, 808831, 809598, 806851, 800604, 791916, 782430, 772985, 763183, 752497, 741179, 729825, 718713, 707982, 697830, 688078, 678093, 667734, 657867, 649331, 641841, 634635, 627854, 622438, 618745, 616023, 613389, 610763, 608635, 607348, 606920, 607283, 608451, 610433, 613122, 616384, 620340, 625425, 631889, 639272, 646771, 654215, 662229, 671238, 680755, 690078, 699372, 709596, 721516, 735244, 750693, 768058, 787661, 809556, 833524, 859550, 888262, 920676, 957374, 998153, 1042839, 1092213, 1147631, 1209800, 1278469, 1353213, 1433628, 1518421, 1604996, 1690346, 1771759, 1846335, 1910639, 1961754, 1998619, 2022047, 2033973, 2037110, 2034705, 2029517, 2022943, 2015392, 2007162, 1998436, 1988806, 1977553, 1964243, 1948603, 1930278, 1909563, 1888182, 1868503, 1852004, 1839207, 1830888, 1828377, 1832504, 1843277, 1860960, 1886750, 1921899, 1966830]
60421A966830N4699O4675P4554Q3036Q8904R1933R2489R0819Q7208Q2552P8341
60410B856040P6100P6957Q1565R0101J02300J17757J36391J58509J84093K12212
60400D092025K41726K72708L06426L43357L81838M19228M53456M81822M98504
60391G491090M95220M65406M07243L22711K15595R1743l9702j67408k81068l73792
60381H627038m42450m87086n10124n15252n06337m87024m60622m29867l96782
60372D391494l62998l29886k98229k68213k40111k14523j91694j71148j52431
60363B162261j35660j20867j07496r5215q4668p6565p0463o5197o0231n5712n1552
60352A238635m7399m3423m0170l7577l4927l1897k8988k6758k5172k3890k2653
$$ y = [1966830, 2021529, 2086204, 2160758, 2243794, 2332698, 2424631, 2517120, 2607939, 2695147, 2777699, 2856040, 2932140, 3009097, 3090662, 3180763, 3283063, 3400820, 3537211, 3695720, 3879813, 4092025, 4333751, 4606459, 4912885, 5256242, 5638080, 6057308, 6510764, 6992586, 7491090, 7986310, 8451716, 8858959, 9181670, 9397265, 9489008, 9449306, 9281898, 9000830, 8627038, 8184588, 7697502, 7187378, 6672126, 6165789, 5678765, 5218143, 4788276, 4391494, 4028496, 3698610, 3400381, 3132168, 2892057, 2677534, 2485840, 2314692, 2162261, 2026601, 1905734, 1798238, 1703023, 1618355, 1541790, 1471327, 1406130, 1345899, 1290187, 1238635, 1191236, 1147813, 1107643, 1070066, 1035139, 1003242, 974254, 947496, 922324, 898434, 875781]
60341H75781k1298j9833j8536j7596j6641j5151j3303j1826j0974j0234r182q112
60329G03095p577p711q234q803r224r562j0073j0769j1133j0705r811r175q870
60316E81448q234o971n718n239n516n963o089n732m947m027l408l264l330l230
60302E09780k916k634k654l024l495l645l339k927k803k882k855k821l069l376
60288D67340l089k078j016n00m03l80m45o39n61J39J060J388R21L53M75J411K599
60271D66575L320L235K624K145K202K564K702K442K108K039K139K024J545J014
60257D98678Q51J052J253J313J510J904J864Q01p24j326m51Q17J040J22p65o78
60241E07261K06J198J962K642L432M347N253N970O437O890P729R072J0439J1076
$$ y = [875781, 854483, 834650, 816114, 798518, 781877, 766726, 753423, 741597, 730623, 720389, 711207, 703095, 695518, 687807, 679573, 670770, 661546, 651984, 641911, 631142, 620009, 609304, 599493, 590318, 581448, 573214, 566243, 560525, 555286, 549770, 543807, 537718, 531986, 527039, 523012, 519604, 516340, 513010, 509780, 506864, 504230, 501576, 498552, 495057, 491412, 488073, 485146, 482343, 479461, 476606, 473785, 470716, 467340, 464251, 462173, 461157, 460657, 460254, 459874, 459429, 458790, 458229, 458368, 459428, 460816, 461737, 462090, 462565, 463976, 466575, 469895, 473130, 475754, 477899, 480101, 482665, 485367, 487809, 489917, 491956, 494095, 496119, 497664, 498678, 499529, 500581, 501834, 503147, 504657, 506561, 508425, 509226, 508502, 507176, 506725, 507542, 508582, 508704, 507939, 507261, 507467, 508665, 510627, 513269, 516701, 521048, 526301, 532271, 538708, 545598, 553327, 562399, 572838, 583914]
60227E83914J0553R088P339N874M766L665K331J074M21L18M4p78j429r44L77J098
60211F27711N36k05L49K148L823M568M944N727O856P803Q468R239J0441J2049
60197G04457J3754J5205J6357J7662J9579K1920K4060K5864K7816L0179L2626
60186I49479L5007L7705M0756M3321M4725M5526M6694M8136M8900M8593M7659
60175A436501M6260M3862M0212L5921L1730K7731K3659J9421J4953J0035M725
60164A735010k56m077o613q409r815j0567j0335r377q343p406n903l124P15M714
60150A656214Q455J2455J7221K2421K7285L1495L5186L8390M1018M3125M4637
60139A977902M5010M3714M0962L7446L3466K8817K3448J7653J1644N493n74o341
$$ y = [583914, 594467, 603555, 610894, 616768, 621534, 625199, 627530, 628604, 629025, 629343, 629387, 628609, 627180, 626236, 626613, 627711, 628247, 628042, 628391, 630539, 634362, 638930, 643874, 649601, 656457, 664260, 672728, 681967, 692408, 704457, 718211, 733416, 749773, 767435, 787014, 808934, 832994, 858858, 886674, 916853, 949479, 984486, 1022191, 1062947, 1106268, 1150993, 1196519, 1243213, 1291349, 1340249, 1388842, 1436501, 1482761, 1526623, 1566835, 1602756, 1634486, 1662217, 1685876, 1705297, 1720250, 1730285, 1735010, 1734754, 1730677, 1724064, 1715655, 1705840, 1695273, 1684938, 1675561, 1667218, 1659812, 1653909, 1650785, 1651500, 1656214, 1664669, 1677124, 1694345, 1716766, 1744051, 1775546, 1810732, 1849122, 1890140, 1933265, 1977902, 2022912, 2066626, 2107588, 2145034, 2178500, 2207317, 2230765, 2248418, 2260062, 2265555, 2264981, 2258640]
60127B258640j1967j7563k2479k5754k7320k7926k7789k6188k2731j8139j3255
60116B017529q005j950M720J1390J7823K4079L0013L5456M0622M5738N0328N3504
60104B321247N4943N5165N4819N4074N2795N0909M8394M4986M0144L3490K5329
60093B836295J6589Q016l35q396j5164j9179k0053j8757j6195j2246o649l5O820
60080B750711J4184K2854L2680M2521N1730O0882P0806Q1553R2551J03297J13475
60069C437244J22690J30388J36007J39184J39894J38440J35093J29751J22104
60060D630795J12036R9711Q5404O9533N2760L5637J8161K1j8613l6873n3858o9200
60048D925514q2887r4805j04616j11882j16194j17398j15837j12133j06624r9141
$$ y = [2258640, 2246673, 2229110, 2206631, 2180877, 2153557, 2125631, 2097842, 2071654, 2048923, 2030784, 2017529, 2009524, 2007574, 2012294, 2023684, 2041507, 2065586, 2095599, 2131055, 2171677, 2217415, 2267743, 2321247, 2376190, 2431355, 2486174, 2540248, 2593043, 2643952, 2692346, 2737332, 2777476, 2810966, 2836295, 2852884, 2860900, 2860565, 2852169, 2837005, 2817826, 2797773, 2779016, 2762821, 2750575, 2743926, 2743891, 2750711, 2764895, 2787749, 2820429, 2862950, 2914680, 2975562, 3046368, 3127921, 3220472, 3323769, 3437244, 3559934, 3690322, 3826329, 3965513, 4105407, 4243847, 4378940, 4508691, 4630795, 4742831, 4842542, 4927946, 4997479, 5050239, 5085876, 5104037, 5104058, 5085445, 5048572, 4994714, 4925514, 4842627, 4747822, 4643206, 4531324, 4415130, 4297732, 4181895, 4069762, 3963138, 3863997]
60038C863997q9523p8150o5802n3140m0527k8172j6182m556O567J6604K4793L0852
60026C566761L5129L7892L8725L7030L3038K7814K2167J5954Q811J163n986j2150
60014C806348j7698k3054k8044l2177l5206l7188l8246l8487l7892l6063l2420
60003C449873k6992k0868j5553j1844r506p873o551n625n447o180p336p895p100
59990C311103n074k488K63L255O416R149J0706J0807R724P858N302J864k547p603
59976C358735j2798j8015k3593k9737l6088m2085m7522n2364n6237n8614n9510
59965B922172n9493n8814n6978n3468m8608m3309l8093l2769k7060k1126j5298
59954B467156r565l591K807R435J6046K2687K9523L6341M2479M7411N1320N4774
$$ y = [3863997, 3774474, 3696324, 3630522, 3577382, 3536855, 3508683, 3492501, 3487945, 3494512, 3511116, 3535909, 3566761, 3601890, 3639782, 3678507, 3715537, 3748575, 3776389, 3798556, 3814510, 3823321, 3824484, 3818498, 3806348, 3788650, 3765596, 3737552, 3705375, 3670169, 3632981, 3594735, 3556248, 3518356, 3482293, 3449873, 3422881, 3402013, 3386460, 3374616, 3365110, 3357237, 3350686, 3345061, 3339614, 3333434, 3326098, 3318203, 3311103, 3306029, 3303541, 3303804, 3307059, 3313475, 3322624, 3333330, 3344137, 3353861, 3361719, 3367021, 3368885, 3366338, 3358735, 3345937, 3327922, 3304329, 3274592, 3238504, 3196419, 3148897, 3096533, 3040296, 2981682, 2922172, 2862679, 2803865, 2746887, 2693419, 2644811, 2601502, 2563409, 2530640, 2503580, 2482454, 2467156, 2457591, 2454000, 2456807, 2466242, 2482288, 2504975, 2534498, 2570839, 2613318, 2660729, 2712049, 2766823]
59942B766823N7750N9235N8076N4228M8888M3260L7364L0265K1347J1127P60q981
59930C180142j8045k6644l4646m1469m6483m9484n0814n0974n0113m7938m4208
59919B719324l9133l3233k6926k0350j3483o349Q53P704J3818J9241K4408K9565
59907B675439L4413L8429M1306M2915M3162M2267M0846L9229L6975L3536K9272
59896C097789K5161K1694J8647J5950J3919J2563J1566J1251J2622J5984K0316
59885C277462K4808L0224L7836M7458N7722O8026P9088R1388J04194J16523J28153
59874D062882J39054J48389J54801J57395J55893J49991J39149J22990J01568
59865E332112P5320M5224J3062j8888m8848p6091j00439j21310j37557j48223
$$ y = [2766823, 2824573, 2883808, 2941884, 2996112, 3045000, 3088260, 3125624, 3155889, 3177236, 3188363, 3189123, 3180142, 3162097, 3135453, 3100807, 3059338, 3012855, 2963371, 2912557, 2861583, 2811470, 2763532, 2719324, 2680191, 2646958, 2620032, 2599682, 2586199, 2579850, 2580703, 2588407, 2602225, 2621466, 2645874, 2675439, 2709852, 2748281, 2789587, 2832502, 2875664, 2917931, 2958777, 2998006, 3034981, 3068517, 3097789, 3122950, 3144644, 3163291, 3179241, 3193160, 3205723, 3217289, 3228540, 3241162, 3257146, 3277462, 3302270, 3332494, 3370330, 3417788, 3475510, 3543536, 3622624, 3714012, 3818206, 3934729, 4062882, 4201936, 4350325, 4505126, 4662521, 4818414, 4968405, 5107554, 5230544, 5332112, 5407432, 5452656, 5465718, 5446830, 5397982, 5321891, 5221452, 5100142, 4962585, 4814362]
59855D814362j53364j54040j51532j46592j39324j29700j18132j05485r2514p9380
59845C544299o5873n2073l8581k5905j3898k008R935K1431L1722M0246M6744N1217
59833C547256N3837N4582N2881M7895L9303K7612J3582k345j9818l8008n5647
59822C721130p1587q5180r6223j04774j11043j15226j17419j17639j15929j12440
59812B673670j07504j01652r5389q8910q2121p5053o7973o1087n4322m7626m1282
59801A850751l5690l0884k6546k2477j8938j6418j5084j4469j3848j2893j1894
59790A631610j1161j0434r168p277n235l506k257j589j524j737j849k214l796
59777A569863o912j0650j3945j6727j9359k1481k2258k1693k0859k0598k0562
$$ y = [4814362, 4660998, 4506958, 4355426, 4208834, 4069510, 3939810, 3821678, 3716193, 3623679, 3544299, 3478426, 3426353, 3387772, 3361867, 3347969, 3345961, 3355896, 3377327, 3409049, 3449295, 3496039, 3547256, 3601093, 3655675, 3708556, 3756451, 3795754, 3823366, 3836948, 3834603, 3814785, 3776777, 3721130, 3649543, 3564363, 3468140, 3363366, 3252323, 3137097, 3019678, 2902039, 2786110, 2673670, 2566166, 2464514, 2369125, 2280215, 2198094, 2123041, 2055068, 1993981, 1939659, 1892033, 1850751, 1815061, 1784177, 1757631, 1735154, 1716216, 1699798, 1684714, 1670245, 1656397, 1643504, 1631610, 1620449, 1610015, 1600847, 1593570, 1588335, 1584829, 1582572, 1580983, 1579459, 1577722, 1575873, 1573659, 1569863, 1562951, 1552301, 1538356, 1521629, 1502270, 1480789, 1458531, 1436838, 1415979, 1395381, 1374819]
59766A374819j9751j7672j4714j1674r121p062n060k696J25L267O636J0142J3575
59753A320814J6750J9659K2258K4282K5555K6322K6975K7479K7431K6635K5307
59742A589467K3710K1930J9996J8012J6102J4488J3609J3883J5296J7395J9813
59731A783701K2647K6362L1358L7584M4360N0670N5774N9564O2442O5125O8682
59720B308269P4139Q1670R0401R9433J08678J18169J26794J32482J33476J28734
59710C402245J17114R7329O9461L6168J793k9758n6303p7201r2499j02275j06540
59699C259534j05695j00952r3957q5771p6456o5825n4320m2892l2172k2127j2441
59688B566926l027O012J4683K3207L1802M0448M8944N7177O5227P3156Q0951Q8795
$$ y = [1374819, 1355068, 1337396, 1322682, 1311008, 1301887, 1294825, 1289765, 1287069, 1287194, 1290461, 1297097, 1307239, 1320814, 1337564, 1357223, 1379481, 1403763, 1429318, 1455640, 1482615, 1510094, 1537525, 1564160, 1589467, 1613177, 1635107, 1655103, 1673115, 1689217, 1703705, 1717314, 1731197, 1746493, 1763888, 1783701, 1806348, 1832710, 1864068, 1901652, 1946012, 1996682, 2052456, 2112020, 2174462, 2239587, 2308269, 2382408, 2464078, 2554479, 2653912, 2762590, 2880759, 3007553, 3140035, 3273511, 3402245, 3519359, 3616688, 3686149, 3722317, 3724110, 3694352, 3638049, 3560848, 3468349, 3366074, 3259534, 3153839, 3052887, 2958930, 2873159, 2796703, 2730878, 2676558, 2633666, 2601494, 2579367, 2566926, 2563899, 2569911, 2584594, 2607801, 2639603, 2680051, 2728995, 2786172, 2851399, 2924555, 3005506, 3094301]
59676C094301R7224J06694J17037J27634J38137J48787J59977J71756J83930J96409
59666D541886K09279K22490K35673K48258K59789K69953K78250K83781K85588
59657F834947K83330K77428K68657K57881K46274K35289K26222K19922K16979
59648I066929K17663K21367K26603K32042K37164K41463K43388K40758K32074
59639A1159451K16950J95585J68628J37508J04103O9953L6167M131k4312m7491
59629A2020673o4260p3843p5980p1378o1365m6868k8113n438K0229M7955P7383
59618A1738995J08531J41254J75026K08798K41043K70340K95955L17150L31939
59609A3829031L37132L29845L08356K71478K18278J49322O7731k1511j12951k01164
$$ y = [3094301, 3191525, 3298219, 3415256, 3542890, 3681027, 3829814, 3989791, 4161547, 4345477, 4541886, 4751165, 4973655, 5209328, 5457586, 5717375, 5987328, 6265578, 6549359, 6834947, 7118277, 7395705, 7664362, 7922243, 8168517, 8403806, 8630028, 8849950, 9066929, 9284592, 9505959, 9732562, 9964604, 10201768, 10443231, 10686619, 10927377, 11159451, 11376401, 11571986, 11740614, 11878122, 11982225, 12052178, 12088345, 12092476, 12068164, 12020673, 11956413, 11882570, 11806590, 11735212, 11673847, 11626979, 11598866, 11593428, 11613657, 11661612, 11738995, 11847526, 11988780, 12163806, 12372604, 12613647, 12883987, 13179942, 13497092, 13829031, 14166163, 14496008, 14804364, 15075842, 15294120, 15443442, 15511173, 15489662, 15376711, 15175547]
59599A5175547k80902l48024m00474m37923m60789m70016m67537m56044m38087
59590A1415751m15723l91127l67211l47451l34845l30657l33875l41938l52005
59581H200919l61417l67519l68149l62756l52456l38644l22121l03710k84700
59572E139447k65883k46897k27358k08084j90230j73766j57937j42914j29720
59563C396658j18543j08259r7941q7865p8662p0384o2853n6253n0782m6166m2069
59552B576881l8669l6413l5355l5070l5129l5452l6263l7754l9701m1515m2783
59541B162777m3613m4148m4031m2851m0883l8810l6744l4243l1344k8767k6840
59530A750503k4894k2177j8796j5349j2134r169o531m097j378J864N044P295Q507
$$ y = [15175547, 14894645, 14546621, 14146147, 13708224, 13247435, 12777419, 12309882, 11853838, 11415751, 11000028, 10608901, 10241690, 9894239, 9559394, 9228737, 8894862, 8552924, 8200919, 7839502, 7471983, 7103834, 6741078, 6388622, 6049978, 5727857, 5424147, 5139447, 4873564, 4626667, 4399309, 4191225, 4000995, 3827229, 3669292, 3526378, 3396658, 3278115, 3169856, 3071915, 2984050, 2905388, 2835004, 2772151, 2715898, 2665116, 2618950, 2576881, 2538212, 2501799, 2466444, 2431374, 2396245, 2360793, 2324530, 2286776, 2247075, 2205560, 2162777, 2119164, 2075016, 2030985, 1988134, 1947251, 1908441, 1871697, 1837454, 1806110, 1777343, 1750503, 1725609, 1703432, 1684636, 1669287, 1657153, 1647984, 1641453, 1637356, 1635978, 1637842, 1642886, 1650181, 1658688]
59517A658688R320J0293J1497J2815J4123J5226J5974J6477J6947J7451J8155
59506A816966J9587K2202K5722K9358L2661L5738L8679M1380M4028M7312N1751
59495B205384N7153O2971O8970P5244Q1803Q8401R4724J00567J05883J10749J15162
59484C167011J18855J21411J22636J22634J21428J18756J14418J08652J01960
59475D217761R4728Q7224P9832P2987O6688O0214N2478M2994L2703K3744J7985
59464D849338J5671J5703J7220K0318K5045L0288L4384L6542L7038L6037L2753
59453E150337K5950J4822n18j9076l9388o0275q1308j02243j22137j39492j53264
59442D473408j63233j69398j71668j70311j66072j59548j50970j40859j30259
$$ y = [1658688, 1668008, 1678301, 1689798, 1702613, 1716736, 1731962, 1747936, 1764413, 1781360, 1798811, 1816966, 1836553, 1858755, 1884477, 1913835, 1946496, 1982234, 2020913, 2062293, 2106321, 2153633, 2205384, 2262537, 2325508, 2394478, 2469722, 2551525, 2639926, 2734650, 2835217, 2941100, 3051849, 3167011, 3285866, 3407277, 3529913, 3652547, 3773975, 3892731, 4007149, 4115801, 4217761, 4312489, 4399713, 4479545, 4552532, 4619220, 4679434, 4731912, 4774906, 4807609, 4831353, 4849338, 4865009, 4880712, 4897932, 4918250, 4943295, 4973583, 5007967, 5044509, 5081547, 5117584, 5150337, 5176287, 5191109, 5190591, 5171515, 5132127, 5071852, 4990544, 4888301, 4766164, 4626672, 4473408, 4310175, 4140777, 3969109, 3798798, 3632726, 3473178, 3322208, 3181349, 3051090]
59433C051090j19869j09462r8680q7890p7715o8138n8762m9612m1023l2944k5037
59422B281958j7272r862k731M316J1094J7338K3368K9763L6491M3106M9652N6480
59410B523701O3249O9134P4208P9500Q5275R0164R2679R2716R0841Q6804P9742
59399C428013O9392N6196M0526K2734L850j4754l2530m9816o6504q1371r3161
59388C282575j01755j07795j11524j12607j11035j07693j03790r9879r5639r0554
59378B240304q4644p8483p2584o6929o1191n5251m9417m4139l9631l5731l2045
59367A620259k8143k3809j9136j4536j0537p470n284l590j907J62K820N996R377
59354A524202J2716J5954J8897K1030K2183K3323K5859K9793L3063L3449L0869
$$ y = [3051090, 2931221, 2821759, 2723079, 2635189, 2557474, 2489336, 2430574, 2380962, 2339939, 2306995, 2281958, 2264686, 2254824, 2252093, 2256409, 2267503, 2284841, 2308209, 2337972, 2374463, 2417569, 2467221, 2523701, 2586950, 2656084, 2730292, 2809792, 2895067, 2985231, 3077910, 3170626, 3261467, 3348271, 3428013, 3497405, 3553601, 3594127, 3616861, 3620711, 3605957, 3573427, 3523611, 3457107, 3375736, 3282575, 3180820, 3073025, 2961501, 2848894, 2737859, 2630166, 2526376, 2426497, 2330858, 2240304, 2155660, 2077177, 2004593, 1937664, 1876473, 1821222, 1771805, 1727666, 1688035, 1652304, 1620259, 1592116, 1568307, 1549171, 1534635, 1524098, 1516628, 1511344, 1507754, 1505847, 1506009, 1508829, 1514825, 1524202, 1536918, 1552872, 1571769, 1592799, 1614982, 1638305, 1664164, 1693957, 1727020, 1760469, 1791338]
59343A791338K7387K5283K5564K7975L1691L5996M0888M6957N4223O1319O6445
59332B235066O9112P0497P2264P5696Q1545Q9686R8921J08106J17608J28781J41840
59321C289122J55349J68191J80899J94440K08623K22441K35145K45991K53575
59312E153776K56485K54460K48241K38645K26351K12224J97033J80959J64058
59303G132232J46987J30726J15707J01685Q8185P4575N9980M3860K6506Q549r795
59292G919197k8460m6811o3806p8733r1227j00845j07357j11365j13988j15941
59282G060664j17429j18733j20260j22046j23821j25522j27166j28327j28439
59273E948921j27680j26880j26516j26326j25982j25541j25016j24146j22770
$$ y = [1791338, 1818725, 1844008, 1869572, 1897547, 1929238, 1965234, 2006122, 2053079, 2107302, 2168621, 2235066, 2304178, 2374675, 2446939, 2522635, 2604180, 2693866, 2792787, 2900893, 3018501, 3147282, 3289122, 3444471, 3612662, 3793561, 3988001, 4196624, 4419065, 4654210, 4900201, 5153776, 5410261, 5664721, 5912962, 6151607, 6377958, 6590182, 6787215, 6968174, 7132232, 7279219, 7409945, 7525652, 7627337, 7715522, 7790097, 7850077, 7893937, 7920443, 7928992, 7919197, 7890737, 7843926, 7780120, 7701387, 7610160, 7509315, 7401958, 7290593, 7176605, 7060664, 6943235, 6824502, 6704242, 6582196, 6458375, 6332853, 6205687, 6077360, 5948921, 5821241, 5694361, 5567845, 5441519, 5315537, 5189996, 5064980, 4940834, 4818064]
59264D818064j21035j18963j16250j12657j08362j03738r9079r4592r0270q5741
59254C767377q0512p4468o7926o1197n4518m8238m2621l7448l2267k7096k2345
59243C218741j8032j3545q535l531O30L783O525R540J3036J6856K0852K5023K9268
59230C300611L3192L6465L9383M2580M6007M8686M9882M9979M9721M9064M7471
59219C793041M4941M1868L8157L3460K8244K3524J9366J4629Q559J727n112j2322
59207D030082k0818l0761m1439n2089o2176p1159p8657q4834r0114r4515r7570
59196C305950r8810r8069r5351r0791q4791p8034p1179o4538n7989n1225m4169
59185B471004l7105l0295k3581j6556r135j623N785J3282K1133K9379L7990M7180
$$ y = [4818064, 4697029, 4578066, 4461816, 4349159, 4240797, 4137059, 4037980, 3943388, 3853118, 3767377, 3686865, 3612397, 3544471, 3483274, 3428756, 3380518, 3337897, 3300449, 3268182, 3241086, 3218741, 3200709, 3187164, 3178629, 3175098, 3175728, 3179511, 3186036, 3195576, 3208612, 3225468, 3246320, 3271343, 3300611, 3333803, 3370268, 3409651, 3452231, 3498238, 3546924, 3596806, 3646785, 3696506, 3745570, 3793041, 3837982, 3879850, 3918007, 3951467, 3979711, 4003235, 4022601, 4037230, 4045789, 4047516, 4042404, 4030082, 4009264, 3978503, 3937064, 3884975, 3822799, 3751640, 3672983, 3588149, 3498035, 3403520, 3305950, 3207140, 3109071, 3013720, 2922929, 2838138, 2760104, 2688925, 2624387, 2566398, 2515173, 2471004, 2433899, 2403604, 2380023, 2363467, 2354332, 2352709, 2358494, 2371776, 2392909, 2422288, 2460278, 2507458]
59173B507458N7264O8243P9446Q9552R7162J01719J04055J05963J09187J14675
59163C434724J22445J31698J41072J49104J54614J56761J54963J48949J38669
59154D732999J23921J04378Q0233N2606K3050p016l6115o2552q5165j03911j19059
59143D703369j30057j36026j37217j35018j30447j23584j14669j04883r5379q6183
59133C509906p6640o6614n6720m7543l9083l1015k3277j6271j0375n298k77M825
59121C141618R077J1554J2475J2641J2163J0583Q024N132J931k293p670j3317
59109C201918j8491k3297k7870l1802l4893l7640m0293m2109m2242m0918l9082
59098B823281l7293l5465l3335l0667k7253k3262j9283j5700j2279q724n186j907
$$ y = [2507458, 2564722, 2632965, 2712411, 2801963, 2899125, 3000844, 3104899, 3210862, 3320049, 3434724, 3557169, 3688867, 3829939, 3979043, 4133657, 4290418, 4445381, 4594330, 4732999, 4856920, 4961298, 5041531, 5094137, 5117187, 5110171, 5074056, 5011504, 4926339, 4822428, 4703369, 4573312, 4437286, 4300069, 4165051, 4034604, 3911020, 3796351, 3691468, 3596089, 3509906, 3433266, 3366652, 3309932, 3262389, 3223306, 3192291, 3169014, 3152743, 3142368, 3137070, 3136793, 3141618, 3150695, 3162249, 3174724, 3187365, 3199528, 3210111, 3218135, 3223267, 3225198, 3222905, 3215235, 3201918, 3183427, 3160130, 3132260, 3100458, 3065565, 3027925, 2987632, 2945523, 2903281, 2862363, 2823281, 2785988, 2750523, 2717188, 2686521, 2659268, 2636006, 2616723, 2601023, 2588744, 2580020, 2574834, 2572927]
59086B572927J281M613P942J1009J3858J6583J9061K1324K3866K7022L0374L3185
59074B783045L5256L6988L8755M0566M2106M2971M3027M2731M2654M2560M1469
59063C232128L8845L5260L1524K7810K3980K0192J6646J3182R713O614M261K581
59051C462736J549J529K591L934M770N323O250P443Q114P736O148K939k373r673
59037C509016j8479k8803m1025n4840o8960q1978r3103j02087j08994j14075j17394
59026B679278j18585j17336j14114j09961j05527j00708r5198q9031q2599p6412
59016A669807p0819o5687o0536n5215n0191m5852m1849l7626l3377k9882k7513
59005A151260k5868k4283k2299j9821j7205j5081j3656j2441j0971r532q637q213
$$ y = [2572927, 2574208, 2578821, 2586763, 2597772, 2611630, 2628213, 2647274, 2668598, 2692464, 2719486, 2749860, 2783045, 2818301, 2855289, 2894044, 2934610, 2976716, 3019687, 3062714, 3105445, 3148099, 3190659, 3232128, 3270973, 3306233, 3337757, 3365567, 3389547, 3409739, 3426385, 3439567, 3449280, 3455894, 3460155, 3462736, 3464285, 3465814, 3468405, 3472339, 3477109, 3482432, 3488682, 3496125, 3504239, 3511975, 3518123, 3521062, 3518689, 3509016, 3490537, 3461734, 3420709, 3365869, 3296909, 3214931, 3121828, 3019741, 2910747, 2796672, 2679278, 2560693, 2443357, 2329243, 2219282, 2113755, 2013047, 1917849, 1828818, 1746219, 1669807, 1598988, 1533301, 1472765, 1417550, 1367359, 1321507, 1279658, 1242032, 1208655, 1178773, 1151260, 1125392, 1101109, 1078810, 1058989, 1041784, 1026703, 1013047, 1000606, 989635, 980103, 971466, 963253]
58993I63253p867p597p549p390o732n910n447n004l774j879k19J087K946N670
58979I13588Q273R861J0838J1899J2717J2445J1016R167P402N791M583M232M736
58966A026548N491N913N882N533M949M158L164J857M6k265m675o495p100o375
58952A036631m874l464k643k150j341N6J620K657K828K293J301j69k205m580o806
58937A019154q580r959j1102j2003j2534j2504j1716j0278q803p988p772p295
58925H98620n809l391o91J583K902L238L417M613P047R647J1349J2343J3495J5058
58911I73421J6560J7658J8454J9063J9450J9607J9486J8948J8103J7404J7070
58900A175224J6766J6335J6311J7081J8025J8347J8373J9083K0552K1988K3214
$$ y = [963253, 955386, 947789, 940240, 932850, 926118, 920208, 914761, 909757, 905983, 904104, 903885, 904972, 907918, 913588, 921861, 931722, 942560, 954459, 967176, 979621, 990637, 999804, 1007206, 1012997, 1017580, 1021812, 1026548, 1032039, 1037952, 1043834, 1049367, 1054316, 1058474, 1061638, 1063495, 1063541, 1061276, 1056601, 1050106, 1043006, 1036631, 1031757, 1028293, 1025650, 1023500, 1022159, 1022215, 1023835, 1026492, 1029320, 1031613, 1032914, 1032745, 1030540, 1025960, 1019154, 1010574, 1000615, 989513, 977510, 964976, 952472, 940756, 930478, 921675, 913687, 905915, 898620, 892811, 889420, 888729, 890312, 893214, 896452, 899869, 904482, 911529, 921176, 932525, 944868, 958363, 973421, 989981, 1007639, 1026093, 1045156, 1064606, 1084213, 1103699, 1122647, 1140750, 1158154, 1175224, 1191990, 1208325, 1224636, 1241717, 1259742, 1278089, 1296462, 1315545, 1336097, 1358085, 1381299]
58889A381299K4954K7348K9299K9918K9818L0358L2093L4528L7119L9932M3370
58878A740036M7553N1988N5925N9143O2259O5983P0297P4779P9494Q4908R1078
58867B483443R7586J04366J11861J20309J29458J39222J49895J61497J73540J85787
58857C856964J98523K11780K24854K37125K48857K60496K71516K80533K86287
58848F076935K87971K84689K75278K58860K35237K04579J66953J22540P2431J9106
58838H004579l4142q4488j30360j71041k05769k33596k53973k67217k74428k77007
58828F072558k75986k71547k63389k51922k38772k25623k12822j99749j86414
58819C946334j73855j62868j53096j43651j34129j24708j15698j07333r9657r2395
$$ y = [1381299, 1406253, 1433601, 1462900, 1492818, 1522636, 1552994, 1585087, 1619615, 1656734, 1696666, 1740036, 1787589, 1839577, 1895502, 1954645, 2016904, 2082887, 2153184, 2227963, 2307457, 2392365, 2483443, 2581029, 2685395, 2797256, 2917565, 3047023, 3186245, 3336140, 3497637, 3671177, 3856964, 4055487, 4267267, 4492121, 4729246, 4978103, 5238599, 5510115, 5790648, 6076935, 6364906, 6649595, 6924873, 7183733, 7418970, 7623549, 7790502, 7913042, 7985473, 8004579, 7970437, 7885949, 7755589, 7584548, 7378779, 7145183, 6891210, 6623993, 6349565, 6072558, 5796572, 5525025, 5261636, 5009714, 4770942, 4545319, 4332497, 4132748, 3946334, 3772479, 3609611, 3456515, 3312864, 3178735, 3054027, 2938329, 2830996, 2731339, 2638944]
58809B638944q5219p8302p2253o7309o2951n8500n3832m9331m5475m2570m0556
58798A982646l8835l6519l3094k8784k4294k0323j7134j4334j1131p198l165J24
58786A747959K684N267Q283J1523J4907J8749K3048K7179L0629L3620L6776M0567
58774B001191M5198N0506N5821O0422O4457O8911P4482Q0947Q7839R5066J02552
58763B787392J10001J17522J25943J35730J46070J55814J65114J75303J87064
58754D105953J99533K11519K22980K34622K46312K56577K63839K67630K68126
58745F277091K64834K56360K41367K19151J89224J51321J06392N7025O120m4519
58735G724366r3715j39677j80194k13976k40914k61159k74777k82352k84996k83531
$$ y = [2638944, 2553725, 2475423, 2403170, 2335861, 2272910, 2214410, 2160578, 2111247, 2065772, 2023202, 1982646, 1943811, 1907292, 1874198, 1845414, 1821120, 1800797, 1783663, 1769329, 1758198, 1751000, 1747835, 1747959, 1750643, 1755910, 1764193, 1775716, 1790623, 1809372, 1832420, 1859599, 1890228, 1923848, 1960624, 2001191, 2046389, 2096895, 2152716, 2213138, 2277595, 2346506, 2420988, 2501935, 2589774, 2684840, 2787392, 2897393, 3014915, 3140858, 3276588, 3422658, 3578472, 3743586, 3918889, 4105953, 4305486, 4517005, 4739985, 4974607, 5220919, 5477496, 5741335, 6008965, 6277091, 6541925, 6798285, 7039652, 7258803, 7448027, 7599348, 7705740, 7762765, 7768885, 7724366, 7630651, 7490974, 7310780, 7096804, 6855890, 6594731, 6319954, 6037602, 5752606, 5469075]
58725E469075k78267k69739k58987k46963k34160k20915k07473j93776j79844
58716C378951j66335j53969j42532j31399j21010j12661j06594j01375r5665q9573
58706B157838q3747p8147p2484o7009o2018n7153n1941m6598m1649l7156l2873
58695A527063k8705k4581k0321j6049j2239q971n740k372N52K726M726P057R325
58682A432471J1021J2302J3123J2389R028L540k557q358j3708j8185k1194k3030
58670A406842k4732k6737k8467k9356k9544k9492k9630l0337l1586l2588l2535
58659A081838l1712l1113l0932l0293k8701k6892k5752k5099k4106k2580k1055
58648G83603j9828j8461j6473j4130j2250j1255j0689r853q688p782p513p622
$$ y = [5469075, 5190808, 4921069, 4662082, 4415119, 4180959, 3960044, 3752571, 3558795, 3378951, 3212616, 3058647, 2916115, 2784716, 2663706, 2551045, 2444451, 2343076, 2247411, 2157838, 2074091, 1995944, 1923460, 1856451, 1794433, 1737280, 1685339, 1638741, 1597092, 1559936, 1527063, 1498358, 1473777, 1453456, 1437407, 1425168, 1416197, 1410457, 1408085, 1408637, 1411363, 1416089, 1423146, 1432471, 1443492, 1455794, 1468917, 1481306, 1490334, 1493874, 1491317, 1482959, 1469251, 1451066, 1429872, 1406842, 1382110, 1355373, 1326906, 1297550, 1268006, 1238514, 1208884, 1178547, 1146961, 1114373, 1081838, 1050126, 1019013, 988081, 957788, 929087, 902195, 876443, 851344, 827238, 804658, 783603, 763775, 745314, 728841, 714711, 702461, 691206, 680517, 670664, 661976, 654194, 646681, 639059]
58636F39059p666p489p086o391n419m400l481k545j540o59j03J36R4j97m42k45
58620E91626L50R18J423K269L392M032L944M040N227P032Q210Q293P768P003N885
58605F61412M474L252K564K238J892J257K33j108k580m137n811p344q201q257
58591F39884p993p680o859n131l019j317J2J635L727N764P331Q500R397J0035
58577F54286J0619J1529J2929J4613J6214J7384J8021J8583J9887K2250K5123
58566H41438K7879L0536L3309L5942L8213M0678M4159M8657N3454N8059O2398
58555A314722O6293O9557P2587P6038P9785Q2790Q4047Q3077P9522P2972O3404
58544B144794N1257L6924K0750L657j2776k7269l9517m9761n8007o4004o7756
$$ y = [639059, 631393, 623904, 616818, 610427, 605008, 600608, 597127, 594582, 593042, 592383, 592280, 592416, 592510, 592313, 591871, 591626, 591976, 592894, 594317, 596586, 599978, 604010, 607954, 611994, 617221, 624253, 632463, 640756, 648524, 655527, 661412, 665886, 669138, 671702, 673940, 675832, 677089, 677322, 676214, 673634, 669497, 663686, 656342, 648141, 639884, 631891, 624211, 617352, 612221, 609202, 607885, 607897, 609532, 613259, 619023, 626354, 634854, 644251, 654286, 664905, 676434, 689363, 703976, 720190, 737574, 755595, 774178, 794065, 816315, 841438, 869317, 899853, 933162, 969104, 1007317, 1047995, 1092154, 1140811, 1194265, 1252324, 1314722, 1381015, 1450572, 1523159, 1599197, 1678982, 1761772, 1845819, 1928896, 2008418, 2081390, 2144794, 2196051, 2232975, 2253725, 2257382, 2244606, 2217337, 2177820, 2128059, 2070052, 2006048, 1938292]
58533A938292o9651p0076o9056o6414o2322n7512n2692m7846m2553l6938l1722
58522A331510k7144k2546j7501j2751r331p194n446l645k023n66J268L779O592
58509A235002R207J1461J3328J4740J5710J6167J5451J2348O127k621j2351k1742
58497A312827l0334l8003m4161m7906m9069m8616m7582m5967m3278l9869l6809
58486H41233l4482l2238k9640k7099k4882k2521j9725j7079j5121j3439j1452
58475E93555r398p783o437m994l820l497l815m069m096m177m241l974l507l223
58461E26524l030k561j921j477j115m17N49J251J511J696K159K900L664M108M052
58446E37893L822L980M520M860M871N216O292P671R038J0761J2847J4352J4800
$$ y = [1938292, 1868641, 1798565, 1729509, 1663095, 1600773, 1543261, 1490569, 1442723, 1400170, 1363232, 1331510, 1304366, 1281820, 1264319, 1251568, 1242237, 1235043, 1229597, 1225952, 1223929, 1223363, 1224631, 1228410, 1235002, 1244209, 1255670, 1268998, 1283738, 1299448, 1315615, 1331066, 1343414, 1349541, 1346920, 1334569, 1312827, 1282493, 1244490, 1200329, 1152423, 1103354, 1054738, 1007156, 961189, 917911, 878042, 841233, 806751, 774513, 744873, 717774, 692892, 670371, 650646, 633567, 618446, 605007, 593555, 584157, 576374, 569937, 564943, 561123, 557626, 553811, 549742, 545646, 541469, 537228, 533254, 529747, 526524, 523494, 520933, 519012, 517535, 516420, 516003, 516552, 517803, 519314, 521010, 523169, 526069, 529733, 533841, 537893, 541715, 545695, 550215, 555075, 559946, 565162, 571454, 579125, 588163, 598924, 611771, 626123, 640923]
58433F40923J5216J6632J8390J9110J8691J7964J6947J4895J1760Q263M716R41
58421H04448k864o358r834j3636j7054j9046j9755k0082k0069j9088j7412j6156
58409F23094j5622j5063j4094j3052j1955j0457q876p942p386o177m232k573j566
58396E04099m25J188K464K841K850L057L224L132L189L745M532N249N944O495
58382E51584O572O363O529P217P926Q485R191R826R563Q177O360M498K127r66
58368F43452l998o128p415q375r105r281q631p279n875n189n174m792l361j567
58354E57282l26P47K500M478N492N736O702Q893J1099J2201J2284J1621R988P425
58340F56122M591J879q19l273m867n632o263o904o967o285n416m658l855l190
$$ y = [640923, 656139, 672771, 691161, 710271, 728962, 746926, 763873, 778768, 790528, 798791, 803507, 804448, 801584, 795226, 785392, 771756, 754702, 735656, 715901, 695819, 675750, 656662, 639250, 623094, 607472, 592409, 578315, 565263, 553308, 542851, 533975, 526033, 518647, 512470, 508238, 505665, 504099, 503674, 504862, 507326, 510167, 513017, 516074, 519298, 522430, 525619, 529364, 533896, 539145, 545089, 551584, 558156, 564519, 571048, 578265, 586191, 594676, 603867, 613693, 623256, 631433, 637793, 642291, 644418, 643452, 639454, 633326, 625911, 617536, 608431, 599150, 590519, 583240, 577365, 572176, 567002, 562210, 558849, 557282, 556956, 557703, 560203, 564681, 570173, 575909, 582611, 591504, 602603, 614804, 627088, 638709, 648697, 656122, 660713, 662592, 661773, 658500, 653633, 648001, 641738, 634834, 627867, 621582, 616166, 611508, 607653, 604463]
58326F04463k978k744j805p21o70j320j019O01J918J736Q66N98R94J446J777K098
58310F05240K465L193M572O036O651O592O986Q142R192R651R992J0393J0354R916
58296G09375R910J0598J1327J1776J2287J2760J2596J1882J1295J0592Q722N615
58284H38735K401k34k405l757l686k880k780l294k931j366J47J176K625M486N427
58269H31664N290N757P658R727J0834J1445J2064J2324J2444J3488J5358J6538
58257I64591J6674J7253J8932K0331K0422J9918J9401J8256J6375J4760J3524
58246A160437J1569R025P594P668P708P289P905R732J0753J0458J1199J4207J7432
58233A292976J9198K0878K3831K6696K8168K9595L2296L4894L5928L6663L8742
$$ y = [604463, 601485, 598741, 596936, 596215, 595545, 594225, 593206, 593807, 595725, 597461, 598327, 598925, 599919, 601365, 603142, 605240, 607705, 610898, 615470, 621506, 628157, 634749, 641735, 649877, 659069, 668720, 678712, 689105, 699459, 709375, 719285, 729883, 741210, 752986, 765273, 778033, 790629, 802511, 813806, 824398, 833120, 838735, 841136, 840902, 838497, 834740, 831054, 828174, 825394, 822100, 819169, 817803, 817950, 819126, 821751, 826237, 831664, 836954, 842711, 850369, 860096, 870930, 882375, 894439, 906763, 919207, 932695, 948053, 964591, 981265, 998518, 1017450, 1037781, 1058203, 1078121, 1097522, 1115778, 1132153, 1146913, 1160437, 1172006, 1181031, 1188625, 1196293, 1204001, 1211290, 1219195, 1228927, 1239680, 1250138, 1261337, 1275544, 1292976, 1312174, 1333052, 1356883, 1383579, 1411747, 1441342, 1473638, 1508532, 1544460, 1581123, 1619865]
58222A619865M1341M3178M5078M8039N1020N3134N5751N9890O3743O5292O5174
58211B211505O4500O2288N7713N2548M8584M4860M0212L6201L4717L4920L5464
58200B723512L7371M1818M7332N2248N7688O5174P3487Q0849Q7888R5609J02830
58189C465806J08668J15030J23590J32866J41300J50409J61702J73525J84283
58180D757179J95756K09638K24109K37525K52129K70194K89854L08954L29423
58171G074761L53361L78426M01884M25759M53107M82757N12765N45201N82317
58162A1210338O21829O61537P04604P54449Q08525Q63098R19878R81835J047264
58153A8573357J114755J189235J276230J375406J487164J620426J787087J994754
$$ y = [1619865, 1661206, 1704384, 1749462, 1797501, 1848521, 1901655, 1957406, 2017296, 2081039, 2146331, 2211505, 2276005, 2338293, 2396006, 2448554, 2497138, 2541998, 2582210, 2618411, 2653128, 2688048, 2723512, 2760883, 2802701, 2850033, 2902281, 2959969, 3025143, 3098630, 3179479, 3267367, 3362976, 3465806, 3574474, 3689504, 3813094, 3945960, 4087260, 4237669, 4399371, 4572896, 4757179, 4952935, 5162573, 5386682, 5624207, 5876336, 6146530, 6436384, 6745338, 7074761, 7428122, 7806548, 8208432, 8634191, 9087298, 9570055, 10082820, 10628021, 11210338, 11832167, 12493704, 13198308, 13952757, 14761282, 15624380, 16544258, 17526093, 18573357, 19688112, 20877347, 22153577, 23528983, 25016147, 26636573, 28423660, 30418414]
58145C0418414K250551K561539K921977L311340L717694M154283M642989N195366
58137E9174153N822528O543456P361648Q253118R207447J0271639J1542481J3156623
58129A31333093J5299043J8067493K1082674K3172303K2700478J8584692J1200701
58122B61440477K304434n985698j2248432j6106275j7906617j8255549j7736184
58115A75506156j6796828j5712109j4597942j3472878j2322789j1140285r943078
58108H1520247q773010p674624o674468n782911n006011m344117l784409l307357
58100C6173340k899900k555093k262950k011041j792165j603421j439328j292770
58092B0316672j161019j044206r39383q42081p52031o71348n98489n29496m64022
$$ y = [30418414, 32668965, 35230504, 38152481, 41463821, 45181515, 49335798, 53978787, 59174153, 64996681, 71540137, 78901785, 87154903, 96362350, 106633989, 118176470, 131333093, 146632136, 164699629, 185782303, 208954606, 231655084, 250239776, 261440477, 263744911, 257759213, 245510781, 229404506, 211497889, 193242340, 175506156, 158709328, 142997219, 128399277, 114926399, 102603610, 91463325, 81520247, 72747237, 65072613, 58398145, 52615234, 47609223, 43265106, 39480697, 36173340, 33273440, 30718347, 28455397, 26444356, 24652191, 23048770, 21609442, 20316672, 19155653, 18111447, 17172064, 16329983, 15577952, 14906604, 14308115, 13778619, 13314597]
58083A3314597m04556l50638k98847k47790j98317j49446r8968m8059n55M3291
58073A1560712Q8871J42134K05173K77409L58326M47864N46032O53689P72631
58064A5052841R03399J043213J188282J341077J517206J746132K065960K512425
58056B7370535L090674L722306M202722M242098L617128K341235P02004q86659
58048D8402043k103829k844978l188633l280296l239050l129704k978690k796601
58040B4840262k589386k361271k118048j870933j634300j417984j224098j052254
58032A0571988r04169p80915o79374n94914n25260m68967m22819l84023l52696
58023E458851l28798l08625k87789k65873k44837k24575k03670j83111j65490
$$ y = [13314597, 12910041, 12559403, 12260556, 12012766, 11814449, 11665003, 11566035, 11517976, 11517421, 11560712, 11649583, 11791717, 11996890, 12274299, 12632625, 13080489, 13626521, 14280210, 15052841, 15956240, 16999453, 18187735, 19528812, 21046018, 22792150, 24858110, 27370535, 30461209, 34183515, 38386237, 42628335, 46245463, 48586698, 49288702, 48402043, 46298214, 43453236, 40264603, 36984307, 33745257, 30615553, 27636863, 24840262, 22250876, 19889605, 17771557, 15900624, 14266324, 12848340, 11624242, 10571988, 9667819, 8886904, 8207530, 7612616, 7087356, 6618389, 6195570, 5811547, 5458851, 5130053, 4821428, 4533639, 4267766, 4022929, 3798354, 3594684, 3411573, 3246083]
58014C246083j51328j39477j30229j24694j21633j18146j13216j07920j02593
58005B136847r6463q9693q3287p7245p1065o5508o1564n8327n4223m9800m6819
57994A382853m5161m3051m0053l7435l5710l3988l1738k9390k7284k5612k4963
57983A008468k5366k5470k4235k2686k2207k2107k0823j8649j7083j6188j4846
57972G78808j3126j2184j2178j2263j2295j2732j3198j2986j2440j2171j1525
57961F41710r702p653o863o883o147m601l433k749j663k89N51J185K539M081M525
57946F04608M231M758O266P518Q284R434J0710J0618Q721O062L204k41m016p121
57932F73036r420j1653j3711j4669j4493j4039j3423j2127j0628j0020j0072r510
$$ y = [3246083, 3094755, 2955278, 2825049, 2700355, 2578722, 2460576, 2347360, 2239440, 2136847, 2040384, 1950691, 1867404, 1790159, 1719094, 1653586, 1592022, 1533695, 1479472, 1429672, 1382853, 1337692, 1294641, 1254588, 1217153, 1181443, 1147455, 1115717, 1086327, 1059043, 1033431, 1008468, 983102, 957632, 933397, 910711, 888504, 866397, 845574, 826925, 809842, 793654, 778808, 765682, 753498, 741320, 729057, 716762, 704030, 690832, 677846, 665406, 653235, 641710, 632008, 624355, 617492, 610609, 604462, 599861, 596428, 593679, 592016, 591727, 592278, 593463, 596002, 600083, 604608, 608839, 613597, 619863, 627381, 635665, 645099, 655809, 666427, 675148, 681210, 684414, 684173, 680157, 673036, 663616, 651963, 638252, 623583, 609090, 595051, 581628, 569501, 558873, 548853, 538781, 529271]
57920E29271q199p203o739o000n006m617m649m026k933k717l411l413k093p20
57906D67545k64k29j79n52j298j383m49N52R27J001Q72m4j706l128l859m434m976
57889D48396m892m291m159m670m893m538m386m559m062k622j254l51J002L017
57875D07738M258L776K664K287K363J984J421J566K361K931K831K265J520Q20
57861D40785K90k24q69j230r04n49j271k882l978m044m178n219o513p063o889
57846C95262o531o224o031n987n755m994m271m542n514n737m619l103k049j290
57832C28615o49m95p22n84j11k75j141j305m7J485K111K311K993L796L904L535
57816C43421L403L430L106K478J842J046q2j165j856k378k885k992k529j979j721
$$ y = [529271, 521072, 513869, 507130, 501130, 496124, 491507, 486858, 482832, 479899, 477182, 473771, 470358, 468265, 467545, 467281, 467052, 466873, 466321, 465023, 463640, 463191, 463743, 464670, 465671, 466543, 466499, 464793, 461665, 457806, 453372, 448396, 443504, 439213, 435054, 430384, 425491, 420953, 416567, 412008, 407946, 405324, 404070, 403719, 404721, 407738, 411996, 415772, 418436, 420723, 423086, 425070, 426491, 428057, 430418, 433349, 436180, 438445, 439965, 440785, 441075, 440851, 439982, 438752, 437848, 437299, 436028, 433146, 429168, 425124, 420946, 415727, 409214, 402151, 395262, 388731, 382507, 376476, 370489, 364734, 359740, 355469, 350927, 345413, 339676, 335057, 331954, 329905, 328615, 327966, 327471, 326749, 326165, 326054, 325779, 324638, 323333, 323286, 324771, 326882, 329193, 332186, 335982, 339886, 343421, 346824, 350254, 353360, 355838, 357680, 358726, 358644, 357479, 355623, 353245, 350360, 347368, 344839, 342860, 341139]
57801C41139j584j613k176k851k449q04O56R80J029J768K604K676K601L402M649
57786C50027N255N360N814O410O257N550N254N182M087J749m63j495j786k145
57772C95056k623l053l746m914n971o160n554m916m701m640m318l807l529l553
57758C33571l403k684j640p81k29J31J05n21j284j349o27J34M07K93j69j251k769
57741C17934l968m468m669m845m692m182l939m249m431l786k563j418o13k38m80
57726B69393j090j245n28N46J473K401L315L495K640J774K030L092L799L861M007
57711B98963M697N586O217O472O446O351O460O716O673O071N173M201K941J317
57697C74284j79j154j857k624l254l547l890m648n465n763n513m927l960k774
$$ y = [341139, 339555, 337942, 335766, 332915, 330466, 329662, 330318, 331298, 332327, 334095, 336699, 339375, 341976, 345378, 350027, 355282, 360642, 366456, 372866, 379123, 384673, 389927, 395109, 399196, 400945, 400482, 398987, 397201, 395056, 392433, 389380, 385634, 380720, 374749, 368589, 363035, 358119, 353418, 348778, 344460, 340653, 337124, 333571, 330168, 327484, 325844, 325063, 324834, 324965, 325070, 324549, 323265, 321916, 321289, 321423, 321830, 322123, 321954, 320703, 317934, 313966, 309498, 304829, 299984, 295292, 291110, 287171, 282922, 278491, 274705, 272142, 270724, 270111, 269873, 269393, 268303, 267058, 266530, 267076, 268549, 270950, 274265, 277760, 280400, 282174, 284204, 287296, 291095, 294956, 298963, 303660, 309246, 315463, 321935, 328381, 334732, 341192, 347908, 354581, 360652, 365825, 370026, 372967, 374284, 374105, 372951, 371094, 368470, 365216, 361669, 357779, 353131, 347666, 341903, 336390, 331463, 327503, 324729]
57683C24729k106k383k883k633j805j382j696k050j738p41N36J627K179K184K002
57668C13840J882J751J695K167L281M383M842M805M707M603M473M701N494O329
57654C68953O617O561O696O990P136P345Q047R104J0010J0609J0992J1006J0677
57641D80743J0762J2054J4259J6350J7906J9331K0897K2403K3800K5405K7333
57630F91243K9311L1217L3311L5791L8435M0975M3542M6730N1079N6465O1958
57619A160057O6687P0787P5020P9474Q3290Q5719Q6571Q5350Q1069P3552O4057
57608B011633N3910M3470L3300K5214K0681J8493J5252Q001m438k1924m3085o4830
57596B095677q3219r5620j01732j02726j00092r5234q9064q1747p3302o4481n6415
$$ y = [324729, 322623, 320240, 317357, 314724, 312919, 311537, 309841, 307791, 306053, 305312, 305848, 307475, 309654, 311838, 313840, 315722, 317473, 319168, 321335, 324616, 328999, 333841, 338646, 343353, 347956, 352429, 357130, 362624, 368953, 375570, 382131, 388827, 395817, 402953, 410298, 418345, 427449, 437459, 448068, 459060, 470066, 480743, 491505, 503559, 517818, 534168, 552074, 571405, 592302, 614705, 638505, 663910, 691243, 720554, 751771, 785082, 820873, 859308, 900283, 943825, 990555, 1041634, 1098099, 1160057, 1226744, 1297531, 1372551, 1452025, 1535315, 1621034, 1707605, 1792955, 1874024, 1947576, 2011633, 2065543, 2109013, 2142313, 2167527, 2188208, 2206701, 2221953, 2229954, 2225516, 2203592, 2160507, 2095677, 2012458, 1916838, 1815106, 1712380, 1612288, 1517054, 1427990, 1346243, 1272941, 1208460, 1152045]
57585A152045m9482m3163l7008l1097k5662k0892j7008j3898j0807p124l385o49
57573H91870J082L020O060R800J3312J6172J8577K1029K4125K8183L2793L7023
57561A103046M0275M2801M5491M9063N3264N6668N7850N6946N5378N3555M9787
57550A664124M2315L1660J9748P349o144k0518l3923m4674n2685n8707o3096o5859
57538A419590o7150o7089o5614o2915n9673n6501n3453n0336m7146m4035m1041
57527H04637l7952l4441l0479k6773k4302k3038k1686j9345j6880j5771j5944
57516E38026j5798j4366j2364j0931j0273r823r074p938o762o094o044n968n261
57503D17330m259l671l363k617j342q6J061K485L882M321L769L447M111N014N278
$$ y = [1152045, 1102563, 1059400, 1022392, 991295, 965633, 944741, 927733, 913835, 903028, 895904, 892519, 891870, 892952, 895972, 902032, 911832, 925144, 941316, 959893, 980922, 1005047, 1033230, 1066023, 1103046, 1143321, 1186122, 1231613, 1280676, 1333940, 1390608, 1448458, 1505404, 1560782, 1614337, 1664124, 1706439, 1738099, 1757847, 1765196, 1759052, 1738534, 1704611, 1659937, 1607252, 1548545, 1485449, 1419590, 1352440, 1285351, 1219737, 1156822, 1097149, 1040648, 987195, 936859, 889713, 845678, 804637, 766685, 732244, 701765, 674992, 650690, 627652, 605966, 586621, 569741, 553970, 538026, 522228, 507862, 495498, 484567, 474294, 464471, 455397, 447459, 440697, 434603, 428559, 422591, 417330, 413071, 409400, 406037, 403420, 402078, 401992, 403053, 405538, 409420, 413741, 417510, 420957, 425068, 430082, 435360]
57488D35360N386O418Q315R860J0239R938R997J0819J1914J2669J3223J4293J6144
57475E74575J8152J9686K1002K2668K4544K6085K7403K9120L1285L3344L5151
57464H63015L7097L9196M0952M2276M3559M4543M4018M1045L5804K8841K0276
57453A280622J0190p54j1598k1589l0227l7245m2799m7114m9866n0461m9132m7052
57441I02975m5127m3239m0871l7763l3862k9362k5066k1946j9974j8080j5563
57430E72122j2824j0361p955n405l263k124j704j261n07M52J568K785L866M824
57416E40213O169Q272J0841J3364J5716J7970K0043K1948K4001K6415K8980L1481
57404G65413L3997L6560L8874M0750M2241M3183M3028M1435L8412L3656K6495
$$ y = [435360, 440746, 447164, 455479, 465339, 475578, 485516, 495513, 506332, 518246, 530915, 544138, 558431, 574575, 592727, 612413, 633415, 656083, 680627, 706712, 734115, 763235, 794520, 827864, 863015, 900112, 939308, 980260, 1022536, 1066095, 1110638, 1154656, 1195701, 1231505, 1260346, 1280622, 1290812, 1290058, 1278460, 1256871, 1226644, 1189399, 1146600, 1099486, 1049620, 999159, 950027, 902975, 857848, 814609, 773738, 735975, 702113, 672751, 647685, 625739, 605765, 587685, 572122, 559298, 548937, 540982, 535577, 532314, 530190, 528486, 527225, 526718, 527170, 528738, 531523, 535389, 540213, 546382, 554654, 565495, 578859, 594575, 612545, 632588, 654536, 678537, 704952, 733932, 765413, 799410, 835970, 874844, 915594, 957835, 1001018, 1044046, 1085481, 1123893, 1157549, 1184044]
57393A184044J7038O621l457j3138k2825l2050l9690m5259m9130n1722n3085n3207
57381H44140n2138m9895m6685m3123l9789l6780l3965l1470k9456k7656k5608
57370D27575k3251k0908j8817j7036j5595j4407j3231j1946j0749r791q883p851
57358B55110o800n822m840m043l958m606n086m629l728l487m013m256l487k199
57344A94156j399j457j963k288k055j294l06O33J507K335K837K552J391p9j024
57329A93546j002k68M75O91L99M6rJ55J56l60j378k408k771k213j207n57p30j595
57311A80970k621l152k858k191k058k705l292l105k681l015l985m486m053l291
57297A37477k682j954r73k73k21m41m92n05o41o17k46Q8J04J53O42J361J867K108
$$ y = [1184044, 1201082, 1207703, 1204246, 1191108, 1168283, 1136233, 1096543, 1051284, 1002154, 950432, 897347, 844140, 792002, 742107, 695422, 652299, 612510, 575730, 541765, 510295, 480839, 453183, 427575, 404324, 383416, 364599, 347563, 331968, 317561, 304330, 292384, 281635, 271844, 262961, 255110, 248310, 242488, 237648, 233605, 229647, 225041, 219955, 215326, 211598, 208111, 204098, 199842, 196355, 194156, 192757, 191300, 189337, 187049, 184994, 183700, 183394, 184027, 185534, 187869, 190706, 193258, 194649, 194570, 193546, 192544, 192276, 192751, 193442, 193841, 193887, 193878, 194033, 194189, 193829, 192451, 190043, 187272, 185059, 183852, 183295, 182565, 180970, 178349, 175197, 172339, 170148, 168090, 165385, 162093, 158988, 156307, 153292, 149307, 144821, 140768, 137477, 134795, 132841, 131868, 131595, 131374, 130933, 130441, 129936, 129295, 128678, 128432, 128520, 128624, 128777, 129419, 130780, 132647, 134755]
57279A34755K147J776J012M85P48J479J939J986K029K270K529K731L009L287L151
57264A65333K275Q81j83k9J368K845L156K418J924K435L339L807L952M356N091
57249B02968N802O317O576O385N851N626O080O513N978M648L792M263N582O559
57235B82940O497N740N266N672O557P049P005P214Q244R614J0570J1134J1889
57222C85391J3068J4427J5767J6974J7638J7246J5856J4133J2643J1381J0056
57211E44580Q601P259O224N272L789J343j762m627o528p364p437p072o518n964
57197E29796n492n080m641l971k918j771j190j352j457n96J101K735L788M455
57183E13407M984N425N943O749P726Q648R537J0317J0536J0188J0314J1760J3695
$$ y = [134755, 136902, 138678, 139690, 140175, 140923, 142402, 144341, 146327, 148356, 150626, 153155, 155886, 158895, 162182, 165333, 167608, 168489, 168306, 168277, 169645, 172490, 175646, 178064, 179988, 182423, 185762, 189569, 193521, 197877, 202968, 208770, 215087, 221663, 228048, 233899, 239525, 245605, 252118, 258096, 262744, 266536, 270799, 276381, 282940, 289437, 295177, 300443, 306115, 312672, 319721, 326726, 333940, 342184, 351798, 362368, 373502, 385391, 398459, 412886, 428653, 445627, 463265, 480511, 496367, 510500, 523143, 534524, 544580, 553181, 560440, 566664, 571936, 575725, 577068, 575306, 570679, 564151, 556787, 549350, 542278, 535760, 529796, 524304, 519224, 514583, 510612, 507694, 505923, 504733, 503381, 501924, 501328, 502429, 505164, 508952, 513407, 518391, 523816, 529759, 536508, 544234, 552882, 562419, 572736, 583272, 593460, 603774, 615534, 629229]
57170F29229J4587J4336J4147J4440J4474J4071J4114J4913J5600J5706J5974
57159G91591J6982J8206J9174K0294K1822K3119K3678K3962K4527K5239K5867
57148A034461K6521K7062K7130K7192K8268L0182L1442L1475L1446L2169L2760
57137A360108L2400L1825L1837L1673L0384K8675K7974K8518K9662L1140L2751
57126A696947L3632L3200L2218L1778L1846L1765L1418L0898K9891K8384K7242
57115B039219K7124K7666K8489K9943L1925L3155L2829L1891L1642L2105L2863
57104B378851L4225L6352L8400L9841M1490M3945M6207M7120M7009M6507M5038
57093B844985M1961L7949L3801K9109K3574J8235J3828R286L487k874q776j4720
$$ y = [629229, 643816, 658152, 672299, 686739, 701213, 715284, 729398, 744311, 759911, 775617, 791591, 808573, 826779, 845953, 866247, 888069, 911188, 934866, 958828, 983355, 1008594, 1034461, 1060982, 1088044, 1115174, 1142366, 1170634, 1200816, 1232258, 1263733, 1295179, 1327348, 1360108, 1392508, 1424333, 1456170, 1487843, 1518227, 1546902, 1574876, 1603394, 1633056, 1664196, 1696947, 1730579, 1763779, 1795997, 1827775, 1859621, 1891386, 1922804, 1953702, 1983593, 2011977, 2039219, 2066343, 2094009, 2122498, 2152441, 2184366, 2217521, 2250350, 2282241, 2313883, 2345988, 2378851, 2413076, 2449428, 2487828, 2527669, 2569159, 2613104, 2659311, 2706431, 2753440, 2799947, 2844985, 2886946, 2924895, 2958696, 2987805, 3011379, 3029614, 3043442, 3052728, 3056215, 3053341, 3044565, 3029845]
57081C029845k1341k7880l4022m1401n1069o1058o8915p5223q2025q9199r5170
57070B382542j00002j05056j10467j15697j21774j30486j42109j56058j72710
57061A228183j92411k13928k36178k60034C9365b74265l41555l72562m09232m50776
57051a848390m95650n45189o01343o63529p31621q09547r01656j008008j127361
57042h732294j262346j418031j599617j816813k085898k421001k827406l310197
57034b5473603l884211m566876n365948o281609p310896q438244r636209j0898473
57026h1856069j2253958j3693214j5053243j6004902j6194037j5407228j3619452
57019a84082103j0945731p610792l951085l60674K839302N501934P637463R319569
$$ y = [3029845, 3008504, 2980624, 2946602, 2905201, 2854132, 2793074, 2724159, 2648936, 2566911, 2477712, 2382542, 2282540, 2177484, 2067017, 1951320, 1829546, 1699060, 1556951, 1400893, 1228183, 1035772, 821844, 585666, 325632, 39365, -274265, -615820, -988382, -1397614, -1848390, -2344040, -2889229, -3490572, -4154101, -4885722, -5695269, -6596925, -7604933, -8732294, -9994640, -11412671, -13012288, -14829101, -16914999, -19336000, -22163406, -25473603, -29357814, -33924690, -39290638, -45572247, -52883143, -61321387, -70957596, -81856069, -94110027, -107803241, -122856484, -138861386, -155055423, -170462651, -184082103, -195027834, -202638626, -206589711, -206950385, -204111083, -198609149, -190971686, -181652117]
57011a81652117J0615419J1573814J2234854J2630457J2780467J2695313J2384598
57004i6737195J1866900J1175188J0352365R440917Q479011P504947O557613N668068
56996b5692186M854391M126864L492989K953750K499870K117174J794057J521778
56988b331313a039596E7364R34358Q01281O92173O00582N22391M54649L94033
56979D456831L39415K93217K56808K26495J97232J68392J42833J21858J04192
56970F307273Q8526P4097N9747M5101L1835K1469J2815L646o215j5574k4340l3124
56958F565256m1379m8281n4600o1636o9064p5779q2156q9521r7991j06593j14972
56947E723284j23443j32014j40770j50584j62061j74561j87351k00497k13154
$$ y = [-181652117, -171036698, -159462884, -147228030, -134597573, -121817106, -109121793, -96737195, -84870295, -73695107, -63342742, -53901825, -45422814, -37917867, -31360254, -25692186, -20837795, -16710931, -13217942, -10264192, -7764322, -5647148, -3853091, -2331313, -1039596, 57364, 991722, 1793003, 2485176, 3085758, 3608149, 4062798, 4456831, 4796246, 5089463, 5346271, 5572766, 5769998, 5938390, 6081223, 6203081, 6307273, 6395799, 6469896, 6529643, 6574744, 6606579, 6628048, 6640863, 6644509, 6638294, 6622720, 6598380, 6565256, 6523877, 6475596, 6420996, 6359360, 6290296, 6214517, 6132361, 6042840, 5944849, 5838256, 5723284, 5599841, 5467827, 5327057, 5176473, 5014412, 4839851, 4652500, 4452003, 4238849]
56938D238849k22235k24646k20158k10744j98173j83763j69264j55923j43318
56929B510625j30716j18805j08575r9475r0440q1928p5101o9704o4441n8842n3140
56918A559458m7069m0485l4372k9416k4387j7829j0395l380M168J4129K5654L6177
56906A432253M6820O3885R3077J33017J74456K03954K08438J80382J22923N0466
56896B709671j8227p0075j02750j21720j33437j40977j44592j44433j41509j36452
56886A555499j28915j18947j07961r7462q7497p7411o7504n8832n1671m5249l9038
56875F75012l3443k9151k6355k4528k2701k0288j7986j7283j8618k0762k2470
56864D21427k3836k5228k5982k5362k3991k3074k2585k1595k0007j8622j7732
$$ y = [4238849, 4016614, 3791968, 3571810, 3361066, 3162893, 2979130, 2809866, 2653943, 2510625, 2379909, 2261104, 2152529, 2053054, 1962614, 1880686, 1805585, 1735881, 1671440, 1612598, 1559458, 1512389, 1471904, 1437532, 1408116, 1383729, 1365900, 1355505, 1352125, 1356293, 1370422, 1396076, 1432253, 1479073, 1542958, 1636035, 1769052, 1943508, 2147462, 2355900, 2536282, 2659205, 2709671, 2691444, 2621369, 2518619, 2396899, 2263462, 2122485, 1977893, 1833460, 1691951, 1555499, 1426584, 1307637, 1199676, 1102214, 1014717, 937306, 869802, 810970, 759299, 714050, 675012, 641569, 612418, 586063, 561535, 538834, 518546, 500560, 483277, 464659, 443897, 421427, 397591, 372363, 346381, 321019, 297028, 273954, 251369, 229774, 209767, 191145, 173413]
56853A73413j6818j5567j4142j2582j0880r517q946q703p939o619n350m300l246
56840D8804k396k088j840p94J005K731M119N735P936J0382J2636J4504J5980J7421
56826A34135J9326K1277K1621J9202J4913J0535O639K831n14k432l049l519m171
56813B36794m135k941j167O85K756N018P122R231J1875J4802J7228J9422K2649
56800C39339K7027L0672L1530K9091K3824J6214P147j658q634j3283j5667j5761
56788D49841j3904j1210q678o256l302L71M468Q799J3411J8259K3179K8201L3800
56775E36979M0762M9324N7767O2179N8626M6187K7615P161j1759k7099l7774m3505
56763G66463m4807m2736l8725l4296l0254k6197k1407j6083j0983o086o17N519
$$ y = [173413, 156595, 141028, 126886, 114304, 103424, 93907, 84961, 76258, 68319, 61700, 56350, 52050, 48804, 46408, 44320, 42480, 41686, 42691, 45422, 49541, 55276, 63212, 73594, 86230, 100734, 116714, 134135, 153461, 174738, 196359, 215561, 230474, 241009, 247648, 250479, 249965, 247533, 244484, 240965, 236794, 232659, 229718, 228551, 229236, 231992, 237010, 244132, 253363, 265238, 280040, 297268, 316690, 339339, 366366, 397038, 428568, 457659, 481483, 497697, 504844, 503186, 494552, 481269, 465602, 449841, 435937, 424727, 416049, 409793, 406491, 406862, 411330, 420129, 433540, 451799, 474978, 503179, 536979, 577741, 627065, 684832, 747011, 805637, 851824, 879439, 886600, 874841, 847742, 809968, 766463, 721656, 678920, 640195, 605899, 575645, 549448, 528041, 511958, 500975, 494889, 494272, 499791]
56751D99791J1530J7287K3936L2164M0387M5300M3879L4950J9747J600j5460k8633
56739G26478l7110m1302m2003m0300l7359l3830k9885k5969k2705j9887j6490
56728C79638j2151p798m285j173K459O745J1173J5322J8478J9050J5540Q200r61
56715D50237r803j7219k2815k6320k7705k7463k6342k4806k2962k0944j9153j7849
56703A86856j6636j4783j2253r978q762q210p388o169n210m758m286l455k586
56690H2382j992j499j004q43j263j953k426k515k243j687j145j028j380j848k260
56675E7296k713l039k816k128j721k020k544k613k142j443p31k08j89o84j187
56660C1118j265r98o05j5Q00J439J442P85j48r21j182q71m32l96o25m59K41P73
$$ y = [499791, 511321, 528608, 552544, 584708, 625095, 670395, 714274, 749224, 768971, 770571, 755111, 726478, 689368, 648066, 606063, 565763, 528404, 494574, 464689, 438720, 416015, 396128, 379638, 367487, 359689, 355404, 354231, 356690, 363435, 374608, 389930, 408408, 427458, 442998, 451198, 450237, 440434, 423215, 400400, 374080, 346375, 318912, 292570, 267764, 244802, 223858, 204705, 186856, 170220, 155437, 143184, 133206, 124444, 116234, 108846, 102677, 97467, 92709, 88423, 84968, 82382, 80390, 78891, 77887, 77044, 75781, 73828, 71402, 68887, 66644, 64957, 63812, 62784, 61404, 59556, 57296, 54583, 51544, 48728, 46600, 44879, 42859, 40315, 37702, 35560, 34117, 33386, 33178, 32989, 32305, 31118, 29853, 28855, 28250, 28235, 29035, 30474, 31916, 32701, 32553, 31632, 30450, 29579, 29147, 28751, 28126, 27667, 27908, 28681]
56642B8681O20J70k6n2k20l24L7P09J158J181R89Q19Q53J272J994K566K717K702
56624D5846K790K718K175J539J480J974K302K074J727J849K402K782K458J443
56610G5559K01p84j344j582j621j596j751k224k667k510j798j320j640k381k853
56595D9689l054l576m564n400n519n163n026n338n630I98c869m532m621m805m677
56580b2504m140l307k393j785j802k125j918q67L55J073J468J955K288K059J722
56565b9921K071K936L381L176L034L331L583L425a823A156K524J705J141J321
56551G847J897K277K277J851Q81k96p71q8J058J633J389Q06L51K24M28P41R27
56534B3432J195J989L125L718L364K721K555K713K616K239K034K173K428K548
$$ y = [28681, 29301, 29471, 29445, 29393, 29173, 28849, 28886, 29595, 30753, 31934, 32923, 33742, 34595, 35867, 37861, 40427, 43144, 45846, 48636, 51354, 53529, 55068, 56548, 58522, 60824, 62898, 64625, 66474, 68876, 71658, 74116, 75559, 75760, 74976, 73632, 72050, 70429, 68833, 67082, 64858, 62191, 59681, 57883, 56563, 54923, 52542, 49689, 46635, 43059, 38495, 33095, 27576, 22413, 17387, 12049, 6419, 998, -3869, -8401, -13022, -17827, -22504, -26644, -29951, -32344, -34129, -35931, -38056, -39974, -40841, -40486, -39413, -37945, -35990, -33702, -31643, -29921, -27850, -24914, -21533, -18357, -15323, -11992, -8409, -4984, -1823, 1156, 3680, 5385, 6526, 7847, 9744, 12021, 14298, 16149, 17030, 16734, 15963, 15875, 16933, 18566, 19955, 20761, 21112, 21336, 21764, 22505, 23432, 24627, 26616, 29741, 33459, 36823, 39544, 42099, 44812, 47428, 49667, 51701, 53874, 56302, 58850]
56520E8850K389J987J693J980K802L532L691L400K983K665K703L172L482K874
56506I8203J697J270K091L111L308L080L332M057M677N187N905O648O996P049
56492A56611P111P030O627O355O676P175P114O603O315O287N937N093M154L272
56478B42360K215J072L56K49L29J43m06j221k127k830l213l536m041m543m769
56463B20038m809m845m782m623m776n452o147o375o509p093p678p324o052m898
56449A38675m476m351l994l558l457l724m120m436m558m470m247l842l051j997
56435H4394j331j500j999j965j313o86m00j40L25P02O37J84l05m41J6R25J804
56418G8907K279K398K297J912J371J184J564J986J991J969K484L169L231K678
$$ y = [58850, 61239, 63226, 64919, 66899, 69701, 73233, 76924, 80324, 83307, 85972, 88675, 91847, 95329, 98203, 99900, 101170, 103261, 106372, 109680, 112760, 116092, 120149, 124826, 130013, 135918, 142566, 149562, 156611, 163722, 170752, 177379, 183734, 190410, 197585, 204699, 211302, 217617, 223904, 229841, 234934, 239088, 242360, 244575, 245647, 246003, 246252, 246581, 246724, 246318, 245097, 242970, 240140, 236927, 233391, 229350, 224807, 220038, 215229, 210384, 205602, 200979, 196203, 190751, 184604, 178229, 171720, 164627, 156949, 149625, 143573, 138675, 134199, 129848, 125854, 122296, 118839, 115115, 110995, 106559, 102001, 97531, 93284, 89442, 86391, 84394, 83063, 81563, 79564, 77599, 76286, 75600, 75200, 75060, 75385, 76087, 76724, 76908, 76603, 76162, 76178, 77103, 78907, 81186, 83584, 85881, 87793, 89164, 90348, 91912, 93898, 95889, 97858, 100342, 103511, 106742, 109420]
56404A09420K234K155K085K020K422L248L739L517L108L057L179L006K498J911
56390A47599J447J272J655K780M486O166O864N852L578J705J618K971M326M996
56376A97315N460N969N848M622L050K299K508K775K446J789J354J030K60j004
56362B35721j928j793r67m79p50j371k012k749l398l453l090l223m076m606m143
56347A97683l574l932m619m394l450l026l315l259k486j886k014k225j910j532
56333A56061j796k554l121l162k789k250j761j405r69k51N65J162J604K023K049
56318A43406J252R6m30j46J18j45m09MR44J753K064J996J857J842J880J786J695
56301A59563K003K659K966K503J809J554J548J283R13Q30P75L13j59K6O21Q48
$$ y = [109420, 111654, 113809, 115894, 117914, 120336, 123584, 127323, 130840, 133948, 137005, 140184, 143190, 145688, 147599, 149046, 150318, 151973, 154753, 159239, 165405, 172269, 178121, 181699, 183404, 185022, 187993, 192319, 197315, 202775, 208744, 214592, 219214, 222264, 224563, 227071, 229846, 232292, 234081, 235435, 236465, 236725, 235721, 233793, 232000, 231033, 230554, 229804, 228433, 226421, 223672, 220274, 216821, 213731, 210508, 206432, 201826, 197683, 194109, 190177, 185558, 181164, 177714, 174688, 171373, 168114, 165628, 163742, 161728, 159503, 157593, 156061, 154265, 151711, 148590, 145428, 142639, 140389, 138628, 137223, 136254, 136003, 136568, 137730, 139334, 141357, 143406, 144658, 144754, 144324, 144178, 144296, 144151, 143742, 143746, 144690, 146443, 148507, 150503, 152360, 154202, 156082, 157868, 159563, 161566, 164225, 167191, 169694, 171503, 173057, 174605, 175888, 176801, 177631, 178406, 178719, 178560, 178586, 179207, 180055]
56285A80055O97O89P31M29K25Q24J653J462L84j10N08J229J429J703K333K553
56269A96794K035J674K099K728L032L484M407N070M970M844N448O314O713O958
56255B56570P617Q258Q101P279O538O115N873N944O404O700O298N512M989M739
56241C46937M334L663K878K007J193Q76J150J374R44N1q19j600k318k629k257
56226C55784j491p37l5N77P41L91R9L42R37J615K523L611M333M497M821N896P229
56209C91133Q038Q406Q910R672J0516J1581J2969J4242J5031J5792J7235J9304
56197E42829K1381K3161K4808K6511K8470L0945L3764L6153L7586L8371L8946
56186H82925L9158L8810L8325L8052L7338L5174L1500K7169K2807J8414J3914
$$ y = [180055, 180752, 181441, 182172, 182601, 182826, 183650, 185303, 186765, 187149, 187039, 187547, 188776, 190205, 191908, 194241, 196794, 198829, 200503, 202602, 205330, 208362, 211846, 216253, 221323, 226293, 231137, 236585, 242899, 249612, 256570, 264187, 272445, 280546, 287825, 294363, 300478, 306351, 312295, 318699, 325399, 331697, 337209, 342198, 346937, 351271, 354934, 357812, 359819, 361012, 361888, 363038, 364412, 365356, 365407, 364588, 362988, 360670, 358041, 355784, 354293, 353556, 353521, 354098, 354839, 355230, 355329, 355671, 356608, 358223, 360746, 364357, 368690, 373187, 378008, 383904, 391133, 399171, 407577, 416487, 426159, 436675, 448256, 461225, 475467, 490498, 506290, 523525, 542829, 564210, 587371, 612179, 638690, 667160, 698105, 731869, 768022, 805608, 843979, 882925, 922083, 960893, 999218, 1037270, 1074608, 1109782, 1141282, 1168451, 1191258, 1209672, 1223586]
56175A223586R435N159J316j692l644m834n802o903q186r396r932r389q309p833
56161A163576q351r120r487r749j0486j1828j3795j6519j9578k1878k2893k3339
56149I86553k4037k4848k5271k5399k5490k5333k4773k4230k3948k3357k1996
56138G17871k0368j9080j7776j5822j3605j2120j1532j1053j0036q571p129o121
56126E64658n585n060m113l145l002l625l966l570l150l141k885j886p70q8O51
56111E21323J774K480K226J963K670L626L612L056L312M409N112M891M357L859
56097E68670L138K292J900K072K432K902L702M692N568O431P427Q169Q422Q824
56083F36641R990J1367J2048J2341J3335J5182J7008J8381J9762K1488K3299K5027
$$ y = [1223586, 1233021, 1238180, 1239496, 1237804, 1234160, 1229326, 1223524, 1216621, 1208435, 1199039, 1189107, 1179718, 1171409, 1163576, 1155225, 1146105, 1136618, 1126869, 1116383, 1104555, 1090760, 1074241, 1054663, 1032785, 1009892, 986553, 962516, 937668, 912397, 886998, 861508, 836175, 811402, 787172, 763224, 739867, 717871, 697503, 678423, 660647, 644825, 631220, 619100, 607568, 596515, 586479, 577908, 570779, 564658, 559073, 554013, 549900, 546755, 543753, 540128, 536162, 532592, 529442, 526301, 523416, 521530, 520760, 520672, 521323, 523097, 525577, 527803, 529766, 532436, 536062, 539674, 542730, 546042, 550451, 555563, 560454, 564811, 568670, 571808, 574100, 576000, 578072, 580504, 583406, 587108, 591800, 597368, 603799, 611226, 619395, 627817, 636641, 646631, 657998, 670046, 682387, 695722, 710904, 727912, 746293, 766055, 787543, 810842, 835869]
56071H35869K7016K9701L3184L7246M1532M6034N1439N8350O6145P3631Q1008
56060A381155Q9860J00663J11814J21890J31094J39239J44026J43115J36789J26978
56050B626623J14894J01513Q9075P9664P2725O5786N7225M6692L3728J8268K247
56039C308440j1412k1499k8941l5082m1295m9707o1999p7375r3234j07744j20176
56028B659976j29274j33450j32702j28618j22381j14254j04840r5172q5563p5882
56018A537840o6726n8786n1402m3536l5849k9968k5878k2026j7899j4492j2111
56007A159167r797p149m887l248j515N17K171L294M639O515Q358R785J0960J1951
55993A190761J2886J4431J6915J9345K0610K1088K1796K2702K3403K4521K6588
$$ y = [835869, 862885, 892586, 925770, 963016, 1004548, 1050582, 1102021, 1160371, 1226516, 1300147, 1381155, 1471015, 1571678, 1683492, 1805382, 1936476, 2075715, 2219741, 2362856, 2499645, 2626623, 2741517, 2843030, 2932105, 3011769, 3084494, 3150280, 3207505, 3254197, 3287925, 3306193, 3308440, 3297028, 3275529, 3246588, 3211506, 3170211, 3120504, 3058505, 2981130, 2887896, 2780152, 2659976, 2530702, 2397252, 2264550, 2135932, 2013551, 1899297, 1794457, 1699285, 1613722, 1537840, 1471114, 1412328, 1360926, 1317390, 1281541, 1251573, 1225695, 1203669, 1185770, 1171278, 1159167, 1149370, 1142221, 1137334, 1134086, 1132571, 1133088, 1135259, 1138553, 1143192, 1149707, 1158065, 1167850, 1178810, 1190761, 1203647, 1218078, 1234993, 1254338, 1274948, 1296036, 1317832, 1340534, 1363937, 1388458, 1415046]
55982A415046K8346K8202K6758K5882K6076K6727K8114L0763L3585L5073L5805
55971A740377L7409L9769M1712M3682M7002N1178N4612N7468O1039O5041O8313
55960B307602P1494P5923Q0742Q4267Q7444R2452R8694J03826J08102J13797J20800
55949C345143J26918J32201J38835J46936J54692J62446J72375J84129J95310
55940D758985K06154K19168K34112K48337K62233K79195K99721L20781L41576
55931G170262L64700L90658M16698M42035M69159M99062N30284N63376O00897
55922A1447131O42456O85437P30845P82334Q39130Q96684R54705J017481J085996
55913A9082199J157689J234675J323960J428786J548592J688606J860948K075918
$$ y = [1415046, 1443392, 1471594, 1498352, 1524234, 1550310, 1577037, 1605151, 1635914, 1669499, 1704572, 1740377, 1777786, 1817555, 1859267, 1902949, 1949951, 2001129, 2055741, 2113209, 2174248, 2239289, 2307602, 2379096, 2455019, 2535761, 2620028, 2707472, 2799924, 2898618, 3002444, 3110546, 3224343, 3345143, 3472061, 3604262, 3743097, 3890033, 4044725, 4207171, 4379546, 4563675, 4758985, 4965139, 5184307, 5418419, 5666756, 5928989, 6208184, 6507905, 6828686, 7170262, 7534962, 7925620, 8342318, 8784353, 9253512, 9752574, 10282858, 10846234, 11447131, 12089587, 12775024, 13505869, 14288203, 15127333, 16024017, 16978722, 17996203, 19082199, 20239888, 21474563, 22798523, 24227309, 25775901, 27464507, 29325455, 31401373]
55905C1401373K340855K664864L051102L485293L947444M436391M968290N553434
55897F1849046O195687O914734P743842Q704287R812039J1112826J2675267J4547850
55889A39555578J6763086J9338869K2083446K4244941K4473832K1479773J5014131
55882B82953656O271563k733627j0267033j5538799j8612627j9952632k0081356
55875B02039145j9451630j8406256j7159199j5815494j4421241j3005122j1598401
55868I2181802j0240509q970724p813491o776792n864266n078907m413785l850713
55860C9172615l372799k970422k632947k344928k094878j879575j695861j535759
55852B0645446j393204j267964j159025j060865r70024q88794q18568p55500o96366
$$ y = [31401373, 33742228, 36407092, 39458194, 42943487, 46890931, 51327322, 56295612, 61849046, 68044733, 74959467, 82703309, 91407596, 101219635, 112332461, 125007728, 139555578, 156318664, 175657533, 197740979, 221985920, 246459752, 267939525, 282953656, 289225219, 286491592, 276224559, 260685760, 242073133, 222120501, 202039145, 182587515, 164181259, 147022060, 131206566, 116785325, 103780203, 92181802, 81941293, 72970569, 65157078, 58380286, 52516020, 47437113, 43023328, 39172615, 35799816, 32829394, 30196447, 27851519, 25756641, 23877066, 22181205, 20645446, 19252242, 17984278, 16825253, 15764388, 14794364, 13905570, 13087002, 12331502, 11635136]
55843A1635136o43072n97474n56879n18400m83024m51814m22468l93207l66098
55834G202700l43060l22231l01330k81210k63181k46179k29365k14337k02072
55825D799735j90748j79106j68852j61219j54133j45521j36591j29181j22453
55816C411931j14812j06833r9638r2558q4677p6909p0240o3853n6814m9727m2891
55805B552979l4913k5108j5402q054l462j938n364j4704k7601m0639n2560o3477
55793B259757p2613p9040q3265q6026q6627q4297q0101p5694p1134o5598n9277
55782A416085n2965m6660m0130l4069k9274k5330k1452j7937j5588j4372j3632
55771A104676j3121j2935j3057j3538j4401j4969j4332j2793j1577j0745q914
$$ y = [11635136, 10992064, 10394590, 9837711, 9319311, 8836287, 8384473, 7962005, 7568798, 7202700, 6859640, 6537409, 6236079, 5954869, 5691688, 5445509, 5216144, 5001807, 4799735, 4608987, 4429881, 4261029, 4099810, 3945677, 3800156, 3663565, 3534384, 3411931, 3297119, 3190286, 3090648, 2998090, 2913413, 2836504, 2766264, 2702411, 2645597, 2595870, 2552979, 2518066, 2492958, 2477556, 2469502, 2466040, 2464102, 2458738, 2444034, 2416433, 2375794, 2323234, 2259757, 2187144, 2108104, 2024839, 1938813, 1852186, 1767889, 1687788, 1612094, 1540960, 1475362, 1416085, 1363120, 1316460, 1276330, 1242261, 1212987, 1187657, 1166205, 1148268, 1132680, 1118308, 1104676, 1091555, 1078620, 1065563, 1052025, 1037624, 1022655, 1008323, 995530, 983953, 973208, 964294]
55760I64294n623k316k50P58O10k030p579j4031j9140k2763k5604k7135k6588
55747H12603k4847k3529k2787k1576j9477j6934j4299j1863j0203r421q663p440
55735F21564o668p272q629r552j0055j0818j1659j1839j1459j1217j1184j0912
55723E00300j0427j0064r678q935q075p453o693n232l356j852r55l99k01n95j469
55708D24916k473l467m332m761m715m617m669m550m115l773l713l578l432m141
55694C68580o104q430j0128j1268j2193j2430j1392r539p867o753o062n789n772
55681B54853n331m072k578j525p70l0J88n76j631j892j354q37o06l26r9m92j614
55664B31308k914l886m362m295l791l228k828k407j912j751k100k388k100j565
$$ y = [964294, 958671, 956355, 956105, 956863, 957473, 955443, 947864, 933833, 914693, 891930, 866326, 839191, 812603, 787756, 764227, 741440, 719864, 700387, 683453, 669154, 657291, 647088, 637667, 629004, 621564, 614896, 607624, 598995, 589443, 579388, 568570, 556911, 545072, 533613, 522396, 511212, 500300, 489873, 479809, 470131, 461196, 453121, 445668, 438975, 433743, 430387, 428535, 427580, 427181, 426980, 426385, 424916, 422443, 418976, 414644, 409883, 405168, 400551, 395882, 391332, 387217, 383444, 379731, 376153, 372721, 368580, 362476, 354046, 343918, 332650, 320457, 308027, 296635, 287096, 279229, 272476, 266414, 260625, 254853, 249522, 245450, 242872, 241347, 240577, 240547, 240735, 240159, 238528, 236636, 235282, 234445, 233839, 233513, 233414, 232922, 231308, 228394, 224508, 220146, 215851, 212060, 208832, 206004, 203597, 201685, 199934, 197834, 195446, 193346, 191781]
55650A91781j283j061m44M00J074J712K595L336L267K423J487R72R69J366J776
55635B10370J641Q97J87n8j63l55j24Q75J922K080J463P51K6r57j855k106j947
55618B12647k113k752l414l939m409m563m111l515l578m283m846m849m578m304
55604A57393m000l772l838m006l770k978j980j134o07m67n20l26K24N79L41q2
55588A31057j41j21o20j445j930k097k588l429l794l155j976j071p82q91r50n88
55572A05479J02M84M5r79j970k671l153l251k645j492m40J9q5m30p02p56p11p51
55554H6093p24k86M07O30O0p25j076j131j316j546j429r38k76M31R16O39m95j724
55536G7510k260k127j698j012j83J84k28p88q40o91q25q04l2Q43O13o48j574j286
$$ y = [191781, 190498, 189437, 188993, 189393, 190467, 192179, 194774, 198110, 201377, 203800, 205287, 206259, 207228, 208594, 210370, 212011, 212908, 213095, 213037, 212874, 212519, 212395, 213270, 215192, 217272, 218735, 219486, 219512, 218555, 216700, 214594, 212647, 210534, 207782, 204368, 200429, 196020, 191457, 187346, 183831, 180253, 175970, 171124, 166275, 161697, 157393, 153393, 149621, 145783, 141777, 138007, 135029, 133049, 131915, 131308, 130841, 130321, 129995, 130219, 130798, 131139, 131057, 130916, 130795, 130175, 128730, 126800, 124703, 122115, 118686, 114892, 111737, 109761, 108690, 107908, 107017, 106067, 105479, 105581, 106065, 106110, 105131, 103161, 100490, 97337, 94086, 91441, 89949, 89509, 89528, 89443, 89013, 88311, 87555, 86844, 86093, 85369, 85083, 85490, 86120, 86180, 85455, 84379, 83248, 81932, 80386, 78957, 78019, 77743, 78174, 79090, 79729, 79234, 77510, 75250, 73123, 71425, 70413, 70230, 70414, 70186, 69398, 68558, 67867, 67042, 66238, 66206, 67049, 67662, 67014, 65440, 64154]
55518F4154j87J007J916K215J719R76Q91J609K421K822K930K916K786K808L354
55503I4337M206M707M671M519M455M136L232J757j62k200l686m174m113m283m740
55488A02662m919m669m388m295m310m535n015n232m648l668l160l126k845k210
55474D5642j906k165k391k216j931j674j123k87K64K65Q8mj21j56K16P34P84N78
55456C4597J158K743M058L895K517J043J02l26l76k35j25M1N53J206J285N76k91
55439E2421q03j263j991k588k507j918j402j142r20o51m92n58p79r09o79j14K76
55422C3981R1l70n27l86l68m64l37j87n28j056q12K64R95N61m57j112j222r99
55404B7067m44K12K79m42j088p81K63J218J692J670J072N4p47r45r82j376j753
$$ y = [64154, 63967, 64974, 66890, 69105, 70824, 71800, 72691, 74300, 76721, 79543, 82473, 85389, 88175, 90983, 94337, 98543, 103250, 107921, 112440, 116895, 121031, 124263, 126020, 125858, 123658, 119972, 115798, 111685, 107402, 102662, 97743, 93074, 88686, 84391, 80081, 75546, 70531, 65299, 60651, 56983, 53823, 50697, 47852, 45642, 43736, 41571, 39180, 36964, 35033, 33359, 32236, 31949, 32213, 32478, 32566, 32562, 32441, 32285, 32501, 33235, 34019, 34597, 35755, 38498, 42556, 46451, 48968, 50011, 50113, 49787, 49411, 49176, 49051, 49092, 49645, 50851, 52136, 52712, 52421, 51618, 50355, 48364, 45776, 43269, 41351, 39949, 38807, 37887, 37236, 36744, 36186, 35407, 34498, 33819, 33705, 33981, 34072, 33702, 33175, 32789, 32421, 31957, 31620, 31433, 30905, 29849, 29037, 29301, 30296, 30857, 30400, 29288, 28066, 27067, 26623, 26835, 27114, 26672, 25584, 24803, 25066, 26284, 27976, 29646, 30718, 30772, 30025, 29080, 28098, 26722, 24969]
55387B4969j353k01Q40J043M86j00N8J016J796J330j57j306j367r87r19q77l35
55370B3936L79O32N17N70Q70J181J523J874J797J098M73O18J123J015K10m43l86
55353C6987J82Q38J259J109L92j90L6P53J100J011J246K088K759K494J599J048
55337E4711J268J689J454M67m57o06l62o55j540k095j910j721k072k268j593p02
55321D3608p73j629k013j489r08r37j184j043o02l14l30m16k12M29J077R61Mp69
55303C3460n91k30q99k232k608j481j9P84J280J852J748K99j553k157j203Q1O23
55286B7154M50R2j84k79p7L02M03j02r14j363j157p42p83j364j857j697r67j27
55268A6788O02J172J360R92L89O7jk57o90p32k01K96K64rl7N1j30m56m26K0M71
$$ y = [24969, 23616, 23415, 24255, 25298, 25784, 25684, 25742, 26758, 28554, 29884, 29727, 28421, 27054, 26067, 25148, 24271, 23936, 24315, 24947, 25464, 26034, 26904, 28085, 29608, 31482, 33279, 34377, 34850, 35468, 36591, 37606, 37816, 37373, 36987, 37169, 38007, 39266, 40375, 40767, 40577, 40613, 41366, 42466, 43477, 44723, 46811, 49570, 52064, 53663, 54711, 55979, 57668, 59122, 59589, 59132, 58526, 58164, 57509, 55969, 53874, 51964, 50243, 48171, 45903, 44310, 43608, 42835, 41206, 39193, 37704, 36796, 35859, 34675, 33632, 33030, 32716, 32386, 31970, 31758, 32187, 33264, 34225, 34229, 33460, 32869, 32639, 31740, 29508, 26900, 25419, 25400, 26184, 27464, 29316, 31064, 31363, 29810, 27653, 26450, 26531, 27154, 27604, 27696, 27512, 27233, 27156, 27458, 27861, 27759, 26845, 25482, 24325, 23583, 22800, 21436, 19579, 17882, 16915, 16788, 17390, 18562, 19922, 20914, 21303, 21370, 21369, 21112, 20422, 19690, 19489, 19785, 20049, 20040, 20003, 20054, 19924, 19468, 19042, 19062, 19533]
55247A9533O70P38P39N72K68O1j1j16j51L14J277J881J295j47j191j043j45O05
55229B5149Q57Q01N37L6m73n99l11N2K81M48N14L47J40K95P28Q04K76l15m98n84
55209B8485j001j483j533j310j254j187n69M74J182J215R12N01j39p92q54k50
55193B2397K86K70P4Q8m9p13j357j125j05P53Q91O20M00K17j20n80r45j026o78
55174A9298Q5R05J295J129P12L16r0m79o09m31l83q50j515j707j261o33j02M99
55156A6179J203J568J333R53R96J299J293R29O37N03J82l17m77j51J32j8k90l21
55138B5633k66k80j0P12J247R38J50k70k42k92l85R1J008J315N01n88q81m35r1
55119B7855k90p85j215j385j190o76j68K7p3l08o64j129j437j323r30o19n15l89
$$ y = [19533, 20203, 20941, 21680, 22252, 22520, 22581, 22570, 22454, 22303, 22617, 23894, 25775, 27070, 26923, 25732, 24689, 24544, 25149, 26006, 26807, 27344, 27380, 26907, 26308, 25997, 26049, 26330, 26778, 27292, 27639, 27779, 28074, 28802, 29606, 29882, 29567, 29069, 28485, 27484, 26001, 24468, 23158, 21904, 20717, 20148, 20622, 21804, 23019, 23931, 24432, 24293, 23501, 22647, 22397, 22683, 22953, 23027, 23115, 23066, 22353, 20996, 19871, 19766, 20519, 21410, 22030, 22430, 22647, 22527, 21947, 21002, 19976, 19298, 19383, 20288, 21583, 22712, 23424, 23740, 23650, 23171, 22562, 22131, 21748, 20898, 19383, 17676, 16415, 15782, 15680, 16179, 17382, 18950, 20283, 21236, 22232, 23531, 24824, 25753, 26390, 26893, 27075, 26758, 26281, 26130, 26262, 26244, 25954, 25633, 25367, 25087, 25077, 25789, 27036, 27974, 28124, 27854, 27612, 27320, 26935, 27026, 28034, 29349, 29850, 29262, 28381, 27946, 27855, 27565, 26780, 25565, 24180, 22990, 22314, 22146, 22173, 22100, 21792, 21128, 19999, 18562, 17239, 16309, 15690, 15175, 14786]
55101A4786m9M50Q90J037Q05M07K79N96R73Q70K90k06k21k1j71p74j260r94l8
55082A7649P81P13o5o02l01L87N50Ln30m02J81N83N92M93M20J38m50r22p61Q4
55062A8541J193K060K292J715O77M7M78J664K653K879K477J695N97n34j100q36
55046C6498j63M18Q73J240J215O19p9k99j52j88n39q63r60q76n04K94J188J567
55028C9289J263O20p1o94r59n75J29M96M90P03J234J382P79Q5j0J74n8n73o55
55009D3049j90K09K35L41R19J561J526O46m90j229j481j574j571j081O0J143J175
54992D3248J80o80n28J65L90Ok65k3L30L43J14o9k18m76p37p21l35K12O58R00
54972D2494J062J337J761K135K179J785J098M23O3O9J69N1j55J5O51J178J060
$$ y = [14786, 14737, 15187, 16077, 17114, 17919, 18326, 18605, 19201, 20174, 21044, 21334, 21128, 20907, 20886, 20715, 19941, 18681, 17687, 17649, 18430, 19143, 19078, 18476, 18175, 18562, 19112, 19115, 18585, 18183, 18364, 18947, 19539, 20032, 20452, 20590, 20140, 19218, 18457, 18541, 19734, 21794, 24086, 25801, 26478, 26525, 27003, 28667, 31320, 34199, 36676, 38371, 38968, 38434, 37334, 36498, 36335, 36753, 37626, 38866, 40081, 40700, 40621, 40322, 40170, 39982, 39443, 38580, 37620, 36744, 36240, 36534, 37722, 39289, 40552, 41172, 41101, 40407, 39448, 38873, 39002, 39498, 39988, 40691, 41925, 43307, 44086, 44171, 44161, 44335, 44277, 43704, 43049, 42859, 43068, 43303, 43644, 44563, 46124, 47650, 48296, 47806, 46577, 45096, 43522, 41951, 40870, 40930, 42073, 43248, 43428, 42748, 42220, 42385, 42775, 42781, 42516, 42493, 42823, 43166, 43280, 43211, 42993, 42517, 41780, 41059, 40724, 40936, 41594, 42494, 43556, 44893, 46654, 48789, 50968, 52753, 53851, 54274, 54337, 54406, 54575, 54626, 54471, 54486, 55137, 56315, 57375]
54955E7375N28K12K41K45Q7K5R9l4m22n54r1N67Q33O98M93K24k95q06q20m45m56
54934E7704j254k210k379j595n81o9j72n23q22j032j149r57k80N77R50N99J19
54917D6926K01P00R08O72N98R86J270Q96K75K39Q77J439J407J108J274K241L586
54900F5603M389M021K841J902J771J973J901J786K213L034L531L486L390L628
54886A05469M133M845N857O969P730Q016P999P654O870N960N226M115J800j255
54872A81388l479m300m870o155p500p899p639p528p361o484n271m750m956m900
54858I8296m099l090k417k104k086k329k389j734n79K67N13O33J083J829K670
54843H4464L347L486L133L225M600O634P858P892P715P817P328N471K841N58j079
$$ y = [57375, 57903, 58115, 58356, 58601, 58688, 58713, 58812, 58778, 58356, 57802, 57711, 58278, 59111, 59809, 60302, 60526, 60231, 59425, 58605, 58160, 57704, 56450, 54240, 51861, 50266, 49685, 49616, 49444, 48921, 48099, 47067, 45918, 44961, 44681, 45258, 46208, 46807, 46926, 47127, 47827, 48735, 49407, 50005, 50991, 52261, 53157, 53432, 53671, 54548, 55987, 57394, 58502, 59776, 62017, 65603, 69992, 74013, 76854, 78756, 80527, 82500, 84401, 86187, 88400, 91434, 94965, 98451, 101841, 105469, 109602, 114447, 120304, 127273, 135003, 143019, 151018, 158672, 165542, 171502, 176728, 180843, 182643, 181388, 177909, 173609, 168739, 162584, 155084, 147185, 139546, 132018, 124657, 118173, 112902, 108152, 103196, 98296, 94197, 91107, 88690, 86586, 84500, 82171, 79782, 78048, 77469, 77736, 78249, 78882, 79965, 81794, 84464, 87811, 91297, 94430, 97655, 102255, 108889, 116747, 124639, 132354, 140171, 147499, 152970, 155811, 156369, 155290]
54828A55290k474l792m822n428n615n466n257n375n798o090n958n471m638l446
54814H5660k356k018k253k169j503r96j083j177q33o74j326k200k287j610j031
54799F2144r29j057j238j427j250m42L98L31p17j926k689k985k785j906o53J71
54783D3040J67k26l91j71K83Q23J195J002R8j135k089k383k023j272m73J56N50
54766C7151O33K52n27j200j222n85K25P68J019J165J327J514J673J718J585J305
54750D6801J019R17J088J335J299R05O34R93J827K482K596K412K308K472L035
54735G2123L945M720M869M662M896N780O737P469Q359R446R915R287Q319P914
54721A68441P724O696M586K086k65k370m004m863n201n627o226o482o095n343
$$ y = [155290, 152816, 149024, 144202, 138774, 133159, 127693, 122436, 117061, 111263, 105173, 99215, 93744, 89106, 85660, 83304, 81286, 79033, 76864, 75361, 74365, 73282, 72105, 71272, 70598, 69272, 67072, 64785, 63175, 62144, 61215, 60158, 58920, 57493, 56243, 55801, 56199, 56530, 55813, 53887, 51198, 48213, 45428, 43522, 42869, 43040, 43207, 42981, 42590, 42419, 42702, 43525, 44720, 45722, 45820, 44685, 42596, 40213, 38190, 36918, 36445, 36601, 37151, 37784, 38036, 37509, 36309, 35087, 34502, 34727, 35495, 36514, 37679, 39006, 40520, 42193, 43911, 45496, 46801, 47820, 48737, 49825, 51160, 52459, 53364, 53998, 54991, 56818, 59300, 61896, 64308, 66616, 69088, 72123, 76068, 80788, 85657, 90319, 95215, 100995, 107732, 115201, 123560, 133006, 142921, 152208, 160527, 168441, 176165, 182861, 187447, 189533, 189268, 186898, 182894, 178031, 172830, 167203, 160977, 154495, 148400, 143057]
54707A43057m496l444k066n86N14Q29L76j53J63J454K808L414L594M186N322O448
54691A61420P225P708P861P585P011O256N137L760K920L116L521K959J535K73
54677B28287p06k262m518o400p286p897q955r975j0132r556q951q495p918p208
54663A28028o657o366o192o059n906n515m665l420k171j499j826k834l452k928
54649F8538j820j256j332j111k13N65N21Rl49n48p65p12j34N89Q80O92L47O0P1
54630F4032O45J558K032J739J337J518K028K265K210K116J781R74K31M02J513
54615H6381K799L688M116M070L634L340L712M403M475L704K905K814L190L330
54601A36561L021K611K388K248J941J544J530K230L336M105M240M140M235M467
$$ y = [143057, 138561, 135117, 133051, 132465, 132979, 133808, 134184, 134031, 134194, 135648, 138456, 141870, 145464, 149650, 154972, 161420, 168645, 176353, 184214, 191799, 198810, 205066, 210203, 213963, 216883, 219999, 223520, 226479, 228014, 228287, 227581, 225319, 220801, 214401, 207115, 199218, 190263, 180288, 170156, 160600, 151649, 143154, 135236, 128028, 121371, 115005, 108813, 102754, 96848, 91333, 86668, 83248, 81077, 79578, 77752, 74918, 71466, 68538, 66718, 65462, 64130, 63019, 62806, 63371, 63892, 63901, 63552, 63004, 62239, 61527, 61393, 61982, 62862, 63554, 63901, 63961, 64032, 64677, 66235, 68267, 70006, 71343, 72861, 74889, 77154, 79364, 81480, 83261, 84235, 84466, 84868, 86381, 89180, 92868, 96984, 101054, 104688, 108028, 111740, 116143, 120618, 124322, 127227, 130041, 133231, 136561, 139582, 142193, 144581, 146829, 148770, 150314, 151844, 154074, 157410, 161515, 165755, 169895, 174130, 178597]
54587A78597M801N694P530R841J1670J2525J2510J1853J0789R728Q809P427M862
54574B96636J348k126n012p502r619j0833j0964j0705j0783j1020j0701r658q451
54561A90610p668p334o994o168m741l100j854j327j333j413j193n99O2K49l84
54546A46813j602k748l274l095k472j844j593j755j976j964j889k056k332k338
54532A15875k086k019k266k389j946j048j49L16M7r50k071k441j831r10l38m2
54516I5752L22N59K00o85j476j765j637j232n44K21N97L78r5l49k44Q5N01Q05
54498I1393P90N21M44Q58J469J768J701J648J793J931J903J856J934K091K344
54483A14444K910L810M584M747M338L808L491L455L715M192M551M448M022L844
$$ y = [178597, 183398, 189092, 196622, 206463, 218133, 230658, 243168, 255021, 265810, 275538, 284347, 291774, 296636, 297984, 295858, 290846, 283344, 273725, 262892, 251928, 241223, 230440, 219420, 208719, 199061, 190610, 182942, 175608, 168614, 162446, 157705, 154605, 152751, 151424, 150091, 148678, 147485, 146886, 146948, 147197, 146813, 145211, 142463, 139189, 136094, 133622, 131778, 130185, 128430, 126454, 124490, 122601, 120545, 118213, 115875, 113789, 111770, 109504, 107115, 105169, 104121, 103972, 104288, 104335, 103385, 101314, 98873, 97042, 96132, 95794, 95752, 96074, 96633, 96833, 96148, 94672, 92907, 91270, 90038, 89494, 89715, 90312, 90690, 90595, 90246, 90002, 90087, 90588, 91393, 92183, 92704, 93148, 94006, 95475, 97243, 98944, 100592, 102385, 104316, 106219, 108075, 110009, 112100, 114444, 117354, 121164, 125748, 130495, 134833, 138641, 142132, 145587, 149302, 153494, 158045, 162493, 166515, 170359]
54469A70359M239M856M966M095K355L89j097j927k602l611m767n453n482n328
54455A60992n399n576n533n217m742m116l343k602k141j984j935j683r94J6P89
54440A16532Q46L93M5l2k24o02o07Q0R11J222J195J497K211K684K412J543N69
54423A30675o8p8N56J411J913J900J816K247L261M129L825K114J18o44Q8J128
54407A54391J472J394J502J489P53l11p01l16j0j69k56M7K59M6j78j38l66j249
54389A57659k063j818p58j33n66j372j650j383j171j315j611j813j941k004j777
54374A36284j090k02K96P6o80j553k208k370j864r64l07j70q8L70Q43Q11N99R28
54356A28711J540J363K71l93L97J882K636K481K378K815L327L514L545L530L204
$$ y = [170359, 174598, 179454, 184420, 188515, 190870, 191259, 190162, 188235, 185633, 182022, 177255, 171802, 166320, 160992, 155593, 150017, 144484, 139267, 134525, 130409, 127066, 124464, 122323, 120339, 118404, 116721, 115727, 115743, 116532, 117378, 117771, 117816, 117784, 117560, 116958, 116351, 116431, 117342, 118564, 119759, 121256, 123467, 126151, 128563, 130106, 130675, 130607, 130529, 131085, 132496, 134409, 136309, 138125, 140372, 143633, 147762, 151587, 153701, 153819, 153175, 153263, 154391, 155863, 157257, 158759, 160248, 161001, 160690, 159989, 159673, 159663, 159494, 159238, 159285, 159544, 159590, 159412, 159274, 158908, 157659, 155596, 153778, 153020, 152887, 152321, 150949, 149299, 147916, 146745, 145430, 143819, 142006, 140065, 138061, 136284, 135194, 134992, 135288, 135364, 134684, 133131, 130923, 128553, 126689, 125725, 125418, 125248, 125160, 125530, 126373, 127184, 127783, 128711, 130251, 131614, 131885, 131492, 131889, 133771, 136407, 138888, 141266, 144081, 147408, 150922, 154467, 157997, 161201]
54341A61201K602K394L039M063M615M456L927L208K132P44m52j010j051j007j049
54326A87812r97p66n88p04j077j541k057k596k968l036l040l249l478l245k590
54311A55880k158k304k519k147j329p27m94j61N11J066J005M58j1l5L22P64R21
54294A49042N67o8l12L30J571K627L086L171L164K932K293J563J313J631J993
54279A74903J894J396Q76M95N8o84j723k747l406l649l844m298m749m633l953
54264A45936l411l482l734l532l087l169l896m493m331l644k961k408j924j747
54250A00117k123k755l032k808k553k646k846k591j710o55q4k02o11p64n57l28
54234G3852l41n07o38p65r81j157j078q49r18j595k559l005k407j092j1J88k98
$$ y = [161201, 163803, 166197, 169236, 173299, 177914, 182370, 186297, 189505, 191637, 192381, 191929, 190919, 189868, 188861, 187812, 186815, 186049, 185461, 184757, 183680, 182139, 180082, 177486, 174518, 171482, 168442, 165193, 161715, 158470, 155880, 153722, 151418, 148899, 146752, 145423, 144696, 144202, 144041, 144552, 145618, 146623, 147081, 147070, 147035, 147357, 148121, 149042, 149609, 149541, 149229, 149559, 151130, 153757, 156843, 160014, 163178, 166110, 168403, 169966, 171279, 172910, 174903, 176797, 178193, 179069, 179564, 179622, 178938, 177215, 174468, 171062, 167413, 163569, 159271, 154522, 149889, 145936, 142525, 139043, 135309, 131777, 128690, 125521, 121625, 117132, 112801, 109157, 106196, 103788, 101864, 100117, 97994, 95239, 92207, 89399, 86846, 84200, 81354, 78763, 77053, 76398, 76314, 76112, 75501, 74737, 74180, 73852, 73511, 73004, 72366, 71601, 70620, 69463, 68385, 67536, 66618, 65023, 62464, 59459, 57052, 55960, 55949, 56137, 55839]
54217E5839q62j209j378j311q80l52k54o32q44l76N19J245J563J539J178N43L5
54200E4363M8M35O91N60J60l73q72r17j96Q69J388J051M46J37n4n16j011r78m42
54181E4789n0j61l27R5J066J911K081J635J030O21M59M22L57J65j57m60o05o40
54163F2231p42r25r89q57p28p57p88o22l63k50k33j68j93n64j085j266j113j167
54145D9421j583j651q24L06O31Jo33m99J07L67p8r18j541j488p52R4L45j75j023
54126D0107j659j762j082L59J741J835M12j228j746j324j023j017m78Q05J831
54111C5771J760J025M85K03k64q59j023n43K59J016J507J505R32J40m16p26j007
54094C9765j138q47l90l64p87r42l86M85J049J169R76M90j30m12j62J29p7n64
$$ y = [55839, 54977, 53768, 52390, 51079, 50199, 49847, 49593, 48961, 48117, 47741, 48260, 49505, 51068, 52607, 53785, 54328, 54363, 54411, 54846, 55537, 56097, 56257, 55884, 55012, 54095, 53899, 54768, 56156, 57207, 57653, 57790, 57736, 57220, 56209, 55231, 54789, 54739, 54578, 54251, 54346, 55412, 57323, 59404, 61039, 62069, 62690, 63149, 63571, 63928, 64093, 63936, 63476, 62871, 62231, 61489, 60564, 59575, 58718, 57990, 57233, 56445, 55823, 55460, 55210, 54977, 54809, 54616, 54052, 52967, 51701, 50588, 49421, 47838, 46187, 45363, 45669, 46300, 46301, 45668, 45169, 45276, 45643, 45565, 44647, 43106, 41618, 40866, 40960, 41305, 41130, 40107, 38448, 36686, 35604, 35963, 37704, 39539, 39951, 38723, 36977, 35653, 34630, 33613, 33135, 33940, 35771, 37531, 38556, 39041, 39244, 38980, 38121, 37098, 36555, 36814, 37830, 39337, 40842, 41774, 41914, 41498, 40772, 39765, 38627, 37780, 37390, 37026, 36239, 35297, 34911, 35396, 36445, 37614, 38590, 39080, 38950, 38538, 38376, 38505, 38428, 37864]
54076C7864p35n42l89k64L28J403K219K220J770J469J209M65o38j257q52J33Q21
54059D5224P71K11l30m25n6K73k3q51j391j089m13j84l84l14J78M08J12R5J060
54040D2872K307K435J220m6j81N87J206J102N44Nl21m51m40l52k48q2K38O27P23
54021E1745J86q47j681j700j021l54j70k89l31k22m3L11R67J747K310K500K282
54004E5390J627P14Q1P8L46K59k31n66l53K70R32J350J376J111Q71P06J69r89
53986F3141k096k194j208O6J001J504J535J112P96J219K014K136J377O92P40J098
53970G2933J293J544J973K085J721J622K255K901K782K298K228K451K483K608
53956A03177L277L939L733K936K522K530K212J613J645K410K840K314J493J070
$$ y = [37864, 37129, 36587, 36198, 35934, 36262, 37665, 39884, 42104, 43874, 45343, 46552, 47017, 46379, 45122, 44270, 44403, 45224, 45995, 46206, 45876, 45451, 45395, 45668, 45645, 44794, 43403, 42314, 41901, 41717, 41333, 41019, 41197, 41605, 41717, 41812, 42872, 45179, 47614, 48834, 48788, 48607, 49194, 50400, 51502, 52046, 52051, 51730, 51279, 50839, 50487, 50239, 50157, 50395, 51022, 51745, 51931, 51084, 49403, 47703, 46682, 46328, 46158, 45869, 45538, 45316, 45273, 45584, 46551, 48298, 50608, 53108, 55390, 57017, 57731, 57812, 57890, 58236, 58495, 58264, 57698, 57345, 57615, 58547, 59897, 61273, 62384, 63255, 63961, 64130, 63141, 61045, 58851, 57643, 57709, 58710, 60214, 61749, 62861, 63657, 64876, 66890, 69026, 70403, 71095, 71835, 72933, 74226, 75770, 77743, 79828, 81549, 83171, 85426, 88327, 91109, 93407, 95635, 98086, 100569, 103177, 106454, 110393, 114126, 117062, 119584, 122114, 124326, 125939, 127584, 129994, 132834, 135148, 136641, 137711]
53942A37711P63J15n78p99o26n24p61j435k513l500l599k658j546j251j868k775
53926A14156l355l389l072k794k643k154r66L52Q19L32l26p56j285j832j632n44
53910I0911K51l28j827k960l140k715k128j659j532j623j284j52J160J765J570
53895G6309J143Q39O48N87O27M78M6j82J98P13O46K49M65J525K530K615J873J018
53877I2327O54J025J957K857L159K934K752K892L064K923K494J960J352O37r6
53862A22891o28p00k24N34J096J358J778K637L415L366K541J713J387J441J696
53847A44301K179K692K757K341K142K759L852M507M327L799L647M028M469M449
53833A92249L939L268K666K162J865J833J649O54j021k212k091j311j196k047
$$ y = [137711, 138474, 138589, 138011, 137212, 136586, 136062, 135301, 133866, 131353, 127853, 124254, 121596, 120050, 118799, 116931, 114156, 110801, 107412, 104340, 101546, 98903, 96749, 95783, 96135, 96954, 97286, 96960, 96204, 94919, 93087, 91455, 90911, 91162, 90834, 89007, 86047, 82907, 80192, 78064, 76405, 74873, 73250, 71966, 71814, 72974, 74739, 76309, 77452, 78291, 78939, 79526, 80153, 80631, 80677, 80495, 80693, 81406, 82052, 82301, 82766, 84291, 86821, 89436, 91309, 92327, 92981, 94006, 95963, 98820, 101979, 104913, 107665, 110557, 113621, 116544, 119038, 120998, 122350, 122987, 122891, 122263, 121563, 121339, 121873, 122969, 124327, 126105, 128742, 132157, 135523, 138064, 139777, 141164, 142605, 144301, 146480, 149172, 151929, 154270, 156412, 159171, 163023, 167530, 171857, 175656, 179303, 183331, 187800, 192249, 196188, 199456, 202122, 204284, 206149, 207982, 209631, 210285, 209264, 207052, 204961, 203650, 202454, 200407]
53819B00407l007l420l452l440l402l322l282l116k636k231k532l320l506k605
53805A57136j531j434k310l249l606l448l179l147l416l633l363k769k528k851
53791A16672l123k857k463k509k758k527j788j189j166j542j931k035j668r11
53777H8205k21O1J12K34K92L3k37J9O88J117J091J069J318J488J255Q50N90L74
53759I8338Jl87n92p68j133j492j468j076o42k61K64Q64J065N95j01k94K34J049
53741I4196J670J982K109K125K092K147K346K538K615K698K872K899K515J992
53727A26796J997K757L744M296M271L934L530L202L060L036K752J867N43n49p54
53712A64482lJ016J327N67o43j441j660j647j424p50p6l94j780k940k871k237
$$ y = [200407, 197400, 193980, 190528, 187088, 183686, 180364, 177082, 173966, 171330, 169099, 166567, 163247, 159741, 157136, 155605, 154171, 151861, 148612, 145006, 141558, 138379, 135232, 131816, 128183, 124820, 122051, 119523, 116672, 113549, 110692, 108229, 105720, 102962, 100435, 98647, 97458, 96292, 94750, 92819, 90784, 89116, 88205, 87984, 88045, 88157, 88391, 88683, 88716, 88479, 88498, 89186, 90303, 91394, 92463, 93781, 95269, 96524, 97374, 97964, 98338, 98339, 97952, 97360, 96592, 95459, 93967, 92499, 91423, 90781, 90520, 90784, 91648, 92713, 93308, 93207, 92913, 93147, 94196, 95866, 97848, 99957, 102082, 104174, 106321, 108667, 111205, 113820, 116518, 119390, 122289, 124804, 126796, 128793, 131550, 135294, 139590, 143861, 147795, 151325, 154527, 157587, 160623, 163375, 165242, 165785, 165236, 164482, 164479, 165495, 166822, 167389, 166746, 165305, 163645, 161998, 160574, 159824, 159748, 159354, 157574, 154634, 151763, 149526]
53696A49526k280k978l322k995k646k565k220j309l38J11K9m02j121j886k220
53681A23384j983j507j038n03m4l3l83m53KM26L57J13J46K64P5k95m43l19j39
53662A17627M3J41j27p48j123q19k34L3J47N72J001O00o60j759j854j072oR21
53644A12683J375J070K82j22L67J193J429R46M67N60R60J047P04M12N84J044J371
53627A26372J564J996K666K954K379J282L91m6k39j91L00J070J571J584J487J566
53611A46706J589J272Q57P95J126J536J882K271K645K585J733L09r38j327q28
53596A62213l5M13L34o0m90p36o08j01M31N53K64M3L06R43J418J188J46j167j807
53577A63248j313k73K19k15q87r62l94K93P19Q62P97N93L59J89P2O2L45R53J532
$$ y = [149526, 147246, 144268, 140946, 137951, 135305, 132740, 130520, 129211, 128873, 128984, 129013, 128611, 127490, 125604, 123384, 121401, 119894, 118856, 118353, 118309, 118276, 117893, 117440, 117442, 117868, 118225, 118338, 118484, 118748, 118823, 118528, 118085, 117766, 117627, 117670, 117811, 117684, 116936, 115813, 114994, 114760, 114793, 114940, 115512, 116513, 117113, 116453, 114694, 112840, 111768, 111762, 112683, 114058, 115128, 115410, 115288, 115655, 116848, 118277, 119223, 119690, 120250, 121210, 122257, 122961, 123373, 123957, 125001, 126372, 127936, 129932, 132598, 135552, 137931, 139213, 139604, 139558, 139319, 139128, 139428, 140498, 142069, 143653, 145140, 146706, 148295, 149567, 150424, 151219, 152345, 153881, 155763, 158034, 160679, 163264, 164997, 165306, 164368, 163041, 162213, 162178, 162591, 162925, 162865, 162375, 161639, 161031, 160930, 161361, 161914, 162178, 162221, 162527, 163470, 164888, 166076, 166222, 165055, 163248, 161935, 161662, 161881, 161666, 160779, 159817, 159423, 159716, 160435, 161297, 162094, 162687, 163046, 163235, 163307, 163369, 163714, 164667, 166199]
53558A66199J699J526J367J304J102P65P04J128J625J690J457J553K188K823K945
53543A90075K768K855L257L490L352L200L309L404L179K892K969L280L318L024
53529B34372K867L115L455L571L532L440L095K416J874K041K811L478L579L350
53515B76996L239L246K962K127R89P0l29l09j13J63N40R86J355J461J087J21j117
53498B93474j830j372qJ193J343N13m68q89p11m25m33o41o74l91k5K81O75J225
53480B90837J668J831K038K647L444L927L960L667K961J886J162J617L037M374
53466C29056N139N728O317O486O300O629P797Q854R002Q868R440J0463J1043J1283
53452D42405J2049J3319J4066J3853J3456J3668J4364J5130J5976J7077J8349
$$ y = [166199, 167898, 169424, 170791, 172095, 173197, 173962, 174666, 175794, 177419, 179109, 180566, 182119, 184307, 187130, 190075, 192843, 195698, 198955, 202445, 205797, 208997, 212306, 215710, 218889, 221781, 224750, 228030, 231348, 234372, 237239, 240354, 243809, 247380, 250912, 254352, 257447, 259863, 261737, 263778, 266589, 270067, 273646, 276996, 280235, 283481, 286443, 288570, 289559, 289629, 289300, 288991, 288878, 289041, 289581, 290567, 291922, 293383, 294470, 294591, 293474, 291644, 290272, 290264, 291457, 292800, 293313, 292845, 291956, 291245, 290820, 290387, 289746, 289072, 288681, 288656, 288937, 289612, 290837, 292505, 294336, 296374, 299021, 302465, 306392, 310352, 314019, 316980, 318866, 320028, 321645, 324682, 329056, 334195, 339923, 346240, 352726, 359026, 365655, 373452, 382306, 391308, 400176, 409616, 420079, 431122, 442405, 454454, 467773, 481839, 495692, 509148, 522816, 537180, 552310, 568286, 585363, 603712]
53441F03712J9619K0756K1509K1669K1633K2203K3613K5183K6177K6532K6536
53430H59142K6344K6088K6048K6306K6566K6565K6417K6348K6460K6893K7786
53419A150963K8876K9548K9588K9467K9632K9846K9599K8780K7598K6150K4488
53408A464535K2895K1622K0531J9301J7872J6353J4719J2949J1284J0021R119
53397A641201Q359P728P343P019O320N014L233J163j192l823o481q726j0207j1081
53383A645870j2103j4073j7033k0169k2604k4088k4828k5040k5004k5185k5787
53372A409956k6375k6444k6207k6293k6691k6567k5361k3626k2443k2240k2432
53361A135277k2081k0752j8793j6856j5174j3381j1108q589o304m160j530J790
$$ y = [603712, 623331, 644087, 665596, 687265, 708898, 731101, 754714, 779897, 806074, 832606, 859142, 885486, 911574, 937622, 963928, 990494, 1017059, 1043476, 1069824, 1096284, 1123177, 1150963, 1179839, 1209387, 1238975, 1268442, 1298074, 1327920, 1357519, 1386299, 1413897, 1440047, 1464535, 1487430, 1509052, 1529583, 1548884, 1566756, 1583109, 1597828, 1610777, 1622061, 1632082, 1641201, 1649560, 1657288, 1664631, 1671650, 1677970, 1682984, 1686217, 1687380, 1686188, 1682365, 1675884, 1667158, 1656951, 1645870, 1633767, 1619694, 1602661, 1582492, 1559888, 1535800, 1510972, 1485932, 1460928, 1435743, 1409956, 1383581, 1357137, 1330930, 1304637, 1277946, 1251379, 1226018, 1202392, 1179949, 1157709, 1135277, 1113196, 1092444, 1073651, 1056795, 1041621, 1028240, 1017132, 1008543, 1002239, 998079, 996549, 998339]
53349I98339N128P713R549J1203J3019J4949J6996J9261K1574K3489K4854K6143
53337A192217K8001L0596L3497L6093L8035L9404M0561M1797M3081M4271M5513
53326A613066M7190M9370N1588N3448N5228N7443N9954O1930O2875O3281O3957
53315B239330O5064O6028O6265O5669O4513O3186O1967O0855N9561N7822N5623
53304B925883N2994M9774M5853M1559L7486L3989L1012K8313K5505K2098J7884
53293C312350J3366R328N895K408j758o649j2070j7968k4219l0614l7284m4670
53281C168115n2586n9756o4950o8284p0831p3049p4353p4314p3527p2940p2778
53270B410747p2605p2166p1656p1253p0787p0026o8994o7824o6479o4753o2563
$$ y = [998339, 1003467, 1011180, 1020729, 1031932, 1044951, 1059900, 1076896, 1096157, 1117731, 1141220, 1166074, 1192217, 1220218, 1250814, 1284311, 1320404, 1358439, 1397843, 1438404, 1480201, 1523282, 1567553, 1613066, 1660256, 1709626, 1761214, 1814662, 1869890, 1927333, 1987287, 2049217, 2112092, 2175373, 2239330, 2304394, 2370422, 2436687, 2502356, 2566869, 2630055, 2692022, 2752877, 2812438, 2870260, 2925883, 2978877, 3028651, 3074504, 3116063, 3153549, 3187538, 3218550, 3246863, 3272368, 3294466, 3312350, 3325716, 3335044, 3340939, 3343347, 3341589, 3334940, 3322870, 3304902, 3280683, 3250069, 3212785, 3168115, 3115529, 3055773, 2990823, 2922539, 2851708, 2778659, 2704306, 2629992, 2556465, 2483525, 2410747, 2338142, 2265976, 2194320, 2123067, 2052280, 1982254, 1913260, 1845436, 1778957, 1714204, 1651641]
53259A651641n9991n7115n3930n0525m7172m4077m1099l7894l4298l0432k6577
53248A168531k3090k0322j8192j5979j2952r374o382m644l539k050k0J954L593
53235A057534N204O909Q317R137R613J0090J0621J1311J2649J4928J7609J9723
53223A193645K0932K1804K3028K4716K6544K8137K9186K9502K9277K9097K9320
53212A485188K9640K9450K8631K7558K6505K5384K4167K3081K2237K1403K0379
53201A763623J9273J8151J6752J4921J3039J1598J0480R040O856M010P84k547
53189A885980n694q634j1845j5801k0188k4131k7236k9983l2882l5821l8426m0610
53177A594729m2404m3654m4248m4415m4429m4223m3542m2301m0648l8878l7421
$$ y = [1651641, 1591650, 1534535, 1480605, 1430080, 1382908, 1338831, 1297732, 1259838, 1225540, 1195108, 1168531, 1145441, 1125119, 1106927, 1090948, 1077996, 1068622, 1062240, 1057596, 1054057, 1052007, 1051987, 1053941, 1057534, 1062738, 1069647, 1077964, 1087101, 1096714, 1106804, 1117425, 1128736, 1141385, 1156313, 1173922, 1193645, 1214577, 1236381, 1259409, 1284125, 1310669, 1338806, 1367992, 1397494, 1426771, 1455868, 1485188, 1514828, 1544278, 1572909, 1600467, 1626972, 1652356, 1676523, 1699604, 1721841, 1743244, 1763623, 1782896, 1801047, 1817799, 1832720, 1845759, 1857357, 1867837, 1876877, 1883733, 1887743, 1888527, 1885980, 1880286, 1871652, 1859807, 1844006, 1823818, 1799687, 1772451, 1742468, 1709586, 1673765, 1635339, 1594729, 1552325, 1508671, 1464423, 1420008, 1375579, 1331356, 1287814, 1245513, 1204865, 1165987, 1128566]
53166A128566l6608l6237l5724l4872l4178l4066l4256l4243l4000l3745l3346
53155G47291l2533l1432l0364k9194k7429k4964k2275j9917j8139j6982j6262
53144D77800j5487j4227j2627j1195j0172r425q974r079r697j0275j0306r815
53132C46521r159q548p988p399o682n799m941m448m487m896n393n817o118o242
53118B58604o110n685n131m812n039n636o005n748n095m475l943l283k528j971
53104A93143j769j811k013k392k868l244l409l376l213l069l061k961k253r04
53090A56800K62M16k03o28m62k34m05o85n52m7L30K04l10p21o12j17R8l44r38
53071A51852r05k99J44J43K01O49J076J078R66J229J723J909J619J191R44R25
$$ y = [1128566, 1091958, 1055721, 1019997, 985125, 950947, 916881, 882625, 848382, 814382, 780637, 747291, 714758, 683326, 652962, 623768, 596339, 571375, 549100, 529183, 511044, 494062, 477800, 462313, 448086, 435459, 424264, 414092, 404667, 395693, 386614, 376917, 366642, 356336, 346521, 337362, 328814, 320826, 313427, 306745, 300946, 296005, 291557, 287070, 282174, 276781, 270964, 264846, 258604, 252494, 246809, 241678, 236866, 231827, 226191, 220186, 214438, 209343, 204868, 200925, 197642, 195114, 193143, 191374, 189563, 187550, 185158, 182290, 179046, 175637, 172261, 169048, 165979, 162918, 159957, 157704, 156800, 157062, 157478, 157275, 156647, 156185, 155951, 155546, 154861, 154309, 154262, 154592, 154796, 154486, 153765, 153153, 153036, 153134, 152790, 151852, 150947, 150648, 150792, 150935, 151136, 151785, 152861, 153939, 154905, 156134, 157857, 159766, 161385, 162576, 163520, 164445]
53055A64445J085J410J917K634L486M123M116L449K689K414K703L178L415L197
53041B04261K585J803R44j54j527k736l269l225l103l078l032l235m176n522o139
53026A70397n552m646m380m518m240l421k540j833j368j487k314l033k694j629
53012A26742j132j647k236k067j510j358j677k055k387k829l206l069k210q10
52998I8549P15J789J833Q17n39j425j719j736j486p23K85O95R2r22j440j251q08
52981I2726m77k94l38p71j426j786j553j001n89m98o29q65j066j090r70q84q56
52964G7633p73p78j234k005k298j627n93j25k52k59J92O84P78M34k35j057j579
52947F6906j379o44j3K26K84K20j54o85q31l81L13R42J445J562J015K54K10R06
$$ y = [164445, 165530, 166940, 168857, 171491, 174977, 179100, 183216, 186665, 189354, 191768, 194471, 197649, 201064, 204261, 206846, 208649, 209593, 209439, 207912, 205176, 201907, 198682, 195579, 192501, 189469, 186234, 182058, 176536, 170397, 164845, 160199, 155819, 151301, 147061, 143640, 141100, 139267, 137899, 136412, 134098, 131065, 128371, 126742, 125610, 123963, 121727, 119660, 118150, 116792, 115115, 113060, 110673, 107844, 104638, 101569, 99359, 98549, 99264, 101053, 102886, 103703, 103164, 101739, 100020, 98284, 96798, 96075, 96360, 97055, 97147, 96225, 94785, 93534, 92726, 92249, 91955, 91617, 90846, 89420, 87634, 86081, 85080, 84491, 83993, 83364, 82499, 81433, 80343, 79373, 78489, 77633, 76860, 76082, 74848, 72843, 70545, 68918, 68325, 68200, 67948, 67689, 67881, 68565, 69343, 69777, 69542, 68485, 66906, 65527, 64883, 64870, 65096, 65380, 65600, 65446, 64761, 63930, 63549, 63862, 64804, 66249, 67811, 68826, 69080, 69290, 70196]
52929G0196J233N61k96k95L79P93O30K50n6k01k0M46P42O47O88J366K312K801
52911H2176K771K679K663K613K689L057L371L157K549K036J786J742K046K662
52897A17997K982K536J742J221P83k0p94q18l31j83m02l45j54p74k333l724m088
52880A13295l746l313k991k938l350l790l445k453j938k302k555j905r78o73q43
52865G6075q89r20j314j778j786j556j701k147k249j715q50m4M23L65n9l59l54
52848E9142m33p96r49n49j24k84p37q02m92k85k25n3L2l10p34n24L01J009J225
52829E4412J174R50L72m15r28j062j106j044n37K37N30J4p87j239j174o56K00
52812D8941R05Q68K31j35J74N45L67l5L1O47J402K036K430K343J733J081Q50Q41
$$ y = [70196, 71429, 71990, 71694, 71399, 71778, 72571, 73201, 73451, 73395, 73194, 73174, 73620, 74362, 75009, 75697, 77063, 79375, 82176, 84947, 87626, 90289, 92902, 95591, 98648, 102019, 105176, 107725, 109761, 111547, 113289, 115335, 117997, 120979, 123515, 125257, 126478, 127261, 127241, 126447, 125629, 125298, 125115, 124713, 124368, 124214, 123440, 121107, 117383, 113295, 109549, 106236, 103245, 100307, 96957, 93167, 89722, 87269, 85331, 83029, 80474, 78569, 77591, 76918, 76075, 75186, 74266, 72952, 71174, 69388, 67832, 66131, 63984, 61735, 60020, 59170, 59126, 59549, 59914, 59855, 59496, 59142, 58709, 57913, 56964, 56415, 56291, 56007, 55270, 54468, 53976, 53691, 53466, 53413, 53445, 53135, 52401, 51877, 52178, 53187, 54412, 55586, 56536, 56908, 56493, 55565, 54503, 53397, 52353, 51816, 52053, 52583, 52597, 51810, 50571, 49397, 48741, 48941, 49846, 50714, 50945, 50810, 50984, 51529, 51896, 51861, 51892, 52539, 53941, 55977, 58407, 60750, 62483, 63564, 64414, 65255]
52794F5255O13K94L81Q61J163J033Q69J078J536J874J985J993K014K136K460K993
52778H8538L565L956L981L497K547J555J116J400J895J906J253L09m48q20q42
52763A13408o54m79n74j075j898k781l391l393k694j663j040j317k224k953k993
52748H4279k603k374k501k624k358j788j359j405j806k089j812r60o2K18k17p04
52732E9835n25J53L64m58j685k181j673r29o38o37m34m1J64J07P8K34M56O18O27
52713E3435L20k66n52J10J463K344J904N33o60j053q91p12p30p24l61L76J087
52696E5623J343J160Q66N57P9n41j072j575k265k724k047k65J073O53p13j043
52680D9109J40J209P31p11j552j269n40K8M52P52O86K76p0j32j79m02m91j35L39
$$ y = [65255, 65868, 66162, 66543, 67404, 68567, 69600, 70469, 71547, 73083, 74957, 76942, 78935, 80949, 83085, 85545, 88538, 92103, 96059, 100040, 103537, 106084, 107639, 108755, 110155, 112050, 113956, 115209, 115518, 115070, 114250, 113408, 112754, 112275, 111701, 110626, 108728, 105947, 102556, 99163, 96469, 94806, 93766, 92449, 90225, 87272, 84279, 81676, 79302, 76801, 74177, 71819, 70031, 68672, 67267, 65461, 63372, 61560, 60600, 60538, 60756, 60539, 59835, 59310, 59463, 59827, 59369, 57684, 55503, 53830, 52901, 52263, 51626, 51192, 51151, 51315, 51422, 51500, 51734, 52190, 52808, 53435, 53755, 53489, 52937, 53047, 54510, 56854, 58758, 59291, 58631, 57578, 56687, 55975, 55245, 54521, 54160, 54536, 55623, 56966, 58126, 58992, 59549, 59628, 59087, 58015, 56440, 54175, 51451, 49404, 49139, 50212, 50865, 50152, 49109, 49249, 50458, 51189, 50478, 48926, 47657, 47117, 47145, 47597, 48349, 49035, 49311, 49241, 49109, 48930, 48528, 48037, 47902, 48241]
52661D8241L15k75q37q64m61j2L14O01R42J323J671J855J777J561J478J578J593
52644F0800J358J104J118J284J333J299J404J561J458J131J022J363J887K250
52630H0372K397K442K435K419K428K350K000J420Q13J91n46j168j255q78o35q97
52614I3888j439j984k547k976k792j961j226j228j722k144k472k832k831k062
52600F3672j012n70q09j044r69r51j149j183q94o14m85k08K28K10o34j702k082
52583D9804j600q65m07k09KK49K20l14r74r76p3R61J194P05L21L32K97J00L44
52564D9111J252K018J769P14k77p97j025j048p75m02l26n70p43o45n17n82o93
52547D6464o16m32m68q19j152j045n16m3L9q0p8p3l38n91k07P68J481J380Q84
$$ y = [48241, 48556, 48281, 47444, 46580, 46119, 46107, 46421, 47022, 47964, 49287, 50958, 52813, 54590, 56151, 57629, 59207, 60800, 62158, 63262, 64380, 65664, 66997, 68296, 69700, 71261, 72719, 73850, 74872, 76235, 78122, 80372, 82769, 85211, 87646, 90065, 92493, 94843, 96843, 98263, 99076, 99267, 98721, 97553, 96298, 95420, 94785, 93888, 92449, 90465, 87918, 84942, 82150, 80189, 78963, 77735, 76013, 73869, 71397, 68565, 65734, 63672, 62660, 62090, 61281, 60237, 59268, 58317, 57168, 55985, 55091, 54477, 53992, 53784, 54012, 54222, 53588, 51886, 49804, 48204, 47339, 46932, 46723, 46725, 46974, 47194, 46880, 45906, 44930, 44857, 45818, 47012, 47717, 48038, 48370, 48667, 48767, 49111, 50363, 52381, 54150, 54864, 54587, 53790, 52765, 51717, 50942, 50540, 50214, 49644, 48901, 48256, 47739, 47157, 46464, 45848, 45416, 44948, 44129, 42977, 41932, 41416, 41373, 41412, 41332, 41254, 41181, 40843, 40252, 40045, 40813, 42294, 43674, 44558]
52528D4558N67L11j39l56K50J298J704J065J01m03m31k74J26R43J866K227J682
52511E5095N91l19n85m04l89q60j408j422q79l24m4K49P99J255J174P35M94N50
52493E4308N02K36K15P23J237J051K82k70k17K9R9K82R52J740J869J197L36k15
52475F4356n83j015j349j259p43j10L83O18N97M32L15L08L18K66J80N0j13o4N61
52456F3148J644K462K410J612O81rm25n82m76k54j21o8N2J87J48J8J79Q20J556
52437G2982J780J372Q13N65M72P1n70p84k48M66O88N57N66N83J86k71j2O60M23
52418H0299j040k281k063j043m89l21K44Q68N50l89n34L37Q40K47l30J71J052
52401G6118J130O40N89Q72M25r05j953j832j017m73l71j72M06R72R26J79o64q85
$$ y = [44558, 45125, 45436, 45297, 44941, 45191, 46489, 48193, 49258, 49359, 48956, 48525, 48251, 48377, 49320, 51186, 53413, 55095, 55686, 55367, 54782, 54378, 53989, 53129, 51721, 50299, 49420, 49096, 49052, 49301, 50100, 51355, 52529, 53264, 53758, 54308, 54810, 55046, 55261, 55984, 57221, 58272, 58554, 58284, 58067, 58096, 58195, 58477, 59429, 61169, 63038, 64235, 64571, 64356, 63773, 62758, 61409, 60150, 59407, 59297, 59680, 60298, 60895, 61327, 61642, 61950, 62268, 62534, 62714, 62764, 62651, 62587, 63148, 64792, 67254, 69664, 71276, 71957, 71948, 71523, 70941, 70465, 70211, 70090, 70022, 70074, 70261, 70409, 70427, 70606, 71426, 72982, 74762, 76134, 76947, 77512, 77984, 78055, 77485, 76701, 76453, 76919, 77607, 78164, 78730, 79313, 79499, 79228, 79216, 79876, 80299, 79259, 76978, 74915, 73872, 73383, 73062, 73306, 74174, 74724, 74335, 73801, 74138, 74978, 75225, 74895, 75066, 76118, 77248, 77888, 78477, 79349, 79774, 78869, 76916, 75084, 74067, 73594, 73223, 73051, 73457, 74429, 75355, 75534, 74870, 73985]
52383G3985m23J01J97O6J29K88J54k42m17j11M30Q96J216J310R67J99n67r51r88
52364G6239q51m14M54J379J679J195N55L51L90P1o80j268j204o09R9O85J039J051
52346H0161P98N65L95m2q22j288p72M10J224J177P02L49J18j78m76o09n19j65
52328H1028M09Q50P16J07m00n69o97q25m62N38J460J670J466J404J258N41l88
52311H8106o38r4M18L57N9J5K40N97J088J522J456Q11K02K39Q02J261J193O68
52293I8302J05M3Q18K109L007K754J500J57m25r2P06J432J892K169K251J943J245
52276A19916N49K29K41L41N11Q39J101R33L82p6q4K76P07Q67M66m48j341j709
52258A23700j611j337p89J74R96R08J39k78l4P1m44q82n07L03P79Q46P46K90n42
$$ y = [73985, 73562, 73663, 73860, 73926, 74055, 74343, 74497, 74255, 73838, 73727, 74157, 75053, 76269, 77579, 78546, 78745, 78178, 77227, 76239, 75388, 74974, 75428, 76807, 78486, 79681, 80236, 80587, 80977, 81048, 80368, 79100, 77896, 77287, 77386, 78071, 79110, 80161, 80959, 81524, 81919, 81877, 81055, 79767, 78995, 79405, 80629, 81806, 82508, 82857, 82975, 82797, 82321, 81712, 81193, 81028, 81437, 82287, 83003, 83110, 82710, 82141, 81444, 80619, 80157, 80695, 82155, 83825, 85291, 86695, 87953, 88494, 88106, 87468, 87374, 87792, 88149, 88208, 88223, 88463, 89060, 90148, 91670, 93126, 93937, 94139, 94378, 95180, 96441, 97634, 98302, 98407, 98450, 99268, 101377, 104384, 107138, 108638, 108795, 108370, 108278, 108984, 110416, 112308, 114477, 116728, 118671, 119916, 120465, 120694, 120935, 121276, 121787, 122626, 123727, 124660, 125042, 124966, 124882, 125158, 125865, 126732, 127198, 126750, 125409, 123700, 122089, 120752, 119963, 120137, 121133, 122041, 122180, 121902, 121868, 121939, 121495, 120613, 120106, 120409, 121188, 122034, 122780, 123070, 122528]
52239A22528q07M03K378L329K565J198N51P24J067J269J498J927K516L078L338
52224A47562L155K773K545K434K134J667J378J344J250J000R53J342J859K060
52210A73456J835J321O51M6j26L50J252K083K384J988J212P72J098J740J885J436
52194A93383J110J358J815K034K160K463K722K587K191J905J757J580J562K074
52180B20701L020L798L881L226K153J218J038J798K839L197K643J906J786K292
52166B55496K811K897K597K187J846J694J920K565L221L247K493J641J499K069
52152B88183K662K791K554K167J675J292J402J986K513K739L110L920M561M287
52138C25842L348K683K688K963L180L474L880M052L789L317K870K413J987J798
$$ y = [122528, 121721, 122124, 124502, 127831, 130396, 131594, 132145, 132869, 133936, 135205, 136703, 138630, 141146, 144224, 147562, 150717, 153490, 156035, 158469, 160603, 162270, 163648, 164992, 166242, 167242, 168195, 169537, 171396, 173456, 175291, 176612, 177263, 177309, 177183, 177533, 178785, 180868, 183252, 185240, 186452, 187224, 188322, 190062, 191947, 193383, 194493, 195851, 197666, 199700, 201860, 204323, 207045, 209632, 211823, 213728, 215485, 217065, 218627, 220701, 223721, 227519, 231400, 234626, 236779, 237997, 239035, 240833, 243672, 246869, 249512, 251418, 253204, 255496, 258307, 261204, 263801, 265988, 267834, 269528, 271448, 274013, 277234, 280481, 282974, 284615, 286114, 288183, 290845, 293636, 296190, 298357, 300032, 301324, 302726, 304712, 307225, 309964, 313074, 316994, 321555, 325842, 329190, 331873, 334561, 337524, 340704, 344178, 348058, 352110, 355899, 359216, 362086, 364499, 366486, 368284]
52124C68284J819J714J467J583K314L083L097K331J415P68L89L02O62J244J381
52109C91853P42j32l89J28P81R41O87N17O89R93J025N21m84j566k070j658p79
52092C91799k76m84r55j143j075j051j099j074j067j302j669j819j748j847k293
52077C72897k673k431j566o95m48q69j378j375q97n96r68j791k438k568k332k045
52061C47827j891j825j594j016m47o46j765k799k658j621j058j665k644k911k372
52046C20915j697j297j116j096j310j703k044k110j762r76o2M25K26k81n18k81
52030C05313K84J042J885K545K764K589K253J837J354J107J482K384L125L094
52016C33058K409J735J621K023K474K597K480K538K955L402L375K760J929J349
$$ y = [368284, 370103, 371817, 373284, 374867, 377181, 380264, 383361, 385692, 387107, 387875, 388264, 388566, 389228, 390472, 391853, 392595, 392463, 392074, 392202, 392983, 393924, 394611, 395128, 395817, 396810, 397835, 398356, 397872, 396306, 394236, 392578, 391799, 391523, 391039, 390084, 388941, 387866, 386815, 385716, 384642, 383575, 382273, 380604, 378785, 377037, 375190, 372897, 370224, 367793, 366227, 365532, 365084, 364215, 362837, 361462, 360565, 359969, 359001, 357210, 354772, 352204, 349872, 347827, 345936, 344111, 342517, 341501, 341054, 340408, 338643, 335844, 333186, 331565, 330507, 328842, 326198, 323287, 320915, 319218, 317921, 316805, 315709, 314399, 312696, 310652, 308542, 306780, 305804, 305742, 306167, 306393, 306112, 305594, 305313, 305597, 306639, 308524, 311069, 313833, 316422, 318675, 320512, 321866, 322973, 324455, 326839, 329964, 333058, 335467, 337202, 338823, 340846, 343320, 345917, 348397, 350935, 353890, 357292, 360667, 363427, 365356, 366705]
52002C66705J249J622K306K956L146K700J896J246J071J353J924K628L255L542
51988C97599L396L013K600K055J192K46k16J2M81O30L77k3l68m89k09L14M39k63
51970D10786j341j978k016j944k004j987j914k205k898l379l184k671k407k347
51956C78511k070j562j287j565k185k624k576k259k229k664l002k602j734j302
51942C48850j569j856j701j478j495j226k35P88P98j50j077j566k062k726l027
51927C30268k755k555k954l498l415k797k475k863l549l992m188m406m662m747
51913B81412m701m835n267n696n879o019o374o735o709o421o337o481o439o186
51899A97333o168o311n800m330k839k321k522k624k664l271m259m658m094l205
$$ y = [366705, 367954, 369576, 371882, 374838, 377984, 380684, 382580, 383826, 384897, 386250, 388174, 390802, 394057, 397599, 400995, 404008, 406608, 408663, 409855, 410101, 409885, 409897, 410378, 411008, 411385, 411362, 410994, 410505, 410296, 410610, 411049, 410786, 409445, 407467, 405451, 403507, 401503, 399516, 397602, 395397, 392499, 389120, 385936, 383265, 380858, 378511, 376441, 374879, 373592, 372027, 369842, 367218, 364642, 362383, 360154, 357490, 354488, 351886, 350152, 348850, 347281, 345425, 343724, 342246, 340751, 339525, 339290, 340078, 340876, 340726, 339649, 338083, 336021, 333295, 330268, 327513, 324958, 322004, 318506, 315091, 312294, 309819, 306956, 303407, 299415, 295227, 290821, 286159, 281412, 276711, 271876, 266609, 260913, 255034, 249015, 242641, 235906, 229197, 222776, 216439, 209958, 203519, 197333, 191165, 184854, 179054, 174724, 171885, 169564, 167042, 164418, 161754, 158483, 154224, 149566, 145472, 142267]
51885A42267k531j936j308r44q92p42m65o97j726k799l066k632k115j649j017
51870A17748m51n11j183j763j739j336j052j041j114j085r39p46n51l40r9R3Q6
51853A03977j17l10k90j50k41p79j509j821j287j86P10R16O24K73Qj40P5P35J272
51834A01760R96J02m98m06j38j15q6P7j70j102j841j353j7P28L02l93m58k09l98
51815I6781q98r10k31M26M72J93K02N15O25L46J44M73J090J343J019O16O62J013
51797A03881J073O00P1Q9O10R40N72j88n44j52N03P06L12j81k71M5L69M08L03
51778A09146M14P92J028O89r8p89j018q37l47M33J271J703J596J387J486J729
51762A18585J769J646J595J582J368R04K87l89p95l88Q17J791J562M96j65J23
$$ y = [142267, 139736, 137800, 136492, 135548, 134656, 133914, 133449, 132752, 131026, 128227, 125161, 122529, 120414, 118765, 117748, 117297, 116786, 115603, 113840, 112101, 110765, 109713, 108672, 107558, 106473, 105534, 104788, 104237, 103897, 103798, 103891, 103977, 103860, 103550, 103260, 103110, 102869, 102090, 100581, 98760, 97473, 97287, 97997, 98913, 99537, 99810, 99818, 99678, 99753, 100488, 101760, 102756, 102858, 102360, 101954, 101816, 101701, 101615, 101692, 101522, 100420, 98579, 97226, 97209, 97937, 98239, 97846, 97388, 97179, 96781, 95883, 94973, 94742, 95168, 95640, 95833, 96035, 96550, 97175, 97521, 97665, 98138, 99228, 100571, 101590, 102206, 102868, 103881, 104954, 105554, 105625, 105714, 106324, 107264, 107836, 107648, 107104, 106952, 107455, 108161, 108473, 108292, 108021, 108066, 108435, 108843, 109146, 109560, 110352, 111380, 112069, 111971, 111182, 110164, 109327, 108980, 109413, 110684, 112387, 113983, 115370, 116856, 118585, 120354, 122000, 123595, 125177, 126545, 127449, 127736, 127347, 126552, 126164, 126981, 128772, 130334, 130830, 130665, 130788]
51746A30788P79J191J371J505J658K033K774L381L075K016J261J274J331R04O66
51731A56007J449K847L777L879L584L188K739K611L299M549N411N308M531L593
51717B06772K618J537N01j25j43J89J93o94k259l587m002l710l276k839k234j633
51701A87308j515k027k701k933k462j471m17K61M61L48l6q48j884k388j877q83
51685A66936l89o49j053j114j064j328j811j985j538q08n13r96j794k156j923
51670A47815j554j294q89k72O9o7n7N87J217Q36l38j041o58Q1K67n3k11J07O00
51651A45145P25J73p74j315r07j9L33j91q68r22m32J0P9p3j65n8K05M13L67Q4
51631A41810k51n60q48j003q89o79p25j022j094n46M43J265J329M63q82j822j705
$$ y = [130788, 131567, 132758, 134129, 135634, 137292, 139325, 142099, 145480, 148555, 150571, 151832, 153106, 154437, 155341, 156007, 157456, 160303, 164080, 167959, 171543, 174731, 177470, 180081, 183380, 187929, 193340, 198648, 203179, 206772, 209390, 210927, 211428, 211303, 211160, 211349, 211542, 210848, 208589, 205002, 201000, 197290, 194014, 191175, 188941, 187308, 185793, 183766, 181065, 178132, 175670, 174199, 173782, 174043, 174504, 174852, 174816, 173968, 172084, 169696, 167819, 166936, 166547, 165898, 164845, 163731, 162667, 161339, 159528, 157543, 156005, 155197, 154684, 153688, 151894, 149738, 147815, 146261, 144967, 144078, 143806, 143875, 143808, 143751, 144338, 145555, 146391, 146053, 145012, 144354, 144435, 144702, 144649, 144438, 144545, 145145, 145870, 146043, 145269, 143954, 143047, 143028, 143361, 143170, 142302, 141380, 140948, 140958, 141037, 140964, 140799, 140741, 140946, 141359, 141726, 141810, 141559, 140999, 140151, 139148, 138259, 137580, 136855, 135833, 134739, 134193, 134636, 135901, 137230, 137693, 136811, 134989, 133284]
51614A33284o92M70J165J216O60l09j234j734j939k249k592k438j662q81o80r17
51598A19468j078r63o88l21J10M02K82k79j016j560j608j017K6J013J380R25L6
51581A15112m60O3J385K496K574J752P30p0o00p42m21q1l24j012j302p50P6L86
51563A18812M4n04p81m98L41J262J644J453J314J620K007J975J614J363J342J366
51547A34374J347J378J535J827K140K153J617Q39M40N64P64Q61J199J745J690
51532A54473O49m33l48O89J354R53O3m92m96j01M57Q71R87J184J905K776K885
51515A67376K061J227J126J417J402J128J045J099P60p1q47j035o31O2O96Q72
51499A77687K28j107k366k705k012j055p12j124j651j674j288j064j264j545j532
$$ y = [133284, 132592, 133062, 134227, 135443, 136103, 135794, 134560, 132826, 130887, 128638, 126046, 123608, 121946, 121065, 120385, 119468, 118390, 117427, 116739, 116418, 116528, 116930, 117212, 116933, 115917, 114357, 112749, 111732, 111758, 112771, 114151, 115076, 115112, 114652, 114715, 116100, 118596, 121170, 122922, 123652, 123582, 122982, 122240, 121819, 121738, 121414, 120402, 119100, 118350, 118426, 118812, 118856, 118352, 117571, 117073, 117414, 118676, 120320, 121773, 123087, 124707, 126714, 128689, 130303, 131666, 133008, 134374, 135721, 137099, 138634, 140461, 142601, 144754, 146371, 147210, 147650, 148214, 148978, 149839, 151038, 152783, 154473, 155122, 154689, 154341, 155030, 156384, 157337, 157400, 156908, 156412, 156311, 156768, 157639, 158626, 159810, 161715, 164491, 167376, 169437, 170664, 171790, 173207, 174609, 175737, 176782, 177881, 178641, 178570, 177723, 176688, 176057, 176119, 176815, 177687, 177915, 176808, 174442, 171737, 169725, 168670, 167958, 166834, 165183, 163509, 162221, 161157, 159893, 158348, 156816]
51484A56816j336j283j319j063m46Q9J01k91n99m83M0P15J114Q41M0m03L06J731
51466A54570K516K012J132J182K234L235L365K704J721P94L16N61J240J589J194
51451A80365L62m14r31j146j014p71q29j172j189n44K99P37Q86J255J826J995
51435A79715J422N11L3M70J645K760K971K177J158O89P75R55J036J134J234J200
51419A99885J073R68P51K41l83q59j370k289l401l972l678l012k610k580k693
51404A76071k722k420j575m37K07k23j384k310k346j619p75m47q73j744k402k348
51388A52653j586n77J45L03O1j65j47j14l63p68r46r08j077j516j617r88k03j89
51370A41998r66j661j689j415j423j694j850j877k043k294k221j656r19l61NK56
$$ y = [156816, 155480, 154197, 152878, 151815, 151369, 151458, 151559, 151268, 150669, 150186, 150226, 150941, 152055, 152896, 152936, 152533, 152839, 154570, 157086, 159098, 160230, 161412, 163646, 166881, 170246, 172950, 174671, 175465, 175781, 176342, 177582, 179171, 180365, 180727, 180313, 179382, 178236, 177222, 176451, 175622, 174450, 173261, 172717, 173016, 173753, 174639, 175894, 177720, 179715, 181137, 181648, 181681, 182151, 183796, 186556, 189527, 191704, 192862, 193551, 194326, 195281, 196317, 197451, 198685, 199885, 200958, 201926, 202677, 202918, 202535, 201676, 200306, 198017, 194616, 190644, 186966, 183954, 181344, 178764, 176071, 173349, 170929, 169354, 168917, 169124, 168901, 167517, 165207, 162861, 161242, 160467, 160020, 159147, 157403, 155001, 152653, 151067, 150490, 150635, 150938, 150999, 150834, 150687, 150573, 150210, 149442, 148496, 147588, 146511, 144995, 143378, 142390, 142187, 141998, 141032, 139371, 137682, 136267, 134844, 133150, 131300, 129423, 127380, 125086, 122865, 121209, 120290, 119929, 119934, 120190]
51354A20190L31J68j02l82p24j003p74J41J119J307O66k0k33k99o75j216j493
51337A17001j493j500j466r67Q8J097J319O58k61p23n56r4L21N97P14N40Q4l28
51319A15031l76j41R6K81M56L87j80r13j148p50k36J07N09R65R26K60k55P5P64
51300A15858Q70L74O7K65M48K56N8K40N56N30J16l53p61j297k070k718k698j924
51282A07817j051q05j128j333j159j096j490j874j687j187j058j407j814k088
51268H8640k307k250j526l72L94L70jj69j92m06p90r97q23m54k30k59k72L3M80
51249G8869N97L39J92L50L51o0l72k17j64p11j060j52J407J857P72l77m38k9j55
51230H0999n64m48J13M01J85j94n04o19k81N00J091R67M75K53K38n4n76q56q91
$$ y = [120190, 120521, 120689, 120587, 120205, 119481, 118478, 117704, 117845, 118964, 120271, 120937, 120917, 120684, 120385, 119710, 118494, 117001, 115508, 114008, 112542, 111575, 111663, 112760, 114079, 114737, 114476, 113753, 113197, 113103, 113424, 114021, 114735, 115275, 115359, 115031, 114655, 114514, 114610, 114891, 115347, 115734, 115554, 114641, 113493, 112743, 112507, 112614, 113123, 114088, 115014, 115274, 115019, 115094, 115858, 116728, 117102, 117169, 117434, 117882, 118138, 118196, 118436, 118992, 119522, 119638, 119285, 118524, 117227, 115157, 112439, 109741, 107817, 106766, 105961, 104833, 103500, 102341, 101245, 99755, 97881, 96194, 95007, 93949, 92542, 90728, 88640, 86333, 84083, 82557, 82185, 82579, 82949, 82948, 82779, 82587, 82181, 81391, 80394, 79571, 79117, 78887, 78628, 78356, 78389, 78869, 79466, 79805, 79997, 80347, 80698, 80638, 80266, 80049, 79885, 79174, 78114, 77962, 79369, 81226, 81998, 81621, 81183, 81154, 80999, 80435, 79987, 80100, 80501, 80686, 80492, 79988, 79369, 79088, 79588, 80679, 81646, 82121, 82374, 82612, 82558, 81982, 81126, 80235]
51211H0235j185j862k396k303j636p53J1M01M03L27M50O13N09K46K19M89P35Q09
51193G5312R23J188J345J096M79k06p41j118j463j755j670q69L91J188Q35k79
51177G4656j022o66M46J347J376P79M13P78J335J136J52n73l43J97O9n81p91k88
51159G8420K04K28K82R17J769K007J403M63l21q83j260j239o26K69P67N69J94
51142H3163L27R03J201Q64L07N0R0K13L63M22O3o80j160q98k80J07L68Q68J249
51123H7540Q19k46r24o85J1N69Q70Q60L89l25p29q11j177j925k170j299k4M95
51105H1238J17l65m42l16k49k40l15n94r28r63o33k84j85k59l44m00m02k43J27
51086G4320O26J148J512J440Q28J05j22K10N33M43J84J09M4l40p79o59OL94k8
$$ y = [80235, 79050, 77188, 74792, 72489, 70853, 70100, 70111, 70512, 70915, 71242, 71692, 72305, 72814, 73060, 73279, 73768, 74503, 75312, 76235, 77423, 78768, 79864, 80343, 80137, 79396, 78278, 76815, 75060, 73390, 72521, 72912, 74100, 74935, 74656, 73634, 72968, 73414, 74761, 76137, 76916, 77329, 78107, 79442, 80578, 80730, 80157, 79814, 80011, 80080, 79499, 78708, 78420, 78624, 78852, 79134, 80051, 81820, 83827, 85230, 85693, 85372, 84489, 83229, 81990, 81364, 81633, 82400, 82969, 83163, 83490, 84393, 85594, 86458, 86765, 86815, 86905, 87118, 87481, 87903, 87966, 87286, 86126, 85228, 84948, 85055, 85423, 86291, 87540, 88359, 88113, 87189, 86504, 86515, 87084, 87954, 88814, 89203, 88878, 88149, 87338, 86161, 84236, 82066, 80767, 80743, 81238, 81355, 80990, 80548, 80232, 79983, 79743, 79428, 78834, 77906, 76943, 76310, 76026, 75841, 75582, 75238, 74838, 74436, 74193, 74320, 74946, 76094, 77606, 79046, 79874, 79979, 79857, 80067, 80600, 81043, 81227, 81336, 81380, 81040, 80261, 79602, 79608, 80002, 79974]
51067G9974p36r12n55l18l98k81L03Q02N98j06n65m90k61k91n28o25l39K94J001
51048G6567J449J566J608J750J805J564J260J302J580J552J096Q07J147J671J532
51033I8256O00l56o15k99j8j0L9M20R18J086P42P0p02j381j694j506j143j152
51015I3255j519j565r09p8J86j6L3N59J019R26M49Rk55m06m00j39L25P70R03N21
50995I3668k24q05q26n07l78m78l33J99N84L17l96r85j174r68l80M22R02O41q
50976H9271k41J83O22M63m4j84K17O03N70M35P02J198J271P75L21M07P90J013
50958I8372J077J162J039M62j24kP03J048N80j13l51k23p7J41N74Q67O44J96J17
50939A06092L95M59R1l04l93l66m89n78k01P54J915K742L009K922K816K693K253
$$ y = [79974, 79238, 78326, 77771, 77453, 77055, 76774, 77077, 77879, 78477, 78371, 77806, 77316, 77055, 76764, 76236, 75611, 75272, 75566, 76567, 78016, 79582, 81190, 82940, 84745, 86309, 87569, 88871, 90451, 92003, 93099, 93906, 95053, 96724, 98256, 98856, 98500, 97885, 97586, 97568, 97558, 97597, 98017, 98935, 100021, 100763, 100833, 100131, 98750, 97056, 95550, 94407, 93255, 91736, 90171, 89262, 89184, 89370, 89354, 89387, 89946, 90965, 91891, 92340, 92349, 92094, 91688, 91288, 91149, 91474, 92244, 93147, 93668, 93444, 92639, 91813, 91306, 90928, 90450, 90117, 90316, 90900, 91217, 90821, 89836, 88662, 87694, 87314, 87736, 88638, 89279, 89271, 89030, 89213, 89835, 90298, 90254, 90070, 90287, 90890, 91460, 91895, 92597, 93795, 95066, 95841, 96162, 96569, 97359, 98372, 99449, 100611, 101650, 102112, 101988, 101986, 102689, 103737, 104317, 104204, 103853, 103630, 103553, 103694, 104268, 105135, 105779, 105975, 106092, 106487, 106946, 107037, 106733, 106340, 105974, 105485, 104907, 104706, 105460, 107375, 110117, 113126, 116048, 118864, 121557, 123810]
50922A23810J450Q14R89J977L103L681L568L169K984L177L404L155K393J758J956
50907A61388L011M282N116N314N019M504M084M017M266M570M796N100N655O266
50893B27388O483O076N340M824M879N456O297P130P747Q083Q344Q803R353R492
50879C25695R011Q463Q553R239R852J0065J0144J0215R904R009P972P232O468
50866D41822M978K631O2j987l273m127n154o760q743j0515j1757j2626j3182j3137
50852C58232j2473j1783j1515j1283j0483r290q411q038p719p149o408n507m414
50839B43759l523l337l564l229k014p76l83o39q27p65p47p98o57l68k95n46p05
50822B20586k97P42J978K720K474J431M38K22O59J025Q63M24K15M32Q60J170J220
$$ y = [123810, 125260, 126074, 127063, 129040, 132143, 135824, 139392, 142561, 145545, 148722, 152126, 155281, 157674, 159432, 161388, 164399, 168681, 173797, 179111, 184130, 188634, 192718, 196735, 201001, 205571, 210367, 215467, 221122, 227388, 233871, 239947, 245287, 250111, 254990, 260446, 266743, 273873, 281620, 289703, 298047, 306850, 316203, 325695, 334706, 343169, 351722, 360961, 370813, 380878, 391022, 401237, 411141, 420150, 428122, 435354, 441822, 446800, 449431, 449493, 447506, 444233, 440106, 434952, 428192, 419449, 408934, 397177, 384551, 371369, 358232, 345759, 333976, 322461, 311178, 300695, 291405, 282994, 274956, 267237, 260088, 253680, 248173, 243759, 240236, 236899, 233335, 230106, 228092, 227316, 226933, 226294, 225467, 224702, 223955, 223157, 222500, 222132, 221837, 221291, 220586, 220289, 221031, 223009, 225729, 228203, 229634, 230072, 230294, 230953, 231978, 232841, 233265, 233480, 233912, 234772, 235942, 237162]
50805B37162J171J286J605J849J793J677K012K965M050M667M770M856N259N736
50791B80858N880N783N977O697P616Q418R249J0283J1131J1212J0678J0392J0911
50778C95085J1870J2638J3098J3561J4147J4709J5211J5815J6596J7437J8261
50767E58428J9179K0314K1574K2640K3214K3362K3595K4480K6018K7582K8510
50756H18896K8710K8505K8087K7321K6001K4055K1491J8372J4876J1217P478L689
50744A058698N5l115n781q211j0434j1886j1923j0649q873p183n413l208p45J522
50730I72854L546N617P687R361J0727J2513J5117J7994K0456K2620K4921K7120
50718A150533K8486K8860K8734K8247K6878K4334K1003J7355J3381R060M805R96
$$ y = [237162, 238333, 239619, 241224, 243073, 244866, 246543, 248555, 251520, 255570, 260237, 265007, 269863, 275122, 280858, 286738, 292521, 298498, 305195, 312811, 321229, 330478, 340761, 351892, 363104, 373782, 384174, 395085, 406955, 419593, 432691, 446252, 460399, 475108, 490319, 506134, 522730, 540167, 558428, 577607, 597921, 619495, 642135, 665349, 688711, 712306, 736786, 762804, 790386, 818896, 847606, 876111, 904198, 931519, 957520, 981575, 1003066, 1021438, 1036314, 1047531, 1055009, 1058698, 1058753, 1055638, 1049857, 1041646, 1031212, 1019326, 1007403, 996754, 987881, 980698, 975285, 972077, 971332, 972854, 976400, 982017, 989704, 999065, 1009792, 1022305, 1037422, 1055416, 1075872, 1098492, 1123413, 1150533, 1179019, 1207879, 1236613, 1264860, 1291738, 1316072, 1337075, 1354430, 1367811, 1376871, 1381676, 1382672]
50706A382672k502o035r707j3576j7848k2419k6647l0087l3108l6171l8847m0251
50694A105474m0283l9775l9328l8681l7327l5238l2757l0206k7808k5619k3382
50683G35070k0738j7700j4661j1905r391p032m764k349M19L204N312O550P497
50670F69512Q678R975J1121J2247J3494J4541J5036J5203J5462J5670J5330J4396
50658H30665J3242J1933J0217Q316P043O817P075P013O516N962N544N294N573
50645I31210O824Q825J0682J1779J2437J3449J5150J7191J9023K0356K1208K1680
50633A109814K1763K1347K0409J9214J8226J7675J7310J6680J5719J4965J5033
50622A308155J5990J7283J8328J9081J9878K0825K1602K1945K2130K2672K3758
$$ y = [1382672, 1380170, 1374135, 1364428, 1350852, 1333004, 1310585, 1283938, 1253851, 1220743, 1184572, 1145725, 1105474, 1065191, 1025416, 986088, 947407, 910080, 874842, 842085, 811879, 784071, 758452, 735070, 714332, 696632, 681971, 670066, 660675, 653643, 648879, 646530, 646949, 650153, 655465, 662015, 669512, 678190, 688165, 699286, 711533, 725027, 739568, 754604, 769807, 785269, 800939, 816269, 830665, 843907, 855840, 866057, 874373, 881416, 888233, 895308, 902321, 908837, 914799, 920343, 925637, 931210, 938034, 946859, 957541, 969320, 981757, 995206, 1010356, 1027547, 1046570, 1066926, 1088134, 1109814, 1131577, 1152924, 1173333, 1192547, 1210773, 1228448, 1245758, 1262438, 1278157, 1293122, 1308155, 1324145, 1341428, 1359756, 1378837, 1398715, 1419540, 1441142, 1463087, 1485217, 1507889, 1531647]
50611A531647K5253K7218K9954L3547L7821M2881M9139N6362O3236O8526P2344
50600B037928P5574P8234P9220P7764P4234O9328O3326N6552M9766M3382L6897
50589B742205K9805K2514J5647Q944J771n577j2168j7838k3188k8164l1845l3940
50577B668166l5300l6384l6290l4123l0525k6838k3440j9879j6215j3074j0580
50566B385518q361o662o336p552r411j1214j3201j5555j7572j8611j9230k0469
50554B231344k2223k3176k2331j9961j6915j3693j0437p296m428j860J99J193
50542B090416P39p92k594m442o937j0671j5455k0668k6028l1528l6846m1321m4669
50529A849204m7189m9098n0134n0059m9110m7576m5335m2283l8886l5679l2542
$$ y = [1531647, 1556900, 1584118, 1614072, 1647619, 1685440, 1728321, 1777460, 1833822, 1897058, 1965584, 2037928, 2113502, 2191736, 2270956, 2348720, 2422954, 2492282, 2555608, 2612160, 2661926, 2705308, 2742205, 2772010, 2794524, 2810171, 2819115, 2820886, 2815309, 2803141, 2785303, 2762115, 2733951, 2702106, 2668166, 2632866, 2596482, 2560192, 2526069, 2495544, 2468706, 2445266, 2425387, 2409172, 2396098, 2385518, 2377157, 2370495, 2364159, 2356607, 2347196, 2335982, 2322781, 2307226, 2289654, 2271043, 2251813, 2231344, 2209121, 2185945, 2163614, 2143653, 2126738, 2113045, 2102608, 2095312, 2090884, 2089024, 2089223, 2090416, 2091155, 2090363, 2087769, 2083327, 2076390, 2065719, 2050264, 2029596, 2003568, 1972040, 1935194, 1893873, 1849204, 1802015, 1752917, 1702783, 1652724, 1603614, 1556038, 1510703, 1468420, 1429534, 1393855, 1361313]
50518A361313k9077k5582k2854k0988j9119j6645j3979j1801j0103q381o342m016
50506A172426j535P60K416L463M609O432Q661J0607J2000J3018J3862J4878J6709
50493A278306J9701K3306K6719K9998L3863L8514M3367M8061N2936N8287O3665
50482A716723O8306P1822P4206P5502P5687P4612P2000O7974O3668O0718N9688
50471B480906N9440N8467N6586N4790N3822N3331N2452N0767M8633M6808M5895
50460C061897M6004M6969M8692N1046N3396N4761N4764N4040N3317N2205M9345
50449C626436M3691L5342K5225J4258K909q748k0715l2739m4299n4864o4056p1563
50437C450877p7147q0771q2372q1483p7505p0718o2574n4495m6616l8195k9122
$$ y = [1361313, 1332236, 1306654, 1283800, 1262812, 1243693, 1227048, 1213069, 1201268, 1191165, 1182784, 1176442, 1172426, 1170891, 1171651, 1174067, 1177530, 1182139, 1188571, 1197232, 1207839, 1219839, 1232857, 1246719, 1261597, 1278306, 1298007, 1321313, 1348032, 1378030, 1411893, 1450407, 1493774, 1541835, 1594771, 1653058, 1716723, 1785029, 1856851, 1931057, 2006559, 2082246, 2156858, 2228858, 2296832, 2360500, 2421218, 2480906, 2540346, 2598813, 2655399, 2710189, 2764011, 2817342, 2869794, 2920561, 2969194, 3016002, 3061897, 3107901, 3154870, 3203562, 3254608, 3308004, 3362765, 3417529, 3471569, 3524886, 3577091, 3626436, 3670127, 3705469, 3730694, 3744952, 3747861, 3739113, 3718398, 3685659, 3641360, 3586496, 3522440, 3450877, 3373730, 3292959, 3210587, 3129104, 3051599, 2980881, 2918307, 2863812, 2817196, 2779001, 2749879]
50426B749879k0455j3492q833o447o200q092j2217j8635k7122l7032m7472n7521
50414B486361o6176p2545p6560p9270q1751q3737q4006q2147p9272p6641p4262
50403A629994p1331o7563o3474n9556n5796n2009m8224m4582m1042l7402l3540
50392A055475k9633k6068k3051k0398j7852j5536j3758j2348j0676q450o122m192
50380H67391k470m82J687L426M461N213O214P534Q974J0570J2563J4949J7322
50367I57352J9317K1106K3172K5634K8019K9902L1500L3370L5595L7747L9552
50356A282266M1169M2693M3880M4582M5077M5706M6452M7180M7884M8470M8604
50345A783963M8177M7666M7561M7678M7421M6570M5269M3420M0697L7228L3668
$$ y = [2749879, 2729424, 2715932, 2707099, 2700652, 2694452, 2686360, 2674143, 2655508, 2628386, 2591354, 2543882, 2486361, 2420185, 2347640, 2271080, 2191810, 2110059, 2026322, 1942316, 1860169, 1780897, 1704256, 1629994, 1558663, 1491100, 1427626, 1368070, 1312274, 1260265, 1212041, 1167459, 1126417, 1089015, 1055475, 1025842, 999774, 976723, 956325, 938473, 922937, 909179, 896831, 886155, 877705, 871583, 867391, 864921, 864439, 866126, 869552, 874013, 879226, 885440, 892974, 901948, 912518, 925081, 940030, 957352, 976669, 997775, 1020947, 1046581, 1074600, 1104502, 1136002, 1169372, 1204967, 1242714, 1282266, 1323435, 1366128, 1410008, 1454590, 1499667, 1545373, 1591825, 1639005, 1686889, 1735359, 1783963, 1832140, 1879806, 1927367, 1975045, 2022466, 2069036, 2114305, 2157725, 2198422, 2235650, 2269318]
50334B269318L0328K6671K1899J5815Q843J426o315j4452k2917l1389l9379m6469
50322B213379n2411n6895n9463n9905n8707n6709n4289n1029m6423m0631l4505
50311A642412k8980k4529k0968j7695j4308j1138r059q729j0126j2892j6742k1352
50299A445894k6032k9945l2655l4355l5517l6434l7081l7254l6826l5932l4892
50288A068971l3915l2903l1593k9835k7770k5700k3897k2390k0971j9442j7858
50277G82697j6445j5212j3819j1971r846p932o474n201l733k136r42n78r02j335
50263F86171j377r10o1R79J973K628K785K605K448K614L113L681L994M038M333
50248G19014N483P426R224R894R333Q308P664P771Q580R784J0909J1491J1326
$$ y = [2269318, 2299646, 2326317, 2348216, 2364031, 2372874, 2374300, 2367985, 2353533, 2330616, 2299227, 2259848, 2213379, 2160968, 2104073, 2044610, 1984705, 1925998, 1869289, 1815000, 1763971, 1717548, 1676917, 1642412, 1613432, 1588903, 1567935, 1550240, 1535932, 1524794, 1515735, 1507006, 1496880, 1483988, 1467246, 1445894, 1419862, 1389917, 1357262, 1322907, 1287390, 1250956, 1213875, 1176621, 1139795, 1103863, 1068971, 1035056, 1002153, 970560, 940725, 912955, 887255, 863358, 840968, 819997, 800555, 782697, 766252, 751040, 737221, 725250, 715404, 707472, 700998, 695797, 692064, 689928, 688986, 688408, 687506, 686171, 684794, 683884, 683823, 684802, 686775, 689403, 692188, 694793, 697241, 699855, 702968, 706649, 710643, 714681, 719014, 724497, 731923, 741147, 751041, 760374, 768682, 776346, 784117, 792697, 802481, 813390, 824881, 836207]
50235H36207J0482R157P649O330N311M204K544L89j797l769n645p413q796r684
50221H45169j0333j0998j1777j2801j4092j5120j5142j4236j3411j3242j3053
50210G00964j1989j0442r595r794j0174r883q968q019p499p506p718p494o515
50197E85368n375n000n431n701n053l844k949k798l234l827m088l681k800k046
50183E29541j741j642j534j545j675j520r41n50q96j566j695j183p29p44r04q14
50167E09862m88n9M29P62O06K4m48m91l97n44q00p77m42j56k34o36j061j247j249
50148E02654j404j793j895j140K07J179J224P81N14M81L51J9l46n57l86L82J476
50131E01747K101J842J287J287J872K450K761L042L334L399L257L204L193K845
$$ y = [836207, 846689, 855846, 863495, 869825, 875136, 879340, 881884, 882273, 880476, 876707, 871062, 863649, 854853, 845169, 834836, 823838, 812061, 799260, 785168, 770048, 754906, 740670, 727259, 714017, 700964, 688975, 678533, 668938, 659144, 648970, 639087, 630119, 622100, 614601, 607095, 599377, 591883, 585368, 579993, 574993, 569562, 563861, 558808, 554964, 552015, 549217, 545983, 542156, 538068, 534387, 531587, 529541, 527800, 526158, 524624, 523079, 521404, 519884, 518943, 518393, 517497, 515931, 514236, 513053, 512324, 511580, 510676, 509862, 509374, 509315, 509744, 510506, 511112, 511136, 510688, 510197, 509800, 509256, 508456, 507679, 507237, 507081, 506847, 506211, 505150, 503903, 502654, 501250, 499457, 497562, 496422, 496629, 497808, 499032, 499813, 500327, 500808, 501159, 501178, 500832, 500275, 499889, 500271, 501747, 503848, 505690, 506977, 508264, 510136, 512586, 515347, 518389, 521723, 525122, 528379, 531583, 534776, 537621]
50117E37621K219J981K523L445M090M229L982L486K909K454K158J942J906K165
50103E77110K435K299K014K354L452M455M705M649N019N711O139O256O484O912
50089F39994P243P371P404P257O785O279O247O689P148P433P805Q440R133R569
50075G44797R611R261Q728Q382Q374Q369Q066P685P573P551P274O983P260Q118
50061H58032R061R914J0899J1907J2577J3244J4907J7907K1347K4207K6382K8344
50049A058728L0464L3109L6816M1716M7242N2898N8929O5721P2902P9550Q5059
50038A663134Q9367R2588R4736R5584R4408R0330Q3277P4391O5214N6659M9079
50027B548767M2683L7471L2990K8628K3854J7989J0202K29j1338k3877l7386n1803
$$ y = [537621, 539840, 541821, 544344, 547789, 551879, 556108, 560090, 563576, 566485, 568939, 571097, 573039, 574945, 577110, 579545, 581844, 583858, 586212, 589664, 594119, 598824, 603473, 608492, 614203, 620342, 626598, 633082, 639994, 647237, 654608, 662012, 669269, 676054, 682333, 688580, 695269, 702417, 709850, 717655, 726095, 735228, 744797, 754408, 763669, 772397, 780779, 789153, 797522, 805588, 813273, 820846, 828397, 835671, 842654, 849914, 858032, 867093, 877007, 887906, 899813, 912390, 925634, 940541, 958448, 979795, 1004002, 1030384, 1058728, 1089192, 1122301, 1159117, 1200833, 1248075, 1300973, 1359902, 1425623, 1498525, 1578075, 1663134, 1752501, 1845089, 1939825, 2035409, 2129817, 2220147, 2303424, 2377815, 2443029, 2499688, 2548767, 2591450, 2628921, 2661911, 2690539, 2714393, 2732382, 2742584, 2742813, 2731475, 2707598, 2670212, 2618409]
50015B618409o6116p8789q8698r5274r8288r8214r6263r3317q9194q3699p7752
50004A652805p2362o7073o0731n3612m7382m2876l9297l5873l2936l0750k8579
49993A141334k5730k2599j9931j7764j5888j4606j4092j3583j2166j0047q250
49982I66678p257o668o019n253m418l521k606j653n05P25J506J655J886L014M773
49967I42337O118O633O895P522Q465R410J0260J0995J1541J1996J2639J3501J4338
49954A072650J5103J6069J7252J8199J8634J8915J9410J9816J9670J9391K0076
49943A275185K2127K4638K6494K7670K9018L1050L3520L6117L9010M2456M6439
49932A633724N0905N6053O1991O8535P5644Q3686R2783J02271J11506J20856J31029
$$ y = [2618409, 2552293, 2473504, 2384806, 2289532, 2191244, 2093030, 1996767, 1903450, 1814256, 1730557, 1652805, 1580443, 1513370, 1452639, 1399027, 1351645, 1308769, 1269472, 1233599, 1200663, 1169913, 1141334, 1115604, 1093005, 1073074, 1055310, 1039422, 1024816, 1010724, 997141, 984975, 974928, 966678, 959421, 952753, 946734, 941481, 937063, 933542, 930936, 929283, 928778, 929503, 931009, 932664, 934550, 937564, 942337, 948455, 955088, 961983, 969505, 977970, 987380, 997640, 1008635, 1020176, 1032172, 1044811, 1058312, 1072650, 1087753, 1103822, 1121074, 1139273, 1157907, 1176822, 1196232, 1216048, 1235718, 1255109, 1275185, 1297312, 1321950, 1348444, 1376114, 1405132, 1436182, 1469702, 1505819, 1544829, 1587285, 1633724, 1684629, 1740682, 1802673, 1871208, 1946852, 2030538, 2123321, 2225592, 2337098, 2457954, 2588983]
49921B588983J41390J49789J54356J54782J51708J45711J37376J27709J17786
49912C869590J08270R9540R1854Q5018P8287P0861O1954N0309L4596J4877p100
49901D558056k9755n2946p6508r8604j17005j31506j43478j53273j59763j62655
49891C432563j63408j63170j61306j56965j50844j44211j37050j28617j19244
49882B107748j10253j02141r4128q5654p7329p0097o4151n9015n4193m9457m4892
49871A296438m0905l7750l5055l2151k9102k6811k5808k5410k4551k3058k1628
49860I74209k0639j9639j8175j6536j5418j4996j4803j4375j3669j2767j1499
49849H01693r677p532n623m313l507k924k411j971j629j412j284j029m05N04J271
$$ y = [2588983, 2730373, 2880162, 3034518, 3189300, 3341008, 3486719, 3624095, 3751804, 3869590, 3977860, 4077400, 4169254, 4254272, 4332559, 4403420, 4465374, 4515683, 4550279, 4565156, 4558056, 4528301, 4475355, 4398847, 4300243, 4183238, 4051732, 3908254, 3754981, 3595218, 3432563, 3269155, 3105985, 2944679, 2787714, 2636870, 2492659, 2355609, 2226992, 2107748, 1997495, 1895354, 1801226, 1715572, 1638243, 1568146, 1503995, 1444980, 1390787, 1341330, 1296438, 1255533, 1217783, 1182728, 1150577, 1121475, 1094664, 1068856, 1043446, 1018895, 995837, 974209, 953570, 933931, 915756, 899220, 883802, 868806, 854003, 839628, 825959, 813192, 801693, 792016, 784484, 778861, 774548, 771041, 768117, 765706, 763735, 762106, 760694, 759410, 758381, 757976, 758480, 759751]
49834G59751J649J912K446L142L521L479L514M148N407O993Q619R979J0743J0985
49820H36288J1435J2868J5253J7891K0315K2648K5071K7563L0291L3671L7665
49809A090959M1607M5239M9348N4697O0784O6580P2212P8842Q6768R4686J01106
49798A842828J05496J07591J06614J02068R4638Q5554P5568O5244N5682M7928
49788B689211M1948L6963L2507K8250K3158J5882N942o351k1023l8234n6874p4518
49776B676861q9248j00711j09065j13994j15356j13933j10721j06044j00031r3327
49766A624431q6612p9850p2767o5668n9051n2848m6799m1329l7160l4173l1423
49755A016751k8346k5247k2553k0213j8075j6249j4831j3656j2523j1412j0361
$$ y = [759751, 761400, 763312, 765758, 768900, 772421, 775900, 779414, 783562, 788969, 795962, 804581, 814560, 825303, 836288, 847723, 860591, 875844, 893735, 914050, 936698, 961769, 989332, 1019623, 1053294, 1090959, 1132566, 1177805, 1227153, 1281850, 1342634, 1409214, 1481426, 1560268, 1647036, 1741722, 1842828, 1948324, 2055915, 2162529, 2264597, 2359235, 2444789, 2520357, 2585601, 2641283, 2689211, 2731159, 2768122, 2800629, 2828879, 2852037, 2867919, 2873861, 2867510, 2846487, 2808253, 2751379, 2676861, 2587613, 2486902, 2377837, 2263843, 2148487, 2034554, 1923833, 1817789, 1717758, 1624431, 1537819, 1457969, 1385202, 1319534, 1260483, 1207635, 1160836, 1119507, 1082347, 1048174, 1016751, 988405, 963158, 940605, 920392, 902317, 886068, 871237, 857581, 845058, 833646, 823285]
49744H23285r390q586q064p744p441p109o742o083m879l505k840l258m056m230
49730G39358l665l215l582m438m822m298l406k953l058l182k989k759k901l400
49716F90690l931m276m363m138l615k924k139j193j71N72P53M46j23p88j266j105
49700F62429k19Q02J303J232Q93M22n4j25M36J094J165Q03P21J074J393J565J991
49683F76925K566K505J586P88R69J626J638Q57J56R7L27L26J03k0Q3K81L34N0
49665F91197n56j153j344j079p29p01j093j749k455l073l588m059m459m581m174
49650F56404l232k080j195q54r80j221j301j307j550k067k424k113j142r4M25
49635F35269L21l2k35j85j2J57L04M45N57N72M59K99K82N06P25N03k06p93o78
$$ y = [823285, 813895, 805309, 797245, 789501, 782060, 774951, 768209, 762126, 757247, 753742, 750902, 747644, 743588, 739358, 735693, 732478, 728896, 724458, 719636, 715338, 711932, 708979, 705921, 702739, 699750, 696991, 694090, 690690, 686759, 682483, 678120, 673982, 670367, 667443, 665304, 664111, 663940, 664512, 665265, 665711, 665588, 664800, 663534, 662429, 662210, 663012, 664315, 665547, 666440, 666862, 666808, 666683, 667119, 668213, 669378, 670181, 670902, 671976, 673369, 674934, 676925, 679491, 681996, 683582, 684370, 685339, 686965, 688603, 689460, 689616, 689713, 690040, 690366, 690469, 690449, 690532, 690813, 691147, 691197, 690641, 689488, 688144, 687065, 686336, 685635, 684542, 682793, 680338, 677265, 673677, 669618, 665159, 660578, 656404, 653172, 651092, 649897, 649043, 648063, 646842, 645541, 644234, 642684, 640617, 638193, 636080, 634938, 634844, 635269, 635590, 635558, 635323, 635138, 635126, 635283, 635587, 636032, 636589, 637161, 637620, 637919, 638201, 638707, 639432, 639935, 639729, 638936, 638258]
49616F38258j15J21j32j42N82J463J624J124P25P14O39K93J91P68J611J988J893
49599F51605K031K790L568L431K320J262J175J761K002J637J502K148K871K686
49585F82789J834J464K074L013L541L661L773M096M643N241N435M975M478M961
49571G35978O470P825Q053P452O830O373N905N716O288P383Q194Q378Q367Q590
49557H37802Q946R130R072Q906Q874R311J0360J1585J2148J1660J0615R813R568
49544I67790R622R726R916J0246J0499J0454J0294J0495J1209J2041J2549J2813
49532A097654J3239J4044J5128J6370J7628J8575J8943J8978J9295K0228K1507
49521A291589K2636K3281K3419K3408K3883K5136K6616K7574K8112K9040L0569
$$ y = [638258, 638143, 638264, 638132, 637990, 638572, 640035, 641659, 642783, 643508, 644222, 644861, 645154, 645345, 646113, 647724, 649712, 651605, 653636, 656426, 659994, 663425, 665745, 667007, 668182, 669943, 671945, 673582, 675084, 677232, 680103, 682789, 684623, 686087, 688161, 691174, 694715, 698376, 702149, 706245, 710888, 716129, 721564, 726539, 731017, 735978, 742448, 750273, 758326, 765778, 772608, 778981, 784886, 790602, 796890, 804273, 812467, 820845, 829212, 837802, 846748, 855878, 864950, 873856, 882730, 892041, 902401, 913986, 926134, 937794, 948409, 958222, 967790, 977412, 987138, 997054, 1007300, 1017799, 1028253, 1038547, 1049042, 1060251, 1072292, 1084841, 1097654, 1110893, 1124937, 1140065, 1156435, 1174063, 1192638, 1211581, 1230559, 1249854, 1270082, 1291589, 1314225, 1337506, 1360925, 1384333, 1408216, 1433352, 1459968, 1487542, 1515654, 1544694, 1575263]
49510A575263L1879L2292L2158L2139L2233L2096L1902L2162L2863L3422L3347
49499A931756L2619L1467L0175K8994K8007K7117K6311K5721K5204K4272K2675
49488B234318K0690J8619J6391J4054J2138J1006J0187Q893O947M666K258j31
49476B360036j972k760k770k829l346m028m432m315l577k451j561j269j053j31
49462B323542J416K733L306L356L249L184L405M043M740N097N401O200P222P613
49448B384507P253O876O625N619L455J138k59j065k287m000n386o215p238r071
49434B379952j1325j3178j4422j5661j7591k0240k2916k4941k6249k7156k7741
$$ y = [1575263, 1607142, 1639434, 1671592, 1703731, 1735964, 1768060, 1799962, 1832124, 1864987, 1898409, 1931756, 1964375, 1995842, 2026017, 2055011, 2083018, 2110135, 2136446, 2162167, 2187371, 2211643, 2234318, 2255008, 2273627, 2290018, 2304072, 2316210, 2327216, 2337403, 2346296, 2353243, 2357909, 2360167, 2360036, 2358064, 2355304, 2352534, 2349705, 2346359, 2342331, 2337899, 2333584, 2330007, 2327556, 2325995, 2324726, 2323673, 2323542, 2324958, 2327691, 2330997, 2334353, 2337602, 2340786, 2344191, 2348234, 2352974, 2358071, 2363472, 2369672, 2376894, 2384507, 2391760, 2398636, 2405261, 2410880, 2414335, 2415473, 2415214, 2414149, 2411862, 2407862, 2402476, 2396261, 2389023, 2379952, 2368627, 2355449, 2341027, 2325366, 2307775, 2287535, 2264619, 2239678, 2213429, 2186273, 2158532]
$$ [...]
##END NTUPLES=NMR SPECTRUM
##END=
