
##TITLE=UV1160_TOFR01-ROVE100A_6307068_bQqLlUrqZi
##JCAMPDX= 6.0         $$ Bruker NMR JCAMP-DX V2.0
##DATA TYPE= NMR SPECTRUM
##DATA CLASS= NTUPLES
##ORIGIN= BRUKER
##OWNER= Administrator
$$ 1.72 TOPSPIN		Version 2.1
$$ 2012-06-06 21:36:11.578 -0500  Administrator@TOPSPIN
$$ Compression mode = diff/dup
##.OBSERVE FREQUENCY= 400.13188235
##.OBSERVE NUCLEUS= ^1H
##.ACQUISITION MODE= SIMULTANEOUS (DQD)
##.ACQUISITION SCHEME= undefined
##.AVERAGES= 64
##.DIGITISER RES= 22
##SPECTROMETER/DATA SYSTEM= spect
##.PULSE SEQUENCE= noesygpps1d.comp
##.SOLVENT NAME= COFFEE_meoh
##.SHIFT REFERENCE= INTERNAL, COFFEE_meoh, 1, 14.98061
##AUDIT TRAIL= $$ (NUMBER, WHEN, WHO, WHERE, PROCESS, VERSION, WHAT)
$$ ##TITLE= Audit trail, TOPSPIN		Version 2.1
$$ ##JCAMPDX= 5.01
$$ ##ORIGIN= Bruker BioSpin GmbH
$$ ##OWNER= Administrator
$$ $$ C:\Bruker\TOPSPIN/data/COFFEE/nmr/UV1160_TOFR01-ROVE100A_6307068_bQqLlUrqZi/12/pdata/1/auditp.txt
$$ ##AUDIT TRAIL=  $$ (NUMBER, WHEN, WHO, WHERE, PROCESS, VERSION, WHAT)
(   1,<2012-06-06 21:36:05.906 -0500>,<Administrator>,<TOPSPIN>,<go>,<TOPSPIN 2.1>,
      <created by zg
	started at 2012-06-06 21:24:35.671 -0500,
	POWCHK enabled, PULCHK disabled,
       configuration hash MD5:
       D5 CA 7A 23 FE 6B EE E2 50 67 74 61 24 F7 5E 3B
       data hash MD5: 64K
       C9 D9 30 9A 61 96 81 92 9C 13 75 7D 60 4A A8 9F>)
(   2,<2012-06-06 21:36:08.843 -0500>,<Administrator>,<TOPSPIN>,<proc1d>,<TOPSPIN 2.1>,
      <Start of raw data processing
       efp LB = 0.3 FT_mod = 6 PKNL = 1 PHC0 = 0 PHC1 = 0 SI = 128K 
       data hash MD5: 128K
       6D 62 98 7F 62 96 C5 82 99 2C 46 BD 53 84 D3 F4>)
(   3,<2012-06-06 21:36:10.125 -0500>,<Administrator>,<TOPSPIN>,<proc1d>,<TOPSPIN 2.1>,
      <pk PHC0 = 34.151 PHC1 = 0 
       data hash MD5: 128K
       1A 16 CE 2C 78 68 61 F9 C2 A2 8F EA 3D DD 36 23>)
(   4,<2012-06-06 21:36:11.234 -0500>,<Administrator>,<TOPSPIN>,<proc1d>,<TOPSPIN 2.1>,
      <abs ABSG = 1 
       data hash MD5: 128K
       FD 27 77 24 4A DD 3D 55 AB 6A 2A B9 2A AB 2B AB>)
(   5,<2012-06-06 21:36:11.328 -0500>,<Administrator>,<TOPSPIN>,<proc1d>,<TOPSPIN 2.1>,
      <abs ABSG = 2 
       data hash MD5: 128K
       AA 8F B3 A2 2E 3F C2 DC 3D CE 85 F6 2E 01 3D E1>)
(   6,<2012-06-06 21:36:11.390 -0500>,<Administrator>,<TOPSPIN>,<proc1d>,<TOPSPIN 2.1>,
      <abs ABSG = 3 
       data hash MD5: 128K
       82 59 D0 DE 0E D7 17 CF 94 F2 5F 2B EB 13 8F D9>)
(   7,<2012-06-06 21:36:11.453 -0500>,<Administrator>,<TOPSPIN>,<proc1d>,<TOPSPIN 2.1>,
      <abs ABSG = 4 
       data hash MD5: 128K
       28 CA 7E FD 10 20 B5 52 8F 16 4D D5 A3 18 3E 33>)
(   8,<2012-06-06 21:36:11.500 -0500>,<Administrator>,<TOPSPIN>,<proc1d>,<TOPSPIN 2.1>,
      <abs ABSG = 5 
       data hash MD5: 128K
       02 58 13 E6 8D 13 D9 AE C5 4E A1 06 66 8F 66 4F>)
$$ ##END=
$$ 
$$ $$ hash MD5
$$ $$ FE 8F AB DB BF F3 A1 D6 71 88 CB E4 86 CC 98 CB
##$RELAX= 
##$RELAX= 
##$RELAX= 
##$RELAX= 
##$RELAX= 
##$RELAX= 
##$RELAX= 
##$RELAX= 
$$ Bruker specific parameters
$$ [...]
150 150 150 150 150 150 150 150
##$TP07= 0
##$TPNAME0= <>
##$TPNAME1= <>
##$TPNAME2= <>
##$TPNAME3= <>
##$TPNAME4= <>
##$TPNAME5= <>
##$TPNAME6= <>
##$TPNAME7= <>
##$TPOAL= (0..7)
0.5 0.5 0.5 0.5 0.5 0.5 0.5 0.5
##$TPOFFS= (0..7)
0 0 0 0 0 0 0 0
##$TUNHIN= 0
##$TUNHOUT= 0
##$TUNXOUT= 0
##$USERA1= <user>
##$USERA2= <user>
##$USERA3= <user>
##$USERA4= <user>
##$USERA5= <user>
##$V9= 5
##$VALIST= <valist>
##$VCLIST= <CCCCCCCCCCCCCCC>
##$VD= 0
##$VDLIST= <DDDDDDDDDDDDDDD>
##$VPLIST= <PPPPPPPPPPPPPPP>
##$VTLIST= <TTTTTTTTTTTTTTT>
##$WBST= 2048
##$WBSW= 25
##$XGAIN= (0..3)
0 0 0 0
##$XL= 0
##$YL= 0
##$YMAX_a= 12534252
##$YMIN_a= -10721198
##$ZGOPTNS= <>
##$ZL1= 120
##$ZL2= 120
##$ZL3= 120
##$ZL4= 120
##$ABSF1= 14.98061
##$ABSF2= -5.57192
##$ABSG= 5
##$ABSL= 3
##$ALPHA= 0
##$AQORDER= 0
##$ASSFAC= 0
##$ASSFACI= 0
##$ASSFACX= 0
##$ASSWID= 0
##$AUNMP= <proc_prof1d_extract.lims>
##$AXLEFT= 0
##$AXNAME= <>
##$AXNUC= <1H>
##$AXRIGHT= 0
##$AXTYPE= 0
##$AXUNIT= <>
##$AZFE= 0.1
##$AZFW= 0.1
##$BCFW= 0
##$BC_mod= 0
##$BYTORDP= 0
##$COROFFS= 0
##$CY= 15
##$DATMOD= 1
##$DC= 0
##$DFILT= <>
##$DTYPP= 0
##$F1P= 0
##$F2P= 0
##$FCOR= 0.5
##$FTSIZE= 131072
##$FT_mod= 6
##$GAMMA= 0
##$GB= 0
##$INTBC= 1
##$INTSCL= 1
##$ISEN= 128
##$LB= 0.3
##$LEV0= 0
##$LPBIN= 0
##$MAXI= 10000
##$MC2= 0
##$MEAN= 0
##$ME_mod= 0
##$MI= 0
##$NCOEF= 0
##$NC_proc= -1
##$NLEV= 6
##$NOISF1= 0
##$NOISF2= 0
##$NSP= 0
##$NTH_PI= 0
##$NZP= 0
##$OFFSET= 14.98061
##$PC= 1
##$PHC0= 34.151
##$PHC1= 0
##$PH_mod= 1
##$PKNL= yes
##$PPARMOD= 0
##$PPDIAG= 0
##$PPIPTYP= 0
##$PPMPNUM= 2147483647
##$PPRESOL= 1
##$PSCAL= 4
##$PSIGN= 0
##$PYNMP= <proc.py>
##$REVERSE= no
##$SF= 400.13
##$SI= 131072
##$SIGF1= 0
##$SIGF2= 0
##$SINO= 400
##$SIOLD= 131072
##$SPECTYP= <>
##$SREGLST= <1H.CDCl3>
##$SSB= 0
##$STSI= 131072
##$STSR= 0
##$SW_p= 8223.68421052632
##$SYMM= 0
##$S_DEV= 0
##$TDeff= 65536
##$TDoff= 0
##$TI= <>
##$TILT= no
##$TM1= 0
##$TM2= 0
##$TOPLEV= 0
##$USERP1= <user>
##$USERP2= <user>
##$USERP3= <user>
##$USERP4= <user>
##$USERP5= <user>
##$WDW= 1
##$XDIM= 131072
##$YMAX_p= 113373768
##$YMIN_p= -459467753
##$CURPLOT= <Network HP LaserJet P1505>
##$CURPRIN= <$Network HP LaserJet P1505>
##$DFORMAT= <normdp>
##$LAYOUT= <+/1D_H.xwp>
##$LFORMAT= <normlp>
##$PFORMAT= <normpl>
##$SURQMSG= 1
$$ End of Bruker specific parameters
$$ ---------------------------------
##NTUPLES= NMR SPECTRUM
##VAR_NAME=  FREQUENCY,     SPECTRUM/REAL,   SPECTRUM/IMAG
##SYMBOL=    X,             R,               I
##VAR_TYPE=  INDEPENDENT,   DEPENDENT,       DEPENDENT
##VAR_FORM=  AFFN,          ASDF,            ASDF
##VAR_DIM=   131072,        131072,          131072
##UNITS=     HZ,            ARBITRARY UNITS, ARBITRARY UNITS
##FACTOR=    0.0627417313425165, 1,          1
##FIRST=     8223.62146879498, -1181,        -16181
##LAST=      0,             -1127,           -16743
##MIN=       0,             -459467753,      0
##MAX=       8223.62146879498, 113373768,    0
$$ Real data points
##PAGE= N=1
##DATA TABLE= (X++(R..R)), XYDATA
$$ [...]
$$ plain form
62450 118687 121169 123795 126617 129731 133049 136528 140411 144889 149649 154174 158424 162820 167507 172091
62436 172091 176239 180082 183757 186936 189159 190383 190847 190577 189467 187674 185510 183004 179978 176525 173010
62421 173010 169576 166027 162285 158578 155104 151868 148939 146509 144520 142582 140500 138566 137048 135729
62407 135729 134225 132538 130983 129760 128889 128400 128269 128272 128166 127981 127877 127836 127717 127507 127273 126982 126608 126360
62389 126360 126481 126901 127350 127784 128430 129390 130495 131554 132536 133459 134277 134949 135469 135834 136089 136363 136660 136727
62371 136727 136304 135502 134762 134474 134762 135542 136519 137304 137793 138401 139592 141224 142710 143827 144994 146627 148596
62354 148596 150505 152258 154089 156211 158653 161351 164253 167345 170599 173893 177019 179933 182941 186434
62340 186434 190429 194583 198634 202610 206547 210311 213854 217424 221336 225595 229839 233638 236832 239676
$$ packed form
62450A18687K482K626K822L114L318L479L883M478M760M525M250M396M687M584
62436A72091M148L843L675L179K223J224M64k70j110j793k164k506l026l453l515
62421A73010l434l549l742l707l474l236k929k430j989j938k082j934j518j319
62407A35729j504j687j555j223q71m89j31Lj06j85j04m1j19k10k34k91l74k48
62389A26360J21M20M49M34O46R60J105J059R82R23Q18O72N20L65K55K74K97O7
62371A36727m23q02p40k88K88P80R77P85M89O08J191J632J486J117J167J633J969
62354A48596J909J753J831K122K442K698K902L092L254L294L126K914L008L493
62340A86434L995M154M051L976L937L764L543L570L912M259M244L799L194K844
$$ plain form
62326 239676 242610 245762 248730 251047 252814 254633 256950 259760 262971 266689 270981 275621 280320 285071
62312 285071 290139 295819 302293 309579 317570 326246 335866 346755 358909 372033 386026 401165 417730
62299 417730 435730 455077 475734 497506 519932 542512 564819 586214 605778 622782 637048
62288 637048 648644 657388 662916 665102 664148 660381 654150 645813 635612 623634 609994 594990 578941
62275 578941 562037 544530 526961 510005 494108 479359 465609 452660 440456 429153 418916
62264 418916 409639 401081 393290 386575 380994 376214 372034 368678 366311 364606 363110 361835 361137 361227 362099
62249 362099 363698 365854 368197 370497 372933 375694 378535 381113 383578 386335 389328 392046 394255 396268
62235 396268 398422 400706 403003 405346 407813 410450 413387 416764 420443 424097 427700 431665 436367 441717
$$ packed form
62326B39676K934L152K968K317J767J819K317K810L211L718M292M640M699M751
62312B85071N068N680O474P286P991Q676R620J0889J2154J3124J3993J5139J6565
62299D17730J8000J9347K0657K1772K2426K2580K2307K1395J9564J7004J4266
62288F37048J1596Q744N528K186r54l767o231q337j0201j1978j3640j5004j6049
62275E78941j6904j7507j7569j6956j5897j4749j3750j2949j2204j1303j0237
62264D18916r277q558p791o715n581m780m180l356k367j705j496j275o98R0Q72
62249C62099J599K156K343K300K436K761K841K578K465K757K993K718K209K013
62235C96268K154K284K297K343K467K637K937L377L679L654L603L965M702N350
$$ plain form
62221 441717 447324 452880 458356 464023 470358 477712 485972 494717 503715 513031 522690 532598 542955 554353
62207 554353 567180 581137 595625 610512 626240 643268 661634 681149 701807 723889 747668
62196 747668 773061 799614 826763 854018 880823 906377 929770 950272 967405 980866 990611 996958
62184 996958 1000418 1001369 1000037 996717 991772 985442 977859 969239 959867 949968 939858 930186 921603 914165
62170 914165 907434 901292 896241 892651 890143 888085 886469 885861 886641 888672 891704 895688 900633 906372 912626
62155 912626 919170 925951 933148 941061 949787 959032 968419 977934 987898 998480 1009506 1020791 1032430
62142 1032430 1044609 1057309 1070379 1083834 1097918 1112879 1128807 1145624 1163099 1180866 1198618
62131 1198618 1216366 1234450 1253160 1272433 1291966 1311574 1331285 1351065 1370595 1389374 1406959
$$ packed form
62221D41717N607N556N476N667O335P354Q260Q745Q998R316R659R908J0357J1398
62207E54353J2827J3957J4488J4887J5728J7028J8366J9515K0658K2082K3779
62196G47668K5393K6553K7149K7255K6805K5554K3393K0502J7133J3461R745O347
62184I96958L460R51j332l320m945o330p583q620r372r899j0110r672q583p438
62170I14165o731o142n051l590k508k058j616o08P80K031L032L984M945N739O254
62155I12626O544O781P197P913Q726R245R387R515R964J0582J1026J1285J1639
62142A032430J2179J2700J3070J3455J4084J4961J5928J6817J7475J7767J7752
62131A198618J7748J8084J8710J9273J9533J9608J9711J9780J9530J8779J7585
$$ plain form
62120 1406959 1423058 1437505 1450304 1461671 1471959 1481507 1490573 1499361 1508055 1516858 1526032 1535866 1546562
62107 1546562 1558197 1570785 1584257 1598302 1612365 1625936 1638796 1650835 1661667 1670595 1676980 1680606
62095 1680606 1681742 1680907 1678521 1674644 1669040 1661591 1652548 1642285 1630869 1618101 1603993 1589073 1574181
62082 1574181 1560015 1546819 1534347 1522117 1509834 1497621 1485812 1474607 1464036 1454142 1444970 1436409
62070 1436409 1428243 1420382 1412843 1405508 1398150 1390743 1383542 1376748 1370293 1364046 1358039 1352352 1346924 1341622
62056 1341622 1336362 1331055 1325528 1319653 1313470 1307067 1300400 1293320 1285732 1277623 1269003 1259931 1250545 1241031
62042 1241031 1231541 1222187 1213042 1204094 1195270 1186537 1177945 1169561 1161450 1153710 1146414 1139501 1132866 1126624
62028 1126624 1121102 1116490 1112643 1109351 1106682 1104895 1104113 1104225 1105044 1106417 1108209 1110351 1112938 1116146 1120000
$$ packed form
62120A406959J6099J4447J2799J1367J0288R548R066Q788Q694Q803R174R834J0696
62107A546562J1635J2588J3472J4045J4063J3571J2860J2039J0832Q928O385L626
62095A680606J136q35k386l877n604p449r043j0263j1416j2768j4108j4920j4892
62082A574181j4166j3196j2472j2230j2283j2213j1809j1205j0571r894r172q561
62070A436409q166p861p539p335p358p407p201o794o455o247o007n687n428n302
62056A341622n260n307n527n875o183o403o667p080p588q109q620r072r386r514
62042A241031r490r354r145q948q824q733q592q384q111p740p296o913o635o242
62028A126624n522m612l847l292k669j787p82J12Q19J373J792K142K587L208L854
$$ plain form
62013 1120000 1124294 1128799 1133481 1138451 1143722 1149112 1154411 1159519 1164236 1167914 1169595 1168709 1165507 1160613
61999 1160613 1154259 1146245 1136546 1125528 1113375 1099656 1083684 1065148 1044200 1021154 996356 970223
61987 970223 943145 915381 887215 859144 831743 805421 780461 757145 735574 715416 696140
61976 696140 677551 659912 643546 628562 614963 602752 591805 581819 572525 563783 555373 546904
61964 546904 538132 529248 520653 512485 504497 496332 487792 478929 470112 461966 455019 449324 444553 440499
61950 440499 437301 435126 433842 433212 433271 434316 436536 439827 443920 448494 453164 457528 461290 464231 466056
61935 466056 466442 465248 462497 458140 452036 444299 435410 425855 415826 405469 395195 385451 376270 367331
61921 367331 358472 349929 342053 335043 328926 323629 319004 314984 311699 309301 307652 306380 305249 304326
$$ packed form
62013A120000M294M505M682M970N271N390N299N108M717L678J681q86l202m894
61999A160613o354q014r699j1018j2153j3719j5972j8536k0948k3046k4798k6133
61987I70223k7078k7764k8166k8071k7401k6322k4960k3316k1571k0158j9276
61976F96140j8589j7639j6366j4984j3599j2211j0947r986r294q742q410q469
61964E46904q772q884q595q168p988q165q540q863q817q146o947n695m771m054
61950D40499l198k175j284o30N9J045K220L291M093M574M670M364L762K941J825
61935D66056L86j194k751m357o104p737q889r555j0029j0357j0274r744r181q939
61921C67331q859q543p876p010o117n297m625m020l285k398j649j272j131r23
$$ plain form
61907 304326 303777 303738 304358 305741 307744 310109 312893 316534 321320 326961 332897 338911 345278 352428 360613
61892 360613 369883 380198 391554 404089 418017 433440 450297 468567 488418 510031 533337 558029
61880 558029 583775 610336 637477 664879 692196 719195 745810 772040 797762 822699 846543
61869 846543 869016 889772 908399 924723 938951 951397 962244 971875 981282 991704 1003824 1017697
61857 1017697 1033531 1052077 1074111 1099894 1129430 1162877 1200407 1241874 1286967 1335498 1387248
61846 1387248 1441756 1498610 1557869 1619855 1684596 1751728 1820819 1891416 1962683 2033171 2100765
61835 2100765 2162608 2215150 2254696 2278170 2283522 2269876 2237825 2189566 2128219 2056776 1977779
61824 1977779 1893748 1807271 1720422 1634441 1550292 1469218 1392460 1320616 1253616 1191266 1133601
$$ packed form
61907C04326n49l9O20J383K003K365K784L641M786N641N936O014O367P150Q185
61892C60613R270J0315J1356J2535J3928J5423J6857J8270J9851K1613K3306K4692
61880E58029K5746K6561K7141K7402K7317K6999K6615K6230K5722K4937K3844
61869H46543K2473K0756J8627J6324J4228J2446J0847R631R407J0422J2120J3873
61857A017697J5834J8546K2034K5783K9536L3447L7530M1467M5093M8531N1750
61846A387248N4508N6854N9259O1986O4741O7132O9091P0597P1267P0488O7594
61835B100765O1843N2542L9546K3474N352j3646l2051m8259o1347p1443p8997
61824A977779q4031q6477q6849q5981q4149q1074p6758p1844o7000o2350n7665
$$ plain form
61813 1133601 1080762 1032790 989615 951127 917207 887770 862735 841899 824871 811230 800758
61802 800758 793485 789543 789099 792367 799529 810515 824874 841994 861509 883487 908154 935434 964810
61789 964810 995576 1027019 1058230 1087962 1114943 1138370 1157924 1173360 1184338 1190735 1192946 1191731
61777 1191731 1187971 1182644 1176841 1171481 1167014 1163598 1161555 1161416 1163451 1167287 1172070 1176843 1180621 1182289
61763 1182289 1180733 1175260 1165818 1152722 1136207 1116309 1093117 1067068 1038971 1009767 980222 950774
61751 950774 921644 893067 865431 839232 815005 793256 774298 758083 744312 732817 723715 717117
61739 717117 712850 710652 710506 712552 716775 723071 731540 742406 755654 771070 788723 809069 832479
61726 832479 858964 888517 921434 958081 998680 1043578 1093472 1149074 1210742 1278828 1354187
$$ packed form
61813A133601n2839m7972m3175l8488l3920k9437k5035k0836j7028j3641j0472
61802H00758p273l942m44L268P162J0986J4359J7120J9515K1978K4667K7280K9376
61789I64810L0766L1443L1211K9732K6981K3427J9554J5436J0978O397K211j215
61777A191731l760n327n803n360m467l416k043j39K035L836M783M773L778J668
61763A182289j556n473r442j3096j6515j9898k3192k6049k8097k9204k9545k9448
61751I50774k9130k8577k7636k6199k4227k1749j8958j6215j3771j1495r102o598
61739G17117m267k198j46K046M223O296Q469J0866J3248J5416J7653K0346K3410
61726H32479K6485K9553L2917L6647M0599M4898M9894N5602O1668O8086P5359
$$ plain form
61715 1354187 1437942 1530786 1632926 1744648 1866449 1998329 2139143 2286780 2438648 2591607
61705 2591607 2741327 2881844 3005961 3106422 3177254 3214594 3216915 3185048 3122150 3033242 2924149
61694 2924149 2800423 2666954 2528074 2387558 2248450 2113072 1983140 1859647 1742733
61685 1742733 1632120 1527901 1430744 1341238 1259240 1183992 1114711 1050962 992561 939333 890974
61674 890974 847108 807442 771813 739995 711551 686009 663128 642804 624743 608420 593451
61663 593451 579732 567118 555078 542860 529950 516302 502177 487854 473435 458858 444090
61652 444090 429285 414722 400605 386978 373848 361282 349351 338058 327362 317276 307935 299550
61640 299550 292185 285521 278987 272292 265740 259821 254565 249527 244399 239412 234964 231052 227234 223070
$$ packed form
61715A354187Q3755R2844J02140J11722J21801J31880J40814J47637J51868J52959
61705B591607J49720J40517J24117J00461P0832L7340K321l1867o2898q8908j09093
61694B924149j23726j33469j38880j40516j39108j35378j29932j23493j16914
61685A742733j10613j04219r7157q9506q1998p5248o9281o3749n8401n3228m8359
61674H90974m3866l9666l5629l1818k8444k5542k2881k0324j8061j6323j4969
61663E93451j3719j2614j2040j2218j2910j3648j4125j4323j4419j4577j4768
61652D44090j4805j4563j4117j3627j3130j2566j1931j1293j0696j0086r341q385
61640B99550p365o664o534o695o552n919n256n038n128m987m448l912l818m164
$$ plain form
61626 223070 218486 213743 209187 205027 201311 198027 195188 192762 190635 188711 187035 185730 184835 184299 184065
61611 184065 184058 184150 184284 184644 185516 186944 188583 189905 190529 190420 189873 189262 188713 188085 187361 186873 186974 187620 188541
61592 188541 189733 191493 193956 196930 200197 203696 207325 210855 214160 217276 220091 222207 223330 223585
61578 223585 223307 222686 221813 220926 220335 220158 220308 220737 221540 222842 224661 226875 229316 231914 234773 237944
61562 237944 241100 243556 244734 244537 243205 240951 237806 233729 228743 223018 216921 210915 205285 199998
61548 199998 194885 189899 185126 180608 176269 172053 168115 164802 162383 160729 159372 157994 156771 156065
61534 156065 155860 155757 155513 155289 155311 155596 156145 157147 158718 160603 162403 164045 165868 168254 171323 174922
61518 174922 178771 182656 186588 190778 195452 200730 206664 213225 220187 227217 234127 240918 247511 253692
$$ packed form
61626B23070m584m743m556m160l716l284k839k426k127j924j676j305q95n36k34
61611A84065pR2J34L60Q72J428J639J322O24j09n47o11n49o28p24m88J01O46R21
61592A88541J192J760K463K974L267L499L629L530L305L116K815K116J123K55
61578B23585k78o21q73q87n91j77J50M29Q03J302J819K214K441K598K859L171
61562B37944L156K456J178j97j332k254l145m077m986n725o097o006n630n287
61548A99998n113m986m773m518m339m216l938l313k419j654j357j378j223p06
61534A56065k05j03k44k24K2K85N49J002J571J885J800J642J823K386L069L599
61518A74922L849L885L932M190M674N278N934O561O962P030O910O791O593O181
$$ plain form
61504 253692 259466 265205 271223 277330 283025 288015 292298 295897 298811 301191 303294 305213 306836 308091
61490 308091 309088 310010 311021 312264 313801 315522 317213 318732 320025 321028 321703 322136 322432 322516 322150 321171
61474 321171 319600 317539 315123 312600 310330 308607 307540 307086 307175 307776 308962 310869 313569 317028 321227
61459 321227 326322 332544 339987 348576 358219 368905 380713 393841 408593 425205 443661 463816
61447 463816 485668 509473 535498 563749 593932 625688 658844 693353 728816 764066 797416
61436 797416 827449 853366 874503 889905 898821 901509 899088 892579 882391 868807 852451 834053
61424 834053 814138 793318 772622 753084 735021 718090 702082 687335 674303 663053 653402 645289
61412 645289 638712 633428 628988 625129 621929 619550 618067 617617 618477 620766 624188 628286 632919 638267 644440
$$ packed form
61504B53692N774N739O018O107N695M990M283L599K914K380K103J919J623J255
61490C08091R97R22J011J243J537J721J691J519J293J003O75M33K96Q4l66r79
61474C21171j571k061k416k523k270j723j067m54Q9O01J186J907K700L459M199
61459C21227N095O222P443Q589R643J0686J1808J3128J4752J6612J8456K0155
61447D63816K1852K3805K6025K8251L0183L1756L3156L4509L5463L5250L3350
61436G97416L0033K5917K1137J5402Q916K688k421o509j0188j3584j6356j8398
61424H34053j9915k0820k0696j9538j8063j6931j6008j4747j3032j1250r651q113
61412F45289o577n284m440l859l200k379j483m50Q60K289L422M098M633N348O173
$$ plain form
61397 644440 651314 658788 666906 675577 684431 693175 701986 711300 721268 731662 742324 753439 765242
61384 765242 777568 789885 801713 812906 823498 833378 842174 849474 855095 859181 862058 864048 865346
61371 865346 865996 865952 865177 863730 861778 859489 856924 853952 850310 845848 840742 835338 829703 823470 816353
61356 816353 808676 801198 794381 788098 782022 776021 770078 764144 758283 752795 747960 743738 739815 735817
61342 735817 731398 726393 721126 716402 712897 710639 709324 708990 710074 712833 717136 722923 730558 740527
61328 740527 752986 767823 785072 805047 828007 853841 882135 912525 944915 979290 1015352
61317 1015352 1052381 1089414 1125394 1159121 1189288 1214736 1234709 1248792 1256817 1258981 1255914 1248346
61305 1248346 1236744 1221386 1202704 1181265 1157486 1131671 1104353 1076321 1048249 1020549 993644
$$ packed form
61397F44440O874P474Q118Q671Q854Q744Q811R314R968J0394J0662J1115J1803
61384G65242J2326J2317J1828J1193J0592R880Q796P300N621M086K877J990J298
61371H65346O50m4p75j447j952k289k565k972l642m462n106n404n635o233p117
61356H16353p677p478o817o283o076o001n943n934n861n488m835m222l923l998
61342G35817m419n005n267m724l505k258j315l34J084K759M303N787P635R969
61328G40527J2459J4837J7249J9975K2960K5834K8294L0390L2390L4375L6062
61317A015352L7029L7033L5980L3727L0167K5448J9973J4083Q025K164l067p568
61305A248346j1602j5358j8682k1439k3779k5815k7318k8032k8072k7700k6905
$$ plain form
61294 993644 968094 944266 922138 901644 882962 866221 851088 837039 823980 812259 801988
61283 801988 792660 783649 774844 766549 758830 751250 743373 735356 727879 721495 716212 711766 708133 705616
61269 705616 704425 704391 705161 706530 708439 710719 713058 715264 717411 719608 721689 723224 723867 723658 723029 722554
61253 722554 722598 723068 723468 723307 722507 721405 720396 719637 719096 718675 718217 717567 716807 716330 716474 717097 717642 717567 716524
61234 716524 714179 710189 704522 697632 690142 682399 674463 666420 658552 651220 644688 639118 634617 631193
61220 631193 628662 626710 625154 624144 623966 624639 625908 627734 630552 634808 640443 647179 655173 664964 676719
61205 676719 689919 703860 718065 732090 745443 757992 770092 781949 793178 803354 812798 822383
61193 822383 832726 843909 855818 868203 880441 891718 901608 910134 917169 922086 924142 922892 918157
$$ packed form
61294I93644k5550k3828k2128k0494j8682j6741j5133j4049j3059j1721j0271
61283H01988r328r011q805q295p719p580p877q017p477o384n283m446l633k517
61269G05616j191l4P70J369J909K280K339K206K147K197K081J535O43k09o29m75
61253G22554M4M70M00j61q00j102j009p59n41m21m58o50p60m77J44O23N45p5j043
61234G16524k345l990n667o890p490p743p936q043p868p332o532n570m501l424
61220F31193k531j952j556j010j78O73J269J826K818M256N635O736P994R791J1755
61205F76719J3200J3941J4205J4025J3353J2549J2100J1857J1229J0176R444R585
61193H22383J0343J1183J1909J2385J2238J1277R890Q526P035M917K056j250m735
$$ plain form
61180 918157 909882 898282 883884 867188 848394 827662 805553 783075 761287 740902 722118 704627
61168 704627 687876 671536 655798 641175 627998 616105 605047 594511 584473 574950 565702 556356
61156 556356 546813 537352 528282 519651 511439 503808 496905 490565 484514 478865 474079 470358 467275 464183
61142 464183 460800 457285 453916 450902 448458 446869 446337 446793 447938 449557 451772 454884 458979 463823 469192
61127 469192 475104 481543 488122 494249 499541 503839 506931 508590 508941 508457 507439 505712 502990 499299 494883
61112 494883 489784 483775 476669 468561 459736 450481 441001 431459 421990 412642 403334 393984 384732 375988
61098 375988 368181 361467 355694 350588 345890 341473 337454 334171 331910 330669 330223 330328 330802 331599 332970
61083 332970 335370 338884 342824 346190 348531 350027 350747 350208 347856 343723 338420 332692 327119 322011 317302
$$ packed form
61180I18157q275j1600j4398j6696j8794k0732k2109k2478k1788k0385j8784j7491
61168G04627j6751j6340j5738j4623j3177j1893j1058j0536j0038r523r248r346
61156E56356r543r461r070q631q212p631o903o340o051n649m786l721l083l092
61142D64183l383l515l369l014k444j589n32M56J145J619K215L112M095M844N369
61127D69192N912O439O579O127N292M298L092J659L51m84j018j727k722l691m416
61112D94883n099o009p106q108q825r255r480r542r469r348r308r350r252q744
61098C75988p807o714n773n106m698m417m019l283k261j241m46J05M74P97J371
61083C32970K400L514L940L366K341J496P20n39k352m133n303n728n573n108m709
$$ plain form
61068 317302 312631 307713 302650 297761 293205 288923 284851 281041 277574 274468 271657 268990 266284 263456
61054 263456 260584 257782 255085 252537 250264 248346 246700 245283 244346 244254 244940 245773 246175 246257 246659 247828
61038 247828 249694 252062 254909 258064 260857 262529 262947 262572 261707 260138 257622 254385 250898 247453 244190
61023 244190 241275 238752 236358 233817 231218 228859 226844 225136 223872 223247 223115 223068 222962 223052 223577 224514
61007 224514 225791 227389 229124 230608 231652 232504 233484 234559 235495 236292 237234 238501 239922 241141 241964 242484
60991 242484 242944 243559 244469 245783 247502 249414 251237 252934 254756 256898 259304 261880 264614 267323 269606
60976 269606 271376 273231 275888 279368 283112 286798 290610 294745 299134 303740 308672 313876 319096 324297
60962 324297 329786 335718 341831 347875 353961 360200 366356 372202 378013 384299 391135 398097 404842 411435
$$ packed form
61068C17302m671m918n063m889m556m282m072l810l467l106k811k667k706k828
61054B63456k872k802k697k548k273j918j646j417r37r2O86Q33M02Q2M02J169
61038B47828J866K368K847L155K793J672M18l75q65j569k516l237l487l445l263
61023B44190k915k523k394k541k599k359k015j708j264o25j32m7j06R0N25R37
61007B24514J277J598J735J484J044Q52R80J075R36P97R42J267J421J219Q23N20
60991B42484M60O15R10J314J719J912J823J697J822K142K406K576K734K709K283
60976B69606J770J855K657L480L744L686L812M135M389M606M932N204N220N201
60962C24297N489N932O113O044O086O239O156N846N811O286O836O962O745O593
$$ plain form
60948 411435 418111 425004 432265 440187 448996 458594 468690 479245 490663 503468 517870 533704 550723
60935 550723 568781 587878 608251 630427 654883 681582 710145 740588 773540 809541 848514
60924 848514 890249 935085 983685 1036354 1093047 1153883 1219171 1288960 1362968 1440924 1522730
60913 1522730 1608435 1698446 1793704 1895295 2004009 2120579 2246093 2381709 2528170 2686126
60903 2686126 2856850 3042425 3245877 3471958 3727408 4019488 4354332 4737347 5174753
60894 5174753 5674113 6244804 6900135 7658436 8539603 9560831 10737071 12078995 13572696
60885 13572696 15145508 16654509 17930272 18856759 19424731 19717618 19854182 19943473 20071724
60876 20071724 20292316 20595799 20885409 21002218 20800299 20217877 19292340 18120962 16810790
$$ packed form
60948D11435O676O893P261P922Q809R598J0096J0555J1418J2805J4402J5834J7019
60935E50723J8058J9097K0373K2176K4456K6699K8563L0443L2952L6001L8973
60924H48514M1735M4836M8600N2669N6693O0836O5288O9789P4008P7956Q1806
60913A522730Q5705R0011R5258J01591J08714J16570J25514J35616J46461J57956
60903B686126J70724J85575K03452K26081K55450K92080L34844L83015M37406
60894E174753M99360N70691O55331P58301Q81167J021228J176240J341924J493701
60885A3572696J572812J509001J275763R26487N67972K92887J36564Q9291J28251
60876B0071724K20592L03483K89610J16809k01919n82422r25537j171378j310172
$$ plain form
60867 16810790 15451349 14109337 12829800 11637982 10544320 9551109 8656032 7852654
60859 7852654 7131891 6484998 5905004 5385867 4921771 4507418 4137890 3807944 3512297
60850 3512297 3246693 3007944 2792927 2598394 2421901 2262061 2117645 1987065 1868842
60841 1868842 1761791 1664433 1574761 1490948 1411912 1337137 1266408 1199803 1137486 1079335 1025084
60830 1025084 974774 928543 886008 846364 809119 774236 741603 710957 682379 656206 632282
60819 632282 609850 588335 567705 547961 528918 510674 493700 478193 463793 450169 437356
60808 437356 425289 413559 401953 390797 380422 370675 361234 352014 342974 333976 325118 316858 309457
60795 309457 302648 296175 290276 285293 281068 277116 273189 269384 265892 262933 260691 259069 257659 256169
$$ packed form
60867A6810790j359441j342012j279537j191818j093662r93211q95077q03378
60859G852654p20763o46893n79994n19137m64096m14353l69528l29946k95647
60850C512297k65604k38749k15017j94533j76493j59840j44416j30580j18223
60841A868842j07051r7358q9672q3813p9036p4775p0729o6605o2317n8151n4251
60830A025084n0310m6231m2535l9644l7245l4883l2633l0646k8578k6173k3924
60819F32282k2432k1515k0630j9744j9043j8244j6974j5507j4400j3624j2813
60808D37356j2067j1730j1606j1156j0375r747r441r220r040q998q858q260p401
60795C09457o809o473n899m983m225l952l927l805l492k959k242j622j410j490
$$ plain form
60781 256169 254714 253518 252584 251769 250917 249750 247973 245711 243555 241921 240657 239463 238355 237454 236705
60766 236705 236147 236124 236832 237968 239211 240777 243025 245728 248258 250405 252509 254803 257090 259144 260987
60751 260987 262652 264003 265009 265911 266936 267956 268591 268560 267846 266586 264936 263022 260927 258646 256054
60736 256054 253027 249684 246466 243836 241865 240214 238506 236597 234506 232244 229827 227340 224930 222760
60722 222760 220958 219512 218273 217155 216265 215702 215290 214766 214141 213669 213443 213328 213282 213458 213949 214666 215527 216504
60704 216504 217424 218053 218466 219120 220430 222433 224877 227408 229643 231395 232890 234527 236330 237904 238952
60689 238952 239536 239787 239752 239594 239501 239236 238149 235874 232708 229139 225368 221498 217770 214245 210614 206666
60673 206666 202724 199259 196305 193528 190696 187783 184766 181656 178586 175651 172820 170193 168084 166617
$$ packed form
60781B56169j455j196r34q15q52j167j777k262k156j634j264j194j108r01p49
60766B36705n58k3P08J136J243J566K248K703K530K147K104K294K287K054J843
60751B60987J665J351J006R02J025J020O35l1p14j260j650j914k095k281k592
60736B56054l027l343l218k630j971j651j708j909k091k262k417k487k410k170
60722B22760j802j446j239j118q90n63m12n24o25m72k26j15m6J76M91P17Q61R77
60704B16504R20O29M13O54J310K003K444K531K235J752J495J637J803J574J048
60689B38952N84K51l5j58r3k65j087k275l166l569l771l870l728l525l631l948
60673B06666l942l465k954k777k832k913l017l110l070k935k831k627k109j467
$$ plain form
60659 166617 165448 164141 162608 160944 159162 157398 156111 155623 155604 155424 154908 154387 154092 153879 153517 152903 152026
60642 152026 150986 150056 149462 149112 148773 148409 148139 147931 147670 147477 147653 148293 149180 150089 151013 152077 153364 154845
60624 154845 156360 157773 159187 160881 162888 164860 166521 168052 169765 171630 173445 175332 177688 180659
60610 180659 183952 187156 190033 192508 194659 196752 199058 201653 204511 207713 211319 215086 218589 221615
60596 221615 224304 226892 229456 231844 233747 234914 235442 235725 235973 235961 235436 234540 233524 232241 230323 227818
60580 227818 225230 222918 220778 218566 216249 213937 211718 209643 207725 205918 204234 202860 202008 201665 201635
60565 201635 201755 201886 201803 201394 200932 200862 201286 201878 202398 203023 204078 205561 207132 208497 209766 211358 213539
60548 213539 216115 218737 221474 224781 228830 233162 237223 240949 244508 247796 250612 253149 255853 258819
$$ packed form
60659A66617j169j307j533j664j782j764j287m88j9j80n16n21k95k13l62o14q77
60642A52026j040r30n94l50l39l64k70k08k61j93J76O40Q87R09R24J064J287J481
60624A54845J515J413J414J694K007J972J661J531J713J865J815J887K356K971
60610A80659L293L204K877K475K151K093K306K595K858L202L606L767L503L026
60596B21615K689K588K564K388J903J167N28K83K48j2n25q96j016j283j918k505
60580B27818k588k312k140k212k317k312k219k075j918j807j684j374q52l43l0
60565B01635J20J31q3m09m62p0M24N92N20O25J055J483J571J365J269J592K181
60548B13539K576K622K737L307M049M332M061L726L559L288K816K537K704K966
$$ plain form
60534 258819 261762 264539 267288 270009 272403 274248 275588 276414 276476 275578 273813 271388 268399 264930 261161
60519 261161 257247 253189 248922 244449 239802 235061 230448 226301 222838 219998 217588 215513 213817 212515
60505 212515 211400 210072 208309 206399 204944 204202 203825 203326 202652 202115 201965 202236 202856 203692 204613 205690 207158
60488 207158 209009 210871 212556 214429 216867 219638 222259 224763 227581 230748 233865 236865 240268 244480
60474 244480 249279 254175 258914 263506 268120 273149 279030 285814 293159 300926 309518 319478 330988 343954
60460 343954 358380 374512 392691 413174 435961 460862 487902 517564 550275 585660 622612
60449 622612 660068 697228 732988 765748 794141 817569 835747 848112 854133 854003 848593 838790
60437 838790 825231 808638 790063 770621 751095 731872 713212 695581 679706 666282 655679
$$ packed form
60534B58819K943K777K749K721K394J845J340Q26O2q98j765k425k989l469l769
60519B61161l914m058m267m473m647m741m613m147l463k840k410k075j696j302
60505B12515j115j328j763j910j455p42l77m99o74n37j50K71O20Q36R21J077J468
60488B07158J851J862J685J873K438K771K621K504K818L167L117L000L403M212
60474B44480M799M896M739M592M614N029N881O784P345P767Q592R960J1510J2966
60460C43954J4426J6132J8179K0483K2787K4901K7040K9662L2711L5385L6952
60449F22612L7456L7160L5760L2760K8393K3428J8178J2365O021j30n410r803
60437H38790j3559j6593j8575j9442j9526j9223j8660j7631j5875j3424j0603
$$ plain form
60426 655679 648009 643427 642169 644337 649861 658724 670993 686520 704745 724795 745582 765834 784301
60413 784301 800148 813074 823076 830271 834952 837577 838681 838959 839372 840830 843740 848154 854400 863227
60399 863227 875289 890884 910382 934566 964318 1000269 1042958 1093094 1151435 1218655 1295550
60388 1295550 1383127 1482292 1593619 1717631 1854990 2006002 2169898 2344583 2526521 2710273
60378 2710273 2888181 3051005 3189305 3294707 3360778 3383787 3363273 3301964 3205139 3079810
60368 3079810 2933835 2774854 2609384 2442545 2278275 2119514 1968221 1825515 1692007
60359 1692007 1568074 1453882 1349280 1253747 1166535 1087032 1015003 950353 892598 840742 793743
60348 793743 750938 711976 676573 644518 615727 589982 566667 544950 524307 504774 486692
$$ packed form
60426F55679p670m582j258K168N524Q863J2269J5527J8225K0050K0787K0252J8467
60413G84301J5847J2926J0002P195M681K625J104K78M13J458K910M414O246Q827
60399H63227J2062J5595J9498K4184K9752L5951M2689N0136N8341O7220P6895
60388A295550Q7577R9165J11327J24012J37359J51012J63896J74685J81938J83752
60378B710273J77908J62824J38300J05402O6071K3009k0514o1309r6825j25329
60368C079810j45975j58981j65470j66839j64270j58761j51293j42706j33508
60359A692007j23933j14192j04602r5533q7212p9503p2029o4650n7755n1856m6999
60348G93743m2805l8962l5403l2055k8791k5745k3315k1717k0643j9533j8082
$$ plain form
60337 486692 470245 455209 441138 427806 415407 404196 394002 384300 374772 365532 356758 348392
60325 348392 340361 332840 326048 319890 313997 308046 301938 295783 289812 284229 279057 274215 269771 265902
60311 265902 262589 259544 256566 253737 251154 248734 246457 244509 242954 241442 239505 237058 234434 232043
60297 232043 230153 228785 227572 225924 223594 220990 218691 216784 214935 212956 210989 209179 207485 205839
60283 205839 204240 202655 201072 199658 198678 198202 198049 198024 198098 198310 198634 198986 199289 199548 199912 200579 201540 202516
60265 202516 203246 203762 204249 204769 205268 205786 206469 207397 208539 209820 211086 212069 212590 212766 212869 213009 213143 213352
60247 213352 213857 214721 215731 216674 217622 218798 220238 221669 222762 223471 224162 225345 227211 229406 231279 232373
60231 232373 232701 232613 232442 232228 231711 230583 228772 226529 224283 222428 221137 220283 219562 218841 218330 218319 218758
$$ packed form
60337D86692j6447j5036j4071j3332j2399j1211j0194r702r528r240q774q366
60325C48392q031p521o792o158n893n951o108o155n971n583n172m842m444l869
60311B65902l313l045k978k829k583k420k277j948j555j512j937k447k624k391
60297B32043j890j368j213j648k330k604k299j907j849j979j967j810j694j646
60283B05839j599j585j583j414r80m76j53k5P4K12L24L52L03K59L64O67R61R76
60265B02516P30N16M87N20M99N18O83R28J142J281J266R83N21J76J03J40J34K09
60247B13352N05Q64J010R43R48J176J440J431J093P09O91J183J866K195J873J094
60231B32373L28q8j71k14n17j128j811k243k246j855j291q54p21p21n11j1M39
$$ plain form
60214 218758 219265 219538 219597 219613 219686 219867 220228 220868 221890 223397 225339 227430 229405 231376 233727 236630 239902
60197 239902 243339 246934 250715 254658 258889 263683 269098 274876 280855 287282 294541 302780 311979 322152
60183 322152 333274 345144 357558 370543 384305 399035 414788 431390 448456 465719 483333
60172 483333 501520 519902 537589 554076 569596 584396 598133 610333 621007 630377 638338 644635
60160 644635 649335 652639 654429 654487 653023 650565 647497 644137 641105 639036 637948 637388 637203 637777 639543
60145 639543 642699 647418 653873 661940 671266 681728 693505 706678 721109 736752 753648 771466
60133 771466 789410 806775 823354 839154 853982 867438 879090 888510 895365 899626 901534 901298 898972
60120 898972 894671 888691 881366 872982 863913 854652 845703 837558 830772 825759 822530 820883 820885 822902 827125
$$ packed form
60214B18758N07K73N9J6P3J81L61O40J022J507J942K091J975J971K351K903L272
60197B39902L437L595L781L943M231M794N415N778N979O427P259Q239R199J0173
60183C22152J1122J1870J2414J2985J3762J4730J5753J6602J7066J7263J7614
60172D83333J8187J8382J7687J6487J5520J4800J3737J2200J0674R370P961O297
60160F44635M700L304J790N8j464k458l068l360l032k069j088n60j85N74J766
60145F39543L156M719O455Q067R326J0462J1777J3173J4431J5643J6896J7818
60133G71466J7944J7365J6579J5800J4828J3456J1652R420O855M261J908k36k326
60120H98972m301n980p325q384r069r261q949q145o786n013l229j647KK017M223
$$ plain form
60105 827125 833390 841552 851761 864240 879008 895904 914630 934653 955328 976279 997489 1018914
60093 1018914 1040241 1061063 1080998 1099448 1115542 1128556 1138225 1144452 1146990 1145727 1141169 1134320
60081 1134320 1126104 1117137 1108056 1099761 1093179 1088879 1087105 1088150 1092618 1101167 1114026 1130908 1151496
60068 1151496 1175935 1204667 1237858 1275198 1316241 1360646 1407987 1457549 1508530 1560335 1612465
60057 1612465 1664120 1714054 1760855 1803349 1840782 1872744 1898971 1919179 1932956 1939789 1939237 1931163
60045 1931163 1915780 1893406 1864327 1829121 1789085 1745993 1701287 1655726 1609963 1565130 1522532
60034 1522532 1482994 1446814 1414240 1385594 1361025 1340561 1324421 1312950 1306182 1303716 1305054 1309734
60022 1309734 1317100 1326239 1336317 1346764 1357051 1366460 1374212 1379706 1382619 1382921 1380819 1376583 1370392
$$ packed form
60105H27125O265Q162J0209J2479J4768J6896J8726K0023K0675K0951K1210K1425
60093A018914K1327K0822J9935J8450J6094J3014R669O227K538j263m558o849
60081A134320q216q967r081q295o582m300j774J045M468Q549J2859J6882K0588
60068A151496K4439K8732L3191L7340M1043M4405M7341M9562N0981N1805N2130
60057A612465N1655M9934M6801M2494L7433L1962K6227K0208J3777O833n52q074
60045A931163j5383k2374k9079l5206m0036m3092m4706m5561m5763m4833m2598
60034A522532l9538l6180l2574k8646k4569k0464j6140j1471o768k466J338M680
60022A309734P366R139J0078J0447J0287R409P752N494K913L02k102m236o191
$$ plain form
60009 1370392 1362481 1353214 1342754 1330788 1316995 1301794 1286223 1271034 1256238 1241659 1227550 1214523
59997 1214523 1203210 1194189 1187933 1184572 1183962 1186128 1191415 1200020 1211659 1225891 1242507 1261280 1281568
59984 1281568 1302446 1323130 1343065 1361820 1379091 1394644 1408013 1418450 1425452 1429174 1430021 1428023
59972 1428023 1422921 1414702 1403600 1389633 1372590 1352559 1330065 1305537 1278947 1250219 1219788 1188589
59960 1188589 1157655 1127845 1099730 1073462 1048817 1025675 1004490 986136 971204 959554 950578
59949 950578 943821 939279 937245 937973 941504 947746 956694 968531 983448 1001304 1021514 1043359 1066310
59936 1066310 1089956 1113681 1136634 1158076 1177607 1194976 1209822 1221698 1230212 1235034 1235840 1232448
59924 1232448 1224979 1213855 1199655 1183033 1164654 1145086 1124792 1104289 1084276 1065509 1048591
$$ packed form
60009A370392p911r267j0460j1966j3793j5201j5571j5189j4796j4579j4109j3027
59997A214523j1313r021o256l361o10K166N287Q605J1639J4232J6616J8773K0288
59984A281568K0878K0684J9935J8755J7271J5553J3369J0437P002L722Q47j998
59972A428023n102q219j1102j3967j7043k0031k2494k4528k6590k8728l0431l1199
59960A188589l0934k9810k8115k6268k4645k3142k1185j8354j4932j1650q976
59949I50578o757m542k034P28L531O242Q948J1837J4917J7856K0210K1845K2951
59936A066310K3646K3725K2953K1442J9531J7369J4846J1876Q514M822Q06l392
59924A232448p469j1124j4200j6622j8379j9568k0294k0503k0013j8767j6918
$$ plain form
59913 1048591 1033935 1021778 1012185 1005101 1000475 998285 998440 1000837 1005563 1012768 1022297 1033662 1046535
59900 1046535 1060980 1076988 1094042 1111404 1128605 1145338 1161146 1175594 1188658 1200581 1211438
59889 1211438 1221119 1229611 1236931 1242917 1247509 1251216 1254925 1259266 1264473 1270853 1279013 1289624 1303313
59876 1303313 1320699 1342213 1367860 1397530 1431517 1470335 1514047 1562134 1613981 1668963 1725994
59865 1725994 1783456 1839692 1893100 1941674 1983008 2015064 2036655 2047138 2046173 2034064 2011919 1981128
59853 1981128 1942964 1898822 1850466 1799695 1747997 1696674 1646914 1599554 1555081 1514054 1477130
59842 1477130 1444512 1415860 1391045 1370523 1354629 1343004 1335188 1331361 1331958 1336862 1345498 1357461
59830 1357461 1372459 1389852 1408788 1428638 1448739 1467795 1484112 1496448 1504147 1506484 1502532 1491896
$$ packed form
59913A048591j4656j2157r593p084m626k190J55K397M726P205R529J1365J2873
59900A046535J4445J6008J7054J7362J7201J6733J5808J4448J3064J1923J0857
59889A211438R681Q492P320N986M592L707L709M341N207O380Q160J0611J3689
59876A303313J7386K1514K5647K9670L3987L8818M3712M8087N1847N4982N7031
59865A725994N7462N6236N3408M8574M1334L2056K1591J0483r65j2109k2145l0791
59853A981128l8164m4142m8356n0771n1698n1323m9760m7360m4473m1027l6924
59842A477130l2618k8652k4815k0522j5894j1625p816l827N97M904Q636J1963
59830A357461J4998J7393J8936J9850K0101J9056J6317J2336P699K337l952j0636
$$ plain form
59818 1491896 1475134 1453174 1426621 1395841 1361413 1324214 1285149 1244971 1204245 1163343 1122510
59807 1122510 1082029 1042376 1004235 968408 935582 906013 879449 855462 833792 814364 797114
59796 797114 782002 769052 758173 748988 741023 734011 727863 722449 717678 713728 710930 709329 708572 708355
59782 708355 708824 710413 713298 717069 720972 724380 727003 728599 728731 726943 723128 717499 710262 701619 692078
59767 692078 682354 672772 663093 653103 643073 633380 623985 614645 605483 596955 589347 582627 576797 572092
59753 572092 568795 567051 566878 568212 570978 575181 580860 587877 595881 604689 614496 625506 637489 649966
59739 649966 662717 675810 689141 702198 714288 724821 733412 740001 745014 749247 753461 758095 763340
59726 763340 769408 776636 785267 795139 805740 816796 828813 842834 859646 879471 902415 928859
$$ packed form
59818A491896j6762k1960k6553l0780l4428l7199l9065m0178m0726m0902m0833
59807A122510m0481l9653l8141l5827l2826k9569k6564k3987k1670j9428j7250
59796G97114j5112j2950j0879r185p965p012o148n414m771l950k798j601p57k17
59782G08355M69J589K885L771L903L408K623J596J32j788l815n629p237q643r541
59767F92078r724r582r679r990j0030r693r395r340r162q528p608o720n830m705
59753E72092l297j744j73J334K766M203N679P017Q004Q808R807J1010J1983J2477
59739F49966J2751J3093J3331J3057J2090J0533Q591O589N013M233M214M634N245
59726G63340O068P228Q631R872J0601J1056J2017J4021J6812J9825K2944K6444
$$ plain form
59714 928859 959230 993709 1032345 1075140 1121656 1170657 1220263 1268195 1311628 1347255 1372168
59703 1372168 1384881 1385458 1374899 1354770 1327232 1294866 1260123 1224960 1190792 1158539 1128674 1101437
59691 1101437 1077036 1055616 1037213 1021891 1009794 1000903 994922 991584 990932 993107 998139 1006125 1017347
59678 1017347 1031867 1049301 1069344 1092318 1118759 1148652 1181576 1217536 1257153 1301003 1349189
59667 1349189 1401644 1458461 1519789 1585766 1656686 1733041 1815231 1903357 1997207 2096259 2199705
59656 2199705 2306629 2416031 2526491 2636037 2742830 2845995 2945511 3041468 3133870 3223143
59646 3223143 3310310 3396508 3482659 3569605 3657994 3747672 3837449 3925703 4011011 4092066 4167239
59635 4167239 4234584 4292272 4338981 4374059 4397497 4409810 4411878 4404930 4390575 4370705 4347367 4322812
$$ packed form
59714I28859L0371L4479L8636M2795M6516M9001M9606M7932M3433L5627K4913
59703A372168J2713N77j0559k0129k7538l2366l4743l5163l4168l2253k9865k7237
59691A101437k4401k1420j8403j5322j2097q891n981l338o52K175N032P986J1222
59678A017347J4520J7434K0043K2974K6441K9893L2924L5960L9617M3850M8186
59667A349189N2455N6817O1328O5977P0920P6355Q2190Q8126R3850R9052J03446
59656B199705J06924J09402J10460J09546J06793J03165R9516R5957R2402Q9273
59646C223143Q7167Q6198Q6151Q6946Q8389Q9678Q9777Q8254Q5308Q1055P5173
59635D167239O7345N7688M6709L5078K3438J2313K068o948j4355j9870k3338k4555
$$ plain form
59623 4322812 4299474 4279562 4264631 4255675 4253652 4259742 4275178 4301042 4338226 4387348 4448634 4521970
59611 4521970 4607041 4703256 4809511 4924069 5044413 5166978 5287133 5399683 5499377 5580918
59601 5580918 5639042 5669340 5669232 5638086 5576725 5487360 5373875 5241448 5095461 4940774 4781819
59590 4781819 4622693 4466770 4316389 4172940 4036980 3908156 3785257 3666453 3549432
59581 3549432 3431566 3310554 3185188 3055512 2922437 2787582 2653254 2521844 2394929
59572 2394929 2273214 2157326 2048107 1945995 1850723 1761929 1679717 1604285 1535339 1472233
59562 1472233 1414478 1361788 1313832 1270188 1230473 1194397 1161780 1132566 1106588 1083278 1061933
59551 1061933 1042286 1024460 1008266 993004 978146 963761 949928 936145 921687 906300 890167
$$ packed form
59623D322812k3338j9912j4931q956k023O090J5436K5864L7184M9122O1286P3336
59611D521970Q5071R6215J06255J14558J20344J22565J20155J12550R9694Q1541
59601E580918N8124L0298j08l1146o1361q9365j13485j32427j45987j54687j58955
59590D781819j59126j55923j50381j43449j35960j28824j22899j18804j17021
59581C549432j17866j21012j25366j29676j33075j34855j34328j31410j26915
59572B394929j21715j15888j09219j02112r5272q8794q2212p5432o8946o3106
59562A472233n7755n2690m7956m3644l9715l6076l2617k9214k5978k3310k1345
59551A061933j9647j7826j6194j5262j4858j4385j3833j3783j4458j5387j6133
$$ plain form
59540 890167 873476 856394 839262 822412 805889 789663 773967 759104 745043 731561 718691
59529 718691 706688 695645 685495 676347 668442 661749 655937 650858 646793 644067 642631 642174 642499 643619
59515 643619 645554 648210 651487 655384 659904 664881 670006 675122 680426 686331 693107 700791 709367 718872
59501 718872 729304 740606 752829 766202 780959 797195 814922 834193 855083 877653 901959
59490 901959 928112 956310 986844 1019983 1055709 1093605 1133145 1173995 1215891 1258359 1300821
59479 1300821 1342961 1384675 1425570 1464790 1501471 1535220 1566017 1593790 1618151 1638439 1653954
59468 1653954 1664292 1669592 1670413 1667451 1661477 1653454 1644449 1635333 1626720 1619236 1613710 1611062 1612103 1617404
59454 1617404 1627190 1641344 1659623 1681756 1707173 1734730 1762896 1790128 1814859 1835300 1849627
$$ packed form
59540H90167j6691j7082j7132j6850j6523j6226j5696j4863j4061j3482j2870
59529G18691j2003j1043j0150r148p905o693n812n079m065k726j436m57L25J120
59515F43619J935K656L277L897M520M977N125N116N304N905O776P684Q576R505
59501G18872J0432J1302J2223J3373J4757J6236J7727J9271K0890K2570K4306
59490I01959K6153K8198L0534L3139L5726L7896L9540M0850M1896M2468M2462
59479A300821M2140M1714M0895L9220L6681L3749L0797K7773K4361K0288J5515
59468A653954J0338N300Q21k962n974q023r005r116q613p484n526k648J041N301
59454A617404R786J4154J8279K2133K5417K7557K8166K7232K4731K0441J4327
$$ plain form
59443 1849627 1856393 1854600 1843554 1823065 1793734 1756651 1712801 1663093 1608910 1552174 1494764 1438132
59431 1438132 1383390 1331302 1282085 1235653 1192200 1152240 1116103 1083775 1055263 1030641 1009692
59420 1009692 992027 977691 967160 960551 957290 956765 958893 963866 971841 983083 997880 1015996 1036653
59407 1036653 1059402 1084556 1112452 1142698 1174489 1207209 1240186 1272200 1301737 1327607 1348981
59396 1348981 1365081 1375229 1379050 1376354 1367042 1351409 1330245 1304342 1274187 1240380 1204027 1166280
59384 1166280 1127808 1089061 1050710 1013363 977139 942036 908521 877272 848480 821862 797204
59373 797204 774481 753609 734551 717586 702997 690547 679646 670001 661782 655222 650357 647062
59361 647062 645027 643855 643486 644366 646832 650549 654977 660180 666698 674752 684169 694980 707503 721672
$$ packed form
59443A849627O766j793j1046k0489k9331l7083m3850m9708n4183n6736n7410n6632
59431A438132n4742n2088m9217m6432m3453l9960l6137l2328k8512k4622k0949
59420A009692j7665j4336j0531o609l261n25K128M973P975J1242J4797J8116K0657
59407A036653K2749K5154K7896L0246L1791L2720L2977L2014K9537K5870K1374
59396A348981J6100J0148L821k696r312j5633k1164k5903l0155l3807l6353l7747
59384A166280l8472l8747l8351l7347l6224l5103l3515l1249k8792k6618k4658
59373G97204k2723k0872j9058j6965j4589j2450j0901r645q219o560m865l295
59361F47062k035j172l69Q80K466L717M428N203O518Q054R417J0811J2523J4169
$$ plain form
59347 721672 736680 751438 765111 777334 788332 798962 810255 822801 836763 852402 870205
59336 870205 890469 913086 937652 963419 989257 1014242 1038495 1063103 1089115 1116946 1146747
59325 1146747 1178802 1213319 1250258 1289684 1332048 1377839 1427148 1479825 1535918 1595772 1659798
59314 1659798 1728362 1801874 1880853 1965769 2056741 2153300 2254521 2359452 2467218 2576551
59304 2576551 2685439 2791648 2893569 2990284 3080897 3164296 3239730 3307248 3367339 3420380 3466593
59293 3466593 3506237 3539470 3566037 3585343 3596798 3599951 3594263 3578994 3553462 3517431 3471154 3415059
59281 3415059 3349567 3275384 3193894 3107014 3016610 2924144 2830810 2737691 2645700 2555613 2468333
59270 2468333 2384857 2305838 2231385 2161470 2096252 2035796 1979749 1927672 1879547 1835634 1795938
$$ packed form
59347G21672J5008J4758J3673J2223J0998J0630J1293J2546J3962J5639J7803
59336H70205K0264K2617K4566K5767K5838K4985K4253K4608K6012K7831K9801
59325A146747L2055L4517L6939L9426M2364M5791M9309N2677N6093N9854O4026
59314A659798O8564P3512P8979Q4916R0972R6559J01221J04931J07766J09333
59304B576551J08888J06209J01921R6715R0613Q3399P5434O7518O0091N3041M6213
59293C466593L9644L3233K6567J9306J1455L153n688j5269k5532l6031m6277n6095
59281C415059o5492p4183q1490q6880r0404r2466r3334r3119r1991r0087q7280
59270B468333q3476p9019p4453o9915o5218o0456n6047n2077m8125m3913l9696
$$ plain form
59259 1795938 1760090 1727682 1698422 1672031 1648231 1626747 1607094 1588480 1570197 1552062 1534250
59248 1534250 1516775 1499329 1481510 1462993 1443594 1423397 1402675 1381505 1359649 1337039 1314115
59237 1314115 1291340 1268659 1245851 1223188 1201238 1180148 1159646 1139735 1120863 1103366 1087250
59226 1087250 1072633 1059960 1049564 1041391 1035316 1031466 1030034 1030971 1034032 1039027 1045962 1054995 1066182
59213 1066182 1079156 1093196 1107801 1122975 1138631 1153914 1167543 1178725 1187262 1192885 1195027 1193390
59201 1193390 1188252 1180000 1168763 1154728 1138524 1121080 1103273 1085798 1069147 1053580 1039315 1026773
59189 1026773 1016467 1008631 1003229 1000353 1000305 1003214 1008888 1017107 1027695 1040116 1053236 1065760 1076854
59176 1076854 1086381 1094817 1103013 1111837 1121859 1133440 1147087 1163453 1182934 1205455 1230789 1258941
$$ packed form
59259A795938l5848l2408k9260k6391k3800k1484j9653j8614j8283j8135j7812
59248A534250j7475j7446j7819j8517j9399k0197k0722k1170k1856k2610k2924
59237A314115k2775k2681k2808k2663k1950k1090k0502j9911j8872j7497j6116
59226A087250j4617j2673j0396q173o075l850j432R37L061M995O935R033J1187
59213A066182J2974J4040J4605J5174J5656J5283J3629J1182Q537N623K142j637
59201A193390n138q252j1237j4035j6204j7444j7807j7475j6651j5567j4265j2542
59189A026773j0306p836n402k876m8K909N674Q219J0588J2421J3120J2524J1094
59176A076854R527Q436Q196Q824J0022J1581J3647J6366J9481K2521K5334K8152
$$ plain form
59164 1258941 1290201 1324974 1363599 1406206 1452760 1503329 1558215 1617677 1681634 1749816 1821969
59153 1821969 1897570 1975448 2054075 2132066 2207958 2279555 2344051 2399041 2443084 2475245 2494565
59142 2494565 2500256 2492189 2471013 2437998 2394906 2343742 2286443 2224790 2160522 2095238 2030182 1966346
59130 1966346 1904730 1846150 1790744 1738060 1687737 1639879 1594768 1552543 1513288 1477040 1443582
59119 1443582 1412523 1383705 1357264 1333209 1311250 1291183 1273129 1257193 1243171 1230760 1219886
59108 1219886 1210609 1202875 1196492 1191268 1187058 1183767 1181347 1179661 1178418 1177354 1176348 1175155 1173223 1170154
59094 1170154 1166207 1161878 1157010 1150800 1142728 1132998 1121945 1109556 1095814 1081091 1065837 1050139
59082 1050139 1033834 1016846 999295 981467 963845 946889 930705 915134 900182 886023 872549
$$ packed form
59164A258941L1260L4773L8625M2607M6554N0569N4886N9462O3957O8182P2153
59153A821969P5601P7878P8627P7991P5892P1597O4496N4990M4043L2161J9320
59142B494565N691q067k1176l3015m3092n1164n7299o1653o4268o5284o5056o3836
59130A966346o1616n8580n5406n2684n0323m7858m5111m2225l9255l6248l3458
59119A443582l1059k8818k6441k4055k1959k0067j8054j5936j4022j2411j0874
59108A219886r277p734o383n224m210l291k420j686j243j064j006j193j932l069
59094A170154l947m329m868o210q072r730j1053j2389j3742j4723j5254j5698
59082A050139j6305j6988j7551j7828j7622j6956j6184j5571j4952j4159j3474
$$ plain form
59071 872549 859388 846540 834618 824184 815219 807471 801022 796172 793028 791502 791585 793394 797010 802400
59057 802400 809350 817439 826274 835788 846085 856988 868067 879159 890453 901922 913053 923386
59045 923386 932985 942152 950944 959318 967534 976167 985802 996841 1009439 1023498 1038799 1055169 1072277
59032 1072277 1089291 1104990 1118252 1128178 1133766 1133935 1128022 1116002 1098185 1075046 1047460 1016627
59020 1016627 983577 949041 913842 878941 844892 811676 779315 748292 719156 692083 667021
59009 667021 643880 622374 602075 582942 565439 549903 536103 523652 512455 502505 493640 485797
58997 485797 479147 473658 468854 464370 460376 457155 454586 452401 450627 449387 448535 447880 447533 447745 448617
58982 448617 450279 453085 457270 462679 469152 476899 486173 496784 508255 520103 531601 541594 549124
$$ packed form
59071H72549j3161j2848j1922j0434q965p748o449m850l144j526Q3J809L616N390
59057H02400O950Q089Q835R514J0297J0903J1079J1092J1294J1469J1131J0333
59045I23386R599R167Q792Q374Q216Q633R635J1039J2598J4059J5301J6370J7108
59032A072277J7014J5699J3262R926N588J69n913j2020j7817k3139k7586l0833
59020A016627l3050l4536l5199l4901l4049l3216l2361l1023k9136k7073k5062
59009F67021k3141k1506k0299j9133j7503j5536j3800j2451j1197r950q865p843
58997D85797o650n489m804m484l994l221k569k185j774j240q52o55l47K12Q72
58982D48617J662K806M185N409O473P747R274J0611J1471J1848J1498R993P530
$$ plain form
58969 549124 554143 557260 558963 559479 559201 558723 558425 558254 557901 556992 555294 553030 550848 549288 548395 548014
58953 548014 548180 548926 549989 551076 552198 553452 554621 555324 555378 554709 553118 550457 546893 542590 537279 530492
58937 530492 522151 512673 502552 492108 481521 470880 460263 449926 440234 431322 423055 415488 409066
58924 409066 404064 400128 396680 393607 391233 389785 389164 389121 389474 390309 392060 395166 399550 404756 410669
58909 410669 417600 425504 433687 441646 449635 457898 465884 472801 478605 483838 488741 493159 497107 500906
58895 500906 504875 509343 514759 521294 528490 535760 543058 550638 558407 566017 573436 580824 588012 594663
58881 594663 600915 607360 614452 622329 631093 640823 651366 662572 674626 687782 701892 716658 732179
58868 732179 748812 766611 785446 805548 827397 851078 876242 902748 930918 961177 993779
$$ packed form
58969E49124N019L117J703N16k78m78k98j71l53r09j698k264k182j560q93l81
58953E48014J66P46J063J087J122J254J169P03N4o69j591k661l564m303n311o787
58937E30492q341r478j0121j0444j0587j0641j0617j0337r692q912q267p567o422
58924D09066n002l936l448l073k374j448o21m3L53Q35J751L106M384N206N913
58909D10669O931P904Q183P959P989Q263P986O917N804N233M903M418L948L799
58895E00906L969M468N416O535P196P270P298P580P769P610P419P388P188O651
58881E94663O252O445P092P877Q764R730J0543J1206J2054J3156J4110J4766J5521
58868G32179J6633J7799J8835K0102K1849K3681K5164K6506K8170L0259L2602
$$ plain form
58857 993779 1028910 1066737 1107412 1151265 1198787 1250174 1305192 1363926 1427259 1496081 1570306
58846 1570306 1649342 1733223 1822480 1916974 2015660 2117515 2221849 2327464 2432141 2533295
58836 2533295 2628671 2716179 2793499 2858143 2907758 2940393 2954903 2951245 2930195 2892888 2840918
58825 2840918 2776634 2702747 2621538 2534839 2444592 2352811 2260901 2169548 2079371 1991237 1905888
58814 1905888 1823753 1745248 1670824 1600581 1534261 1471728 1413123 1358474 1307522 1259974 1215578
58803 1215578 1173918 1134513 1097139 1061710 1027885 995222 963701 933680 905337 878564 853391
58792 853391 830019 808410 788341 769908 753490 739102 726280 714699 704517 696029 689343 684448
58780 684448 681168 679057 677756 677523 678955 682206 686889 692731 699793 708066 717439 728207 740989 755983
$$ packed form
58857I93779L5131L7827M0675M3853M7522N1387N5018N8734O3333O8822P4225
58846A570306P9036Q3881Q9257R4494R8686J01855J04334J05615J04677J01154
58836B533295R5376Q7508P7320O4644M9615L2635J4510l658k1050l7307n1970
58825B840918o4284p3887q1209q6699r0247r1781r1910r1353r0177q8134q5349
58814A905888q2135p8505p4424p0243o6320o2533n8605n4649n0952m7548m4396
58803A215578m1660l9405l7374l5429l3825l2663l1521l0021k8343k6773k5173
58792H53391k3372k1609k0069j8433j6418j4388j2822j1581j0182q488o686m895
58780F84448l280k111j301k33J432L251M683N842P062Q273R373J0768J2782J4994
$$ plain form
58766 755983 772789 791124 811188 833131 856689 881628 908143 936560 966965 999349 1033819
58755 1033819 1070544 1109791 1152077 1197905 1247297 1299950 1355935 1415842 1480232 1549364 1623458
58744 1623458 1702655 1786621 1874686 1966483 2061904 2160209 2259632 2357996 2453206 2542993 2624721
58733 2624721 2695795 2753945 2797057 2823328 2831923 2823127 2797682 2756417 2700753 2633009 2555845 2471590
58721 2471590 2382236 2289652 2195491 2101142 2007895 1916881 1828785 1743993 1663010 1586267 1513527
58710 1513527 1444164 1378193 1316419 1259305 1206290 1156506 1109628 1065681 1024593 986365 951249
58699 951249 919260 889856 862494 837221 814398 794152 776434 761272 748611 738162 729740 723541
58687 723541 719845 718688 720032 723982 730579 739639 750909 764015 778058 791608 803340 812422 818122
$$ packed form
58766G55983J6806J8335K0064K1943K3558K4939K6515K8417L0405L2384L4470
58755A033819L6725L9247M2286M5828M9392N2653N5985N9907O4390O9132P4094
58744A623458P9197Q3966Q8065R1797R5421R8305R9423R8364R5210Q9787Q1728
58733B624721P1074N8150M3112K6271Q595q796k5445m1265n5664o7744p7164q4255
58721B471590q9354r2584r4161r4349r3247r1014q8096q4792q0983p6743p2740
58710A513527o9363o5971o1774n7114n3015m9784m6878m3947m1088l8228l5116
58699I51249l1989k9404k7362k5273k2823k0246j7718j5162j2661j0449q422o199
58687G23541l696j157J344L950O597R060J1270J3106J4043J3550J1732R082N700
$$ plain form
58674 818122 819561 816207 808379 796993 783048 767520 751362 735214 719238 703304 687170 670455
58662 670455 652842 634420 615527 596222 576337 556078 536013 516373 496931 477786 459647
58651 459647 443004 427541 412753 398665 385596 373617 362686 352933 344394 336764 329768 323515
58639 323515 318221 313809 310027 306641 303341 299776 295916 292004 288057 283877 279715 276313 273963 272054
58625 272054 269976 267964 266635 266152 266342 267270 269124 271798 274979 278494 282228 286013 289941 294534 300253
58610 300253 306988 314271 321675 328815 335319 341121 346438 351225 355005 357509 359046 359907 359838 358513 356084
58595 356084 352792 348383 342443 335106 327005 318655 310269 302013 294094 286701 280070 274435 269751 265698
58581 265698 262131 259268 257284 256079 255572 255872 256926 258411 260165 262348 265010 267940 271108 274768 278878
$$ packed form
58674H18122J439l354p828j1386j3945j5528j6158j6148j5976j5934j6134j6715
58662F70455j7613j8422j8893j9305j9885k0259k0065j9640j9442j9145j8139
58651D59647j6643j5463j4788j4088j3069j1979j0931r753q539p630o996o253
58639C23515n294m412l782l386l300l565l860l912l947m180m162l402k350j909
58625B72054k078k012j329m83J90R28J854K674L181L515L734L785L928M593N719
58610C00253O735P283P404P140O504N802N317M787L780K504J537Q61o9j325k429
58595C56084l292m409n940p337q101q350q386q256p919p393o631n635m684m053
58581B65698l567k863j984j205n07L00J054J485J754K183K662K930L168L660M110
$$ plain form
58566 278878 282987 286975 291397 296768 303024 310005 317957 327110 337289 348365 360663 374499 389695
58553 389695 405918 423127 441348 460501 480726 502454 525802 550430 576244 603670 632837
58542 632837 663133 693948 725125 756091 785259 810937 832341 849081 860367 865561 865065 859854
58530 859854 850457 837177 820926 803044 784395 765316 746228 727724 710213 694052 679840 668049
58518 668049 658601 651240 646054 643148 642157 642635 644646 648515 654297 661999 671944 684451 699466 716966
58504 716966 737164 759695 782956 804800 823468 837326 844350 842881 832745 815042 791105 762271
58492 762271 730195 696496 662192 628054 595135 564276 535384 507982 482267 458920 438083
58481 438083 419231 401907 385933 371109 357343 344917 334024 324256 315107 306736 299620 293702
$$ packed form
58566B78878M109L988M422N371O256O981P952R153J0179J1076J2298J3836J5196
58553C89695J6223J7209J8221J9153K0225K1728K3348K4628K5814K7426K9167
58542F32837L0296L0815L1177L0966K9168K5678K1404J6740J1286N194m96n211
58530H59854r397j3280j6251j7882j8649j9079j9088j8504j7511j6161j4212j1791
58518F68049r448p361n186k906r91M78K011L869N782P702R945J2507J5015J7500
58504G16966K0198K2531K3261K1844J8668J3858P024j469j0136j7703k3937k8834
58492G62271l2076l3699l4304l4138l2919l0859k8892k7402k5715k3347k0837
58481D38083j8852j7324j5974j4824j3766j2426j0893r768r149q371p116n918
$$ plain form
58469 293702 288512 283892 279953 276543 273386 270501 267909 265234 262172 259078 256458 254227 252070 250167
58455 250167 248838 247881 247029 246717 247568 249349 251275 253106 255158 257486 259894 262611 266134 270523 275488
58440 275488 281036 287336 294173 301323 309262 318762 329921 342297 355796 370692 386909 403957 421394
58427 421394 438724 455072 469636 482217 492732 500600 505313 507134 506434 502750 495414 484711 471548
58414 471548 456372 439408 421549 403931 386859 370128 354122 339561 326447 314317 303276
58403 303276 293687 285110 276726 268660 261717 255968 250770 246033 242256 239345 236650 234188 232593 231814
58389 231814 231054 230132 229721 230091 230757 231581 233049 235216 237484 239721 242595 246456 250855 255404 260253 265422
58373 265422 270520 275333 279911 283945 286869 288646 289609 289557 287930 284901 281354 277743 273932 270182 267171
$$ packed form
58469B93702n190m620l939l410l157k885k592k675l062l094k620k231k157j903
58455B50167j329r57q52l12Q51J781J926J831K052K328K408K717L523M389M965
58440B75488N548O300O837P150P939R500J1159J2376J3499J4896J6217J7048J7437
58427D21394J7330J6348J4564J2581J0515P868M713J821p00l684p336j0703j3163
58414D71548j5176j6964j7859j7618j7072j6731j6006j4561j3114j2130j1041
58403C03276r589q577q384q066o943n749n198m737l777k911k695k462j595p79
58389B31814p60r22m11L70O66Q24J468K167K268K237K874L861M399M549M849N169
58373B65422N098M813M578M034K924J777R63n2j627l029l547l611l811l750l011
$$ plain form
58358 267171 264950 262858 260653 258777 257444 256440 255896 256295 257678 259744 262665 266790 271657 276464 281370
58343 281370 287070 293129 298169 301729 304531 306714 307330 305940 303356 300328 296792 292818 289067 285778
58329 285778 282478 279093 276258 274135 272071 269887 268308 267688 267389 266908 266556 266629 266949 267574 268894 270619
58313 270619 271729 271828 271540 271295 270833 270188 270044 270675 271636 272769 274468 276691 278863 281024 283901 287603
58297 287603 291448 295306 299865 305310 311021 316833 323261 330225 336947 343368 350220 357371 363572 368217
58283 368217 371886 374827 376451 376739 376585 376303 375323 373803 372864 372782 372646 372317 372986 375136 377748 380182 383142
58266 383142 387052 391253 395575 400924 407455 413919 419724 425924 433271 441029 448665 456932 466304 476002
58252 476002 485566 495644 506238 515917 523856 530903 537629 543175 547139 550735 554866 558842 562266 566284
$$ packed form
58358B67171k221k092k205j876j333j004n44L99J383K066K921M125M867M807M906
58343B81370N700O059N040L560K802K183O16j390k584l028l536l974l751l289
58329B85778l300l385k835k123k064k184j579o20k99m81l52P3L20O25J320J725
58313B70619J110R9k88k45m62o45j44O31R61J133J699K223K172K161K877L702
58297B87603L845L858M559N445N711N812O428O964O722O421O852P151O201M645
58283C68217L669K941J624K88j54k82r80j520r39q2j36l29O69K150K612K434K960
58266C83142L910M201M322N349O531O464N805O200P347P758P636Q267R372R698
58252D76002R564J0078J0594R679P939P047O726N546L964L596M131L976L424M018
$$ plain form
58238 566284 571623 577208 582160 587483 594368 602431 611006 620494 631123 642063 653150 665774 680742
58225 680742 697026 713936 732638 754076 777274 801264 826858 855004 885218 917179 951999
58214 951999 990301 1030782 1072174 1114694 1158007 1199797 1237995 1272485 1303062 1327933 1346101
58203 1346101 1359209 1369288 1376715 1382037 1387453 1394572 1402968 1412786 1426355 1445262 1468250 1493997
58191 1493997 1523473 1557500 1594772 1634603 1678908 1729028 1783339 1840458 1901985 1969450 2041534
58180 2041534 2117148 2198339 2287148 2382531 2483429 2591900 2710008 2836605 2970451 3113515
58170 3113515 3267876 3432475 3606256 3791228 3989021 4197982 4417328 4650483 4900516
58161 4900516 5166217 5446641 5745401 6066281 6409097 6774342 7167216 7592231 8048832
$$ packed form
58238E66284N339N585M952N323O885Q063Q575R488J0629J0940J1087J2624J4968
58225F80742J6284J6910J8702K1438K3198K3990K5594K8146L0214L1961L4820
58214I51999L8302M0481M1392M2520M3313M1790L8198L4490L0577K4871J8168
58203A346101J3108J0079P427N322N416P119Q396R818J3569J8907K2988K5747
58191A493997K9476L4027L7272L9831M4305N0120N4311N7119O1527O7465P2084
58180B041534P5614Q1191Q8809R5383J00898J08471J18108J26597J33846J43064
58170C113515J54361J64599J73781J84972J97793K08961K19346K33155K50033
58161D900516K65701K80424K98760L20880L42816L65245L92874M25015M56601
$$ plain form
58152 8048832 8537254 9063237 9631637 10241717 10894989 11601443 12371701 13210455 14125400
58143 14125400 15135593 16264005 17531289 18965815 20609284 22501784 24672927 27160627
58135 27160627 30027594 33348567 37197934 41660077 46821680 52735916 59447716 67100787
58127 67100787 75916770 85843753 96091773 105104045 111192532 113373768 111722155 107072186
58119 107072186 100482846 92892198 85017666 77350149 70170478 63602296 57677999 52372446
58111 52372446 47615391 43319187 39412828 35851270 32605540 29658190 27001756 24627113
58103 24627113 22513030 20632333 18962686 17484558 16174895 15011295 13978582 13064723
58095 13064723 12254303 11532082 10888893 10318414 9812081 9362414 8967330 8625667 8331501
$$ packed form
58152H048832M88422N25983N68400O10080O53272P06454P70258Q38754R14945
58143A4125400J010193J128412J267284J434526J643469J892500K171143K487700
58135B7160627K866967L320973L849367M462143N161603N914236O711800P653071
58127F7100787Q815983R926983J0248020R012272O088487K181236j651613m649969
58119A07072186o589340p590648p874532p667517p179671o568182n924297n305553
58111E2372446m757055m296204l906359l561558l245730k947350k656434k374643
58103B4627113k114083j880697j669647j478128j309663j163600j032713r13859
58095A3064723q10420p22221o43189n70479n06333m49667l95084l41663k94166
$$ plain form
58086 8331501 8077111 7858060 7671499 7513553 7382819 7283346 7220919 7200043 7227163 7311985
58076 7311985 7461847 7678714 7964338 8324193 8765714 9301195 9957059 10772540 11781309
58067 11781309 12993709 14389036 15901941 17401164 18697785 19607937 20029207 19964431 19483875
58058 19483875 18677176 17633604 16440026 15174907 13900274 12661454 11491019 10409892
58050 10409892 9427968 8547316 7764385 7069981 6451866 5900279 5409731 4975478 4591321
58041 4591321 4251483 3951581 3686646 3450582 3238312 3046278 2870612 2707447 2555478
58032 2555478 2415697 2287998 2170200 2060637 1959200 1865332 1777366 1694400 1616654 1543463
58022 1543463 1472946 1404116 1337384 1272721 1209371 1147718 1089374 1035030 984075 936544 893347
$$ packed form
58086H331501k54390k19051j86561j57946j30734r9473o2427k0876K7120Q4822
58076G311985J49862K16867K85624L59855M41521N35481O55864Q15481J008769
58067A1781309J212400J395327J512905J499223J296621R10152M21270o4776m80556
58058A9483875q06699j043572j193578j265119j274633j238820j170435j081127
58050A0409892r81924q80652p82931o94404o18115n51587m90548m34253l84157
58041D591321l39838k99902k64935k36064k12270j92034j75666j63165j51969
58032B555478j39781j27699j17798j09563j01437r3868q7966q2966p7746p3191
58022A543463p0517o8830o6732o4663o3350o1653n8344n4344n0955m7531m3197
$$ plain form
58011 893347 854165 817214 781629 748218 717390 688223 660173 633891 609739 587112 565794
58000 565794 546412 528976 512465 496342 481053 466585 452054 437225 423010 409916 397326
57989 397326 384815 372876 361811 351170 340792 331227 322616 314253 305747 297584 290165 283300 276976
57976 276976 271557 266916 262356 257678 253385 249604 245827 241919 238319 235019 231426 227462 223778 220633
57962 220633 217593 214595 212253 210800 209699 208569 207583 206758 205820 205006 205028 205982 207196 208414 210191 212922
57946 212922 216400 220578 225844 232299 239609 247738 256935 266814 276388 285171 293353 300703 306309 309649
57932 309649 310988 310472 307770 302942 296731 289716 281992 273903 266169 258955 251681 244037 236358 228784
57918 228784 220975 213017 205672 199366 193727 188490 184043 180650 177953 175644 173932 172954 172431 172274 172837
$$ packed form
58011H93347l9182l6951l5585l3411l0828k9167k8050k6282k4152k2627k1318
58000E65794j9382j7436j6511j6123j5289j4468j4531j4829j4215j3094j2590
57989C97326j2511j1939j1065j0641j0378r565q611q363q506q163p419o865o324
57976B76976n419m641m560m678m293l781l777l908l600l300l593l964l684l145
57962B20633l040k998k342j453j101j130r86q25r38q14K2R54J214J218J777K731
57946B12922L478M178N266O455P310Q129R197R879R574Q783Q182P350N606L340
57932C09649J339n16k702m828o211p015p724q089p734p214p274p644p679p574
57918B28784p809p958p345o306n639n237m447l393k697k309j712r78n23j57N63
$$ plain form
57903 172837 174167 175612 176607 177276 177937 178581 179042 179154 178514 176712 174008 171168 168506 165690 162570 159410
57887 159410 156179 152461 148413 144993 142873 141750 141024 140452 139891 139159 138547 138827 140359 142707 145421 148544
57871 148544 152118 155811 159392 162957 166428 169408 171745 173665 175167 175955 176093 175945 175295 173395 170191
57856 170191 166624 163325 159849 155669 151055 146418 141572 136311 131081 126396 122106 117859 113817 110336
57842 110336 107343 104490 101611 98623 95429 92279 89762 88086 86816 85596 84625 84083 83717 83376 83363 83797
57826 83797 84225 84342 84566 85395 86727 88291 90188 92435 94502 95902 96848 97777 98636 99158 99395 99408 98834
57809 98834 97420 95659 94324 93548 92881 91997 90887 89639 88475 87782 87661 87698 87551 87457 87786 88452 89193 90074
57791 90074 91226 92446 93545 94822 96646 98818 100837 102591 104321 106056 107552 108654 109346 109606 109498
$$ packed form
57903A72837J330J445R95O69O61O44M61J12o40j802k704k840k662k816l120l160
57887A59410l231l718m048l420k120j123p26n72n61p32o12K80J532K348K714L123
57871A48544L574L693L581L565L471K980K337J920J502P88J38j48o50j900l204
57856A70191l567l299l476m180m614m637m846n261n230m685m290m247m042l481
57842A10336k993k853k879k988l194l150k517j676j270j220r71n42l66l41j3M34
57826H3797M28J17K24Q29J332J564J897K247K067J400R46R29Q59N22K37J3n74
57809I8834j414j761j335p76o67q84j110j248j164o93j21L7j47r4L29O66P41Q81
57791I0074J152J220J099J277J824K172K019J754J730J735J496J102O92K60j08
$$ plain form
57776 109498 109219 108815 108108 107125 106165 105156 103468 100840 97985 95736 93999 92197 90339 88897 87868
57761 87868 86747 85374 84108 83134 82281 81600 81551 82394 83772 85060 85854 86063 85784 85152 84142 82568 80389
57744 80389 77931 75602 73563 71824 70406 69230 68090 66991 66236 65916 65660 65203 64839 64948 65416 65994
57728 65994 66859 68303 70131 71958 73877 76236 78880 81225 83010 84452 85703 86703 87582 88678 90055
57713 90055 91443 92734 94124 95700 97240 98526 99562 100411 101008 101175 100619 99052 96529 93523 90398
57698 90398 87019 83210 79364 76100 73467 71014 68589 66525 64997 63717 62409 61153 60090 59147 58236
57683 58236 57459 56990 56922 57309 58051 58728 58820 58259 57539 57178 57202 57266 57133 56933 56992 57460 58142 58810 59575 60721
57663 60721 62179 63494 64482 65500 66899 68576 70361 72383 74695 76911 78735 80456 82387 84183 85387
$$ packed form
57776A09498k79m04p07r83r60j009j688k628k855k249j737j802j858j442j029
57761H7868j121j373j266r74q53o81m9Q43J378J288P94K09k79o32j010j574k179
57744H0389k458k329k039j739j418j176j140j099p55l20k56m57l64J09M68N78
57728F5994Q65J444J828J827J919K359K644K345J785J442J251J000Q79J096J377
57713I0055J388J291J390J576J540J286J036Q49N97J67n56j567k523l006l125
57698I0398l379l809l846l264k633k453k425k064j528j280j308j256j063r43r11
57683E8236p77m69o8L87P42O77R2n61p20l61K4O4j33k00N9M68O82O68P65J146
57663F0721J458J315R88J018J399J677J785K022K312K216J824J721J931J796J204
$$ plain form
57648 85387 86370 87936 90104 92157 93882 95962 98917 102349 105589 108535 111532 114870 118750 123371 128703
57633 128703 134352 139875 145112 150174 155306 160758 166525 172276 177885 183906 191058 199305 208026 217144
57619 217144 227430 239532 253370 268811 286330 306526 329431 354765 382540 412899 445578
57608 445578 480011 515862 553053 591285 629763 667232 701945 731646 753894 766603 768440 759091
57596 759091 739497 711766 678564 642385 605190 568377 532821 499008 467230 437664 410331
57585 410331 385158 362131 341259 322407 305385 290195 276919 265385 255215 246278 238784 232789
57573 232789 227928 223780 220276 217611 215992 215560 216342 218150 220737 224072 228227 233018 238141 243736 250360
57558 250360 258243 267007 276353 286574 298072 310765 324395 339099 355179 372501 390538 408872
$$ packed form
57648H5387R83J566K168K053J725K080K955L432L240K946K997L338L880M621N332
57633A28703N649N523N237N062N132N452N767N751N609O021P152Q247Q721R118
57619B17144J0286J2102J3838J5441J7519K0196K2905K5334K7775L0359L2679
57608D45578L4433L5851L7191L8232L8478L7469L4713K9701K2248J2709J837r349
57596G59091j9594k7731l3202l6179l7195l6813l5556l3813l1778k9566k7333
57585D10331k5173k3027k0872j8852j7022j5190j3276j1534j0170q937p494n995
57573B32789m861m148l504k665j619m32P82J808K587L335M155M791N123N595O624
57558B50360P883Q764R346J0221J1498J2693J3630J4704J6080J7322J8037J8334
$$ plain form
57546 408872 427173 444710 460319 472964 482086 487372 488503 485253 477758 466559 452403 435943
57534 435943 417671 398139 378117 358278 338761 319376 300261 281968 264825 248605 233040
57523 233040 218269 204499 191600 179380 167971 157569 148062 139261 131264 124188 117769 111659 105948
57510 105948 100950 96593 92478 88462 84744 81375 78101 74727 71321 68055 65142 62872 61326 60098
57496 60098 58659 57003 55602 54696 54045 53445 53048 53052 53397 53988 54904 56193 57680 59169 60631 62061 63353
57479 63353 64527 65909 67868 70403 73140 75701 78000 80195 82489 85047 88102 91988 96857 102317
57465 102317 107673 112693 117981 124317 131811 139963 148425 157313 166810 176818 187078 197313 207179
57452 207179 216278 224326 231160 236549 240146 241620 240704 237210 231200 223082 213294 202021 189513 176529
$$ packed form
57546D08872J8301J7537J5609J2645R122N286J131l250p495j1199j4156j6460
57534D35943j8272j9532k0022j9839j9517j9385j9115j8293j7143j6220j5565
57523B33040j4771j3770j2899j2220j1409j0402r507q801p997p076o419o110n711
57510A05948m998m357m115m016l718l369l274l374l406l266k913k270j546j228
57496F0098j439j656j401r06o51o00l97ML45N91R16J289J487J489J462J430J292
57479F3353J174J382J959K535K737K561K299K195K294K558L055L886M869N460
57465A02317N356N020N288O336P494Q152Q462Q888R497J0008J0260J0235R866
57452B07179R099Q048O834N389L597J474r16l494o010q118r788j1273j2508j2984
$$ plain form
57438 176529 164016 152312 141083 130070 119471 109492 100019 91015 82834 75825 69836 64432 59385
57425 59385 54736 50532 46760 43464 40684 38372 36479 35050 34093 33500 33204 33293 33837 34764 36014 37700
57409 37700 39969 42822 46174 50011 54360 59214 64584 70551 77196 84521 92471 100957 109904 119369
57395 119369 129576 140623 152186 163717 174870 185444 194956 202639 207946 210747 210904 208025 201863
57382 201863 192715 181242 168095 153866 139129 124287 109501 94873 80546 66531 52748 39358
57370 39358 26826 15469 5132 -4552 -13845 -22876 -31670 -40007 -47584 -54484 -61170 -67797 -73944 -79282
57356 -79282 -84124 -88930 -93637 -97936 -101936 -106022 -110223 -114188 -117757 -121077 -124187 -126897 -129146 -131163
57342 -131163 -133217 -135408 -137712 -140022 -142190 -144206 -146252 -148389 -150340 -151796 -152825 -153732 -154661 -155582 -156527
$$ packed form
57438A76529j2513j1704j1229j1013j0599r979r473r004q181p009n989n404n047
57425E9385m649m204l772l296k780k312j893j429r57n93k96Q9N44R27J250J686
57409C7700K269K853L352L837M349M854N370N967O645P325P950Q486Q947R465
57395A19369J0207J1047J1563J1531J1153J0574R512P683N307K801J57k879o162
57382B01863r148j1473j3147j4229j4737j4842j4786j4628j4327j4015j3783j3390
57370C9358j2532j1357E132d552r293r031q794q337p577o900o686o627o147n338
57356g9282m842m806m707m299m000m086m201l965l569l320l110k710k249k017
57342a31163k054k191k304k310k168k016k046k137j951j456j029r07r29r21r45
$$ plain form
57327 -156527 -157558 -158584 -159501 -160372 -161255 -161979 -162416 -162781 -163381 -164170 -164896 -165549 -166296 -167145 -168070 -169364 -171419
57310 -171419 -174155 -177048 -179711 -182142 -184426 -186613 -188931 -191699 -194910 -198138 -200983 -203378 -205496 -207562
57296 -207562 -209757 -212060 -214208 -216037 -217792 -219883 -222412 -225179 -227984 -230630 -232785 -234265 -235368 -236585
57282 -236585 -238027 -239519 -241155 -243315 -246159 -249464 -252965 -256479 -259708 -262367 -264488 -266308 -267951 -269543
57268 -269543 -271452 -273906 -276497 -278586 -280118 -281490 -282742 -283581 -284184 -285215 -286849 -288499 -289745 -290896 -292331
57253 -292331 -293925 -295502 -297274 -299370 -301395 -302946 -304239 -305787 -307714 -309760 -311737 -313627 -315440 -317253
57239 -317253 -319280 -321632 -324179 -326793 -329501 -332276 -334932 -337428 -340049 -343096 -346548 -350161 -353706 -357010
57225 -357010 -359985 -362698 -365232 -367488 -369380 -371103 -372863 -374410 -375311 -375652 -375956 -376351 -376377 -375760 -374891 -374368
$$ packed form
57327a56527j031j026r17q71q83p24m37l65o00p89p26o53p47q49r25j294k055
57310a71419k736k893k663k431k284k187k318k768l211l228k845k395k118k066
57296b07562k195k303k148j829j755k091k529k767k805k646k155j480j103j217
57282b36585j442j492j636k160k844l305l501l514l229k659k121j820j643j592
57268b69543j909k454k591k089j532j372j252q39o03j031j634j650j246j151j435
57253b92331j594j577j772k096k025j551j293j548j927k046j977j890j813j813
57239c17253k027k352k547k614k708k775k656k496k621l047l452l613l545l304
57225c57010k975k713k534k256j892j723j760j547r01l41l04l95k6O17Q69N23
$$ plain form
57209 -374368 -374520 -375518 -377470 -380273 -383832 -388504 -394766 -402318 -410171 -417785 -425491 -433578 -441688 -449514 -457347
57194 -457347 -465442 -473413 -480760 -487533 -493974 -499959 -505244 -509868 -513884 -517106 -519594 -521972 -524807 -527984
57180 -527984 -531064 -533910 -536607 -539205 -541915 -545178 -549103 -553216 -557066 -560698 -564238 -567563 -570758 -574379
57166 -574379 -578798 -583753 -588989 -594806 -601460 -608509 -615315 -621773 -628038 -633983 -639482 -644810 -650163 -655159
57152 -655159 -659365 -662948 -666292 -669276 -671498 -672913 -673840 -674654 -675833 -677912 -680956 -684455 -688101 -692164 -696811
57137 -696811 -701708 -706737 -712398 -718927 -725694 -732163 -738807 -746387 -754934 -764181 -774451 -786294 -799693
57124 -799693 -814382 -830526 -848358 -867538 -887537 -908301 -929985 -952538 -976052 -1000944 -1027251
57113 -1027251 -1054392 -1082223 -1111568 -1143025 -1176036 -1209883 -1244744 -1280979 -1318242 -1356227 -1395469
$$ packed form
57209c74368j52r98j952k803l559m672o262p552p853p614p706q087q110p826p833
57194d57347q095p971p347o773o441n985n285m624m016l222k488k378k835l177
57180e27984l080k846k697k598k710l263l925m113l850l632l540l325l195l621
57166e74379m419m955n236n817o654p049o806o458o265n945n499n328n353m996
57152f55159m206l583l344k984k222j415r27q14j179k079l044l499l646m063m647
57137f96811m897n029n661o529o767o469o644p580q547r247j0270j1843j3399
57124g99693j4689j6144j7832j9180j9999k0764k1684k2553k3514k4892k6307
57113a027251k7141k7831k9345l1457l3011l3847l4861l6235l7263l7985l9242
$$ plain form
57102 -1395469 -1436384 -1478338 -1520662 -1563783 -1608372 -1654207 -1700955 -1749145 -1799162 -1850241 -1901773
57091 -1901773 -1954757 -2010584 -2069291 -2130449 -2194877 -2263852 -2337409 -2415074 -2497637 -2586559 -2682283
57080 -2682283 -2784667 -2894429 -3012531 -3138842 -3273074 -3416385 -3570406 -3735459 -3911392
57071 -3911392 -4099290 -4300537 -4515094 -4742681 -4984736 -5243213 -5518494 -5810835 -6123028
57062 -6123028 -6459366 -6822957 -7216483 -7644542 -8112521 -8624000 -9182090 -9792576 -10463230
57053 -10463230 -11201317 -12014986 -12916126 -13918767 -15035954 -16281805 -17675619 -19240648
57045 -19240648 -21000877 -22983950 -25226993 -27776617 -30686824 -34024270 -37876545 -42352560
57037 -42352560 -47579439 -53708000 -60921862 -69435794 -79485720 -91321187 -105192813 -121324033
$$ packed form
57102a395469m0915m1954m2324m3121m4589m5835m6748m8190n0017n1079n1532
57091a901773n2984n5827n8707o1158o4428o8975p3557p7665q2563q8922r5724
57080b682283j02384j09762j18102j26311j34232j43311j54021j65053j75933
57071c911392j87898k01247k14557k27587k42055k58477k75281k92341l12193
57062f123028l36338l63591l93526m28059m67979n11479n58090o10486o70654
57053a0463230p38087q13669r01140j002641j117187j245851j393814j565029
57045a9240648j760229j983073k243043k549624k910207l337446l852275m476015
57037d2352560n226879o128561p213862q513932j0049926j1835467j3871626j6131220
$$ plain form
57029 -121324033 -139883875 -160978250 -184634155 -210751160 -239068947 -269213185 -300746398
57022 -300746398 -333051795 -365047637 -395025387 -420910546 -440863066 -453792701 -459467753
57015 -459467753 -458288293 -451008889 -438571710 -422010983 -402355855 -380536764 -357333409
57008 -357333409 -333370751 -309142683 -285041484 -261376161 -238376926 -216204528 -194981266
57001 -194981266 -174829678 -155889023 -138302387 -122192457 -107639999 -94666667 -83227608
56994 -83227608 -73222717 -64520945 -56980613 -50459481 -44822030 -39946596 -35726465 -32065519
56986 -32065519 -28877097 -26087527 -23636768 -21474272 -19556780 -17849791 -16326723 -14964409
56978 -14964409 -13740959 -12637731 -11639977 -10734669 -9910252 -9158975 -8476436 -7857516 -7294710
$$ packed form
57029a21324033j8559842k1094375k3655905k6117005k8317787l0144238l1533213
57022c00746398l2305397l1995842k9977750k5885159j9952520j2929635n675052
57015d59467753J179460P279404J2437179J6560727J9655128K1819091K3203355
57008c57333409K3962658K4228068K4101199K3665323K2999235K2172398K1223262
57001a94981266K0151588J8940655J7586636J6109930J4552458J2973332J1439059
56994h3227608J0004891Q701772P540332O521132N637451M875434M220131L660946
56986c2065519L188422K789570K450759K162496J917492J706989J523068J362314
56978a4964409J223450J103228R97754R05308Q24417P51277O82539O18920N62806
$$ plain form
56969 -7294710 -6780826 -6310841 -5880369 -5484749 -5120569 -4785920 -4478110 -4192877 -3926614
56960 -3926614 -3677568 -3444263 -3224610 -3017370 -2822675 -2640230 -2468457 -2306150 -2153421
56951 -2153421 -2010364 -1876232 -1750551 -1633594 -1525063 -1423662 -1328627 -1240414 -1159376 -1085052
56941 -1085052 -1017260 -956517 -902799 -855181 -813286 -777864 -749432 -727615 -712353 -704436 -704213 -710899
56929 -710899 -723541 -741311 -762263 -783297 -802213 -818752 -833030 -844363 -852415 -858061 -862020 -863778
56917 -863778 -862936 -860455 -857295 -852854 -846265 -838658 -832424 -828136 -823302 -814486 -800249 -782179 -763696 -747849
56903 -747849 -735744 -726728 -719778 -714267 -709563 -704772 -699317 -693278 -686870 -680118 -673243 -666750 -660754 -654728
56889 -654728 -648233 -641385 -634358 -627001 -619228 -611237 -603056 -594437 -585493 -576832 -568733 -560794 -552664 -544523
$$ packed form
56969g294710N13884M69985M30472L95620L64180L34649L07810K85233K66263
56960c926614K49046K33305K19653K07240J94695J82445J71773J62307J52729
56951b153421J43057J34132J25681J16957J08531J01401R5035Q8213Q1038P4324
56941a085052O7792O0743N3718M7618M1895L5422K8432K1817J5262P917K23o686
56929g10899j2642j7770k0952k1034j8916j6539j4278j1333q052n646l959j758
56917h63778Q42K481L160M441O589P607O234M288M834Q816J4237J8070J8483J5847
56903g47849J2105R016O950N511M704M791N455O039O408O752O875O493N996O026
56889f54728O495O848P027P357P773P991Q181Q619Q944Q661Q099P939Q130Q141
$$ plain form
56875 -544523 -536507 -528299 -519742 -511243 -503186 -495447 -487925 -481030 -475209 -470415 -466388 -463035 -460191 -457469
56861 -457469 -454662 -451851 -448868 -445240 -440947 -436669 -432870 -429147 -424874 -419980 -414676 -408928 -402708 -396327
56847 -396327 -390113 -384041 -377987 -371979 -365952 -359743 -353540 -347854 -342760 -337731 -332506 -327478 -322870 -318220
56833 -318220 -313133 -307905 -302833 -297522 -291477 -284853 -277940 -270398 -261767 -252428 -243340 -235090 -227765 -221530
56819 -221530 -216613 -212847 -209780 -207161 -204880 -202602 -200001 -197242 -194751 -192532 -190080 -186893 -182763 -177703
56805 -177703 -171909 -165716 -159272 -152337 -144559 -135832 -126320 -116455 -107114 -99435 -94114 -91079 -89951 -90399
56791 -90399 -91874 -93544 -94908 -96072 -97067 -97356 -96426 -94405 -91603 -87901 -83158 -77752 -71992 -65288 -56656
56776 -56656 -45898 -33658 -20483 -6583 7481 20530 31279 38802 42538 42428 39222 34226 28588
$$ packed form
56875e44523Q016Q208Q557Q499Q057P739P522O895N821M794M027L353K844K722
56861d57469K807K811K983L628M293M278L799L723M273M894N304N748O220O381
56847c96327O214O072O054O008O027O209O203N686N094N029N225N028M608M650
56833c18220N087N228N072N311O045O624O913P542Q631R339R088Q250P325O235
56819b21530M917L766L067K619K281K278K601K759K491K219K452L187M130N060
56805a77703N794O193O444O935P778Q727R512R865R341P679N321L035J128m48
56791i0399j475j670j364j164r95k89R30K021K802L702M743N406N760O704Q632
56776e6656J0758J2240J3175f583G481J3049J0749P523L736j10l206m996n638
$$ plain form
56763 28588 22933 17546 12520 7799 3440 -192 -2775 -4394 -5252 -5148 -3642 -657 3544 8925 15762
56748 15762 24154 33737 43856 53621 61824 67224 69170 67854 64004 58514 52221 45707 39239 33003
56734 33003 27256 22085 17267 12655 8529 5256 2831 1104 269 635 2073 4122 6658 10009 14332
56719 14332 19182 23687 26894 28060 27004 24244 20490 16067 11026 5656 453 -4319 -8644 -12345 -15235
56704 -15235 -17601 -20081 -22920 -25742 -28171 -30270 -32247 -34092 -35741 -37284 -38771 -40024 -40827 -41181 -41250
56689 -41250 -41218 -41254 -41463 -41742 -41835 -41610 -41194 -40805 -40540 -40362 -40138 -39726 -39133 -38589 -38295 -38124 -37751 -37057 -36283 -35740
56669 -35740 -35476 -35240 -34695 -33747 -32691 -31954 -31612 -31311 -30725 -29864 -28811 -27507 -26049 -24905 -24449 -24486 -24609 -24815
56651 -24815 -25356 -26124 -26674 -26828 -26836 -26893 -26923 -26852 -26760 -26669 -26466 -26086 -25536 -24774 -23869 -23246 -23391 -24271 -25336 -26135 -26631
$$ packed form
56763B8588n655n387n026m721C440a92k583j619q58J04J506f57C544N381O837
56748A5762Q392R583J0119R765Q203N400J946j316l850n490o293o514o468o236
56734C3003n747n171m818m612m126l273k425A104B69L66J438K049K536L351M323
56719A4332M850M505L207J166j056k760l754m423n041n370D53d319m325l701k890
56704a5235k366k480k839k822k429k099j977j845j649j543j487j253q03l54o9
56689d1250L2l6k09k79r3K25M16L89K65J78K24M12N93N44K94J71L73O94P74N43
56669c5740K64K36N45R48J056P37L42L01N86Q61J053J304J458J144M56l7j23k06
56651b4815n41p68n50j54qn7l0P1R2R1K03L80N50P62R05O23j45q80j065p99m96
$$ plain form
56630 -26631 -26933 -27083 -27143 -27164 -26986 -26372 -25406 -24447 -23663 -22900 -22083 -21363 -20780 -20088 -19089 -17867 -16586 -15285 -13939
56611 -13939 -12507 -10863 -8947 -7032 -5492 -4283 -2955 -1321 252 1384 2163 2912 3678 4194 4262 3992
56595 3992 3726 3728 3861 3611 2594 975 -783 -2478 -4170 -5826 -7367 -9015 -11106 -13464 -15442 -16685 -17459
56578 -17459 -18079 -18456 -18424 -18076 -17507 -16600 -15366 -14204 -13546 -13473 -13869 -14636 -15522 -16092 -16198 -16229 -16571 -17057 -17263
56559 -17263 -17087 -16730 -16274 -15668 -14982 -14351 -13706 -12855 -11800 -10775 -9942 -9224 -8380 -7189 -5643 -4066 -2854
56542 -2854 -2095 -1564 -1109 -745 -313 519 1762 2914 3593 3985 4395 4696 4627 4342 4241 4404 4624 4859 5244
56523 5244 5764 6313 7003 8038 9322 10585 11854 13391 15161 16732 17844 18710 19655 20731 21817 22886
56507 22886 24003 25201 26448 27682 28865 30103 31644 33585 35643 37410 38839 40286 42076 44188
$$ packed form
56630b6631l02j50o0k1J78O14R66R59P84P63Q17P20N83O92R99J222J281J301J346
56611a3939J432J644J916J915J540J209J328a321B52J132P79P49P66N16O8k70
56595C992k66KJ33k50j017I75g83j695j692j656j541j648k091k358j978j243p74
56578a7459o20l77L2L48N69R07J234J162O58P3l96p67q86n70j06l1l42m86k06
56559a7263J76L57M56O06O86O31O45Q51J055J025Q33P18Q44J191J546J577J212
56542b854P59N31M55L64c13E19J243J152O79L92M10L01o9k85j01J63K20K35L85
56523E244N20N49O90J035J284J263J269J537J770J571J112Q66R45J076J086J069
56507B2886J117J198J247J234J183J238J541J941K058J767J429J447J790K112
$$ plain form
56493 44188 46406 48603 50829 53251 55971 58836 61482 63720 65795 68088 70623 73050 75044 76558
56479 76558 77729 78770 79908 81195 82350 82962 82877 82259 81340 80269 79116 77842 76306 74514 72783 71395
56463 71395 70139 68545 66598 64867 63831 63352 62936 62273 61322 60166 58989 58033 57327 56525 55229 53444
56447 53444 51544 49823 48271 46781 45356 43971 42408 40459 38278 36349 34971 33947 32920 31916
56433 31916 31284 31126 31041 30565 29660 28678 27980 27746 27956 28400 28788 28992 29117 29275 29421 29490 29509 29513 29499 29575 29906
56412 29906 30372 30578 30411 30301 30621 31121 31340 31389 31829 32881 34163 35239 36019 36616 37171 37906 39024 40449
56394 40449 41909 43289 44684 46098 47390 48544 49718 50997 52334 53749 55304 56871 58232 59450
56380 59450 60844 62522 64239 65773 67140 68383 69455 70433 71527 72737 73778 74463 74958 75502 76120 76687
$$ packed form
56493D4188K218K197K226K422K720K865K646K238K075K293K535K427J994J514
56479G6558J171J041J138J287J155O12q5o18r19j071j153j274j536j792j731j388
56463G1395j256j594j947j731j036m79m16o63r51j156j177r56p06q02j296j785
56447E3444j900j721j552j490j425j385j563j949k181j929j378j024j027j004
56433C1916o32j58q5m76r05r82o98k34K10M44L88K04J25J58J46O9J9Mj4P6L31
56412B9906M66K06j67j10L20N00K19M9M40J052J282J076P80N97N55P35J118J425
56394D0449J460J380J395J414J292J154J174J279J337J415J555J567J361J218
56380E9450J394J678J717J534J367J243J072R78J094J210J041O85M95N44O18N67
$$ plain form
56364 76687 77049 76992 76360 75338 74367 73660 73005 72174 71258 70492 69977 69706 69602 69434 68942 68182 67515 67150 66965
56345 66965 66838 66804 66732 66255 65294 64331 63859 63785 63673 63346 62963 62662 62457 62327 62155 61651 60565 58975 57212
56326 57212 55631 54526 54035 53961 53880 53590 53319 53318 53500 53684 53944 54463 55197 55976 56766 57599 58359 58862 59069 59085
56306 59085 59060 59227 59792 60579 61027 60823 60320 60090 60231 60443 60581 60743 60937 61029 61005 61003 61043 60997 60797 60507 60219
56285 60219 60034 60032 60096 59908 59357 58854 58987 59897 61173 62273 62865 62956 62924 63325 64394 65792 67021 67986 68930
56266 68930 69992 71111 72245 73425 74652 75976 77550 79385 81159 82541 83621 84771 86232 88078
56252 88078 90401 93172 96011 98415 100230 101674 103013 104437 106099 107968 109704 110965 111756 112235 112364
56237 112364 112046 111458 110898 110420 109970 109753 110022 110623 111153 111537 111996 112457 112470 111829 110847 109910 109068 108244 107563
$$ packed form
56364G6687L62n7o32j022r71p07o55q31r16p66n15k71j04j68m92p60o67l65j85
56345F6965j27l4p2m77r61r63m72p4j12l27l83l01k05j30j72n04j086j590j763
56326E7212j581j105m91p4q1k90k71jJ82J84K60N19P34P79P90Q33P60N03K07J6
56306E9085k5J67N65P87M48k04n03k30J41K12J38J62J94R2k4kM0m6k00k90k88
56285F0219j85kO4j88n51n03J33R10J276J100N92R1l2M01J069J398J229R65R44
56266F8930J062J119J134J180J227J324J574J835J774J382J080J150J461J846
56252H8078K323K771K839K404J815J444J339J424J662J869J736J261P91M79J29
56237A12364l18n88n60m78m50k17K69O01N30L84M59M61J3o41r82r37q42q24o81
$$ plain form
56218 107563 107263 107438 107957 108591 109215 109946 110979 112252 113452 114503 115739 117416 119326 121191 123123 125328
56202 125328 127705 130185 133142 136921 141196 145366 149426 153833 158690 163706 168905 174674 181053 187562
56188 187562 193842 199920 205827 211467 216859 222024 226630 230327 233394 236412 239329 241513 242773 243605
56174 243605 244269 244433 243954 243309 242869 242388 241560 240536 239524 238426 237222 236260 235721 235195 234138 232442 230285
56157 230285 227758 224900 221767 218344 214699 211327 208831 207122 205460 203443 201396 199597 197757 195594
56143 195594 193340 191326 189561 188054 187040 186498 185933 185003 183932 182956 181881 180517 179109 177927 176881
56128 176881 175890 175178 174859 174676 174497 174587 175035 175409 175398 175282 175360 175412 175199 175002 175171 175586 176063 176815 177983 179166
56108 179166 179973 180710 181956 183826 186086 188628 191295 193641 195447 197187 199476 202339 205442 208713 212261
$$ packed form
56218A07563l00J75N19O34O24P31J033J273J200J051J236J677J910J865J932K205
56202A25328K377K480K957L779M275M170M060M407M857N016N199N769O379O509
56188A87562O280O078N907N640N392N165M606L697L067L018K917K184J260Q32
56174B43605O64J64m79o45m40m81q28j024j012j098j204r62n39n26j057j696k157
56157B30285k527k858l133l423l645l372k496j709j662k017k047j799j840k163
56143A95594k254k014j765j507j014n42n65r30j071r76j075j364j408j182j046
56128A76881r91p12l19j83j79R0M48L74j1j16P8N2k13j97J69M15M77P52J168J183
56108A79166Q07P37J246J870K260K542K667K346J806J740K289K863L103L271L548
$$ plain form
56093 212261 216028 220002 224451 229472 234643 239610 244654 250298 256665 263684 271415 279696 287901 295651
56079 295651 303422 311927 321279 331296 342215 354498 368241 383397 400265 419270 440570 464396
56067 464396 491421 522343 557524 597533 643487 696117 754803 818087 884595 952711 1019799
56056 1019799 1082752 1139402 1189017 1231839 1268778 1301215 1330241 1355994 1377946 1395542 1408237
56045 1408237 1415534 1417610 1415561 1410506 1402785 1392202 1378228 1359389 1333369 1298698 1255966 1206852
56033 1206852 1152784 1095369 1037148 980646 927017 876541 829874 787709 749726 715026 683294
56022 683294 654554 628250 603686 581070 561044 543453 527575 513240 500704 489700 479631
56011 479631 470453 462472 455594 449669 445114 442225 440339 438691 437573 437545 438100 438313 438338 439005 440459 442458
$$ packed form
56093B12261L767L974M449N021N171M967N044N644O367P019P731Q281Q205P750
56079B95651P771Q505R352J0017J0919J2283J3743J5156J6868J9005K1300K3826
56067D64396K7025L0922L5181M0009M5954N2630N8686O3284O6508O8116O7088
56056A019799O2953N6650M9615M2822L6939L2437K9026K5753K1952J7596J2695
56045A408237P297K076k049n055p721j0583j3974j8839k6020l4671m2732m9114
56033A206852n4068n7415n8221n6502n3629n0476m6667m2165l7983l4700l1732
56022F83294k8740k6304k4564k2616k0026j7591j5878j4335j2536j1004j0069
56011D79631r178p981o878n925m555k889j886j648j118k8N55K13K5O67J454J999
$$ plain form
55995 442458 445479 450040 455377 460283 464918 470347 476664 483101 489679 497161 505533 514088 522870 532538
55981 532538 542960 553380 563845 574999 586669 598169 609792 622500 636281 650364 664797
55970 664797 680287 696717 713465 730864 749698 769575 789557 810056 832232 855856 879802
55959 879802 904371 931008 959826 989622 1020325 1053250 1088860 1126392 1165786 1207864 1252538
55948 1252538 1298909 1347227 1398724 1453553 1510956 1571273 1635546 1703441 1773948 1847943 1927504
55937 1927504 2012987 2103427 2199548 2303436 2415424 2534331 2660609 2796180 2941343 3095125
55927 3095125 3258433 3433344 3619499 3815066 4021208 4241609 4477592 4727954 4993638
55918 4993638 5278050 5582635 5906925 6253256 6626475 7028614 7459071 7920284 8417707
$$ packed form
55995D42458L021M561N337M906M635N429O317O437O578P482Q372Q555Q782R668
55981E32538J0422J0420J0465J1154J1670J1500J1623J2708J3781J4083J4433
55970F64797J5490J6430J6748J7399J8834J9877J9982K0499K2176K3624K3946
55959H79802K4569K6637K8818K9796L0703L2925L5610L7532L9394M2078M4674
55948A252538M6371M8318N1497N4829N7403O0317O4273O7895P0507P3995P9561
55937A927504Q5483R0440R6121J03888J11988J18907J26278J35571J45163J53782
55927C095125J63308J74911J86155J95567K06142K20401K35983K50362K65684
55918D993638K84412L04585L24290L46331L73219M02139M30457M61213M97423
$$ plain form
55909 8417707 8954071 9530054 10151139 10827345 11565969 12372368 13259128 14247485 15360091
55900 15360091 16621589 18066033 19732207 21650147 23844500 26354252 29240568 32582459
55892 32582459 36488451 41112642 46628116 53170432 60818960 69590659 79307716 89332193
55884 89332193 98450054 105194742 108484883 108083480 104543640 98794444 91754705 84163958
55876 84163958 76555132 69264717 62470402 56255519 50655650 45665633 41240659 37316666
55868 37316666 33830708 30724005 27942026 25442565 23198201 21186326 19382462 17765077
55860 17765077 16318372 15025874 13867193 12824203 11884757 11037632 10269558 9570054 8933962
55851 8933962 8356299 7829026 7345125 6901253 6494034 6117913 5768877 5446281 5148816
$$ packed form
55909H417707N36364N75983O21085O76206P38624Q06399Q86760R88357J112606
55900A5360091J261498J444444J666174J917940K194353K509752K886316L341891
55892C2582459L905992M624191N515474O542316P648528Q771699R717057J0024477
55884H9332193R117861O744688L290141m01403l539840n749196p039739p590747
55876H4163958p608826p290415o794315o214883n599869m990017m424974l923993
55868C7316666l485958l106703k781979k499461k244364k011875j803864j617385
55860A7765077j446705j292498j158681j042990r39446q47125p68074o99504o36092
55851H933962n77663n27273m83901m43872m07219l76121l49036l22596k97465
$$ plain form
55842 5148816 4872336 4613582 4372383 4148303 3938614 3741431 3557472 3386816 3227094
55833 3227094 3076634 2936243 2806096 2683816 2567440 2457443 2354192 2256179 2162504 2074432
55823 2074432 1992778 1916221 1843753 1776224 1713912 1655084 1598690 1546086 1498379 1454310 1412576
55812 1412576 1374064 1339997 1309806 1282637 1259177 1240264 1225208 1212907 1202962 1194181 1183643 1168810
55800 1168810 1149306 1125456 1096709 1062834 1025138 985087 943031 899465 856082 814303 774091
55789 774091 735397 699377 666967 637606 610559 586203 564858 545685 527951 512156 498774
55778 498774 487159 476787 468342 462393 458256 455309 454188 455542 458750 463063 468745 475801 482630 487234
55764 487234 488861 487426 482404 473530 461746 448351 433968 419139 404806 391217 377432 362990
$$ packed form
55842E148816k76480k58754k41199k24080k09689j97183j83959j70656j59722
55833C227094j50460j40391j30147j22280j16376j09997j03251r8013r3675q8072
55823B074432q1654p6557p2468o7529o2312n8828n6394n2604m7707m4069m1734
55812A412576l8512l4067l0191k7169k3460j8913j5056j2301r945q781j0538j4833
55800A168810j9504k3850k8747l3875l7696m0051m2056m3566m3383m1779m0212
55789G74091l8694l6020l2410k9361k7047k4356k1345j9173j7734j5795j3382
55778D98774j1615j0372q445n949m137k947j121J354L208M313N682P056O829M604
55764D87234J627j435n022q874j1784j3395j4383j4829j4333j3589j3785j4442
$$ plain form
55752 362990 349010 336610 325370 314469 304169 294947 286239 277446 269268 262677 257369 252556 248500
55739 248500 245880 244333 242988 241844 241362 241187 240565 239604 238948 238563 237873 236751 235398 233619 231164 228403
55723 228403 225790 223101 220000 216880 214342 212315 210558 209403 209150 209232 208840 207872 206481 204299 201005
55708 201005 197095 193222 189259 184872 180396 176296 172325 168124 164076 160611 157256 153377 149350 145985
55694 145985 143249 140527 137694 134949 132058 128750 125479 122823 120518 118041 115703 114118 112962 111363
55680 111363 109241 107278 105732 104311 103001 102069 101347 100374 99195 98245 97593 96962 96295 95596 94533 92921
55664 92921 91283 90178 89335 88147 86692 85424 84241 82756 81137 79787 78498 76851 75170 74170 73869
55649 73869 73724 73583 73618 73621 73348 73324 74247 75738 76695 76811 76744 76849 76753 76249 75581 74751 73413 71699 70332 69733
$$ packed form
55752C62990j3980j2400j1240j0901j0300r222q708q793q178o591n308m813m056
55739B48500k620j547j345j144m82j75o22r61o56l85o90j122j353j779k455k761
55723B28403k613k689l101l120k538k027j757j155k53Q2l92r68j391k182l294
55708B01005l910l873l963m387m476m100l971m201m048l465l355l879m027l365
55694A45985k736k722k833k745k891l308l271k656k305k477k338j585j156j599
55680A11363k122j963j546j421j310r32p22r73j179r50o52o31o67o99j063j612
55664I2921j638j105q43j188j455j268j183j485j619j350j289j647j681j000l01
55649G3869j45j41L5Lk73k4R23J491R57J16o7J05r6n04o68q30j338j714j367n99
$$ plain form
55629 69733 69668 69922 70637 71860 73364 75006 76775 78492 80007 81583 83520 85530 87101 88275 89366
55614 89366 90069 89681 88144 86134 84103 81923 79466 76861 74178 71512 69309 67950 67024 65735 63965
55599 63965 62309 61117 60246 59652 59518 59761 60068 60415 60938 61443 61686 62008 62894 64051 64730 64850 64927 65003 64575
55580 64575 63608 62653 61843 60733 59279 58072 57330 56527 55308 54045 53145 52549 52119 51867 51574 50921 50172
55563 50172 49931 50012 49381 47586 45465 43994 43170 42447 41612 40694 39623 38478 37675 37452 37531 37632 37883 38390
55545 38390 38871 39069 39078 38965 38486 37547 36562 35959 35642 35276 34792 34341 34003 33749 33481 33021 32350 31866 31975 32395
55525 32395 32422 31966 31740 32218 33014 33621 34138 34827 35476 35750 35854 36330 37407 38929 40712 42646 44557 46309
55507 46309 48009 49953 52429 55566 59171 62707 65681 68094 70249 72125 73298 73476 72767 71403 69591
$$ packed form
55629F9733o5K54P15J223J504J642J769J717J515J576J937K010J571J174J091
55614H9366P03l88j537k010k031k180k457k605k683k666k203j359r26j289j770
55599F3965j656j192q71n94j34K43L07L47N23N05K43L22Q86J157O79J20P7P6m28
55580F4575r67r55q10j110j454j207p42q03j219j263r00n96m30k52k93o53p49
55563E0172k41Q1o31j795k121j471q24p23q35r18j071j145q03k23P9J01K51N07
55545C8390M81J98Rj13m79r39r85o03l17l66m84m51l38k54k68m60o71m84J09M20
55525C2395K7m56k26M78P96O07N17O89O49K74J04M76J077J522J783J934J911J752
55507D6309J700J944K476L137L605L536K974K413K155J876J173J78p09j364j812
$$ plain form
55492 69591 67623 65675 63488 60702 57554 54662 52078 49197 45817 42617 40209 38318 36336 34212
55478 34212 32309 30756 29439 28373 27634 27056 26398 25699 25191 24913 24637 24126 23358 22580 22134 22059 21920 21264
55460 21264 20218 19283 18626 18009 17407 17169 17446 17994 18689 19753 21225 22748 24115 25557 27141 28380
55444 28380 28853 28850 28995 29498 30120 30621 30862 30698 30149 29533 29157 28981 28767 28385 27809 27031 26145 25306 24455 23355
55424 23355 22046 20966 20415 20170 19874 19523 19332 19326 19335 19170 18701 17897 17001 16409 16247 16281 16333 16513 16881 17235
55404 17235 17426 17580 17764 17756 17408 16979 16809 16826 16672 16153 15377 14597 14104 14111 14540 15038 15329 15426 15428 15296 14967 14493
55382 14493 13994 13593 13389 13294 12934 12046 10991 10499 10834 11543 12094 12383 12518 12531 12518 12723 13235 13839 14314 14578
55362 14578 14523 14087 13563 13453 13822 14220 14368 14489 14753 14898 14697 14412 14421 14735 15160 15659 16255 16880 17547 18440
$$ packed form
55492F9591j968j948k187k786l148k892k584k881l380l200k408j891j982k124
55478C4212j903j553j317j066p39n78o58o99n08k78k76n11p68p78m46p5j39o56
55460B1264j046r35o57o17o02k38K77N48O95J064J472J523J367J442J584J239
55444B8380M73lJ45N03O22N01K41j64n49o16l76j76k14l82n76p78q86q39q51j100
55424B3355j309j080n51k45k96l51j91oRj65m69q04q96n92j62L4N2J80L68L54
55404A7235J91J54J84ql48m29j70J7j54n19p76p80m93PM29M98K91R7Kj32l29m74
55382A4493m99m01k04r5l60q88j055m92L35P09N51K89J35J3j3K05N12O04M75K64
55362A4578n5m36n24j10L69L98J48J21K64J45k01k85RL14M25M99N96O25O67Q93
$$ plain form
55342 18440 19579 20697 21613 22391 22959 23011 22515 21941 21644 21422 20981 20456 20130 19957 19769 19638 19663 19654 19401 19013
55322 19013 18655 18197 17487 16695 16040 15384 14468 13399 12575 12245 12397 12865 13348 13534 13422 13334 13427 13495 13420 13431
55302 13431 13630 13677 13305 12801 12584 12617 12625 12607 12732 12971 13217 13554 14054 14509 14728 14806 14802 14451 13650 12911 12821 13230
55280 13230 13481 13270 12826 12324 11668 10865 10195 9897 9959 10210 10449 10549 10574 10693 10864 10838 10619 10597 11017 11599
55260 11599 11937 11961 11762 11353 10926 10922 11433 11879 11758 11335 11158 11248 11325 11481 11991 12652 12984 12941 12833 12697 12335
55239 12335 11904 11800 11992 12051 11872 11789 11941 12069 12067 12168 12443 12543 12180 11508 10875 10467 10287 10216 10028 9585 9090
55218 9090 8907 9105 9397 9518 9445 9273 9078 8884 8574 7993 7277 6918 7217 7858 8289 8326 8098 7706 7308 7287
55198 7287 7805 8408 8535 8331 8431 9069 9845 10325 10349 9850 8895 7900 7306 7050 6758 6419 6351 6576 6741 6708
$$ packed form
55342A8440J139J118R16P78N68N2m96n74k97k22m41n25l26j73j88j31K5rk53l88
55322A9013l58m58p10p92o55o56r16j069q24l30J52M68M83J86j12q8R3O8p5J1
55302A3431J99M7l72n04k17L3Qj8J25K39K46L37N00M55K19P8ml51q01p39r0M09
55280A3230K51k11m44n02o56q03o70k98O2K51K39J00K5J19J71k6k19k2M20N82
55260A1599L38K4j99m09m27mN11M46j21m23j77R0P7J56N10O61L32m3j08j36l62
55239A2335m31j04J92N9j79q3J52J28kJ01K75J00l63o72o33m08j80p1j88m43m95
55218I090j83J98K92J21p3j72j95j94l10n81p16l59K99O41M31L7k28l92l98k1
55198G287N18O03J27k04J00O38P76M80K4m99r55r95n94k56k92l39o8K25J65l3
$$ plain form
55178 6708 6669 6656 6469 6180 6133 6349 6417 6166 5949 6054 6275 6268 5985 5542 5026 4632 4656 5133 5735 6178 6485 6762
55156 6762 6997 7149 7221 7189 7095 7204 7707 8316 8535 8358 8282 8580 9044 9518 10165 11021 11709 11896 11710 11475 11343
55135 11343 11354 11535 11724 11603 11110 10547 10108 9600 8849 8129 7904 8339 9226 10226 11045 11539 11794 11927 11796
55116 11796 11160 10185 9451 9298 9407 9249 8719 8118 7729 7535 7321 6911 6394 6123 6340 6826 7139 7117 6936
55097 6936 6737 6539 6504 6856 7461 7831 7694 7255 6858 6697 6943 7754 8972 10099 10733 10823 10482 9855 9242
55078 9242 8984 9063 9157 9178 9391 9910 10488 10996 11622 12343 12633 12120 11202 10603 10555 10749 10904 10985 11027 11094 11373 11975
55056 11975 12694 13190 13422 13671 14167 14867 15605 16269 16834 17269 17495 17452 17229 17030 16943 16794 16392 15836 15351 14916
55036 14916 14344 13694 13269 13189 13290 13472 13793 14189 14454 14593 14832 15164 15283 15082 14872 14896 15046 15224 15601 16203
$$ packed form
55178F708l9j3j87k89m7K16O8k51k17J05K21pk83m43n16l94K4M77O02M43L07K77
55156F762K35J52P2l2r4J09N03O09K19j77p6K98M64M74O47Q56O88J87j86k35j32
55135A1343J1J81J89j21m93n63m39n08p51p20k25M35Q87J000Q19M94K55J33j31
55116A1796o36r75p34j53J09j58n30o01l89j94k14m10n17k71K17M86L13k2j81
55097F936j99j98l5L52O05L70j37m39l97j61K46Q11J218J127O34R0l41o27o13
55078I242k58P9R4K1K13N19N78N08O26P21K90n13r18n99m8J94J55Q1M2O7K79O02
55056A1975P19M96K32K49M96P00P38O64N65M35K26m3k23j99q7j49m02n56m85m35
55036A4916n72o50m25q0J01J82L21L96K65J39K39L32J19k01k10K4J50J78L77O02
$$ plain form
55016 16203 16652 16649 16430 16347 16282 15867 15132 14498 14232 14212 14227 14245 14344 14580 14886 15039 14800 14206 13585 13222 13140 13278
54994 13278 13614 13972 14009 13662 13389 13662 14347 14874 14947 14808 14845 15180 15693 16231 16725 17125 17352 17342 17183 17097 17173
54973 17173 17228 17096 16960 17103 17454 17725 17986 18641 19720 20618 20764 20206 19346 18426 17561 16954 16762 16900 17221
54954 17221 17698 18276 18795 19312 20231 21798 23667 25220 26175 26616 26660 26396 26051 25868 25870 25917 25921 25851 25643 25306
54934 25306 24946 24551 23948 23164 22629 22694 23075 23108 22536 21750 21258 21112 20971 20601 20194 20145 20514 20861 20768 20437
54914 20437 20481 21163 22172 23151 24035 24813 25359 25707 26095 26512 26599 26254 25997 26367 27245 28122 28771 29294 29709
54895 29709 29940 30080 30323 30701 31185 31921 33068 34496 35936 37346 38893 40655 42528 44360 46040 47598
54879 47598 49372 51806 54898 58111 61001 63664 66286 68612 70226 71094 71402 71093 70012 68337 66393
$$ packed form
55016A6203M49lk19q3o5m15p35o34k66k0J5J8R9K36L06J53k39n94o21l63q2J38
54994A3278L36L58L7l47k73K73O85N27P3j39L7L35N13N38M94M00K27j0j59q6P6
54973A7173N5j32j36J43L51K71K61O55J079Q98J46n58q60r20q65o07j92J38L21
54954A7221M77N78N19N17R19J567J869J553R55M41M4k64l45j83KM7Mp0k08l37
54934B5306l60l95o03p84n35O5L81L3n72p86m92j46j41l70m07m9L69L47r3l31
54914B0437M4O82J009R79Q84P78N46L48L88M17Q7l45k57L70Q78Q77O49N23M15
54895B9709K31J40K43L78M84P36J147J428J440J410J547J762J873J832J680J558
54879D7598J774K434L092L213K890K663K622K326J614Q68L08l09j081j675j944
$$ plain form
54864 66393 64164 61418 58243 55051 52101 49411 47052 45116 43426 41680 39880 38269 36899 35625
54850 35625 34508 33792 33446 33112 32607 32110 31841 31830 32112 32805 33863 35033 36148 37304 38703 40527 42929
54833 42929 45893 49079 52053 54682 57075 59145 60550 61101 60952 60288 59055 57134 54609 51766 48957
54818 48957 46461 44345 42410 40477 38644 37110 35801 34409 32842 31373 30291 29585 29035 28444 27765
54803 27765 27154 26902 27148 27667 28054 28115 27949 27695 27374 26987 26575 26192 25906 25732 25513 25004 24217 23488 23005
54784 23005 22526 21817 21124 20821 20762 20469 19882 19424 19296 19182 18813 18398 18266 18350 18295 17875 17178 16490 16097 16052
54764 16052 16077 15835 15338 14919 14800 14858 14890 14923 15158 15713 16457 17045 17180 16954 16831 17145 17727 18212 18586 19144
54744 19144 19987 20873 21564 22036 22364 22668 23173 24036 25119 26188 27328 28836 30685 32490 34095 35859
$$ packed form
54864F6393k229k746l175l192k950k690k359j936j690j746j800j611j370j274
54850C5625j117p16l46l34n05m97k69j1K82O93J058J170J115J156J399J824K402
54833D2929K964L186K974K629K393K070J405N51j49o64j233j921k525k843k809
54818D8957k496k116j935j933j833j534j309j392j567j469j082p06n50n91o79
54803B7765o11k52K46N19L87O1j66k54l21l87m12l83k86j74k19n09p87p29m83
54784B3005m79p09o93l03n9k93n87m58j28j14l69m15j32Q4n5m20o97o88l93m5
54764A6052K5k42m97m19j19N8L2L3K35N55P44N88J35k26j23L14N82M85L74N58
54744A9144Q43Q86O91M72L28L04N05Q63J083J069J140J508J849J805J605J764
$$ plain form
54728 35859 38170 40927 43741 46427 49149 52161 55582 59305 63048 66541 69720 72674 75393 77689
54714 77689 79296 79972 79595 78383 76949 75888 75251 74620 73679 72516 71401 70535 70027 69889 70000 70246 70727
54697 70727 71658 73062 74712 76347 77805 78996 79929 80678 81157 81075 80389 79597 79211 79045 78466 77330 76211
54680 76211 75682 75777 76259 76996 77886 78754 79475 80001 80153 79702 78659 77202 75271 72653 69515 66412 63569
54663 63569 60610 57212 53638 50360 47484 44884 42542 40437 38344 36158 34239 33058 32561 32190 31494
54648 31494 30483 29461 28717 28355 28226 28057 27738 27438 27320 27296 27178 26943 26705 26507 26327 26170 26039 25869 25635
54629 25635 25490 25681 26309 27234 28130 28671 28773 28709 28905 29547 30481 31444 32271 32911 33436 34055 34949 36021 36962
54610 36962 37609 38080 38610 39390 40563 42112 43765 45208 46420 47574 48664 49525 50219 51085 52353 54030
$$ packed form
54728C5859K311K757K814K686K722L012L421L723L743L493L179K954K719K296
54714G7689J607O76l77j212j434j061o37o31r41j163j115q66n08j38J11K46M81
54697G0727R31J404J650J635J458J191R33P49M79q2o86p92l86j66n79j136j119
54680G6211n29R5M82P37Q90Q68P21N26J52m51j043j457j931k618l138l103k843
54663F3569k959l398l574l278k876k600k342k105k093k186j919j181m97l71o96
54648C1494j011j022p44l62j29j69l19l00j18k4j18k35k38j98j80j57j31j70k34
54629B5635j45J91O28R25Q96N41J02o4J96O42R34R63Q27O40N25O19Q94J072R41
54610C6962O47M71N30P80J173J549J653J443J212J154J090Q61O94Q66J268J677
$$ plain form
54594 54030 56213 59069 62378 65518 68221 71032 74695 79314 84387 89476 94510 99536 104489 109168
54580 109168 113250 116311 117994 118183 117049 114949 112260 109142 105497 101280 96800 92484 88411 84393
54566 84393 80482 77026 74178 71686 69289 66986 64820 62746 60856 59327 58038 56592 54942 53532
54552 53532 52565 51529 49833 47571 45316 43451 42042 41111 40591 40211 39772 39422 39314 39229 38836 38169 37449
54535 37449 36642 35597 34520 33881 33841 34123 34434 34702 34915 35008 34982 34947 35002 35184 35457 35617 35426 34996 34849 35314
54515 35314 36036 36374 36143 35702 35431 35468 35809 36284 36490 36154 35589 35478 36168 37428 38851 40180 41252 41952
54497 41952 42352 42693 43142 43776 44728 46062 47497 48550 49072 49413 49994 50915 52044 53281 54592 55959 57393
54480 57393 58928 60542 62184 63900 65839 68091 70585 73159 75632 77838 79674 81075 81916 81998 81249
$$ packed form
54594E4030K183K856L309L140K703K811L663M619N073N089N034N026M953M679
54580A09168M082L061J683J89j134k100k689l118l645m217m480m316m073m018
54566H4393l911l456k848k492k397k303k166k074j890j529j289j446j650j410
54552E3532r67j036j696k262k255j865j409r31n20l80m39l50j08q5l93o67p20
54535C7449q07j045j077o39m0K82L11K68K13R3k6l5N5J82K73J60j91m30j47M65
54515C5314P22L38k31m41k71L7L41M75K06l36n65j11O90J260J423J329J072P00
54497D1952M00L41M49O34R52J334J435J053N22L41N81R21J129J237J311J367J434
54480E7393J535J614J642J716J939K252K494K574K473K206J836J401Q41Q2p49
$$ plain form
54465 81249 79837 77994 75831 73444 71083 68996 67168 65406 63610 61815 60048 58342 56818 55507
54451 55507 54174 52534 50672 49009 47847 47142 46704 46431 46307 46345 46593 47023 47422 47545 47416 47332 47540 47991
54433 47991 48436 48639 48554 48389 48533 49264 50493 51830 52908 53602 54022 54376 54804 55269 55668 56094 56828 57951
54415 57951 59140 60020 60573 61007 61390 61663 61922 62358 62894 63164 62969 62554 62332 62435 62616 62521 62049 61479 61239
54396 61239 61505 62057 62554 62836 62895 62739 62454 62242 62190 62086 61674 60995 60275 59561 58709 57708 56731 55830 54837
54377 54837 53675 52549 51726 51221 50846 50495 50255 50230 50314 50264 49996 49709 49575 49465 49184 48877 48866 49075 49032 48592
54357 48592 48275 48594 49382 50128 50697 51342 52164 52955 53529 53895 54137 54394 54864 55596 56365 56968 57500 58103 58635
54338 58635 58929 59209 59857 60853 61824 62541 62990 63039 62487 61476 60447 59606 58800 57971 57372 57180 57229 57208 56953
$$ packed form
54465H1249j412j843k163k387k361k087j828j762j796j795j767j706j524j311
54451E5507j333j640j862j663j162p05m38k73j24L8K48M30L99J23j29q4K08M51
54433D7991M45K03q5j65J44P31J229J337J078O94M20L54M28M65L99M26P34J123
54415E7951J189Q80N53M34L83K73K59M36N36K70j95m15k22J03J81r5m72n70k40
54396F1239K66N52M97K82N9j56k85k12n2j04m12o79p20p14q52j001r77r01r93
54377E4837j162j126q23n05l75l51k40k5Q4n0k68k87j34j10k81l07j1K09m3m40
54357D8592l17L19P88P46N69O45Q22P91N74L66K42K57M70P32P69O03N32O03N32
54338E8635K94K80O48R96R71P17M49M9n52j011j029q41q06q29n99j92M9k1k55
$$ plain form
54319 56953 56427 55681 54879 54171 53504 52781 52145 51837 51798 51741 51621 51654 51876 52048 52089 52225 52558 52850 52901 52840 52910
54298 52910 53212 53829 54878 56239 57472 58211 58452 58336 57911 57283 56716 56378 56156 55899 55624 55316 54774 53896
54280 53896 52946 52290 51988 51853 51754 51620 51250 50418 49162 47784 46520 45396 44430 43807 43706 43990 44196 43957
54262 43957 43369 42833 42510 42115 41331 40269 39314 38631 38018 37196 36079 34836 33818 33310 33157 32788 31868 30734
54244 30734 29890 29251 28344 27160 26294 26123 26339 26454 26372 26230 26032 25725 25437 25351 25446 25501 25276 24670 23814 23005
54224 23005 22398 21796 20963 20046 19394 19022 18675 18374 18414 18729 18814 18472 18186 18458 19165 19836 20213 20254 19974 19597
54204 19597 19528 19826 20007 19732 19386 19545 20133 20609 20810 21089 21675 22338 22782 23011 23189 23401 23590 23618 23393 23078
54184 23078 23048 23468 24003 24168 23907 23595 23546 23773 24166 24614 24927 24876 24454 23892 23370 22824 22117 21306 20644 20365
$$ packed form
54319E6953n26p46q02p08o67p23o36l08l9n7j20L3K22J72M1J36L33K92N1o1P0
54298E2910L02O17J049J361J233P39K41j16m25o28n67l38k22k57k75l08n42q78
54280E3896r50o56l02j35r9j34l70q32j256j378j264j124r66o23j01K84K06k39
54262D3957n88n36l23l95p84j062r55o83o13q22j117j243j018n08j53l69r20j134
54244C0734q44o39r07j184q66j71K16J15q2j42j98l07k88q6R5N5k25o06q56q09
54224B3005o07o02q33r17o52l72l47l01M0L15Q5l42k86K72P07O71L77M1k80l77
54204A9597o9K98J81k75l46J59N88M76K01K79N86O63M44K29J78K12J89K8k25l15
54184B3078l0M20N35J65k61l12m9K27L93M48L13n1m22n62n22n46p07q11o62k79
$$ plain form
54164 20365 20493 20851 21217 21460 21530 21422 21227 21081 20929 20472 19588 18707 18462 18954 19668 20115 20196 19898 19102 17892
54144 17892 16703 15887 15387 15056 14989 15244 15542 15569 15397 15276 15230 15084 14755 14240 13535 12806 12400 12413 12463 12207
54124 12207 11820 11625 11500 11128 10649 10544 10939 11465 11783 11851 11642 11077 10322 9781 9646 9740 9903 10267 11015 12035
54104 12035 12961 13469 13498 13274 13072 12899 12533 11982 11679 11954 12556 13007 13269 13655 14205 14609 14695 14612 14472 14242
54084 14242 14048 14178 14668 15219 15608 15869 15991 15795 15285 14749 14344 13881 13260 12815 12916 13423 13837 13892 13754
54065 13754 13695 13769 13844 13813 13718 13706 13865 14141 14470 14877 15382 15906 16429 17102 17943 18538 18387 17558 16655 16126 15903
54044 15903 15752 15591 15367 15013 14753 15091 16179 17461 18236 18405 18369 18380 18345 18196 18121 18391 19122 20199 21247
54025 21247 21756 21447 20595 19820 19561 19788 20201 20555 20767 20820 20652 20160 19368 18543 18013 17873 17957 18129 18394 18704
$$ packed form
54164B0365J28L58L66K43P0j08j95j46j52m57q84q81k45M92P14M47Q1k98p96j210
54144A7892j189q16n00l31o7K55K98K7j72j21m6j46l29n15p05p29m06J3N0k56
54124A2207l87j95j25l72m79j05L95N26L18O8k09n65p55n41j35R4J63L64P48J020
54104A2035R26N08K9k24k02j73l66n51l03K75O02M51K62L86N50M04Q6q3j40k30
54084A4242j94J30M90N51L89K61J22j96n10n36m05m63o21m45J01N07M14N5j38
54065A3754n9P4P5l1r5j2J59K76L29M07N05N24N23O73Q41N95j51q29r03n29k23
54044A5903j51j61k24l54k60L38J088J282P75J69l6J1l5j49p5K70P31J077J048
54025B1247N09l09q52p75k59K27M13L54K12N3j68m92p92q25n30j40Q4J72K65L10
$$ plain form
54005 18704 18908 19055 19490 20386 21338 21722 21423 20916 20657 20687 20834 21019 21193 21253 21166 21073 21089 21147 21164 21247 21575 22129
53983 22129 22710 23213 23718 24267 24720 24910 24904 25006 25497 26346 27205 27717 27921 28263 29136 30445 31753 32841 33943
53964 33943 35344 36976 38603 40221 42010 43905 45553 46780 47858 49114 50453 51450 51870 51919 52009 52394
53948 52394 52994 53492 53633 53537 53656 54316 55290 55993 56096 55833 55622 55543 55306 54677 53789 52965 52336 51730 50903 49789
53928 49789 48518 47299 46332 45681 45090 44082 42478 40784 39787 39699 39896 39602 38644 37452 36521 36084 36104 36340
53910 36340 36447 36238 35820 35392 34948 34353 33659 33145 33040 33334 33858 34398 34730 34686 34303 33818 33461 33299 33294 33459
53890 33459 33881 34592 35464 36263 36824 37181 37524 38081 38985 40158 41274 41987 42304 42617 43232 44017 44692 45287
53872 45287 46002 46765 47377 48060 49322 51131 52724 53509 53770 54183 54963 55832 56530 56985 57191 57304 57685 58499
$$ packed form
54005A8704K04J47M35Q96R52L84k99n07k59L0J47J85J74O0q7r3J6N8J7Q3L28N54
53983B2129N81N03N05N49M53J90oJ02M91Q49Q59N12K04L42Q73J309J308J088J102
53964C3943J401J632J627J618J789J895J648J227J078J256J339R97M20M9R0L85
53948E2394O00M98J41r6J19O60R74P03J03k63k11p9k37o29q88q24o29o06q27j114
53928D9789j271j219r67o51n91j008j604j694r97q8J97k94r58j192r31m37K0K36
53910C6340J07k09m18m28m44n95o94n14j05K94N24N40L32m4l83m85l57j62nJ65
53890C3459M22P11Q72P99N61L57L43N57R04J173J116P13L17L13O15P85O75N95
53872D5287P15P63O12O83J262J809J593P85K61M13P80Q69O98M55K06J13L81Q14
$$ plain form
53854 58499 59488 60421 61500 62904 64259 65090 65655 66707 68485 70535 72518 74599 76903 79148 81102
53839 81102 82957 84976 87080 89038 90771 92271 93453 94291 94865 95165 95076 94672 94248 93905 93369 92427 91292
53822 91292 90346 89741 89407 89192 88841 88069 86873 85578 84374 83023 81241 79128 76992 74958 73060 71494
53806 71494 70421 69608 68588 67185 65642 64246 63065 62056 61146 60162 58884 57302 55710 54458 53630
53791 53630 52982 52174 51052 49771 48621 47711 46878 45927 44882 43966 43385 43178 43214 43256 43087 42665 42187 41978
53773 41978 42264 42962 43668 43965 43823 43608 43611 43685 43557 43286 43114 42982 42606 42024 41648 41656 41728 41556 41263 41114 41173
53752 41173 41471 42176 43218 44072 44316 44216 44317 44621 44630 44165 43680 43686 44223 44995 45723 46260 46623 47065 47877 49004
53732 49004 50065 50828 51491 52365 53532 54930 56551 58337 60023 61363 62466 63692 65187 66695 67818
$$ packed form
53854E8499R89R33J079J404J355Q31N65J052J778K050J983K081K304K245J954
53839H1102J855K019K104J958J733J500J182Q38N74L00q9m04m24l43n36r42j135
53822I1292r46o05l34k15l51p72j196j295j204j351j782k113k136k034j898j566
53806G1494j073q13j020j403j543j396j181j009r10r84j278j582j592j252q28
53791E3630o48q08j122j281j150r10q33r51j045r16n81k07L6M2j69m22m78k09
53773D1978K86O98P06K97j42k15LP4j28k71j72j32l76n82l76QP2j72k93j49N9
53752D1173K98P05J042Q54K44j00J01L04Rm65m85ON37P72P28N37L63M42Q12J127
53732D9004J061P63O63Q74J167J398J621J786J686J340J103J226J495J508J123
$$ plain form
53717 67818 68409 68612 68697 68848 69061 69178 69080 68894 68945 69439 70206 70814 70936 70550 69825 68872 67692 66331 65008
53698 65008 63998 63369 62878 62199 61273 60327 59537 58793 57933 57052 56358 55777 55043 54221 53804 54049 54496 54422 53685
53679 53685 52791 52177 51768 51246 50504 49703 49073 48749 48679 48636 48446 48201 48106 48128 48005 47622 47150 46743 46314 45761
53659 45761 45233 44991 45087 45355 45645 45943 46277 46642 47031 47477 48027 48689 49381 49996 50498 50955 51372 51614 51522 51100
53639 51100 50507 49992 49885 50454 51580 52708 53398 53833 54531 55650 56889 58036 59229 60614 62070 63385
53623 63385 64457 65216 65632 65886 66302 66978 67742 68547 69599 70983 72430 73664 74726 75776 76814 77784
53607 77784 78742 79674 80425 80968 81562 82371 83138 83506 83507 83459 83490 83431 83122 82627 82210 82204 82747 83497 83802 83383 82670
53586 82670 82245 82157 82039 81745 81464 81341 81309 81302 81337 81339 81150 80708 80075 79310 78510 77927 77785 77979 78190 78247 78218 78160
$$ packed form
53717F7818N91K03Q5J51K13J17r8j86N1M94P67O08J22l86p25r53j180j361j323
53698F5008j010o29m91o79r26r46p90p44q60q81o94n81p34q22m17K45M47p4p37
53679E3685q94o14m09n22p42q01o30l24p0m3j90k45r5K2j23l83m72m07m29n53
53659D5761n28k42R6K68K90K98L34L65L89M46N50O62O92O15N02M57M17K42r2m22
53639E1100n93n15j07N69J126J128O90M35O98J119J239J147J193J385J456J315
53623F3385J072P59M16K54M16O76P64Q05J052J384J447J234J062J050J038R70
53607G7784R58R32P51N43N94Q09P67L68Jm8L1n9l09m95m17oN43P50L05m19p13
53586H2670m25q8j18k94k81j23l2pL5Kj89m42o33p65q00n83j42J94K11N7k9n8
$$ plain form
53564 78160 78060 78019 78250 78817 79514 80074 80374 80449 80449 80610 81128 82020 83172 84462 85742 86791 87516 88167 89176
53545 89176 90717 92545 94272 95669 96770 97819 99135 100859 102786 104561 106032 107336 108696 110229
53531 110229 111962 113866 115837 117753 119550 121203 122641 123790 124666 125386 126118 127039 128291 129900 131764
53516 131764 133701 135450 136679 137221 137335 137505 137910 138299 138461 138546 138740 138951 139030 139040 139022 138731 137998 137134 136605
53497 136605 136441 136330 136185 136190 136337 136344 136054 135590 135083 134608 134349 134484 134788 134770 134301 133827 133812 134247 134858 135513 136271
53476 136271 137242 138507 139989 141349 142262 142950 144115 146168 148699 150974 152766 154521 156773 159638 162817
53461 162817 165957 169016 172359 176450 181381 186800 192310 197816 203451 209337 215570 222321 229725 237675
53447 237675 245858 254039 262308 271011 280437 290567 301159 312052 323305 335032 347252 359992
$$ packed form
53564G8160j00m1K31N67O97N60L00P5%J61N18Q92J152J290J280J049P25O51J009
53545H9176J541J828J727J397J101J049J316J724J927J775J471J304J360J533
53531A10229J733J904J971J916J797J653J438J149Q76P20P32R21J252J609J864
53516A31764J937J749J229N42J14J70M05L89J62Q5J94K11P9J0j8k91p33q64n29
53497A36605j64j11j45NJ47Pk90m64n07m75k59J35L04j8m69m74j5M35O11O55P58
53476A36271R71J265J482J360R13O88J165K053K531K275J792J755K252K865L179
53461A62817L140L059L343M091M931N419N510N506N635N886O233O751P404P950
53447B37675Q183Q181Q269Q703R426J0130J0592J0893J1253J1727J2220J2740
$$ plain form
53435 359992 373353 387278 401419 415457 429468 443713 458136 472400 486443 500664 515463
53424 515463 530858 546644 562699 579005 595623 612773 630743 649505 668528 687139 704996
53413 704996 722130 738612 754330 769028 782486 794707 805946 816489 826390 835550 844057 852256
53401 852256 860479 868806 877172 885492 893558 900999 907509 913053 917737 921528 924213 925623 925788 924860 922875
53386 922875 919608 914718 908100 900034 890885 880754 869591 857564 845066 832299 819078 805149
53374 805149 790549 775572 760508 745520 730645 715799 700878 685870 670820 655681 640421
53363 640421 625354 611175 598496 587374 577415 568252 559868 552510 546457 541837 538632 536785 536296
53350 536296 537185 539415 542964 547913 554376 562306 571483 581692 592830 604877 617832 631702 646505
$$ packed form
53435C59992J3361J3925J4141J4038J4011J4245J4423J4264J4043J4221J4799
53424E15463J5395J5786J6055J6306J6618J7150J7970J8762J9023J8611J7857
53413G04996J7134J6482J5718J4698J3458J2221J1239J0543R901R160Q507Q199
53401H52256Q223Q327Q366Q320Q066P441O510N544M684L791K685J410J65r28j985
53386I22875l267m890o618q066r149j0131j1163j2027j2498j2767j3221j3929
53374H05149j4600j4977j5064j4988j4875j4846j4921j5008j5050j5139j5260
53363F40421j5067j4179j2679j1122r959r163q384p358o053m620l205j847m89
53350E36296Q89K230L549M949O463P930R177J0209J1138J2047J2955J3870J4803
$$ plain form
53337 646505 662297 679204 697307 716448 736296 756733 778011 800415 823923 848422 874076
53326 874076 901174 929703 959384 990105 1021990 1055061 1089135 1124090 1159951 1196647 1233948
53315 1233948 1271652 1309630 1347660 1385492 1423062 1460340 1496936 1532209 1565787 1597721 1628045
53304 1628045 1656588 1683337 1708665 1732985 1756417 1778913 1800412 1820707 1839464 1856544 1872090
53293 1872090 1886107 1898162 1907643 1914028 1916734 1914968 1907994 1895435 1877297 1853945 1826192 1795054
53281 1795054 1761194 1724862 1686457 1646710 1606077 1564392 1521540 1478118 1434958 1392196 1349322
53270 1349322 1306028 1262575 1219393 1176766 1134921 1094003 1053901 1014398 975590 937909 901696
53259 901696 867008 833881 802540 773238 746048 720924 697881 677044 658534 642263 627826
$$ packed form
53337F46505J5792J6907J8103J9141J9848K0437K1278K2404K3508K4499K5654
53326H74076K7098K8529K9681L0721L1885L3071L4074L4955L5861L6696L7301
53315A233948L7704L7978L8030L7832L7570L7278L6596L5273L3578L1934L0324
53304A628045K8543K6749K5328K4320K3432K2496K1499K0295J8757J7080J5546
53293A872090J4017J2055R481O385K706j766o974j2559j8138k3352k7753l1138
53281A795054l3860l6332l8405l9747m0633m1685m2852m3422m3160m2762m2874
53270A349322m3294m3453m3182m2627m1845m0918m0102l9503l8808l7681l6213
53259I01696l4688l3127l1341k9302k7190k5124k3043k0837j8510j6271j4437
$$ plain form
53248 627826 614698 602674 592045 583256 576458 571427 567773 565082 563018 561464 560529 560357 561043 562740
53234 562740 565588 569438 573899 578846 584579 591294 598692 606395 614514 623431 633283 644006 655701 668504
53220 668504 682190 696343 710873 725976 741622 757498 773457 789615 805937 822137 838074
53209 838074 853891 869612 884943 899630 913738 927423 940727 953775 966889 980196 993263
53198 993263 1005363 1015986 1024973 1032285 1037871 1041729 1043850 1044093 1042184 1037886 1031118 1021913 1010297 996236
53184 996236 979758 961139 940876 919369 896652 872593 847379 821640 796085 771050 746452
53173 746452 722131 698188 674973 652716 631147 609616 587678 565436 543259 521270 499304
53162 499304 477240 455185 433340 411904 391094 371096 351999 333855 316743 300669 285520
$$ packed form
53248F27826j3128j2024j0629q789o798n031l654k691k064j554r35j72O86J697
53234E62740K848L850M461M947N733O715P398P703Q119Q917R852J0723J1695J2803
53220F68504J3686J4153J4530J5103J5646J5876J5959J6158J6322J6200J5937
53209H38074J5817J5721J5331J4687J4108J3685J3304J3048J3114J3307J3067
53198I93263J2100J0623Q987P312N586L858K121K43j909m298o768r205j1616j4061
53184I96236j6478j8619k0263k1507k2717k4059k5214k5739k5555k5035k4598
53173G46452k4321k3943k3215k2257k1569k1531k1938k2242k2177k1989k1966
53162D99304k2064k2055k1845k1436k0810j9998j9097j8144j7112j6074j5149
$$ plain form
53151 285520 271308 258375 247075 237275 228423 220116 212351 205243 198743 192775 187324 182282 177386
53138 177386 172511 167848 163605 159671 155762 151805 147950 144230 140460 136564 132791 129436 126418 123364
53124 123364 120117 116957 114199 111770 109369 106906 104526 102279 100110 98149 96599 95229 93391 90815
53110 90815 88070 85932 84561 83620 82874 82242 81434 80108 78383 76745 75374 74005 72511 71184 70278 69659
53094 69659 69137 68826 68868 69019 68805 68030 66904 65741 64674 63702 62833 62168 61824 61773 61788 61640 61281 60755 60023
53075 60023 59071 58136 57591 57564 57860 58227 58535 58690 58641 58547 58715 59263 59994 60637 61057 61208 61077 60763 60416 60067
53055 60067 59684 59420 59530 59963 60307 60284 60065 59954 59962 59920 59790 59641 59422 58984 58308 57576 57029 56827 56937 57089
53035 57089 56962 56513 56003 55647 55389 55140 55016 55152 55386 55380 55028 54556 54260 54254 54484 54867 55373 56008 56724 57335
$$ packed form
53151B85520j4212j2933j1300r800q852q307p765p108o500n968n451n042m896
53138A77386m875m663m243l934l909l957l855l720l770l896l773l355l018l054
53124A23364l247l160k758k429k401k463k380k247k169j961j550j370j838k576
53110I0815k745k138j371r41p46o32q08j326j725j638j371j369j494j327r06o19
53094F9659n22l11M2J51k14p75j126j163j067r72q69o65l44n1J5j48l59n26p32
53075F0023r52r35n45k7K96L67L08J55m9r4J68N48P31O43M20J51j31l14l47l49
53055F0067l83k64J10M33L44k3k19j11Qm2j30j49k19m38o76p32n47k02J10J52
53035E7089j27m49n10l56k58k49j24J36K34ol52m72k96oK30L83N06O35P16O11
$$ plain form
53015 57335 57625 57605 57543 57645 57819 57813 57522 57011 56337 55484 54463 53365 52307 51404 50768 50415 50207 49954 49578
52996 49578 49117 48566 47808 46748 45514 44424 43707 43265 42826 42323 41966 41805 41435 40409 38902 37634 37072
52979 37072 36978 36857 36574 36327 36225 36168 36067 35929 35734 35419 35004 34569 34093 33425 32502 31492 30658 30078 29541
52960 29541 28749 27678 26730 26430 26898 27653 27981 27537 26560 25560 24862 24474 24314 24413 24799 25260 25457 25323 25181
52941 25181 25342 25713 25952 25869 25484 24851 24094 23532 23431 23627 23678 23454 23296 23526 24068 24676 25243 25717 25975 25975
52921 25975 25879 25845 25862 25934 26185 26593 26803 26519 25961 25634 25697 25827 25721 25476 25385 25562 25884 26225 26597 27037 27440
52900 27440 27572 27308 26770 26173 25591 25033 24670 24719 25083 25358 25373 25475 26122 27319 28658 29750 30432 30724 30808
52881 30808 30996 31452 31994 32332 32444 32530 32659 32724 32753 32992 33580 34324 34941 35387 35832 36376 36934 37382 37742 38124
$$ packed form
53015E7335K90k0o2J02J74ok91n11o74q53j021j098j058r03o36l53k08k53l76
52996D9578m61n51p58j060j234j090p17m42m39n03l57j61l70j026j507j268n62
52979C7072r4j21k83k47j02n7j01j38j95l15m15m35m76o68r23j010q34n80n37
52960B9541p92j071r48l00M68P55L28m44r77j000o98l88j60R9L86M61J97j34j42
52941B5181J61L71K39q3l85o33p57n62j01J96N1k24j58K30N42O08N67M74K58%
52921B5975r6l4J7P2K51M08K10k84n58l27O3J30j06k45r1J77L22L41L72M40M03
52900B7440J32k64n38n97n82n58l63M9L64K75J5J02O47J197J339J092O82K92Q4
52881C0808J88M56N42L38J12Q6J29O5K9K39N88P44O17M46M45N44N58M48L60L82
$$ plain form
52861 38124 38506 38618 38150 37108 35895 34972 34470 34166 33783 33275 32822 32607 32556 32370 31888 31382 31293 31635 31856
52842 31856 31434 30462 29443 28668 28037 27402 26834 26472 26283 26091 25767 25365 25104 25184 25564 25960 26155 26236 26390
52823 26390 26495 26147 25168 23967 23234 23267 23721 24030 24029 24075 24537 25286 25788 25704 25212 24711 24351 23963 23361 22600
52803 22600 21923 21559 21540 21649 21596 21310 21046 21112 21546 22125 22647 23090 23512 23903 24161 24169 23909 23546 23376 23609 24162
52782 24162 24730 25058 25151 25226 25549 26289 27464 28905 30249 31040 30997 30230 29183 28280 27694 27432 27477 27710 27837
52763 27837 27693 27581 28058 29262 30670 31629 31987 32026 31966 31772 31430 31172 31312 31906 32680 33317 33757 34185 34698
52744 34698 35120 35189 34877 34404 34025 33881 33960 34061 33874 33313 32687 32345 32209 31910 31317 30658 30088 29515 28919 28495
52724 28495 28289 27977 27230 26112 24992 24196 23875 23952 24100 23994 23734 23744 24143 24555 24701 24799 25088 25305 25065
$$ packed form
52861C8124L82J12m68j042j213r23n02l04l83n08m53k15n1j86m82n06q9L42K21
52842C1856m22r72j019p75o31o35n68l62j89j92l24m02k61Q0L80L96J95Q1J54
52823B6390J05l48r79j201p33L3M54L09jM6M62P49N02q4m92n01l60l88o02p61
52803B2600o77l64j9J09n3k86k64O6M34N79N22M43M22L91K58Qk60l63j70K33N53
52782B4162N68L28R3P5L23P40J175J441J344P91m3p67j047r03n86k62M5K33J27
52763B7837j44j12M77J204J408R59L58L9o0j94l42k58J40N94P74O37M40M28N13
52744C4698M22O9l12m73l79j44P9J01j87n61o26l42j36k99n93o59n70n73n96m24
52724B8495k06l12p47j118j120p96l21P7J48j06k60J0L99M12J46R8K89K17k40
$$ plain form
52705 25065 24479 23935 23483 22898 22254 21883 21797 21612 21169 20790 20834 21277 21888 22509 23008 23172 22864 22164 21308 20584
52685 20584 20226 20224 20224 19839 19112 18494 18321 18502 18733 18822 18746 18565 18345 18050 17532 16818 16299 16384 16916 17273 17130
52664 17130 16858 17003 17634 18396 19009 19438 19660 19535 19018 18341 17886 17882 18215 18556 18711 18817 19137 19690 20179 20267
52644 20267 19860 19119 18310 17651 17221 16981 16943 17247 17956 18813 19324 19157 18411 17532 17043 17234 17928 18560 18651 18249
52624 18249 17764 17441 17189 16950 16932 17310 17890 18295 18446 18661 19219 20001 20619 20878 20980 21276 21867 22555 23118
52605 23118 23557 24049 24789 25869 27182 28352 28906 28655 27913 27285 27288 28083 29362 30421 30575 29714 28388 27266
52587 27266 26652 26542 26851 27343 27580 27280 26651 26127 25841 25589 25193 24668 24092 23528 23070 22763 22556 22478 22702
52568 22702 23238 23733 23866 23823 24049 24677 25518 26462 27465 28192 28173 27404 26395 25544 24834 24217 23893 24006 24373
$$ packed form
52705B5065n86n44m52n85o44l71q6j85m43l79M4M43O11O21M99J64l08p00q56p24
52685B0584l58k%l85p27o18j73J81K31Q9p6j81k20k95n18p14n19Q5N32L57j43
52664A7130k72J45O31P62O13M29K22j25n17o77m55mL33L41J55J06L20N53M89Q8
52644B0267m07p41q09o59m30k40l8L04P09Q57N11j67p46q79m89J91O94O32R1m02
52624A8249m85l23k52k39j8L78N80M05J51K15N58P82O18K59J02K96N91O88N63
52605B3118M39M92P40J080J313J170N54k51p42o28LP95J279J059J54q61j326j122
52587B7266o14j10L09M92K37l00o29n24k86k52l96n25n76n64m58l07k07p8K24
52568B2702N36M95J33m3K26O28Q41R44J003P27j9p69j009q51p10o17l24J13L67
$$ plain form
52549 24373 24714 24962 25179 25381 25543 25603 25407 24871 24200 23687 23286 22728 22100 21910 22392 23172 23782 24164 24412
52530 24412 24400 24024 23526 23213 23029 22700 22192 21706 21318 20944 20635 20623 21034 21665 22102 21991 21317 20485 20025 20125
52510 20125 20538 20990 21475 22093 22798 23475 24067 24496 24625 24496 24444 24761 25342 25848 26122 26292 26550 26971 27483
52491 27483 27892 28001 27803 27465 27084 26626 26146 25859 25846 25915 25908 25935 26148 26454 26698 26941 27315 27725 27952 27973 27962
52470 27962 28036 28175 28341 28468 28424 28192 28008 28150 28588 29006 29148 29012 28798 28773 29093 29574 29770 29440 28900 28717
52450 28717 29122 29860 30536 30912 30916 30612 30199 29881 29693 29511 29223 28821 28333 27799 27246 26679 26129 25721 25584 25635
52430 25635 25625 25428 25154 24889 24578 24255 24156 24396 24758 25053 25454 26191 27062 27628 27784 27833 28004 28219 28345 28372
52410 28372 28313 28135 27851 27492 26982 26256 25509 25130 25339 26059 27104 28289 29368 30123 30596 31000 31335 31329 30845
$$ packed form
52549B4373L41K48K17K02J62O0j96n36o71n13m01n58o28j90M82P80O10L82K48
52530B4412j2l76m98l13j84l29n08m86l88l74l09j2M11O31M37j11o74q32m60J00
52510B0125M13M52M85O18P05O77N92M29J29j29n2L17N81N06K74J70K58M21N12
52491B7483M09J09j98l38l81m58m80k87j3O9pK7K13L06K44K43L74M10K27K1j1
52470B7962P4J39J66J27m4k32j84J42M38M18J42j36k14k5L20M81J96l30n40j83
52450B8717M05P38O76L76Ml04m13l18j88j82k88m02m88n34n53n67n50m08j37N1
52430B5635j0j97k74k65l11l23r9K40L62K95M01P37Q71N66J56M9J71K15J26K7
52410B8372n9j78k84l59n10p26p47l79K09P20J045J185J079P55M73M04L35om84
$$ plain form
52391 30845 30131 29533 29158 28933 28870 29042 29370 29641 29782 29971 30376 30838 30981 30678 30290 30288 30692 31060 31067 30869 30838
52370 30838 31116 31570 32014 32300 32348 32263 32308 32544 32647 32299 31648 31131 30929 30865 30791 30777 30906 31146 31452 31763 31894
52349 31894 31660 31178 30805 30699 30640 30406 30098 29972 30111 30391 30691 30987 31304 31623 31817 31700 31251 30759 30623
52330 30623 30966 31534 32005 32237 32278 32269 32407 32811 33354 33760 33894 33865 33790 33638 33391 33188 33186 33317 33338 33088 32666 32376
52308 32376 32507 33103 33914 34619 35131 35622 36262 36999 37609 37949 38121 38421 39035 39779 40248 40282 40120 39971 39658
52289 39658 38982 38277 38195 38908 39885 40581 40974 41262 41370 41117 40649 40312 40162 39943 39587 39394 39601 40033 40351
52270 40351 40480 40596 40794 40994 41108 41139 41066 40855 40605 40547 40807 41275 41807 42380 42962 43385 43586 43798 44268 44842
52250 44842 45136 45096 45076 45304 45608 45785 45957 46371 47063 47944 48981 50153 51386 52729 54373 56298 58078
$$ packed form
52391C0845p14n98l75k25o3J72L28K71J41J89M05M62J43l03l88kM04L68Pj98l1
52370C0838K78M54M44K86M8q5M5K36J03l48o51n17k02o4p4j4J29K40L06L11J31
52349C1894k34m82l73j06n9k34l08j26J39K80L00K96L17L19J94j17m49m92j36
52330C0623L43N68M71K32M1rJ38M04N43M06J34k9p5j52k47k03kJ31K1k50m22k90
52308C2376J31N96Q11P05N12M91O40P37O10L40J72L00O14P44M69L4j62j49l13
52289C9658o76p05q2P13R77O96L93K88J08k53m68l37j50k19l56j93K07M32L18
52270D0351J29J16J98K00J14L1p3k11k50n8K60M68N32N73N82M23K01K12M70N74
52250D4842K94m0k0K28L04J77J72M14O92Q81J037J172J233J343J644J925J780
$$ plain form
52233 58078 59275 59859 60109 60281 60619 61388 62575 63757 64622 65451 66687 68205 69435 70129 70539 70896 71218
52216 71218 71685 72684 74307 76146 77753 78989 79850 80339 80668 81207 82034 82830 83382 83894 84569 85225 85627 85935
52198 85935 86508 87449 88619 89917 91280 92525 93509 94356 95311 96423 97594 98796 99980 100895 101352 101651
52182 101651 102390 103777 105396 106716 107631 108336 108916 109284 109414 109442 109530 109786 110333 111279 112550 113847 114944
52165 114944 115965 117246 118878 120522 121758 122506 123006 123487 124005 124558 125213 126075 127208 128586 130079 131546
52149 131546 133006 134615 136410 138167 139664 140972 142351 143926 145624 147338 148959 150338 151451 152568
52135 152568 153992 155641 157154 158390 159563 160828 162038 163046 163982 165039 166173 167159 167823 168138 168188 168149
52119 168149 168197 168344 168471 168518 168558 168630 168731 168981 169595 170546 171419 171737 171331 170368 169146 167963 167047 166450 166039
$$ packed form
52233E8078J197N84K50J72L38P69J187J182Q65Q29J236J518J230O94M10L57L22
52216G1218M67R99J623J839J607J236Q61M89L29N39Q27P96N52N12O75O56M02L08
52198H5935N73R41J170J298J363J245R84Q47R55J112J171J202J184R15M57K99
52182A01651P39J387J619J320R15P05N80L68J30K8Q8K56N47R46J271J297J097
52165A14944J021J281J632J644J236P48N00M81N18N53O55Q62J133J378J493J467
52149A31546J460J609J795J757J497J308J379J575J698J714J621J379J113J117
52135A52568J424J649J513J236J173J265J210J008R36J057J134R86O64L15N0l9
52119A68149M8J47J27M7M0P2J01K50O14R51Q73L18m06r63j222j183r16n97m11
$$ plain form
52100 166039 165653 165218 164772 164460 164472 164844 165305 165474 165197 164596 163857 163139 162577 162118 161444 160334 159064 158129
52082 158129 157629 157284 156963 156716 156325 155387 154029 152946 152453 152015 151124 150149 149798 150054 150206 149760 148825 147703
52064 147703 146582 145612 144908 144427 144082 143914 143873 143592 142721 141479 140496 140077 139933 139667 139210 138692 138141 137472
52046 137472 136628 135626 134586 133744 133349 133471 133942 134452 134695 134542 134177 133981 134159 134574 134991 135367 135787 136300
52028 136300 136952 137812 138802 139651 140199 140615 141134 141806 142679 143967 145701 147448 148763 149770 150931 152347
52012 152347 153682 154740 155682 156657 157598 158456 159306 160113 160752 161311 162073 163102 164185 165275 166672 168586
51996 168586 170808 172989 175003 176786 178095 178723 178840 178883 179118 179508 179942 180429 181035 181738 182372 182749 182863
51979 182863 182928 183115 183243 182904 181939 180629 179380 178361 177551 176939 176519 176134 175538 174661 173718 172959 172335 171474
$$ packed form
52100A66039l86m35m46l12J2L72M61J69k77o01p39p18n62m59o74j110j270r35
52082A58129n00l45l21k47l91r38j358j083m93m38q91r75l51K56J52m46r35j122
52064A47703j121r70p04m81l45j68m1k81q71j242r83m19j44k66m57n18n51o69
52046A37472q44j002j040q42l95J22M71N10K43j53l65j96J78M15M17L76M20N13
52028A36300O52Q60R90Q49N48M16N19O72Q73J288J734J747J315J007J161J416
52012A52347J335J058R42R75R41Q58Q50Q07O39N59P62J029J083J090J397J914
51996A68586K222K181K014J783J309O28J17M3K35L90M34M87O06P03O34L77J14
51979A82863O5J87J28l39r65j310j249j019q10o12m20l85n96q77r43p59o24q61
$$ plain form
51961 171474 170082 168350 166852 165984 165620 165376 165058 164702 164305 163767 163117 162598 162423 162545 162647 162371 161591 160580
51943 160580 159823 159566 159588 159476 159003 158138 156914 155503 154285 153535 153110 152660 152061 151379 150528 149298 147677
51926 147677 145818 143709 141288 138865 136935 135421 133579 130920 127859 125119 122759 120216 117100 113584
51912 113584 110052 106733 103671 100776 97818 94597 91197 87950 85090 82580 80257 78056 75977 73974
51898 73974 71992 70110 68501 67196 65949 64516 63038 61963 61474 61171 60485 59304 57965 56739 55634
51883 55634 54657 53936 53481 53091 52655 52326 52236 52240 52079 51656 51015 50191 49268 48477 48048 47981 48026 47851 47246 46303 45475
51862 45475 45216 45456 45609 45241 44560 44069 43913 43842 43683 43537 43503 43448 43188 42732 42257 41935 41836 41933 42126 42282 42312
51841 42312 42238 42196 42358 42793 43399 43995 44443 44652 44567 44288 44118 44270 44529 44451 43937 43353 42975 42617 42008 41284
$$ packed form
51961A71474j392j732j498q68l64k44l18l56l97n38o50n19j75J22J02k76p80j011
51943A60580p57k57K2j12m73q65j224j411j218p50m25m50n99o82q51j230j621
51926A47677j859k109k421k423j930j514j842k659l061k740k360k543l116l516
51912A13584l532l319l062k895k958l221l400l247k860k510k323k201k079k003
51898G3974j982j882j609j305j247j433j478j075m89l03o86j181j339j226j105
51883E5634r77p21m55l90m36l29r0Mj61m23o41q24r23p91m29o7M5j75o05r43q28
51862D5475k59K40J53l68o81m91j56p1j59j46l4n5k60m56m75l22r9R7J93J56L0
51841D2312p4m2J62M35O06N96M48K09q5k79j70J52K59p8n14n84l78l58o09p24
$$ plain form
51821 41284 40798 40578 40342 39985 39710 39633 39561 39296 38976 38931 39311 39973 40669 41218 41540 41649 41669 41799 42153 42600
51801 42600 42820 42628 42246 42123 42463 43011 43372 43430 43330 43194 43027 42909 43088 43751 44778 45785 46442 46733 46927
51782 46927 47294 47863 48452 48862 49021 48990 48942 49093 49515 50026 50425 50799 51396 52170 52712 52801 52815 53328 54482 55947
51762 55947 57394 58720 59905 60939 61944 63099 64414 65785 67277 69077 71116 72974 74329 75258 75927
51747 75927 76210 75866 74986 73985 73161 72494 71859 71189 70383 69289 67908 66482 65291 64441 63915 63672 63592 63456
51729 63456 63186 62992 63089 63327 63307 62877 62262 61688 61113 60446 59813 59424 59310 59385 59605 59893 59991 59645 58901 58052
51709 58052 57290 56628 56084 55715 55434 55024 54446 53951 53775 53857 53960 53945 53823 53627 53358 52995 52488 51787 50976 50277
51689 50277 49835 49533 49085 48336 47451 46793 46569 46574 46364 45768 45152 44999 45310 45609 45567 45358 45355 45670 46099 46342 46171
$$ packed form
51821D1284m86k20k36l57k75p7p2k65l20m5L80O62O96N49L22J09K0J30L54M47
51801D2600K20j92l82j23L40N48L61N8j00j36j67j18J79O63J027J007O57K91J94
51782D6927L67N69N89M10J59l1m8J51M22N11L99L74N97P74N42Q9J4N13J154J465
51762E5947J447J326J185J034J005J155J315J371J492J800K039J858J355R29O69
51747G5927K83l44q80j001q24o67o35o70q06j094j381j426j191q50n26k43q0j36
51729F3456k70j94R7K38k0m30o15n74n75o67o33l89j14P5K20K88R8l46p44q49
51709E8052p62o62n44l69k81m10n78m95j76Q2J03j5j22j96k69l63n07p01q11o99
51689E0277m42l02m48p49q85o58k24Nk10n96o16j53L11K99m2k09lL15M29K43j71
$$ plain form
51668 46171 45568 44850 44494 44685 45143 45530 45863 46383 47127 47838 48240 48199 47716 46897 45976 45199 44691 44468 44494 44574
51648 44574 44328 43511 42365 41480 41212 41350 41384 41036 40450 39923 39508 38978 38216 37526 37387 37923 38787 39615 40344
51629 40344 40976 41287 41010 40199 39192 38306 37732 37577 37756 37901 37677 37227 37109 37735 39026 40553 41830 42491
51611 42491 42456 42048 41738 41750 41994 42364 42867 43434 43856 44035 44079 44063 43907 43607 43421 43595 44017 44336 44372 44237 44107
51590 44107 44043 44042 44095 44156 44165 44170 44376 44977 45958 47096 48141 48982 49629 50070 50216 50024 49623 49244 49044 49062 49285 49668
51568 49668 50082 50353 50386 50186 49808 49402 49257 49611 50352 51069 51500 51797 52237 52772 53099 53110 53091 53401 54091 54892
51548 54892 55523 55903 56100 56160 56042 55703 55214 54702 54203 53640 52972 52307 51757 51265 50678 49956 49236 48646 48176
51529 48176 47756 47387 47125 46982 46870 46644 46218 45709 45472 45852 46806 47832 48375 48287 47834 47354 47017 46855 46834
$$ packed form
51668D6171o03p18l56J91M58L87L33N20P44P11M02m1m83q19r21p77n08k23K6Q0
51648D4574k46q17j146q85k68J38L4l48n86n27m15n30p62o90j39N36Q64Q28P29
51629D0344O32L11k77q11j007q86n74j55J79J45k24m50j18O26J291J527J277O61
51611D2491l5m08l10J2K44L70N03N67M22J79M4j6j56l00j86J74M22L19L6j35j30
51590D4107o4jN3O1RNK06O01R81J138J045Q41O47M41J46j92m01l79k00J8K23L83
51568D9668M14K71L3k00l78m06j45L54P41P17M31K97M40N35L27J1j9L10O90Q01
51548E4892O31L80J97O0j18l39m89n12m99n63o68o65n50m92n87p22p20n90m70
51529D8176m20l69k62j43j12k26m26n09k37L80R54J026N43q8m53m80l37j62k1
$$ plain form
51510 46834 46872 46920 47081 47479 47975 48195 47965 47567 47444 47748 48326 49049 49922 50937 52000 53008 53835 54285 54236
51491 54236 53863 53547 53464 53460 53405 53478 53961 54815 55630 55975 55750 55239 54858 54844 55121 55457 55705 55868 56002 56196 56582
51470 56582 57208 57896 58418 58856 59536 60527 61416 61782 61746 61854 62465 63421 64315 64942 65436 66016 66660 67075 67085 66944
51450 66944 67087 67564 67966 67990 67776 67536 67103 66207 65015 64051 63616 63588 63779 64127 64451 64359 63631 62532 61565
51431 61565 60995 60718 60491 60136 59580 58882 58195 57640 57178 56659 55973 55128 54208 53326 52607 52130 51851 51619 51285
51412 51285 50794 50170 49489 48893 48544 48412 48191 47599 46791 46214 45971 45558 44505 43079 42001 41564 41408 41156
51394 41156 40824 40495 40008 39281 38623 38397 38534 38690 38723 38695 38548 38142 37597 37251 37205 37171 36864 36350 35918 35726
51374 35726 35683 35596 35382 35140 35021 34998 34901 34688 34563 34703 34994 35188 35212 35188 35251 35486 35937 36523 37060 37540 38196
$$ packed form
51510D6834L8M8J61L98M96K20k30l98j23L04N78P23Q73J015J063J008Q27M50m9
51491E4236l73l16q3mn5P3M83Q54Q15L45k25n11l81j4K77L36K48J63J34J94L86
51470E6582O26O88N22M38O80R91Q89L66l6J08O11R56Q94O27M94N80O44M15J0j41
51450F6944J43M77M02K4k14k40m33q96j192r64m35k8J91L48L24r2p28j099r67
51431F1565n70k77k27l55n56o98o87n55m62n19o86q45r20q82p19m77k79k32l34
51412E1285m91o24o81n96l49j32k21n92q08n77k43m13j053j426j078m37j56k52
51394D1156l32l29m87p27o58k26J37J56L3k8j47m06n45l46m6l4l07n14m32j92
51374C5726m3q7k14k42j19k3r7k13j25J40K91J94K4k4O3K35M51N86N37M80O56
$$ plain form
51353 38196 39084 39825 40043 39887 39807 39956 40146 40303 40498 40607 40423 40153 40350 41177 42157 42758 42909 42766 42378
51334 42378 41845 41472 41478 41737 42004 42166 42112 41677 40962 40444 40436 40658 40634 40317 39980 39746 39582 39622 40020 40535 40713
51313 40713 40485 40221 40111 39902 39367 38687 38139 37710 37251 36774 36341 35767 34791 33497 32303 31478 30883 30274
51295 30274 29729 29626 30210 31291 32343 32858 32634 31837 30868 30122 29777 29740 29763 29633 29324 28968 28718 28571 28376
51276 28376 28048 27769 27876 28487 29295 29806 29777 29362 28924 28699 28649 28542 28199 27716 27377 27367 27654 28177 28941 29786
51256 29786 30254 29969 29110 28296 27991 28197 28681 29215 29599 29717 29668 29644 29625 29406 29018 28818 29025 29382 29519 29442
51236 29442 29457 29755 30327 31152 32174 33129 33668 33703 33444 33089 32669 32209 31832 31597 31379 31021 30533 30077 29821
51217 29821 29901 30398 31231 32071 32521 32426 31993 31547 31237 30998 30720 30364 29941 29516 29243 29235 29367 29368 29208 29240 29761
$$ packed form
51353C8196Q88P41K18j56q0J49J90J57J95J09j84k70J97Q27R80O01J51j43l88
51334D2378n33l73OK59K67J62n4m35p15n18qK22k4l17l37k34j64M0L98N15J78
51313D0713k28k64j10k09n35o80n48m29m59m77m33n74r76j294j194q25n95o09
51295C0274n45j03N84J081J052N15k24p97r69p46l45l7K3j30l09l56k50j47j95
51276B8376l28k79J07O11Q08N11k9m15m38k25n0j07l43m83l39j0K87N23P64Q45
51256B9786M68k85q59q14l05K06M84N34L84J18m9k4j9k19l88k00K07L57J37p7
51236B9442J5K98N72Q25J022R55N39L5k59l55m20m60l77k35k18l58m88m56k56
51217B9821Q0M97Q33Q40M50r5m33m46l10k39k78l56m23m25k73qJ32Jj60L2N21
$$ plain form
51196 29761 30557 31110 31195 31035 30908 30853 30838 30918 31112 31323 31513 31823 32331 32819 32944 32589 31980 31515 31498 31912 32375
51175 32375 32448 32097 31734 31721 31976 32194 32290 32413 32636 32823 32803 32543 32170 31939 32107 32696 33385 33749 33626 33171
51155 33171 32623 32138 31839 31810 31971 32076 31924 31582 31329 31380 31654 31889 31959 32029 32325 32818 33295 33675 34076 34527
51135 34527 34862 34996 35128 35464 35864 35971 35663 35213 35004 35208 35726 36336 36842 37152 37284 37302 37285 37314 37399 37407 37195
51114 37195 36846 36614 36601 36615 36489 36326 36256 36111 35651 35047 34829 35264 35995 36449 36456 36334 36443 36809 37198 37428 37545
51093 37545 37723 38052 38485 38938 39382 39793 40092 40211 40206 40224 40350 40529 40687 40899 41366 42181 43163 43984 44435 44519
51073 44519 44336 44029 43841 44019 44543 45108 45478 45675 45702 45383 44694 44070 43918 44027 43861 43369 43012 42966 42870 42495
51053 42495 42161 42201 42441 42519 42376 42071 41453 40497 39719 39771 40629 41581 42033 41988 41769 41591 41524 41615 41860 42123 42206
$$ packed form
51196B9761P96N53Q5j60j27n5j5Q0J94K11J90L10N08M88J25l55o09m65j7M14M63
51175C2375P3l51l63j3K55K18R6J23K23J87k0k60l73k31J68N89O89L64j23m55
51155C3171n48m85k99k9J61J05j52l42k53N1K74K35P0P0K96M93M77L80M01M51
51135C4527L35J34J32L36M00J07l08m50k09K04N18O10N06L10J32J8j7K9Q5Qk12
51114C7195l49k32j3J4j26j63p0j45m60o04k18M35P31M54Pj22J09L66L89K30J17
51093C7545J78L29M33M53M44M11K99J19nJ8J26J79J58K12M67Q15R82Q21M51Q4
51073D4519j83l07j88J78N24N65L70J97K7l19o89o24j52J09j66m92l57m6r6l75
51053D2495l34M0K40P8j43l05o18r56p78N2Q58R52M52m5k19j78o7R1K45K63Q3
$$ plain form
51032 42206 42043 41854 42013 42605 43176 43159 42608 42163 42216 42465 42477 42311 42221 42100 41724 41298 41315 41871 42567 43042 43268
51011 43268 43329 43271 43188 43183 43208 43158 43087 43085 43054 42869 42674 42710 42956 43261 43694 44380 45062 45320 45223 45278 45679 46083 46229 46303
50987 46303 46506 46704 46762 46839 47085 47353 47503 47673 47968 48142 47885 47314 46885 46960 47641 48841 50326 51779 53067
50968 53067 54320 55626 56813 57707 58454 59322 60341 61315 62129 62818 63420 63945 64453 65005 65568 66092 66625 67197
50950 67197 67678 67897 67856 67654 67266 66541 65472 64316 63395 62805 62383 61900 61303 60744 60388 60233 60167 60109 60033 59924
50930 59924 59849 60030 60624 61458 62132 62415 62406 62322 62389 62900 64072 65681 67112 67973 68509 69241 70365 71700 73094
50911 73094 74628 76418 78367 80202 81696 82895 84140 85792 87914 90239 92459 94461 96367 98469
50897 98469 101091 104310 107812 111235 114658 118463 122695 126854 130538 133969 137635 141594 145433 148833
$$ packed form
51032D2206j63j89J59N92N71j7n51m45N3K49J2j66r0j21l76m26J7N56O96M75K26
51011D3268O1n8q3nK5n0p1kl1j85j95L6K46L05M33O86O82K58r7N5M01M04J46P4
50987D6303K03J98N8P7K46K68J50J70K95J74k57n71m29P5O81J200J485J453J288
50968E3067J253J306J187Q94P47Q68J019R74Q14O89O02N25N08N52N63N24N33N72
50950F7197M81K19m1k02l88p25j069j156r21n90m22m83n97n59l56j55o6n8p6j09
50930E9924p5J81N94Q34O74K83rq4O7N11J172J609J431Q61N36P32J124J335J394
50911G3094J534J790J949J835J494J199J245J652K122K325K220K002J906K102
50897I8469K622L219L502L423L423L805M232M159L684L431L666L959L839L400
$$ plain form
50883 148833 151916 155037 158435 162134 166047 170136 174442 178936 183362 187430 191200 195054 199157 203124
50869 203124 206413 208920 210935 212582 213579 213587 212620 210977 208846 206103 202514 198131 193368 188658 184102
50854 184102 179550 174960 170510 166377 162592 159112 155887 152831 149889 147133 144659 142425 140370 138642
50840 138642 137395 136386 135116 133459 131867 130848 130508 130693 131214 131737 131820 131333 130616 130013 129513 129031 128710
50823 128710 128615 128429 127852 127119 126747 126866 127160 127362 127454 127488 127499 127581 127779 127972 128085 128288 128752 129376 130043 130980
50803 130980 132438 134146 135544 136554 137708 139449 141679 144049 146359 148555 150679 152986 155886 159608
50789 159608 164068 169086 174495 180047 185526 191077 197172 204118 211791 219928 228419 237197 246128 255210
50775 255210 264647 274497 284406 293921 303006 312071 321542 331486 341626 351591 361172 370425 379552 388696
$$ packed form
50883A48833L083L121L398L699L913M089M306M494M426M068L770L854M103L967
50869B03124L289K507K015J647R97Qr67j643k131k743l589m383m763m710m556
50854A84102m552m590m450m133l785l480l225l056k942k756k474k234k055j728
50840A38642j247j009j270j657j592j019l40J85N21N23Q3m87p17o03n00m82l21
50823A28710r5j86n77p33l72J19K94K02R2L4J1Q2J98J93J13K03M64O24O67R37
50803A30980J458J708J398J010J154J741K230K370K310K196K124K307K900L722
50789A59608M460N018N409N552N479N551O095O946P673Q137Q491Q778Q931R082
50775B55210R437R850R909R515R085R065R471R944J0140R965R581R253R127R144
$$ plain form
50761 388696 397910 407254 416771 426381 435951 445513 455228 465054 474572 483252 490804 497203 502467 506527
50747 506527 509276 510632 510559 509075 506316 502568 498210 493530 488625 483567 478705 474661 471943 470653 470653
50732 470653 471854 474213 477656 482238 488312 496281 506226 517974 531514 547073 564790 584518 605951
50719 605951 628738 652375 676153 699305 721108 740934 758376 773375 786063 796490 804572 810240
50707 810240 813431 814005 811839 806978 799487 789252 776188 760583 742911 723324 701660 678049 653166
50694 653166 627842 602676 578113 554546 532142 510815 490595 471838 454938 439984 426815
50683 426815 415220 404951 395779 387715 381045 376012 372565 370486 369592 369768 371036 373668 377976 383833
50669 383833 390664 398054 406159 415330 425574 436551 447852 459025 469527 478978 487336 494641 500780
$$ packed form
50761C88696R214R344R517R610R570R562R715R826R518Q680P552O399N264M060
50747E06527K749J356p3j484k759l748m358m680m905n058m862m044k718j290%
50732D70653J201K359L443M582O074P969R945J1748J3540J5559J7717J9728K1433
50719F05951K2787K3637K3778K3152K1803J9826J7442J4999J2688J0427Q082N668
50707H10240L191N74k166m861p491j0235j3064j5605j7672j9587k1664k3611k4883
50694F53166k5324k5166k4563k3567k2404k1327k0220j8757j6900j4954j3169
50683D26815j1595j0269r172q064o670n033l447k079q94J76J268K632M308N857
50669C83833O831P390Q105R171J0244J0977J1301J1173J0502R451Q358P305O139
$$ plain form
50656 500780 505717 509763 513296 516313 518558 519995 520819 521094 520681 519628 518356 517410 517137 517597 518621 519985
50640 519985 521649 523831 526735 530328 534477 539174 544413 549983 555631 561337 567162 572887 578156 583023
50626 583023 588061 593809 600330 607430 615115 623693 633529 644800 657434 671212 685941 701530 717937
50613 717937 735216 753720 774156 797238 823370 852773 885778 922710 963529 1007789 1054952
50602 1054952 1104501 1155759 1207868 1259965 1311162 1360335 1406279 1448208 1485967 1519669 1549342
50591 1549342 1574952 1596467 1613679 1626119 1633305 1634991 1631140 1621877 1607646 1589262 1567629 1543407
50579 1543407 1517079 1489179 1460399 1431558 1403583 1377381 1353551 1332304 1313679 1297679 1284100
50568 1284100 1272422 1262065 1252632 1243753 1234907 1225703 1216230 1206806 1197374 1187385 1176325 1164167 1151296
$$ packed form
50656E00780M937M046L533L017K245J437Q24K75m13j053j272r46k73M60J024J364
50640E19985J664K182K904L593M149M697N239N570N648N706N825N725N269M867
50626E83023N038N748O521P100P685Q578R836J1271J2634J3778J4729J5589J6407
50613G17937J7279J8504K0436K3082K6132K9403L3005L6932M0819M4260M7163
50602A054952M9549N1258N2109N2097N1197M9173M5944M1929L7759L3702K9673
50591A549342K5610K1515J7212J2440P186J686l851r263j4231j8384k1633k4222
50579A543407k6328k7900k8780k8841k7975k6202k3830k1247j8625j6000j3579
50568A284100j1678j0357r433q879q846r204r473r424r432r989j1060j2158j2871
$$ plain form
50555 1151296 1138260 1125624 1113861 1103254 1093978 1086243 1080186 1075620 1072149 1069592 1068061 1067458 1067133
50542 1067133 1066226 1064254 1061138 1056749 1050679 1042428 1031663 1018257 1002214 983623 962613 939396 914386
50529 914386 888206 861475 834557 807628 780915 754762 729470 705260 682403 661231 641922
50518 641922 624368 608360 593860 581040 570069 560977 553690 548148 544295 542001 541060 541319 542778
50505 542778 545433 549044 553183 557651 562701 568706 575701 583431 591822 601134 611630 623314 636172
50492 636172 650494 666834 685744 707612 732628 760725 791615 825049 860974 899338 939735
50481 939735 981363 1023246 1064433 1104109 1141766 1177355 1211200 1243714 1275185 1305677 1335046
50470 1335046 1363087 1389737 1415010 1438688 1460336 1479876 1498007 1515727 1533448 1550920 1568080
$$ packed form
50555A151296j3036j2636j1763j0607r276p735o057m566l471k557j531o03l25
50542A067133r07j972l116m389o070q251j0765j3406j6043j8591k1010k3217k5010
50529I14386k6180k6731k6918k6929k6713k6153k5292k4210k2857k1172j9309
50518F41922j7554j6008j4500j2820j0971r092p287n542l853k294r41K59J459
50505E42778K655L611M139M468N050O005O995P730Q391R312J0496J1684J2858
50492F36172J4322J6340J8910K1868K5016K8097L0890L3434L5925L8364M0397
50481I39735M1628M1883M1187L9676L7657L5589L3845L2514L1471L0492K9369
50470A335046K8041K6650K5273K3678K1648J9540J8131J7720J7721J7472J7160
$$ plain form
50459 1568080 1585615 1604525 1625361 1648063 1672270 1697480 1722985 1747982 1771767 1793648 1812666
50448 1812666 1827582 1837258 1840992 1838508 1829753 1814797 1793854 1767311 1735776 1700150 1661604 1621379
50436 1621379 1580559 1540102 1501094 1464840 1432542 1404894 1382079 1364039 1350614 1341415 1335812 1333102
50424 1333102 1332528 1333012 1333116 1331413 1326775 1318194 1304681 1285640 1261270 1232285 1199356 1163097 1124398
50411 1124398 1084340 1043697 1002861 962230 922285 883239 844993 807674 771878 738187 706709
50400 706709 677267 649766 624145 600257 578078 557882 539928 524075 509915 497111 485431
50389 485431 474644 464692 455845 448402 442282 437111 432598 428600 424938 421497 418462 416222 415041 414968
50375 414968 415959 417829 420198 422814 425922 430036 435371 441762 449087 457408 466683 476754 487714 499939
$$ packed form
50459A568080J7535J8910K0836K2702K4207K5210K5505K4997K3785K1881J9018
50448A812666J4916R676L734k484q755j4956k0943k6543l1535l5626l8546m0225
50436A621379m0820m0457l9008l6254l2298k7648k2815j8040j3425r199n603k710
50424A333102n74M84J04j703m638q581j3513j9041k4370k8985l2929l6259l8699
50411A124398m0058m0643m0836m0631l9945l9046l8246l7319l5796l3691l1478
50400G06709k9442k7501k5621k3888k2179k0196j7954j5853j4160j2804j1680
50389D85431j0787r952q847p443o120n171m513l998l662l441l035k240j181p3
50375D14968R91J870K369K616L108M114N335O391P325Q321R275J0071J0960J2225
$$ plain form
50361 499939 513630 528586 544623 561857 580394 600014 620454 641725 663862 686530 709209
50350 709209 731727 754313 777212 800487 824169 848304 872801 897466 922214 947058 971817
50339 971817 996004 1019077 1040683 1060626 1078742 1094851 1108681 1119732 1127355 1131059 1130657 1126071
50327 1126071 1117115 1103611 1085646 1063642 1038299 1010592 981667 952494 923614 895385 868459
50316 868459 843710 821678 802294 785319 770836 759144 750269 743784 739061 735557 732881 730714 728604
50303 728604 725729 721041 713891 704458 693346 680812 666661 650873 633956 616546 598950 581241
50291 581241 563558 546098 529005 512460 496729 481915 467792 454109 440962 428650 417253
50280 417253 406576 396471 386988 378269 370472 363736 358001 352874 347918 343084 338644 334686 330931 327095
$$ packed form
50361D99939J3691J4956J6037J7234J8537J9620K0440K1271K2137K2668K2679
50350G09209K2518K2586K2899K3275K3682K4135K4497K4665K4748K4844K4759
50339I71817K4187K3073K1606J9943J8116J6109J3830J1051P623L704m02m586
50327A126071q956j3504j7965k2004k5343k7707k8925k9173k8880k8229k6926
50316H68459k4749k2032j9384j6975j4483j1692q875o485m723l504k676k167k110
50303G28604k875m688p150r433j1112j2534j4151j5788j6917j7410j7596j7709
50291E81241j7683j7460j7093j6545j5731j4814j4123j3683j3147j2312j1397
50280D17253j0677j0105r483q719p797o736n735n127m956m834m440l958l755l836
$$ plain form
50266 327095 323230 319603 316413 313728 311502 309549 307599 305550 303575 301899 300546 299389 298409 297842 298073
50251 298073 299390 301743 304710 307791 310808 313972 317580 321766 326533 331878 337759 343998 350313 356423
50237 356423 362146 367454 372437 377111 381277 384675 387260 389174 390409 390757 390209 389189 388128 386879 384777
50222 384777 381262 376317 370338 363800 357099 350501 344100 337869 331817 326089 320849 316155 311943 308099
50208 308099 304472 300874 297192 293539 290210 287450 285245 283340 281443 279405 277257 275173 273391 272097
50194 272097 271272 270616 269739 268515 267205 266171 265457 264736 263698 262419 261247 260372 259655 258878 258062 257471 257397
50177 257397 257982 259111 260373 261245 261530 261600 262046 263116 264646 266445 268453 270480 272098 273029 273462 273806
50161 273806 274233 274640 274938 275191 275515 275998 276705 277569 278348 278809 278995 279200 279729 280728 282126 283625 284848 285713
$$ packed form
50266C27095l865l627l190k685k226j953j950k049j975j676j353j157r80n67K31
50251B98073J317K353K967L081L017L164L608M186M767N345N881O239O315O110
50237C56423N723N308M983M674M166L398K585J914J235L48n48j020j061j249k102
50222C84777l515m945n979o538o701o598o401o231o052n728n240m694m212l844
50208C08099l627l598l682l653l329k760k205j905j897k038k148k084j782j294
50194B72097q25o56q77j224j310j034p14p21j038j279j172q75p17p77q16n91p4
50177B57397N85J129J262Q72K85P0M46J070J530J799K008K027J618R31M33L44
50161B73806M27M07K98K53L24M83P07Q64P79M61J86K05N29R99J398J499J223Q65
$$ plain form
50143 285713 286602 287956 289784 291764 293778 296083 298915 302164 305558 308967 312428 316002 319751 323778
50129 323778 328193 333079 338514 344502 350843 357224 363518 369916 376665 383740 390864 397805 404597 411487
50115 411487 418729 426408 434392 442463 450550 458843 467696 477396 487994 499365 511512 524770 539593
50102 539593 556088 573897 592669 612533 634038 657781 684235 713770 746603 782783 822475
50091 822475 866178 914458 967495 1025093 1086997 1152859 1221828 1292420 1362884 1431515 1496736
$$ packed form
50143B85713Q89J354J828J980K014K305K832L249L394L409L461L574L749M027
50129C23778M415M886N435N988O341O381O294O398O749P075P124O941O792O890
50115D11487P242P679P984Q071Q087Q293Q853R700J0598J1371J2147J3258J4823
50102E39593J6495J7809J8772J9864K1505K3743K6454K9535L2833L6180L9692
50091H22475M3703M8280N3037N7598O1904O5862O8969P0592P0464O8631O5221
$$ [...]
##END NTUPLES=NMR SPECTRUM
##END=
