
##TITLE=UV1161_TOLI01-ROVE100E_6307121_g9q3QIkHXl
##JCAMPDX= 6.0         $$ Bruker NMR JCAMP-DX V2.0
##DATA TYPE= NMR SPECTRUM
##DATA CLASS= NTUPLES
##ORIGIN= BRUKER
##OWNER= Administrator
$$ 1.72 TOPSPIN		Version 2.1
$$ 2012-06-06 22:13:18.812 -0500  Administrator@TOPSPIN
$$ Compression mode = diff/dup
##.OBSERVE FREQUENCY= 400.13188235
##.OBSERVE NUCLEUS= ^1H
##.ACQUISITION MODE= SIMULTANEOUS (DQD)
##.ACQUISITION SCHEME= undefined
##.AVERAGES= 64
##.DIGITISER RES= 22
##SPECTROMETER/DATA SYSTEM= spect
##.PULSE SEQUENCE= noesygpps1d.comp
##.SOLVENT NAME= COFFEE_meoh
##.SHIFT REFERENCE= INTERNAL, COFFEE_meoh, 1, 14.98061
##AUDIT TRAIL= $$ (NUMBER, WHEN, WHO, WHERE, PROCESS, VERSION, WHAT)
$$ ##TITLE= Audit trail, TOPSPIN		Version 2.1
$$ ##JCAMPDX= 5.01
$$ ##ORIGIN= Bruker BioSpin GmbH
$$ ##OWNER= Administrator
$$ $$ C:\Bruker\TOPSPIN/data/COFFEE/nmr/UV1161_TOLI01-ROVE100E_6307121_g9q3QIkHXl/12/pdata/1/auditp.txt
$$ ##AUDIT TRAIL=  $$ (NUMBER, WHEN, WHO, WHERE, PROCESS, VERSION, WHAT)
(   1,<2012-06-06 22:13:13.359 -0500>,<Administrator>,<TOPSPIN>,<go>,<TOPSPIN 2.1>,
      <created by zg
	started at 2012-06-06 22:01:43.187 -0500,
	POWCHK enabled, PULCHK disabled,
       configuration hash MD5:
       D5 CA 7A 23 FE 6B EE E2 50 67 74 61 24 F7 5E 3B
       data hash MD5: 64K
       FD 34 E3 DF FC 0B 0F 33 A6 FE 95 A9 0E 7A 79 8E>)
(   2,<2012-06-06 22:13:16.187 -0500>,<Administrator>,<TOPSPIN>,<proc1d>,<TOPSPIN 2.1>,
      <Start of raw data processing
       efp LB = 0.3 FT_mod = 6 PKNL = 1 PHC0 = 0 PHC1 = 0 SI = 128K 
       data hash MD5: 128K
       30 66 4E 76 DC 76 64 BF 35 3D B9 F2 88 16 6D 3D>)
(   3,<2012-06-06 22:13:17.687 -0500>,<Administrator>,<TOPSPIN>,<proc1d>,<TOPSPIN 2.1>,
      <pk PHC0 = 30.57495 PHC1 = 0 
       data hash MD5: 128K
       22 4C E4 B2 16 48 62 75 6E DF 84 D9 F1 4F 70 34>)
(   4,<2012-06-06 22:13:18.453 -0500>,<Administrator>,<TOPSPIN>,<proc1d>,<TOPSPIN 2.1>,
      <abs ABSG = 1 
       data hash MD5: 128K
       4A 67 87 BE D9 79 D4 44 4B 34 68 00 D0 C6 9B 50>)
(   5,<2012-06-06 22:13:18.531 -0500>,<Administrator>,<TOPSPIN>,<proc1d>,<TOPSPIN 2.1>,
      <abs ABSG = 2 
       data hash MD5: 128K
       23 89 B4 09 0C F2 42 E9 E5 D3 10 91 24 A8 D4 43>)
(   6,<2012-06-06 22:13:18.593 -0500>,<Administrator>,<TOPSPIN>,<proc1d>,<TOPSPIN 2.1>,
      <abs ABSG = 3 
       data hash MD5: 128K
       1D B3 30 6C 85 09 14 D9 85 2F AF DD 69 18 B2 96>)
(   7,<2012-06-06 22:13:18.671 -0500>,<Administrator>,<TOPSPIN>,<proc1d>,<TOPSPIN 2.1>,
      <abs ABSG = 4 
       data hash MD5: 128K
       96 99 AF B0 6F 24 91 76 12 9F 35 BE AC 91 B1 A9>)
(   8,<2012-06-06 22:13:18.734 -0500>,<Administrator>,<TOPSPIN>,<proc1d>,<TOPSPIN 2.1>,
      <abs ABSG = 5 
       data hash MD5: 128K
       F6 F1 48 FA 8A C0 CF 24 64 D8 9D EF E4 43 3F 78>)
$$ ##END=
$$ 
$$ $$ hash MD5
$$ $$ EC 80 A0 2B 6F E1 EA 38 1C 4C 88 64 89 FA 25 D7
##$RELAX= 
##$RELAX= 
##$RELAX= 
##$RELAX= 
##$RELAX= 
##$RELAX= 
##$RELAX= 
##$RELAX= 
$$ [...]
150 150 150 150 150 150 150 150
##$TP07= 0
##$TPNAME0= <>
##$TPNAME1= <>
##$TPNAME2= <>
##$TPNAME3= <>
##$TPNAME4= <>
##$TPNAME5= <>
##$TPNAME6= <>
##$TPNAME7= <>
##$TPOAL= (0..7)
0.5 0.5 0.5 0.5 0.5 0.5 0.5 0.5
##$TPOFFS= (0..7)
0 0 0 0 0 0 0 0
##$TUNHIN= 0
##$TUNHOUT= 0
##$TUNXOUT= 0
##$USERA1= <user>
##$USERA2= <user>
##$USERA3= <user>
##$USERA4= <user>
##$USERA5= <user>
##$V9= 5
##$VALIST= <valist>
##$VCLIST= <CCCCCCCCCCCCCCC>
##$VD= 0
##$VDLIST= <DDDDDDDDDDDDDDD>
##$VPLIST= <PPPPPPPPPPPPPPP>
##$VTLIST= <TTTTTTTTTTTTTTT>
##$WBST= 2048
##$WBSW= 25
##$XGAIN= (0..3)
0 0 0 0
##$XL= 0
##$YL= 0
##$YMAX_a= 11841000
##$YMIN_a= -7157224
##$ZGOPTNS= <>
##$ZL1= 120
##$ZL2= 120
##$ZL3= 120
##$ZL4= 120
##$ABSF1= 14.98061
##$ABSF2= -5.57192
##$ABSG= 5
##$ABSL= 3
##$ALPHA= 0
##$AQORDER= 0
##$ASSFAC= 0
##$ASSFACI= 0
##$ASSFACX= 0
##$ASSWID= 0
##$AUNMP= <proc_prof1d_extract.lims>
##$AXLEFT= 0
##$AXNAME= <>
##$AXNUC= <1H>
##$AXRIGHT= 0
##$AXTYPE= 0
##$AXUNIT= <>
##$AZFE= 0.1
##$AZFW= 0.1
##$BCFW= 0
##$BC_mod= 0
##$BYTORDP= 0
##$COROFFS= 0
##$CY= 15
##$DATMOD= 1
##$DC= 0
##$DFILT= <>
##$DTYPP= 0
##$F1P= 0
##$F2P= 0
##$FCOR= 0.5
##$FTSIZE= 131072
##$FT_mod= 6
##$GAMMA= 0
##$GB= 0
##$INTBC= 1
##$INTSCL= 1
##$ISEN= 128
##$LB= 0.3
##$LEV0= 0
##$LPBIN= 0
##$MAXI= 10000
##$MC2= 0
##$MEAN= 0
##$ME_mod= 0
##$MI= 0
##$NCOEF= 0
##$NC_proc= -2
##$NLEV= 6
##$NOISF1= 0
##$NOISF2= 0
##$NSP= 0
##$NTH_PI= 0
##$NZP= 0
##$OFFSET= 14.98061
##$PC= 1
##$PHC0= 30.57495
##$PHC1= 0
##$PH_mod= 1
##$PKNL= yes
##$PPARMOD= 0
##$PPDIAG= 0
##$PPIPTYP= 0
##$PPMPNUM= 2147483647
##$PPRESOL= 1
##$PSCAL= 4
##$PSIGN= 0
##$PYNMP= <proc.py>
##$REVERSE= no
##$SF= 400.13
##$SI= 131072
##$SIGF1= 0
##$SIGF2= 0
##$SINO= 400
##$SIOLD= 131072
##$SPECTYP= <>
##$SREGLST= <1H.CDCl3>
##$SSB= 0
##$STSI= 131072
##$STSR= 0
##$SW_p= 8223.68421052632
##$SYMM= 0
##$S_DEV= 0
##$TDeff= 65536
##$TDoff= 0
##$TI= <>
##$TILT= no
##$TM1= 0
##$TM2= 0
##$TOPLEV= 0
##$USERP1= <user>
##$USERP2= <user>
##$USERP3= <user>
##$USERP4= <user>
##$USERP5= <user>
##$WDW= 1
##$XDIM= 131072
##$YMAX_p= 239866293
##$YMIN_p= -360654321
##$CURPLOT= <Network HP LaserJet P1505>
##$CURPRIN= <$Network HP LaserJet P1505>
##$DFORMAT= <normdp>
##$LAYOUT= <+/1D_H.xwp>
##$LFORMAT= <normlp>
##$PFORMAT= <normpl>
##$SURQMSG= 1
$$ End of Bruker specific parameters
$$ ---------------------------------
##NTUPLES= NMR SPECTRUM
##VAR_NAME=  FREQUENCY,     SPECTRUM/REAL,   SPECTRUM/IMAG
##SYMBOL=    X,             R,               I
##VAR_TYPE=  INDEPENDENT,   DEPENDENT,       DEPENDENT
##VAR_FORM=  AFFN,          ASDF,            ASDF
##VAR_DIM=   131072,        131072,          131072
##UNITS=     HZ,            ARBITRARY UNITS, ARBITRARY UNITS
##FACTOR=    0.0627417313425165, 1,          1
##FIRST=     8223.62146879498, -420,         -43340
##LAST=      0,             621,             -43279
##MIN=       0,             -360654321,      0
##MAX=       8223.62146879498, 239866293,    0
$$ Real data points
##PAGE= N=1
##DATA TABLE= (X++(R..R)), XYDATA
$$ [...]
62091C155233R395O502L721J221r92k792l952m449m409l683k020J87J931K749
62077C158642L324M431N731O270N855N254N157N594O359P302Q134Q504Q474Q474
62063C247505Q623Q488P750O715N915N513N346N301N334N272M914M272L557K942
62049C327447K431J923J258L87m99j061j172j005p51m01P8N97J165J985L048L830
62033C339260L935L904M826O880Q871R613R396R477J0395J1540J2365J3151J4234
62020C457847J5193J5453J5242J5282J5751J6246J6626J7175J7857J8112J7585
62009C638369J6510J5075J2951R762N625Q55m482j0304j6043k0829k4209k6485
61997C596795k8658l2027l7422m4404n1434n7155o1288o4196o6040o6867o7080
$$ plain form
62091 3155233 3164628 3171130 3174851 3176072 3175080 3172288 3168336 3163887 3159478 3155795 3153775 3153962 3155893 3158642
62077 3158642 3161966 3166397 3172128 3178398 3184253 3189507 3194664 3200258 3206617 3213919 3222053 3230557 3239031 3247505
62063 3247505 3256128 3264616 3272366 3279081 3284996 3290509 3295855 3301156 3306490 3311762 3316676 3320948 3324505 3327447
62049 3327447 3329878 3331801 3333059 3333446 3332947 3331886 3330714 3329709 3328958 3328557 3328635 3329232 3330397 3332382 3335430 3339260
62033 3339260 3343195 3347099 3351925 3358805 3367676 3377289 3386685 3396162 3406557 3418097 3430462 3443613 3457847
62020 3457847 3473040 3488493 3503735 3519017 3534768 3551014 3567640 3584815 3602672 3620784 3638369
62009 3638369 3654879 3669954 3682905 3692667 3698292 3699147 3694665 3684361 3668318 3647489 3623280 3596795
61997 3596795 3568137 3536110 3498688 3454284 3402850 3345695 3284407 3220211 3154171 3087304 3020224
61986C020224o7129o6833o5680o3705o1503n9343n6875n3872n0686m7704m4861
61975B382033m1998l9364l7337l5872l4610l3388l2329l1459l0606k9735k9152
61964B006183k9147k9492k9547k8946k7990k7244k6816k6367k5776k5379k5288
61953A704191k4914k3585k1427j9213j7426j5960j4633j3441j2182j0422q152
61942A522836o098n005m899n385o409q246j0792j3403j5576j7506j9719k2313
61930A387485k4780k6600k7766k8607k9156k8982k7775k5940k4299k3185k2140
61919A098255k0688j9085j7952j7337j6525j4939j2889j1202j0287r757q909p357
61907I31328n312l426k363k214k280j657j49J583K879L821M943O387P836R187
$$ plain form
61986 3020224 2953095 2886262 2820582 2756877 2695374 2636031 2579156 2525284 2474598 2426894 2382033
61975 2382033 2340035 2300671 2263334 2227462 2192852 2159464 2127135 2095676 2065070 2035335 2006183
61964 2006183 1977036 1947544 1917997 1889051 1861061 1833817 1807001 1780634 1754858 1729479 1704191
61953 1704191 1679277 1655692 1634265 1615052 1597626 1581666 1567033 1553592 1541410 1530988 1522836
61942 1522836 1516738 1511733 1506834 1501449 1495040 1486794 1476002 1462599 1447023 1429517 1409798 1387485
61930 1387485 1362705 1336105 1308339 1279732 1250576 1221594 1193819 1167879 1143580 1120395 1098255
61919 1098255 1077567 1058482 1040530 1023193 1006668 991729 978840 967638 957351 947594 938685 931328
61907 931328 926016 922590 920227 918013 915733 914076 913927 915510 918389 922210 927153 933540 941376 950563
61893I50563J0856J3163J5745J7983J9877K2099K5043K8148L0492L1955L3343
61882A199267L5249L7220L8442L8929L9463M0356M0999M0892M0515M0626M1105
61871A633063M1094M0139L8622L7150L6004L5201L4623L4159L4006L4799L7006
61860B035866M0353M4331M9095N5223O2616P0449P8381Q7009R6795J07209J17425
61849B844752J27284J37126J47080J57079J67219J77692J88515J99586K10632
61840D356965K20731K28240K31458K28957K18949J99017J67375J24320P2283J4872
61830F063167m3653r8768j46797j85977k16012k36937k49077k53864k53502k49394
61820D129186k41541k29879k15548k00398j85552j71004j56424j41912j27922
$$ plain form
61893 950563 961419 974582 990327 1008310 1028187 1050286 1075329 1103477 1133969 1165924 1199267
61882 1199267 1234516 1271736 1310178 1349107 1388570 1428926 1469925 1510817 1551332 1591958 1633063
61871 1633063 1674157 1714296 1752918 1790068 1826072 1861273 1895896 1930055 1964061 1998860 2035866
61860 2035866 2076219 2120550 2169645 2224868 2287484 2357933 2436314 2523323 2620118 2727327 2844752
61849 2844752 2972036 3109162 3256242 3413321 3580540 3758232 3946747 4146333 4356965
61840 4356965 4577696 4805936 5037394 5266351 5485300 5684317 5851692 5976012 6048295 6063167
61830 6063167 6019514 5920746 5773949 5587972 5371960 5135023 4885946 4632082 4378580 4129186
61820 4129186 3887645 3657766 3442218 3241820 3056268 2885264 2728840 2586928 2459006
61811B459006j14788j02602r1393q1245p2034o3264n4432m5593l7272k9720k2583
61800A744080j5446q460k174L105P634J2034J6805K1733K5895K8589L0206L1604
61788A895605L2629L2086K9397K5382K0952J6009J0327M681J00l411o319q263
61776B049175q454p123n453m080k641p78J368L570N538O487N626L151j26m004
61762B042256q803j4047j8555k2027k5351k8874l1511l2278l1676l0793k9762
61751A768579k7948k5115k1661j7957j4066r863n119K13N641J0489J4723J8840
61739A696756K2889K6536L0294L5460M2236M8958N4188N8656O4070P0781P7873
61728B228697Q4992R2733J01371J10575J20428J31641J44521J58624J73734J90346
$$ plain form
61811 2459006 2344218 2241616 2150223 2068978 1996944 1933680 1879248 1833655 1796383 1766663 1744080
61800 1744080 1728634 1720174 1718000 1721105 1728739 1740773 1757578 1779311 1805206 1833795 1864001 1895605
61788 1895605 1928234 1960320 1989717 2015099 2036051 2052060 2062387 2067068 2067168 2063757 2057438 2049175
61776 2049175 2040721 2033598 2028145 2024065 2021424 2020646 2022014 2025584 2031122 2037609 2043235 2046386 2046260 2042256
61762 2042256 2033453 2019406 2000851 1978824 1953473 1924599 1893088 1860810 1829134 1798341 1768579
61751 1768579 1740631 1715516 1693855 1675898 1661832 1651969 1646850 1647063 1652704 1663193 1677916 1696756
61739 1696756 1719645 1746181 1776475 1811935 1854171 1903129 1957317 2015973 2080043 2150824 2228697
61728 2228697 2313689 2406422 2507793 2618368 2738796 2870437 3014958 3173582 3347316 3537662
61718C537662K08852K28975K50326K72970K97034L22277L48302L74644M00177
61709F241219M22695M39362M47269M43320M24062L86332L28412K50935J57288
61700I540894N3655n1857j51195k38381l10188l65461m04395m28334m39490m40117
61690F765131m31925m16544l96233l73486l49783l25289l00037k74950k51269
61681C645615k29435k09180j90395j73235j57521j42892j29588j18237j08652
61672B186480r9652r0483q1711p4116o7350o0492n3623m7967m4399m2418m0858
61661A483411l9160l7720l7156l7506l8243l8826l9004l8594l7328l5273l3124
61650A071477l1556l0377k8840k6786k4881k3638k2749k1625k0111j8476j7123
$$ plain form
61718 3537662 3746514 3975489 4225815 4498785 4795819 5118096 5466398 5841042 6241219
61709 6241219 6663914 7103276 7550545 7993865 8417927 8804259 9132671 9383606 9540894
61700 9540894 9594549 9542692 9391497 9153116 8842928 8477467 8073072 7644738 7205248 6765131
61690 6765131 6333206 5916662 5520429 5146943 4797160 4471871 4171834 3896884 3645615
61681 3645615 3416180 3207000 3016605 2843370 2685849 2542957 2413369 2295132 2186480
61672 2186480 2086828 1996345 1914634 1840518 1773168 1712676 1659053 1611086 1566687 1524269 1483411
61661 1483411 1444251 1406531 1369375 1331869 1293626 1254800 1215796 1177202 1139874 1104601 1071477
61650 1071477 1039921 1009544 980704 953918 929037 905399 882650 861025 840914 822438 805315
61639H05315j6432j6393j6321j5500j4172j3212j2772j2159j1270j1008j1703
61628F54373j2233j1626j0562j0189j0211r570q460q141q825r265q616p480o647
61615E32548n943m998m187m033m277m240l775l280k996k851k789k735k407j588
61601D82449o11j43l78o64k02J052K330K954L053L298M036M910N390N362N122
61586E17958M966M936M819M326L392K354J642J267R51O70O82R28R63P29Q11J613
61570E53007K728L572M149M776N390N630N283M236K389K8k148l903n834q238j0211
61555E60854j0769j0468j0806j2118j3177j2954j1741j0270q741p263o387o428
61543D39732o698o143m666l258k789k970k731j493J14J038J174J480K538L617
$$ plain form
61639 805315 788883 772490 756169 740669 726497 713285 700513 688354 677084 666076 654373
61628 654373 642140 630514 619952 609763 599552 589982 581522 573381 564556 555291 546675 539195 532548
61615 532548 526605 521607 517420 513387 509110 504870 501095 497815 494819 491968 489179 486444 484037 482449
61601 482449 481838 481695 481317 480653 480451 481503 483833 486787 489840 493138 497174 502084 507474 512836 517958
61586 517958 522924 527860 532679 537005 540397 542751 544393 545660 546611 547281 547963 548891 549854 550583 551394 553007
61570 553007 555735 559307 563456 568232 573622 579252 584535 588771 591160 591188 589040 585137 579303 571065 560854
61555 560854 550085 539617 528811 516693 503516 490562 478821 468551 459810 452547 446160 439732
61543 439732 433034 426891 422225 418967 416178 413208 410477 408984 409098 410136 411310 412790 415328 418945
61529D18945L755L298L458M570N683O064O150O564O942O447N157M240M697O327
61515D92297Q090R266J0009J0731J1347J1566J1735J2655J4310J5496J5297J4328
61503F37127J3854J4078J4173J3675J2987J2533J2260J2058J1909J1639J1088
61492G77381J0584J0567J0724J0272R139Q050P314O373M872L348K435J990J428
61479H64477M52r20k537l996m771m791m495m095l244j691J94J850L136M293N654
61464H49516P477R753J2087J4231J6610J9766K3327K6380K8894L1818L5536L9260
61452A114655M2422M5700M9977N5093O0382O5744P1370P6985Q2192Q7117R1829
61441A843466R5527R7157R6515R3910Q8867Q0209O7592N2264L6126K0341N002
$$ plain form
61529 418945 422700 425998 429456 434026 439709 445773 451923 458487 465429 471876 477033 481273 485970 492297
61515 492297 500387 509653 519662 530393 541740 553306 565041 577696 592006 607502 622799 637127
61503 637127 650981 665059 679232 692907 705894 718427 730687 742745 754654 766293 777381
61492 777381 787965 798532 809256 819528 828667 836717 844031 850404 855276 858624 861059 863049 864477
61479 864477 864929 864009 861472 857476 852705 847914 843419 839324 836080 834389 834583 836433 839569 843862 849516
61464 849516 856993 866746 878833 893064 909674 929440 952767 979147 1008041 1039859 1075395 1114655
61452 1114655 1157077 1202777 1252754 1307847 1368229 1433973 1505343 1582328 1664520 1751637 1843466
61441 1843466 1938993 2036150 2132665 2226575 2315442 2395651 2463243 2515507 2551633 2571974 2576976
61430B576976j0198k5041l8383m8870n6132o0904o3847o4863o3944o1877n9369
61419B023548n6073n1482m6359m2082l8676l4699k9292k3249j7679j2602p530
61408A663825k656J355M443P279J0371J3590J6565J9067K0935K2042K2512K2806
61396A822134K3371K4243K5106K5731K6121K6256K5975K5383K5119K5718K6783
61385B101940K7299K6902K6238K5753K4766K2420J9135J6232J4211J2204R420
61374B326520O294L770J926L0k261m451o101p567r412j1389j2602j2726j2522
61361B259509j2927j3961j4887j5172j4812j3853j2257j0340q809q052p696p139
61349B119604o292n578n404n837o600p207p324p097o933o842o271m751k390M83
$$ plain form
61430 2576976 2566778 2541737 2503354 2454484 2398352 2337448 2273601 2208738 2144794 2082917 2023548
61419 2023548 1967475 1915993 1869634 1827552 1788876 1754177 1724885 1701636 1683957 1671355 1663825
61408 1663825 1661169 1662524 1666967 1674246 1684617 1698207 1714772 1733839 1754774 1776816 1799328 1822134
61396 1822134 1845505 1869748 1894854 1920585 1946706 1972962 1998937 2024320 2049439 2075157 2101940
61385 2101940 2129239 2156141 2182379 2208132 2232898 2255318 2274453 2290685 2304896 2317100 2326520
61374 2326520 2332814 2336584 2338510 2338540 2336279 2331828 2325727 2318160 2308748 2297359 2284757 2272031 2259509
61361 2259509 2246582 2232621 2217734 2202562 2187750 2173897 2161640 2151300 2142491 2134439 2126743 2119604
61349 2119604 2113312 2107734 2102330 2096493 2089893 2082686 2075362 2068265 2061332 2054490 2048219 2043468 2041078 2041561
61335B041561L873P951J2593J7452K2397K7587L3201L9302M5953N3231O1097O9228
61323B435426P6983Q3676Q9162R4045R8837J02864J04483J02594R7479Q9912P9926
61312C455387O6960N0955L2913J4460k865j8222l1773m4315n6273o7146p6132
61301C323949q3037q8257r2072r4322r4739r3361r0588q6929q2651p7661p1984
61290B368348o6213o1118n6678n2066m6766m1272l6365l2225k8657k5720k3517
61279A897751k1735j9889j7888j5815j3393j0204o417k766K41K710M989P184R133
61266A813901J0660J1807J2835J3756J3998J2919J0808Q816P637O796N578M120
61254A933631L064K547K241J987J776J317L22q95j657j753j550j475j754k485
$$ plain form
61335 2041561 2045434 2053385 2065978 2083430 2105827 2133414 2166615 2205917 2251870 2305101 2366198 2435426
61323 2435426 2512409 2596085 2685247 2779292 2878129 2980993 3085476 3188070 3285549 3375461 3455387
61312 3455387 3522347 3573302 3606215 3620675 3617810 3599588 3567815 3523500 3467227 3400081 3323949
61301 3323949 3240912 3152655 3060583 2966261 2871522 2778161 2687573 2600644 2517993 2440332 2368348
61290 2368348 2302135 2241017 2184339 2132273 2085507 2044235 2007870 1975645 1946988 1921268 1897751
61279 1897751 1876016 1856127 1838239 1822424 1809031 1798827 1792410 1789644 1789885 1792595 1797584 1804768 1813901
61266 1813901 1824561 1836368 1849203 1862959 1876957 1889876 1900684 1909500 1917137 1923933 1929511 1933631
61254 1933631 1936695 1939242 1941483 1943470 1945246 1946563 1946885 1945990 1944333 1942580 1941030 1939555 1937801 1935316
61240A935316l457m155m467n182p182j0269j3403j5980j8264k0600k2773k4251
61228A785333k4595k3634k1667j9427j7485j5719j3762j1712r970q595p357o229
61216A605181n225m029k391p45L31J150K624M973P552R960J2476J5184J7467J8745
61202A683253J9146J9225J9489K0376K2119K4341K6278K7644K8864L0327L1870
61191A952932L3146L3996L4242L3584L1935K9444K6057K1374J5115P325j788j1786
61179B205576k1817l1048l9351m6934n3287n7277n8523n8051n7198n6424n5382
61168A670284n3583n0702m6811m2632l9090l6351l3766l0950k8233k5859k3446
61157A258861k0757j8295j6609j5512j4475j3300j1872r830p180m772l386k681
$$ plain form
61240 1935316 1931859 1927704 1923237 1918055 1910873 1900604 1887201 1871221 1852957 1832357 1809584 1785333
61228 1785333 1760738 1737104 1715437 1696010 1678525 1662806 1649044 1637332 1627362 1618767 1611410 1605181
61216 1605181 1599956 1595927 1593536 1592791 1593122 1594272 1596896 1601869 1609421 1619381 1631857 1647041 1664508 1683253
61202 1683253 1702399 1721624 1741113 1761489 1783608 1807949 1834227 1861871 1890735 1921062 1952932
61191 1952932 1986078 2020074 2054316 2087900 2119835 2149279 2175336 2196710 2211825 2219150 2217362 2205576
61179 2205576 2183759 2152711 2113360 2066426 2013139 1955862 1897339 1839288 1782090 1725666 1670284
61168 1670284 1616701 1565999 1519188 1476556 1437466 1401115 1367349 1336399 1308166 1282307 1258861
61157 1258861 1238104 1219809 1203200 1187688 1173213 1159913 1148041 1138211 1131031 1126259 1122873 1120192
61145A120192j765n84J02M6o4K94O83M90K6K55J463K774L226L056L419M832O425
61128A144870P063O700O030N112L250K33l115n904q077r985j1597j2575j2836
61115A109169j2792j3200j4723j7212j9475k0428k0486k0985k2155k2729k1977
61104I03007k0948k0858k1203k0591j8846j7058j5850j4800j3485j2106j0809
61093G16453r305p413n393l527j840l48Q93K074L474M984O172O854P072O520M745
61078G31415K078k81j545k190l100m251m836m487l742l311l305l373l262l025
61064F92785k860k921l246l630l668l147k403k079k365k761k675k112j522j185
61050F56211j111j340j937k612k793k230j292m87N4N05R64J337J501J445J192
$$ plain form
61145 1120192 1118427 1117843 1117945 1117991 1117927 1118221 1118904 1119394 1119420 1119675 1121138 1123912 1127138 1130194 1133613 1138445 1144870
61128 1144870 1151933 1158633 1164663 1169775 1173025 1173258 1170143 1164239 1156162 1146177 1134580 1122005 1109169
61115 1109169 1096377 1083177 1068454 1051242 1031767 1011339 990853 969868 947713 924984 903007
61104 903007 882059 861201 839998 819407 800561 783503 767653 752853 739368 727262 716453
61093 716453 707148 699735 694342 690815 688975 688627 689520 691594 695068 700052 706224 713078 720150 726670 731415
61078 731415 733493 733212 731667 729477 726377 722126 717290 712803 709061 705750 702445 699072 695810 692785
61064 692785 689925 687004 683758 680128 676460 673313 670910 668831 666466 663705 661030 658918 657396 656211
61050 656211 655100 653760 651823 649211 646418 644188 642896 642409 642463 642968 643932 645269 646770 648215 649407
61035F49407O22n68k472m619o331p501q536r362r202p853o471o247o802o892o288
61020E60885n767n511m865l761k986k682j969o22J73m26j486j598p81q9L2O2M42
61003E29051J165J990K476K211J504J289J894K578K776K970L587M036L812L689
60989E65028M591N963O581O477O698P506Q181Q492Q936R462R280Q205P156O990
60975F69546P630Q554R395R919J0096J0272J0662J0806J0273R673J0084J1482
60963G88392J2687J2893J2360J1603J0845J0289J0134J0160J0028R985J0487J1225
60951I21088J1528J1612J2436J4318J6609J8759K0784K2691K4528K6873L0147
60940A131373L3589L6163L8319M1386M5309M8737N1468N4930N9770O4819O9207
$$ plain form
61035 649407 650029 649461 646989 642370 636039 628538 620002 610640 601438 593585 587114 580867 574065 567173 560885
61020 560885 555118 549607 544742 540981 537995 535313 533344 532722 532895 532469 530983 529385 528604 528515 528547 528609 529051
61003 529051 530216 532206 534682 536893 538397 539686 541580 544158 546934 549904 553491 557527 561339 565028
60989 565028 569619 575582 582163 588640 595338 602844 611025 619517 628453 637915 647195 655400 662556 669546
60975 669546 677176 685730 695125 705044 715140 725412 736074 746880 757153 766826 776910 788392
60963 788392 801079 813972 826332 837935 848780 859069 869203 879363 889391 899376 909863 921088
60951 921088 932616 944228 956664 970982 987591 1006350 1027134 1049825 1074353 1101226 1131373
60940 1131373 1164962 1201125 1239444 1280830 1326139 1374876 1426344 1481274 1541044 1605863 1675070
60929A675070P3730P9160Q4854R0180R5830J02541J09837J17208J25205J34143
60919B687758J43005J50943J58630J66830J75024J82931J92174K04644K20204
60910D282143K37590K56574K77631L00646L25824L54915L89719M30471M77454
60901G332967N32647N97516O70956P52380Q45130R53371J077894J220096J388096
60892A5371053J591602J831108K100081K394016K694348K926930K955650K661573
60884C4526361K056845J313055O56762K29301M3359M6756J82192L67723M57875
60875C9880229K88160k06223r20857j645635k201868k525871k648901k631504
60867B7387530k524415k365829k185247k000597j818377j640515j469127j305702
$$ plain form
60929 1675070 1748800 1827960 1912814 2002994 2098824 2201365 2311202 2428410 2553615 2687758
60919 2687758 2830763 2981706 3140336 3307166 3482190 3665121 3857295 4061939 4282143
60910 4282143 4519733 4776307 5053938 5354584 5680408 6035323 6425042 6855513 7332967
60901 7332967 7865614 8463130 9134086 9886466 10731596 11684967 12762861 13982957 15371053
60892 15371053 16962655 18793763 20893844 23287860 25982208 28909138 31864788 34526361
60884 34526361 36583206 37896261 38553023 38782324 38825683 38872439 39054631 39422354 39880229
60875 39880229 40168389 39962166 39041309 37395674 35193806 32667935 30019034 27387530
60867 27387530 24863115 22497286 20312039 18311442 16493065 14852550 13383423 12077721
60859A2077721j150856j006903q78081p67124o73389n94750n29235m74338m26995
60850E576050l85374l49230l17845k89154k61681k35993k13300j93801j77115
60841C152557j63274j52269j43360j35631j28670j22120j15302j07856j00189
60832A983886r2766q5576p8684p2627o7638o3165n8736n4687n1448m8641m5603
60821A264315m2383l9617l7646l6219l4785l2780l0099k7469k5846k5076k3880
60810I08515k1559j9011j7472j6995j6854j6622j6066j4707j2603j0973j0828
60799G34825j1378j1032r693q663q403p956o855o039o183o422n688m391l693l756
60785F34673l833l672l771m281m677m634m479m499m468m198m120m786o002o876
$$ plain form
60859 12077721 10926865 9919962 9041881 8274757 7601368 7006618 6477383 6003045 5576050
60850 5576050 5190676 4841446 4523601 4234447 3972766 3736773 3523473 3329672 3152557
60841 3152557 2989283 2837014 2693654 2558023 2429353 2307233 2191931 2084075 1983886
60832 1983886 1891120 1805544 1726860 1654233 1586595 1523430 1464694 1410007 1358559 1309918 1264315
60821 1264315 1221932 1182315 1144669 1108450 1073665 1040885 1010786 983317 957471 932395 908515
60810 908515 886956 867945 850473 833478 816624 800002 783936 769229 756626 745653 734825
60799 734825 723447 712415 702722 694059 685656 677700 670845 664806 658623 652201 646513 642122 638429 634673
60785 634673 630840 627168 623397 619116 614439 609805 605326 600827 596359 592161 588041 583255 577253 570377
60771E70377o764n909n047m552m145l362k097o41O07J323J365R34N06L50K35o6
60755E43114j17Q46K814M740N600N392M789M252L873L785M183M923N519N626N309
60740F04648M837M459M377M630M896M672L800K666J761J195P20P6q52k074l418
60725F36393m430m666m185l616l549m002m524m729m550m088l507k986k598k215
60711E82748j740j345j268j340j170p90o86j000j215r21m71l39k52L56J253J553
60695E73373R99L49K98O35Q81J168J969L248M432N065N062M450L289J939R59N31
60679F08647K05n93j955l511m955o222p214p666p434o827o312o060o042o368p074
60664E30619p651p415o551o054o330o527n838m860m805n707o469o464o120n839
$$ plain form
60771 570377 563613 557704 552657 548105 543960 540598 538501 537860 538467 539790 541155 542089 542595 542945 543180 543114
60755 543114 542997 543843 546657 551397 556997 562389 567178 571430 575303 579088 583271 588194 593713 599339 604648
60740 604648 609485 613944 618321 622951 627847 632519 636319 638985 640746 641941 642661 642737 641885 639811 636393
60725 636393 631963 627297 623112 619496 615947 611945 607421 602692 598142 594054 590547 587561 584963 582748
60711 582748 581008 579663 578395 577055 575885 575095 574409 573409 572194 571273 570802 570463 570211 570567 571820 573373
60695 573373 574372 574721 575019 575654 576535 577703 579672 582920 587352 592417 597479 601929 605218 607157 608116 608647
60679 608647 608852 608259 606304 602793 597838 591616 584402 576736 569302 562475 556163 550103 544061 537693 530619
60664 530619 522968 515553 509002 502948 496618 490091 484253 479393 474588 468881 462412 455948 449828 443989
60650D43989n437m876m706n188n777n893n646n328m843m142l675l857m362m536
60636C75723m111l170j811l38N93O13J41j54j13J32O79J586K412K654K428K173
60620C79437J989J826J947K540L099L025K680L040M258N419N815N689N555N533
60606D31852N676O307P480Q599R052Q990R140R903J0897J1300J0569R002P694
60593E46461P627Q729R938J0262R603Q544P670P145O711N935M658L187J928Q15
60579F39213o00k491m478n976o633o460n871n561n967o778p273p179o922o935
60565E60089p100p017o489n567m392l171k173j587j437j620j848j689r47j1N34
60550E15575P35J329K846M865O393O844O561O416P005Q152R276J0191J1260J2617
$$ plain form
60650 443989 438552 433676 428970 423782 418005 412112 406466 401138 396295 392153 388478 384621 380259 375723
60636 375723 371612 368442 366631 366293 366886 367499 367640 367486 367373 367505 368184 369770 372182 374836 377264 379437
60620 379437 381426 383252 385199 387739 390838 393863 396543 399583 403841 409260 415075 420764 426319 431852
60606 431852 437528 443835 451315 459914 468966 477956 487096 496999 507896 519196 529765 538767 546461
60593 546461 554088 562817 572755 583017 592620 601164 608834 615979 622690 628625 633283 636470 638398 639213
60579 639213 638613 636122 631644 625668 619035 612575 606704 601143 595176 588398 581125 573946 567024 560089
60565 560089 552989 545972 539483 533916 529524 526353 524180 522593 521156 519536 517688 515999 515052 515041 515575
60550 515575 516310 517639 520485 525350 531743 538587 545148 551564 558569 566721 575997 586188 597448 610065
60536F10065J3654J3773J3306J3084J3187J2790J1389R461P662N903L651P71k232
60523G26464m668o134o791p267q129r288j0208j0641j0812j0831j0504r862r381
60510F11948r278r076q304p292o747o709o432n390l978l062k978l185k944k205
60496E34368j610j521j502r37R6J089J962K985L984M416M361M633N573O488O749
60481E71134O761P273Q226Q980R375R841J0665J1743J2971J4428J6149J8145K0505
60468G26196K3218K5971K8573L1355L4781L8749M2741M6532N0314N4119N7443
60457A159992N9528N9700N7545N3064M6682L8950L0401K1923J4836J0060P200
60446A559881M964K492j35k619n161q251j2101j6364k0178k2445k2530k0796j8174
$$ plain form
60536 610065 623719 637492 650798 663882 677069 689859 701248 710709 718371 724274 727925 728696 726464
60523 726464 721796 715662 708871 701604 693475 684187 673979 663338 652526 641695 631191 621329 611948
60510 611948 602670 593594 585290 577998 571251 564542 558110 552720 548742 545680 542702 539517 536573 534368
60496 534368 532758 531237 529735 528798 528894 529983 531945 534930 538914 543330 547691 552324 557897 564385 571134
60481 571134 577895 585168 593394 602374 611749 621590 632255 643998 656969 671397 687546 705691 726196
60468 726196 749414 775385 803958 835313 870094 908843 951584 998116 1048430 1102549 1159992
60457 1159992 1219520 1279220 1336765 1389829 1436511 1475461 1505862 1527785 1542621 1552681 1559881
60446 1559881 1564845 1567337 1567202 1564583 1559422 1551171 1539070 1522706 1502528 1480083 1457553 1436757 1418583
60433A418583j5132j1423o827j649L720R296J5289K1670K8244L4836M1105M6473
60421A584185N0531N3305N4779N4488N2082M8193M4214M1204L9466L9233M1117
60410B102797M5562N2325O0999P1678Q4602R9421J15472J32755J51877J72923
60400C090411J95103K17875K41755K67323K93727L18601L38970L51440L51910
60391E667115L36326L02310K49762J80233R6840N227q6524j70217k40173k93785
60381F047114l30483l51105l57940l54289l43353l27522l08430k87177k64521
60372C122294k41189k18130j96272j76133j57925j41809j27706j15051j03220
60363A644859r2194q2410p4043o6869o0759n5711n1355m7061m2775l9212l6787
$$ plain form
60433 1418583 1403451 1392028 1385201 1383552 1387272 1396568 1411857 1433527 1461771 1496607 1537712 1584185
60421 1584185 1634716 1688021 1742800 1797288 1849370 1897563 1941777 1982981 2022447 2061680 2102797
60410 2102797 2148359 2200684 2261683 2333361 2417963 2517384 2632856 2765611 2917488 3090411
60400 3090411 3285514 3503389 3745144 4012467 4306194 4624795 4963765 5315205 5667115
60391 5667115 6003441 6305751 6555513 6735746 6832586 6837813 6751289 6581072 6340899 6047114
60381 6047114 5716631 5365526 5007586 4653297 4309944 3982422 3673992 3386815 3122294
60372 3122294 2881105 2662975 2466703 2290570 2132645 1990836 1863130 1748079 1644859
60363 1644859 1552665 1470255 1396212 1329343 1268584 1212873 1161518 1114457 1071682 1032470 995683
60352I95683l4791l2183k8885k5812k3718k2517k1685k0812j9641j8062j6272
60341G31305j4706j3540j2484j1282j0177r517r053q131o675n552n575o390o774
60328F11449o094n029m667n184n804n969n958o194o378n915m991m594n178n915
60314E33579n741m776m069m121m330m020l322k782k596k659k899l143k992k297
60300D83832j526j210j259j221j002q45p43m63j04q7n63j213j693j869j709j272
60284D67053q11m68m3N75R60P60N40J179K475L174K642J726J527K027K435K375
60268D88126K219K477L220L968M036L276K495K628L471L899L475L060L463M285
60254E34098M621M216L317K015M82o19q10n69p29j272j431q00K65J233J800J829
$$ plain form
60352 995683 960892 928709 899824 874012 850294 827777 806092 785280 765639 747577 731305
60341 731305 716599 703059 690575 679293 669116 659599 650546 642415 635740 630188 624613 618223 611449
60328 611449 605355 600326 595659 590475 584671 578702 572744 566550 560172 554257 549266 544672 539494 533579
60314 533579 527838 523062 518993 514872 510542 506522 503200 500418 497822 495163 492264 489121 486129 483832
60300 483832 482306 481096 479837 478616 477614 476769 476026 475563 475459 475372 474809 473596 471903 470034 468325 467053
60284 467053 466242 465774 465731 466306 467266 468026 468566 469745 472220 475394 478036 479762 481289 483316 485751 488126
60268 488126 490345 492822 496042 500010 504046 507322 509817 512445 515916 519815 523290 526350 529813 534098
60254 534098 538719 542935 546252 548267 548749 548130 547320 546751 546022 544750 543319 542519 542784 544017 545817 547646
60238E47646J415J000R64J229J515J739J769J270L26k06K46R16N91n99j314q92
60222E57615j43J7j41J93J142K070K466K358K115K167K792L900N020N659N686
60207E92916N416N456O293P812R238R835R664R418R615J0250J1138J2250J3661
60194G12962J5392J7363J9375K1204K2876K4632K6533K8400L0333L2857L6071
60183I87998L9138M1272M2896M5059M7897N0473N2104N2976N3333N2911N1483
60172A517540M9238M6328M2603L8182L3646K9255K4559J9228J3709Q569L658j360
60160A825155o003r274j0844j1319j1333j0941j0031q691o948m538j252K750P179
60147A743910J1994J7227K2647K7884L2825L7530M1813M5255M7736M9515N0637
$$ plain form
60238 547646 549061 550061 551025 552254 553769 555508 557277 558547 558873 558667 558913 559829 560420 559821 558507 557615
60222 557615 557472 557489 557348 557541 558683 560753 563219 565577 567692 569859 572651 576551 581571 587230 592916
60207 592916 598332 603788 610081 617893 627131 636966 646630 656048 665663 675913 687051 699301 712962
60194 712962 728354 745717 765092 786296 809172 833804 860337 888737 919070 951927 987998
60183 987998 1027136 1068408 1111304 1156363 1204260 1254733 1306837 1359813 1413146 1466057 1517540
60172 1517540 1566778 1613106 1655709 1693891 1727537 1756792 1781351 1800579 1814288 1822857 1826515 1825155
60160 1825155 1819152 1809878 1799034 1787715 1776382 1765441 1755410 1746719 1739771 1735233 1733981 1736731 1743910
60147 1743910 1755904 1773131 1795778 1823662 1856487 1894017 1935830 1981085 2028821 2078336 2128973
60136B128973N0607M9034M6293M2985L9016L3799K7314K0340J3478O623m12p321
60124B450729j3677j9343k4117k7498k9219k9579k8826k6707k3113j8651j3939
60113B196060q743k608M011J0122J5536K1034K7213L3872M0524M6708N1729N4928
60101B490386N6436N7014N6840N5032N0753M4267L6605K8505K0096J1283K175
60090B909392o684j4281j9553k2041k2120k0579j8033j4611r891l297N152J4501
60078B777955K3632L2338M1269N0949O1249P1763Q2204R2457J02650J13140J23921
60067C573527J34028J42138J47869J51933J54857J56119J54827J50768J44334
60058D910400J35760J24871J11466R5667P7899N8600L8007J6281o081k8217m9428
$$ plain form
60136 2128973 2179580 2228614 2274907 2317892 2356908 2390707 2418021 2438361 2451839 2458462 2458050 2450729
60124 2450729 2437052 2417709 2393592 2366094 2336875 2307296 2278470 2251763 2228650 2209999 2196060
60113 2196060 2187317 2184709 2188720 2198842 2214378 2235412 2262625 2296497 2337021 2383729 2435458 2490386
60101 2490386 2546822 2603836 2660676 2715708 2766461 2810728 2847333 2875838 2895934 2907217 2909392
60090 2909392 2902708 2888427 2868874 2846833 2824713 2804134 2786101 2771490 2761599 2758302 2763454 2777955
60078 2777955 2801587 2833925 2875194 2926143 2987392 3059155 3141359 3233816 3336466 3449606 3573527
60067 3573527 3707555 3849693 3997562 4149495 4304352 4460471 4615298 4766066 4910400
60058 4910400 5046160 5171031 5282497 5378164 5456063 5514663 5552670 5568951 5562870 5534653 5485225
60047E485225o9544q8406j05262j19091j29379j36093j39160j38448j34226j27094
60037D298522j17637j06591r5012q3490p1353n7612m2676k8217j5220l137Q655
60026C686232J9524K8348L4784L9129M1348M1091L8413L3940K8314K1836J4614
60015D027573O886q42p999j4404k0418k6302l1626l5706l8490m0436m1594m1512
60003C735130m0154l8186l6191l4220l2325l0856k9919k9093k8045k6883k5667
59992C383591k3943k1154j7179j2367p369k938O44L966P804J2021J5769J8641
59980C357486K0769K1808K0808J7500J2716P177P46o780j4940k3228l1536l9541
59968C342985m6516n2322n7684o2779o6441o7546o6412o4020o0568n5843n0319
$$ plain form
60047 5485225 5415681 5327275 5222013 5102922 4973543 4837450 4698290 4559842 4425616 4298522
60037 4298522 4180885 4074294 3979282 3895792 3824439 3766827 3724151 3695934 3680714 3677577 3686232
60026 3686232 3705756 3734104 3768888 3808017 3849365 3890456 3928869 3962809 3991123 4012959 4027573
60015 4027573 4034459 4033617 4025618 4011214 3990796 3964494 3932868 3897162 3858672 3818236 3776642 3735130
60003 3735130 3694976 3656790 3620599 3586379 3554054 3523198 3493279 3464186 3436141 3409258 3383591
59992 3383591 3359648 3338494 3321315 3308948 3301579 3298641 3299285 3303251 3311055 3323076 3338845 3357486
59980 3357486 3378255 3400063 3420871 3438371 3451087 3458264 3459010 3452230 3437290 3414062 3382526 3342985
59968 3342985 3296469 3244147 3186463 3123684 3057243 2989697 2923285 2859265 2798697 2742854 2692535
59957B692535m4709l8831l1927k3975j5817q122j015N522J1676J8072K5264L2950
59945B621623M0271M6778N2675N8232O3399O7735P0370P0364O7558O2696N6408
59934C278109M8635L9447K9601J9600Q993k491j3819k3705l2256m0408m8115n4213
59922C209378n7872n9097n8009n4825n0431m5794m0732l4314k6588j8771j1588
59911B751357m500L063J0739J7920K4557L0757L6210M0595M4018M6691M8556M9455
59899C099418M9255M7716M4706M0753L6782L3099K9197K4757K0313J6586J3712
59888C456294J1469R967R779J1482J5207K0477K6590L3417M1673N1967O3810P6061
59876C828193Q8272J00902J14226J27649J40173J50910J59101J64291J66543J65776
$$ plain form
59957 2692535 2647826 2608995 2577068 2553093 2537276 2529154 2528139 2533661 2545337 2563409 2588673 2621623
59945 2621623 2661894 2708672 2761347 2819579 2882978 2950713 3021083 3091447 3159005 3221701 3278109
59934 3278109 3326744 3366191 3395792 3415392 3424385 3421894 3408075 3384370 3352114 3311706 3263591 3209378
59922 3209378 3151506 3092409 3034400 2979575 2929144 2883350 2842618 2808304 2781716 2762945 2751357
59911 2751357 2746857 2749920 2760659 2778579 2803136 2833893 2870103 2910698 2954716 3001407 3049963 3099418
59899 3099418 3148673 3196389 3241095 3281848 3318630 3351729 3380926 3405683 3425996 3442582 3456294
59888 3456294 3467763 3477730 3487509 3498991 3514198 3534675 3561265 3594682 3636355 3688322 3752132 3828193
59876 3828193 3916465 4017367 4131593 4259242 4399415 4550325 4709426 4873717 5040260 5206036
59866E206036J60797J49762J31953J08433Q0752M9762J6249j8064n0859q0315
59856E754506j05430j25694j40996j51586j57733j59508j57192j51569j43523
59847D461275j33563j22060j09592r6665q3315o9452n5399m1765k8822j6345l988
59836C700309Q288K0126L0843L9794M6843N2285N5995N6983N4215M7751L8508
59825D151940K6912J2469m912k3791m2090n8926p4750q9643j02383j11759j18102
59814C564965j22593j25453j25794j23232j18624j13035j06846j00264r3695q7038
59804B448391p9464p0741o2165n5171m9552m3968l7982l2472k8197k4948k2335
59793A941396k0421j9299j8611j7881j6859j5445j3670j1850j0279q736o832m814
$$ plain form
59866 5206036 5366833 5516595 5648548 5756981 5837733 5887495 5903744 5885680 5834821 5754506
59856 5754506 5649076 5523382 5382386 5230800 5073067 4913559 4756367 4604798 4461275
59847 4461275 4327712 4205652 4096060 3999395 3916080 3846628 3791229 3749464 3720642 3704297 3700309
59836 3700309 3708597 3728723 3759566 3799360 3846203 3898488 3954483 4011466 4065681 4113432 4151940
59825 4151940 4178852 4191321 4186409 4162618 4120528 4061602 3986852 3897209 3794826 3683067 3564965
59814 3564965 3442372 3316919 3191125 3067893 2949269 2836234 2729388 2629124 2535429 2448391
59804 2448391 2368927 2298186 2236021 2180850 2131298 2087330 2049348 2016876 1988679 1963731 1941396
59793 1941396 1920975 1901676 1883065 1865184 1848325 1832880 1819210 1807360 1797081 1788345 1781513 1776699
59781A776699l421k918k910l297m713p607j1455j5252j8419k0855k2508k3318
59769A640026k3390k2885k1852k0423j8981j7879j7020j5898j4042j1417q340
59758A447899n048j417K695O855J0203J2452J4371J6960K0381K4019K7327L0115
59746A606812L2292L3889L5235L6598L7692L7927L7103L5504L3452L1129K8593
59735A986226K5583K1662J7151J3584J2550J4173J7367K1278K5652L0046L3748
59724B219020L6659L9475M2812M6978N2551O0279O9981Q0504R1134J02308J14417
59713B956118J26557J36921J43783J45554J40434J26928J04757P5097M0322L850
59703D000321l0282n8615p9490r3183j00984j04088j03065r8159r0097q0385p0511
$$ plain form
59781 1776699 1773278 1770360 1767450 1764153 1759440 1751833 1740378 1725126 1706707 1685852 1663344 1640026
59769 1640026 1616636 1593751 1571899 1551476 1532495 1514616 1497596 1481698 1467656 1456239 1447899
59758 1447899 1442851 1441434 1444129 1450984 1461187 1473639 1488010 1504970 1525351 1549370 1576697 1606812
59746 1606812 1639104 1672993 1708228 1744826 1782518 1820445 1857548 1893052 1926504 1957633 1986226
59735 1986226 2011809 2033471 2050622 2064206 2076756 2090929 2108296 2129574 2155226 2185272 2219020
59724 2219020 2255679 2295154 2337966 2384944 2437495 2497774 2567755 2648259 2739393 2841701 2956118
59713 2956118 3082675 3219596 3363379 3508933 3649367 3776295 3881052 3956149 3996471 4000321
59703 4000321 3970039 3911424 3831934 3738751 3637767 3533679 3430614 3332455 3242358 3161973 3091462
59692C091462o0921n1133m0735k9859j8891q300J333R805J7847K6589L6222M5879
59680C019298N4872O3411P1906Q0324Q8672R7456J07064J17211J27499J38276
59670C965989J50329J63799J77858J91553K04824K18507K33342K49035K64479
59661E819715K78836K91944L03506L12451L17718L19108L16813L10614L00471
59652H571176K87647K74290K62022K51740K44445K41026K41179K43612K47392
59643A0864529K52006K55996K56911K53071K44383K30942K12022J87106J57129
59634A2914095J23958Q9340N4824K2044p526l2550n1474o3100o7806o7141o1735
59623A2852929n0759l3968j2922J0785L7347O7456J00180J33597J67045K01230
$$ plain form
59692 3091462 3030541 2979408 2938673 2908814 2889923 2881623 2882956 2892761 2910608 2937197 2973419 3019298
59680 3019298 3074170 3137581 3209487 3289811 3378483 3475939 3583003 3700214 3827713 3965989
59670 3965989 4116318 4280117 4457975 4649528 4854352 5072859 5306201 5555236 5819715
59661 5819715 6098551 6390495 6694001 7006452 7324170 7643278 7960091 8270705 8571176
59652 8571176 8858823 9133113 9395135 9646875 9891320 10132346 10373525 10617137 10864529
59643 10864529 11116535 11372531 11629442 11882513 12126896 12357838 12569860 12756966 12914095
59634 12914095 13038053 13127393 13182217 13204261 13196735 13164185 13112711 13049611 12981805 12914664 12852929
59623 12852929 12802170 12768202 12755280 12766065 12803412 12870868 12971048 13104645 13271690 13472920
59613A3472920K36121K69901L00093L24773L42422L51321L49335L34046L03289
59604A6284221K56055J93016J16225K8893o4260j57241k44342l21481l85960m35754
59594A5269372m69819m88760m94421m89008m74985m55188m32295m08466l86108
59585A1170322l68501l58693l57771l64436l75839l88278l97860m01844l99657
59576G757443l92229l80487l64964l46420l26026l04860k83695k63109k43307
59567D852346k24092k05444j87858j71712j56716j42502j29303j17422j06507
59558C410790r6103q6537p8400p1467o4941n8681n3316m9160m5809m2905m0663
59547B722808l9512l9589m0638m2116m3493m4733m6224m8008m9398m9725m9035
$$ plain form
59613 13472920 13709041 13978942 14279035 14603808 14946230 15297551 15646886 15980932 16284221
59604 16284221 16540276 16733292 16849517 16878410 16814150 16656909 16412567 16091086 15705126 15269372
59594 15269372 14799553 14310793 13816372 13327364 12852379 12397191 11964896 11556430 11170322
59585 11170322 10801821 10443128 10085357 9720921 9345082 8956804 8558944 8157100 7757443
59576 7757443 7365214 6984727 6619763 6273343 5947317 5642457 5358762 5095653 4852346
59567 4852346 4628254 4422810 4234952 4063240 3906524 3764022 3634719 3517297 3410790
59558 3410790 3314687 3228150 3149750 3078283 3013342 2954661 2901345 2852185 2806376 2763471 2722808
59547 2722808 2683296 2643707 2603069 2560953 2517460 2472727 2426503 2378495 2329097 2279372 2230337
59536B230337m7680m5661m2961m0039l7353l4774l2008k9143k6233k2863j8894
59525A852728j5073j2076r482o578l667j452M38L006O146Q647J0041J1157J2663
59512A856498J4103J4887J5368J6334J8002J9947K1673K3085K4600K6844K9927
59501B081268L3253L6434L9990M4515M9522N4101N8400O3460O9534P5702Q1312
59490B687491Q6835R2947R9536J06052J12190J17835J22802J26891J29834J31088
59480C813501J30136J27079J22504J16844J10272J03052R5302Q6581P6414O5154
59470D846839N3653M2229L0891K0354J1739N226J61l315l947j117M199J0776J8464
59457E036152K7447L7128M6495N4855O1346O4366O2487N5574M4291K8864R225
$$ plain form
59536 2230337 2182657 2136996 2094035 2053996 2016643 1981869 1949861 1920718 1894485 1871622 1852728
59525 1852728 1837655 1825579 1816097 1809519 1805852 1804400 1804838 1807844 1813990 1822637 1832678 1843835 1856498
59512 1856498 1870601 1885488 1900856 1917190 1935192 1955139 1976812 1999897 2024497 2051341 2081268
59501 2081268 2114521 2150955 2190945 2235460 2284982 2339083 2397483 2460943 2530477 2606179 2687491
59490 2687491 2774326 2867273 2966809 3072861 3185051 3302886 3425688 3552579 3682413 3813501
59480 3813501 3943637 4070716 4193220 4310064 4420336 4523388 4618690 4705271 4781685 4846839
59470 4846839 4900492 4942721 4973612 4993966 5005705 5010931 5011092 5007777 5003830 5002713 5006912 5017688 5036152
59457 5036152 5063599 5100727 5147222 5202077 5263423 5327789 5390276 5445850 5490141 5519005 5528230
59446E528230j3771l8305o2906q7198j11049j33395j52316j66171j74584j78337
59436D410198j78461j75512j69759j61727j52164j41571j30175j18380j06811
59427C075638r5736q4870p3915o3021n2487m2376l2587k3145j4170n691K415J0356
59415B600411J8312K6277L4085M1722M9494N7550O5490P2714P9091Q4859Q9928
59404C219933R3635R5252R4457R1222Q5458P6838O4948M9878L2611J4432m207
59393C914457k3636m3545o2343p8510r1845j02699j10702j15373j17394j18058
59383C050352j17636j15509j11719j07143j02162r6383q9814q3117p6541o9806
59373B080522o3340n8163n4136m9677m3888l7843l2872k8726k4439k0118j6626
$$ plain form
59446 5528230 5514459 5476154 5413248 5326050 5215001 5081606 4929290 4763119 4588535 4410198
59436 4410198 4231737 4056225 3886466 3724739 3572575 3431004 3300829 3182449 3075638
59427 3075638 2979902 2895032 2821117 2758096 2705609 2663233 2630646 2607501 2593331 2587640 2590055 2600411
59415 2600411 2618723 2645000 2679085 2720807 2770301 2827851 2893341 2966055 3045146 3130005 3219933
59404 3219933 3313568 3408820 3503277 3594499 3679957 3756795 3821743 3871621 3904232 3918664 3914457
59393 3914457 3890821 3847276 3784933 3706423 3614578 3511879 3401177 3285804 3168410 3050352
59383 3050352 2932716 2817207 2705488 2598345 2496183 2399800 2309986 2226869 2150328 2080522
59373 2080522 2017182 1959019 1904883 1855206 1811318 1773475 1740603 1711877 1687438 1667320 1650694
59362A650694j4016j1398q141m353m26L183N970P887R636J1897J4537J7119J9835
59349A702424K3070K6232K7816K6881K4040K0970J9215J9462K1468K4532K8213
59338A964323L2674L8211M4544N0581N4907N6715N6633N6631N8628O2996O8738
59327B545581P5052Q2168R0590J00242J10773J22074J34069J46398J58861J71807
59317C737615J85694K00528K16046K32025K47908K62475K74446K83265K88875
59308E928877K90913K88629K81612K70212K55392K38430K20658K03054J85958
59299H163735J69324J53179J37671J22814J08398R4037P9142O2927M4727K4340
59289I160294K067k1473m5431o8804r0645j10424j28179j44346j59260j72774
$$ plain form
59362 1650694 1636678 1625280 1617139 1612786 1612360 1615543 1621513 1629400 1639036 1650933 1665470 1682589 1702424
59349 1702424 1725494 1751726 1779542 1806423 1830463 1851433 1870648 1890110 1911578 1936110 1964323
59338 1964323 1996997 2035208 2079752 2130333 2185240 2241955 2298588 2355219 2413847 2476843 2545581
59327 2545581 2620633 2702801 2793391 2893633 3004406 3126480 3260549 3406947 3565808 3737615
59317 3737615 3923309 4123837 4339883 4571908 4819816 5082291 5356737 5640002 5928877
59308 5928877 6219790 6508419 6790031 7060243 7315635 7554065 7774723 7977777 8163735
59299 8163735 8333059 8486238 8623909 8746723 8855121 8949158 9028300 9091227 9135954 9160294
59289 9160294 9162361 9140888 9095457 9026653 8936008 8825584 8697405 8553059 8393799 8221025
59279H221025j84495j94412k02987k10498k16628k20871k23034k23028k20787
59270F324285k16731k11832k06522k00061j91680j81960j72155j62566j52642
59261D628136j42425j32654j23385j13825j03710r3770q4519p5782o7677o0840
59251C629549n5090m9134m2340l5723l0276k5369j9852j3897q564m071K75M713
59239C350221Q689J1860J4521J7061J9593K2026K4006K4913K4496K3318K2049
59228C562753K0650J8811J6760J4906J2997J0486P698N686M846M415L592K568
59216C686168K094K468L271L883L991L600K739J131j714o046j1693j8474k6550
59203C644868l6034m6296n5993o3912o9743p3987p7144p9011p8951p6851p3505
$$ plain form
59279 8221025 8036530 7842118 7639131 7428633 7212005 6991134 6768100 6545072 6324285
59270 6324285 6107554 5895722 5689200 5489139 5297459 5115499 4943344 4780778 4628136
59261 4628136 4485711 4353057 4229672 4115847 4012137 3918367 3833848 3758066 3690389 3629549
59251 3629549 3574459 3525325 3482985 3447262 3416986 3391617 3371765 3357868 3349304 3345233 3345508 3350221
59239 3350221 3358910 3370770 3385291 3402352 3421945 3443971 3467977 3492890 3517386 3540704 3562753
59228 3562753 3583403 3602214 3618974 3633880 3646877 3657363 3665061 3670747 3675593 3680008 3683600 3686168
59216 3686168 3688262 3690730 3694001 3697884 3701875 3705475 3708214 3709345 3707631 3701585 3689892 3671418 3644868
59203 3644868 3608834 3562538 3506545 3442633 3372890 3298903 3221759 3142748 3063797 2986946 2913441
59192B913441o9769o5545o0074n3126m5372l7647l0298k3238j6213r056k370K169
59180B502902L085J021j324j542P78M813J0039J6365K3416L0663L8154M6489N6100
59167B730959O6811P8019Q9138J00038J11190J23119J35697J48310J60608J72507
59157C916396J83345J91739J96503J97053J92817J83038J67548J47055J22295
59148E497789R3639O1961K9072l375l4696o4247r0325j10942j25380j34282j38486
59137D980728j38465j34750j28240j19991j10913j01506r1736q1539p1561o2948
59127C939079n6162n0606m5688m1630l8798l6995l5901l5691l6598l8340m0506
59116C482164m3008m5748m8330n0515n2433n3871n4141n3128n1726n0587m9207
$$ plain form
59192 2913441 2843672 2778127 2718053 2664927 2619555 2581908 2551610 2528372 2512159 2503103 2500733 2502902
59180 2502902 2505987 2507008 2505684 2504142 2504920 2509733 2519772 2536137 2559553 2590216 2628370 2674859 2730959
59167 2730959 2797770 2875789 2964927 3064965 3176155 3299274 3434971 3583281 3743889 3916396
59157 3916396 4099741 4291480 4487983 4685036 4877853 5060891 5228439 5375494 5497789
59148 5497789 5591428 5653389 5682461 5679086 5644390 5580143 5489818 5378876 5253496 5119214 4980728
59137 4980728 4842263 4707513 4579273 4459282 4348369 4246863 4155127 4073588 4002027 3939079
59127 3939079 3882917 3832311 3786623 3744993 3706195 3669200 3633299 3597608 3561010 3522670 3482164
59116 3482164 3439156 3393408 3345078 3294563 3242130 3188259 3134118 3080990 3029264 2978677 2929470
59105B929470m6973m4334m2005l9666l6593l3004k9737k6836k3611j9869j6129
59094B570713j2649r150n560k214P38L479O087Q505J0900J3536J6334J9053K1724
59081B641496K4448K6907K8560K9242K9157K8518K7482K6181K4442K1806J8150
59070B926389J4002R893N846J806k034n667r353j2796j4995j5519j5278j5259
59058B867035j5216j4386j2824j1105r227o826m031j254J566M676P924J1134J4543
59045B832009J8094K0970K2776K4494K7224L0550L3274L5135L6389L6208L3024
59034C150147K6384J7113N780p712k2936l8729n4270o9245q2850r3814j01607
59023B728261j06636j09161j08980j06420j02588r8363r3950q9443q4956q0106
$$ plain form
59105 2929470 2882497 2838163 2796158 2756492 2719899 2686895 2657158 2630322 2606711 2586842 2570713
59094 2570713 2558064 2548914 2543354 2541140 2541878 2545357 2551444 2559949 2570849 2584385 2600719 2619772 2641496
59081 2641496 2665944 2692851 2721411 2750653 2779810 2808328 2835810 2861991 2886433 2908239 2926389
59070 2926389 2940391 2950284 2956130 2957936 2955902 2950235 2940882 2928086 2913091 2897572 2882294 2867035
59058 2867035 2851819 2837433 2824609 2813504 2804277 2797451 2793420 2792166 2793732 2798408 2806332 2817466 2832009
59045 2832009 2850103 2871073 2893849 2918343 2945567 2976117 3009391 3044526 3080915 3117123 3150147
59034 3150147 3176531 3193644 3199424 3191712 3168776 3130047 3075777 3006532 2923682 2829868 2728261
59023 2728261 2621625 2512464 2403484 2297064 2194476 2096113 2002163 1912720 1827764 1747658
59013A747658p4317o7867o1790n6654n2211m8264m4954m2063l8992l5687l2750
59002A192109l0460k8407k6237k4029k1859j9710j7786j6251j4749j2963j1435
58991I68223j0844j0720r975q658p882p899p533n917l595j524K4J155J936K817
58977H99608M525O956Q950R648R399Q931Q324P358O244N504N500O231P248P713
58963A002139P104N977N295N106M595L490K423J764J076J50l74N3J010J658J706
58948A043172J453J355J730K492K969K498J243j05j339k868m867o994q916j0455
58934A021368j1342j1552j1685j2141j2230j1140r531q827r039q745p346n707
58922I02083m317k518j60J598K161K766M726P471R526J0522J1087J1537J1843
$$ plain form
59013 1747658 1673341 1605474 1543684 1487030 1434819 1386555 1341601 1299538 1260546 1224859 1192109
59002 1192109 1161649 1133242 1107005 1082976 1061117 1041407 1023621 1007370 992621 979658 968223
58991 968223 957379 946659 936684 928026 920144 912245 904712 898795 895200 893676 893700 894855 896791 899608
58977 899608 904133 911089 920039 929687 939086 948017 956341 963699 969943 975447 980947 987178 994426 1002139
58963 1002139 1009243 1015220 1020515 1025621 1030216 1033706 1036129 1037893 1038969 1039119 1038745 1038798 1039808 1041466 1043172
58948 1043172 1044625 1045980 1047710 1050202 1053171 1055669 1056912 1056807 1055468 1052600 1047733 1040739 1031823 1021368
58934 1021368 1010026 998474 986789 974648 962418 951278 941747 932920 923881 915136 907790 902083
58922 902083 897766 895248 895088 896686 898847 901613 906339 913810 923336 933858 944945 956482 968325
58909I68325J2345J3374J4482J5019J5195J5657J6280J6311J5568J4719J4344
58898A131619J4375J4466J4421J4261J4212J4690J5988J8042K0561K3228K5703
58887A321566K7610K8758K9288K9600L0283L1880L4389L7108L9381M1346M3570
58876A694779M6226M9140N2343N5890N9392O2551O5943P0407P5807Q1245Q6421
58865B400144R1833R7820J04376J11753J20140J28846J37045J45350J55286J67108
58855C659701J79532J91770K04379K17710K31069K44044K57080K70011K81377
58846E736673K90098K96478L00534L00513K94277K81153K61309K34275J99463
58837H194773J57620J10565N9959P327m5152r5031j40625j80920k14863k41603
$$ plain form
58909 968325 980670 994044 1008526 1023545 1038740 1054397 1070677 1086988 1102556 1117275 1131619
58898 1131619 1145994 1160460 1174881 1189142 1203354 1218044 1234032 1252074 1272635 1295863 1321566
58887 1321566 1349176 1377934 1407222 1436822 1467105 1498985 1533374 1570482 1609863 1651209 1694779
58876 1694779 1741005 1790145 1842488 1898378 1957770 2020321 2086264 2156671 2232478 2313723 2400144
58865 2400144 2491977 2589797 2694173 2805926 2926066 3054912 3191957 3337307 3492593 3659701
58855 3659701 3839233 4031003 4235382 4453092 4684161 4928205 5185285 5455296 5736673
58846 5736673 6026771 6323249 6623783 6924296 7218573 7499726 7761035 7995310 8194773
58837 8194773 8352393 8462958 8522917 8530244 8485092 8390061 8249436 8068516 7853653 7612050
58827G612050k61289k74833k82995k86162k84814k79677k71605k61612k50716
58818E158347k39364k27358k14678k01935j89778j78314j67395j56999j46957
58809C435569j36941j27013j17743j09415j01607r3863q6288p9316p3337o8623
58799B441423o4971o1410n7011n2042m7517m3610l9595l5275l1270k7626k3532
58788A957564j8834j4530j1122p760l724L95L863P049J0642J4566J8446K2260
58776A978815K5832K8723L1305L4924M0032M5347M9760N4070N9593O6040P2052
58765B486493P7121Q1818Q6649R1886R8075J05574J13870J22176J30462J39211
58755C533335J48617J58639J69318J80537J91997K03865K16702K30224K43091
$$ plain form
58827 7612050 7350761 7075928 6792933 6506771 6221957 5942280 5670675 5409063 5158347
58818 5158347 4918983 4691625 4476947 4275012 4085234 3906920 3739525 3582526 3435569
58809 3435569 3298628 3171615 3053872 2944457 2842850 2748987 2662699 2583383 2510046 2441423
58799 2441423 2376452 2315042 2258031 2205989 2158472 2114862 2075267 2039992 2008722 1981096 1957564
58788 1957564 1938730 1924200 1913078 1905318 1901594 1901989 1905852 1912901 1923543 1938109 1956555 1978815
58776 1978815 2004647 2033370 2064675 2099599 2139631 2184978 2234738 2288808 2348401 2414441 2486493
58765 2486493 2563614 2645432 2732081 2823967 2922042 3027616 3141486 3263662 3394124 3533335
58755 3533335 3681952 3840591 4009909 4190446 4382443 4586308 4803010 5033234 5276325
58746E276325K54477K64830K74219K81094K83564K80924K72841K58085K35414
58737G681773K05054J68102J25163P6868K5196k6946p7274j24378j66989k03982
58727G682587k34826k59256k76932k88065k93739k94884k91576k84092k73794
58718E185423k62105k49387k35725k21946k08867j96334j83988j72288j61738
58709C293045j51912j42356j33542j25844j18394j10262j01980r4628q8125q1761
58699B144241p5704p0557o5984o1158n6079n1189m6234m0839l5693l1710k8537
58688A580557k5193k1718j8782j6120j2899r248o012l296p43J032Q90r88l184
58675A464296m980o922r445j2211j4874j7417j9650k1342k2757k4162k5096k5133
$$ plain form
58746 5276325 5530802 5795632 6069851 6350945 6634509 6915433 7188274 7446359 7681773
58737 7681773 7886827 8054929 8180092 8256960 8282156 8255210 8177936 8053558 7886569 7682587
58727 7682587 7447761 7188505 6911573 6623508 6329769 6034885 5743309 5459217 5185423
58718 5185423 4923318 4673931 4438206 4216260 4007393 3811059 3627071 3454783 3293045
58709 3293045 3141133 2998777 2865235 2739391 2620997 2510735 2408755 2314127 2226002 2144241
58699 2144241 2068537 1997980 1931996 1870838 1814759 1763570 1717336 1676497 1640804 1609094 1580557
58688 1580557 1555364 1533646 1514864 1498744 1485845 1476597 1470585 1467289 1466546 1467578 1468468 1467480 1464296
58675 1464296 1459316 1452394 1442949 1430738 1415864 1398447 1378797 1357455 1334698 1310536 1285440 1260307
58663A260307k5071k6106k8087k9746l0500l0806l0885l0357k9227k8172k7666
58652I43684k7589k7589k7168k5728k3367k1194j9982j9024j7282j5118j3698
58641G05945j3137j2556j1663j0942j0509r942r205q640q178p482o662n984n205
58628E85840m091l123k768k547j761o23L38J242K244K711K209J534J495J594J213
58613E85507J157K330L791M063L544L682M341M165L111K494K623K514J900J511
58599F26733J256J27j866l461m146m696n524o094o148n924n089l056n37R09J089
58584E83573J384K595M114N388O588P619Q055Q298R315J1035J2430J3296J4402
58571F88092J5781J6539J6575J6860J7844J9088K0649K3121K6139K8510L0203
$$ plain form
58663 1260307 1235236 1209130 1181043 1151297 1120797 1089991 1059106 1028749 999522 971350 943684
58652 943684 916095 888506 861338 835610 812243 791049 771067 752043 734761 719643 705945
58641 705945 692808 680252 668589 657647 647138 637196 627991 619351 611173 603691 597029 591045 585840
58628 585840 581749 578626 575858 573311 571550 570927 571265 572507 574751 577462 579671 581205 582700 584294 585507
58613 585507 586664 588994 592785 596848 600392 604074 608415 612580 615691 618185 620808 623322 625222 626733
58599 626733 627989 628116 626250 622789 618643 613947 608423 602329 596181 590257 585168 582112 581575 582484 583573
58584 583573 584957 587552 591666 597054 603642 611261 619316 627614 636929 647964 660394 673690 688092
58571 688092 703873 720412 736987 753847 771691 790779 811428 834549 860688 889198 919401
58560I19401L2513L5934L9504M2648M6036N0130N4422N8608O3044O7639P1680
58549A481559P5127P8692Q2269Q4714Q5381Q4467Q1542P5354O5527N3111L9130
58538B286873K3903P968p750k2847l7139m9455n8394o4272o8633p1755p2514p0799
58526A795186o7991o4767o0424n4912m9499m4800m0056l4986l0568k7198k3929
58515A296056k0243j6916j4384j1923r199p032n862m938l698k457j229M94K231
58502A200900K361J95l326p425j2338j7923k3167k7687l2028l5932l8120l8274
58490I67236l7500l6277l3990l0965k8803k7845k6452k3806k1308k0037j8874
58479F61379j6545j3756j1856j0806r842q905q193p453o648o256o171n611m599
$$ plain form
58560 919401 951914 987848 1027352 1070000 1116036 1166166 1220588 1279196 1342240 1409879 1481559
58549 1481559 1556686 1635378 1717647 1802361 1887742 1972209 2053751 2129105 2194632 2247743 2286873
58538 2286873 2310776 2318744 2310994 2288147 2251008 2201553 2143159 2078887 2010254 1938499 1865985 1795186
58526 1795186 1727195 1662428 1602004 1547092 1497593 1452793 1412737 1377751 1347183 1319985 1296056
58515 1296056 1275813 1258897 1244513 1232590 1223391 1216359 1210497 1205559 1201861 1199404 1198175 1198669 1200900
58502 1200900 1203261 1203456 1200130 1192705 1180367 1162444 1139277 1111590 1079562 1043630 1005510 967236
58490 967236 929736 893459 859469 828504 799701 771856 745404 721598 700290 680253 661379
58479 661379 644834 631078 619222 608416 598574 589669 581476 574023 567375 561119 554948 549337 544738
58466E44738m064m072l596k518k021k341k215j237p40j384j972j657j299j561
58452E14061j647j135j077j944k367j322J19N74L27L20P41J619L211M849N171
58437E21500M469M831O979R041R590R702J0628J1646J1814J1759J1978J1365R195
58424F44497O766N277L808J240j581l463n032p352r750j0954j1213j1582j2157
58411E88504j2481j2632j2616j1829j0280r035q462p556n929m733m558m303l285
58398D80805k480k369j663L65K286K785K541K511K289J732J908K951L121J747
58384D98529P76J583K684K595K524L917N675O270O550P777Q902Q399P119O643
58370E69943O373M835K425M60j161k992m235m156l914m677n409m711l410l025
$$ plain form
58466 544738 540674 536602 533006 530488 528467 526126 523911 522674 521934 520550 518578 516921 515622 514061
58452 514061 512414 511279 510202 508258 505891 504569 504688 505262 505589 505909 506650 508269 511480 516329 521500
58437 521500 525969 530800 537779 546820 556410 566112 576740 588386 600200 611959 623937 635302 644497
58424 644497 651263 656540 660348 661588 660007 656544 651512 644160 634410 623456 612243 600661 588504
58411 588504 576023 563391 550775 538946 528666 519631 511169 503613 497684 492951 488393 484090 480805
58398 480805 478325 475956 474293 474658 476944 479729 482270 484781 487070 488802 490710 493661 496782 498529
58384 498529 499305 500888 503572 506167 508691 512608 518283 524553 531103 538880 547782 556181 563300 569943
58370 569943 576316 581151 583576 584036 582875 579883 575648 571492 567578 562901 557492 552781 549371 546346
58356E46346l103k272o23J054K909M953N950N421N028O039P318P695Q146R319
58342F04180R363O867L723K240J514l75k616l313l124l985n610o343o155o023
58328E90343n645m519l723m070m158k820j617k119k786j617K46P31O15J657K979
58313E63497K913K552L745N284M945L729M086N456N563M870N589P359P922P283
58299F34793P321Q109Q322Q488J0035J1957J2132J1239J1661J3282J3930J3301
58287G64570J2819J2322J0410P552N497M236K606R89M18J58o92p63J190L190K889
58272H27391J751K528M460N062M916O243Q347R013R030J0690J3049J3412J2446
58259I28338J3090J5361J6819J7204J8151J9242J8859J7837J7964J8141J6486
$$ plain form
58356 546346 543243 540971 540348 541402 544311 549264 555214 560635 565663 571702 579020 586715 594861 604180
58342 604180 613543 620410 624133 626373 627887 627512 624896 621583 618459 614474 608864 602521 596366 590343
58328 590343 584698 580179 576456 572386 568228 565408 563791 561672 558886 557269 557515 558246 558861 560518 563497
58313 563497 566410 568962 572707 577991 582936 586665 590751 596207 601770 606640 612229 619588 627510 634793
58299 634793 642114 650223 658545 667033 677068 689025 701157 712396 724057 737339 751269 764570
58287 764570 777389 789711 800121 807673 813170 817406 820012 821001 821419 821577 820885 820122 821312 824502 827391
58272 827391 829142 831670 836130 841192 846108 852351 860698 869711 878741 889431 902480 915892 928338
58259 928338 941428 956789 973608 990812 1008963 1028205 1047064 1064901 1082865 1101006 1117492
58248A117492J4598J4992J5970J4212J0743R043Q893P747O530Q055J1079J2121
58236A251475J2016J4276J8072J9423J8537J9333K2151K3599K3364K4462K6972
58225A473680K8123K8484L1391L6175L8702L8663L9887M3204M5637M6710M8966
58214A899622N2101N3274N3141N4956N7820N7756N5113N3706N3069M9299M3404
58203B483261M0788M2226M3340M3299M5776N0928N4781N7240O2332O9925P5575
58192C069471P9239Q5487R4572J02089J08032J17006J28892J38764J46756J58182
58182D228490J73118J85979J96265K09346K25564K39350K50269K63914K80697
58173F252992K95213L08020L26055L49868L72581L92976M16854M44042M67695
$$ plain form
58248 1117492 1132090 1147082 1163052 1177264 1188007 1197050 1205943 1213690 1220220 1228275 1239354 1251475
58236 1251475 1263491 1277767 1295839 1315262 1333799 1353132 1375283 1398882 1422246 1446708 1473680
58225 1473680 1501803 1530287 1561678 1597853 1636555 1675218 1715105 1758309 1803946 1850656 1899622
58214 1899622 1951723 2004997 2058138 2113094 2170914 2228670 2283783 2337489 2390558 2439857 2483261
58203 2483261 2524049 2566275 2609615 2652914 2698690 2749618 2804399 2861639 2923971 2993896 3069471
58192 3069471 3148710 3234197 3328769 3430858 3538890 3655896 3784788 3923552 4070308 4228490
58182 4228490 4401608 4587587 4783852 4993198 5218762 5458112 5708381 5972295 6252992
58173 6252992 6548205 6856225 7182280 7532148 7904729 8297705 8714559 9158601 9626296
58164I626296M88361N14718N48345N82205O15988O57411P06317P54161Q01830
58155A5295632Q60521R32091J006893J083882J172939J273827J374464J474834
58147B4475083J590849J730473J889855K076722K309851K589633K898912L239922
58139D2801300L639111M110176M649678N275209O022293O892654P855242Q908267
58131I0153930J0082718J1390840J2874004J4689027J6893604J8918634J9392957
58124A94395714J6899388J1168299L501375m053042r937652j3642511j5422687
58117A82908884j5801181j5306758j4383386j3320505j2240773j1178840j0153446
58110I0523995r169697q214279p287473o418466n633398m932126m308277l767140
$$ plain form
58164 9626296 10114657 10629375 11177720 11759925 12375913 13033324 13739641 14493802 15295632
58155 15295632 16156153 17088244 18095137 19179019 20351958 21625785 23000249 24475083
58147 24475083 26065932 27796405 29686260 31762982 34072833 36662466 39561378 42801300
58139 42801300 46440411 50550587 55200265 60475474 66497767 73390421 81245663 90153930
58131 90153930 100236648 111627488 124501492 139190519 156084123 175002757 194395714
58124 194395714 211295102 222463401 225964776 221911734 211974082 198331571 182908884
58117 182908884 167107703 151800945 137417559 124097054 111856281 100677441 90523995
58110 90523995 81354298 73140019 65852546 59434080 53800682 48868556 44560279 40793139
58102D0793139l309312k917433k573397k273236k014916j786960j579877j395986
58094B2942022j238078j098794r69274q48905p39666o39523n47804m69087m04657
58085A5986234l45837k81530k07962j26540l6660O3871J73665K88163M05584N28970
58075A6447958O61028Q01630R57179J151316J414374J754543K145436K541104
58067B7874568K875743L027271K818242K129966J050337j28784j104728j755404
58059C6787211k140884k364045k476246k493994k438417k332103k186784k013739
58051A8340999j830254j646068j459361j273857j104596r59993q33155p18068
58043H515647o20315n44344m83332m29842l85502l52576l25998l00834k78779
$$ plain form
58102 40793139 37483827 34566394 31992997 29719761 27704845 25917885 24338008 22942022
58094 22942022 21703944 20605150 19635876 18786971 18047305 17407782 16859978 16390891 15986234
58085 15986234 15640397 15358867 15150905 15024365 14987705 15051576 15225241 15513404 15918988 16447958
58075 16447958 17108986 17910616 18867795 20019111 21433485 23188028 25333464 27874568
58067 27874568 30750311 33777582 36595824 38725790 39776127 39647343 38542615 36787211
58059 36787211 34646327 32282282 29806036 27312042 24873625 22541522 20354738 18340999
58051 18340999 16510745 14864677 13405316 12131459 11026863 10066870 9233715 8515647
58043 8515647 7895332 7350988 6867656 6437814 6052312 5699736 5373738 5072904 4794125
58034D794125k61048k43337k23433k05691j92653j80166j65516j52507j43857
58025C025917j36412j28356j23290j22482j20847j15312j09806j07192j03729
58016A958491r6354q8386q2992p7693p0359o4124o1320n8619n3192m7940m5790
58005A211722m4383m1107l7995l7050l5893l2589k9764k9502k9168k6616k4533
57994H43122k5265k6035k3921k0969j9972j9445j7223j4926j4574j4576j3175
57983F33041j2081j2832j3317j1760j0348j1218j2493j1971j1018j1173j0687
57972E04143q237o427p676r926j0151q986q307p541n847m854n715o449n381m182
57958D04464m434m499k863j226j095q01R19J942P04m81M95J713J172R11L176N881
$$ plain form
58034 4794125 4533077 4289740 4066307 3860616 3667963 3487797 3322281 3169774 3025917
58025 3025917 2889505 2761149 2637859 2515377 2394530 2279218 2169412 2062220 1958491
58016 1958491 1862137 1773751 1690759 1613066 1542707 1478583 1417263 1358644 1305452 1257512 1211722
58005 1211722 1167339 1126232 1088237 1051187 1015294 982705 952941 923439 894271 867655 843122
57994 843122 817857 791822 767901 746932 726960 707515 690292 675366 660792 646216 633041
57983 633041 620960 608128 594811 583051 572703 561485 548992 537021 526003 514830 504143
57972 504143 495906 489479 481803 471877 461726 452740 444433 436892 431045 426191 420476 414027 408646 404464
57958 404464 400030 395531 392668 391442 390347 389546 390465 392407 393111 392630 393125 394838 396010 396921 400097 405978
57942D05978O063M974N422O835P000O248N926N090K571l8j241k850o597j0112
57928D35269j0407q979r198j0754j1038j0128j0019j0392r454p844p624q343p879
57915C13210o354n671n874n307l758k450j600o83l16j200k133j549j5R96J574
57900B78870K415K913K484K183K718K626Q08j111j408j224k181l280l081k756
57886B79976l782m620l248j119q93j836j225R63K487K970L864N118N413N103N664
57871B94835O639O227M456K892J818M42p99r63r22k136l884m480m406n348o912
57856B87459p291o610o674p819q707q846q750q206o832n684n818o091m871k949
57842A92311k127k086j457q23j508k464j682J39P58M02J084K543K688J776K221
$$ plain form
57942 405978 412041 417015 422437 429272 436272 442520 448446 453536 456107 456069 454828 451978 445381 435269
57928 435269 424862 415883 406685 395931 384893 374765 364746 354354 344900 337056 329432 321089 313210
57915 313210 306856 301185 295311 290004 286246 283796 282196 281513 281197 279997 277864 276315 276300 277296 278870
57900 278870 281285 284198 286682 288865 291583 294209 295017 293906 292498 291274 289093 285813 282732 279976
57886 279976 276194 271574 268326 267207 266314 264478 263253 264216 266703 269673 273537 278655 284068 289171 294835
57871 294835 301474 307701 312157 315049 316867 317309 316510 315547 314625 312489 308605 304125 299719 294371 287459
57856 287459 280168 273558 266884 259065 250358 241512 232762 224556 217724 212040 206222 200131 195260 192311
57842 192311 190184 188098 186641 185818 184310 181846 180164 180303 181061 181463 182547 185090 187778 189554 191775
57827A91775M127M857L599K652L391M264L876L088K818K386J248J58l90r76j776
57812B25097k133k089k501l215l067j969j158j123j238j467k381l350k854r39
57798A95613P03J302J691K320K630K628L106M012M500M600M994N142L862J811
57784B38914J089K158L228L086K252J197m08k178k937k722k915l899m526m325
57770B28014m223m622m622l771k806k163j470r09j282k317k679k036j477j507
57756A92130j479j288j730k745l136k619k405l135l913l950l648l486l336l276
57742A51984l685m219m104l578l521l607k600o10P72Q90P34R77J111R69J248K046
57726A34807K502K391K455K850K938K929L869N635O680O326N600N356N242M958
$$ plain form
57827 191775 195902 200759 204358 207010 210401 214665 218541 221629 224447 226833 228081 228239 227849 226873 225097
57812 225097 222964 220875 218374 215159 212092 210123 208965 207842 206604 205137 202756 199406 196552 195613
57798 195613 196316 197618 199309 201629 204259 206887 209993 214005 218505 223105 228099 233241 237103 238914
57784 238914 240003 242161 245389 248475 250727 251924 251516 249338 246401 243679 240764 236865 232339 228014
57770 228014 223791 219169 214547 210776 207970 205807 204337 203428 202146 199829 197150 195114 193637 192130
57756 192130 190651 189363 187633 184888 181752 179133 176728 173593 169680 165730 162082 158596 155260 151984
57742 151984 148299 144080 139976 136398 132877 129270 126670 126060 126832 127722 128456 129433 130544 131513 132761 134807
57726 134807 137309 139700 142155 145005 147943 150872 154741 160376 167056 173382 178982 184338 189580 194538
57712A94538M798M543L490K029J429J722J513L11q10j331k110l517m645n088n670
57697A91202o694p177o628n894n556n046m045l192k729k062j190r45j286j111
57683A37647k67P5m16n54J43O25L81L86J113J491R20M15P41J206J306J769K846
57666A49827L449L139L155M195M978M447L677M009M810M791M228M184M623M839
57652B08351M887N163N359N101M887N375O377P471Q682R857J0411J0413J0855
57639C03189J2079J3097J3255J3284J3938J4887J5792J7162J9147K0891K2022
57628D78743K3482K5921K8575L0727L2902L5597L8285M0792M4109M8725N3542
57617H81400N7750O2281O7970P3748P8171Q1455Q4360Q6247Q5871Q3256P9170
$$ plain form
57712 194538 199336 203879 207369 209398 210827 212549 214062 214373 213563 212232 210122 206605 201960 196872 191202
57697 191202 184508 177331 170703 164809 159253 154207 150162 146970 144241 142179 140989 140044 138758 137647
57683 137647 137380 137455 137039 136485 136628 137253 137634 138020 139133 140624 141544 141959 142700 143906 145212 146981 149827
57666 149827 153276 156415 159570 163765 168743 173190 176867 180876 185686 190477 194705 198889 203512 208351
57652 208351 213238 218401 223760 228861 233748 239123 245500 252971 261653 271510 281921 292334 303189
57639 303189 315268 328365 341620 354904 368842 383729 399521 416683 435830 456721 478743
57628 478743 502225 528146 556721 587448 620350 655947 694232 735024 779133 827858 881400
57617 881400 939150 1001431 1069401 1143149 1221320 1302775 1387135 1473382 1559253 1642509 1721679
57606A721679P3584O5876N5763M2784K5962N391j6734l7875n6886p2945q4284
57595A722315q9799r0856q9737q7136q2703p7075p1471o5947n9838n3409m7521
57584I06823m2180l6913l2033k8007k4224j9904j5729j2939j1242r190o272l190
57572F65000m06K160M342O015P877J0576J3481J5623J7455K0185K3750K6959K9475
57559H42492L2126L5306L8492M1436M4518M7747N0511N2462N3666N3779N1973
57548A344508M7769M1305L2877K2845J1800J86j1960k4256l5448m4351n0903n5662
57536A278710n8790o0262o0441n9712n8049n5642n3180n0835m7838m3999m0587
57525F89375l8593l7092l4607l1265k8225k5740k3279k0950j9301j8087j6620
$$ plain form
57606 1721679 1795263 1861139 1916902 1959686 1985648 1991039 1974305 1936430 1879544 1806599 1722315
57595 1722315 1632516 1541660 1451923 1364787 1282084 1205009 1133538 1067591 1007753 954344 906823
57584 906823 864643 827730 795697 767690 743466 723562 707833 694894 683652 674462 668190 665000
57572 665000 664594 666754 671096 677111 684988 695564 709045 724668 742123 762308 786058 813017 842492
57559 842492 874618 909924 948416 989852 1034370 1082117 1132628 1185090 1238756 1292535 1344508
57548 1344508 1392277 1433582 1466459 1489304 1501104 1501290 1489330 1465074 1429626 1385275 1334372 1278710
57536 1278710 1219920 1159658 1099217 1039505 981456 925814 872634 821799 773961 729962 689375
57525 689375 650782 613690 579083 547818 519593 493853 470574 449624 430323 412236 395616
57514C95616j5010j3792j2818j1711j0862j0632j0187q647o768n978o082n637
57502B77492m303l161k772k552k083j632j268p51l12l34l09O06K090L008L188
57487B66907L564M587N701O458P037P569Q058Q821J0010J0852J0521R586R373
57474C69044J0142J1130J2138J3677J5669J7416J8849K0507K2324K3831K5461
57463E60188K8159L1613L4388L6014L7536L9639M1570M2295M1557L9429L5865
57452I68253L0998K4992J7486Q213j895j1247j9167k5899l1300l4931l7266l9266
57440H48971m0706m0521l8945l7572l6980l5940l3538l0460k7593k4766k1657
57429D80293j8694j6192j3787j1375r521q290o794m649k784k030j815j091L23
$$ plain form
57514 395616 380606 366814 353996 342285 331423 320791 310604 301957 295189 289211 283129 277492
57502 277492 273189 270028 267256 264704 262621 260989 259721 258970 258658 258324 258015 258621 260711 263719 266907
57487 266907 270471 275058 280759 287217 294254 301823 309881 318702 328712 339564 350085 359671 369044
57474 369044 379186 390316 402454 416131 431800 449216 468065 488572 510896 534727 560188
57463 560188 588347 619960 654348 690362 727898 767537 809107 851402 892959 932388 968253
57452 968253 999251 1024243 1041729 1049942 1048047 1036800 1017633 991734 960434 925503 888237 848971
57440 848971 808265 767744 728799 691227 654247 618307 584769 554309 526716 501950 480293
57429 480293 461599 445407 431620 420245 410724 402434 395640 390991 388207 386177 384362 383271 383594
57416C83594K019L799N476O598P152P904R478J1578J3620J5488J7296J8995K0701
57403E23698K2777K5249K7692K9959L2332L4700L6380L6959L6687L5680L3559
57392H75672L0038K5141J8730J0658J564p402j5831k4000l1522l7253m0912m3501
57380G61382m5586m6397m5293m3026m0683l8395l5927l3664l2023l0485k8183
57369C41720k5078k1962j9626j8427j8158j7921j6708j4519j2367j0923r885q916
57357A47230q276q074p752o927n966n228m473l586l093l309l601l242k394j671
57343G9638j280j089j007q41l43K42L36O6L03J254J880J400M67J42M03N07J92
57326H2270k54o20p66m96K9J68k45m86o3L73L6o55n80M85J597J804R89k60j113
$$ plain form
57416 383594 385613 389412 394888 401486 408638 416542 426020 437598 451218 466706 484002 502997 523698
57403 523698 546475 571724 599416 629375 661707 696407 732787 769746 806433 842113 875672
57392 875672 905710 930851 949581 960239 961803 954401 938570 914570 883048 845795 804883 761382
57380 761382 715796 669399 624106 581080 540397 502002 466075 432411 400388 369903 341720
57369 341720 316642 294680 275054 256627 238469 220548 203840 189321 176954 166031 156146 147230
57357 147230 138954 130880 123128 116201 110235 105007 100534 96948 93855 90546 86945 83703 81309 79638
57343 79638 78358 77269 76262 75421 75078 75320 75656 75722 76025 77279 79159 80559 81026 81168 81571 82078 82270
57326 82270 82016 81396 80630 80134 80163 80331 80086 79600 79537 79910 79946 79291 78711 79196 80793 82597 83586 83326 82213
57307H2213j043l28J78l7o55j127j224q78o5Q51J252J099J036J402J822K051K480
57290H9027L335M138M458M512M609M671M784N412O473P073O799O490P026Q050
57276A66857Q675Q730Q527Q021P141O399O287O485O415O201O289O615O869P240
57262B66751Q062R023R407Q938P921O888O481P141Q374Q983Q575Q163Q617R343
57248C82667R327Q737Q433Q477Q335Q120Q480R393J0128J0353J0387J0421J0379
57235E03637J0440J0892J1508J1764J1625J1539J1750J2247J3163J4462J5529
57224F38556J5807J5735J6219J7274J8056J8258J8585J9573K0702K1029K0277
57213H40071J8913J7438J5854J3760J0877P466M208J612l12j850l245m521n381
$$ plain form
57307 82213 81170 80842 81020 80983 80328 79201 77977 77099 77034 77885 79137 80236 81272 82674 84496 86547 89027
57290 89027 92362 96500 100958 105470 110079 114750 119534 124946 131419 138492 145291 151781 158807 166857
57276 166857 175532 184262 192789 200810 207951 214350 220637 227122 233537 239738 246027 252642 259511 266751
57262 266751 274813 283836 293243 302181 310102 316990 323471 330612 338986 347969 356544 364707 373324 382667
57248 382667 391994 400731 409164 417641 425976 434096 442576 451969 462097 472450 482837 493258 503637
57235 503637 514077 524969 536477 548241 559866 571405 583155 595402 608565 623027 638556
57224 638556 654363 670098 686317 703591 721647 739905 758490 778063 798765 819794 840071
57213 840071 858984 876422 892276 906036 916913 924379 928587 930199 929887 928037 924792 920271 914890
57200I14890n374m619m074m414m859m115k394j319j577j989j423l23M60J124K142
57185H82136L171L885M998P205R772J1387J1903J2048J1982J1383J0423R539Q498
57172I98330O908N270M385L992L226K151J598J701J770J611J809K672L939N486
57158A044848P428R450J0971J2025J3161J4568J5935J7042J7770J7816J7145J6392
57146A214551J6068J5864J5564J5936J7553J9313J9552J8276J6828J5692J4122
57135A399319J1902R826Q294O810N156L762K750J766R56Q54J115N72j220l681
57121A448181o538j0150j4308j7941k0478k2241k3278k3112k2112k1852k3403
57110A242768k6225k9178l1649l3371l4245l4806l5966l7861l9887m2056m5163
$$ plain form
57200 914890 909516 904897 900823 896409 891550 887435 885041 883722 882145 880156 878733 878410 878870 879994 882136
57185 882136 885307 889192 894190 901395 911167 922554 934457 946505 958487 969870 980293 989832 998330
57172 998330 1005238 1010508 1014893 1018885 1022111 1024262 1025860 1027561 1029331 1030942 1032751 1035423 1039362 1044848
57158 1044848 1052276 1061726 1072697 1084722 1097883 1112451 1128386 1145428 1163198 1181014 1198159 1214551
57146 1214551 1230619 1246483 1262047 1277983 1295536 1314849 1334401 1352677 1369505 1385197 1399319
57135 1399319 1411221 1421047 1429341 1436151 1441307 1445069 1447819 1449585 1450541 1451395 1452510 1453082 1451862 1448181
57121 1448181 1441643 1431493 1417185 1399244 1378766 1356525 1333247 1310135 1288023 1266171 1242768
57110 1242768 1216543 1187365 1155716 1122345 1088100 1053294 1017328 979467 939580 897524 852361
57099H52361m9287n3393n6884o0398o4543o8974p3188p7120q0350q1896q1361
57088A04967B5639e0578p1851o6645o2132n9567n9201o1283o6567p4946q4811
57077f57581r4601j04114j13828j24041j35330j48608j64025j80866j98953k18945
57067b140892k40789k63479k87059l13281l43346l76662m12687m52277m96094
57058e326566n43458n94179o49808p11607p78970q51635r32019j023779j129667
57049a2541688j252593j397080j567601j766845j997791k266263k580000k947342
57041b8317203l379181l889953m493375n197947o007903o925301p947923r068195
57033g5226981j0278327j1574074j2950287j4396207j5894238j7405202j8838966
$$ plain form
57099 852361 803074 749681 692797 632399 567856 498882 425694 348574 268224 186328 104967
57088 104967 25639 -50578 -122429 -189074 -251206 -310773 -369974 -431257 -497824 -572770 -657581
57077 -657581 -752182 -856296 -970124 -1094165 -1229495 -1378103 -1542128 -1722994 -1921947 -2140892
57067 -2140892 -2381681 -2645160 -2932219 -3245500 -3588846 -3965508 -4378195 -4830472 -5326566
57058 -5326566 -5870024 -6464203 -7114011 -7825618 -8604588 -9456223 -10388242 -11412021 -12541688
57049 -12541688 -13794281 -15191361 -16758962 -18525807 -20523598 -22789861 -25369861 -28317203
57041 -28317203 -31696384 -35586337 -40079712 -45277659 -51285562 -58210863 -66158786 -75226981
57033 -75226981 -85505308 -97079382 -110029669 -124425876 -140320114 -157725316 -176564282
57026a76564282k0060820k0975474k1618601k2105646k2402190k2113094k0555930
57019c26396037j7151441j1850455n256388J644410P926215J3037462J6839004
57012c21207230J9441673K1020092K1726473K1705147K1129998K0201089J9101323
57005a76881435J7954036J6811239J5671630J4511885J3315404J2087331J0852355
56998g5677555R642850Q489196P416432O442925N578190M822335M168754L607449
56990b5509424L126813K715000K361729K059002J800223J579383J391174J230810
56982i245290J093251R73573Q68536P77035O98481O31334N73428N22874M78137
56973b628641M37886M01259L67859L37247L09082K83888b28811A6165K29140K13336
$$ plain form
57026 -176564282 -196625102 -217600576 -239219177 -261324823 -283727013 -305840107 -326396037
57019 -326396037 -343547478 -355397933 -360654321 -359009911 -351083696 -338046234 -321207230
57012 -321207230 -301765557 -280745465 -259018992 -237313845 -216183847 -195982758 -176881435
57005 -176881435 -158927399 -142116160 -126444530 -111932645 -98617241 -86529910 -75677555
56998 -75677555 -66034705 -57545509 -50129077 -43686152 -38107962 -33285627 -29116873 -25509424
56990 -25509424 -22382611 -19667611 -17305882 -15246880 -13446657 -11867274 -10476100 -9245290
56982 -9245290 -8152039 -7178466 -6309930 -5532895 -4834414 -4203080 -3629652 -3106778 -2628641
56973 -2628641 -2190755 -1789496 -1421637 -1084390 -775308 -491420 -228811 16165 245305 458641
56963D58641J97196J80833J63875J46265J29194J14048J00879Q8803P7370O6678
56953A723782N6584M6884L7896K9909K2375J4675P336J426l066p072j0818j3552
56941A906359j4960j5668j6134j6221j6153j6782j8418k0360k2056k3761k5604
56930A700242k6949k7358k7314k7209k6514k4702k2231j9733j6910j3281r197
56919A458844m702K141J3938L0713M9464O7401Q3750R6874J00841Q7637N4158
56908B041059O541m3058q3901j11485j26925j33662j34990j33115j28931j22259
56898A029274j12730j00730q7520p4628o3243n3903m6446m0310l5114l0930k7833
56887C55887k5496k3462k1643k0169j8891j7421j5598j3549j1374r069o696m315
$$ plain form
56963 458641 655837 836670 1000545 1146810 1276004 1390052 1490931 1579734 1657104 1723782
56953 1723782 1780366 1827250 1865146 1895055 1917430 1932105 1939441 1940867 1937801 1930729 1919911 1906359
56941 1906359 1891399 1875731 1859597 1843376 1827223 1810441 1792023 1771663 1749607 1725846 1700242
56930 1700242 1673293 1645935 1618621 1591412 1564898 1540196 1517965 1498232 1481322 1468041 1458844
56919 1458844 1454142 1456283 1470221 1500934 1550398 1617799 1701549 1798423 1899264 1986901 2041059
56908 2041059 2047600 2004542 1920641 1809156 1682231 1548569 1413579 1280464 1151533 1029274
56898 1029274 916544 815814 728294 653666 590423 536520 490074 449764 414650 383720 355887
56887 355887 330391 306929 285286 265117 246226 228805 213207 199658 188284 179215 172519 168204
56875A68204j841P68L362N915Q675J1484J3192J2453R088M251o69m745p413q614
56861B14110r165j0166j1640j2377j1448r348p336o129n603n350n064m607m034
56848A11843l487l024k639k428k355k021j102N3P56R72J354K205L060L421L360
56833A09968L142K885K851L471M741O051O993P915R314J0968J1959J1328Q677
56820B00263M579N36j940k494j927j108l86O3J01J31R99L033N566P725R202J0160
56804B34503J0976J2256J4556J7722K0933K3371K4334K2822J8082J0828L051l652
56792D09782q848j2292j3480j2580j0708q638o160l255p47R74K775N371Q179J0566
56778C60939J3290J7441K2692K7810L2183L5418L6039L2237K4040J3541L030o256
$$ plain form
56875 168204 166363 167131 170493 176408 185083 196567 209759 222212 231300 235551 234882 230137 222724 214110
56861 214110 204945 194779 183139 170762 159314 149966 142630 136501 130898 125548 120484 115877 111843
56848 111843 108356 105332 102693 100265 97910 95889 94787 94840 95596 96568 97922 100127 103187 106608 109968
56833 109968 113110 115995 118846 122317 127058 133109 140102 148017 157331 168299 180258 191586 200263
56820 200263 204842 205378 203438 200944 199017 197909 197523 197586 197687 197818 198817 201850 207416 215141 224343 234503
56804 234503 245479 257735 272291 290013 310946 334317 358651 381473 399555 410383 413434 409782
56792 409782 400934 388642 375162 362582 351874 343236 337076 333821 333074 334048 336823 342194 350373 360939
56778 360939 374229 391670 414362 442172 474355 509773 545812 578049 602089 615630 618660 612404
56766F12404j3672j8799k1791k3278k3604k2670k0525j7578j4276j0967p930n090
56754D12224k008J423M759P821J1146J4958J8465K0848K2124K2119J9406J2835
56742E66120L675n137j1754j6320j9450k1224k1726k1269j9945j7836j5666j4179
56730C85289j2996j1127q598o390m741k794n6K917N555P837R540R959Q751O174
56716C89320K390k500p575j1375j3410j4426j4932j4597j3431j2346j1944j1682
56704B63492j0878r685q476p185n848n022m912m810m057l006k403k315k250j897
56690A90748j302o34k12l35q71j373j756k237k578k185j196n92q27j214j159j102
56674A71175j582k159k031j224m65k67o42j355j962k020j656j442j418q49M35
$$ plain form
56766 612404 598732 579933 558142 534864 511260 488590 468065 450487 436211 425244 417314 412224
56754 412224 410216 411639 416398 424219 435365 450323 468788 489636 511760 533879 553285 566120
56742 566120 569795 564658 552904 536584 517134 495910 474184 452915 432970 415134 399468 385289
56730 385289 372293 361166 352568 346178 341437 338643 338587 341504 347059 354896 364436 374395 383146 389320
56716 389320 391710 389210 381635 370260 356850 342424 327492 312895 299464 287118 275174 263492
56704 263492 252614 242929 234453 227268 221420 216398 211486 206676 202619 199613 197210 194895 192645 190748
56690 190748 189446 188812 188600 188265 187394 186021 184265 182028 179450 177265 176069 175477 174650 173436 172277 171175
56674 171175 169593 167434 165403 164179 163714 163447 162805 161450 159488 157468 155812 154370 152952 152103 152538
56659A52538J301O10j160k408k242j211m14m39j044j480j174l07M47Q41J143J290
56643A46291O74p49j921j872r52k12J3J88O05J011J105Q30K20n40j092j197r59
56626A41443m87L03J224J606J054J39k16J21M50K66j92l80j28K76M35L09K05L32
56608A46760M64L39J74L76P80Q20M85M18Q71J274J106O13K51Rk79m11j38L07M73
56589A54692K43j36m25n75p31j157j836k269k027j434j166j274j329j330j554
56574A37692j584o53Q51J493Q59J99M18P40K87k07M15J738K381K029J578J517
56558A49753J441J069O45L04m0j58L25J175J676J558J249J166J294J413J278O69
56542A64817k57p56k24R67J853K017J839J721J580J213P27M69O93J242J576J234
$$ plain form
56659 152538 153839 154449 153289 150881 148639 147428 147014 146575 145531 144051 142877 142570 143017 143858 145001 146291
56643 146291 146965 146216 144295 142423 141471 141259 141272 141460 142065 143076 144181 145011 145231 144691 143599 142402 141443
56626 141443 140956 141259 142483 144089 145143 145282 145066 145187 145637 145903 145711 145331 145203 145479 145914 146223 146428 146760
56608 146760 147224 147563 147737 148113 148893 149713 150198 150616 151487 152761 153867 154480 154731 154740 154461 154050 153912 154219 154692
56589 154692 154935 154799 154374 153799 153068 151911 150075 147806 145779 144345 143179 141905 140576 139246 137692
56574 137692 136108 135455 136306 137799 138658 138857 139275 140015 140302 140095 140510 142248 144629 146658 148236 149753
56558 149753 151194 152263 152908 153212 153172 153014 153339 154514 156190 157748 158997 160163 161457 162870 164148 164817
56542 164817 164560 163804 163580 164547 166400 168417 170256 171977 173557 174770 175497 175966 176659 177901 179477 180711
56526A80711L98k57l04J53Q38J495J684J131L75L56J133J804J928K116K764L252
56510A99577L069K797L136L758M042M208M690N061M647L807L544M129M968N573
56496B57006N878N918O003O771Q263R346R005P783P005O897O539N454M153L128
56482C49149K290J507Q65K95m50j385k320l159l768l879l637l846m939o205o615
56467C13903o129n432m997n065n910p141p402n915l865l060l601m089l798l306
56453B44193l177l289l448l542l135k022j035j105j669j319KR13P40L09K74J67
56437B22857m04q68p29n38j100k377l627m072l244j371L06M86o85j689j431k70
56421B01244Q54J404J193K74p75j132o30J45P23J069J093O70K08L41R98J554J925
$$ plain form
56526 180711 181109 180852 180548 180701 181539 183034 184718 185849 186224 186580 187713 189517 191445 193561 196325 199577
56510 199577 202646 205443 208579 212337 216379 220587 225277 230338 234985 238792 242336 246465 251433 257006
56496 257006 262884 268802 274805 281576 289839 299185 308190 315973 322978 329875 336414 341868 346021 349149
56482 349149 351439 352946 353811 354106 353656 352271 349951 346792 343024 339145 335508 331662 326723 320518 313903
56467 313903 307774 302342 297345 292280 286370 279229 271827 265912 262047 258987 255386 251297 247499 244193
56453 244193 241016 237727 234279 230737 227602 225580 224545 223440 221771 220452 220454 221367 222107 222416 222690 222857
56437 222857 222453 221585 220856 220318 219218 216841 213214 209142 205898 204527 204833 205319 204634 202945 201514 201244
56421 201244 202098 203502 204695 204969 204194 203062 202432 202577 203300 204369 205462 206132 206340 206681 207679 209233 211158
56404B11158K562L332L437K688J890J734K163K914L766M124L497K529K462L295
56390B51551L641K751J540J093J297J576J967K675L369L651L622L481L091K419
56376B87724J824J562J537J716K114K273J594L24o17j031j568k363k578j831r28
56361B89752o94r94j450k141k998l475l367l205l272l135k671k523k912l011k272
56346B51632j430j345j665j543j022p28p67p70o97p49q24p48p22j015j497j876
56330B34234k090k116j857j472j380j545j398o47K91R17J090P08k29j118j186
56315B22202o05l35o19o94k44N7j23r3N20R44O12J96M57J021J192J109J116Q31
56297B27544q1q78n98N03J346J474J344J478J972K571K728K030R13M15Q07J267
$$ plain form
56404 211158 213720 217052 220489 223177 225067 226801 228964 231878 235644 239768 243265 245794 248256 251551
56390 251551 255192 257943 259483 260576 261873 263449 265416 268091 271460 275111 278733 282214 285305 287724
56376 287724 289548 291110 292647 294363 296477 298750 300344 300668 300051 299020 297452 295089 292511 290680 289752
56361 289752 289058 288064 286614 284473 281475 278000 274633 271428 268156 265021 262350 259827 256915 253904 251632
56346 251632 250202 248857 247192 245649 244627 243899 243132 242362 241665 240916 240092 239344 238622 237607 236110 234234
56330 234234 232144 230028 228171 226699 225319 223774 222376 221729 222020 222937 224027 224735 224506 223388 222202
56315 222202 221597 221262 220643 219949 219705 219762 219639 219546 220066 221010 221622 221818 222275 223296 224488 225597 226713 227544
56297 227544 227463 226585 225987 226490 227836 229310 230654 232132 234104 236675 239403 241433 242346 242761 243568 244835
56281B44835J199J034J241J513J582J878K532K741K017J250J589K877M047M499
56267B74834M246L443K524K260K847L541L822M145M872N389N146M719M873N314
56253C31975N411N349N551N595M887L848L384L566L842M097M450M517L833K748
56239C93053K001J742J670J701J742J331L12o14p69m49k39m2M48R17R42Q69J257
56222D05872J942K507L125M125N117N514N534N918O873P889Q426Q334P994Q220
56208D87390R470J1014J1778J2087J3397J6023J8529J9979K1236K3211K5248K6453
56196F95815K7282K8641L0480L2357L4365L6379L7578L7756L7908L8433L8091
56185A075085L5921L2830K9902K6606K2156J7266J2892Q539L578j047m273o841
$$ plain form
56281 244835 246034 247068 248309 249822 251404 253282 255814 258555 260572 261822 263411 266288 270335 274834
56267 274834 279080 282523 285047 287307 290154 293695 297517 301662 306534 311923 317069 321788 326661 331975
56253 331975 337386 342735 348286 353881 358768 362616 366000 369566 373408 377505 381955 386472 390305 393053
56239 393053 395054 396796 398466 400167 401909 403240 403552 402938 402169 401720 401481 401439 401887 402804 403746 404615 405872
56222 405872 407814 410321 413446 417571 422688 428202 433736 439654 446527 454416 462842 471176 479170 487390
56208 487390 496860 507874 519652 531739 545136 561159 579688 599667 620903 644114 669362 695815
56196 695815 723097 751738 782218 814575 848940 885319 922897 960653 998561 1036994 1075085
56185 1075085 1111006 1143836 1173738 1200344 1222500 1239766 1252658 1261197 1264775 1263728 1259455 1252614
56173A252614r864j2657j4030j4619j5690j6685j6229j4835j4227j4650j5029
56162A094099j5276j6130j7265j7766j8103j9401k1132k1810k1547k1676k2096
56151H81897k1454j9877j9118j9779k0573k0517j9893j8846j7066j5090j4063
56140F75621j3918j3425j2113j0546q914p035n632n678o543o655n821n130m798
56127E69413m129l388l494l988l512k286j874k429k442j425n41k72K49J242J816
56112E42940J912K609L987M803M743M919N643N879N430N594O778P591P145O462
56098F16435O649P364P868Q195Q504Q634Q828R637J0719J1096J0766J0685J1082
56085G36462J1361J1738J3210J5696J7861J9021J9774K0752K2245K4910K9089
$$ plain form
56173 1252614 1242750 1230093 1216063 1201444 1185754 1169069 1152840 1138005 1123778 1109128 1094099
56162 1094099 1078823 1062693 1045428 1027662 1009559 990158 969026 947216 925669 903993 881897
56151 881897 860443 840566 821448 801669 781096 760579 740686 721840 704774 689684 675621
56140 675621 661703 648278 636165 625619 616705 609670 604038 598360 591817 585162 579341 574211 569413
56127 569413 565284 561896 558402 554414 550902 548616 546742 544313 541871 540446 539905 539633 539882 541124 542940
56112 542940 544852 547461 551448 556251 560994 565913 571556 577435 582865 588459 595237 602828 609973 616435
56098 616435 623084 630448 638316 646511 655015 663649 672477 682114 692833 703929 714695 725380 736462
56085 736462 747823 759561 772771 788467 806328 825349 845123 865875 888120 913030 942119
56074I42119L3708L7593M1558M7152N3911O0159O6233P4211Q4467R5102J05034
56063A641247J14957J24799J32584J36334J35155J28481J16661J02379Q9087P7863
56053B799547O7844N9179N2613M6518L7768K5911J3555K442p629j6020k1240k4446
56041C036042k9483l8445n0197o3807p9602r5901j08521j15228j17648j17444
56031B219766j13898j06722r8065q9925q2180p4562o7846o1918n5465m8622m3054
56020A377509l8631l3284k7118k2963k1605k0106j6520j2655j0359q576o095l914
56008A155683k869j859k84P35J052K360M867O387O234O567Q468J0234J1046J2504
55994A221125J4971J6262J5798J5980J7714J8737J8264J8837K1410K3217K2928
$$ plain form
56074 942119 975827 1013420 1054978 1102130 1156041 1216200 1282433 1356644 1441111 1536213 1641247
56063 1641247 1756204 1881003 2013587 2149921 2285076 2413557 2530218 2632597 2721684 2799547
56053 2799547 2867391 2926570 2979183 3025701 3063469 3089380 3102935 3105377 3097748 3081728 3060488 3036042
56041 3036042 3006559 2968114 2917917 2854110 2774508 2678607 2570086 2454858 2337210 2219766
56031 2219766 2105868 1999146 1901081 1811156 1728976 1654414 1586568 1524650 1469185 1420563 1377509
56020 1377509 1338878 1305594 1278476 1255513 1233908 1213802 1197282 1184627 1174268 1165692 1159597 1155683
56008 1155683 1152814 1150955 1150671 1151406 1152458 1154818 1159685 1166072 1172306 1178873 1187341 1197575 1208621 1221125
55994 1221125 1236096 1252358 1268156 1284136 1301850 1320587 1338851 1357688 1379098 1402315 1425243
55983A425243K3287K5938K8239K8223K8092K9710L1005L0226K9472L0643L2058
55972A742136L2321L3395L6492L9227M0111M1563M5186M8548M9983N1940N6079
55961B216981N9837O1418O3331O7412P1455P4337P8927Q5982R1148R2405R4495
55950C057728J01112J08838J14006J19356J28242J38210J46395J55461J68055
55941D237403J81161J92022K03740K18800K33369K44441K56202K72426K89385
55932F328949L03611L19561L41706L65939L87139M08276M33468M59307M82195
55923I830151N07034N39224N75296O10893O50012O96395P44567P90379Q41538
55914A5785489R06082R79775J056899J143122J244187J352928J462576J582321
$$ plain form
55983 1425243 1448530 1474468 1502707 1530930 1559022 1588732 1619737 1649963 1679435 1710078 1742136
55972 1742136 1774457 1807852 1844344 1883571 1923682 1965245 2010431 2058979 2108962 2160902 2216981
55961 2216981 2276818 2338236 2401567 2468979 2540434 2614771 2693698 2779680 2870828 2963233 3057728
55950 3057728 3158840 3267678 3381684 3501040 3629282 3767492 3913887 4069348 4237403
55941 4237403 4418564 4610586 4814326 5033126 5266495 5510936 5767138 6039564 6328949
55932 6328949 6632560 6952121 7293827 7659766 8046905 8455181 8888649 9347956 9830151
55923 9830151 10337185 10876409 11451705 12062598 12712610 13409005 14153572 14943951 15785489
55914 15785489 16691571 17671346 18728245 19871367 21115554 22468482 23931058 25513379
55906B5513379J724719J890200K080395K312089K598315K930315L299440L720481
55898D6069333M210236M763286N377832O085090O922984P908703R074785J0492546
55890A00904795J2199730J4138416J6216747J8320546K0052911K0465611J8370942
55883B20669698J3255683N940912j789085q277472j2772727j5366717j6497071
55876A85163221j6608469j6076794j5189751j4116716j2938188j1712593j0494409
55869H8026301r315369q194683p163654o252173n460537m770470m175006l674836
55861C9019573l255837k894586k580314k311631k078549j867090j676448j513837
55853B0841281j376451j253991j144207j050954r70831q95895q26189p66618p14670
$$ plain form
55906 25513379 27238098 29128298 31208693 33520782 36119097 39049412 42348852 46069333
55898 46069333 50279569 55042855 60420687 66505777 73428761 81337464 90412249 100904795
55890 100904795 113104525 127242941 143459688 161780234 181833145 202298756 220669698
55883 220669698 233925381 239866293 238077208 229799736 217027009 201660292 185163221
55876 185163221 168554752 152477958 137288207 123171491 110233303 98520710 88026301
55869 88026301 78710932 70516249 63352595 57100422 51639885 46869415 42694409 39019573
55861 39019573 35763736 32869150 30288836 27977205 25898656 24031566 22355118 20841281
55853 20841281 19464830 18210839 17066632 16015678 15044847 14148952 13322763 12556145 11841475
55844A1841475o63286o12792n68418n29148m89910m51997m20570l94370l67910
55835G343074l41473l19359l00502k80215k59213k42121k28852k15762k03341
55826D952236j94593j87732j78462j67776j59935j54392j47185j38521j31584
55817C492056j25495j16780j06455r8394r1974q3281p2578o3580n6339m7617l7704
55806B591859l0309k6200k3172k1836k5256l2985m1245m8826n7369o6075p1801
55795B146785p4312p6280p8037p7401p4571p2187p0493o7135o1899n7075n3181
55784A384214m8622m3561l9841l7143l3331k8453k4500k1449j7541j3053r781
55773A066939p152k950K375O089P403P373N169j164j0378j8631k4429k9091l2653
$$ plain form
55844 11841475 11178189 10565397 9996979 9467831 8977921 8525924 8105354 7710984 7343074
55835 7343074 7001601 6682242 6381740 6101525 5842312 5600191 5371339 5155577 4952236
55826 4952236 4757643 4569911 4391449 4223673 4063738 3909346 3762161 3623640 3492056
55817 3492056 3366561 3249781 3143326 3044932 2952958 2869677 2797099 2733519 2677180 2629563 2591859
55806 2591859 2561550 2535350 2512178 2490342 2465086 2432101 2390856 2342030 2284661 2218586 2146785
55795 2146785 2072473 1996193 1918156 1840755 1766184 1693997 1623504 1556369 1494470 1437395 1384214
55784 1384214 1335592 1292031 1252190 1215047 1181716 1153263 1128763 1107314 1089773 1076720 1066939
55773 1066939 1059787 1056837 1059212 1065301 1072704 1080077 1085246 1084082 1073704 1055073 1030644 1001553 968900
55760I68900l3560l2419l1800l2005l1027k8811k7550k7424k6115k3061k0377
55749F54751j8934j7275j5056j3871j3823j2820j0158p600o125m733l129k513
55737E28714k978l070k613l015m263m628l904l926n167n882n396n237o218p149
55723D65268p388p869q760q704p376o249n932n184l396j826j526k146l335n186
55709C90391o887p201o706p212q617q850p291n604m692l658k352k169l341m098
55695C11713l656l454m371n147m871m715n723o899o935o125n416n004m874n309
55681B39214n996o043n435m958m417k780m47O70n4j088j269j190j405j367r69
55666B02466j176k221k965k878k816l159l101k495k384k867k523r54J78k67j150
$$ plain form
55760 968900 935340 902921 871121 839116 808089 779278 751728 724304 698189 675128 654751
55749 654751 635817 618542 603486 589615 575792 562972 552814 545214 539089 534356 531227 528714
55737 528714 525736 522666 520053 517038 512775 508147 504243 500317 495150 489268 483872 478635 472417 465268
55723 465268 457880 450011 441251 432547 425171 418922 412990 407806 404410 402584 401058 398912 395577 390391
55709 390391 383504 376303 369597 362385 353768 344918 337627 332023 327331 323673 321321 319152 315811 311713
55695 311713 308057 304603 300232 295085 290214 285499 279776 272877 265942 259817 254401 249397 244523 239214
55681 239214 233218 227175 221740 216782 212365 209585 209138 209808 209754 208666 207397 206207 204802 203435 202466
55666 202466 201290 199069 196104 193226 190410 187251 184150 181655 179271 176404 173881 172927 173105 172838 171688
55651A71688j124n97l79j12O60J309J312J289J757K102J772J187O21l77j622j828
55635A77658n51Q28J073O72O06Q59J122J608K232K260J697J679K682L655L776
55620B01856L596L583L083J714L62l36j078k430l617l933m008m517m898m564m106
55605A80707m101l916k963k024j971k189j594l98M23O88Q69J046J057J059J029
55590A67722M41p71j667j580j120j098j361j511j870k680l306l204k940l211l541
55575A38303l069k025j432j659k199k478k317j862j604j997k742l026k697k473
55561A06723k654k630k071j593j644j723j354r49r98j218j160r42p48l80K31O62
55545H7552O56M26N3o00j175r91k28R3m41j234j932k737l280k615q76M49M68j89
$$ plain form
55651 171688 170564 169967 169588 169476 170136 171445 172757 174046 175803 177905 179677 180864 181485 181108 179486 177658
55635 177658 177107 177935 179008 179680 180286 181145 182267 183875 186107 188367 190064 191743 194425 198080 201856
55620 201856 205452 209035 212118 213832 214194 213858 212780 210350 206733 202800 198792 194275 189377 184813 180707
55605 180707 176606 172690 169727 167703 165732 163543 161949 161551 161974 162662 163531 164577 165634 166693 167722
55590 167722 168163 167392 165725 164145 163025 161927 160566 159055 157185 154505 151199 147995 145055 141844 138303
55575 138303 135234 133209 131777 130118 127919 125441 123124 121262 119658 117661 114919 111893 109196 106723
55561 106723 104069 101439 99368 97775 96131 94408 93054 92105 91107 89889 88729 87787 87039 86659 86890 87552
55545 87552 88208 88634 88687 88087 86912 85921 85693 85786 85345 84111 82179 79442 76162 73547 72671 73120 73588 73399
55527G3399q66j720k495k121m84R13J013N82O60J046J324J905K889L302K613J767
55511H3727J647J766J545J487J899J962J398J538L170M766M569L249K568K560
55497A17851J946N88n16j183k080l166l707l679l681l704l235k388j793j605j616
55482H8032j837k110j798q39l29r35j629j192r3M50M10M76M71r5o33l00L70K73
55464G8692l47m60j86l89q23m99L31M36k79p36o53p94j242j184n85l83p45q15
55446F9339m58o35j608k314k104j676j668j664j214p43p17r44j221j790k507k563
55430D5513j603m22O5j10m05n70n50j96M43R30R19N15Lm24o36o34o69q60q37k95
55410D0177L55M51N0k70l48m24m62k52q9m03q68p48j31K07M5j35k35o88j336j340
$$ plain form
55527 73399 72533 70813 68318 66197 65713 66626 67639 68221 68881 69927 71251 73156 76045 79347 81960 83727
55511 83727 85374 87140 88685 90172 92071 94033 95431 96969 100139 104905 109474 112723 115291 117851
55497 117851 119797 120385 119869 118686 116606 113440 109733 106054 102373 98669 95434 93046 91253 89648 88032
55482 88032 86195 84085 82287 81448 81119 80184 78555 77363 77270 77720 78130 78606 79077 78982 78349 78049 78419 78692
55464 78692 78345 77885 77699 77310 76487 75988 76319 76755 76476 75740 75087 74293 73051 71867 71282 70899 70154 69339
55446 69339 68881 68246 66638 64324 62220 60544 58876 57212 55998 55255 54538 53594 52373 50583 48076 45513
55430 45513 43910 43488 43553 43443 43038 42468 41918 41722 42165 43095 44014 44529 44532 44108 43472 42838 42169 41309 40472 40177
55410 40177 40532 40983 41033 40763 40415 39991 39529 39277 39188 38785 37917 37169 37038 37245 37290 37155 36920 36232 34896 33556
55390C3556m74L97N81L65J95k4l44k82M24J187J298Q49M03J71Mj13p5N4J20J50
55370C8442K71M65N92N84N19N08N44M24qn67q19o14j73L56R75J340Q63l37j247
55351D2118j220q14p01n09L86J542J940J543J180J098P70J23j08M18J028J017
55335D9811N51K40K65L05J8n77j071j096q81j077j791k256j921j238q15m17L97
55318C8447J199J254P25L26O3n67j348j473q68k75M1M64R26P35k01j072j412j611
55300C5353j877j622n75M64O24J72K6N14J127J323J074P74P92J019R49L62k85
55283D0214m52k73k19k70r8J52n1p26j306j441j272r45n21k58l28k48N36J560
55265C4054J702P32l15n87l35j30kK17L02l9o68j165j262r06k29L87N61L12mj74
$$ plain form
55390 33556 33082 33479 34060 34425 34620 34596 34252 33970 34394 35581 36879 37728 38131 38302 38306 38193 38118 38172 38292 38442
55370 38442 38713 39178 39770 40354 40873 41381 41925 42349 42341 41774 40955 40341 40168 40524 41499 42839 43702 43365 42118
55351 42118 40898 40084 39383 38874 39260 40802 42742 44285 45465 46563 47333 47456 47348 47766 48794 49811
55335 49811 50362 50602 50867 51172 51190 50613 49542 48446 47565 46488 44697 42441 40520 39282 38467 38050 38447
55318 38447 39646 40900 41625 41951 42014 41447 40099 38626 37758 37483 37524 37988 38914 39649 39448 38376 36964 35353
55300 35353 33476 31854 31279 31743 32367 32539 32565 33079 34206 35529 36603 37377 38169 39188 40137 40499 40214
55283 40214 39762 39489 39270 39000 38902 39054 39003 38277 36971 35530 34258 33313 32792 32534 32206 31958 32494 34054
55265 34054 35756 36488 36173 35586 35251 35121 35119 35336 35638 35599 34931 33766 32504 31598 31369 31756 32317 32629 32625 32451
55245C2451j80oK87L73R4j64k0K25P8k49j42L12M23Km06n04o12r79j408j662j622
55224B6291j034J87J372J534O12l92o09q9O04R35N16n74j488j311j91Q01R37M23
55206B8524j94n09k04P16J561J542P54pl50n23o64o31m61k86J02P75J080M48m09
55187C1264l29M81P35J55j49L97R55Q11M27L64K85k16p26p27m41k85j94J3J46
55168C2966J7k76o39j021r83o7J227J797J440J050J062Q65J89j74L47J091J228
55151D0119Q85N19Q0m66o17j41L07J67j73k16l32r90j666j473m54N33R95J093
55133C8170J068R94Q91O83J93n11j066j334j512j594j296o66j38K36Q15J451J395
55116C7779N34k32k87j39l65o50n62l95n21n49j4O71O62j87j284j970j859r76
$$ plain form
55245 32451 32271 32265 32552 32925 33019 32855 32835 33060 33138 32889 32747 33059 33482 33484 33078 32574 31962 30983 29575 27913 26291
55224 26291 25257 25444 26816 28350 28962 28570 27961 27872 28476 29411 29927 29353 27865 26554 26363 27164 28101 28524
55206 28524 28330 27821 27617 28333 29894 31436 32190 32183 31833 31310 30646 30015 29554 29268 29370 30145 31225 31673 31264
55187 31264 30935 31416 32151 32306 32157 32554 33509 34320 34747 35111 35396 35180 34454 33727 33286 33001 32807 32820 32966
55168 32966 32983 32707 32068 31047 30064 29997 31224 33021 34461 35511 36573 37438 37627 37453 37800 38891 40119
55151 40119 41004 41523 41603 41137 40520 40379 40686 40853 40680 40464 40132 39142 37476 36003 35549 36082 37077 38170
55133 38170 39238 40232 41123 41806 41999 41488 40422 39088 37576 35982 34686 34020 33882 34118 34933 36384 37779
55116 37779 38313 38081 37794 37655 37290 36640 36078 35683 35162 34613 34599 35270 35932 35745 34461 32491 30632 29656
55098B9656M9M60K96K50N41O91O12P95J163R44J38j75L52O12l1n00J21Q53L74
55079C7201o83o68N30J481J389Q18L85P2j79k35j57p2J89P00J059J029J078J528
55061D5465J781J282O17O60J197J381J151J063J125Q77L82P5k9j85k78j98l31
55044E6035q25r15l7R83J001K04m82r94j666j848p02Q79J098k4n32N25J782J722
55026E6204O37k94o32n63j59M22P23N83M04M03K31l10q02q90p66o96o05m48m53
55007E2989o87q43o62j95M04R33J028N36p6k65k21m29o24j25Q01R80L3r06o12
54988E2059P18J870J936R35m08j164r14j14M68O75Q77J115J083Q64R06J160R94
54971F3060K91j50K92J157J526J126M24o1k48l42m38l07K91J075J376R90M50J25
$$ plain form
55098 29656 29705 30165 30461 30711 31252 31943 32555 33350 34513 35457 35595 35420 35772 36384 36353 35853 35974 36827 37201
55079 37201 36518 35850 36380 37861 39250 40068 40453 40525 40346 40111 39954 39882 40071 40771 41830 42859 43937 45465
55061 45465 47246 48528 49145 49805 51002 52383 53534 54597 55722 56599 56981 57056 57027 56842 56564 56366 56035
55044 56035 55210 54295 54258 55241 56242 56446 55964 54970 53304 51456 50754 51633 52731 52707 52175 52700 54482 56204
55026 56204 56841 56547 55915 55352 55193 55615 56338 56921 57325 57728 57959 57649 56847 55957 55191 54495 53890 53442 52989
55007 52989 52302 51459 50797 50602 51006 51939 52967 53503 53427 53162 52941 52512 51888 51763 52564 53544 53577 52671 52059
54988 52059 52777 54647 56583 57518 57110 55946 55032 54918 55386 56061 56938 58053 59136 60000 60906 62066 63060
54971 63060 63351 63201 63493 64650 66176 67302 67726 67665 67417 67075 66637 66330 66621 67696 69072 70062 70512 70637
54953G0637l03r63j135k87Q09J032N47L71O65O75K26k5J07K3n30j088j400j642
54935F7719j646j013j80j58r46j418j098p97j032j094l62N91R80Q81O59K42k59
54918F1069j67P38J627J814J724J869J747P99l14n05K13R67J354J498J256M57
54902G6146k41R5J316K241K193J679J497J844K483L088L281K791J872J294J651
54887A03230K841M121M702M378L762L685M262M828M898M781M931N173M991M259
54873A64842L167J702k42k398m301n815p065p910p931p087n927n090m758m649
54859A06538m357l714k988k652k785k816k116q00L35O98M65J74Q1J59N38J450
54843H8210K618L221K846K181K233L025L808M411N425O827P514O817N526M596
$$ plain form
54953 70637 70334 69371 68236 67949 68758 69790 70337 70708 71373 72048 72274 72249 72356 72379 71849 70761 69361 67719
54935 67719 66073 65060 64880 64722 63776 62358 61260 60463 59431 58337 57975 58566 59546 60427 61086 61328 61069
54918 61069 60902 61640 63267 65081 66805 68674 70421 71220 70906 70401 70614 71581 72935 74433 75689 76146
54902 76146 75905 76000 77316 79557 81750 83429 84926 86770 89253 92341 95622 98413 100285 101579 103230
54887 103230 106071 110192 114894 119272 123034 126719 130981 135809 140707 145488 150419 155592 160583 164842
54873 164842 168009 169711 169469 167071 162770 156955 149890 141980 134049 126962 121035 115945 111187 106538
54859 106538 102181 98467 95479 92827 90042 87226 85110 84310 84645 85343 85808 85982 86063 86222 86760 88210
54843 88210 90828 94049 96895 99076 101309 104334 108142 112553 117978 124805 132319 139136 144662 149258
54829A49258L686K042N8j320k271l729n604o761o821o538o352n870n051m535m407
54814I5785l937k969k262k005j310P0R22L37p93j122o88m37p39j349k047k375
54798G5081j584J46J247O74o18j163j129j535k140j907j101j065j904k146j079
54783E9777J26K33m29q34p17m10k9M04N93L30j05l36m02m87n53n04l78j73K56
54764E6362Q52J247J104M20n99j581j992j553p48l73m70k12Q54K018K307J741
54748E9377J232J357J745J721J205P88J007J713K258K267J990J846J890J999K288
54733H4683K904L567L842L904M466N716O891P204O836O601O868P273P337O959
54719A65051O203N041L468J664j35j847l436m743n562n807n493m643l480k565
$$ plain form
54829 149258 152944 154986 155044 153724 151453 147724 142120 135359 128538 122000 115648 109778 104727 100192 95785
54814 95785 91848 88879 86617 84612 83302 83372 84294 84631 83838 82716 82028 81591 80852 79503 77456 75081
54798 75081 73497 73643 74890 75564 74946 73783 72654 71119 68979 67072 65971 64906 63002 60856 59777
54783 59777 59903 60136 59707 58873 58156 57746 57717 58121 58714 59044 58939 58603 58201 57714 57161 56657 56279 56106 56362
54764 56362 57214 58461 59565 59985 59386 57805 55813 54260 53512 53139 52669 52457 53311 55329 57636 59377
54748 59377 60609 61966 63711 65432 66637 67425 68432 70145 72403 74670 76660 78506 80396 82395 84683
54733 84683 87587 91154 94996 98900 103366 109082 115973 123177 130013 136614 143482 150755 158092 165051
54719 165051 171254 176295 179763 181427 181292 179445 176009 171266 165704 159897 154404 149761 146281 143716
54705A43716k351k562k355j289J38J139J463J367J147J039J310J921K344K215
54691A49242J998K409L333L915L732L207K807K522K273K210K348K427K350K266
54677A87039K071J336Pj418k575l600m543n105n273n632o521p384p435o627n483
54662A28857m447l803l779m261m671m572m063l367k492j631j277j485j583j201
54648H6225r52j438k089j864p04M54Q89N98j49r45j148m03P78J600J961K232K325
54631H7370J818R17L80L87K77l54r93r52k30O67J365J811K056K104J923J591J421
54614A01558J725K305K589K448K455K887L052K288J117O02Q10Q70L87p1j0M29
54598A25441J038J906K860L362L200K821K673K738K981L655M809N963O594O719
$$ plain form
54705 143716 141365 138803 136448 135159 135297 136436 137899 139266 140413 141452 142762 144683 147027 149242
54691 149242 151240 153649 156982 160897 164629 167836 170643 173165 175438 177648 179996 182423 184773 187039
54677 187039 189110 190446 190453 189035 186460 182860 178317 173212 167939 162307 155786 148402 140967 134340 128857
54662 128857 124410 120607 116828 112567 107896 103324 99261 95894 93402 91771 90494 89009 87426 86225
54648 86225 85273 83835 81746 79882 79178 79632 80521 81119 80970 80025 78877 78474 79252 80852 82813 85045 87370
54631 87370 89188 90105 90485 90872 91149 90795 89802 88850 88620 89287 90652 92463 94519 96623 98546 100137 101558
54614 101558 103283 105588 108177 110625 113080 115967 119019 121307 122424 123026 123836 124706 125093 125022 125012 125441
54598 125441 126479 128385 131245 134607 137807 140628 143301 146039 149020 152675 157484 163447 170041 176760
54584A76760O707O800O902O670N741M175K557J344K55j185k682l482l586l860
54570B03116m758n735o175o190o058n627m852m282m332m471l886k740k009k054
54556A39947k065j218P0N23m42j967k729k376j692j414j442j439j541j995k400
54541A17820k092j213o89j051j840k242j920j096k46J23j63o63p46l42M8Q2j47
54524A03623n53j185j826k017j672j183q02m10l5pl51o26o21o35p43m77L89J213
54506I2082J295P99M13L76M66N39N96N14L06L59R36J594J644J055L64j18m29m11
54488A02380K53J381K257K460K275K135K159K397K977L736M106L811L351L373
54474A39051L757L870L509L061K696K044R52J2j45J82O2r32k329l474m082m104
$$ plain form
54584 176760 183467 190267 197169 203839 209580 213755 216312 217656 217911 216726 214044 210562 206976 203116
54570 203116 198358 192623 186448 180258 174200 168573 163721 159439 155107 150636 146750 144010 142001 139947
54556 139947 137882 136664 136734 137257 136815 134848 132119 129743 128051 126637 125195 123756 122215 120220 117820
54541 117820 115728 114515 113826 112775 110935 108693 106773 105677 105431 105554 105391 104728 103982 103640 103688 103770 103623
54524 103623 103070 101885 100059 98042 96370 95187 94385 93975 93940 93933 93582 92956 92335 91700 90957 90480 90869 92082
54506 92082 93377 94176 94589 94965 95431 95970 96566 97080 97386 97745 98681 100275 101919 102974 103338 103220 102791 102380
54488 102380 102633 104014 106271 108731 111006 113141 115300 117697 120674 124410 128516 132327 135678 139051
54474 139051 142808 146678 150187 153248 155944 157988 158940 158952 158807 158989 159051 158119 155790 152316 148234 144130
54458A44130l575k851k489k600k669k288j721j406j329j258j303j659k037j873
54444A15072j055j1Q23J236J116N87J31J43M05N12O04J116J858K072J497P30L47
54427A27183L16M50Q92J674K347K444K099J804J724J625J341J063J085J349J314
54412A48710N33n88r59q6J166J632J311J134J420J586J307J069J206J258P37j38
54396A61298q73j322j491j316r84r68j246j084j19R12J067L67n22j267j887k223
54380A48342k105j834j791j779j348o55l44o32j121j428j506j399j201j207j555
54365A28437j788j283j35Q87J287J269J145Q74M51K23N25J161J582J546J371J561
54349A39113K164K634K437J813J593K174K975L146K544J678R52M74L52O46J082
$$ plain form
54458 144130 140555 137704 135215 132615 129946 127658 125937 124531 123202 121944 120641 118982 116945 115072
54444 115072 114017 114006 114829 116065 117181 117768 117899 118042 118447 118959 119563 120679 122537 124609 126106 126836 127183
54427 127183 127499 127949 128841 130515 132862 135306 137405 139209 140933 142558 143899 144962 146047 147396 148710
54412 148710 149243 148655 147696 147610 148776 150408 151719 152853 154273 155859 157166 158235 159441 160699 161436 161298
54396 161298 160425 159103 157612 156296 155312 154344 153098 152014 151895 152807 153874 154241 153719 152452 150565 148342
54380 148342 146237 144403 142612 140833 139485 138830 138486 137854 136733 135305 133799 132400 131199 129992 128437
54365 128437 126649 125366 125231 126118 127405 128674 129819 130693 131144 131367 131892 133053 134635 136181 137552 139113
54349 139113 141277 143911 146348 148161 149754 151928 154903 158049 160593 162271 163223 163697 164049 164695 165777
54334A65777J279J238J206J095N14n02j331j457j100r20j370k350l263l399k568
54319A52849j424r01j194j627j586j223j052j175j258j145j083j332j679j586
54305A34584p83K90Q80P63M89O00Q67O83M8l70k36n0l47q28p61RQ84J321J333
54286A39376J162Q32L03j82k41J56N40L59m87j501j970j620r99j006j888k823
54270A30011k836k040j487j776k361k479k210k091k147k045j865j946k027j443
54256A01258k80M73J74p51j666k493l185l222k367j315q56p86m80j38m37j206
54240H2723j516j143r39j487k265k524k239j692q24L40J116Q46j79j043j365j487
54224F6322j616j450q28j80L3n4K3L46N20K59k51o18o37l20K45Q95J327J262P60
$$ plain form
54334 165777 167056 168294 169500 170595 171109 170607 169276 167819 166719 165799 164429 162079 158816 155417 152849
54319 152849 151425 150524 149330 147703 146117 144894 143842 142667 141409 140264 139181 137849 136170 134584
54305 134584 133801 134091 134971 135734 136223 136823 137690 138373 138421 138051 137815 137765 137418 136590 135829 135838 136722 138043 139376
54286 139376 140538 141370 141673 141491 141250 141406 141946 142305 141818 140317 138347 136727 135728 134722 132834 130011
54270 130011 127175 125135 123648 121872 119511 117032 114822 112731 110584 108539 106674 104728 102701 101258
54256 101258 100978 101451 101625 100874 99208 96715 93530 90308 87941 86626 85770 84984 84504 84366 83929 82723
54240 82723 81207 80064 79125 77638 75373 72849 70610 68918 68094 68434 69550 70396 70217 69174 67809 66322
54224 66322 64706 63256 62428 62248 62281 62227 62250 62596 63116 63375 63124 62506 61869 61549 61794 62689 64016 65278 66038
54205F6038K09m0P2L76O47O56K87k12l00K86J078J262N74m14r18o67L2P00R86
54186G0652Q00L41QN7L30L99J2o81j309j598j498j155q17o66o68o18m28k57k79
54167F2625l98m00k99k76k53Q3P19J100P84O7m37o24q73j234j206m54O50J469
54149F1043J732J456O74m36j327j513j143q22q34r38r01q25q08o00J0P02Q91M68
54131E6829p8l35m69q16j213j130m24L47N01l1p21r77o61j20J20j37n34o12m39
54112D9100n21r77j216o77L87J213J367R53J83p13j302j183n01J81N77Q87J285
54095D9043J549J362P59J19j22R4L04p4r10j288o42L19N18L6k5P63J529J434Q21
54076E5589N36P18Q84P91O52O47P42Q12O79J82n39r98r27o18m58l97j55K94O99
$$ plain form
54205 66038 66247 66207 66279 66655 67302 67958 68245 68033 67733 68019 69097 70359 70933 70519 69601 68934 68966 69666 70652
54186 70652 71452 71793 71801 71858 72188 72587 72599 71918 70609 69011 67513 66358 65541 64875 64207 63589 63161 62904 62625
54167 62625 62227 61827 61528 61252 60999 61082 61801 62901 63685 63752 63315 62691 61818 60584 59378 58924 59574 61043
54149 61043 62775 64231 64905 64469 63142 61629 60486 59664 58830 57892 56991 56166 55358 54758 54768 55470 56361 56829
54131 56829 56751 56416 55947 55131 53918 52788 52364 52711 53212 53181 52460 51483 50822 50702 50822 50685 50151 49539 49100
54112 49100 48579 47602 46386 45709 46096 47309 48676 49629 49812 49099 47797 46614 46113 46294 46871 47758 49043
54095 49043 50592 51954 52713 52832 52710 52804 53108 53034 52124 50836 50194 50513 51031 51067 51042 51805 53334 54768 55589
54076 55589 56125 56843 57727 58518 59170 59817 60559 61371 62050 62232 61693 60695 59768 59150 58692 58295 58140 58434 59133
54057E9133Q52O88K68j50k16Q1L12J38k48m38k74J32N65P81N80J11k08j98p7M7
54037F1879M13J084J579J403O92ll40k96L3M38N64K30l27p26p84n27j29M3l09
54018F4917r31j181q75m88l75l01k3K61L51M47O25N03p7n51l30L56Q99J136J198
53999F5561R83M17j12k43j76j84j5N16Q76N51O2K73J006J311R83P40R22J046P58
53980G5275L80K54L18N62J219K207K988L211L010K629K241K194K745L457L532
53965A06222K950K625L172M100M479L975K943K000J672K060K609K613K010J332
53951A44762Q90O21O21J092J541R67p47k268k327j292o59j261k482l156k751j727
53935A31824r72r70j400j616j402j070r34j007j219j509j636j363r09q32j323
$$ plain form
54057 59133 59985 60673 60941 60791 60575 60656 60968 61106 60858 60420 60146 60278 60843 61624 62204 62315 62107 61909 61832 61879
54037 61879 62292 63376 64955 66358 67050 67047 66707 66411 66444 66882 67446 67676 67349 66623 65839 65312 65183 65226 64917
54018 64917 63986 62805 61930 61442 61067 60766 60743 61004 61355 61802 62427 62930 62853 62302 61972 62328 63227 64363 65561
53999 65561 66544 66961 66849 66606 66430 66246 66231 66747 67623 68174 68236 68509 69515 70826 71809 72549 73471 74517 75275
53980 75275 75655 75909 76227 76789 78008 80215 83203 86414 89424 92053 94294 96488 99233 102690 106222
53965 106222 109172 111797 114969 119069 123548 127523 130466 132466 134138 136198 138807 141420 143430 144762
53951 144762 145652 146273 146894 147986 149527 150494 149747 147479 145152 143860 143201 141940 139458 136302 133551 131824
53935 131824 130852 129882 128482 126866 125464 124394 123460 122453 121234 119725 118089 116726 115817 114985 113662
53920A13662j925k122j885j578j588k082k793l044k328r52K62Q65J034R66O18
53905I7110O8l55m79m36l35j92j97n25r40r78o16j76L29J064J648J353K75m96
53887I6122j68Q88J873K488K768K707K478K519K926L248L211L119L201L114K604
53872A33098K109K163K606K883K762K327J661R99Q35J332J953K081J728J220O27
53857A60384n3n04l87J55P95J510K356L024L168K975K945L206L497L612L575L520
53841A93778L680M224M851M870M039L032K583K597K511K176J794J304M73n12j163
53826B30237j344j333j336j369j576k128k854l357l549l677l907m174m387m450
53812A90796m196l578k905k540k495k593k820l175l387l210k906k926l219l312
$$ plain form
53920 113662 111737 109615 107730 106152 104564 102482 99689 96645 94317 93365 93627 94492 95526 96492 97110
53905 97110 97178 96823 96344 95908 95573 95381 95184 94659 93719 92741 92125 91949 92278 93342 94990 96343 96618 96122
53887 96122 95954 96842 98715 101203 103971 106678 109156 111675 114601 117849 121060 124179 127380 130494 133098
53872 133098 135207 137370 139976 142859 145621 147948 149609 150608 151443 152775 154728 156809 158537 159757 160384
53857 160384 160331 159827 159440 159595 160390 161900 164256 167280 170448 173423 176368 179574 183071 186683 190258 193778
53841 193778 197458 201682 206533 211403 215442 218474 221057 223654 226165 228341 230135 231439 231912 231400 230237
53826 230237 228893 227560 226224 224855 223279 221151 218297 214940 211391 207714 203807 199633 195246 190796
53812 190796 186600 183022 180117 177577 175082 172489 169669 166494 163107 159897 156991 154065 150846 147534
53798A47534l078k951l211l521l331k547j618j086j114j402j490j286j085j188
53784A18626j528j867k052j967j478o33K84J020J463J370N20o73j216o66J53J56
53768A11512o50j318j209n34K12O31M37k92q50m73O95J720J991J763J486J198
53752A16319P84L44L1j72k66p8M33R92J320J470J622J731J601J259J040J264J895
53735A31589K563K900K811K463K090J885J981K348K742K887K708K243J461M64
53721A63135k50j77M84R56Q64O41P97J213J463J378R80K21p49j398j387j028r12
53704A66231j229j773k282k468k101j423j133j445j655j155m61n06j209j586j193
53689A44612o07m51o64r51j312j704j747j155k52K61Mp57j364j389j025q21r43
$$ plain form
53798 147534 144456 141505 138294 134773 131442 128895 127277 126191 125077 123675 122185 120899 119814 118626
53784 118626 117098 115231 113179 111212 109734 109101 109385 110405 111868 113238 113758 113085 111869 111203 111356 111512
53768 111512 110862 109544 108335 107801 108013 108644 109081 108789 107939 107466 108161 109881 111872 113635 115121 116319
53752 116319 117103 117447 117478 117306 117040 116962 117395 118387 119707 121177 122799 124530 126131 127390 128430 129694 131589
53735 131589 134152 137052 139863 142326 144416 146301 148282 150630 153372 156259 158967 161210 162671 163135
53721 163135 162885 162708 163192 164148 165012 165653 166450 167663 169126 170504 171484 171705 170956 169558 168171 167143 166231
53704 166231 165002 163229 160947 158479 156378 154955 153822 152377 150722 149567 149106 148600 147391 145805 144612
53689 144612 144005 143554 142890 141939 140627 138923 137176 136021 135769 136030 136034 135277 133913 132524 131499 130678 129735
53672A29735r69o02k77o13j477k101k036j547j060o73l56k15l81p68j082r93l35
53655A14250O84J560J895J739J453J353J555J877J843J093n9p75o13N6O68J074
53639A29653J244J013M98L01P72J491J956K250K554K533J873J020O26O60P52J025
53623A50221J776K632K904K568K124J720J237R13J017J194J027J028J904L083
53609A75348L195K033P71J49k38o94p64l02N8N4L18J093J500Q85p7m48l94n59
53591A81928p97n52N4L65K17o1k87m59l78J01O52Q92Q87Q43N92L0l92k32J31j0
53571A83524n88q41m05K98P89J063J285J446J426J220R97J063J585K237K387J886
53555A99372J345J310J514J476J408J906K857L411L160K689K727L195L427L075
$$ plain form
53672 129735 128766 128164 127887 127274 125797 123696 121660 120113 119053 118380 118024 117809 117428 116660 115578 114585 114250
53655 114250 114934 116494 118389 120128 121581 122934 124489 126366 128209 129302 129243 128468 127855 127911 128579 129653
53639 129653 130897 131910 132408 132709 133481 134972 136928 139178 141732 144265 146138 147158 147784 148444 149196 150221
53623 150221 151997 154629 157533 160101 162225 163945 165182 166095 167112 168306 169333 170361 172265 175348
53609 175348 178543 180576 181347 181496 181258 180564 179800 179498 179556 179610 179928 181021 182521 183406 183329 182881 182487 181928
53591 181928 181131 180579 180633 180998 181215 181154 180867 180408 180030 180131 180783 181675 182562 183405 183997 184027 183635 183403 183534 183524
53571 183524 182936 182095 181690 181988 182777 183840 185125 186571 187997 189217 190214 191277 192862 195099 197486 199372
53555 199372 200717 202027 203541 205017 206425 208331 211188 214599 217759 220448 223175 226370 229797 232872
53541B32872K432J979J901K089K412K863L453M061M554M904N078M895M167L090
53527B80750K191J855K009K305K470K400K202K136K386K779K876K403J500N92
53513C10854J14K32O20O82K12k71j91L38P21P16N09J80l13p14o40k09R9J97M06
53494C13542P10P13L91K03K69K73K43O58J430J708J126M84O04J241J695J887K169
53477C29346K615L108L681M169M108L517L280M059N283N899N714N275M871M524
53463C89449M559N390O738P900Q725R693J1002J2208J2818J2827J2670J2875J3682
53450E20536J4737J5453J5811J6403J7394J8108J8143J8193J9048K0381K1374
53439G15581K2019K2832K3653K3875K3691K4007K5063K6099K6533K6529K6310
$$ plain form
53541 232872 235304 237283 239184 241273 243685 246548 250001 254062 258616 263520 268598 273493 277660 280750
53527 280750 282941 284796 286805 289110 291580 293980 296182 298318 300704 303483 306359 308762 310262 310854
53513 310854 310968 311200 311820 312502 312714 312443 312252 312590 313311 314027 314536 314716 314403 313689 313049 312840 312939 313136 313542
53494 313542 314252 314965 315356 315559 315828 316101 316344 317002 318432 320140 321266 321750 322354 323595 325290 327177 329346
53477 329346 331961 335069 338750 342919 347027 350544 353824 357883 363166 369065 374779 380054 384925 389449
53463 389449 394008 399398 406136 414036 422761 432454 443456 455664 468482 481309 493979 506854 520536
53450 520536 535273 550726 566537 582940 600334 618442 636585 654778 673826 694207 715581
53439 715581 737600 760432 784085 807960 831651 855658 880721 906820 933353 959882 986192
53428I86192K5798K5207K5110K5612K6040K5859K5335K5118K5557K6572K7710
53417A270110K8236K7732K6587K5467K4408K3058K1608K0569J9703J8216J6181
53406A521875J4674J4095J3489J2099J0676J0309J0698J0495R020O818M769L306
53394A642323K327J291m86l113n913q252j0284j2415j4376j5580j6187j7089j8701
53381A523545k0465k1671k2317k2852k3434k3841k3913k3813k3803k3933k3937
53370A269566k3496k2568k1466k0526j9811j9186j8523j7690j6437j4601j2494
53359A062768j0705r411q048n979l346q43J312L688O641R456J1147J1926J3124
53346A081730J5496J8303K0435K1906K3551K5719K7891K9526L0650L1600L2654
$$ plain form
53428 986192 1011990 1037197 1062307 1087919 1113959 1139818 1165153 1190271 1215828 1242400 1270110
53417 1270110 1298346 1326078 1352665 1378132 1402540 1425598 1447206 1467775 1487478 1505694 1521875
53406 1521875 1536549 1550644 1564133 1576232 1586908 1597217 1607915 1618410 1627430 1634248 1639017 1642323
53394 1642323 1644650 1645941 1645455 1642342 1636429 1628177 1617893 1605478 1591102 1575522 1559335 1542246 1523545
53381 1523545 1503080 1481409 1459092 1436240 1412806 1388965 1365052 1341239 1317436 1293503 1269566
53370 1269566 1246070 1223502 1202036 1181510 1161699 1142513 1123990 1106300 1089863 1075262 1062768
53359 1062768 1052063 1042652 1034604 1028625 1025279 1024436 1025748 1029436 1036077 1045533 1056680 1068606 1081730
53346 1081730 1097226 1115529 1135964 1157870 1181421 1207140 1235031 1264557 1295207 1326807 1359461
53335A359461L3965L5484L6996L8465M0215M2418M4648M6415M7955M9843N2010
53324A827875N3858N5336N7025N9031O0569O1046O0836O0627O0524O0345O0154
53313B477226N9933N9136N7325N4983N3013N1556M9830M7153M3617L9712L5795
53302C029279L2067K8680K5561K2364J8796J4970J1308Q054M929J364k925p662
53290C186785j2459j7403k2970k9367l6202m2866m8939n4129n8203o1109o3055
53279B740083o4283o5004o5564o6350o7205o7367o6314o4519o2987o2209o1883
53268B026398o1568o1088o0327n9012n6978n4418n1704m9027m6362m3741m1375
53257A440798l9416l7606l5353l2349k9035k6176k3922k1573j8519j5062j2095
$$ plain form
53335 1359461 1393426 1428910 1465906 1504371 1544586 1587004 1631652 1678067 1726022 1775865 1827875
53324 1827875 1881733 1937069 1994094 2053125 2113694 2174740 2235576 2296203 2356727 2417072 2477226
53313 2477226 2537159 2596295 2653620 2708603 2761616 2813172 2863002 2910155 2953772 2993484 3029279
53302 3029279 3061346 3090026 3115587 3137951 3156747 3171717 3183025 3191079 3196008 3197372 3194447 3186785
53290 3186785 3174326 3156923 3133953 3104586 3068384 3025518 2976579 2922450 2864247 2803138 2740083
53279 2740083 2675800 2610796 2545232 2478882 2411677 2344310 2277996 2213477 2150490 2088281 2026398
53268 2026398 1964830 1903742 1843415 1784403 1727425 1673007 1621303 1572276 1525914 1482173 1440798
53257 1440798 1401382 1363776 1328423 1296074 1267039 1240863 1216941 1195368 1176849 1161787 1149692
53246A149692j0047q577p200n809m410k750n26K020M103N162N506O016P240Q918
53232A149338J0380J1239J1595J1847J2526J4024J6165J8106J9174J9776K1095
53221A315265K3628K6482K8308K8679K8193K7562K7010K6541K6195K5915K5389
53210A609167K4278K2566K0622J8943J7838J7262J6879J6296J5236J3575J1392
53199A804054R070P123N669M169J946j028m160p010r746j2650j5534j8076k0538
53186A743289k3594k7292l0733l3098l4703l6475l8606m0314m0989m0932m0664
53175A355889m0029l8595l6580l4822l3772l3119l2487l2003l1947l2109l1948
53164I78478l1343l0890l1252l2206l2585l1389k8980k6821k5883k5615k4695
$$ plain form
53246 1149692 1139645 1131068 1123868 1118059 1113649 1110899 1110373 1112393 1116496 1121658 1127164 1133180 1140420 1149338
53232 1149338 1159718 1170957 1182552 1194399 1206925 1220949 1237114 1255220 1274394 1294170 1315265
53221 1315265 1338893 1365375 1393683 1422362 1450555 1478117 1505127 1531668 1557863 1583778 1609167
53210 1609167 1633445 1656011 1676633 1695576 1713414 1730676 1747555 1763851 1779087 1792662 1804054
53199 1804054 1813124 1820247 1825916 1830085 1832031 1831003 1826843 1819833 1810087 1797437 1781903 1763827 1743289
53186 1743289 1719695 1692403 1661670 1628572 1593869 1557394 1518788 1478474 1437485 1396553 1355889
53175 1355889 1315860 1277265 1240685 1205863 1172091 1138972 1106485 1074482 1042535 1010426 978478
53164 978478 947135 916245 884993 852787 820202 788813 759833 733012 707129 681514 656819
53153F56819k2582j9899j7554j5994j5236j5023j4858j4261j3253j2319j1753
53142D84087j1425j1160j0986j0848j0462r806r325r384r712r755r269q419p418
53129C56118o507n995n965o123o211o370o744o953o542n821n619o142o634o430
53115B68062n769n225m847m394m057m259m828n037m566l945l773l968m005l604
53101B05785k864k038j496j625k373l023k876k058j277r46r41j140j614k230k554
53086A76730k350j794j094l56J01j45r28j452j221o32l18m31q87j754k826l280
53070A57363k509j056p6M2j00P4M74P41P45N43K01k33p60j294j429p03N97J384
53052A54004J039K87J48M39K39n08r32p12m65m16J12J463K792L132K616J990J482
$$ plain form
53153 656819 634237 614338 596784 580790 565554 550531 535673 521412 508159 495840 484087
53142 484087 472662 461502 450516 439668 429206 419400 410075 400691 390979 381224 371955 363536 356118
53129 356118 349611 343616 337651 331528 325317 318947 312203 305250 298708 292887 287268 281126 274492 268062
53115 268062 262293 257068 252221 247827 243770 239511 234683 229646 225080 221135 217362 213394 209389 205785
53101 205785 202921 200883 199387 197762 195389 192366 189490 187432 186155 185209 184268 183128 181514 179284 176730
53086 176730 174380 172586 171492 171136 171237 171092 170164 168712 167491 166859 166541 166110 165223 163469 160643 157363
53070 157363 154854 153798 153722 153764 153664 153738 154212 154953 155698 156241 156442 156209 155449 154155 152726 152023 152620 154004
53052 154004 155043 155330 155478 155917 156156 155648 154716 154004 153539 153123 153235 154698 157490 160622 163238 165228 166710
53035A66710Q73K95K39Q07J421J365M62p45j476j515j466j868k334k124j420j194
53019A58030j713k126j826j305j175j226j067r50j213j574j702j946k584k961
53005A34662k350j289r87j593k112j991j736j784j789j457j148j163j079m75J62
52990A13871n2j124k101k231j734j218q33l37J29k7r83j928j920j098m99o36r31
52973I6348p89n74r44j687j932j356n76k97n99j136j582j701j318n21K40M24j40
52956H1860r92j338p51L41J047R35L02m02r83j264r67k04L40K08k09k72k8l4m28
52937G7161p70o61r3P23J427J524P83l26j003r22l42L51Q48Q44K96k81l09N3J80
52918G9483j01l28k99l55o79p99k74N81J063R81P68Q33J129J369J449J490J531
$$ plain form
53035 166710 167583 167878 168117 168924 170345 171710 172172 171427 169951 168436 166970 165102 162768 160644 159224 158030
53019 158030 156317 154191 152365 151060 149885 148659 147592 146642 145429 143855 142153 140207 137623 134662
53005 134662 132312 131023 130036 128443 126331 124340 122604 120820 119031 117574 116426 115263 114184 113709 113871
52990 113871 113819 112695 110594 108363 106629 105411 104578 104241 104370 104343 103360 101432 99512 98414 97915 97279 96348
52973 96348 95559 94985 94041 92354 90422 89066 88490 88193 87594 86458 84876 83175 81857 81336 81576 82000 81860
52956 81860 80868 79530 78779 79120 80167 81102 81404 81002 80019 78755 77788 77584 77924 78132 77923 77651 77623 77589 77161
52937 77161 76391 75730 75637 76360 77787 79311 80094 79768 78765 77843 77501 77852 78700 79544 79840 79559 79250 79303 79483
52918 79483 79382 79054 78755 78400 77721 76922 76648 77229 78292 79273 80041 80874 82003 83372 84821 86311 87842
52901H7842J317O53q9j68O44J654K037J802J550J541J602J747K232K882L076K654
52885A12976K219K259K448K283J915J837J974J751R93J55m30r94j749k271j981
52870A23385j132p36j357k387k818k417j713j109n93l17o84j584k147j767r57
52855A01667o47r29j117q05l23r4r8r8J6J96K95R9m15q84r14o07m83q22j352j603
52835I1082j345p46k36j16j86Q6P80J256R74K35l48p84j391j855j387N7J442J786
52817H9304J094K7p94r89m60M31J087J273J195R41L84k55l87R6N54N24L93O51
52799I5069R91Q26L10J56N32Q17N37j1k83j90k7j3j57m11o02l24P03K103K997
52780A03023K946K509K473K733K486J550P54P55J108J062P34P61J135J279J116
$$ plain form
52901 87842 89159 89812 89723 89555 90199 91853 93890 95692 97242 98783 100385 102132 104364 107246 110322 112976
52885 112976 115195 117454 119902 122185 124100 125937 127911 129662 130655 130810 130380 129386 127637 125366 123385
52870 123385 122253 121517 120160 117773 114955 112538 110825 109716 109123 108806 108122 106538 104391 102624 101667
52855 101667 101020 100091 98974 98169 97846 97752 97654 97556 97572 97768 98063 98162 97747 96863 95949 95342 94859 94037 92685 91082
52835 91082 89737 88991 88755 88639 88453 88539 89319 90575 91549 91784 91436 90652 89261 87406 86019 86076 87518 89304
52817 89304 90398 90425 89631 88642 88182 88613 89700 90973 92168 93109 93493 93238 92851 92947 93501 94025 94418 95069
52799 95069 96060 96886 97196 97352 97884 98701 99238 99227 98944 98754 98727 98714 98557 98146 97544 97220 97923 100026 103023
52780 103023 105969 108478 110951 113684 116170 117720 118474 119229 120337 121399 122133 122894 124029 125308 126424
52765A26424J158J498J579J159P65P88Q60N17o4m96q50j387j951k197k178k210
52749A23415k301k109j506q66p59j431k526l249l047k203j531j475j755j960j997
52734I4700j911j638j243r16n84P2Q97J096K24j091j868j856j480j060o65m89
52718H2188o54p77l57M10P16J99o08j025r87q59q58r17q81o61k46K52O34P85O78
52699G7032K41o26j751k582k600j806p35M3L57L25mo60j364j462n81P16J290N55
52681F6388r09j961j945j139l16Rl0MJ51q9r65j827j689m90P32J034N39M2K4L80
52661E7943Q09J100J055N02n10j496j704p74O89J454R66j2l90j15K6k18k40L18
52643E9403R68J136Q72N05J72L7L73R98J262J027J028J708K288J734K57q59p74
$$ plain form
52765 126424 127582 129080 130659 131818 132583 133371 134231 134748 134684 134188 133338 131951 130000 127803 125625 123415
52749 123415 121114 119005 117499 116633 115874 114443 111917 108668 105621 103418 101887 100412 98657 96697 94700
52734 94700 92789 91151 89908 88992 88408 88480 89377 90473 90697 89606 87738 85882 84402 83342 82677 82188
52718 82188 81534 80757 80400 80810 81526 81725 81117 80092 79105 78246 77388 76471 75590 74929 74683 74935 75569 76354 77032
52699 77032 77273 76647 74896 72314 69714 67908 67173 67216 67573 67898 67894 67234 65870 64408 63827 64543 65833 66388
52681 66388 65479 63518 61573 60434 60118 60127 60097 60101 60252 60163 59198 57371 55682 55192 55924 56958 57497 57539 57563 57943
52661 57943 58752 59852 60907 61409 60899 59403 57699 56925 57614 59068 60034 60022 59632 59517 59543 59325 59085 59403
52643 59403 60371 61507 62379 62884 63056 63093 63466 64464 65726 66753 67781 69489 71777 73511 73768 72909 72135
52626G2135J86J163J598J530J493J971K675K703J766Q29R33J805K312J977J278
52611I6354P00K36j45l39n17r91j595j767j361q44n83n19n60p99j167j339j212
52594H3552j041j007r92q80p07m56j27rm57j226j572j090j67N56P12J88q59j803
52576G2615j885j055p5M04M74N28O45P53Q90R88P85L27J75O92J375J460R38M62
52558H0496L70L14n9n76q52q19o99o38o58p91j034j162p95J18J049J340R09L07
52540G6820Mo0j29j33J48N97Q72Q95Q76R06Q31O02L89K86J81k3l11o36q92q27
52520H0396l09K99M28N3k32M1O98J291J545J307M78o26j229q24J67Q22O95J54
52502H5154j87n4L68P11O95L40p8k82j61K24O85R30P57L56K56Q07J738K328K014
$$ plain form
52626 72135 72321 73484 75082 76612 78105 80076 82751 85454 87220 88049 88982 90787 93099 95076 96354
52611 96354 97054 97290 97145 96806 96289 95298 93703 91936 90575 89731 89148 88629 88069 87270 86103 84764 83552
52594 83552 82511 81504 80512 79632 78925 78469 78342 78333 77876 76650 75078 73988 73821 74377 75089 75277 74418 72615
52576 72615 70730 69675 69600 70004 70478 71006 71651 72404 73294 74282 75067 75394 75569 76261 77636 79096 80034 80496
52558 80496 80866 81180 81121 80545 79693 78874 78175 77537 76879 76088 75054 73892 73097 73215 74264 75604 76513 76820
52540 76820 76824 76764 76635 76502 76650 77247 78119 79014 79890 80796 81627 82229 82618 82904 83085 83062 82751 82115 81223 80396
52520 80396 80087 80386 80814 80867 80635 80676 81374 82665 84210 85517 85995 85369 84140 83316 83483 84305 85000 85154
52502 85154 84967 84913 85281 85992 86687 87027 86949 86667 86506 86730 87415 88345 89102 89458 89714 90521 92259 94587 96601
52483I6601R06k76p59m39N8Q5l14o28o06l86rO90J567K038J761J112O86O24O64
52464A03375O38N93N92O91R47J189J000K26o49r26m99J61O80J135J668K056J911
52447A14788J144J37n93p94o16l52j19J09K39M2n18j086j195p02J22Q00R80O93
52429A13079L30K20K25nm18n90m34m14q07j162r92n62m78o96o41k15M8m8J4N55
52409A07009R85N45n79j470j611j312j033q40o18m29m00n15p03r26j035p34N4
52392I6388Q91J221J010P62Q52J095J150J038J100J432J668J357M33o96j414j285
52376A07002l10R83J813J700Q79J21M3O02J203J299Q01N7m46l31M19J292J570
52359A18697J021J91k79m18o63j018j046o94m28l73mQ03J161L54q41j053k52K36
$$ plain form
52483 96601 97507 97231 96472 96033 96091 96176 95862 95234 94628 94242 94233 94923 96490 98528 100289 101401 102087 102711 103375
52464 103375 104013 104606 105198 105889 106836 108025 109025 109251 108602 107676 107177 107338 108018 109153 110821 112877 114788
52447 114788 115932 116069 115476 114682 114066 113714 113595 113704 113943 113985 113467 112381 111186 110484 110606 111406 112386 113079
52429 113079 113409 113629 113854 113849 113431 112841 112407 111993 111186 110024 109032 108470 107992 107296 106655 106440 106488 106440 106454 107009
52409 107009 107994 108539 107960 106490 104879 103567 102534 101694 101076 100647 100247 99732 99029 98103 97068 96334 96388
52392 96388 97279 98500 99510 100272 101124 102219 103369 104407 105507 106939 108607 109964 110397 109701 108287 107002
52376 107002 106692 107675 109488 111188 112067 112188 112231 112833 114036 115335 116136 116193 115747 115416 115835 117127 118697
52359 118697 119718 119909 119630 119212 118549 117531 116485 115791 115363 114990 114986 115789 116950 117304 116463 115410 115158 115394
52341A15394k05o12j01O76O11l5J3J109K192K275J544O94k7o04p19j15P00Q30
52323A23620J42n18l83L38Q58P89L95J13J55N69J261J925K151J819J181N60J27
52306A35102l7P4K31R9k79m00P3P87J174J209J354J776K137K142J910J603J066
52289A50021J88o12o71J30J083J371R14L41J57K02Q9q2J58Q85J562J742J588J424
52271A60490J161N56j82n44l58L1K75L69N00P80J114J198P71Rn40n94m75m30k9
52252A64102J117K374K525J341lk32P55K063K793K678K176K036K492K808K176
52237A91201R87N85J567L047L924M121M119L894L134K140J668J949K452K677K700
52222B30165K859L306L944M563M939M960M721M407M152M013L929L683L102K450
$$ plain form
52341 115394 115189 114577 114476 115152 115763 115728 115741 116850 119042 121317 122861 123555 123528 122924 122205 122090 122790 123620
52323 123620 123762 123244 122861 123199 124057 124846 125241 125354 125509 126078 127339 129264 131415 133234 134415 134975 135102
52306 135102 135065 135139 135370 135469 135190 134790 134863 135650 136824 138033 139387 141163 143300 145442 147352 148955 150021
52289 150021 150209 149597 148926 149056 150139 151510 152424 152765 152922 153124 153213 153131 153289 154174 155736 157478 159066 160490
52271 160490 161651 162207 162025 161481 161123 161154 161429 161798 162298 163078 164192 165390 166161 166170 165630 165036 164561 164131 164102
52252 164102 165219 167593 170118 171459 171456 171224 171979 174042 176835 179513 181689 183725 186217 189025 191201
52237 191201 192188 192773 194340 197387 201311 205432 209551 213445 216579 218719 220387 222336 224788 227465 230165
52222 230165 233024 236330 240274 244837 249776 254736 259457 263864 268016 272029 275958 279641 282743 285193
52208B85193K305K908L836M460M509M054L330K766K821L488M230M642M869N139
52194C38550N295N171N020N106N213N066M941N230N609N318M233L016K229J870
52180D01867J816K121K614K815K557K305K552L119L421L243K964L033L358L367
52166D41152K719J909J880K867L947M116L603L564M444N279M928L540K397K476
52152D88821L582M821N571N831N834N598N037M317L852L846M024M004L767L560
52138E52465L447L274L025K935L168L563L782L589K960K110J429J226J401J449
52124E89823R36Op01p40m29m95j084j494j152n09m12q49j093j059j530k708l498
52107E73012k975j810j327j683j965j746j480j415j259j092j542k637l380l039
$$ plain form
52208 285193 287498 290406 294242 298702 303211 307265 310595 313361 316182 319670 323900 328542 333411 338550
52194 338550 343845 349016 354036 359142 364355 369421 374362 379592 385201 390519 394752 397768 399997 401867
52180 401867 403683 405804 408418 411233 413790 416095 418647 421766 425187 428430 431394 434427 437785 441152
52166 441152 443871 445780 447660 450527 454474 458590 462193 465757 470201 475480 480408 483948 486345 488821
52152 488821 492403 497224 502795 508626 514460 520058 525095 529412 533264 537110 541134 545138 548905 552465
52138 552465 555912 559186 562211 565146 568314 571877 575659 579248 582208 584318 585747 586973 588374 589823
52124 589823 590759 590765 590064 589324 588895 588400 587316 585822 584670 584161 583749 582900 581807 580748 579218 576510 573012
52107 573012 570037 568227 566900 565217 563252 561506 560026 558611 557352 556260 554718 552081 548701 545662
52093E45662k196j928k457l186l611l596l062k070j141q64j165j442j427j525
52079E15992k087k783k984k562k013j762j717j693j912k646l466l455k435j422
52065D83055j434k256k905l019l019l101k919k442k250k628k983k623j706r38
52051D48832o72p42r11j065j118j072j089j215j199q62m37k69l04j46M32J260
52035D39423J992K339K219J865J654J747J936K027K126K448L044L894M968N946
52021D77628O204N513M565M353N018N777N967N773N748N985O114N925N686N789
52007E56045O221O526O306N624M893M431M278M320M405M333M003L594L430L515
51993F21924L554L420L346L395L194K487J664J290J243Q92P4o34p88p54j206k167
$$ plain form
52093 545662 543466 541538 539081 535895 532284 528688 525626 523556 522415 521551 520386 518944 517517 515992
52079 515992 513905 511122 508138 505576 503563 501801 500084 498391 496479 493833 490367 486912 484477 483055
52065 483055 481621 479365 476460 473441 470422 467321 464402 461960 459710 457082 454099 451476 449770 448832
52051 448832 448160 447418 446507 445442 444324 443252 442163 440948 439749 438887 438450 438181 437877 437731 438163 439423
52035 439423 441415 443754 445973 447838 449492 451239 453175 455202 457328 459776 462820 466714 471682 477628
52021 477628 483832 489345 493910 498263 503281 509058 515025 520798 526546 532531 538645 544570 550256 556045
52007 556045 562266 568792 575098 580722 585615 590046 594324 598644 603049 607382 611385 614979 618409 621924
51993 621924 625478 628898 632244 635639 638833 641320 642984 644274 645517 646409 646483 645849 645061 644307 643101 640934
51977F40934k983l156k882k649k639k698k768l011l494m006m337m532m646m471
51963E92662l796k879k266k188k382k585k718k655k182j440j023j291j879k145
51949E61233j880j297n96J02N66N75J49n25j325k056k342j992j406j275j908l010
51933E43013m112m893n278n422n616n912o054n992o243p291q774r776r863r405
51919D48382q862q405q279q910j0308j1691j2215j1864j1333j1160j1244j1130
51907C22981j0548r672q913q484q206p832p447p276p179o793o197n944o262o610
51893B15618o387n720n115m667m057l210k523k422k979l910m645m531l418j974
51879A60060j140j141j378j332j141j174j439j664j700j544j210q15o03o93q71
$$ plain form
51977 640934 637951 634795 631913 629264 626625 623927 621159 618148 614654 610648 606311 601779 597133 592662
51963 592662 588866 585987 583721 581533 579151 576566 573848 571193 569011 567571 566548 565257 563378 561233
51949 561233 559353 558056 557460 557562 558128 558703 558852 558327 557002 554946 552604 550612 549206 547931 546023 543013
51933 543013 538901 534008 528730 523308 517692 511780 505726 499734 493491 486200 477426 467650 457787 448382
51919 448382 439520 431115 422836 413926 403618 391927 379712 367848 356515 345355 334111 322981
51907 322981 312433 302761 293848 285364 277158 269326 261879 254603 247424 240631 234434 228490 222228 215618
51893 215618 209231 203511 198396 193729 189672 186462 183939 181517 178538 174628 169983 165452 162034 160060
51879 160060 158920 157779 156401 155069 153928 152754 151315 149651 147951 146407 145197 144382 143779 143086 142215
51864A42215q96p98p50p89r05j177j466j323n77R8j54j108j569r50q1m2p13j160
51846A27855j063r84j274j480j105l48K20M02M02M00L51J93j8q8K29R69J734J971
51828A28366J547Q35J84l73p76p38k50J25j03o59r09p21m42j81J90M29J7r65j633
51809A23943j349m85J89M36N16N77N99P03R90J200R70L99n6k52m54p42p32j87
51791A26265M92O70K31l52n79l52J16N73Q63R99J140J397J643J605J213P45M82
51774A37151L45M5l37l08L92J270J614J440J444J938K332K034J384J135J295J172
51758A54346O20L92J008J868K041J495J014J103J521J773J589R63K05m6O36J843
51742A72371K667K715K398K165K009J871K021K623L328L701L723L549L055K119
$$ plain form
51864 142215 141319 140521 139771 138982 138077 136900 135434 134111 133534 133632 133478 132370 130801 129851 129770 129728 129015 127855
51846 127855 126792 125808 124534 123054 121949 121601 121821 122223 122625 123025 123376 123569 123551 123463 123692 124661 126395 128366
51828 128366 129913 130748 130932 130559 129783 129045 128795 128920 128817 128158 127249 126528 126086 125905 126095 126524 126541 125576 123943
51809 123943 122594 122109 122298 122734 123250 123827 124426 125129 126119 127319 128289 128688 128632 128380 127926 127184 126452 126265
51791 126265 126757 127427 127658 127306 126727 126375 126491 127064 127927 128926 130066 131463 133106 134711 135924 136669 137151
51774 137151 137496 137541 137204 136896 137288 138558 140172 141612 143056 144994 147326 149360 150744 151879 153174 154346
51758 154346 154966 155358 156366 158234 160275 161770 162784 163887 165408 167181 168770 169733 169938 169892 170528 172371
51742 172371 175038 177753 180151 182316 184325 186196 188217 190840 194168 197869 201592 205141 208196 210315
51728B10315J062L97K53L74N32N52K15m82j121j409j675k289k793k406j312o63
51712A99550j050j831k145j941j524q69K4O43N69J78Q4J72j16p34j019p37m70
51695A88784p64j425j856j774j383j035q39n11K46J099J140M9j176j253k37O24
51679A79689N74M3m69j210k341l169l022k332j995j945j312M3J062R06J25j01
51663A64546N27J204J196O94M16O53J045J119Q16L42j46m67l05M18J134J103M08
51646A74703j39j53k16q18j411j196m21r2n66j238j635j989k494k790k517j891
51630A55137j303q34n69q54j737k553k566j848r87k58M34R63J012P52Q52J603
51614A47244K375K240R40r10k387k971k818k481k315k188j811j215p84q44j320
$$ plain form
51728 210315 211377 211774 212027 212401 212933 213485 213700 213218 212097 210688 209013 206724 203931 201525 200213 199550
51712 199550 198500 196669 194524 192583 191059 190190 190214 190857 191426 191604 191688 191860 191744 191010 189991 189254 188784
51695 188784 188020 186595 184739 182965 181582 180547 179708 179197 179443 180542 181682 181731 180555 179302 179065 179689
51679 179689 180263 180306 179837 178627 176286 173117 170095 167763 165768 163823 162511 162554 163616 164522 164647 164546
51663 164546 165073 166277 167473 168167 168583 169236 170281 171400 172216 172558 172412 171945 171640 172058 173192 174295 174703
51646 174703 174564 174411 174195 173377 171966 170770 170349 170257 169691 168453 166818 164829 162335 159545 157028 155137
51630 155137 153834 153000 152431 151577 149840 147287 144721 142873 141886 141628 142062 143025 144037 144789 145641 147244
51614 147244 149619 151859 152799 151889 149502 146531 143713 141232 138917 136729 134918 133703 132919 132075 130755
51599A30755j768j707j096m66l06l14K80J415J911R72n15r50J1J261J802J615
51583A32900J034K30m63n36M6O94R85R49N12n01j544j539l83O03M58q7J62J108
51565A34628J827K137K502K786K394J551J186J501J675J241P22O51Q59J090J500
51550A58250K120K589K744K891L077K813J929J012N05O0o31j026n69K19L25k72
51534A76036o07j54N51Q32P42P29R31J118J140J100J155J260J144O13j36o25o45
51517A85184n08o12r25j094r89q68j007j346j576j496j264j218j378j290n70M69
51501A69512J024O15n53j925k896k894j790l17M32K52J1L53Q73R27O60N86O32
51484A65502L94L4J02N76Q29N80K93M56R70J408J501J329J231J566K245K633K278
$$ plain form
51599 130755 128987 127280 126184 125718 125412 125098 125378 126793 128704 129676 129161 128211 128222 129483 131285 132900
51583 132900 133934 134164 133701 133165 133211 133905 134890 135839 136351 135850 134306 132767 132384 132987 133445 133358 133520 134628
51565 134628 136455 138592 141094 143880 146274 147825 149011 150512 152187 153428 154150 154801 155660 156750 158250
51550 158250 160370 162959 165703 168594 171671 174484 176413 177425 177930 177990 177359 176333 175764 175983 176308 176036
51534 176036 175429 175275 175826 176658 177400 178129 179060 180178 181318 182418 183573 184833 185977 186590 186454 185829 185184
51517 185184 184676 184064 183139 182045 181056 180188 179181 177835 176259 174763 173499 172281 170903 169613 169043 169512
51501 169512 170536 171151 170598 168673 165777 162883 161093 160776 161208 161460 161471 161824 162697 163624 164284 164870 165502
51484 165502 165896 165930 166032 166608 167437 168017 168310 168766 169736 171144 172645 173974 175205 176771 179016 181649 183927
51467A83927J593J341J602J801J648J463J494J567J580J674J725J232J40q05r41
51452B01041m87l6L16P72J104Q35Q8m25l23M4L06O55J392K276K809K932L000L055
51434B19354K671J671O15J70K50K10j69m82n02o37j241j935k103j788j620j919
51418B12545k405k781l080l286l111k468j833j723j969j931j409r52j053j430
51404A83114j436r77n78n08m20n3K33P4k20k24k83r84j914j991j183p72j502k449
51386A67927k466j850j649k002k229k136k123k253k204k072k204k358j956j143
51372A39282o45n32k36K28J71l80m76R1J48j089k621k954k051j060o90p96j081
51355A25309j300j067k21P47J253J369J396J156M31k90l66l8j07o48r92q47o07
$$ plain form
51467 183927 185520 186861 188463 190264 191912 193375 194869 196436 198016 199690 201415 202647 202787 201982 201041
51452 201041 200554 200518 200834 201606 202710 203545 203633 203208 202885 202929 203235 203890 205282 207558 210367 213299 216299 219354
51434 219354 222025 223696 224311 224481 224731 224941 224772 224290 223788 223151 221910 219975 217872 216084 214464 212545
51418 212545 210140 207359 204279 200993 197882 195414 193581 191858 189889 187958 186549 185597 184544 183114
51404 183114 181678 180701 180123 179615 179195 179142 179375 179449 179229 179005 178722 177738 175824 173833 172650 171878 170376 167927
51386 167927 165461 163611 161962 159960 157731 155595 153472 151219 149015 146943 144739 142381 140425 139282
51372 139282 138637 138105 137869 138097 138268 137888 137412 137503 137651 136562 133941 130987 128936 127876 127186 126390 125309
51355 125309 124009 122942 122721 123468 124721 126090 127486 128642 129073 128783 128417 128379 128272 127624 126632 125785 125178
51338A25178m84k01L10P14Q91J012Q89O2j176j770j223k76K83O08J060J216N17
51321A27610n82j011n31M4M9l01m30j53L07O30O11L74L80R35J671J892J416O29
51303A33540j93j168k217k808k564j810j206j079j378j928k430k520k144j706
51289A08389j517j359r73o17o20p35m70rj8o09j218j560j877k144j877j146q37
51272I0803j307j577p29N64R26K63k41K5M38M06K62M62P75P76M99K22nj68j13
51253I2281J18J58j27l73l07j70k00j14M30J209J688J627J083J11j065j870j831
51236I2648j155m57o0J19J96J83P9j59o25j138j230p32j45K6p9p8j19n70j182
51217H5522j244o16M0K02P7P5K15L12L49L51J90j65m53m61l48m06n59m00K44R66
$$ plain form
51338 125178 124694 124493 124803 125517 126408 127420 128309 128371 127195 125425 124202 123926 124209 124817 125877 127093 127610
51321 127610 127028 126017 125486 125530 125579 125278 124848 124695 125002 125632 126243 126617 126997 127932 129603 131495 132911 133540
51303 133540 133347 132179 129962 127154 124590 122780 121574 120495 119117 117189 114759 112239 110095 108389
51289 108389 106872 105513 104540 103923 103303 102568 102098 102089 102071 101462 100244 98684 96807 94663 92786 91640 90803
51272 90803 89496 87919 87190 87754 88680 88943 88702 88727 89165 89571 89833 90295 91070 91846 92345 92567 92562 92394 92281
51253 92281 92399 92557 92430 92057 91750 91580 91380 91266 91696 92905 94593 96220 97303 97414 96349 94479 92648
51236 92648 91493 91036 90976 91095 91291 91474 91553 91394 90769 89631 88401 87669 87524 87550 87471 87393 87274 86704 85522
51217 85522 84278 83662 83702 83904 83981 84056 84271 84583 84932 85283 85473 85308 84855 84394 84046 83640 83081 82681 82925 83891
51197H3891J110M85l81p89o25l61l19k81J6L30K24k77p57r41q35m42K36R00J140
51178H2324R19N66K75k6l09k99J50Q42J460J721J415O46P1L59J302J957J806J321
51160I6500J070Q14M6r33j211n17L22L44m33j140j052k62N93J030J013P43M12
51143I7339K05K90N87O66J97n60r75p89l47n1J41N19J121J653J810J541J035N47
51125A04929K23L1q2o3J28L60M59M49M30L13o3n64q21o89l89j71j20l59j007j798
51105A01196k139j789j180q23o87n00l38m71p89q13l21L93Q77Q52K65o60j362
51088I1711j287m65M46Q90R53J066J297J232O26j21l36J16N85M15j91l33M65J577
51070I8646J899J043l11j186j214p29j90K48O44R95J223J315J293J058N39L5Q0
$$ plain form
51197 83891 85001 85486 85105 84316 83691 83330 83011 82730 82746 83076 83300 83023 82266 81325 80490 80048 80284 81184 82324
51178 82324 83243 83809 84084 84058 83749 83450 83600 84442 85902 87623 89038 89684 89755 90114 91416 93373 95179 96500
51160 96500 97570 98384 98430 97497 96286 95769 96091 96435 96002 94862 93810 93548 94141 95171 96184 96927 97339
51143 97339 97544 97834 98421 99087 99284 98724 97749 96960 96613 96562 96703 97222 98343 99996 101806 103347 104382 104929
51125 104929 105152 105183 105101 105038 105166 105526 105985 106434 106864 107177 107114 106550 105729 105040 104651 104480 104360 104001 102994 101196
51105 101196 99057 97268 96088 95265 94578 94078 93740 93269 92480 91667 91346 91739 92616 93468 93733 93073 91711
51088 91711 90424 89959 90405 91295 92248 93314 94611 95843 96469 96348 96012 96128 96713 97128 96937 96604 97069 98646
51070 98646 100545 101588 101277 100091 98877 98148 97958 98206 98850 99845 101068 102383 103676 104734 105273 105308 105388
51053A05388O75R77K15j109j555m75J120J733J094K36L8L08M01K53L49Q98J386
51036A11932J179L42l71l70J29M45K37k27n32n35k85J06M07L45l0k74j07J86J57
51017A12734j49l12k36k85o27r33r15q22r53r56k35R56J512R41K40O33J777K100
50999A14470R42n52j071q07p17q60n04L87Q54L47n65j119j169q04N7J121J550
50982A11560J011L31M63J166J451R70K50j88k22J80R18J514J565J333J283J166
50966A24751M49n48q34j68O49J048J311J603J483R00O72J185J545R17j1pQ54J455
50948A37254J429J375J446J061K41m7O25J413J561J549K111K878K993K525K300
50933A60714K534K647K427K422K951L468L363K859K671L053L598L869L864L887
$$ plain form
51053 105388 106063 107040 107255 106146 104591 104116 105236 106969 108063 108299 108337 108645 109046 109299 109648 110546 111932
51036 111932 113111 113453 113082 112712 112841 113286 113523 113296 112764 112229 111944 112050 112457 112802 112772 112498 112391 112577 112734
51017 112734 112585 112273 112037 111752 111125 110192 109277 108455 107502 106546 106311 107267 108779 109720 109960 110593 112370 114470
50999 114470 115412 114860 113789 112982 112265 111405 110901 111288 112142 112489 111924 110805 109636 108832 108889 110010 111560
50982 111560 112571 112902 113365 114531 115982 116952 117202 117014 116792 116972 117890 119404 120969 122302 123585 124751
50966 124751 125200 124652 123818 123650 124299 125347 126658 128261 129744 130644 131316 132501 134046 134963 134952 134945 135799 137254
50948 137254 138683 140058 141504 142565 142806 142759 143384 144797 146358 147907 150018 152896 155889 158414 160714
50933 160714 163248 165895 168322 170744 173695 177163 180526 183385 186056 189109 192707 196576 200440 204327
50919B04327M148M576M942N134N295N645O197O813P407P981Q494Q892R319R988
50905B99158J0834J1512J1885J2254J2929J3779J4493J5074J5763J6492J6851
50894D51024J6667J6327J6219J6137J5600J4677J4005J3954J4041J3576J2488
50883F14715J1265J0223R326Q613Q282Q230Q064P761P856Q558R178Q895P784O498
50869G35248N170L325Q00j981m663p295r811j1924j3719j5713j7903j9400j9589
50856F22545j9184j9425k0504k1479k1553k0763j9446j7780j5996j4486j3385
50845D18544j2378j1192r938q826p870p036o416n956n312m263l090k289j959j721
50831C30298j265p33n30q11j223j167m24N15R01O25M18R98K192L103L167K687
$$ plain form
50919 204327 208475 213051 217993 223127 228422 234067 240264 247077 254484 262465 270959 279851 289170 299158
50905 299158 309992 321504 333389 345643 358572 372351 386844 401918 417681 434173 451024
50894 451024 467691 484018 500237 516374 531974 546651 560656 574610 588651 602227 614715
50883 614715 625980 636203 645529 654142 662424 670654 678718 686479 694335 702893 712071 720966 728750 735248
50869 735248 740418 743743 744543 742562 737899 730604 720793 708869 695150 679437 661534 642134 622545
50856 622545 603361 583936 563432 541953 520400 499637 480191 462411 446415 431929 418544
50845 418544 406166 394974 385036 376210 368340 361304 354888 348932 343620 339357 336267 333978 332019 330298
50831 330298 329033 328300 327770 326959 325736 324569 324145 324660 325561 326186 326604 327602 329794 332897 336064 338751
50815C38751K359K488K880L316L759M189M501M704N043N678O357O659O530O432
50801D03646O840P794Q955R986J0807J1580J2532J3668J4722J5463J6035J6816
50789E48844J8046J9801K2196K5184K8171L0342L1661L2994L4942L6934L8030
50778H67145L8221L8343L8828L9237L8976L7840L5807L2874K9485K6593K4829
50767A248178K3811K2652K1053J9598J8967J9208J9860K0692K1949K3753K5446
50756A485167K5967K4980K3192K1313J9020J5412J0260M344j401o651j1587j6502
50744A593514k1604k6773l1441l4884l6849l7613l7510l6678l5233l3299l0799
50733A230831k7593k3870k0077j6404j2666q749m783p91L397P744J1894J5554
$$ plain form
50815 338751 341110 343598 346478 349794 353553 357742 362243 366947 371990 377668 384025 390684 397214 403646
50801 403646 410486 418280 427235 437221 448028 459608 472140 485808 500530 515993 532028 548844
50789 548844 566890 586691 608887 634071 662242 692584 724245 757239 792181 829115 867145
50778 867145 905366 943709 982537 1021774 1060750 1098590 1134397 1167271 1196756 1223349 1248178
50767 1248178 1271989 1294641 1315694 1335292 1354259 1373467 1393327 1414019 1435968 1459721 1485167
50756 1485167 1511134 1536114 1559306 1580619 1599639 1615051 1625311 1629655 1628254 1621603 1610016 1593514
50744 1593514 1571910 1545137 1513696 1478812 1441963 1404350 1366840 1330162 1294929 1261630 1230831
50733 1230831 1203238 1179368 1159291 1142887 1130221 1121472 1116689 1115898 1119295 1127039 1138933 1154487
50721A154487J8648K1068K2750K3984K4978K5051K3072J9075J4677J1317Q691
50710A367798N608J791k051n467q643j1655j4334j6937k0092k3876k7619l0812
50698A213711l3504l5595l6547l6280l5630l5286l4727l2966l0114k7258k4837
50687H50967k2073j8444j4914j2821j1906j0350p003k762O68K810M549O643Q992
50674G74356J1328J3751J6242J8374J9910K1320K3163K5295K7097K8193K8577
50663A007606K8321K7579K6690K5811K4604K2766K0634J8774J7160J5299J3039
50652A248283J0676Q395O273M809M586N252N674N556O085Q287J1440J3899J5133
50639A354348J5920J6744J7033J6262J4808J3128J0834P388L404K47j630l188
$$ plain form
50721 1154487 1173135 1194203 1216953 1240937 1265915 1290966 1314038 1333113 1347790 1359107 1367798
50710 1367798 1373406 1375197 1373146 1367679 1359036 1347381 1333047 1316110 1296018 1272142 1244523 1213711
50698 1213711 1180207 1144612 1108065 1071785 1036155 1000869 966142 933176 903062 875804 850967
50687 850967 828894 810450 795536 782715 770809 760459 753456 750694 751362 754172 758721 765364 774356
50674 774356 785684 799435 815677 834051 853961 875281 898444 923739 950836 979029 1007606
50663 1007606 1035927 1063506 1090196 1116007 1140611 1163377 1184011 1202785 1219945 1235244 1248283
50652 1248283 1258959 1267354 1273627 1278436 1283022 1288274 1293948 1299504 1305589 1313876 1325316 1339215 1354348
50639 1354348 1370268 1387012 1404045 1420307 1435115 1448243 1459077 1466465 1469869 1470116 1468486 1465298
50627A465298n340p631q870q662p686o556n047k598P68M315P187R047J0339J2060
50613A456624J5080J9400K4174K8604L2760L7453M3323N0134N6928O2748O7224
50602A894452P0512P2711P3447P2136O8669O3694N8162N2708M7431M2081L6476
50591B552479L0811K5492K0556J5405R456K928l415r183j4516j9282k2783k4592
$$ plain form
50627 1465298 1459958 1452327 1443457 1434795 1427109 1420553 1415506 1412908 1413676 1417991 1425178 1434225 1444564 1456624
50613 1456624 1471704 1491104 1515278 1543882 1576642 1614095 1657418 1707552 1764480 1827228 1894452
50602 1894452 1964964 2037675 2111122 2183258 2251927 2315621 2373783 2426491 2473922 2516003 2552479
50591 2552479 2583290 2608782 2629338 2644743 2654199 2657127 2653712 2644529 2630013 2610731 2587948 2563356
$$ [...]
##END NTUPLES=NMR SPECTRUM
##END=
