
##TITLE=UV1162_TOLI01-ROVE100E_6307216_0OQk8GED2b
##JCAMPDX= 6.0         $$ Bruker NMR JCAMP-DX V2.0
##DATA TYPE= NMR SPECTRUM
##DATA CLASS= NTUPLES
##ORIGIN= BRUKER
##OWNER= Administrator
$$ 1.72 TOPSPIN		Version 2.1
$$ 2012-06-06 22:50:26.406 -0500  Administrator@TOPSPIN
$$ Compression mode = diff/dup
##.OBSERVE FREQUENCY= 400.13188235
##.OBSERVE NUCLEUS= ^1H
##.ACQUISITION MODE= SIMULTANEOUS (DQD)
##.ACQUISITION SCHEME= undefined
##.AVERAGES= 64
##.DIGITISER RES= 22
##SPECTROMETER/DATA SYSTEM= spect
##.PULSE SEQUENCE= noesygpps1d.comp
##.SOLVENT NAME= COFFEE_meoh
##.SHIFT REFERENCE= INTERNAL, COFFEE_meoh, 1, 14.98061
##AUDIT TRAIL= $$ (NUMBER, WHEN, WHO, WHERE, PROCESS, VERSION, WHAT)
$$ ##TITLE= Audit trail, TOPSPIN		Version 2.1
$$ ##JCAMPDX= 5.01
$$ ##ORIGIN= Bruker BioSpin GmbH
$$ ##OWNER= Administrator
$$ $$ C:\Bruker\TOPSPIN/data/COFFEE/nmr/UV1162_TOLI01-ROVE100E_6307216_0OQk8GED2b/12/pdata/1/auditp.txt
$$ ##AUDIT TRAIL=  $$ (NUMBER, WHEN, WHO, WHERE, PROCESS, VERSION, WHAT)
(   1,<2012-06-06 22:50:20.953 -0500>,<Administrator>,<TOPSPIN>,<go>,<TOPSPIN 2.1>,
      <created by zg
	started at 2012-06-06 22:38:50.796 -0500,
	POWCHK enabled, PULCHK disabled,
       configuration hash MD5:
       D5 CA 7A 23 FE 6B EE E2 50 67 74 61 24 F7 5E 3B
       data hash MD5: 64K
       77 0A EF 11 E4 23 02 21 CE F0 85 4D 2C 7D A8 12>)
(   2,<2012-06-06 22:50:23.984 -0500>,<Administrator>,<TOPSPIN>,<proc1d>,<TOPSPIN 2.1>,
      <Start of raw data processing
       efp LB = 0.3 FT_mod = 6 PKNL = 1 PHC0 = 0 PHC1 = 0 SI = 128K 
       data hash MD5: 128K
       EB 8C F6 2B F4 A0 73 16 0E 9A 88 64 CF 5E B5 17>)
(   3,<2012-06-06 22:50:25.250 -0500>,<Administrator>,<TOPSPIN>,<proc1d>,<TOPSPIN 2.1>,
      <pk PHC0 = 30.98145 PHC1 = 0 
       data hash MD5: 128K
       1C 6A F6 3B B7 78 D1 04 3E 63 63 C7 56 05 BA 87>)
(   4,<2012-06-06 22:50:26.046 -0500>,<Administrator>,<TOPSPIN>,<proc1d>,<TOPSPIN 2.1>,
      <abs ABSG = 1 
       data hash MD5: 128K
       E2 B7 CF 39 DE 70 96 AA 46 75 D4 7D A6 33 68 1A>)
(   5,<2012-06-06 22:50:26.125 -0500>,<Administrator>,<TOPSPIN>,<proc1d>,<TOPSPIN 2.1>,
      <abs ABSG = 2 
       data hash MD5: 128K
       CD 7B AA 7B 65 09 D1 C7 6F 21 4A 45 EE 2A 97 FC>)
(   6,<2012-06-06 22:50:26.171 -0500>,<Administrator>,<TOPSPIN>,<proc1d>,<TOPSPIN 2.1>,
      <abs ABSG = 3 
       data hash MD5: 128K
       99 B0 A0 87 49 B8 C7 EF 69 AD 36 B5 01 54 AE DF>)
(   7,<2012-06-06 22:50:26.250 -0500>,<Administrator>,<TOPSPIN>,<proc1d>,<TOPSPIN 2.1>,
      <abs ABSG = 4 
       data hash MD5: 128K
       EE 5E E7 68 4A FA 75 72 18 76 FD 4D BA E4 02 56>)
(   8,<2012-06-06 22:50:26.312 -0500>,<Administrator>,<TOPSPIN>,<proc1d>,<TOPSPIN 2.1>,
      <abs ABSG = 5 
       data hash MD5: 128K
       8E 72 7A A3 B0 12 41 5B 12 27 A1 81 D5 EF 6A 72>)
$$ ##END=
$$ 
$$ $$ hash MD5
$$ $$ E0 E4 F6 C3 21 49 62 98 B8 C6 43 A0 65 95 7B BE
##$RELAX= 
##$RELAX= 
##$RELAX= 
##$RELAX= 
##$RELAX= 
##$RELAX= 
##$RELAX= 
##$RELAX= 
$$ [...]
150 150 150 150 150 150 150 150
##$TP07= 0
##$TPNAME0= <>
##$TPNAME1= <>
##$TPNAME2= <>
##$TPNAME3= <>
##$TPNAME4= <>
##$TPNAME5= <>
##$TPNAME6= <>
##$TPNAME7= <>
##$TPOAL= (0..7)
0.5 0.5 0.5 0.5 0.5 0.5 0.5 0.5
##$TPOFFS= (0..7)
0 0 0 0 0 0 0 0
##$TUNHIN= 0
##$TUNHOUT= 0
##$TUNXOUT= 0
##$USERA1= <user>
##$USERA2= <user>
##$USERA3= <user>
##$USERA4= <user>
##$USERA5= <user>
##$V9= 5
##$VALIST= <valist>
##$VCLIST= <CCCCCCCCCCCCCCC>
##$VD= 0
##$VDLIST= <DDDDDDDDDDDDDDD>
##$VPLIST= <PPPPPPPPPPPPPPP>
##$VTLIST= <TTTTTTTTTTTTTTT>
##$WBST= 2048
##$WBSW= 25
##$XGAIN= (0..3)
0 0 0 0
##$XL= 0
##$YL= 0
##$YMAX_a= 10476622
##$YMIN_a= -7045878
##$ZGOPTNS= <>
##$ZL1= 120
##$ZL2= 120
##$ZL3= 120
##$ZL4= 120
##$ABSF1= 14.98061
##$ABSF2= -5.57192
##$ABSG= 5
##$ABSL= 3
##$ALPHA= 0
##$AQORDER= 0
##$ASSFAC= 0
##$ASSFACI= 0
##$ASSFACX= 0
##$ASSWID= 0
##$AUNMP= <proc_prof1d_extract.lims>
##$AXLEFT= 0
##$AXNAME= <>
##$AXNUC= <1H>
##$AXRIGHT= 0
##$AXTYPE= 0
##$AXUNIT= <>
##$AZFE= 0.1
##$AZFW= 0.1
##$BCFW= 0
##$BC_mod= 0
##$BYTORDP= 0
##$COROFFS= 0
##$CY= 15
##$DATMOD= 1
##$DC= 0
##$DFILT= <>
##$DTYPP= 0
##$F1P= 0
##$F2P= 0
##$FCOR= 0.5
##$FTSIZE= 131072
##$FT_mod= 6
##$GAMMA= 0
##$GB= 0
##$INTBC= 1
##$INTSCL= 1
##$ISEN= 128
##$LB= 0.3
##$LEV0= 0
##$LPBIN= 0
##$MAXI= 10000
##$MC2= 0
##$MEAN= 0
##$ME_mod= 0
##$MI= 0
##$NCOEF= 0
##$NC_proc= -2
##$NLEV= 6
##$NOISF1= 0
##$NOISF2= 0
##$NSP= 0
##$NTH_PI= 0
##$NZP= 0
##$OFFSET= 14.98061
##$PC= 1
##$PHC0= 30.98145
##$PHC1= 0
##$PH_mod= 1
##$PKNL= yes
##$PPARMOD= 0
##$PPDIAG= 0
##$PPIPTYP= 0
##$PPMPNUM= 2147483647
##$PPRESOL= 1
##$PSCAL= 4
##$PSIGN= 0
##$PYNMP= <proc.py>
##$REVERSE= no
##$SF= 400.13
##$SI= 131072
##$SIGF1= 0
##$SIGF2= 0
##$SINO= 400
##$SIOLD= 131072
##$SPECTYP= <>
##$SREGLST= <1H.CDCl3>
##$SSB= 0
##$STSI= 131072
##$STSR= 0
##$SW_p= 8223.68421052632
##$SYMM= 0
##$S_DEV= 0
##$TDeff= 65536
##$TDoff= 0
##$TI= <>
##$TILT= no
##$TM1= 0
##$TM2= 0
##$TOPLEV= 0
##$USERP1= <user>
##$USERP2= <user>
##$USERP3= <user>
##$USERP4= <user>
##$USERP5= <user>
##$WDW= 1
##$XDIM= 131072
##$YMAX_p= 233484525
##$YMIN_p= -343036551
##$CURPLOT= <Network HP LaserJet P1505>
##$CURPRIN= <$Network HP LaserJet P1505>
##$DFORMAT= <normdp>
##$LAYOUT= <+/1D_H.xwp>
##$LFORMAT= <normlp>
##$PFORMAT= <normpl>
##$SURQMSG= 1
$$ End of Bruker specific parameters
$$ ---------------------------------
##NTUPLES= NMR SPECTRUM
##VAR_NAME=  FREQUENCY,     SPECTRUM/REAL,   SPECTRUM/IMAG
##SYMBOL=    X,             R,               I
##VAR_TYPE=  INDEPENDENT,   DEPENDENT,       DEPENDENT
##VAR_FORM=  AFFN,          ASDF,            ASDF
##VAR_DIM=   131072,        131072,          131072
##UNITS=     HZ,            ARBITRARY UNITS, ARBITRARY UNITS
##FACTOR=    0.0627417313425165, 1,          1
##FIRST=     8223.62146879498, -838,         -36519
##LAST=      0,             689,             -36311
##MIN=       0,             -343036551,      0
##MAX=       8223.62146879498, 233484525,    0
$$ Real data points
##PAGE= N=1
##DATA TABLE= (X++(R..R)), XYDATA
$$ [...]
62153A854907J5118J5676J6647J7569J8176J9090K0843K2809K3909K4096K4334
62142B073174K5233K6458K7559K8686L0140L1718L3016L4109L5362L6651L7327
62131B419433L7196L7012L7647L9011M0274M0945M1212M1285M0939L9918L8331
62120B853203L6405L4212L1836K9495K7369K5544K4230K3762K4200K5247K6589
62109C162092K8037K9320L0233L1088L2426L4065L5009L4558L2930L0456K6855
62098C507069K1892J6250J1003O473K128k522p424j2132j6121j9125k1464k3792
62086C462235k6240k8200k9171k9307k8822k7572k5735k4204k3488k2856k1460
62075C175180j9800j9019j9007j8520j7103j5716j5145j4891j4122j2962j2157
$$ y = [1854907, 1870025, 1885701, 1902348, 1919917, 1938093, 1957183, 1978026, 2000835, 2024744, 2048840, 2073174, 2098407, 2124865, 2152424, 2181110, 2211250, 2242968, 2275984, 2310093, 2345455, 2382106, 2419433, 2456629, 2493641, 2531288, 2570299, 2610573, 2651518, 2692730, 2734015, 2774954, 2814872, 2853203, 2889608, 2923820, 2955656, 2985151, 3012520, 3038064, 3062294, 3086056, 3110256, 3135503, 3162092, 3190129, 3219449, 3249682, 3280770, 3313196, 3347261, 3382270, 3416828, 3449758, 3480214, 3507069, 3528961, 3545211, 3556214, 3562687, 3564815, 3562293, 3554869, 3542737, 3526616, 3507491, 3486027, 3462235, 3435995, 3407795, 3378624, 3349317, 3320495, 3292923, 3267188, 3242984, 3219496, 3196640, 3175180, 3155380, 3136361, 3117354, 3098834, 3081731, 3066015, 3050870, 3035979, 3021857, 3008895, 2996738]
62064B996738j1931j1779j1198j0222r304q888r062r544j0090j0725j1437j1841
62052B870717j1598j1096j1212j2299j3769j4832j5330j5635j5987j6151j5809
62041B716999j5135j4779j5173j5951j6379j6210j5760j5240j4577j3932j3642
62030B550221j3457j2594j0954r489q839q352p182n629m502l714k549r66M30J491
62016B463915K628L854M683N015N266N568N614N364N174N101M807M271L966M097
62002B529323M264L872K359r04o249j3058k0048k6260l1329l4972l7090l8352
61990B331556l9921m2407m5679m9605n4139n8570o1612o2639o2170o0853n8716
61979A735245n5723n2335m9049m5882m2677l9460l6215l2837k9617k7237k5856
$$ y = [2996738, 2984807, 2973028, 2961830, 2951608, 2942304, 2933416, 2924354, 2914810, 2904720, 2893995, 2882558, 2870717, 2859119, 2848023, 2836811, 2824512, 2810743, 2795911, 2780581, 2764946, 2748959, 2732808, 2716999, 2701864, 2687085, 2671912, 2655961, 2639582, 2623372, 2607612, 2592372, 2577795, 2563863, 2550221, 2536764, 2524170, 2513216, 2503727, 2494888, 2486536, 2479354, 2473725, 2469223, 2465509, 2462960, 2461994, 2462424, 2463915, 2466543, 2470397, 2475080, 2480095, 2485361, 2490929, 2496543, 2501907, 2507081, 2512182, 2516989, 2521260, 2525226, 2529323, 2533587, 2537459, 2539818, 2538914, 2532665, 2519607, 2499559, 2473299, 2441970, 2406998, 2369908, 2331556, 2291635, 2249228, 2203549, 2153944, 2099805, 2041235, 1979623, 1916984, 1854814, 1793961, 1735245, 1679522, 1627187, 1578138, 1532256, 1489579, 1450119, 1413904, 1381067, 1351450, 1324213, 1298357]
61968A298357k4716k3109k1351k0322k0327k0806k1008k0610j9832j9173j8887
61957A068216j8654j7900j6514j4926j3485j2122j0698r309q011o554m634k300
61945I33109L8J940L315M511N847O974P036N686L515J157j495m643p719j0040
61931I49231j1942j4312j7152j9510k0782k1228k1237k0934k0533k0176j9425
61920G42000j7811j5853j4524j3651j2082r645p650o932o591n468l844k748k297
61907F22904j732o75N27J485K144K644L187L964M960O061P415R200J1039J2299
61893F85422J3105J4294J6170J8088J9667K1467K3894K6385K8335L0200L2731
61882I29758L5695L8110L9500M0178M0554M0801M0983M1026M0728M0116L9473
$$ y = [1298357, 1273641, 1250532, 1229181, 1208859, 1188532, 1167726, 1146718, 1126108, 1106276, 1087103, 1068216, 1049562, 1031662, 1015148, 1000222, 986737, 974615, 963917, 954608, 946597, 940043, 935409, 933109, 933147, 935087, 938402, 942913, 948760, 955734, 962770, 968456, 971971, 973128, 971633, 966990, 959271, 949231, 937289, 922977, 905825, 886315, 865533, 844305, 823068, 802134, 781601, 761425, 742000, 724189, 708336, 693812, 680161, 668079, 658434, 650784, 643852, 637261, 631793, 627949, 625201, 622904, 621172, 620497, 621024, 622509, 624653, 627297, 630484, 634448, 639408, 645469, 652884, 662084, 673123, 685422, 698527, 712821, 728991, 747079, 766746, 788213, 812107, 838492, 866827, 897027, 929758, 965453, 1003563, 1043063, 1083241, 1123795, 1164596, 1205579, 1246605, 1287333, 1327449, 1366922]
61871A366922L8771L7508L5461L3035L0479K7438K3864K0766J9274J9336K0067
61860A672921K1039K2571K5029K8531L3149L8801M5096N1722N8795O6337P3792
61849B137783Q0606Q7007R3570J00182J06056J10795J14967J19591J25243J31547
61839C207347J37280J41132J42425J40842J35389J24241J05918Q0282M8398J2169
61829D275423k5636o1872r4241j21671j43357j58499j67458j72037j73614j71805
61819B985233j65973j57194j47426j37433j26885j16112j06129r7022q7857p8319
61809A764883o9216o1022n3217m5406l8028l1385k4969j8357j2007o476j453L813
61797A407160R545J5413K1084K6332L0872L4533L7452L9782M1361M1818M0925
$$ y = [1366922, 1405693, 1443201, 1478662, 1511697, 1542176, 1569614, 1593478, 1614244, 1633518, 1652854, 1672921, 1693960, 1716531, 1741560, 1770091, 1803240, 1842041, 1887137, 1938859, 1997654, 2063991, 2137783, 2218389, 2305396, 2398966, 2499148, 2605204, 2715999, 2830966, 2950557, 3075800, 3207347, 3344627, 3485759, 3628184, 3769026, 3904415, 4028656, 4134574, 4214856, 4263254, 4275423, 4249787, 4187915, 4093674, 3972003, 3828646, 3670147, 3502689, 3330652, 3157038, 2985233, 2819260, 2662066, 2514640, 2377207, 2250322, 2134210, 2028081, 1931059, 1843202, 1764883, 1695667, 1634645, 1581428, 1536022, 1497994, 1466609, 1441640, 1423283, 1411276, 1404800, 1403347, 1407160, 1416705, 1432118, 1453202, 1479534, 1510406, 1544939, 1582391, 1622173, 1663534, 1705352, 1746277]
61786A746277L8745L5596L1814K7346K1664J4515O797J10m659p903j0306j1769
61774A888227j1708j0057p501m745j930J091M089O268O854N756L452K57l913r043
61760A867097j4695k0434k6110l1438l5736l8622m0522m1912m2367m1101l8260
61749A495900l4886l1678k8481k5081k1648j8248j4616j0757p123l770N9M953
61737A304624J0277J4734J7841K0373K3390K7195L1382L5473L9390M3397M7884
61726A615960N3128N9112O5459P1804P8414Q6211R5889J07064J18693J30410J42962
61715B625106J57216J73188J90262K07904K25797K43570K60706K76370K88904
61706D649023K95875K94946K84492K63087K29147J81978J23131N6357j3542q1523
$$ y = [1746277, 1785022, 1820618, 1852432, 1879778, 1901442, 1915957, 1922754, 1922864, 1918205, 1910302, 1899996, 1888227, 1876519, 1866462, 1858961, 1854216, 1852286, 1853377, 1857466, 1863734, 1870588, 1876344, 1879796, 1880053, 1876140, 1867097, 1852402, 1831968, 1805858, 1774420, 1738684, 1700062, 1659540, 1617628, 1575261, 1534160, 1495900, 1461014, 1429336, 1400855, 1375774, 1354126, 1335878, 1321262, 1310505, 1303382, 1299612, 1299671, 1304624, 1314901, 1329635, 1347476, 1367849, 1391239, 1418434, 1449816, 1485289, 1524679, 1568076, 1615960, 1669088, 1728200, 1793659, 1865463, 1943877, 2030088, 2125977, 2233041, 2351734, 2482144, 2625106, 2782322, 2955510, 3145772, 3353676, 3579473, 3823043, 4083749, 4360119, 4649023, 4944898, 5239844, 5524336, 5787423, 6016570, 6198548, 6321679, 6378036, 6364494, 6282971]
61696F282971j42835j94134k34297k63620k82389k91004k91222k85977k77418
61687D020075k65903k51312k34601k17462k00966j85189j69929j55238j41311
61678B198164j28315j16353j05459r5590q6652p8442p0677o3306n6734n1350m6780
61667A298506m2110l7015l2285k8892k6905k5714k5042k5162k6154k7406k8166
61656I73655k8373k8592k9174k9761k9756k9011k7873k6649k5362k3980k2566
61645F72558k1172j9856j8758j7919j7066j5923j4756j4086j3821j3255j2074
61634D93872j0732r678q895q495q902r794r830q301o421n882o547o871o312n938
61620C81274o477p108o782n684m636l809k786j537n90l09n20q24r89j037j114
$$ y = [6282971, 6140136, 5946002, 5711705, 5448085, 5165696, 4874692, 4583470, 4297493, 4020075, 3754172, 3502860, 3268259, 3050797, 2849831, 2664642, 2494713, 2339475, 2198164, 2069849, 1953496, 1848037, 1752447, 1665795, 1587353, 1516676, 1453370, 1396636, 1345286, 1298506, 1256396, 1219381, 1187096, 1158204, 1131299, 1105585, 1080543, 1055381, 1029227, 1001821, 973655, 945282, 916690, 887516, 857755, 827999, 798988, 771115, 744466, 719104, 695124, 672558, 651386, 631530, 612772, 594853, 577787, 561864, 547108, 533022, 519201, 505946, 493872, 483140, 473462, 464567, 456072, 447170, 437376, 427546, 419245, 412824, 406942, 400395, 393524, 387212, 381274, 374797, 367689, 360907, 355223, 350587, 346778, 343992, 342455, 341865, 341556, 341036, 340212, 339223, 338186, 337072]
61605C37072j227j097m67M55J117J286J318J645K228K688K808K781L007L680M553
61590C61847N161N362N528O032O717P057O787O175N696N617N732N457M376K834
61576D40378J658J194R83O74O81J460K600L374L816M584N792O768O908O239N067
61561D92176L630K072L43j855m639p493r713j1173j2213j2986j3408j3575j3624
61548C97542j3306j2324j0943r653q430o949n451m528m186l851l298k803k356
61535C09464j636p82l40k72J02R71J694J923K187K939L816M291M475M725N049
61520C38606N317N638O155O870P834R025R899R787Q991Q661R294J0113J0341J0231
61506D56762J0246J0067R248Q224P772P911Q076Q080Q076P905P274O458O101O322
$$ y = [337072, 335845, 334748, 334281, 334736, 335853, 337139, 338457, 340102, 342330, 345018, 347826, 350607, 353614, 357294, 361847, 367008, 372370, 377898, 383930, 390647, 397704, 404491, 410666, 416362, 421979, 427711, 433168, 437544, 440378, 442036, 443230, 444213, 444887, 445568, 447028, 449628, 453002, 456818, 461402, 467194, 473962, 480870, 487109, 492176, 495806, 497878, 498221, 496366, 491727, 484234, 474521, 463348, 451135, 438149, 424741, 411166, 397542, 384236, 371912, 360969, 351316, 342886, 335937, 330486, 325958, 321772, 317921, 314623, 311820, 309464, 307828, 307046, 306706, 306434, 306536, 307507, 309201, 311124, 313311, 316250, 320066, 324357, 328832, 333557, 338606, 343923, 349561, 355716, 362586, 370420, 379445, 389344, 399131, 408122, 416783, 426077, 436190, 446531, 456762, 467008, 477075, 486323, 494547, 502319, 510230, 518306, 526386, 534462, 542367, 549641, 556099, 562200, 568522]
61492E68522O644O733O630O263N373M116L219L259L969M509M301L543K859K472
61478F32412J903O77q96k018k449k715l170l469l154k268j061M11K002L324M357
61463F23886N770Q077J0771J2863J4048J4873J5948J7533J9710K2432K5396K8341
61451H19648L1425L4972L8848M2564M5948M9367N3193N7301O1109O3928O5223
61440A363526O4807O2821N9480N4773M8487M0437L0724J9836Q572k359j2531k1552
61428A717021k8844l4129l7974m1227m3779m4599m3228m0600l7905l5245l2043
61417A297448k8311k4705k1509j8309j4785j1248q270o047m255k278L15L259N670
61404A166975O997P857R436J2031J4605J5959J6040J5831J6142J6863J7374J7435
$$ y = [568522, 575166, 581899, 588529, 594792, 600165, 604281, 607500, 610759, 614728, 619237, 623538, 627081, 629940, 632412, 634315, 634992, 634096, 632078, 629629, 626914, 623744, 620275, 617121, 614853, 613792, 614203, 616205, 619529, 623886, 629656, 637733, 648504, 661367, 675415, 690288, 706236, 723769, 743479, 765911, 791307, 819648, 851073, 886045, 924893, 967457, 1013405, 1062772, 1115965, 1173266, 1234375, 1298303, 1363526, 1428333, 1491154, 1550634, 1605407, 1653894, 1694331, 1725055, 1744891, 1753463, 1751104, 1738573, 1717021, 1688177, 1654048, 1616074, 1574847, 1531068, 1486469, 1443241, 1402641, 1364736, 1329491, 1297448, 1269137, 1244432, 1222923, 1204614, 1189829, 1178581, 1170311, 1164264, 1160009, 1157731, 1158046, 1161305, 1166975, 1173972, 1181829, 1191265, 1203296, 1217901, 1233860, 1249900, 1265731, 1281873, 1298736, 1316110, 1333545]
61392A333545J7431J7785J8440J9083J9710K0516K1278K1343K0520J9548J9251
61381A548450J9355J8674J6509J3423J0509Q214O196M126K154N43p94k125l474
61368A641760m642n562o327o911p285p762q731r948j0589j0287r648r421r604
61355A535043r764r759r631r161q213p231o821o990p314p637q033q392q612q905
61341A418580r216q717o709l799j203R38L530O893J0301J3274J6270J9785K3749
61328A483676K8156L3275L8887M4184M8951N3905N9408O4590O8297P0197P0520
61317B064046O9429O7072O3465N7892M9316L8010K5880J4486L664p206j7548k6303
61305B402203l3621m0505m7136n2660n6454n8737n9941o0272n9874n8794n6817
$$ y = [1333545, 1350976, 1368761, 1387201, 1406284, 1425994, 1446510, 1467788, 1489131, 1509651, 1529199, 1548450, 1567805, 1586479, 1602988, 1616411, 1626920, 1635134, 1641330, 1645456, 1647610, 1648153, 1647359, 1645234, 1641760, 1637118, 1631556, 1625229, 1618318, 1611033, 1603271, 1594540, 1584592, 1574003, 1563716, 1554068, 1544647, 1535043, 1525279, 1515520, 1505889, 1496728, 1488515, 1481284, 1474463, 1467473, 1460159, 1452522, 1444489, 1436097, 1427485, 1418580, 1409364, 1400647, 1393938, 1390139, 1388936, 1389874, 1393404, 1400297, 1410598, 1423872, 1440142, 1459927, 1483676, 1511832, 1545107, 1583994, 1628178, 1677129, 1731034, 1790442, 1855032, 1923329, 1993526, 2064046, 2133475, 2200547, 2264012, 2321904, 2371220, 2409230, 2435110, 2449596, 2453260, 2446054, 2428506, 2402203, 2368582, 2328077, 2280941, 2228281, 2171827, 2113090, 2053149, 1992877, 1933003, 1874209, 1817392]
61294A817392n3834n0219m6399m2341l7964l3704l0069k6863k3493j9877j6453
61283A436176j3543j1242r703q863q110o864n430m573m408m246l595k710k047
61270A350842j603r80J37J616K928L620L844M150M695N006M714M037L252K233
61256A388491R60k9k60o6j78q36j780k749l559l925l760l417l228l075k818k767
61240A357004l196l706l655l012k311j889j711j741k136l127m887p343r902j1802
61226A296586j2854j3432j3610j3009j1730j0611j0047r369q016o523n534m604
61214A177247k951p95J099K763M840P307R508J1376J3660J6847K0535K3870K6080
61201A311386K6794K6445K6112K6363K6578K6020K5146K4981K5583K6105K6138
$$ y = [1817392, 1763558, 1713339, 1666940, 1624599, 1586635, 1552931, 1522862, 1495999, 1472506, 1452629, 1436176, 1422633, 1411391, 1401688, 1392825, 1384715, 1377851, 1372421, 1367848, 1363440, 1359194, 1355599, 1352889, 1350842, 1349239, 1348259, 1348396, 1350012, 1352940, 1356560, 1360404, 1364554, 1369249, 1374255, 1378969, 1383006, 1386258, 1388491, 1389451, 1389422, 1389162, 1389096, 1388918, 1388082, 1386302, 1383553, 1379994, 1376069, 1372309, 1368892, 1365664, 1362589, 1359771, 1357004, 1353808, 1350102, 1346447, 1343435, 1341124, 1339235, 1337524, 1335783, 1333647, 1330520, 1325633, 1318290, 1308388, 1296586, 1283732, 1270300, 1256690, 1243681, 1231951, 1221340, 1211293, 1201924, 1193908, 1187385, 1181851, 1177247, 1174296, 1173501, 1174600, 1177363, 1182203, 1189510, 1199018, 1210394, 1224054, 1240901, 1261436, 1285306, 1311386, 1338180, 1364625, 1390737, 1417100, 1443678, 1469698, 1494844, 1519825, 1545408, 1571513, 1597651]
61190A597651K6005K5831K5284K4164K2329J9083J3519N675l368j2574k1432k9489
61178A692678l6217m1461m5325m7576m7951m6989m5748m4499m2455l9005l4615
61167A220837l0289k6678k3962k2077k0801j9798j8776j7510j5948j4448j3526
61156I97024j3086j2334j0936r713r543j0026j0031r230q322p911p901p772o885
61143H73334m896k442r92j200j971k015j679k064k944k925j573J58J561K885M219
61128H57456N058N352N866O994Q186Q908R345R700R521Q221N740K520p81l526
61114I38560n537p289r103j0530j1173j1748j3231j5339j6942j7803j8604j9345
61102G81916j9170j7936j6622j5792j4962j3840j2945j2429j1465r529p306n666
$$ y = [1597651, 1623656, 1649487, 1674771, 1698935, 1721264, 1740347, 1753866, 1759541, 1756173, 1743599, 1722167, 1692678, 1656461, 1615000, 1569675, 1522099, 1474148, 1427159, 1381411, 1336912, 1294457, 1255452, 1220837, 1190548, 1163870, 1139908, 1117831, 1097030, 1077232, 1058456, 1040946, 1024998, 1010550, 997024, 983938, 971604, 960668, 950955, 941412, 931386, 921355, 912125, 903803, 895892, 887991, 880219, 873334, 868438, 865996, 865004, 863804, 861833, 859818, 858139, 856075, 853131, 850206, 848633, 848791, 850352, 853237, 857456, 862514, 867866, 873732, 880726, 888912, 897820, 907165, 916865, 926386, 934607, 940347, 942867, 942086, 938560, 933023, 925734, 916631, 906101, 894928, 883180, 869949, 854610, 837668, 819865, 801261, 781916, 762746, 744810, 728188, 712396, 697434, 683594, 670649, 658220, 646755, 637226, 629920, 624254]
61090F24254m573l566k565j588l42J333L137M802O348P698Q665R431J0224J0470
61076F73728R128O103K423j101m370p110q763r574j0552j1796j2094j0779q878
61063F06365p736p541p852q479r074q919p969p205p086o711n437m251m347n164
61049E08594n210m290l529l547l810l706l083j845k8J630K219J937K020L103M344
61034D94799M632M101L774L918L451J336j882m498n657o177p057p926p784o715
61020D68315n804n422m768l285j604p00p97j383j717j155L80K009K594J998J141
61005D49802P37O92P70J088J661K139K299K278K248K297K615L220L606L345K778
60990D81575K528K571K627L005M032M993M916M148L760L706L115K266K499L956
$$ y = [624254, 619681, 616115, 613550, 611962, 611620, 612953, 616090, 620892, 627240, 634938, 643603, 653034, 663258, 673728, 682856, 688959, 691382, 690281, 685911, 678801, 670038, 660464, 649912, 638116, 626022, 615243, 606365, 598629, 591088, 583236, 574757, 565683, 556764, 548795, 541590, 534504, 527793, 522356, 518105, 513758, 508594, 503384, 499094, 495565, 492018, 488208, 484502, 481419, 479574, 479546, 481176, 483395, 485332, 487352, 490455, 494799, 499431, 503532, 507306, 511224, 514675, 516011, 514129, 509631, 503974, 497797, 490740, 482814, 475030, 468315, 462511, 457089, 452321, 449036, 447432, 446732, 445935, 444552, 442835, 441680, 442060, 444069, 446663, 448661, 449802, 450539, 451231, 452001, 453089, 454750, 456889, 459188, 461466, 463714, 466011, 468626, 471846, 475452, 478797, 481575, 484103, 486674, 489301, 492306, 496338, 501331, 506247, 510395, 514155, 517861, 520976, 523242, 525741, 529697]
60976E29697N173N319N247N785O498O781O796O731O434O254O950Q368R427R794
60962F25254J0234J1006J1519J1817J2687J3887J4108J3214J2656J2989J3015
60951G62386J2137J1538J2009J2638J2757J3208J4481J5509J5713J6321J8257
60940I16954K0494K1990K3500K5908K8533L0635L2919L5962L8838M1013M3773
60929A260519M8038N2514N5851N8927O3072O7826P2455P7951Q5206R2833R9120
60918B034312J04784J11563J19519J27890J37053J47314J57272J65641J73239
60909C278587J81110J88568J95519K04471K17460K33081K49578K68493K91751
60900E308618L17469L42779L68865L99302M35732M79748N36345O09721O97709
$$ y = [529697, 534870, 540189, 545436, 551221, 557719, 564500, 571296, 578027, 584461, 590715, 597665, 606033, 615460, 625254, 635488, 646494, 658013, 669830, 682517, 696404, 710512, 723726, 736382, 749371, 762386, 774523, 786061, 798070, 810708, 823465, 836673, 851154, 866663, 882376, 898697, 916954, 937448, 959438, 982938, 1008846, 1037379, 1068014, 1100933, 1136895, 1175733, 1216746, 1260519, 1308557, 1361071, 1416922, 1475849, 1538921, 1606747, 1679202, 1757153, 1842359, 1935192, 2034312, 2139096, 2250659, 2370178, 2498068, 2635121, 2782435, 2939707, 3105348, 3278587, 3459697, 3648265, 3843784, 4048255, 4265715, 4498796, 4748374, 5016867, 5308618, 5626087, 5968866, 6337731, 6737033, 7172765, 7652513, 8188858, 8798579, 9496288]
60891I496288P96482R08701J040426J193032J367259J571981J816095K093031
60883B0283295K390225K712037L057888L349981L409602L067977K335008J439663
60875D2045676O74429J99090R25Q549J76121M29611N86369M15953j78115j054092
60865D3304516j930144k581874k945835l072435l033198k883467k671738k441157
60857B1744668k216022k000969j795473j601594j419935j248794j089751r48268
60849I423862q27249p24546o37259n64174n03416m51679m06793l68112l34129
60840D606505l02582k73132k47092k24388k03537j84557j69113j57490j47985
60831B696629j39522j32313j25785j18397j09996j02026r5067q8361q1986p7072
$$ y = [9496288, 10292770, 11201471, 12241897, 13434929, 14802188, 16374169, 18190264, 20283295, 22673520, 25385557, 28443445, 31793426, 35203028, 38271005, 40606013, 42045676, 42720105, 42919195, 42920120, 42928669, 43104790, 43534401, 44120770, 44536723, 44358608, 43304516, 41374372, 38792498, 35846663, 32774228, 29741030, 26857563, 24185825, 21744668, 19528646, 17527677, 15732204, 14130610, 12710675, 11461881, 10372130, 9423862, 8596613, 7872067, 7234808, 6670634, 6167218, 5715539, 5308746, 4940634, 4606505, 4303923, 4030791, 3783699, 3559311, 3355774, 3171217, 3002104, 2844614, 2696629, 2557107, 2424794, 2299009, 2180612, 2070616, 1968590, 1873523, 1785162, 1703176, 1626104]
60821A626104p3359o8977o3324n8062n4401n1495m8296m5178m2663m0213l7371
60810A042765l4752l2968l1645l0273k8947k7715k6194k4364k2771k1537k0135
60799G41464j8428j6914j5735j4546j3491j3086j3001j2267j1016j0473j0861
60788E91646j0761r255p295o110n505m653l634l114l195l430l599l785m079m572
60774E18659n239n612n119l937k833k036j061J00O45J95m61m56P8N42Q89J524
60758D95878K593L847M945N622N846N890N939N738N117M615M787N096M514L167
60744E63594K239K049J482k10k171l225l473l790m431m936n049m964m954n173
60730E26988n620n961n763n142m777n023n446n494n126m514l705k864k315k088
$$ y = [1626104, 1552745, 1483768, 1420444, 1362382, 1307981, 1256486, 1208190, 1163012, 1120349, 1080136, 1042765, 1008013, 975045, 943400, 913127, 884180, 856465, 830271, 805907, 783136, 761599, 741464, 723036, 706122, 690387, 675841, 662350, 649264, 636263, 623996, 612980, 602507, 591646, 580885, 571630, 564335, 558225, 552720, 548067, 544433, 541319, 538124, 534694, 531095, 527310, 523231, 518659, 513420, 507808, 502689, 498752, 495919, 493883, 492822, 492922, 493567, 493762, 493301, 492845, 492923, 493465, 494354, 495878, 498471, 502318, 507263, 512885, 518731, 524621, 530560, 536298, 541415, 546030, 550817, 555913, 560427, 563594, 565833, 567882, 569364, 569154, 566983, 563758, 560285, 556495, 552064, 547128, 542079, 537115, 532161, 526988, 521368, 515407, 509644, 504502, 499725, 494702, 489256, 483762, 478636, 474122, 470417, 467553, 465238, 463150]
60716D63150j864j626j727k090k058j411p84o03l14P04K083K982L168K902K328
60701D64840J676J619K565L764L967K967J840J640K442L647M568M705L943K795
60687E06978K083K067K130J466p3j956l598m849n884o816p580q149q649r102r284
60672D48784r065q738q647q634q263p626p335p596p783p287o321n508m971m401
60658C46609l728l263l108k971k675k442k367k044j134j93k98j629l005l236k550
60643C11966k053k051j852j204q64j248j503p06O59J441J499J612J966J904J225
60628C10791O74Q14J311J639J832K123K521L046L847M709M996M452L642L295L607
60613C53299M398N468O454O872O629O150N746N330M986N259O404P763Q457Q333
$$ y = [463150, 461286, 459660, 457933, 455843, 453785, 452374, 451590, 450987, 450673, 451377, 453460, 456442, 459610, 462512, 464840, 466516, 468135, 470700, 474464, 478431, 481398, 483238, 484878, 487320, 490967, 495535, 500240, 504183, 506978, 509061, 511128, 513258, 514724, 514651, 512695, 509097, 504248, 498364, 491548, 483968, 475819, 467170, 458068, 448784, 439719, 430981, 422334, 413700, 405437, 397811, 390476, 382880, 375097, 367810, 361489, 355981, 351010, 346609, 342881, 339618, 336510, 333539, 330864, 328422, 326055, 324011, 322877, 322684, 322386, 320757, 317752, 314516, 311966, 309913, 307862, 306010, 304806, 303942, 302694, 301191, 300485, 301144, 302585, 304084, 305696, 307662, 309566, 310791, 311465, 312279, 313590, 315229, 317061, 319184, 321705, 324751, 328598, 333307, 338303, 342755, 346397, 349692, 353299, 357697, 363165, 369619, 376491, 383120, 389270, 395016, 400346, 405332, 410591, 416995, 424758, 433215, 441548]
60599D41548P905P628P619P734P562O675N232M041L617L577L294K727K115J285
60585E12559j6j476k540l196l844m519m893n001n219n572n661n379n071m923m759
60570D50490m537m429m199l205j416J12L02o58j576j547o09O53J667K135K130
60555D35313K011K017K024J921K025K746L907M843N253N530O077O781P331P728
60541D95507Q167Q617Q890Q890Q606P990P248O925P270P627P079N666M319L523
60527E96324K678J072j123l267n142o816q094q725q987r379r822r801r264q794
60513E10860q728q724q377p726o938n994n040m558m733m924m346l120k143j925
60499D33584k047j871j398j102j146j107n20N51J579K127K208K136K215K537L020
$$ y = [441548, 449453, 457081, 464700, 472434, 479996, 486671, 491903, 495944, 499561, 503138, 506432, 509159, 511274, 512559, 512543, 511067, 508527, 505331, 501487, 496968, 492075, 487074, 481855, 476283, 470622, 465243, 460172, 455249, 450490, 445953, 441524, 437325, 434120, 432704, 432816, 433118, 432460, 430884, 429337, 428728, 429381, 431048, 433183, 435313, 437324, 439341, 441365, 443286, 445311, 448057, 451964, 456807, 462060, 467590, 473667, 480448, 487779, 495507, 503674, 512291, 521181, 530071, 538677, 546667, 553915, 560840, 568110, 575737, 582816, 588482, 592801, 596324, 599002, 600074, 598951, 595684, 590542, 583726, 575632, 566907, 557920, 548541, 538719, 528918, 519654, 510860, 502132, 493408, 485031, 477305, 470367, 464373, 459333, 454775, 450042, 445118, 440772, 437652, 435509, 433584, 431537, 429666, 428268, 427166, 426020, 424913, 424393, 424944, 426523, 428650, 430858, 432994, 435209, 437746, 440766]
60484D40766L460L660L659L804M429N430O253O438O174O185P039Q569J0083J1084
60470E27033J1675J2270J3109J4214J5621J7356J9265K1166K3199K5714K8780
60459G29402L2079L5398L8874M2662M6728N1158N6285O2128O7923P2592P5503
60448A310732P6426P5009P0736O3535N4094M3469L2466K1325R891j822j3181k3187
60436A719493l1276l7573m2228m4931m5441m4165m1690l8012l2840k6590k0323
60425A314424j4602q937k586M535J1991J9447K6703L3314L8505M1597M2400M1253
60413A548044L8659L4917L0083K4375J8473J3278R425P127O395P167R307J2654
60401A759904J7116K2669K9301L7070M6087N6341O7694Q0100R3705J08604J24774
$$ y = [440766, 444226, 447886, 451545, 455349, 459778, 465208, 471461, 477899, 484073, 490258, 497297, 505866, 515949, 527033, 538708, 550978, 564087, 578301, 593922, 611278, 630543, 651709, 674908, 700622, 729402, 761481, 796879, 835753, 878415, 925143, 976301, 1032586, 1094714, 1162637, 1235229, 1310732, 1387158, 1462167, 1532903, 1596438, 1650532, 1694001, 1726467, 1747792, 1757683, 1755861, 1742680, 1719493, 1688217, 1650644, 1608416, 1563485, 1518044, 1473879, 1432189, 1394177, 1361337, 1334747, 1314424, 1299822, 1290885, 1288299, 1292834, 1304825, 1324272, 1350975, 1384289, 1422794, 1464391, 1506791, 1548044, 1586703, 1621620, 1651703, 1676078, 1694551, 1707829, 1717254, 1724381, 1730776, 1737943, 1747250, 1759904, 1777020, 1799689, 1828990, 1866060, 1912147, 1968488, 2036182, 2116282, 2209987, 2318591, 2443365]
60390B443365J42456J62188J84256K08301K33839K60770K88883L17066L43412
60381D584536L65824L81773L87464L78093L49676L00843K33278J50881N8846l6858
60371G154356j29561k12314k79330l27872l58754l74701l78328l71779l57509
60362D364208l38309l16408k93169k69599k46488k24046k02147j81206j62221
60353B130615j45693j31087j17639j05208r4040q4165p5502o8118o1971n6596
60343A190596n1553m6999m3443m0892l8612l5856l2640k9670k7502k5930k4335
60332G93164k2487k0752j9408j8265j7119j6123j5365j4523j3467j2743j2732
60321F10180j2755j1957j0850j0829j2024j2780j1794r794q446q252q336p842
$$ y = [2443365, 2585821, 2748009, 2932265, 3140566, 3374405, 3635175, 3924058, 4241124, 4584536, 4950360, 5332133, 5719597, 6097690, 6447366, 6748209, 6981487, 7132368, 7191214, 7154356, 7024795, 6812481, 6533151, 6205279, 5846525, 5471824, 5093496, 4721717, 4364208, 4025899, 3709491, 3416322, 3146723, 2900235, 2676189, 2474042, 2292836, 2130615, 1984922, 1853835, 1736196, 1630988, 1536948, 1452783, 1377281, 1309163, 1247192, 1190596, 1139043, 1092044, 1048601, 1007709, 969097, 933241, 900601, 870931, 843429, 817499, 793164, 770677, 749925, 730517, 712252, 695133, 679010, 663645, 649122, 635655, 622912, 610180, 597425, 585468, 574618, 563789, 551765, 538985, 527191, 517397, 508951, 500699, 492363, 484521]
60309D84521o769n619m809m397m036l300k296j706j973k749l400l736l824l556
60295D32351k873k223k174k667l107l190l224l541m028m345m364m200l913l353
60281C85149k332j004j5O1n72r84n71K04L62l40j090r62P6J232J839J954J988
60264C84995K011J771J364J384K044K594K145R42J80N24J365J799J753J820K267
60249D08958K784L041L074L094L136L106L026L121L472L758L556L000K762L161
60235D53049L679L747L642L914M246L660J934N6j038j491j977k678l244l396l204
60220D60899k947k927l128k993j989m82M67M39J87N19J253J691J681J557J510
60205D55737J614K198L422M693N155M831M686N407O612P475P750P957Q771J0365
$$ y = [484521, 477752, 472133, 467324, 462927, 458891, 455591, 453295, 451589, 449616, 446867, 443467, 439731, 435907, 432351, 429478, 427255, 425081, 422414, 419307, 416117, 412893, 409352, 405324, 400979, 396615, 392415, 388502, 385149, 382817, 381813, 381798, 381859, 381287, 380303, 379732, 379936, 380298, 379958, 378868, 377906, 377982, 379214, 381053, 383007, 384995, 387006, 388777, 390141, 391525, 393569, 396163, 398308, 399250, 399430, 399954, 401319, 403118, 404871, 406691, 408958, 411742, 414783, 417857, 420951, 424087, 427193, 430219, 433340, 436812, 440570, 444126, 447126, 449888, 453049, 456728, 460475, 464117, 468031, 472277, 475937, 477871, 477927, 476889, 475398, 473421, 470743, 467499, 464103, 460899, 457952, 455025, 451897, 448904, 446915, 446433, 446900, 447339, 447526, 448045, 449298, 450989, 452670, 454227, 455737, 457351, 459549, 462971, 467664, 472819, 477650, 482336, 487743, 494355, 501830, 509580, 517537, 526308, 536673]
60191E36673J2318J4033J5275J6323J7546J8960K0288K1407K2608K4399K6988
60180G46818K9896L2202L3426L4060L4913L5988L6513L6124L5376L4746L3678
60169A123740L1267K7568K3565J9935J6467J2776Q981N409K048j261m271o392
60157A259832p429p844q117q058p166n496l722k170l16K390N630Q612J1119J3595
60143A250860J6354J9300K2364K5618K8847L1541L3446L4682L5228L4806L3326
60132A566372L1028K8070K4530K0781J7248J3650R205L793j748o678j1006j4783
60120A680462j7593j9243k0188k0633j9931j7581j4179j0572o616j781L465P973
60108A543583J1546J5223J9846K5123L0274L4785L8391M1000M2940M4748M6427
$$ y = [536673, 548991, 563024, 578299, 594622, 612168, 631128, 651416, 672823, 695431, 719830, 746818, 776714, 808916, 842342, 876402, 911315, 947303, 983816, 1019940, 1055316, 1090062, 1123740, 1155007, 1182575, 1206140, 1226075, 1242542, 1255318, 1264299, 1269708, 1271756, 1270495, 1266224, 1259832, 1252403, 1244559, 1236442, 1228384, 1221218, 1215722, 1212000, 1209830, 1209514, 1211904, 1217534, 1226146, 1237265, 1250860, 1267214, 1286514, 1308878, 1334496, 1363343, 1394884, 1428330, 1463012, 1498240, 1533046, 1566372, 1597400, 1625470, 1650000, 1670781, 1688029, 1701679, 1710884, 1714677, 1712929, 1706251, 1695245, 1680462, 1662869, 1643626, 1623438, 1602805, 1582874, 1565293, 1551114, 1540542, 1533926, 1532145, 1535610, 1543583, 1555129, 1570352, 1590198, 1615321, 1645595, 1680380, 1718771, 1759771, 1802711, 1847459, 1893886]
60097A893886M7385M7258M6318M4817M2449L8846L4157K8707K2413J5048O987
60086B268271p70p342j2456j6103j8102j8261j6792j4213j0749o087P0P399J5137
60073B170002K2789L0377L8050M5771N3472O1215O9032P6739Q3975R0285R5199
60062B836906R8415R9963R9927R8137R4404Q9017Q2447P4650O5145N3919M1735
60051C734665K9266J6509L287j0146k3434l6466m8916n9883o8569p5085q0069
60040C381159q3704q5615q5535q3556p9815p4465o7985o1057n4049m6808l9001
60029B619569l0435k1132j1421j961O509J3485J8738K2236K4134K4652K3846K1640
60017B709860J8162J3838R058M035r50n612j0048j4594j9100k2949k6070k9229
$$ y = [1893886, 1941271, 1988529, 2034847, 2079664, 2122113, 2160959, 2195116, 2223823, 2246236, 2261284, 2268271, 2267501, 2260159, 2247703, 2231600, 2213498, 2195237, 2178445, 2164232, 2153483, 2147396, 2147466, 2154865, 2170002, 2192791, 2223168, 2261218, 2306989, 2360461, 2421676, 2490708, 2567447, 2651422, 2741707, 2836906, 2935321, 3035284, 3135211, 3233348, 3327752, 3416769, 3499216, 3573866, 3639011, 3692930, 3734665, 3763931, 3780440, 3783727, 3773581, 3750147, 3713681, 3664765, 3604882, 3536313, 3461228, 3381159, 3297455, 3211840, 3126305, 3042749, 2962934, 2888469, 2820484, 2759427, 2705378, 2658570, 2619569, 2589134, 2568002, 2556581, 2554620, 2561129, 2574614, 2593352, 2615588, 2639722, 2664374, 2688220, 2709860, 2728022, 2741860, 2750918, 2754953, 2754003, 2748391, 2738343, 2723749, 2704649, 2681700, 2655630, 2626401]
60005B626401l2688l5218l5334l3234l0615k8596k6615k3466j8737j2960o844
59994B342094p22N481J2036J9055K6282L3237L9514M4828M8890N1483N2545N2047
59982B726770M9876M5943M0320L3200K4924J6121P465q36r037j7201k4948l2038
59970B860559l8750m5367n1643n7086o1408o4420o5980o6398o6331o5757o3655
59959B213764n9370n3779m8292m3158l7738l2048k6801k1922j6292r435k424L428
59947A865933Q098J2455J6956K1500K6138L1118L6244M0835M4389M6824M7973
59936B198463M7325M4563M0075L4565K8330K1310J3769O400m81p356j4684k2041
59924B390238k8570l4022l8633m2166m3823m3327m1320l8460l4764l0193k5228
$$ y = [2626401, 2593713, 2558495, 2523161, 2489927, 2459312, 2430716, 2404101, 2380635, 2361898, 2348938, 2342094, 2341372, 2346853, 2358889, 2377944, 2404226, 2437463, 2476977, 2521805, 2570695, 2622178, 2674723, 2726770, 2776646, 2822589, 2862909, 2896109, 2921033, 2937154, 2944619, 2943783, 2934746, 2917545, 2892597, 2860559, 2821809, 2776442, 2724799, 2667713, 2606305, 2541885, 2475905, 2409507, 2343176, 2277419, 2213764, 2154394, 2100615, 2052323, 2009165, 1971427, 1939379, 1912578, 1890656, 1874364, 1864929, 1862505, 1865933, 1874031, 1886486, 1903442, 1924942, 1951080, 1982198, 2018442, 2059277, 2103666, 2150490, 2198463, 2245788, 2290351, 2330426, 2364991, 2393321, 2414631, 2428400, 2434800, 2434319, 2426963, 2412279, 2390238, 2361668, 2327646, 2289013, 2246847, 2203024, 2159697, 2118377, 2079917, 2045153, 2014960, 1989732]
59913A989732k0312j5276r831m223J122O227J1289J6109K0293K3838K7003K9838
59901B075809L2169L3857L4733L4548L3352L1627K9743K7561K4894K1908J8673
59890B398874J4882J0507O375L508K153J978K806M655P365J0867J5497K1513K8525
59877B529505L5934M3672N1994O0913P0333Q0254R0200R8937J05498J10123J13303
59866C390666J14299J11577J04501R3602P9321O1631M1000J8770l731k5665m6126
59855C939845o3953p8530r0137r9099j05095j07612j06768j03296r7967r1256
59845B996132q3473p5034o6528n8349n0232m1485l1908k2139j2902m350L579J0743
59833B564054J7181K3327K9264L4234L7498L9053L8853L6015K9824K1016J1040
$$ y = [1989732, 1969420, 1954144, 1944313, 1940090, 1941212, 1947439, 1958728, 1974837, 1995130, 2018968, 2045971, 2075809, 2107978, 2141835, 2176568, 2211116, 2244468, 2276095, 2305838, 2333399, 2358293, 2380201, 2398874, 2413756, 2424263, 2430638, 2434146, 2436299, 2438277, 2441083, 2445738, 2453103, 2463970, 2479467, 2500980, 2529505, 2565439, 2609111, 2661105, 2722018, 2792351, 2872605, 2962805, 3061742, 3167240, 3277363, 3390666, 3504965, 3616542, 3721043, 3814645, 3893966, 3955597, 3996597, 4015367, 4011636, 3985971, 3939845, 3875892, 3797362, 3707225, 3608126, 3503031, 3395419, 3288651, 3185355, 3087388, 2996132, 2912659, 2837625, 2771097, 2712748, 2662516, 2621031, 2589123, 2566984, 2554082, 2549732, 2553311, 2564054, 2581235, 2604562, 2633826, 2668060, 2705558, 2744611, 2783464, 2819479, 2849303, 2870319, 2881359]
59822B881359L71j1343k3799l5902m7053n7393o6760p4391p9781q2939q3898q2878
59810B235593q0864p8905p6774p3462o9041o4806o1357n7784n3240m8150m3248
59799A527962l8424l3339k8325k3923k0018j6192j2591r838q266p649p512p465
59787A314420p324p015o281m753k648j030p06j099r56l8P41O46l25k130m906q250
59771A268346j1216j3328j4856j6003j6622j6911j7407j8003j7832j6500j4662
59760A095006j3048j1648j0224q889p771o594m960k659L05L584O404Q374J0157
59747A058037J2629J5520J7794J9221K0480K1794K2720K3295K4054K4789K4630
59736A284963K3619K2784K2385K1675K0805K1130K2784K3609K1873J8701J6522
$$ y = [2881359, 2881730, 2870387, 2846588, 2810686, 2763633, 2706240, 2639480, 2565089, 2485308, 2402369, 2318471, 2235593, 2154729, 2075824, 1999050, 1925588, 1856547, 1791741, 1730384, 1672600, 1619360, 1571210, 1527962, 1489538, 1456199, 1427874, 1403951, 1383933, 1367741, 1355150, 1345312, 1337046, 1329397, 1321885, 1314420, 1307096, 1300081, 1293800, 1289047, 1286399, 1285369, 1284663, 1283564, 1282608, 1282570, 1283311, 1283957, 1283632, 1281502, 1276596, 1268346, 1257130, 1243802, 1228946, 1212943, 1196321, 1179410, 1162003, 1144000, 1126168, 1109668, 1095006, 1081958, 1070310, 1060086, 1051197, 1043426, 1036832, 1031872, 1029213, 1029518, 1033102, 1039506, 1047880, 1058037, 1070666, 1086186, 1103980, 1123201, 1143681, 1165475, 1188195, 1211490, 1235544, 1260333, 1284963, 1308582, 1331366, 1353751, 1375426, 1396231, 1417361, 1440145, 1463754, 1485627, 1504328, 1520850]
59725A520850J6237J7250J9293K2604K6907L1577L6458M1351M5354M7901N0147
59714A875929N3960N9801O6633P3632Q0771Q7573R2409R3346Q9080P9046O3258
59703B715438M2441J8147p264l0805m9699o2626p0122p3560p4030p2200o8519
59692B267201o3238n6722m9881m3520l7106k9251j9906j0973l980J745P688J3913
59680A975970J9511K4500K9807L5748M1773M7608N3563N9776O6067P2536P9468
59669B506327Q6715R3959J01510J10088J19834J30192J40725J51454J62330J72956
59659C776090J82920J92106K00616K08545K15483K20155K21051K17849K11724
59650E646539K03992J95107J85457J76376J69533J65647J64368J64994J66640
$$ y = [1520850, 1537087, 1554337, 1573630, 1596234, 1623141, 1654718, 1691176, 1732527, 1777881, 1825782, 1875929, 1929889, 1989690, 2056323, 2129955, 2210726, 2298299, 2390708, 2484054, 2573134, 2652180, 2715438, 2757879, 2776026, 2768762, 2737957, 2688258, 2625632, 2555510, 2481950, 2407920, 2335720, 2267201, 2203963, 2147241, 2097360, 2053840, 2016734, 1987483, 1967577, 1956604, 1952624, 1954369, 1962057, 1975970, 1995481, 2019981, 2049788, 2085536, 2127309, 2174917, 2228480, 2288256, 2354323, 2426859, 2506327, 2593042, 2687001, 2788511, 2898599, 3018433, 3148625, 3289350, 3440804, 3603134, 3776090, 3959010, 4151116, 4351732, 4560277, 4775760, 4995915, 5216966, 5434815, 5646539, 5850531, 6045638, 6231095, 6407471, 6577004, 6742651, 6907019, 7072013, 7238653]
59641G238653J68276J69228J69226J67425J62052J51878J37482J20309J01089
59632H585618Q0025N7897L5831J4332o304k4794l9198m8480n2925n3119m9342
59621H499541m1933l1418j8124k205J5992L6066N7882Q1240J05436J29654J53406
59610H985537J76061J96370K13121K25748K33510K34582K26826K09141J81167
59601A0882063J42334R2619L4277k8310r0767j49929k03281k48473k83915l09188
59591I837430l24566l30628l28425l19479l05517k88522k70797k54391k40647
59582G174458k30796k26503k28842k36703k46908k56071k61990k63645k60896
59573D962104k54288k44666k32795k19480k05636j91741j77728j63851j51033
$$ y = [7238653, 7406929, 7576157, 7745383, 7912808, 8074860, 8226738, 8364220, 8484529, 8585618, 8665643, 8723540, 8759371, 8773703, 8767399, 8742605, 8703407, 8654927, 8602002, 8548883, 8499541, 8457608, 8426190, 8408066, 8405861, 8421853, 8457919, 8515801, 8597041, 8702477, 8832131, 8985537, 9161598, 9357968, 9571089, 9796837, 10030347, 10264929, 10491755, 10700896, 10882063, 11024397, 11117016, 11151293, 11122983, 11032216, 10882287, 10679006, 10430533, 10146618, 9837430, 9512864, 9182236, 8853811, 8534332, 8228815, 7940293, 7669496, 7415105, 7174458, 6943662, 6717159, 6488317, 6251614, 6004706, 5748635, 5486645, 5223000, 4962104, 4707816, 4463150, 4230355, 4010875, 3805239, 3613498, 3435770, 3271919, 3120886]
59564C120886j39596j28469j16728j05289r5703q7740p9677p0889o2588n5858
59554B178349n0403m5594m1441l7918l4490l1001k8173k6564k5756k5185k5072
59543A806752k5869k7273k8518k9344l0126l1131l2070l2415l1983l1099l0168
59532A476756k9148k7735k6062k4632k3396k1555j8822j6118j4277j2673j0190
59521A252148p091m785l866l419k317k51K458N154O940P410P410Q217R969J1729
59507A289706J3027J4283J5642J6593J7051J7781J9316K1338K3475K5910K8678
59496A502800L1193L3075L4827L7138M0036M3281M7143N2127N8014O3685O8068
59485B011387P1185P4149P7968Q2274Q5564Q6839Q6544Q5623Q4228Q1897P8495
$$ y = [3120886, 2981290, 2852821, 2736093, 2630804, 2535101, 2447361, 2367684, 2296795, 2234207, 2178349, 2127946, 2082352, 2040911, 2002993, 1968503, 1937502, 1909329, 1882765, 1857009, 1831824, 1806752, 1780883, 1753610, 1725092, 1695748, 1665622, 1634491, 1602421, 1570006, 1538023, 1506924, 1476756, 1447608, 1419873, 1393811, 1369179, 1345783, 1324228, 1305406, 1289288, 1275011, 1262338, 1252148, 1245057, 1240272, 1236406, 1232987, 1230670, 1230419, 1232877, 1238031, 1244971, 1252381, 1259791, 1268008, 1277977, 1289706, 1302733, 1317016, 1332658, 1349251, 1366302, 1384083, 1403399, 1424737, 1448212, 1474122, 1502800, 1533993, 1567068, 1601895, 1639033, 1679069, 1722350, 1769493, 1821620, 1879634, 1943319, 2011387, 2082572, 2156721, 2234689, 2316963, 2402527, 2489366, 2575910, 2661533, 2745761, 2827658, 2906153]
59474B906153P4254O9340O4067N8886N3331M5667L4880K2627J1890L888k398p831
59462C334754j1839j3721j3754j2423r684n425J74P142J5620K4930L3656M0932
59450C390362M6837N1231N3203N1998M7532L9672K7988J2765m644k2935m1559
59439C652450n9988p7103r1833j03630j12056j16781j18334j17891j15870j11666
59429B627298j05336r8386r2068q5722p7850o8319n8588n0068m2971l6571k9979
59418A881440k2795j5442q740k993K300P722J3366J9083K4818L0513L6068M1536
59406B006876M6963N2105N6657O0596O3685O4954O3603O0244N6195N1510M4858
59395B628246L5505K4273J2178o47j4121k7366l9406m9986n9151o6672p2378p6299
$$ y = [2906153, 2980407, 3049747, 3113814, 3172700, 3226031, 3271698, 3306578, 3329205, 3341095, 3344983, 3342585, 3334754, 3322915, 3309194, 3295440, 3283017, 3273333, 3267908, 3268082, 3275224, 3290844, 3315774, 3349430, 3390362, 3437199, 3488430, 3541633, 3593631, 3641163, 3680835, 3708823, 3721588, 3716944, 3694009, 3652450, 3592462, 3515359, 3423526, 3319896, 3207840, 3091059, 2972725, 2854834, 2738964, 2627298, 2521962, 2423576, 2331508, 2245786, 2167936, 2099617, 2041029, 1990961, 1947990, 1911419, 1881440, 1858645, 1843203, 1834463, 1831470, 1833770, 1841492, 1854858, 1873941, 1898759, 1929272, 1965340, 2006876, 2053839, 2105944, 2162601, 2223197, 2286882, 2351836, 2415439, 2475683, 2531878, 2583388, 2628246, 2663751, 2688024, 2700202, 2699555, 2685434, 2658068, 2618662, 2568676, 2509525, 2442853, 2370475, 2294176]
59383B294176p8280p8141p6567p4812p3194p0787o7033o2577n8099n3422m8437
59372A552827m3763l9725l5686l1271k7247k4256k1578j8249j4629j1688r416
59361A275319p044m383j746J039M422Q025J0861J2668J4195J6089J8204K0222
59349A367871K2395K5293K8826L1551L1363K7506K1951J8083J7717J9997K3246
59338A635799K6949L1461L6783M2414M7684N1585N2934N1641M9399M8366M9385
59327B124400N2000N5736O0589O6556P3257P9965Q5934R1065R6370J03115J11320
59316C000307J19949J28651J38233J48967J59741J69687J79518J90087K00567
59307D435707K09248K15430K19246K20220K17418K10922K01875J91113J78724
$$ y = [2294176, 2215896, 2137755, 2061188, 1986376, 1913182, 1842395, 1775362, 1712785, 1654686, 1601264, 1552827, 1509064, 1469339, 1433653, 1402382, 1375135, 1350879, 1329301, 1311052, 1296423, 1284735, 1275319, 1268275, 1263892, 1262146, 1263185, 1267607, 1275632, 1286493, 1299161, 1313356, 1329445, 1347649, 1367871, 1390266, 1415559, 1444385, 1475936, 1507299, 1534805, 1556756, 1574839, 1592556, 1612553, 1635799, 1662748, 1694209, 1730992, 1773406, 1821090, 1872675, 1925609, 1977250, 2026649, 2075015, 2124400, 2176400, 2232136, 2292725, 2359281, 2432538, 2512503, 2598437, 2689502, 2785872, 2888987, 3000307, 3120256, 3248907, 3387140, 3536107, 3695848, 3865535, 4045053, 4235140, 4435707, 4644955, 4860385, 5079631, 5299851, 5517269, 5728191, 5930066, 6121179, 6299903]
59298F299903J64943J50505J35977J21435J06864R2333P7700O2660M6992L0476
59288G289788J2800o117k5953m6488o7795q9495j10402j29437j46403j61313j73539
59277F345646j82410j88128j91274j91842j89573j84984j79152j72689j65532
59268D700062j57589j48861j39268j29013j18921j09743j01332r3085q4851p6777
59258C540622o8654o0210n1898m4635l8834l4257l0579k7534k4800k2338k0632
59247C116251j9978j9874j9738j9875k1024k3198k5676k7966l0100l2182l4295
59236B842345l6644l9207m1427m2824m3651m4300m4463m3616m1984m0185l8191
59225B385853l5481l2058k8428k4642k0327j5665j1386p635l684R88N983J0699
$$ y = [6299903, 6464846, 6615351, 6751328, 6872763, 6979627, 7071960, 7149660, 7212320, 7259312, 7289788, 7302588, 7296471, 7270518, 7224030, 7156235, 7066740, 6956338, 6826901, 6680498, 6519185, 6345646, 6163236, 5975108, 5783834, 5591992, 5402419, 5217435, 5038283, 4865594, 4700062, 4542473, 4393612, 4254344, 4125331, 4006410, 3896667, 3795335, 3702250, 3617399, 3540622, 3471968, 3411758, 3359860, 3315225, 3276391, 3242134, 3211555, 3184021, 3159221, 3136883, 3116251, 3096273, 3076399, 3056661, 3036786, 3015762, 2992564, 2966888, 2938922, 2908822, 2876640, 2842345, 2805701, 2766494, 2725067, 2682243, 2638592, 2594292, 2549829, 2506213, 2464229, 2424044, 2385853, 2350372, 2318314, 2289886, 2265244, 2244917, 2229252, 2217866, 2210231, 2206547, 2207535, 2213518, 2224217]
59213B224217J5041J9029K2213K4003K4360K3769K2593K0656J7467J2774O814
59202B432936Q3p022j4174k0881k6617l1189l4663l6945l7895l7825l7358l6560
59190B111890l4774l1482k6960k1862j6667j1671o989k348K683Q111J3634J9316
59178B002881K5503L2093L8550M4508M9402N1636M9613M4041L8023L4345L3667
59167B444262L5611M0009M6234N2833N9063O5794P3905Q2835R1780J01096J11225
59156C204647J21270J30076J37827J45095J51043J54129J53956J50907J44412
59147D493362J33241J17345R8032P6347N2612K7424J882k3152m7020o8603q6757
59136D774713j01284j12555j20429j24526j25382j24285j22049j18787j14658
$$ y = [2224217, 2239258, 2258287, 2280500, 2304503, 2328863, 2352632, 2375225, 2395881, 2413348, 2426122, 2432936, 2433019, 2425997, 2411823, 2390942, 2364325, 2333136, 2298473, 2261528, 2223633, 2185808, 2148450, 2111890, 2077116, 2045634, 2018674, 1996812, 1980145, 1968474, 1961485, 1959137, 1961820, 1969931, 1983565, 2002881, 2028384, 2060477, 2099027, 2143535, 2192937, 2244573, 2294186, 2338227, 2376250, 2410595, 2444262, 2479873, 2519882, 2566116, 2618949, 2678012, 2743806, 2817711, 2900546, 2992326, 3093422, 3204647, 3325917, 3455993, 3593820, 3738915, 3889958, 4044087, 4198043, 4348950, 4493362, 4626603, 4743948, 4841980, 4918327, 4970939, 4998363, 5000245, 4977093, 4930073, 4861470, 4774713, 4673429, 4560874, 4440445, 4315919, 4190537, 4066252, 3944203, 3825416, 3710758]
59127C710758j09894j04449r8463r2773q8041q3725p8863p3473o8274o3450n8763
59116B790590n4347n0306m5995m0876l5629l1290k7698k4041k0435j7530j5074
59105B427369j2292r417p333n878m013j594N32K068L484M677M907M162L307K668
59091B412647J732K16j738m389q110j2316j5912j8824k1806k4972k7801l0430
59079B248297l3409l6301l8076l8822l9492m0061l9661l8491l7676l7108l5409
59068A833791l2394k9562k7594k5409k2318j9161j6387j2980q491m348j795L7
59056A633389K571N608Q085R972J1911J3813J5146J6064J7035J7846J8011J7740
59044A787191J7659J7952J8531J9511K0860K2123K3198K4814K7516L0593L2694
$$ y = [3710758, 3600864, 3496415, 3397952, 3305179, 3217138, 3133413, 3054550, 2981077, 2912803, 2849353, 2790590, 2736243, 2685937, 2639942, 2599066, 2563437, 2532147, 2504449, 2480408, 2459973, 2442443, 2427369, 2415077, 2405660, 2398327, 2392449, 2388436, 2386842, 2387374, 2389442, 2392926, 2397603, 2402510, 2406672, 2409979, 2412647, 2414379, 2414595, 2412857, 2408468, 2400358, 2388042, 2372130, 2353306, 2331500, 2306528, 2278727, 2248297, 2214888, 2178587, 2140511, 2101689, 2062197, 2022136, 1982475, 1943984, 1906308, 1869200, 1833791, 1801397, 1771835, 1744241, 1718832, 1696514, 1677353, 1660966, 1647986, 1639495, 1635147, 1633352, 1633389, 1635960, 1641568, 1649653, 1659625, 1671536, 1685349, 1700495, 1716559, 1733594, 1751440, 1769451, 1787191, 1804850, 1822802, 1841333, 1860844, 1881704, 1903827, 1927025, 1951839, 1979355, 2009948, 2042642]
59033B042642L3020L1444K7918K2408J5018N772n308j7540k9601m0527n0176n8394
59021A976676o4506o8159o9969p0803p0828o9711o7308o3865n9964n6402n3551
59010A261610n0755m7059m2639l8627l5466l2476k9273k6475k4476k2673k0549
58999H91142j8552j7190j6054j4572j2927j1489j0004q133o251n001m396m037
58987G62536l772l629l452l131k801k421j617k69J179K443L921O120Q899J1638
58973G75644J3814J5162J5594J5201J4113J2367J0210Q333P202O307M841K936
58961I01724J439N66k38j073j289n67O03J720K652L216L247L156L433L677L157
58946I25423K306K268K930K821J310o46k300m166o586q805j0307j1783j3864j5918
$$ y = [2042642, 2075662, 2107106, 2135024, 2157432, 2172450, 2178222, 2172914, 2155374, 2125773, 2085246, 2035070, 1976676, 1912170, 1844011, 1774042, 1703239, 1632411, 1562700, 1495392, 1431527, 1371563, 1315161, 1261610, 1210855, 1163796, 1121157, 1082530, 1047064, 1014588, 985315, 958840, 934364, 911691, 891142, 872590, 855400, 839346, 824774, 811847, 800358, 790354, 782221, 775970, 770969, 766573, 762536, 758764, 755135, 751683, 748552, 745751, 743330, 741713, 741444, 742623, 745066, 748987, 755107, 764006, 775644, 789458, 804620, 820214, 835415, 849528, 861895, 872105, 880438, 887640, 893947, 898788, 901724, 903163, 903729, 903491, 902418, 901129, 900562, 901165, 902885, 905537, 908753, 912000, 915156, 918589, 922266, 925423, 927729, 929997, 932927, 935748, 937058, 936412, 934112, 929946, 923360, 914555, 904248, 892465, 878601, 862683]
58932H62683j7014j7174j6822j5957j4622j3375j2526j1675j0510r236p766n638
58920G10368l198j727j602j527m04J167K149K758L827N471P386R624J2061J3792
58906G60145J4106J3484J2796J2233J1681J1398J1370J0808R234P434O505O512
58894H87706O827P165P593Q116Q959J0551J2686J4398J5324J6256J7745J9067
58882A032393J9383J8957J8475J8129J8190J9484K2169K5010K6870K8178K9924
58871A277162L2065L4063L6151L8817M1653M3977M6099M8854N2311N5933N9722
58860A766807O4090O8970P3851P8570Q3395Q8662R4762J01972J09803J17288J24437
58849B772607J32519J42244J52612J62337J71386J80106J87810J93478J97100
$$ y = [862683, 845669, 828495, 811673, 795716, 781094, 767719, 755193, 743518, 733008, 723772, 716006, 710368, 707170, 705443, 703841, 702314, 701910, 703077, 705226, 707984, 711811, 717282, 724668, 734292, 746353, 760145, 774251, 787735, 800531, 812764, 824445, 835843, 847213, 858021, 867255, 874689, 881194, 887706, 894533, 901698, 909291, 917407, 926366, 936917, 949603, 964001, 979325, 995581, 1013326, 1032393, 1051776, 1070733, 1089208, 1107337, 1125527, 1145011, 1167180, 1192190, 1219060, 1247238, 1277162, 1309227, 1343290, 1379441, 1418258, 1459911, 1503888, 1549987, 1598841, 1651152, 1707085, 1766807, 1830897, 1899867, 1973718, 2052288, 2135683, 2224345, 2319107, 2421079, 2530882, 2648170, 2772607, 2905126, 3047370, 3199982, 3362319, 3533705, 3713811, 3901621, 4095099, 4292199]
58840D292199J99054J98623J94322J85289J71384J52420J28392J00157O9016L5917
58830E726773J784l1999o4090r3753j20220j42288j59333j71993j81048j86406
58820D577427j88041j87009j84500j80505j74534j66983j58788j50362j41860
58811C044845j33820j26520j19294j11541j03819r6943r0702q4429p8219p2476
58801B027082o6989o1521n6697n3201n0614m8082m5495m2988m0104l6551l3038
58790A491802l0192k7348k3730k0018j7381j5532j3285j0473p834n403k576M86
58778A318516L031N172P795J1011J3969J6281J8508K1148K4114K7254L0562L3863
58766A531224L6949L9968M3083M6116M9044N2419N6594O1027O5064O8866P2986
$$ y = [4292199, 4491253, 4689876, 4884198, 5069487, 5240871, 5393291, 5521683, 5621840, 5690856, 5726773, 5728557, 5696558, 5632468, 5538715, 5418495, 5276207, 5116874, 4944881, 4763833, 4577427, 4389386, 4202377, 4017877, 3837372, 3662838, 3495855, 3337067, 3186705, 3044845, 2911025, 2784505, 2665211, 2553670, 2449851, 2352908, 2262206, 2177777, 2099558, 2027082, 1960093, 1898572, 1841875, 1788674, 1738060, 1689978, 1644483, 1601495, 1561391, 1524840, 1491802, 1461610, 1434262, 1410532, 1390514, 1373133, 1357601, 1344316, 1333843, 1326009, 1320606, 1318030, 1318516, 1321547, 1326719, 1334514, 1345525, 1359494, 1375775, 1394283, 1415431, 1439545, 1466799, 1497361, 1531224, 1568173, 1608141, 1651224, 1697340, 1746384, 1798803, 1855397, 1916424, 1981488, 2050354, 2123340]
58755B123340P7573Q2658Q8410R4522J00204J05579J12066J20500J29894J38984
58745C173730J47830J56806J65216J72333J78675J84652J88826J89160J85183
58736D742411J77457J65681J48947J27195J00926P0246L5850J97l4062o6220r6562
58725E372066j24017j46755j64477j78129j87777j92710j93452j91634j87976
58716C805139j82118j74468j66396j58568j50611j42493j34748j27326j19661
58707B448750j11828j04351r7072q9577q2461p6708p2016o7236o2165n7463n3076
58696A574797m8339m3423l9126l5470l1884k8458k5523k2441j8465j4327j1242
58685A256099q794n669k109M90K139M248P054R067R322Q220O081K711j357n053
$$ y = [2123340, 2200913, 2283571, 2371981, 2466503, 2566707, 2672286, 2784352, 2904852, 3034746, 3173730, 3321560, 3478366, 3643582, 3815915, 3994590, 4179242, 4368068, 4557228, 4742411, 4919868, 5085549, 5234496, 5361691, 5462617, 5532863, 5568713, 5568910, 5534848, 5468628, 5372066, 5248049, 5101294, 4936817, 4758688, 4570911, 4378201, 4184749, 3993115, 3805139, 3623021, 3448553, 3282157, 3123589, 2972978, 2830485, 2695737, 2568411, 2448750, 2336922, 2232571, 2135499, 2045922, 1963461, 1886753, 1814737, 1747501, 1685336, 1627873, 1574797, 1526458, 1483035, 1443909, 1408439, 1376555, 1348097, 1322574, 1300133, 1281668, 1267341, 1256099, 1247305, 1241636, 1239527, 1240017, 1242156, 1246404, 1253458, 1262525, 1271847, 1280067, 1286148, 1288859, 1287502, 1282449]
58671A282449q396j2137j5776j7886j8582j9636k1736k3531k3925k3571k3584
58660A073689k4362k6073k8654l0966l1540l0586k9742k9613k9165k7779k6128
58649G59081k4637k2896k1022j9880j9335j8037j5563j3218j2061j1574j0864
58638E69994r846q674p311o161n835n978n584m716m413m722m435l170k058j857
58624D95234j894j519j098r03l31J042K703L964M608M557L955L654M474N965O991
58609E31402P303P361O966N695M330M082M550M255L022J896R26q41l146m616n138
58594E68047n931p107p482p110p464q676r068q089p210p134o532m598k537j315
58580D77794j49J580K972L397L727M523M916M511M583N983P589Q212Q460R344
$$ y = [1282449, 1274053, 1261916, 1246140, 1228254, 1209672, 1190036, 1168300, 1144769, 1120844, 1097273, 1073689, 1049327, 1023254, 994600, 963634, 932094, 901508, 871766, 842153, 812988, 785209, 759081, 734444, 711548, 690526, 670646, 651311, 633274, 617711, 604493, 592432, 580858, 569994, 560148, 551474, 544163, 538002, 532167, 526189, 520605, 515889, 511476, 506754, 502319, 499149, 497091, 495234, 493340, 491821, 490723, 489820, 489489, 490531, 493234, 497198, 501806, 506363, 510318, 513972, 518446, 524411, 531402, 538705, 546066, 553032, 558727, 563057, 567139, 571689, 575944, 578966, 580862, 581788, 580947, 577801, 573185, 568047, 562116, 555009, 547527, 540417, 532953, 524277, 515209, 507120, 499910, 492776, 486244, 481646, 479109, 477794, 477645, 479225, 482197, 485594, 489321, 493844, 498760, 503271, 507854, 513837, 521426, 529638, 538098, 547442]
58566E47442J0515J1208J1690J2512J3565J4784J6598J8778K0251K0936K2258
58555G20537K4987K7973L0056L1731L4008L6967M0402M4489M8865N2352N4469
58544A146836N5993N7368N7923N7326N6229N4701N1535M5827L7878K8017J6273
58533A665906L791p251j6044k3760l1052l6813m0215m2107m3344m3469m2039l9629
58521A303974l6680l2963k8971k5981k3917k1095j6959j3157j0889r181o861m292
58509A073028k098k2J940L163M099O329R865J2437J2476J0673P677K665m494j2080
58495A125658j8946k5785l2631l7557l9517m0081m0602m0013l7364l4166l2053
58484G46943l0241k7457k4426k2232k0167j7461j5304j4824j4730j3238j0908
$$ y = [547442, 557957, 569165, 580855, 593367, 606932, 621716, 638314, 657092, 677343, 698279, 720537, 745524, 773497, 803553, 835284, 869292, 906259, 946661, 991150, 1040015, 1092367, 1146836, 1202829, 1260197, 1318120, 1375446, 1431675, 1486376, 1537911, 1583738, 1621616, 1649633, 1665906, 1669697, 1662446, 1646402, 1622642, 1591590, 1554777, 1514562, 1472455, 1429111, 1385642, 1343603, 1303974, 1267294, 1234331, 1205360, 1179379, 1155462, 1134367, 1117408, 1104251, 1093362, 1084181, 1077320, 1073028, 1070930, 1070908, 1072848, 1076011, 1080110, 1086439, 1096304, 1108741, 1121217, 1131890, 1139567, 1142232, 1137738, 1125658, 1106712, 1080927, 1048296, 1010739, 971222, 931141, 890539, 850526, 813162, 778996, 746943, 716702, 689245, 664819, 642587, 622420, 604959, 589655, 574831, 560101, 546863, 535955]
58473E35955r382q691p961p322p102o471m914l664l795m305l978l569m127m730
58459D55944m074k946k882l579l733l283k858k160q28K20K21R4Q70J866K136K355
58443D37363L416M565M790M698N209N888O247P180R220J0994J1435J1785J3408
58430E36198J5245J5707J5531J6316J7552J7465J5696J3070R834O128K974Q25
58418F82541j613n308r045j1435j3160j5280j6986j7158j6566j6344j5819j4081
58406E29746j2106j1176j0689r588q417p848o938n002l340k973k615j119J81J0
58392D48126k53P97J697Q46q4J163L305L660K662K711L870M356M210N043O902
58377D89011Q469R641J1033J1954J1555J0928J1303J1439R586O566M143J848j503
$$ y = [535955, 526573, 517882, 509921, 502599, 495497, 489026, 484112, 480448, 476653, 472348, 468370, 464801, 460674, 455944, 451870, 448924, 446042, 442463, 438730, 435447, 432589, 430429, 429601, 429821, 430042, 430136, 431006, 432872, 435008, 437363, 440779, 445344, 450134, 454832, 460041, 465929, 472176, 479356, 488576, 499570, 511005, 522790, 536198, 551443, 567150, 582681, 598997, 616549, 634014, 649710, 662780, 672614, 678742, 681716, 682541, 680928, 675620, 666575, 655140, 641980, 626700, 609714, 592556, 575990, 559646, 543827, 529746, 517640, 506464, 495775, 486187, 477770, 469922, 462984, 457982, 454642, 451669, 449054, 447935, 448116, 448126, 447873, 448670, 450367, 451213, 451129, 452292, 455597, 459257, 461919, 464630, 468500, 472856, 477066, 482109, 489011, 497480, 507121, 518154, 530108, 541663, 552591, 563894, 575333, 584919, 591485, 595628, 597476, 595973]
58364E95973m713n880n779o335p115o553n255m771m437k777p15J8K33J652L466
58349E47012M019M395O518R143R722Q964R487J1021J1048R245P257N089J711j626
58335F43005k865l093m899p623q429p407p187q005p593n719m615m869m822m073
58321E61806l776l651k304k80P03J037K229L511L147K245L120M830M531K609K014
58306E81771L101L565L115L651N122N612N329O233P906Q093P113P396R021R924
58292F66952J0164J1582J3692J4302J3823J4444J5570J4636J1932R923Q406N252
58280H10678J385j52M10J32j077q00N31J30j556j307R85K421K910N102Q606J0125
58264H38523R533J0038J2118J3114J2963J4356J6986J7742J6879J7821K0518K1373
$$ y = [595973, 591260, 585380, 579601, 573266, 566151, 559598, 554343, 549572, 545135, 542358, 541643, 541661, 541894, 543546, 547012, 551031, 555426, 561944, 571087, 580809, 589773, 599260, 610281, 621329, 630574, 637831, 642920, 644631, 643005, 640140, 637047, 632148, 624525, 616096, 608689, 601502, 593497, 585904, 580185, 575570, 570701, 565879, 561806, 558030, 554379, 552075, 551795, 552498, 553535, 555764, 559275, 562422, 564667, 567787, 572617, 577148, 579757, 581771, 584872, 588437, 591552, 595203, 600325, 605937, 611266, 617499, 625405, 633498, 640611, 648007, 657028, 666952, 677116, 688698, 702390, 716692, 730515, 744959, 760529, 775165, 787097, 797020, 805426, 810678, 812063, 811911, 812321, 812453, 811376, 810576, 811107, 811237, 809681, 808374, 809359, 811780, 814690, 819792, 828398, 838523, 848056, 858094, 870212, 883326, 896289, 910645, 927631, 945373, 962252, 980073, 1000591, 1021964]
58252A021964K0234K0788K3312K3709K0827J8160J7128J5174J1740R709R616Q660
58240A221021O605O444Q214Q653P785R147J2668J4302J3641J4647J7790J9016
58228A359933J7782J8475K2264K5237K6221K8671L3127L5769L6246L8868M4066
58217A686659M7052M6954M8846N4346N8830O0423O2967O7399O9143O6948O5430
58206B334997O5792O3266N6909N2629N2924N3072N1011N1434N6244O0589O2413
58195B961280O6209P3409P9026Q1945Q8063R8872J07688J11863J17721J28476
58185C914552J38639J45687J55488J70381J83690J92344K02970K19040K34306
58176E557097K45676K59939K80470L00197L15398L33167L57271L80335L98567
$$ y = [1021964, 1042198, 1062986, 1086298, 1110007, 1130834, 1148994, 1166122, 1181296, 1193036, 1202745, 1212361, 1221021, 1227626, 1234070, 1242284, 1250937, 1258722, 1267869, 1280537, 1294839, 1308480, 1323127, 1340917, 1359933, 1377715, 1396190, 1418454, 1443691, 1469912, 1498583, 1531710, 1567479, 1603725, 1642593, 1686659, 1733711, 1780665, 1829511, 1883857, 1942687, 2003110, 2066077, 2133476, 2202619, 2269567, 2334997, 2400789, 2464055, 2520964, 2573593, 2626517, 2679589, 2730600, 2782034, 2838278, 2898867, 2961280, 3027489, 3100898, 3179924, 3261869, 3349932, 3448804, 3556492, 3668355, 3786076, 3914552, 4053191, 4198878, 4354366, 4524747, 4708437, 4900781, 5103751, 5322791, 5557097, 5802773, 6062712, 6343182, 6643379, 6958777, 7291944, 7649215, 8029550, 8428117]
58167H428117M20148M49882M80006N05731N34994N72833O11536O46927O88265
58158A3338439P40626P94234Q43250Q97534R63201J030269J093395J165112J253561
58149B2119621J348034J442925J553710J691396J845132K010197K208097K457728
58141C6676840K754484L101363L528745M054953M661721N341483O131475P063514
58133G3314578Q120758R283534J0567844J1983201J3541129J5352620J7505821
58126A59669485J9556615K0197709J7873719J2089405M097592l862218j0025939
58119B19596368j3865371j5743142j6232856j5821006j4920768j3850871j2766614
58112A16395740j1699696j0661101r665011q699247p746432o828158n986398n234653
$$ y = [8428117, 8848265, 9298147, 9778153, 10283884, 10818878, 11391711, 12003247, 12650174, 13338439, 14079065, 14873299, 15716549, 16614083, 17577284, 18607553, 19700948, 20866060, 22119621, 23467655, 24910580, 26464290, 28155686, 30000818, 32011015, 34219112, 36676840, 39431324, 42532687, 46061432, 50116385, 54778106, 60119589, 66251064, 73314578, 81435336, 90718870, 101286714, 113269915, 126811044, 142163664, 159669485, 179226100, 199423809, 217297528, 229386933, 233484525, 229622307, 219596368, 205730997, 189987855, 173754999, 157933993, 143013225, 129162354, 116395740, 104696044, 94034943, 84369932, 75670685, 67924253, 61096095, 55109697, 49875044]
58104D9875044m562851l973963l478321l062881k700496k383114k117231j894004
58096B5702183j692398j507495j349115j214916j089244r67645q59488p65804
58088A6256078o75946n87786n10685m45442l80720l13446k53935k05421j57103
58079A2725594j04528n8425k3698J2864O2704J20504J82492K62111L70058M95040
58069A4044716O25312P74369R61581J182827J427860J705998K014970K312269
58061B5049902K589992K961643L543045M168227M324554L533832J832924j98169
58053D7805950j901715k979301l499958l639813l526590l264296k958731k672982
58045B3362564k410460k162068j935247j731329j534814j340272j162385j009392
$$ y = [49875044, 45312193, 41338230, 37859909, 34797028, 32096532, 29713418, 27596187, 25702183, 24009785, 22502290, 21153175, 19938259, 18849015, 17881370, 17021882, 16256078, 15580132, 14992346, 14481661, 14036219, 13655499, 13342053, 13088118, 12882697, 12725594, 12621066, 12562641, 12538943, 12551807, 12614511, 12735015, 12917507, 13179618, 13549676, 14044716, 14670028, 15444397, 16405978, 17588805, 19016665, 20722663, 22737633, 25049902, 27639894, 30601537, 34144582, 38312809, 42637363, 46171195, 48004119, 47805950, 45904235, 42924934, 39424976, 35785163, 32258573, 28994277, 26035546, 23362564, 20952104, 18790036, 16854789, 15123460, 13588646, 12248374, 11085989, 10076597]
58037A0076597q71599p44670o40125n63002n00551m42765l95243l62549l36551
58028E219542l10568k89023k74051k57378k34365k12459j97178j82573j63901
58019C098046j47445j39196j34796j28918j24168j22804j19593j10840j01545
58010A968741r6301r1673q4354p8097p5699p2547o5187n8274n6141n5123n0958
57999A184387m6404m4792m3132l8383l3927l3163l2996k9998k6860k6571k6312
57988H01849k3272k0564k1264k2271k0193j7725j8131j8848j6620j3843j3758
57977E95360j4304j2665j1041j2066j3201j1569r849j1410j3858j3338j1257j1038
57965D49764j1890j1336j0373j0782j0790q504o146o061o178m189k394l398m807
$$ y = [10076597, 9204998, 8460328, 7820203, 7257201, 6756650, 6313885, 5918642, 5556093, 5219542, 4908974, 4619951, 4345900, 4088522, 3854157, 3641698, 3444520, 3261947, 3098046, 2950601, 2811405, 2676609, 2547691, 2423523, 2300719, 2181126, 2070286, 1968741, 1872440, 1780767, 1696413, 1618316, 1542617, 1470070, 1404883, 1346609, 1290468, 1235345, 1184387, 1137983, 1093191, 1050059, 1011676, 977749, 944586, 911590, 881592, 854732, 828161, 801849, 778577, 758013, 736749, 714478, 694285, 676560, 658429, 639581, 622961, 609118, 595360, 581056, 568391, 557350, 545284, 532083, 520514, 510665, 499255, 485397, 472059, 460802, 449764, 437874, 426538, 416165, 405383, 394593, 386089, 379943, 373882, 367704, 363515, 361121, 357723, 352916]
57952C52916l465j254j367k251p25K005K765K095K495L597L806M067N571O523
57938C76778N447M618N961O899M818K092J814K020n83m448o214o828r061j1588
57924C71725j1335r516r599j1123j0993r293q572q757p823o205n786n841m539
57911B62343l042l552m815m109k278k127l226k949j420q65j005K68K493L283K571
57896B41570K232K269J226n09j518k345m088n332m254k363k276l196k604r92p24
57881B17096j495j160L7L18L17J893M021M157K950L222N049O047N909O392P307
57866B62060O815N259M675M758L405R45k05P5m25k088l066l068l742n248o088
57851B64062o289p281q682q706p620p336p761p065n478n193o494p338o881o094
$$ y = [352916, 349451, 348197, 346830, 344579, 343854, 345859, 348624, 350719, 353214, 356811, 360617, 364684, 370255, 376778, 382225, 386843, 392804, 399703, 404521, 406613, 408427, 410447, 409864, 405416, 399202, 392374, 383313, 371725, 360390, 350874, 341275, 330152, 319159, 309866, 301294, 292537, 284714, 278509, 272723, 266882, 262343, 259301, 255749, 250934, 246825, 244547, 242420, 239194, 236245, 234825, 233960, 232955, 233223, 235716, 238999, 241570, 243802, 246071, 247297, 246788, 245270, 242925, 238837, 233505, 229251, 226888, 224612, 221416, 218812, 217820, 217096, 215601, 214441, 214478, 214796, 215113, 217006, 221027, 225184, 228134, 231356, 236405, 242452, 248361, 254753, 262060, 268875, 274134, 278809, 283567, 286972, 287917, 287712, 287787, 287362, 285274, 282208, 279140, 275398, 270150, 264062, 257773, 250492, 241810, 233104, 225484, 218148, 210387, 203322, 197844, 192651, 186157, 178819, 171938, 165844]
57837A65844n139l410j987k524l939l676k086j839l112l238j397K67O23J059K299
57822A37745L141L135L379M037M007L488L941N162N344M299L616L418K171k8j159
57807A85696p58n78j339j869j862k425l364l088j660r90j500j572p78m59p00M7
57791A62801J716K285J544J809L945N715N398M150L575L557L607L906L973K763
57777B10744R51O20J865K301P51j238k375l452n049o026n598m615l801k848k079
57762A80151k586l938m150k812j811k028j962o77M50K77k01O0L26j85p28n59m01
57745A59226j066k134l011l821m496m462l877l580l466k617j328j004j733k084
57731A20547j698j746k386k125m16J380K265K693K838K111J029J172K546L341
$$ y = [165844, 160705, 157295, 155308, 152784, 148845, 145169, 143083, 141244, 138132, 134894, 133497, 133764, 134387, 135446, 137745, 140886, 144021, 147400, 151437, 155444, 158932, 162873, 168035, 173379, 177678, 181294, 184712, 186883, 186855, 185696, 184938, 184360, 183021, 181152, 179290, 176865, 173501, 170413, 168753, 167763, 166263, 164691, 163913, 163454, 162754, 162801, 164517, 166802, 168346, 170155, 174100, 179815, 185213, 189363, 192938, 196495, 200102, 204008, 207981, 210744, 211695, 212315, 214180, 216481, 217232, 215994, 213619, 210167, 205118, 199092, 193494, 188879, 185078, 182230, 180151, 177565, 173627, 169477, 166665, 164854, 162826, 160864, 160187, 160637, 160914, 160713, 160773, 161099, 160914, 160186, 159627, 159226, 158160, 156026, 153015, 149194, 144698, 140236, 136359, 132779, 129313, 126696, 125368, 124364, 122631, 120547, 118849, 117103, 114717, 112592, 112176, 113556, 115821, 118514, 121352, 123463, 124492, 125664, 128210, 131551]
57717A31551K899K573L009L197K916L393M652N008M220M348O187P660P166N847
57703A94626M966L709J367p17j386j662k713l807m124m524n734o594o025n027
57689A62355m960n358n183m762m774m770m202l654l618l360k315j240q12m87J29
57674A12989K66n19j320j426j338j348p82L30P40J27p0R00J807J765J756K518
57658A16395L022K570K358L279M051L378K243K266L238M043M552N016M969M282
57644A65662L942M452M865M646M853O137P370P668Q035R380J0704J0899J0707
57631B59320J1165J1696J1458J1020J1171J1549J1946J3250J5627J7603J8548
57620D04353K0065K3233K6594K8868L1443L5865M0881M4620M7884N2540N8123
$$ y = [131551, 134450, 137023, 140032, 143229, 146145, 149538, 154190, 159198, 163418, 167766, 173953, 181613, 188779, 194626, 199592, 203301, 204668, 203951, 202565, 200903, 198190, 194383, 190259, 185735, 180001, 173407, 167382, 162355, 157395, 152037, 146854, 142092, 137318, 132548, 128346, 124692, 121074, 117714, 115399, 114159, 113347, 112860, 112989, 113255, 112736, 111416, 109990, 108652, 107304, 106522, 106852, 107592, 107719, 107649, 108549, 110356, 112121, 113877, 116395, 119417, 121987, 124345, 127624, 131675, 135053, 137296, 139562, 142800, 146843, 151395, 156411, 161380, 165662, 169604, 174056, 178921, 183567, 188420, 194557, 201927, 209595, 217630, 227010, 237714, 248613, 259320, 270485, 282181, 293639, 304659, 315830, 327379, 339325, 352575, 368202, 385805, 404353, 424418, 447651, 474245, 503113, 534556, 570421, 611302, 655922, 703806, 756346, 814469]
57609H14469O2848O6750P1078P5527P8683Q0322Q0692P8301P0805N7456L8781
57598A575712J5129j1831l7279n6064o7179p3302p6542p7065p5279p2454o9008
57587I74838o4397n8847n3323m7931m2223l6763l2554k9175k5415k1452j8496
57576E44262j6551j4479j2049j0029q418o433m175k542j502r6J847L558M775N909
57562D84077O978P777Q894J1086J3870J6116J7741J9560K1729K3728K5521K7514
57550F84591K9649L1691L3891L6163L7375L6593L4370L1487K7293K0790J2509
57539A016402L867m574j2791k0224k6531l2408l8035m1889m2924m2697m3233m3878
57527F71085m2628l9611l6749l4630l2332k9876k8271k7278k5534k2913k0591
$$ y = [814469, 877317, 944067, 1015145, 1090672, 1169355, 1249677, 1330369, 1408670, 1479475, 1536931, 1575712, 1590841, 1579010, 1541731, 1485667, 1418488, 1345186, 1268644, 1191579, 1116300, 1043846, 974838, 910441, 851594, 798271, 750340, 708117, 671354, 638800, 609625, 584210, 562758, 544262, 527711, 513232, 501183, 491154, 482736, 476303, 472128, 469586, 468084, 467988, 469835, 473393, 478168, 484077, 491055, 498832, 507726, 518812, 532682, 548798, 566539, 586099, 607828, 631556, 657077, 684591, 714240, 745931, 779822, 815985, 853360, 889953, 924323, 955810, 983103, 1003893, 1016402, 1020269, 1015695, 1002904, 982680, 956149, 923741, 885706, 843817, 800893, 758196, 714963, 671085, 628457, 588846, 552097, 517467, 485135, 455259, 426988, 399710, 374176, 351263, 330672]
57516C30672j8844j6911j4895j3679j3076j2070j0805j0270j0194r419q107p463
57504A84939p392o679n397m824m948m368k884j832j682j517j145j407k017j462
57490A37385M06J830J847J520J800K129J939J781K144K676L204M108N263N992
57476A74024O306O766P038O296N061M867N921O962P595Q750J0560J1862J2372
57463B74380J3401J5708J8410K0595K2342K3706K4344K4678K5735K7444K8674
57452E19417K9138K9521K9473K7556K3536J8699J3557P331J97o158j1008j5467
57440F65792k0185k4220k6970k9095l0706l0758k9261k7968k7768k7389k5785
57429C65687k3797k2245k0382j7655j5129j3701j2548j0797r044p923o726m903
$$ y = [330672, 311828, 294917, 280022, 266343, 253267, 241197, 230392, 220122, 209928, 200509, 192402, 184939, 177547, 170868, 165471, 160647, 155699, 151331, 148447, 146615, 144933, 143416, 142271, 140864, 138847, 137385, 137791, 139621, 141468, 142988, 144788, 146917, 148856, 150637, 152781, 155457, 158661, 162769, 168032, 174024, 180330, 187096, 194134, 200430, 205491, 210358, 216279, 223241, 230836, 239586, 250146, 262008, 274380, 287781, 303489, 321899, 342494, 364836, 388542, 412886, 437564, 463299, 490743, 519417, 548555, 578076, 607549, 635105, 658641, 677340, 690897, 698228, 698425, 692267, 681259, 665792, 645607, 621387, 594417, 565322, 534616, 503858, 474597, 446629, 418861, 391472, 365687, 341890, 319645, 299263, 281608, 266479, 252778, 240230, 229433, 220389, 212466, 205740, 200837]
57417B00837l388l001k962k379j728j556j129J07J278J700K365M190O230P292
57403B07856Q004R551J1515J2848J3953J5932J8511K0521K1818K3060K4087K4207
57391D11863K3703K3553K3710K2965K0378J5943J0123L596k879r057j5231k1211
57379E07456k5984k8979l0821l2139l2618l2019l1114l0580k9895k8278k5967
57368A79062k3605k1309j9199j7941j7693j7406j6159j4376j2840G087b868q928
57356a1796q750q640p748o531n886n698n354m935m798m664m169l697l650l648
57342h9964l316l069l191l017k109j328j581k342k565k285k083j709n97P95J403
57327a16958R60M2q42j392j349r74j028j579j730j189r85j726k361j862r70r60
$$ y = [200837, 197449, 194448, 191486, 189107, 187379, 185823, 184694, 184801, 186079, 187779, 190144, 194334, 200564, 207856, 215860, 225411, 236926, 249774, 263727, 279659, 298170, 318691, 340509, 363569, 387656, 411863, 435566, 459119, 482829, 505794, 526172, 542115, 552238, 555834, 552955, 543898, 528667, 507456, 481472, 452493, 421672, 389533, 356915, 324896, 293782, 263202, 233307, 205029, 179062, 155457, 134148, 114949, 97008, 79315, 61909, 45750, 31374, 18534, 7087, -2868, -11796, -20546, -29186, -36934, -43465, -49351, -55049, -60403, -65338, -70136, -74800, -78969, -82666, -86316, -89964, -93280, -96349, -99540, -102557, -104666, -105994, -107575, -109917, -112482, -114767, -116850, -118559, -119156, -118361, -116958, -115998, -115956, -116798, -118190, -119539, -120513, -121541, -123120, -124850, -126039, -127024, -128750, -131111, -132973, -133943, -134903]
57311a34903j711k373k984l926m701m686m335m246l879k725j809k337l565l825
57297a82005l116k862l473l941l712l328l192l127l124l298l216k456j641j760
57283b24251k663l303l213k735k099j427j254j907k699k787k451k501k862k899
57269b59051k542k021j062L79J233O19n44o63K54Q74O80K59j53q77j670j841j419
57252b67545j027q24o82r12j650j979j136MJ12m55l83K44J39q56j528j364j051
57235b80893q77k91O67J169J093J239J802K095K019K408L569M754N453O059O954
57220b42780P992R032J0054J0690J0602J0225J0115R801Q452O408M731L502J938
57207a39238P0j321k236l432m792n311m853m400m392m266l887l914m499m907m842
$$ y = [-134903, -136614, -138987, -141971, -145897, -150598, -155284, -159619, -163865, -167744, -170469, -172278, -174615, -178180, -182005, -185121, -187983, -191456, -195397, -199109, -202437, -205629, -208756, -211880, -215178, -218394, -220850, -222491, -224251, -226914, -230217, -233430, -236165, -238264, -239691, -240945, -242852, -245551, -248338, -250789, -253290, -256152, -259051, -261593, -263614, -264676, -264297, -263064, -262445, -262989, -263652, -263398, -262524, -261844, -261585, -261738, -262615, -264285, -266126, -267545, -268572, -269396, -270078, -270990, -272640, -274619, -275755, -275751, -275639, -276094, -276477, -276233, -276094, -276950, -278478, -279842, -280893, -281770, -282061, -281394, -280225, -279132, -277893, -276091, -273996, -271977, -269569, -266000, -261246, -255793, -249734, -242780, -234788, -225756, -215702, -205012, -194410, -184185, -174070, -164269, -155817, -149409, -144678, -141176, -139238, -139168, -140489, -142725, -146157, -150949, -156260, -161113, -165513, -169905, -174171, -178058, -181972, -186471, -191378, -196220]
57192a96220m856n143n166m711m222l805l043j909q93j49M92P65L64j21J74J017
57176b27426J562J817K304K631K053J186J421K727L741L942M048M351M450M597
57162a86596N462O515O632O271P064R110J0781J1408J2016J3004J3402J2976J2972
57149e8983J3888J4598J4443a721A3238J5694J6149J6983J8293J8941J8391J7592
57137A35281J7260J6891J6207J5806J5668J4777J3067J1975J2098J2104J0948
57126B92082R467Q737Q436P939P496P293O784N886N487N907O231N904N476N130
57112C88255M109K317P81j38j238k560k974k461k734m617o786q076r055j0226
57098C44597j0756j0182r386q874p951o699o657q507j1196j4324j8954k5005l0483
$$ y = [-196220, -201076, -206219, -211385, -216096, -220318, -224123, -227166, -229075, -229968, -230117, -229625, -228860, -228496, -228617, -228443, -227426, -225864, -224047, -221743, -219112, -217059, -215873, -214452, -211725, -207984, -204042, -199994, -195643, -191193, -186596, -181134, -174619, -167987, -161716, -154652, -145542, -134761, -123353, -111337, -98333, -84931, -71955, -58983, -45095, -30497, -16054, -1721, 13238, 28932, 45081, 62064, 80357, 99298, 117689, 135281, 152541, 169432, 185639, 201445, 217113, 231890, 244957, 256932, 269030, 281134, 292082, 301549, 310286, 318722, 326661, 334157, 341450, 348234, 354120, 359607, 365514, 371745, 377649, 383125, 388255, 392364, 394681, 395462, 395324, 394086, 391526, 388552, 386091, 383357, 378740, 371954, 363878, 354823, 344597, 333841, 323659, 314273, 305399, 297448, 290749, 284092, 275585, 264389, 250065, 231111, 206106, 175623]
57085A75623l4667l9469m6093B364e6660o5367p3182q1281q8603r6312j05253
57074e66658j13941j21434j29775j41218j55433j71760j91561k15712k42209k69094
57064b318795k97541l29421l64168m00737m40294m84190n31683n82407o38681
57055f387917p02700p74055q52671r41176j041610j153103j276114j415437j575735
57046a6120518j757771j962570k195211k460857k762241l106147l507747l983604
57038c7856666m545585n206515n984476o893679p936616r111123j0415476j1836793
57030i9786929j3343629j4898468j6460745j7964792j9328795k0530198k1639877
57023b23953433k2670024k3312567k2877875k0621831j6245442j0142845l212534
$$ y = [175623, 140956, 101487, 55394, 2364, -56660, -122027, -195209, -276490, -365093, -461405, -566658, -680599, -802033, -931808, -1073026, -1228459, -1400219, -1591780, -1807492, -2049701, -2318795, -2616336, -2945757, -3309925, -3710662, -4150956, -4635146, -5166829, -5749236, -6387917, -7090617, -7864672, -8717343, -9658519, -10700129, -11853232, -13129346, -14544783, -16120518, -17878289, -19840859, -22036070, -24496927, -27259168, -30365315, -33873062, -37856666, -42402251, -47608766, -53593242, -60486921, -68423537, -77534660, -87950136, -99786929, -113130558, -128029026, -144489771, -162454563, -181783358, -202313556, -223953433, -246623457, -269936024, -292813899, -313435730, -329681172, -339824017, -343036551]
57016c43036551L563733R450968J4060425J7286555J9202358J9984499J9881094
57009b39606919J9192931J8229298J7238575J6358488J5618367J4974675J4345791
57002a23648794J3641819J2798935J1805808J0700872R546100Q403020P322455
56995d9429785O339638N470484M714403M063005L506006L031826K628451K285958
56987a7390014J996481J751769J543177J364134J210342J077627R61745Q60239
56979f624500P72288O96436O30145N71549N19867M74013M32496L94838L61452
56970a771416L31973L05160K80557K58705K39418a34198F9787J87826J73273J59334
56960E90220J45035J30875J18053J06824R6432Q6335P6768O8232O0783N3956M7167
$$ y = [-343036551, -339472818, -330021850, -315961425, -298674870, -279472512, -259488013, -239606919, -220413988, -202184690, -184946115, -168587627, -152969260, -137994585, -123648794, -110006975, -97208040, -85402232, -74701360, -65155260, -56752240, -49429785, -43090147, -37619663, -32905260, -28842255, -25336249, -22304423, -19675972, -17390014, -15393533, -13641764, -12098587, -10734453, -9524111, -8446484, -7484739, -6624500, -5852212, -5155776, -4525631, -3954082, -3434215, -2960202, -2527706, -2132868, -1771416, -1439443, -1134283, -853726, -595021, -355603, -134198, 69787, 257613, 430886, 590220, 735255, 866130, 984183, 1091007, 1187439, 1273774, 1350542, 1418774, 1479557, 1533513, 1580680]
56949A580680M0244L3360K6410J8746J0131J556n635j1517j7591k4713l1942l8016
56937A581713m3314m9393n6834o4468p0710p4818p6705p6347p3870o9696o4218
56926H61340n7692n0734m4290l8704l3368k7739k2077j6607j0724l864L550J1057
56914E70148J9395K9627M1927N6610P5032R7018J18427J35069J48827J64640J78865
56903A635585J75654J40806P8401R281m6810q4193j07736j22836j31779j35891
56893A410482j36416j33548j26942j17187j05501r2628p9333o7220n7658n0240
56883D43809m3526l7028l1411k7167k4131k1984k0251j7996j4635j0894p944n741
56871A81101l189j06K069J881o14m204p760j0614j2395j3058j3017j2804j2602
$$ y = [1580680, 1620924, 1654284, 1680694, 1699440, 1709571, 1711127, 1705492, 1693975, 1676384, 1651671, 1619729, 1581713, 1538399, 1489006, 1432172, 1367704, 1296994, 1222176, 1145471, 1069124, 995254, 925558, 861340, 803648, 752914, 708624, 669920, 636552, 608813, 586736, 570129, 559405, 555541, 559091, 570148, 589543, 619170, 661097, 717707, 792739, 889757, 1008184, 1143253, 1292080, 1456720, 1635585, 1811239, 1952045, 2030446, 2039727, 1992917, 1908724, 1800988, 1678152, 1546373, 1410482, 1274066, 1140518, 1013576, 896389, 790888, 698260, 618927, 551707, 494049, 443809, 400283, 363255, 331844, 304677, 280546, 258562, 238311, 220315, 205680, 194786, 186842, 181101, 177912, 177806, 179875, 181756, 181142, 176938, 169178, 158564, 146169, 133111, 120094, 107290, 94688]
56858I4688j2160j1112r383p434o062n654n647n080l727k353j704j674j726j785
56844A9187k167k786k969k312j309p91r35j113p20K08J317K482L746M896N496
56829B2230N476N470O249P914R652J0442R880Q352O478M577K738J210M37O39J528
56814A03272K537L247L569L635L680L927M543N666P397R662J2112J4364J6297
56801A93908J7995J9426K0353K0473J9400J6607J1888N971L07l980o732q289q821
56788B98506q371p204n732m183k546p04J524M271P432J0684J3859J7068K0358
56775C44962K3530K6386K8787L0182K9406K5362J7939Q215j982j0725j6676j9597
56763D85789k0198j9416j7943j6320j4896j3552j1832r527o764l501M56M677Q103
$$ y = [94688, 82528, 71416, 62033, 54599, 48537, 42883, 37236, 32156, 28429, 26076, 24372, 22698, 20972, 19187, 17020, 14234, 11265, 8953, 7644, 6853, 5918, 4805, 4085, 4293, 5610, 8092, 11838, 16734, 22230, 27706, 33176, 39425, 47339, 56991, 67433, 77313, 85665, 92143, 96720, 99458, 100668, 101105, 101744, 103272, 105809, 109056, 112625, 116260, 119940, 123867, 128410, 134076, 141473, 151135, 163247, 177611, 193908, 211903, 231329, 251682, 272155, 291555, 308162, 320050, 326021, 326328, 322348, 315616, 307327, 298506, 290135, 282931, 277199, 273016, 270470, 269766, 271290, 275561, 282993, 293677, 307536, 324604, 344962, 368492, 394878, 423665, 453847, 483253, 508615, 526554, 534769, 532787, 522062, 505386, 485789, 465591, 446175, 428232, 411912, 397016, 383464, 371632, 362105, 355341, 351840, 352296, 356973, 365076]
56750C65076J0254J2014J4648J8364K2047K3847K1809J4912M466o113j3875j8498
56738D68951k1400k3298k3687k2339k0063j7764j5681j3693j1706r536p088m689
56726B78007k682p39J786M755P341R245J0889J2120J1663Q504L238k529p621j1617
56712C22360j4239j5266j4991j4178j3451j3000j2793j2681j2283j1180r424p650
56700A71224o456n797n160m309l548l197l080k809k415k244k291k091j377n16
56686A25934k1J2j21j73j05j03m32j070j456j081k88Q6o2N2P78J343J031K79p6
56667A24527q4m09j136j682j654j191n64n7K1k83m26j51o1p49j709j894j144l27
56649A11027j56n10q50o73L01J791K910L037K541K119J790J213O43O23R04O10
$$ y = [365076, 375330, 387344, 401992, 420356, 442403, 466250, 488059, 502971, 507437, 501324, 487449, 468951, 447551, 424253, 400566, 378227, 358164, 340400, 324719, 311026, 299320, 289784, 282696, 278007, 275325, 274586, 276372, 281127, 288468, 297713, 308602, 320722, 332385, 340889, 344127, 341598, 333977, 322360, 308121, 292855, 277864, 263686, 250235, 237235, 224442, 211761, 199478, 188298, 178874, 171224, 164768, 158971, 153811, 149502, 145954, 142757, 139677, 136868, 134453, 132209, 129918, 127827, 126450, 125934, 125913, 125925, 125804, 125631, 125526, 125423, 124991, 123921, 122465, 121384, 121096, 121182, 121120, 121172, 121950, 123293, 124324, 124603, 124527, 124443, 124034, 122898, 121216, 119562, 118371, 117807, 117750, 117771, 117488, 117062, 116911, 116850, 116101, 114392, 112498, 111354, 111027, 110871, 110361, 109511, 108838, 109139, 110930, 113840, 116877, 119418, 121537, 123327, 124540, 125183, 125806, 126710, 127320]
56633A27320m60j525j863j465p26j23j45p97j270q32R5M78J32k81m84p80j096
56616A16178r29l30N3J13M06R84J158P00K88L50M80L45K64M18L22k87q67q49m10
56597A18387O7N36R17Q74N13M95R60J011j6j397j858j125l5N89O17M49O53J485
56579A23122K506K957K727K427K403K265J804J616K219L043L004J841L33o53r26
56564A50688r56j337k121k641k244j198m59m82q53j140j319j253n46O66J533J545
56548A37883J204J158J283J136P14K92p3l45k93R5M29N76R51J707K206J956J477
56531A52356J572K123K333J892J177N05j23n76n33J9O30Q48O77N08O76J039J064
56514A66187N33QJ54P72J079Q57N90M36P0k70L58K124L773M214L996M312N144
$$ y = [127320, 126860, 125335, 123472, 122007, 121281, 121158, 121013, 120216, 118946, 118114, 118209, 118687, 118819, 118538, 118054, 117274, 116178, 115249, 114919, 114972, 115085, 115491, 116475, 117633, 118333, 118621, 118971, 119451, 119796, 120060, 120478, 120800, 120513, 119646, 118797, 118387, 118454, 118990, 119907, 120781, 121294, 121789, 122749, 123760, 123744, 122347, 120489, 119364, 119329, 119918, 120535, 120984, 121637, 123122, 125628, 128585, 131312, 133739, 136142, 138407, 140211, 141827, 144046, 147089, 150093, 151934, 152267, 151614, 150688, 149732, 148395, 146274, 143633, 141389, 140191, 139732, 139250, 138397, 137257, 135938, 134685, 134139, 134805, 136338, 137883, 139087, 140245, 141528, 142664, 143378, 143670, 143597, 143252, 142959, 143054, 143483, 144059, 145010, 146717, 148923, 150879, 152356, 153928, 156051, 158384, 160276, 161453, 161958, 161835, 161259, 160726, 160745, 161375, 162223, 162900, 163408, 164084, 165123, 166187, 166720, 166728, 166882, 167654, 168733, 169590, 170180, 170616, 170686, 170416, 170774, 172898, 176671, 180885, 184881, 189193, 194337]
56497A94337N483M987M417M478N055N674O039O033N718N456N635O218O771O854
56483B73155O281N138L831K872K372J914J133J56p16j410j956k340k742l553m751
56468B79384n621n491m577l817l956m955o028o193n108l590k933l573m755n527
56454B13260n606n143m365l673l549l979m415m509m412m184l592k761k364k659
56440A58049l005k773k135j545j025n73n93j188j554q61N06J367J262Q95J053
56425A47880J625J941J706J374J538K055K182J659J221J528K059J917J351J416
56411A71452K206K643K155J427J136J065R17R55J254J366J239J559K491L131K831
56396A97827K226K157K524K914L416M040M185L575K915K760K550J742J010J252
$$ y = [194337, 199820, 204807, 209224, 213702, 218757, 224431, 230470, 236503, 242221, 247677, 253312, 259530, 266301, 273155, 279436, 284574, 288405, 291277, 293649, 295563, 296696, 296852, 296136, 294726, 292770, 290430, 287688, 284135, 279384, 273763, 268272, 263695, 259878, 255922, 250967, 244939, 238746, 233638, 230048, 227115, 223542, 218787, 213260, 207654, 202511, 198146, 194473, 190924, 186945, 182530, 178021, 173609, 169425, 165833, 163072, 160708, 158049, 155044, 152271, 150136, 148591, 147566, 146993, 146400, 145212, 143658, 142797, 143303, 144670, 145932, 146827, 147880, 149505, 151446, 153152, 154526, 156064, 158119, 160301, 161960, 163181, 164709, 166768, 168685, 170036, 171452, 173658, 176301, 178456, 179883, 181019, 182084, 183001, 183956, 185210, 186576, 187815, 189374, 191865, 194996, 197827, 200053, 202210, 204734, 207648, 211064, 215104, 219289, 222864, 225779, 228539, 231089, 232831, 233841, 235093]
56382B35093K170K911L440M102M456L851K734K085J905J432O81M60Q86J018J97
56367B67421j103k015k201j942j742j961k511k919k873k462j856j252j212k252
56353B39120l786m369l497k352k101k401k370k134k315k681k417j436m70k5k7
56338B06739k35m35m50m20o74j114j316j386j798k193j550n5O16k88j343j159
56322A92939m88p28j585j815j315r00o76k17K43J98m6m4k05q46j048K2J309J206
56304A86004O5l64L79J099J061P43N15J72j40O0N45O46M56O64J247J583J665J972
56286A98372K308K057J437J271J590J712J498J395J447J391J444J887K211J890
56272B21910J508J824K310K085J688K246L294L361K414J883K305K789K851K983
$$ y = [235093, 237263, 240174, 243614, 247716, 252172, 256023, 258757, 260842, 262747, 264179, 264860, 265320, 266206, 267224, 267421, 266318, 264303, 262102, 260160, 258418, 256457, 253946, 251027, 248154, 245692, 243836, 242584, 241372, 239120, 235334, 230965, 227468, 225116, 223015, 220614, 218244, 216110, 213795, 211114, 208697, 207261, 206791, 206766, 206739, 206504, 206069, 205619, 205199, 204525, 203411, 202095, 200709, 198911, 196718, 195168, 195113, 195729, 195441, 194098, 192939, 192451, 191723, 190138, 188323, 187008, 186108, 185432, 185215, 185458, 185656, 185610, 185566, 185361, 184515, 183467, 183489, 184798, 186004, 186069, 185705, 186084, 187183, 188244, 188987, 189502, 189674, 189534, 189594, 190139, 190785, 191241, 191905, 193152, 194735, 196400, 198372, 200680, 202737, 204174, 205445, 207035, 208747, 210245, 211640, 213087, 214478, 215922, 217809, 220020, 221910, 223418, 225242, 227552, 229637, 231325, 233571, 236865, 240226, 242640, 244523, 246828, 249617, 252468, 255451]
56258B55451L235K974K298K110K527K761K677K976L616L707L165K963L353L451
56244B97264K911K562K866L127K697J843R72J27m10j56O76J250J220R26M92k31
56228C18136r73j391j804k554k962k282j232j091j647j669j034o23m32K81J148
56213B99871J013J52Q9J047J625J291J142J755K262K220K560L899N500O498O820
56198C37744O448N308M216M417N764O882P326P968R000R349Q597P755P603P826
56184D36203Q118Q621Q892Q098O636N871N886N293L604K030J504J621K004K837
56170E07218L590L098J580P56J322K077K135K116K472K462J713J080J019O68o06
56155E32700k149l231l971m410m118l293k891l208l585l761m053m138l303k089
$$ y = [255451, 258686, 261660, 263958, 266068, 268595, 271356, 274033, 277009, 280625, 284332, 287497, 290460, 293813, 297264, 300175, 302737, 305603, 308730, 311427, 313270, 314242, 314369, 313959, 313803, 314479, 315729, 316949, 317875, 318367, 318136, 317163, 315772, 313968, 311414, 308452, 306170, 304938, 303847, 302200, 300531, 299497, 298874, 298442, 298723, 299871, 300884, 301036, 301125, 302172, 303797, 305088, 306230, 307985, 310247, 312467, 315027, 318926, 324426, 330924, 337744, 344192, 349500, 353716, 358133, 363897, 370779, 378105, 386073, 395073, 404422, 413019, 420774, 428377, 436203, 444321, 452942, 461834, 469932, 476568, 482439, 488325, 493618, 497222, 499252, 500756, 502377, 504381, 507218, 510808, 513906, 515486, 516242, 517564, 519641, 521776, 523892, 526364, 528826, 530539, 531619, 532638, 533306, 532700, 530551, 527320, 523349, 518939, 514821, 511528, 508637, 505429, 501844, 498083, 494030, 489892, 486589, 484500]
56141D84500j907k815l434l220k917k690j862o81k82o83q86r97j896k892k249
56126D55089l72L54p57j852j839j687j772j008N51J125L18K4J184K358K656L191
56110D57563M426M860L800K839L140L722L674L597L703L104K195K911N432P376
56096E12342P586P703Q722R149Q214P693Q680R576R265R267J0735J2206J2534
56083F33672J3165J5230J7108J7216J6719J7237J8285J9112K0552K3049K5318
56072H36663K6942K9666L4262L8894M2466M6663N2599N8684O4143P1379Q2171
56061A384532R4557J06122J17309J28707J38000J42509J41996J36438J24416J06865
56051B621451Q9213P6218O7136N8970N1305M4570L6629K5311J2188K99r768j8443
$$ y = [484500, 482593, 479778, 476344, 473124, 470207, 467517, 465655, 464974, 464692, 464009, 463123, 462126, 460230, 457338, 455089, 454717, 455071, 454314, 452462, 450623, 448936, 447164, 446156, 446707, 447832, 448150, 448174, 449358, 451716, 454372, 457563, 461989, 466849, 470649, 473488, 476628, 480350, 484024, 487621, 491324, 494428, 496623, 499534, 504966, 512342, 519928, 527631, 536353, 545502, 553716, 561409, 570089, 579665, 588930, 598197, 608932, 621138, 633672, 646837, 662067, 679175, 696391, 713110, 730347, 748632, 767744, 788296, 811345, 836663, 863605, 893271, 927533, 966427, 1008893, 1055556, 1108155, 1166839, 1230982, 1302361, 1384532, 1479089, 1585211, 1702520, 1831227, 1969227, 2111736, 2253732, 2390170, 2514586, 2621451, 2710664, 2786882, 2854018, 2912988, 2964293, 3008863, 3045492, 3070803, 3082991, 3083290, 3073522, 3055079]
56039C055079k4599k8051l2297m1108n4215o9271q5448j01860j15155j22464j24667
56028B255944j23607j18716j09712r9672r1553q4221p5550o6746n9800n3450m5831
56017A327086l8574l4036l0912k6697k2234j9655j8128j5728j3212j1947j0436
56006A085527o952l267j744j172N50K234K037J514K840M776N510O615R813J2929
55992A121210J3450J3059J4106J5022J3942J3308J5661J8454J8463J7769J9740
55981A294184K2614K3046K2543K4211K6497K6463K5990K8262L1456L2409L3124
55970A590799L6802M0919M1492M0857M3685M8541N1035N2302N6339O1878O4970
55959B129619O6848P1216P6442P8611P9551Q3582Q9206R2329R4702J00441J07418
$$ y = [3055079, 3030480, 3002429, 2970132, 2929024, 2874809, 2805538, 2720090, 2618230, 2503075, 2380611, 2255944, 2132337, 2013621, 1903909, 1804237, 1712684, 1628463, 1552913, 1486167, 1426367, 1372917, 1327086, 1288512, 1254476, 1223564, 1196867, 1174633, 1154978, 1136850, 1121122, 1107910, 1095963, 1085527, 1078575, 1075308, 1073564, 1072392, 1072942, 1075176, 1077213, 1078727, 1081567, 1086343, 1091853, 1098468, 1108281, 1121210, 1134660, 1147719, 1161825, 1176847, 1190789, 1204097, 1219758, 1238212, 1256675, 1274444, 1294184, 1316798, 1339844, 1362387, 1386598, 1413095, 1439558, 1465548, 1493810, 1525266, 1557675, 1590799, 1627601, 1668520, 1710012, 1750869, 1794554, 1843095, 1894130, 1946432, 2002771, 2064649, 2129619, 2196467, 2267683, 2344125, 2422736, 2502287, 2585869, 2675075, 2767404, 2862106, 2962547, 3069965]
55948C069965J11116J13827J20705J29998J36835J43174J53930J66673J75876
55939D322099J83970J97157K13476K26481K37596K52976K71270K86716L01265
55930F493006L21034L43868L63311L81612M05519M32791M56991M81669N14803
55921A0194604N53156N88028O22481O65935P15709P61898Q06730Q60232R20788
55912A6689561R79979J042525J120160J209976J301508J400756J522902J666697
55904B6934064J822879K002932K230820K512416K844194L243189L730461M293363
55896D9614318M908973N600898O428725P431546Q632156J0071153J1754736J3585838
55888A18028343J5443977J7278661J8886108J9508065J7942100J3435679O556129
$$ y = [3069965, 3181081, 3294908, 3415613, 3545611, 3682446, 3825620, 3979550, 4146223, 4322099, 4506069, 4703226, 4916702, 5143183, 5380779, 5633755, 5905025, 6191741, 6493006, 6814040, 7157908, 7521219, 7902831, 8308350, 8741141, 9198132, 9679801, 10194604, 10747760, 11335788, 11958269, 12624204, 13339913, 14101811, 14908541, 15768773, 16689561, 17669540, 18712065, 19832225, 21042201, 22343709, 23744465, 25267367, 26934064, 28756943, 30759875, 32990695, 35503111, 38347305, 41590494, 45320955, 49614318, 54523291, 60124189, 66552914, 73984460, 82616616, 92687769, 104442505, 118028343, 133472320, 150750981, 169637089, 189145154, 207087254, 220522933, 227079062]
55881B27079062r86553p456219j2013661j4709545j5939336j6092747j5532570
55874A44348431j4594554j3502760j2351498j1184464j0040003q932945p863430
55867F5878777o857831n960679n185898m513508l931347l443216l038466k690257
55859C0257575k386298k131525j919934j731939j560467j413655j290450j177399
55851A6645908j070612r78384r00704q26931p55096o93809o43632n95076n46420
55842I635244n05867m74457m43575m11088l84037l63566l42247l18304k98264
55833F093839k83555k67931k50065k35791k25950k14232j99006j85785j76291
55824D055233j66026j54140j45040j38929j30978j20918j13499j08694j01440
$$ y = [227079062, 226092509, 218636290, 206622629, 191913084, 175973748, 159881001, 144348431, 129753877, 116251117, 103899619, 92715155, 82675152, 73742207, 65878777, 59020946, 53060267, 47874369, 43360861, 39429514, 35986298, 32947832, 30257575, 27871277, 25739752, 23819818, 22087879, 20527412, 19113757, 17823307, 16645908, 15575296, 14596912, 13696208, 12869277, 12114181, 11420372, 10776740, 10181664, 9635244, 9129377, 8654920, 8211345, 7800257, 7416220, 7052654, 6710407, 6392103, 6093839, 5810284, 5542353, 5292288, 5056497, 4830547, 4616315, 4417309, 4231524, 4055233, 3889207, 3735067, 3590027, 3451098, 3320120, 3199202, 3085703, 2977009, 2875569]
55815B875569r1685q4646q0378p3193o2390n3547m7953m0567k9963k0852j5094
55804B275301r396l791l502j0268j9889l0064m2615n6461o6614p2002p6610q1299
55792A802790q2199p8728p5378p3708p0222o3994n8975n6564n3164m7276m2203
55781A100379l9503l6401l1838k8647k7556k5302k0711j6696j4375j1176o511
55770H41663l329k222O9M455P670Q421R566J2286J3547J1240O565m4r684k0267
55756H79936k6875k8589k9509l1499l1775k9249k7055k6678k5479k2364k0149
55745E80715j9826j8245j4105j0764j0286r988p783n850n943n975m368l267m323
55732D59992n546n212m753n157m685k832k288m230n894n536n529p605r258q110
$$ y = [2875569, 2783884, 2699238, 2618860, 2545667, 2483277, 2429730, 2381777, 2341210, 2311247, 2290395, 2275301, 2265905, 2262114, 2258612, 2248344, 2228455, 2198391, 2155776, 2099315, 2032701, 1960699, 1884089, 1802790, 1720591, 1641863, 1566485, 1492777, 1422555, 1358561, 1299586, 1243022, 1189858, 1142582, 1100379, 1060876, 1024475, 992637, 963990, 936434, 911132, 890421, 873725, 859350, 848174, 841663, 838334, 836112, 836181, 840636, 848306, 856727, 866293, 878579, 892126, 903366, 909931, 909887, 900203, 879936, 853061, 824472, 794963, 763464, 731689, 702440, 675385, 648707, 623228, 600864, 580715, 560889, 542644, 528539, 517775, 507489, 497501, 489718, 483868, 477925, 471950, 467582, 464315, 459992, 454446, 449234, 444481, 439324, 434639, 431807, 429519, 425289, 419395, 413859, 408330, 400725, 391467, 383357]
55718C83357n940n123m596k703p32m52j056j427k478m660o098n823n811p403q691
55703C20364q000o816o700o355m511k789k971m039m488m945o073o564n678n086
55689B45349n861o340n288m412n171n923m833l137k721k911k310j640k084k875
55675A89843k875k668k845k400r16o5q23j488p04p2j325l202l684l222l239l368
55659A56947k746k212k749l383k947k312k660l154k488j163k26O30J777K205J366
55644A36885P42J537K463J828K82n84p74j129j444j231r71j031p60r1k71j536
55628A33915k040o85R79J404J515K590L759L705L084L131L510L480L527L928L441
55613A69243J399o93j559k331m287o282o635n878n354m721l203j773j703k217
$$ y = [383357, 377417, 372294, 367698, 364995, 364263, 363811, 362755, 361328, 358850, 354190, 348092, 342269, 336458, 329055, 320364, 312364, 305548, 298848, 292493, 287982, 285193, 282222, 278183, 273695, 268750, 262677, 256113, 250435, 245349, 239488, 233148, 227860, 223448, 218277, 212354, 207521, 204384, 201663, 198752, 196442, 194802, 192718, 189843, 186968, 184300, 181455, 179055, 178139, 178074, 177251, 175763, 175059, 174987, 173662, 170460, 166776, 163554, 160315, 156947, 154201, 151989, 149240, 145857, 142910, 140598, 137938, 134784, 132296, 131133, 130907, 131537, 133314, 135519, 136885, 137627, 139164, 141627, 143455, 143737, 143153, 142379, 141250, 139806, 138575, 137604, 136573, 135813, 135722, 135451, 133915, 131875, 131190, 132169, 133573, 135088, 137678, 141437, 145142, 148226, 151357, 154867, 158347, 161874, 165802, 169243, 170642, 169949, 168390, 166059, 161772, 155490, 148855, 142977, 137623, 132902, 129699, 127926, 126223, 124006]
55599A24006j878j136j271j968k055j687j707j797j175k51Q5m8j73m94r94q70
55583A06587j65l37j825k830k095r63r36j174n03N5q56k260k412j645j312j306
55567H6023q80n90j077j282j45J165R80j54p20q90j530j953j170k52q46k175k178
55550G2326q70p0l97r38j373k089k595j950n44M59R33J399J503O28o47j414j927
55533F2434k627k732j647o28r48j524n58J349K069J210K13j40j99M5Q07J368J012
55516E9504N28R52J598J326Q66J684L264L782K969K174K075K345L025M139M557
55501I4788L381J867J854K838K785J263l84j521k558l239k848j932j711k094k211
55486I0278k363l294m134l419j802j348k375l300l434l497l513k642j229o52r43
$$ y = [124006, 122128, 120992, 119721, 117753, 115698, 114011, 112304, 110507, 109332, 109081, 109166, 109118, 108945, 108451, 107457, 106587, 106422, 106085, 104260, 101430, 99335, 98372, 97436, 96262, 95759, 95814, 94958, 92698, 90286, 88641, 87329, 86023, 85143, 84553, 83476, 82194, 82049, 83214, 84194, 84040, 83320, 82430, 80900, 78947, 77777, 77525, 76679, 74504, 72326, 71456, 71386, 70989, 70051, 68678, 66589, 63994, 62044, 61500, 61959, 62892, 64291, 65794, 66422, 65775, 64361, 62434, 59807, 57075, 55428, 54800, 53852, 52328, 51770, 53119, 55188, 56398, 56611, 56471, 56272, 56317, 57124, 58492, 59504, 60032, 60984, 62582, 63908, 64774, 66458, 69722, 73504, 76473, 78647, 80722, 83067, 86092, 90231, 94788, 98169, 100036, 101890, 104728, 107513, 108776, 108392, 106871, 104313, 101074, 98226, 96294, 94583, 92489, 90278, 87915, 84621, 80487, 77068, 75266, 73918, 71543, 68243, 64809, 61312, 57799, 55157, 53928, 53276, 52333]
55471E2333o97L98J089Q38M50K32m46j442j694j051m94k86K45R39P67k03p55o76
55453D9547j038k013k296j280n8L80L36L27K37N5J57M52L83l1k35k38n35r84j033
55434D2133q83j138j532j362r15j014j469j414r08o43m60K13Q90O85O6Q5L89q8
55416C2635r38r07l59o90j556j167N23J448O36n40q37o86o64m90j51j97m20M7
55398B5687R36J011K94J12O74O58k96q60l68J93K04L33P53N15m89r06k14L86J88
55379B8811J34P42Q54k22j203q37J37M50K69L81O60O22N14O68P17M38M00Q51J005
55360C5391K86o57j027r78r19o90j97P7q8j29L54R95J501K082K642K605J992J584
55342D4824J632J528J175J260J705J310l12j806j951j234p09m43l0L26K65j8k79
$$ y = [52333, 51636, 52034, 53123, 53961, 54411, 54643, 54197, 52755, 51061, 50010, 49516, 49230, 49475, 50414, 51181, 50978, 50223, 49547, 48509, 46496, 44200, 42920, 42862, 43242, 43578, 43905, 44142, 44197, 44354, 44806, 45189, 45158, 44923, 44685, 44150, 43166, 42133, 41250, 40112, 38580, 37218, 36303, 35289, 33820, 32406, 31498, 30855, 30395, 30608, 31498, 32183, 32249, 32334, 32723, 32635, 31697, 30790, 30431, 29741, 28185, 27018, 27541, 28989, 29625, 29085, 28248, 27562, 26898, 26408, 26257, 26060, 25640, 25687, 26623, 27634, 27928, 28040, 28714, 29372, 29076, 28216, 27848, 28041, 28245, 28578, 29331, 29846, 29357, 28451, 28237, 28623, 28811, 28945, 29687, 30541, 30319, 29116, 28279, 28416, 28866, 29135, 29516, 30176, 30798, 31312, 31980, 32697, 33135, 33535, 34386, 35391, 35677, 35020, 33993, 33015, 32096, 31406, 31209, 31286, 31198, 31069, 31423, 32418, 33919, 36001, 38643, 41248, 43240, 44824, 46456, 47984, 49159, 50419, 52124, 53434, 53122, 51316, 49365, 48131, 47422, 46979, 46949, 47275, 47540, 47522, 47243]
55325D7243p81j693k578k933k657j807o11K59K77q9j24j46p46j167k72J142J062
55308C4379n48j531r15j69l48m02N12J231O36l54m65j16k49m98j28L55J11n21
55290C0980p56o61n50j25O49R69N75M78J145J303kj514j566o64m16q53o82L34
55272B8644J085R85N50K38k0k26k93m65q97j135q06l11j39l5K53K61k98o52p8
55253B6661Q14J008O62O21Q67O99P0m41o40p37o30j61K55J52j17Q1N80P38N03
55234C0985L37L73M24M84N57K98m21j015r57n86m90n36l18%O6R3M02O68M53O0
55214C0877m1j32o71j163p29M18J073O21l21q78p86k36M53Q86P80K67k56n47o06
55195B9009m99l22j90j19k7Q3J99M49Q20Q91L87k02k38J1j93p47r00o26o58r47
$$ y = [47243, 46462, 44769, 42191, 39258, 36601, 34794, 34183, 34442, 34719, 34630, 34506, 34360, 33614, 32447, 32175, 33317, 34379, 33831, 32300, 31385, 31216, 30868, 30466, 30978, 32209, 32845, 32491, 32026, 31910, 31661, 31163, 31035, 31390, 31501, 30980, 30224, 29563, 29013, 28888, 29537, 30506, 31081, 31559, 32704, 34007, 34005, 32491, 30925, 30261, 29845, 28992, 28310, 28644, 29729, 30714, 31264, 31502, 31482, 31256, 30963, 30498, 29601, 28466, 27660, 27349, 27210, 27175, 27428, 27689, 27391, 26739, 26661, 27475, 28483, 29145, 29766, 30633, 31332, 31402, 30961, 30321, 29584, 28954, 28793, 29048, 29200, 29083, 29164, 29744, 30482, 30985, 31322, 31695, 32119, 32603, 33160, 33458, 33037, 32022, 31065, 30479, 29989, 29453, 29135, 29135, 29201, 29294, 29696, 30364, 30817, 30877, 30836, 30704, 30033, 28870, 28141, 28559, 29632, 30253, 29932, 29054, 28268, 28032, 28485, 29371, 30151, 30418, 30162, 29615, 29009, 28510, 28188, 27998, 27879, 27852, 27935, 28134, 28583, 29403, 30294, 30681, 30479, 30241, 30252, 30059, 29312, 28412, 27786, 27128, 26181]
55175B6181o23L39Q06L87J48P15J092L63o80p38Q6P09O51K39j80l28M4O61Q15
55156C0687M58M13R26J120N12n9J65O27N48J95J06M2l17n29k32P0k2jM15N14r0
55135C5548m82M3O52M60R4L28L87p10k046k009q82k58m14j84O58R03l3j165j420
55116B9470q61j26L68M78L72M69P67N96l14j080q84k51j22l24k16j55q28j577
55098B5782j063N80J768J671J088R10R94P62M6q85j471j150j28M45p5p89n46K64
55080B8203M27j04l09P0K59q0l89k82N6N67J291J746J413P68P25J170J199O72
55062C7402K96K25j4k18M51J767K317J509N50O99J568J933J434P33M25M79N58
55045E2114M13k0p45j764k828l210k302n84O41Q05O42P47N99k69j124j139p47
$$ y = [26181, 25558, 25897, 26703, 27090, 27238, 27953, 29045, 29408, 28728, 27990, 28076, 28785, 29436, 29675, 29495, 29167, 29211, 29872, 30687, 31145, 31558, 32484, 33604, 34116, 34057, 34222, 34849, 35397, 35592, 35698, 35740, 35423, 34894, 34662, 34732, 34710, 34709, 35124, 35638, 35548, 35066, 35109, 35761, 36221, 36315, 36643, 37030, 36320, 34274, 32265, 31383, 31125, 30711, 30527, 31185, 32088, 32055, 30890, 29470, 28609, 28483, 28851, 29329, 29701, 30170, 30937, 31533, 31219, 30139, 29255, 29004, 28882, 28558, 28342, 28187, 27359, 25782, 24719, 25299, 27067, 28738, 29826, 30736, 31730, 32492, 32538, 31653, 30182, 29032, 28904, 29349, 29274, 28485, 27939, 28203, 28630, 28526, 28217, 28287, 28546, 28466, 28077, 27795, 27851, 28418, 29709, 31455, 32868, 33636, 34361, 35531, 36730, 37402, 37698, 37923, 37909, 37691, 38142, 39909, 42226, 43735, 44285, 44984, 46552, 48485, 49919, 50652, 51077, 51556, 52114, 52527, 52507, 51762, 49998, 47170, 43960, 41658, 41074, 41715, 42520, 43162, 43909, 44508, 44239, 43115, 41976, 41229]
55028D1229p41p73j22P65J012R75J563K303J855K93q65r21o70o71m76J05M42K46
55010D5549K6l4l88j028j227q04m39m07j70L88N02j23o26l01L88O81N46L47J59
54991D3039k1p7j44n21r37n98O37J881K283J869J050Q4o98q56m19J1P4J4J39M26
54971D7236P22Q61O04Q6J29J299K757L045J973P13M2l55p16n64J99P65N64J20
54953E9480J15L46K66m6j14K06O86J125J428J494J288Q04k4j071j776j655r23
54936F1629k00L34Q17J047O73o1n37o93r61j333j337r59p21p37n04J80P84P61
54918E8182J22p39j322j225o11k81o39r09j60J267K259K519K553K381J557L86
54902F5340j45K10P18R32J109J315J243J067J329J889K031J748J756K157K302
$$ y = [41229, 40488, 39715, 39593, 40358, 41370, 42345, 43908, 46211, 48066, 48359, 47494, 46573, 45903, 45232, 44756, 44861, 45303, 45549, 45575, 45541, 45153, 44125, 42898, 42094, 41655, 41248, 41078, 41466, 41968, 41845, 41219, 40918, 41306, 41987, 42533, 42880, 43039, 43018, 42941, 42797, 42276, 41339, 40741, 41378, 43259, 45542, 47411, 48461, 48545, 47847, 46991, 46572, 46583, 46657, 46671, 46810, 47236, 47958, 48819, 49423, 49509, 49638, 50937, 53694, 56739, 58712, 59425, 59467, 59112, 58396, 57832, 58031, 58796, 59360, 59480, 59595, 59941, 60207, 60161, 60047, 60253, 60939, 62064, 63492, 64986, 66274, 67078, 67054, 65983, 64207, 62552, 61629, 61429, 61763, 62580, 63627, 64300, 64239, 63702, 63009, 62048, 60715, 59378, 58419, 57698, 56961, 56457, 56637, 57421, 58182, 58304, 57565, 56243, 55018, 54407, 54126, 53487, 52578, 52418, 53685, 55944, 58463, 61016, 63397, 64954, 65340, 65195, 65405, 66123, 67055, 68164, 69479, 70722, 71789, 73118, 75007, 77038, 78786, 80542, 82699, 85001]
54887H5001K108K287K932L202K760K336K425K587K482K495K880L332L792M670
54873A25289N833O430O110N337M258K352l21k735m182m948n374n376n240n593
54859A21840o117n721m447l804m413m871l903k316j668k062k491k496k259j798
54845G3474j083n05l08j44K20L79K26N16J764L301M252M685N037N175M920M805
54829A06714N272N721N267L983K522J080n09k021l054l668m121m398m511m778
54815A03499n197n100m092k821k132k002j933j857j960k037j783j375j169j182
54801F8859j244j311j202o76p9k70j349k173j758n23M05N17mq34j480j353n41
54784E4984P8L4j28j7k36j204k055j739o76j23l07l54J43N39K02n99j129j033
$$ y = [85001, 87109, 89396, 92328, 95530, 98290, 100626, 103051, 105638, 108120, 110615, 113495, 116827, 120619, 125289, 131122, 137552, 143662, 148999, 153257, 155609, 155288, 152553, 148371, 143423, 138049, 132673, 127433, 121840, 115723, 110002, 105555, 101751, 97338, 92467, 88564, 86248, 84580, 82518, 80027, 77531, 75272, 73474, 72391, 71886, 71578, 71434, 71654, 72033, 72259, 72775, 74539, 77840, 82092, 86777, 91814, 96989, 101909, 106714, 111986, 117707, 122974, 126957, 129479, 130559, 130050, 128029, 124975, 121307, 117186, 112788, 108277, 103499, 98302, 93202, 89110, 86289, 84157, 82155, 80222, 78365, 76405, 74368, 72585, 71210, 70041, 68859, 67615, 66304, 65102, 64426, 64347, 64077, 62728, 60555, 58797, 58274, 58679, 59196, 59192, 58358, 56878, 55525, 54984, 55062, 55096, 54968, 54951, 54715, 53511, 51456, 49717, 49041, 48918, 48611, 48257, 48400, 48939, 49141, 48542, 47413, 46380]
54766D6380p03q63j666k232j596j21P69M87K2L48J091J380J158Q45M81J1k20m1
54748D5530L1l64o25p3R33J577J823K161K554K485J930J465J505J935K365K434
54732F7666K062J714J926K479K567K119K096L147M677N785O324O568O605O618
54718A22353O934P241O611M948L480L080L021K148M35j438l109m231m104k739
54704A44630j470j393j880j693q53k56j14J3J50O9N7L99N41j28j081j379j094
54687A34518r65j009p59m27o09r78n34Q94K415L278L467L186K648K238K070J692
54671A51125Q12o0n39j278k946m797n553n312n296n856o125n636n043m904m823
54656I3769m221l216k392k124k293k434k180j769j744k000j787r63m09o43q92
$$ y = [46380, 45677, 44814, 43148, 40916, 39320, 39199, 39968, 40455, 40477, 40825, 41916, 43296, 44454, 45299, 45780, 45791, 45571, 45530, 45561, 45197, 44572, 44499, 45432, 47009, 48832, 50993, 53547, 56032, 57962, 59427, 60932, 62867, 65232, 67666, 69728, 71442, 73368, 75847, 78414, 80533, 82629, 85776, 90453, 96238, 102562, 109130, 115735, 122353, 129287, 136528, 143139, 148087, 151567, 154647, 157668, 159816, 160251, 158813, 155704, 151473, 147369, 144630, 143160, 141767, 139887, 138194, 137341, 137085, 136971, 136984, 137134, 137203, 137260, 137659, 138200, 138072, 136991, 135612, 134518, 133553, 132544, 131785, 131358, 130749, 129771, 129237, 130131, 132546, 135824, 139291, 142477, 145125, 147363, 149433, 151125, 151937, 151877, 151338, 150060, 147114, 142317, 136764, 131452, 126156, 120300, 114175, 108539, 103496, 98592, 93769, 89548, 86332, 83940, 81816, 79523, 77089, 74909, 73140, 71396, 69396, 67609, 66646, 66237, 65594, 64702]
54641F4702l98K98L72J44L61P59N97O3j38r4l83q34q22l91%M19J059J423J157
54622F8294J000J681K471K309J669J720K205J998J336J456K240K270J379J015
54608I3043J728K263J743R60P47O58K34J19R62K186K770K517J910J444J585K631
54592A17500M174N347N851O033N992N494M836M679M925M826M344M196M351L752
54578A86300J951j76j789l040m193m920n053n062n217n165m824m725m954m680
54564A34453l410j884j125j210j527j653j549j416j618k228k603k109j241j076
54550A09804j627j832j399j303k042k722k518j969j922k170k008j479j119j010
54536H4684p99l96k6J28K5k43m12k96j49k47l00J11N96L85l08m12L88J194J342
$$ y = [64702, 64304, 64602, 64974, 65118, 65479, 66238, 66835, 66898, 66760, 66666, 66283, 65449, 64627, 64236, 64236, 64655, 65714, 67137, 68294, 69294, 70975, 73446, 75755, 77424, 79144, 81349, 83347, 84683, 86139, 88379, 90649, 92028, 93043, 94771, 97034, 98777, 99737, 100484, 101142, 101376, 101495, 102457, 104643, 107413, 109930, 111840, 113284, 114869, 117500, 121674, 127021, 132872, 138905, 144897, 150391, 155227, 159906, 164831, 169657, 174001, 178197, 182548, 186300, 188251, 188075, 186286, 183246, 179053, 174133, 169080, 164018, 158801, 153636, 148812, 144087, 139133, 134453, 131043, 129159, 128034, 126824, 125297, 123644, 122095, 120679, 119061, 116833, 114230, 112121, 110880, 109804, 108177, 106345, 104946, 103643, 101601, 98879, 96361, 94392, 92470, 90300, 88292, 86813, 85694, 84684, 83885, 83489, 83463, 83591, 83616, 83373, 82961, 82665, 82516, 82269, 81969, 82080, 82676, 83061, 82753, 82341, 82729, 83923, 85265]
54517H5265J232J355J451J149N98l9q70j718j982j490p65j63M43R48R21M59K71
54500H7065N65P84P61J077J927K605K608K252J850J311R06J305K301K726K215
54485A12258J830K274K714K312J712J916K629K933K833K998L502L841L775L390
54471A50917K688J821J165O64k18j333j593p48l50j811m172n152m043k350j657
54456A33828k021k500k371j689j117j267j965k368k064j575j432j364r06k91j0
54441A10888M2L04P14Q30N26J20n0K64J134K161K605K206J538J299J550J977K343
54424A30451K435K099J593J446J676J731J446J321J635J946J897J682J471J095
54410A53924O59N57N65o6j130j236K42K052K681K175J463R00L87J69M02O03M13
$$ y = [85265, 86497, 87852, 89303, 90452, 91050, 91011, 90141, 88423, 86441, 84951, 84186, 84023, 84466, 85414, 86335, 86794, 87065, 87630, 88414, 89175, 90252, 92179, 94784, 97392, 99644, 101494, 102805, 103711, 105016, 107317, 110043, 112258, 114088, 116362, 119076, 121388, 123100, 125016, 127645, 130578, 133411, 136409, 139911, 143752, 147527, 150917, 153605, 155426, 156591, 157255, 157037, 155704, 154111, 153363, 153013, 151202, 147030, 141878, 137835, 135485, 133828, 131807, 129307, 126936, 125247, 124130, 122863, 120898, 118530, 116466, 114891, 113459, 112095, 111189, 110898, 110888, 110930, 111234, 111948, 112778, 113304, 113424, 113374, 113638, 114772, 116933, 119538, 121744, 123282, 124581, 126131, 128108, 130451, 132886, 134985, 136578, 138024, 139700, 141431, 142877, 144198, 145833, 147779, 149676, 151358, 152829, 153924, 154583, 155140, 155705, 155639, 154509, 153273, 153515, 155567, 158248, 160423, 161886, 162786, 163173, 163342, 163744, 164347, 164760]
54393A64760K17K46j05j082j651q92L80O37l11j436k100k289j862q62k23q27k087
54376A50513k710k563k508k631k082p90N5l70j351j603p17O53J547J508R95R47
54360A38893J577J944J194k09j163j381j298r71r9R89J467J200R29J140J421J230
54344A46863O44J68K29Q67J662J983J637J073O43O2r45j896k095j605j070q13
54328A47407p07o88p99q94q10o77o13m61k60n02j356k125k075j419q37m71m0M14
54310A33087O27O55O59N49L00J80J42k99j045j129j87O54L93k48l8P31Q93M64
54292A36388M57R07Q12j6n89m32k13l53l20K77Q87Q14M4j032k069k711k759k521
54274A27571k441k449k245k002k051k091j656j064r97j272j183q92j259k239k754
$$ y = [164760, 164977, 165223, 165118, 164036, 162385, 161493, 161873, 162510, 162199, 160763, 158663, 156374, 154512, 153650, 153427, 152600, 150513, 147803, 145240, 142732, 140101, 138019, 137229, 137284, 136914, 135563, 133960, 133243, 133896, 135443, 136951, 137946, 138893, 140470, 142414, 143608, 143399, 142236, 140855, 139557, 138586, 138487, 139476, 140943, 142143, 143072, 144212, 145633, 146863, 147507, 147675, 147904, 148771, 150433, 152416, 154053, 155126, 155769, 155831, 154886, 152990, 150895, 149290, 148220, 147407, 146700, 146012, 145213, 144319, 143509, 142832, 142219, 141758, 141498, 140996, 139640, 137515, 135440, 134021, 133184, 132713, 132673, 133087, 133714, 134369, 135028, 135577, 135877, 136057, 136199, 135900, 134855, 133726, 133539, 134193, 134586, 134338, 134300, 135031, 135924, 136388, 136845, 137752, 138564, 138548, 137959, 137527, 137314, 136961, 136641, 136918, 137805, 138619, 138663, 137631, 135562, 132851, 130092, 127571, 125130, 122681, 120436, 118434, 116383, 114292, 112636, 111572, 110575, 109303, 108120, 107228, 105969, 103730, 100976]
54259A00976k352j839j842j881j334n07j15l70r89j559j695j339j000j179j552
54244H1423j390p64m68p79j110j038p71n01j48Q7k55j107j833k077k007j681j060
54227F4521o47j066j882j842o39N64P36J79k90m64n19m39k08n6q7j18j09k48m32
54208E6954l20l1q0m25l86K25P35O92N37P18Q56L40o70j384j190j31J086J495
54190E9021P92j30j52N97R29K47p54j238j151p83j79N56J056J152J032P46J09
54173F1850o85j067q35l63M1L05J73o07j512j613q16J0L45M76N75L31j65l01p9
54154E6063k89j086j426o34M83Q22L89j98q18j557k033j814j164o10j93K98P32
54137D6965Q47O96M26O6k39k75k74p12j324j158o1P85L91p07j368j335j095q96
$$ y = [100976, 98624, 96785, 94943, 93062, 91728, 91221, 91106, 90736, 89747, 88188, 86493, 85154, 84154, 82975, 81423, 80033, 79269, 78801, 78022, 76912, 75874, 75103, 74602, 74454, 74541, 74286, 73179, 71346, 69269, 67262, 65581, 64521, 63874, 62808, 60926, 59084, 58445, 59009, 59745, 59924, 59634, 59170, 58651, 58212, 58004, 57948, 57861, 57743, 57634, 57386, 56954, 56634, 56603, 56523, 56098, 55712, 55937, 56672, 57364, 57901, 58619, 59475, 59815, 59145, 57761, 56571, 56440, 57526, 59021, 59813, 59683, 59531, 60128, 61057, 61304, 60550, 59312, 58161, 57378, 57199, 57755, 58811, 59963, 60995, 61741, 61850, 61165, 60098, 59263, 58900, 58941, 59246, 59419, 58812, 57300, 55687, 54871, 54881, 55226, 55702, 56277, 56608, 56443, 56142, 56063, 55774, 54688, 53262, 52628, 53111, 53933, 54322, 54124, 53306, 51749, 49716, 47902, 46738, 46128, 45935, 46233, 46965, 47812, 48508, 48934, 49000, 48761, 48486, 48212, 47500, 46176, 45018, 44957, 45742, 46133, 45426, 44058, 42723, 41628, 40732]
54119D0732o47l97k17MJ64j07p14r36n21j85l93m86J74R29P26k21p28k99M31Q04
54099C8113P76N42K19n7k01l10m48m74l36j99r4J72N34O39N17O22Q49M88n06j095
54079C9751o90r1j54m11r6M11L58J79Q02J918K299J683J021Q94Q88O32L34J70
54061D9898O3K08Q53J457J070k05j100p79J46O28M06j17n76q46q94q40q65r12
54043D7595p93n93n31m37J31J126J908J971J413N97j57n06k79J00q7q96j475j078
54025D8009L6R97J302J120Q40O37M29R2l23n60l97R2N87Q54R52J082J303J295
54007E8347N61r69k525l032k219r45k33k20k80N4O33R86Q54M72L72Q24J469J721
53989E5870J556J455J603J606J149M49j41m84m33J51Q97J019L33m29o04l60m6
$$ y = [40732, 40085, 39688, 39471, 39475, 39639, 39532, 38818, 37882, 37361, 37176, 36783, 36297, 36471, 37400, 38126, 37905, 37177, 36878, 37309, 38113, 38889, 39431, 39650, 39593, 39392, 39082, 38634, 38160, 37824, 37625, 37531, 37703, 38237, 38876, 39393, 40015, 40864, 41352, 40846, 39751, 39061, 38970, 38816, 38405, 38309, 38720, 39078, 39257, 40059, 41977, 44276, 45959, 46980, 47874, 48762, 49394, 49728, 49898, 49961, 50169, 51022, 52479, 53549, 53344, 52244, 51465, 51611, 52239, 52645, 52528, 51952, 51106, 50212, 49372, 48507, 47595, 46802, 46209, 45678, 45241, 45372, 46498, 48406, 50377, 51790, 52387, 52230, 51724, 51445, 51545, 51458, 50562, 49087, 48009, 48045, 49042, 50344, 51464, 52304, 52941, 53370, 53462, 53139, 52579, 52182, 52274, 52861, 53715, 54667, 55749, 57052, 58347, 58908, 57939, 55414, 52382, 50163, 49218, 48985, 48765, 48485, 48539, 49172, 50158, 51012, 51484, 51856, 52680, 54149, 55870, 57426, 58881, 60484, 62090, 63239, 63688, 63547, 63063, 62630, 62781, 63678, 64697, 65030, 64601, 63997, 63637, 63591]
53972F3591M60J195J627J477J413K071K915L030K651K833L725M293L805K762K060
53957I9908J978K236K480K524K357K158K050J908J645J467J537J640J520J263
53943A26671R56L51o50j516j725j537j493j567j469j430j802k161j823j060q00
53928A08945j125j194p96q12j672k415k025r25l68p70j410j599j494j610j966
53913H8764j987j301m05k45j000j708j491p42n11r70j228o31M63J291J487J109
53897H0895M84R1K01M52K71k56m64j02L86P15J130J721K029J799J554J843K364
53880I5113K377J805J353J597K294K683K285J440J033J566K517K872K274J341
53866A22550Q01P77R76J154J156Q80M87L47N30O45M18J50K61O87J121J604K401
$$ y = [63591, 64051, 65246, 66873, 68350, 69763, 71834, 74749, 77779, 80430, 83263, 86988, 91281, 95086, 97848, 99908, 101886, 104122, 106602, 109126, 111483, 113641, 115691, 117599, 119244, 120711, 122248, 123888, 125408, 126671, 127627, 127978, 127328, 125812, 124087, 122550, 121057, 119490, 118021, 116591, 114789, 112628, 110805, 109745, 108945, 107820, 106626, 105830, 105018, 103346, 100931, 98906, 97981, 97613, 96843, 95433, 93834, 92340, 90730, 88764, 86777, 85476, 85071, 84826, 83826, 82118, 80627, 79885, 79374, 78404, 77176, 76545, 77008, 78299, 79786, 80895, 81379, 81470, 81671, 82123, 82394, 82138, 81674, 81572, 81958, 82673, 83803, 85524, 87553, 89352, 90906, 92749, 95113, 97490, 99295, 100648, 102245, 104539, 107222, 109507, 110947, 111980, 113546, 116063, 118935, 121209, 122550, 123351, 124128, 125104, 126258, 127414, 128294, 128781, 129128, 129658, 130303, 130721, 130871, 131132, 131819, 132940, 134544, 136945]
53849A36945L261L464K759J933K001K955L759L668L177L326M232M852M330L094
53835A83756K341K653L482L855L325K207J141M72k3p53j663k224k081j501r82
53820A94005p44q26j314k147k908l186l043k890l041l543m173m392l714k393j402
53805A54289j329j717j886j916k239k688k781k692l019l705l909l153j889q57
53791A20509m07n34r81j259j075q31j192k084k666k397j557o73o1P9k72o26m01
53774A03572J22m6j173k222k118j079j36J58l0m36q99j086o25L52J224J500J218
53757I8296O68K2o12r73p72j66J75k13q44o89N17J813K144J572Q97N08K78K90
53739A02911Q32J637J939J501R62R19J247J624K136K950L724L826K979J513J85
$$ y = [136945, 140206, 143670, 146429, 148362, 150363, 153318, 157077, 160745, 163922, 167248, 171480, 176332, 180662, 183756, 186097, 188750, 192232, 196087, 199412, 201619, 202760, 203232, 203209, 202456, 200793, 198569, 196488, 194987, 194005, 193261, 192435, 191121, 188974, 186066, 182880, 179837, 176947, 173906, 170363, 166190, 161798, 158084, 155691, 154289, 152960, 151243, 149357, 147441, 145202, 142514, 139733, 137041, 134022, 130317, 126408, 123255, 121366, 120509, 120102, 119568, 118587, 117328, 116253, 115422, 114230, 112146, 109480, 107083, 105526, 104853, 104792, 104871, 104599, 103973, 103572, 103694, 103648, 102475, 100253, 98135, 97056, 96920, 97078, 97048, 96612, 95713, 94627, 94002, 94354, 95578, 97078, 98296, 98964, 98986, 98374, 97401, 96629, 96463, 96638, 96425, 95581, 94892, 95409, 97222, 99366, 100938, 101835, 102343, 102621, 102911, 103743, 105380, 107319, 108820, 109782, 110701, 111948, 113572, 115708, 118658, 122382, 126208, 129187, 130700, 130885]
53724A30885j50Q59K484L356K854J792J381J784K141J809J075N31K62o0n20q03
53708A49680p08n08n92r22j164j205j218j211j033q47j123j857k375k220j763
53693A30934j511j323r17o38r57j521j583j151r06j005r33n53m17q11j293j497
53677A13918j630j852j814j300p56o95r80j148j083r85q49m67K37J042J608J658
53661A04904J200N88J75m7k80n17o36p71j073j208o69L34R72Q92O11O59Q91R17
53643A06942O61K43k23l88J99J345K095J778Q80L97O77J299J772J949J836J505
53627A22967J206J236J618J990J873J099M1o13n11J8L94M92O44J069J633K057
53611A37213K110J674R85O23R01J358J369J036R16J067R91N23j6m76r14r29J56
$$ y = [130885, 130735, 131594, 134078, 137434, 140288, 142080, 143461, 145245, 147386, 149195, 150270, 150801, 151063, 151003, 150483, 149680, 148972, 148464, 147872, 146950, 145786, 144581, 143363, 142152, 141119, 140272, 139149, 137292, 134917, 132697, 130934, 129423, 128100, 127183, 126545, 125588, 124067, 122484, 121333, 120427, 119422, 118489, 117936, 117519, 116708, 115415, 113918, 112288, 110436, 108622, 107322, 106566, 105871, 104891, 103743, 102660, 101675, 100826, 100359, 100596, 101638, 103246, 104904, 106104, 106692, 106867, 106820, 106540, 106023, 105387, 104616, 103543, 102335, 101666, 102000, 102972, 103864, 104475, 105134, 106025, 106942, 107603, 107846, 107623, 107235, 107434, 108779, 110874, 112652, 113532, 113929, 114606, 115905, 117677, 119626, 121462, 122967, 124173, 125409, 127027, 129017, 130890, 131989, 132030, 131417, 130906, 130924, 131318, 131810, 132454, 133523, 135156, 137213, 139323, 140997, 141982, 142605, 143506, 144864, 146233, 147269, 148185, 149252, 150243, 150766, 150750, 150274, 149360, 148431, 148587]
53594A48587K082L460L232J782K87n45p39o64p30j110j420j180o45o15j178j412
53578A49192o93M09J016J091J092J054P24K56R2K89M55K70k27p46q99m76K47P22
53560A53868P92Q50J199J623J756J545J198J013J295K032K639K551K091K071K495
53545A79018K507J740R35P97J110J418J795K340K621K316J881J905K231K303K020
53530B06937J721J673K019K804L690M019L563K791K118J454P42K22r6n14q05k41
53514B32097J041J730J113J94J84P56Q97O56P64J125R93M07J21K91L52J43R6L32
53496B43292N25O22Q37R02L35n77r13l37N54J172J495J617J469J142Q97Q10Q69
53479B54711J280K087K671K412J775J863K963M220M846M830M480M031L836M237
$$ y = [148587, 150669, 154129, 157361, 159143, 159430, 158885, 158146, 157482, 156752, 155642, 154222, 153042, 152397, 151782, 150604, 149192, 148499, 148908, 149924, 151015, 152107, 153161, 153885, 154141, 154233, 154522, 154977, 155247, 155020, 154274, 153375, 152899, 153146, 153868, 154660, 155510, 156709, 158332, 160088, 161633, 162831, 163844, 165139, 167171, 169810, 172361, 174452, 176523, 179018, 181525, 183265, 184200, 184997, 186107, 187525, 189320, 191660, 194281, 196597, 198478, 200383, 202614, 204917, 206937, 208658, 210331, 212350, 215154, 218844, 222863, 226426, 229217, 231335, 232789, 233531, 233753, 233657, 233143, 232338, 232097, 233138, 234868, 235981, 236175, 236359, 237115, 238012, 238668, 239432, 240557, 241550, 241957, 242078, 242369, 242721, 242864, 242960, 243292, 243817, 244439, 245276, 246178, 246513, 245936, 245023, 244686, 245240, 246412, 247907, 249524, 250993, 252135, 253032, 253842, 254711, 255991, 258078, 260749, 263161, 264936, 266799, 269762, 273982, 278828, 283658, 288138, 292169, 296005, 300242]
53465C00242N044N683N996O330O901P630Q514R547J0253J0120R490R311R892J0667
53451D15620J1218J1796J2615J3392J3916J4428J5144J6009J7066J8461J9878
53440E79543K0630K0601K0543K1125K2138K2961K3287K3190K2892K2718K2867
53429H22495K3037K2754K2191K2175K3142K4563K5597K5858K5429K4666K4186
53418A086093K4531K5468K6038K5573K4261K2580K0708J8777J7178J6101J5155
53407A322463J3844J2324J1261J1058J1416J1598J1044R826Q550P665O949N892
53395A443890M433K908J364n76l103n861q360j0357j1837j2950j4079j5541j7193
53382A352738j8662j9881k1037k2043k2560k2562k2401k2323k2339k2500k2779
$$ y = [300242, 305286, 310969, 316965, 323295, 330196, 337826, 346340, 355887, 366140, 376260, 385750, 395061, 404953, 415620, 426838, 438634, 451249, 464641, 478557, 492985, 508129, 524138, 541204, 559665, 579543, 600173, 620774, 641317, 662442, 684580, 707541, 730828, 754018, 776910, 799628, 822495, 845532, 868286, 890477, 912652, 935794, 960357, 985954, 1011812, 1037241, 1061907, 1086093, 1110624, 1136092, 1162130, 1187703, 1211964, 1234544, 1255252, 1274029, 1291207, 1307308, 1322463, 1336307, 1348631, 1359892, 1370950, 1382366, 1393964, 1405008, 1414834, 1423384, 1431049, 1437998, 1443890, 1448323, 1451231, 1452595, 1452019, 1448916, 1443055, 1434695, 1424338, 1412501, 1399551, 1385472, 1369931, 1352738, 1334076, 1314195, 1293158, 1271115, 1248555, 1225993, 1203592, 1181269, 1158930, 1136430, 1113651]
53371A113651k2738k1958k0722j9678j8854j7789j6539j5656j5078j4036j2358
53360I18245j0819r765q374n989l270j220K65J959M002N978P940J0322J3015J5405
53346I37694J7384J9481K1852K3850K4922K5395K6070K7374K9149L1029L2718
53335A216918L4054L5053L5915L6957L8417M0327M2534M4814M6964M8744M9930
53324A670627N0616N1332N2625N4483N6336N7599N8094N8034N7825N7773N7677
53313B283021N6887N5017N2491N0010M7678M5166M2519M0083L7669L4577L0715
53302B775833K6961K4083K1859J9613J7032J4127J0880P475M317J315k468p808
53290B913219j4261k0695k6694l2783l9326m5822n1448n5833n9087o1388o2848
$$ y = [1113651, 1090913, 1068955, 1048233, 1028555, 1009701, 991912, 975373, 959717, 944639, 930603, 918245, 907426, 897661, 889287, 883298, 880028, 878808, 879073, 881032, 885034, 891012, 898952, 909274, 922289, 937694, 955078, 974559, 996411, 1020261, 1045183, 1070578, 1096648, 1124022, 1153171, 1184200, 1216918, 1250972, 1286025, 1321940, 1358897, 1397314, 1437641, 1480175, 1524989, 1571953, 1620697, 1670627, 1721243, 1772575, 1825200, 1879683, 1936019, 1993618, 2051712, 2109746, 2167571, 2225344, 2283021, 2339908, 2394925, 2447416, 2497426, 2545104, 2590270, 2632789, 2672872, 2710541, 2745118, 2775833, 2802794, 2826877, 2848736, 2868349, 2885381, 2899508, 2910388, 2917863, 2922180, 2923495, 2921027, 2913219, 2898958, 2878263, 2851569, 2818786, 2779460, 2733638, 2682190, 2626357, 2567270, 2505882, 2443034]
53279B443034o3678o4198o4575o4712o4497o4111o3821o3508o2721o1440o0243
53268A745530n9424n8405n6688n4919n4080n3735n2289m9131m5522m2794m0601
53257A177942l7730l3950l0182k7161k4759k2492j9984j7005j3563j0123p362
53246I33631n637m721m023k954j355L44J587K464L603N241O850P984Q941J0174
53232I62129J1550J2706J3734J4966J6325J7527J8659J9998K1364K2295K2829
53221A154082K3523K4631K5714K6216K6083K5613K5053K4443K3716K2855K1982
53210A423911K1244K0607J9821J8699J7250J5519J3643J2089J1440J1539J1311
53199A597073R841P429N081L225J410q27l484o454r886j3829j7912k1597k4672
$$ y = [2443034, 2379356, 2315158, 2250583, 2185871, 2121374, 2057263, 1993442, 1929934, 1867213, 1805773, 1745530, 1686106, 1627701, 1571013, 1516094, 1462014, 1408279, 1355990, 1306859, 1261337, 1218543, 1177942, 1140212, 1106262, 1076080, 1048919, 1024160, 1001668, 981684, 964679, 951116, 940993, 933631, 927994, 923273, 919250, 916296, 914941, 915285, 916872, 919336, 922939, 928180, 935030, 943014, 951955, 962129, 973679, 986385, 1000119, 1015085, 1031410, 1048937, 1067596, 1087594, 1108958, 1131253, 1154082, 1177605, 1202236, 1227950, 1254166, 1280249, 1305862, 1330915, 1355358, 1379074, 1401929, 1423911, 1445155, 1465762, 1485583, 1504282, 1521532, 1537051, 1550694, 1562783, 1574223, 1585762, 1597073, 1606914, 1614343, 1619424, 1622649, 1624059, 1623232, 1619748, 1613294, 1603408, 1589579, 1571667, 1550070, 1525398]
53186A525398k7331k9836l2220l4332l6114l7716l9195m0190m0191l9196l7785
53175A131292l6467l5310l4298l3684l3612l3648l3168l2083l0928l0305l0378
53164G67411l0803l0994l0661l0081k9652k9162k8025k6292k4787k3945k3048
53153D59961k1236j8715j6378j4558j2871j1132r697q899q669q699q628q191p554
53140C04734p270p513p635p043o174n940o383o740o621o327n981n272m292l739
53126B17804l956m412m526m354m120l745l285l199l554l594k756j676j427k014
53112A71186k445k197j805j900k337k621k687k819l114l285l038k397j701j354
53098A37486j481j855k119k115j882j484j005o45n92p32p30m85l02n00r30j088
$$ y = [1525398, 1498067, 1468231, 1436011, 1401679, 1365565, 1327849, 1288654, 1248464, 1208273, 1169077, 1131292, 1094825, 1059515, 1025217, 991533, 957921, 924273, 891105, 859022, 828094, 797789, 767411, 736608, 705614, 674953, 644872, 615220, 586058, 558033, 531741, 506954, 483009, 459961, 438725, 420010, 403632, 389074, 376203, 365071, 355374, 346475, 337806, 329107, 320479, 312288, 304734, 297464, 289951, 282316, 275273, 269099, 263159, 256776, 250036, 243415, 237088, 231107, 225835, 221543, 217804, 213848, 209436, 204910, 200556, 196436, 192691, 189406, 186207, 182653, 179059, 176303, 174627, 173200, 171186, 168741, 166544, 164739, 162839, 160502, 157881, 155194, 152375, 149261, 145976, 142938, 140541, 138840, 137486, 136005, 134150, 132031, 129916, 128034, 126550, 125545, 124900, 124308, 123576, 122846, 122361, 122059, 121559, 120629, 119541]
53082A19541o21L10J131J278O37k99q41p81n80p39j109j098m97J65K94j7q0N31
53064A17225J433J729R35m96j522j512q02j51J28K44K78k5o15q40j88R03J471
53047A18195J096K37m92q68r62q42o12n31q13j354j733j547p94J9L30J24j11l9
53029A09303J56K49M18Q87J426J592J368J087R43Q55P65O24L14j23k74J28O90
53012A20408P62K77k89n90n82k53K38L42k81j102j371j264j521k038j923j044
52996A09769m49q18j524j738j566j461j288p41j65j50o98j350j819k029j965j849
52980I0159k053k366j954n86O90P31l05j390j945k047j798j321j038j214j440
52965G2123j241q87q47r15o48l62o86j316j309o51m01j071j813j663q08j11L2
$$ y = [119541, 118920, 119230, 120361, 121639, 122276, 121977, 121136, 120355, 119775, 119036, 117927, 116829, 116332, 116497, 116791, 116774, 116694, 117225, 118658, 120387, 121322, 120826, 119304, 117792, 116990, 116839, 116967, 117211, 117489, 117464, 116849, 116009, 115821, 116724, 118195, 119291, 119528, 119036, 118168, 117206, 116364, 115752, 115221, 114408, 113054, 111321, 109774, 108980, 108999, 109329, 109453, 109342, 109303, 109459, 109708, 110126, 111013, 112439, 114031, 115399, 116486, 117429, 118284, 119049, 119673, 119987, 119864, 119590, 119718, 120408, 121170, 121447, 121158, 120568, 119986, 119733, 119971, 120313, 120032, 118930, 117559, 116295, 114774, 112736, 110813, 109769, 109320, 108502, 106978, 105240, 103674, 102213, 100925, 100184, 100019, 99869, 99171, 97821, 96002, 93973, 92008, 90159, 88106, 85740, 83786, 83200, 83890, 84621, 84316, 82926, 80981, 78934, 77136, 75815, 74777, 73563, 72123, 70882, 69995, 69148, 68233, 67585, 67223, 66537, 65221, 63912, 63261, 62860, 61789, 59976, 58313, 57505, 57394, 57426]
52948E7426j88n50r40j108q09j95K38J66j86k95N8N07N92M07M60Q85J234J117
52930E8819O17q8r05j409r90J39P81K85m41k97L27K83m04o23kN86N00J64J46L66
52910E7854N55O61M94j70q77o56O36J889K092J457P66K26l55q68r56n55R2P05
52892F2990R98Q19M81N27R16R21K39m02j99O10J182J225J115J146J274J495J880
52875G7217K266K317J969J454R59N90M91O93R05P87L84J0k35m67o39o24o24j086
52857H6367k009k740k648j807p74QL43R8o85j554j902j624j219j072r18l79K73
52840F7758L58k49q80r44n65j49J79L50pj104k333k604j515K05J434J577P74m43
52822F1842j497j989j848j283o69l53l99m41l5P13J147Q91L42O5K6j28l41k55
$$ y = [57426, 57238, 56688, 55748, 54640, 53831, 53636, 53874, 54040, 53854, 53559, 53617, 54124, 54716, 55123, 55583, 56468, 57702, 58819, 59436, 59348, 58443, 57034, 56044, 56183, 56964, 57249, 56808, 56511, 56838, 57121, 56717, 56094, 56092, 56678, 57178, 57342, 57488, 57854, 58409, 59070, 59564, 59394, 58517, 57861, 58497, 60386, 62478, 63935, 64701, 64927, 64572, 63704, 62748, 62193, 62285, 62990, 63988, 64807, 65288, 65815, 66731, 67652, 67891, 67489, 67290, 67900, 69082, 70307, 71422, 72568, 73842, 75337, 77217, 79483, 81800, 83769, 85223, 86182, 86772, 87263, 87956, 88861, 89648, 90032, 90042, 89807, 89340, 88701, 88077, 87453, 86367, 84358, 81618, 78970, 77163, 76389, 76397, 76740, 76838, 76153, 74599, 72697, 71073, 69854, 68782, 67864, 67485, 67758, 68116, 67867, 66987, 66043, 65478, 65329, 65508, 65858, 65851, 64747, 62414, 59810, 58295, 58500, 59934, 61511, 62285, 61842, 60345, 58356, 56508, 55225, 54556, 54203, 53804, 53363, 53328, 54041, 55188, 56079, 56421, 56486, 56512, 56384, 56043, 55788]
52804E5788O3R8l31q28r93q63o33l32P6N47R76J196R42J83n45n21L37J371J963
52785E8494K128K176K135J765J028K83lK77P03P47M27L28Q56J650J938J327O0
52768G6319j237j886j556o48p8l29r36j197j037p82m12K76J057J427J320J155
52752G1456J193J330J395J273Q25K12J3N19J134J095N23Q2j35n35r86r34n13n57
52734G7390j293j905j774j258r24p67o33o71q97r05n09j80l33p59j052j180j208
52717F1142r63l89J54L53L52L43K11j30m28m86m39l41O4P40J026L61r15j961k317
52698E6377k076j529j036r19j069r10j78N40N45M8o6N09J055P81j01o02k22L62
52680E1509J46q33j457j024j86N0k50k83R8K36j69o24p10n71m14j85L1Nj57o2
$$ y = [55788, 55851, 55949, 55618, 54790, 53797, 52934, 52301, 51969, 52045, 52592, 53568, 54764, 55706, 55889, 55344, 54823, 55160, 56531, 58494, 60622, 62798, 64933, 66698, 67726, 68009, 68006, 68283, 68986, 69733, 70160, 70488, 71344, 72994, 74932, 76259, 76319, 75082, 73196, 71640, 70992, 70914, 70585, 69649, 68452, 67415, 66633, 66221, 66497, 67554, 68981, 70301, 71456, 72649, 73979, 75374, 76647, 77472, 77684, 77697, 78216, 79350, 80445, 80968, 81050, 80915, 80380, 79394, 78460, 77947, 77390, 76097, 74192, 72418, 71160, 70236, 69469, 68836, 68165, 67268, 66363, 65854, 65674, 65341, 64582, 63530, 62350, 61142, 60179, 59790, 59944, 60297, 60649, 60992, 61203, 61073, 60645, 60159, 59720, 59379, 59443, 60183, 61209, 61570, 60655, 58694, 56377, 54301, 52772, 51736, 50817, 49748, 48838, 48660, 49200, 49745, 49793, 49727, 50236, 51291, 52072, 51971, 51369, 51147, 51509, 51655, 50822, 49365, 48341, 48155, 48205, 47955, 47672, 47770, 48006, 47837, 47213, 46503, 45932, 45518, 45333, 45364, 45369, 45212, 45150]
52660D5150K50M05M61Q03J211R72J60k25K18O38K71m56p65n83j92M09J065J157
52642E0949L88o27j190j270j040l83M92P84J54o32p54l08L11J091J726J325k15
52625E0801j471j256l30q8l37J19J276J888J462Q14O23P26R44J369J800J845J766
52608F1951K165K805K829K163J634J583J452R56N54N05M35J82J18K83J13n90j278
52591G7860j631j997k430k233j124j5J10n02r27r22r48j204j419j390j175q26
52575E9227m51l96q73j482j565j026m59l56n44m90K7P61J320J474J193O14O2o3
52557E6973L28Q13Q94M87j67r37j685j939j355n25m75j180j449p01J47J69r4L43
52539D9647J186J345O64k2k67k84j07L74O17j2r34q62J56N75l09j213p42O23J332
$$ y = [45150, 45400, 45805, 46266, 47069, 48280, 49252, 49412, 49187, 49405, 50043, 50314, 49858, 49093, 48510, 48318, 48727, 49792, 50949, 51337, 50710, 49520, 48250, 47210, 46827, 47319, 48103, 48257, 47625, 46871, 46563, 46874, 47965, 49691, 51016, 50801, 49330, 48074, 47744, 47656, 47319, 47438, 48714, 50602, 52064, 52878, 53501, 54227, 55171, 56540, 58340, 60185, 61951, 64116, 66921, 69750, 71913, 73547, 75130, 76582, 77538, 78092, 78597, 79032, 79214, 79332, 79615, 79728, 79138, 77860, 76229, 74232, 71802, 69569, 68445, 68430, 68540, 68038, 67111, 66189, 65241, 64037, 62618, 61228, 60053, 59227, 58776, 58380, 57507, 56025, 54460, 53434, 52975, 52619, 52075, 51585, 51612, 52373, 53693, 55167, 56360, 56974, 57036, 56973, 57301, 58114, 59008, 59495, 59328, 58391, 56706, 54767, 53412, 52887, 52412, 51232, 49783, 49082, 49229, 49398, 49304, 49647, 50833, 52178, 52842, 52820, 52553, 52269, 52162, 52536, 53153, 53141, 52207, 51345, 51501, 52076, 51767, 50554, 49812, 50435, 51767]
52520E1767Q71P6k14K9L35L23J8j28K73Q86Q81N2p75p32O7Q87J288J357J290J184
52500E9735J052P76K23m94j026j169r51m10L80J040J148Q00M85L55J74RK33P17
52482F3077P85L11J03O56J249R80J39k52Q5M71M45L40N52Q06N24l48j183j346
52464F7394r06m99m75m26J90J124J541J138N51M27N70L51l68j075j277r59m20
52447F6881J39P29J301J443P32n47j386j200o42p37j406j614q62K50J031J445
52431F5557J577J153J29q26j053p31n19o38p62o02k61k2k1q2J66Q33J474J563
52413F6935J161P31L65k42j015j369j095p13o79p53n32q9K52L70K68o2m00l76
52395F2757j0J97P9J23O77J286J320Q18L25J95L83O68P15L08k24k43K80N83J62
$$ y = [51767, 52638, 52714, 52500, 52529, 52864, 53187, 53205, 53077, 53350, 54236, 55117, 55169, 54394, 53662, 53729, 54616, 55904, 57261, 58551, 59735, 60787, 61563, 61786, 61292, 60266, 59097, 58146, 57736, 58116, 59156, 60304, 61104, 61589, 61944, 62118, 62127, 62360, 63077, 63862, 64173, 64276, 64932, 66181, 67161, 67300, 67048, 67133, 67604, 68049, 68389, 68941, 69747, 70271, 69923, 68740, 67394, 66488, 65989, 65514, 65088, 65278, 66402, 67943, 69081, 69632, 70059, 70629, 70980, 70612, 69537, 68260, 67301, 66881, 67020, 67749, 69050, 70493, 71225, 70678, 69292, 68092, 67450, 66713, 65307, 63693, 62831, 63081, 64112, 65557, 67134, 68287, 68416, 67590, 66537, 65806, 65287, 64649, 63887, 63285, 63024, 63002, 62981, 62899, 63065, 63898, 65372, 66935, 68096, 68827, 69192, 68950, 67935, 66566, 65471, 64758, 64079, 63326, 62794, 62705, 62957, 63327, 63595, 63533, 63133, 62757, 62747, 62944, 63023, 63146, 63823, 65109, 66429, 67247, 67572, 67767, 68150, 68818, 69533, 69841, 69617, 69374, 69654, 70237, 70399]
52376G0399m97o53k76J80M85O16M98K53K90O76Q72N55J64J09j8o19j122p18L06
52357G1500R41R50R64J145Q36k41j316j532r56l00m2j55l25k17K95R39J317J341
52339G5144J174Q88M56R4J02L72M19Mn69q69p71m13k6J36Rj26Q8N83Q76O74K45
52318G8490O2L06P37R76Q33M32P8j8J57M86P86P86L28l47o86m02K39P10O97K63
52298H4913k06k04L80R82R05K23l27l38q4K19P06J202J068K03n62n84k84k79l10
52279H7623R2N20K25o00j041p82k43M08J380K379K602J843Q35K49k0l15o05o14
52261I3936j88O10J398J538P64l15q22n92p2N26J226J665J370P12O43J337J969
52244A05705K021J912J976J820J234Q70J287J998K198J968J974K375K740K788
$$ y = [70399, 69902, 69249, 68973, 69153, 69638, 70254, 70752, 71005, 71295, 71971, 72843, 73398, 73562, 73671, 73653, 73034, 71912, 71194, 71500, 72441, 73391, 74355, 75500, 76336, 76095, 74779, 73247, 72291, 71991, 71949, 71794, 71469, 71252, 71547, 72486, 73803, 75144, 76318, 77206, 77662, 77756, 77858, 78230, 78649, 78653, 78084, 77215, 76444, 76031, 76005, 76141, 76150, 76024, 76112, 76695, 77571, 78245, 78490, 78552, 78858, 79595, 80571, 81404, 81836, 81914, 81896, 82053, 82539, 83325, 84111, 84439, 84092, 83406, 83004, 83243, 83953, 84650, 84913, 84707, 84503, 84883, 85865, 86770, 86993, 86666, 86328, 86244, 86463, 87169, 88371, 89439, 89642, 89080, 88496, 88212, 87933, 87623, 87715, 88235, 88460, 87860, 86819, 86037, 85794, 86202, 87582, 89961, 92563, 94406, 95241, 95490, 95470, 95155, 94550, 93936, 93748, 94358, 95756, 97294, 98058, 97743, 96921, 96329, 96257, 96783, 98009, 99674, 101044, 101756, 102399, 103736, 105705, 107726, 109638, 111614, 113434, 114668, 115538, 116825, 118823, 121021, 122989, 124963, 127338, 130078, 132866]
52230A32866K549K023J314R63J436K359K820K531K193K529L371L894L591K770
52216A67209K125J923J742J137L84J89P52J489J892K091K340K400J905J056M32
52201A89066L38O84J343K098K403J817O58j35M3J010K237L310L859L571K563J539
52185B16404J190J544K029K104J703J194J081J634K569L180K987K254J688J675
52171B43236J951K050J846J569J412J397J533J836K149K102J501O92L62R11K006
52156B66553K834K832K215J740J889K373K524K144J778K052K951L885M357M324
52142C04451L957L287K328J444J293K137L354L979L794L509L696L990L780L256
52128C48255L120L369L279K674K356K825L361L026K037J404J525J869J935J766
$$ y = [132866, 135415, 137438, 138752, 139715, 141151, 143510, 146330, 148861, 151054, 153583, 156954, 160848, 164439, 167209, 169334, 171257, 172999, 174136, 174520, 174709, 175461, 176950, 178842, 180933, 183273, 185673, 187578, 188634, 189066, 189404, 190088, 191431, 193529, 195932, 197749, 198407, 198272, 198315, 199325, 201562, 204872, 208731, 212302, 214865, 216404, 217594, 219138, 221167, 223271, 224974, 226168, 227249, 228883, 231452, 234632, 237619, 239873, 241561, 243236, 245187, 247237, 249083, 250652, 252064, 253461, 254994, 256830, 258979, 261081, 262582, 263274, 263636, 264547, 266553, 269387, 272219, 274434, 276174, 278063, 280436, 282960, 285104, 286882, 288934, 291885, 295770, 300127, 304451, 308408, 311695, 314023, 315467, 316760, 318897, 322251, 326230, 330024, 333533, 337229, 341219, 344999, 348255, 351375, 354744, 358023, 360697, 363053, 365878, 369239, 372265, 374302, 375706, 377231, 379100, 381035, 382801]
52114C82801J515J132O23K33J46L03N36N99K40n08j174j325j064o95j68N99J104
52097C84897O75m73j338j469j435j750k046j786j202r13j045j255j374j446j322
52082C66718q37l22l77j049j661j648j225j002j199j495j508j190p63m76m93q81
52066C50592j528k154k504k514k277j866j367j040j201j857k609k985k761k019
52052C21910j136o84r68j539j560r14m29p61j464j687j335q68l59M50J260J324
52036C11240N57j98l17j13r3j51Q4N71J041J484J963K271K227K076K204K551K729
52019C30126K584K313K102J983J981K104K229K209K081J936J634R78J17m21k03
52004C53753P26J968L077L770L952L669L054K325J754J540J664J939K180K208
$$ y = [382801, 384316, 385448, 386071, 386304, 386450, 386753, 387289, 387888, 388128, 387620, 386446, 385121, 384057, 383362, 383194, 383793, 384897, 385572, 385099, 383761, 382292, 380857, 379107, 377061, 375275, 374073, 373160, 372115, 370860, 369486, 368040, 366718, 365881, 365559, 365182, 364133, 362472, 360824, 359599, 358597, 357398, 355903, 354395, 353205, 352442, 351966, 351473, 350592, 349064, 346910, 344406, 341892, 339615, 337749, 336382, 335342, 334141, 332284, 329675, 326690, 323929, 321910, 320774, 320090, 319122, 317583, 316023, 315109, 314680, 313919, 312455, 310768, 309433, 308565, 308206, 308656, 309916, 311240, 311797, 311599, 311282, 311169, 311076, 310925, 311009, 311580, 312621, 314105, 316068, 318339, 320566, 322642, 324846, 327397, 330126, 332710, 335023, 337125, 339108, 341089, 343193, 345422, 347631, 349712, 351648, 353282, 354260, 354377, 353956, 353753, 354479, 356447, 359524, 363294, 367246, 370915, 373969, 376294, 378048, 379588, 381252, 383191, 385371, 387579]
51990C87579J838J104M99N85J250J718J507J052J082J587J894J569Q90L78K35
51975D04767K98K80lm18n55k64p4p01k026l012k915k135j583j568j815k206k808
51958C83262l283l099k467k250k661k805k072j176j026j249q73j51l40j705k921
51943C55184k892k062j418j202j254j791k877l756l632k795k126j814j390q42
51929C25333p65j459k539l524m159m318m084l938m227m565m395m022m297n320
51915B73721o225o381o065n804n758n945o403o892o940o489n998n741n484n060
51901A88536m684m538m528m554m570m315l633l048l257l946l967k993k053k025
51887A36425k535k857l030l254l060k039q65n34r35j174j017j045j431j605j222
$$ y = [387579, 389417, 390521, 391020, 391605, 392855, 394573, 396080, 397132, 398214, 399801, 401695, 403264, 404154, 404532, 404767, 405065, 405345, 405342, 404924, 404369, 404105, 404031, 403330, 401304, 398292, 395377, 393242, 391659, 390091, 388276, 386070, 383262, 379979, 376880, 374413, 372163, 369502, 366697, 364625, 363449, 362423, 361174, 360301, 360150, 359810, 358105, 355184, 352292, 350230, 348812, 347610, 346356, 344565, 341688, 337932, 334300, 331505, 329379, 327565, 326175, 325333, 324568, 323109, 320570, 317046, 312887, 308569, 304485, 300547, 296320, 291755, 287360, 283338, 279041, 273721, 267496, 261115, 255050, 249246, 243488, 237543, 231140, 224248, 217308, 210819, 204821, 199080, 193596, 188536, 183852, 179314, 174786, 170232, 165662, 161347, 157714, 154666, 151409, 147463, 143496, 140503, 138450, 136425, 133890, 131033, 128003, 124749, 121689, 119650, 118785, 118251, 117316, 116142, 115125, 114080, 112649, 111044, 109822]
51872A09822o57k98l9K16K09j78n46n06k58k63n13n24JP08R77O23Q0j36j3Q8n5
51851A08738l96q44j303j477j094l95L2O4J71N69P70L28m11q10p87p02o60m53
51833A01340m6L29M79L26j67p83j028o07J27N12K60l64q09n69M13J427J509N82
51815A02931l41m84k73m15o51k62O04J035P12J81j99o39j079q97P9J004R45L1
51797A02282p89q73l74J72M72O91J115J606J595R05K88N89J474J692P21m84o99
51780A10383J51J190J759J846J666J331R27N62L07J80J68K21K95N09R75J516J790
51763A25776J800J921K271K427K089J656J735K240K521K264J853J762J924J961
51749A54200J714J374J152J040Q76N47J25k15l93n44q79j468k144k641k758k468
$$ y = [109822, 109165, 108867, 108828, 109044, 109253, 109075, 108529, 108023, 107765, 107502, 106989, 106465, 106466, 107174, 108151, 108774, 108854, 108718, 108705, 108793, 108738, 108342, 107498, 106195, 104718, 103624, 103229, 103261, 103325, 103496, 104065, 104835, 105163, 104752, 103942, 103155, 102453, 101793, 101340, 101294, 101623, 102102, 102428, 102261, 101478, 100450, 99843, 99970, 100482, 100742, 100378, 99569, 99000, 99413, 100840, 102349, 102931, 102590, 102106, 101833, 101418, 100767, 100505, 101109, 102144, 102856, 103037, 102838, 102199, 101120, 100223, 100302, 101306, 102251, 102282, 101493, 100620, 100246, 100418, 100890, 101581, 102696, 104302, 105897, 106802, 107090, 107679, 109153, 110845, 111566, 111082, 110383, 110534, 111724, 113483, 115329, 116995, 118326, 119253, 119815, 120122, 120302, 120470, 120691, 120986, 121495, 122470, 123986, 125776, 127576, 129497, 131768, 134195, 136284, 137940, 139675, 141915, 144436, 146700, 148553, 150315, 152239, 154200, 155914, 157288, 158440, 159480, 160356, 160903, 161028, 160813, 160420, 159876, 158997, 157529, 155385, 152744, 149986, 147518]
51733A47518j899j248o47j49J49R0l06o97p08l60m7l7k26m49p20r74q97l31L20
51714A38382N18K79j6l45r93j746j908j343q31r49j289j289j200j467j752j511
51698A22540j087j184j450q85L89J027M62k50j19L16N9p46j215j074o73j62M26
51681A16374N99j03j180j602j071k31L33N55M47km96n91l94m47q46j051p00r9
51663A09495L27N78P86Q15N09N4j93j47q0l29r53j626j942j872j818j973j929
51646I9702j221j69L50l3p10q55l58J46M4o13j184j111n03O2K63K93L94M40K46
51627I5183q7l33l76l9Q78K025K478J811Q03M57O67N91J10kO24J380J561J118
51609A08849L60m52r07n35M92J199P82m65j511j672j127n67m93p44o47J94J317
$$ y = [147518, 145619, 144371, 143724, 143575, 143724, 143814, 143508, 142811, 142103, 141743, 141696, 141659, 141433, 140984, 140264, 139290, 138393, 138062, 138382, 138900, 139179, 139163, 138818, 137825, 136079, 134171, 132828, 131997, 131048, 129759, 128470, 127270, 125803, 124051, 122540, 121453, 120269, 118819, 117934, 118323, 119350, 119812, 119562, 119443, 119759, 119818, 119072, 117857, 116783, 116110, 115948, 116374, 116973, 116870, 115690, 114088, 113017, 112786, 113119, 113674, 114121, 114119, 113623, 113032, 112638, 112191, 111345, 110294, 109594, 109495, 109822, 110400, 111186, 112001, 112510, 112564, 112371, 112224, 112144, 111815, 110862, 109236, 107294, 105422, 103604, 101631, 99702, 98481, 98312, 98662, 98629, 97919, 97064, 96706, 96852, 96896, 96283, 95099, 93988, 93485, 93547, 93810, 94103, 94497, 94937, 95183, 95096, 94763, 94387, 94348, 95226, 97251, 99729, 101540, 102343, 102800, 103467, 104058, 104168, 104166, 104790, 106170, 107731, 108849, 109209, 108757, 107850, 107315, 107807, 109006, 109788, 109323, 107812, 106140, 105013, 104446, 103953, 103209, 102562, 102756, 104073]
51592A04073J854J461M95o05j569k012j561m68L97N30L86P12J623K540K869K518
51576A13243J878J485J516J632J453J074Q05O42L82J66L36O79N35k06p86n62K14
51559A24486Q63J077R00L91k56n90l12L51R48J291J322Q69j43j281j859j557o84
51542A25816J38M06L7o63j298j654j643j220n88k58m49o11j47N24L74o64j388
51525A16712r45QL68J59K07O75Q16K21m88n52j19rn50j110q68M9N87O8q95j148
51505A13186m34M64R61J255J631J839J660J405J376J312Q92L55N6k18p98j285
51489A23657r27K05J191J509J597J964K305J960Q81k28o68l33M06J150J687J911
51473A38267J729J183N86L12M22O05O26N81O75Q91J069J152J158J060Q63P42R09
$$ y = [104073, 105927, 107388, 107883, 107278, 105709, 103697, 102136, 101668, 102065, 102595, 102981, 103693, 105316, 107856, 110725, 113243, 115121, 116606, 118122, 119754, 121207, 122281, 123086, 123728, 124110, 124276, 124612, 125291, 125826, 125620, 124834, 124272, 124486, 125349, 126426, 127326, 127717, 127461, 126871, 126559, 126910, 127858, 129149, 130471, 131340, 131197, 129916, 128057, 126500, 125816, 125954, 126360, 126397, 125734, 124436, 122782, 121139, 119919, 119331, 119073, 118624, 118013, 117866, 118390, 118764, 118100, 116712, 115767, 115775, 116143, 116302, 116509, 117184, 118000, 118221, 117733, 117181, 117062, 117053, 116503, 115393, 114525, 114574, 115161, 115229, 114334, 113186, 112752, 113216, 114177, 115432, 117063, 118902, 120562, 121967, 123343, 124655, 125547, 125902, 125958, 125740, 124942, 123657, 122730, 122935, 124126, 125635, 127232, 129196, 131501, 133461, 134342, 134114, 133446, 133113, 133519, 134669, 136356, 138267, 139996, 141179, 141765, 142077, 142499, 143104, 143730, 144311, 144986, 145877, 146946, 148098, 149256, 150316, 151179, 151921, 152830]
51456A52830J321J634J505R09J92j87p8K19K48j44p18j160j297j154r21q76j070
51439A51253j158q24l30k93q84j597j846j555j047p10p88j274j785j875j547j224
51423A32516j149j159j097j065j184j445j878k456k743k155q52J27m0j029j866
51408A12525k004j607j076p10o76r33j250j426j367r71k90K13J5o95j084p81l27
51391I7556k88m85m86k86m8L39Q15P72j32j182j395q84o40j020j327r80l50j14
51373H9865l37n33l65P6N28Q12Q58O16L3p76j352j237n44P8K45K51M55N85J50
51354H9408p00j249j052l43L71Q10J053J419K099K741K646J629M69Q1M62Q38P65
51337A01447N50O35Q51N54n74j931k379j479j64L05q4k49K46O14L32N7L44M35
$$ y = [152830, 154151, 155785, 157290, 158199, 158391, 158204, 158126, 158345, 158593, 158449, 157731, 156571, 155274, 154120, 153199, 152323, 151253, 150095, 149271, 148941, 148648, 147764, 146167, 144321, 142766, 141719, 141009, 140221, 138947, 137162, 135287, 133740, 132516, 131367, 130208, 129111, 128046, 126862, 125417, 123539, 121083, 118340, 116185, 115333, 115460, 115420, 114391, 112525, 110521, 108914, 107838, 107128, 106452, 105519, 104269, 102843, 101476, 100505, 100215, 100428, 100443, 99748, 98664, 97883, 97556, 97268, 96783, 96297, 96011, 95963, 96302, 97117, 97889, 97757, 96575, 95180, 94296, 93656, 92636, 91309, 90329, 89979, 89865, 89528, 88995, 88630, 88706, 89234, 90046, 90904, 91520, 91553, 90777, 89425, 88188, 87644, 87722, 87967, 88218, 88673, 89258, 89408, 88708, 87459, 86407, 86064, 86435, 87245, 88298, 89717, 91816, 94557, 97203, 98832, 99301, 99382, 99844, 100682, 101447, 101997, 102632, 103483, 104037, 103463, 101532, 99153, 97674, 97510, 97815, 97731, 97482, 97728, 98342, 98674, 98731, 99075, 99510]
51319I9510n17j858k266j719j277j241r52l56j90n01l42N32J062N38k89n94q03
51302H8737j595k420k227j153l82n03r66j107r00o12l40p4J84M39N85L58k38o95
51284G7091n11J52P32R98J091R60L56n73j222j232r05o63m94j52L18N23J39p34
51266G5874j587j800j178k42J62k19p62p55k47K01L60M55M64j8r67j543j073l7
51248F7088M46M3n05m66J18Q14J367J603J364Q26M99O05P57N49J65L8K31M64N01
51229G6507J95m85j196j299o20J84M10J37j45l28n61o81m05O7K97L38N59Q41N88
51210G4403l09j206j516j351j143j081j050q01j21Q27J354Q56l61j322j439r59
51194F4781l36L21J002J445J321O15l00q29n74K69J012J247J251J351J301P62
$$ y = [99510, 98993, 97135, 94869, 93150, 91873, 90632, 89680, 89324, 89134, 88633, 88291, 88823, 89885, 90423, 90134, 89540, 88737, 87142, 84722, 82495, 81342, 80960, 80457, 79491, 78384, 77484, 76872, 76532, 76458, 76642, 77081, 77666, 78024, 77786, 77091, 76580, 76732, 77464, 78462, 79553, 80513, 80869, 80296, 79074, 77842, 76937, 76274, 75780, 75628, 75946, 76469, 76608, 75874, 74287, 72487, 71309, 71067, 71229, 71010, 70248, 69493, 69246, 69447, 69807, 70262, 70726, 70708, 69741, 68198, 67125, 67088, 67534, 67577, 67072, 66606, 66724, 67538, 68905, 70508, 71872, 72698, 73197, 73802, 74559, 75108, 75273, 75311, 75542, 76006, 76507, 76702, 76217, 75021, 73722, 73102, 73286, 73696, 73833, 73688, 73360, 72799, 72118, 71713, 71780, 72077, 72415, 72974, 73815, 74403, 74094, 72888, 71372, 70021, 68878, 67797, 66747, 65946, 65825, 66652, 68006, 68862, 68501, 67179, 65740, 64781, 64445, 64766, 65768, 67213, 68534, 69149, 68849, 68020, 67446, 67715, 68727, 69974, 71225, 72576, 73877, 74639]
51178G4639Q5j21O8J39R0L23O70N17l3j60L53Q02Q02Q57J225J206K46j015j551
51159G9142j191l65O85J690J894P66j063k326k447j777q31N2N37N15M21P20J144
51142G7566J089N57J36M8l3j99m0N79J106J057O53L58J49k51o28l97N01J261J098
51123H4610K07m71l62J74L87n6r27j719j886j165oO07K32m12l50L63Q41O67K77
51104H1011K8k57o45p35l17J68K14j88p64j241j220m07P43J319J181J159J580
51087H1629J555M92n85l07J004J787J437Q60Q23R94Q99P52P93O22j28r66j025
51070I0636k13O86R32N23J9l5M71J140J353P57m03j419j728j409r87p37l69L53
51052H9570R72P88n2n68k29L53L59q8k77l1J68j6l14l32OM42O34M16nk19j32q0
$$ y = [74639, 74724, 74603, 74671, 74810, 74900, 75223, 75893, 76410, 76377, 76217, 76570, 77372, 78174, 79031, 80256, 81462, 81708, 80693, 79142, 77951, 77586, 78271, 79961, 81855, 82621, 81558, 79232, 76785, 75008, 74177, 74229, 74766, 75281, 75702, 76422, 77566, 78655, 79212, 79348, 79396, 79363, 79164, 79124, 79703, 80809, 81866, 82519, 82877, 83026, 82775, 82147, 81750, 82251, 83512, 84610, 84817, 84346, 83984, 84158, 84545, 84489, 83562, 81843, 79957, 78792, 78786, 79393, 79625, 79213, 78863, 79226, 80067, 80734, 81011, 81039, 80782, 80137, 79402, 79085, 79253, 79467, 79279, 78515, 77274, 76054, 75647, 76390, 77709, 78890, 80049, 81629, 83184, 83676, 83091, 82784, 83788, 85575, 87012, 87872, 88695, 89689, 90588, 91340, 92133, 92755, 92627, 91661, 90636, 90423, 91109, 92041, 92564, 92583, 92548, 93019, 94159, 95512, 96269, 95866, 94447, 92719, 91310, 90323, 89586, 89217, 89570, 90542, 91330, 91278, 90710, 90481, 90834, 91193, 91105, 90828, 90797, 90965, 90949, 90635, 90303, 90309, 90751, 91385, 91801, 91796, 91577, 91445, 91365]
51030I1365k74m34k86qJ66M01Q29J040O52N1n0L36N90M85L52K86om58m91R2O95
51009I5333O99K23k18l83l41k05q0p8j51j15M5J27K5j63l30l62J6J004K171K682
50989I9899K181J164K80l18p61j063j179j192j084o67O0P00R16P95N75K31k36
50972A00301m04J92J252J783J187O3l64L47J330J503R63Q41J633K380J943O41
50956A15591j74L9N01M86L02N11R55J164J169J276J356R88J88n97j044j097p28
50939A20886o0L94J54n04p34j49O75R27M59j60l06J28P08R35P85O64P83Q42O18
50920A27045N55J217K312K860K431J691J479J863K378K748K972L054L105L438
50906A59148M074M456M095L384L127L360L407L101L228M363N944O960P136O888
$$ y = [91365, 91091, 90657, 90371, 90363, 90529, 90930, 91759, 92799, 93451, 93502, 93452, 93788, 94378, 94863, 95215, 95501, 95495, 95037, 94546, 94638, 95333, 96032, 96255, 96037, 95654, 95313, 95108, 95028, 94950, 94799, 94684, 94729, 94856, 94881, 94718, 94388, 94026, 94042, 95046, 97217, 99899, 102080, 103244, 103524, 103206, 102445, 101382, 100203, 99011, 97927, 97260, 97320, 98020, 98936, 99731, 100306, 100537, 100301, 99897, 100089, 101341, 103124, 104311, 104374, 104010, 104357, 105687, 107190, 108153, 108994, 110627, 113007, 114950, 115591, 115417, 115456, 115957, 116443, 116745, 117256, 118211, 119375, 120544, 121820, 123176, 124164, 124352, 123755, 122711, 121614, 120886, 120826, 121220, 121374, 120870, 120136, 119987, 120662, 121589, 122048, 121888, 121582, 121710, 122418, 123353, 124138, 124802, 125585, 126427, 127045, 127600, 128817, 131129, 133989, 136420, 138111, 139590, 141453, 143831, 146579, 149551, 152605, 155710, 159148, 163222, 167678, 171773, 175157, 178284, 181644, 185051, 188152, 191380, 195743, 201687, 208647, 215783, 222671]
50892B22671O521O058N719N837O315O668O647O478O404O491O856P688Q887J0047
50878C19287J0896J1396J1439J0932J0278J0145J0513J0520R576Q187P136O368
50866D36673N278L689J937J49j843l937n764p265q709j0018j0666j0463r959r757
50852C69345r846r891r843r843r784r370q593p779p158o634o027n335m609l746
50838B60887k670j647j203j496j936j732p65L12R19J093J072P73O9p04j036r17
50822B51019p78p61n98k31k8j67k59M8M55M09l0k22J84P57Q46L86m9N9O10J129
50802B52779J428J834K597L333L361K662K137K634L962N152N663N866O300O908
50788C06616P320P628Q328R494J0534J0936J0906J0959J1245J1621J2167J3121
$$ y = [222671, 229192, 235250, 240969, 246806, 253121, 259789, 266436, 272914, 279318, 285809, 292665, 300353, 309240, 319287, 330183, 341579, 353018, 363950, 374228, 384373, 394886, 405406, 414982, 423169, 430305, 436673, 441951, 445640, 447577, 447726, 445883, 441946, 436182, 428917, 420208, 410190, 399524, 389061, 379102, 369345, 359499, 349608, 339765, 329922, 320138, 310768, 302175, 294396, 287238, 280604, 274577, 269242, 264633, 260887, 258217, 256570, 255367, 253871, 251935, 250203, 249438, 249750, 250669, 251762, 252834, 253607, 253676, 252972, 251936, 251019, 250241, 249480, 248882, 248651, 248623, 248456, 248197, 248245, 248700, 249109, 249079, 248857, 249041, 249798, 250644, 251030, 250981, 251040, 251650, 252779, 254207, 256041, 258638, 261971, 265332, 267994, 270131, 272765, 276727, 281879, 287542, 293408, 299708, 306616, 313936, 321564, 329892, 339386, 349920, 360856, 371762, 382721, 393966, 405587, 417754, 430875]
50776D30875J4345J5370J6046J6725J7656J8546J8938J8832J8694J9038K0028
50765F25093K1342K2369K2788K2965K3525K4582K5721K6684K7512K8029K7854
50754H98464K7080K6255K5315K3247J9451J4738J0384O637L017m36l198n427p935
50741A037592j0900j3455j4829j5206j5085j4521j3297j1439r098o357l431p31
50729I09243J597L911O564R461J2374J5450J8967K2755K6219K8883L0699L1821
50717A117944L2289L1986L0752K8468K5136K0996J6582J2510R066O039L049m9
50705A334768l348p235j2023j7196k1696k5254k8730l2656l6153l8037l8531l8885
50693A035024l9556l9810l9049l7502l5413l2602k9173k5863k3156k0723j8140
$$ y = [430875, 445220, 460590, 476636, 493361, 511017, 529563, 548501, 567333, 586027, 605065, 625093, 646435, 668804, 691592, 714557, 738082, 762664, 788385, 815069, 842581, 870610, 898464, 925544, 951799, 977114, 1000361, 1019812, 1034550, 1044934, 1051571, 1054588, 1054152, 1050954, 1045527, 1037592, 1026692, 1013237, 998408, 983202, 968117, 953596, 940299, 928860, 919762, 913405, 909974, 909243, 910840, 914751, 921315, 930776, 943150, 958600, 977567, 1000322, 1026541, 1055424, 1086123, 1117944, 1150233, 1182219, 1212971, 1241439, 1266575, 1287571, 1304153, 1316663, 1325729, 1331768, 1334817, 1334768, 1331420, 1324185, 1312162, 1294966, 1273270, 1248016, 1219286, 1186630, 1150477, 1112440, 1073909, 1035024, 995468, 955658, 916609, 879107, 843694, 811092, 781919, 756056, 732900, 712177, 694037]
50682F94037j5575j3276j1043q681o480m660k800m58K054M101N696P403R433J1391
50668F71142J2935J4192J5422J6656J7663J8081J7649J6457J4948J3459J1943
50657H40547J0326Q857P817P074O302N456M764M330M109M138M471M951N372N881
50643I24395O911Q647J0713J2377J3080J2889J2644J3341J5096J6777J7100J5987
50631A079957J4483J3439J2692J1729J0660J0140J0521J1527J2733J4021J5428
50620A217330J6829J8083J9391K1122K3230K5097K6226K6892K7917K9902L2874
50609A484893L6610M1040M6257N2280N8798O5146P0603P4830P7892P9748Q0019
50598B168116P8420P5148P0591O4969N8673N2536M7113M1925L6094K9629K3346
$$ y = [694037, 678462, 665186, 654143, 645462, 638982, 634322, 631522, 631064, 633118, 637219, 642915, 650318, 659751, 671142, 684077, 698269, 713691, 730347, 748010, 766091, 783740, 800197, 815145, 828604, 840547, 850873, 859730, 867547, 874621, 880923, 886379, 891143, 895473, 899582, 903720, 908191, 913142, 918514, 924395, 931306, 939953, 950666, 963043, 976123, 989012, 1001656, 1014997, 1030093, 1046870, 1063970, 1079957, 1094440, 1107879, 1120571, 1132300, 1142960, 1153100, 1163621, 1175148, 1187881, 1201902, 1217330, 1234159, 1252242, 1271633, 1292755, 1315985, 1341082, 1367308, 1394200, 1422117, 1452019, 1484893, 1521503, 1562543, 1608800, 1661080, 1719878, 1785024, 1855627, 1930457, 2008349, 2088097, 2168116, 2246536, 2321684, 2392275, 2457244, 2515917, 2568453, 2615566, 2657491, 2693585, 2723214, 2746560]
50587B746560J7468J1199L976l611j0556j6506k1610k5847k8995l0967l1714l1055
50575B578342k9018k6141k3063k0023j7038j4217j1682r436p696o990p547q869
50563B396622j0346j2048j4409j7309k0005k1974k3339k4410k5148k5279k4714
50552B177641k3607k2070j9940j6985j3398r941p301n466l997k868k629l703n991
50539B039745r201j3170j7712k2605k7864l3545l9128m3667m6807m9058n0794
50528A686194n1623n1181m9916m8517m7038m5198m3101m0964l8524l5342l1566
50517A203224k7779k4255k0873j7580j4462j1476q550n782l139k73K916N777P557
50504A085305Q350Q979J0093J1811J3917J5850J6908J7078J7411J8905K1294K3599
$$ y = [2746560, 2764028, 2775227, 2779203, 2775592, 2765036, 2748530, 2726920, 2701073, 2672078, 2641111, 2609397, 2578342, 2549324, 2523183, 2500120, 2480097, 2463059, 2448842, 2437160, 2427724, 2420028, 2413038, 2405491, 2396622, 2386276, 2374228, 2359819, 2342510, 2322505, 2300531, 2277192, 2252782, 2227634, 2202355, 2177641, 2154034, 2131964, 2112024, 2095039, 2081641, 2071700, 2064399, 2058933, 2054936, 2052068, 2049439, 2045736, 2039745, 2030544, 2017374, 1999662, 1977057, 1949193, 1915648, 1876520, 1832853, 1786046, 1736988, 1686194, 1634571, 1583390, 1533474, 1484957, 1437919, 1392721, 1349620, 1308656, 1270132, 1234790, 1203224, 1175445, 1151190, 1130317, 1112737, 1098275, 1086799, 1078249, 1072467, 1069328, 1069055, 1071971, 1077748, 1085305, 1093655, 1102634, 1112727, 1124538, 1138455, 1154305, 1171213, 1188291, 1205702, 1224607, 1245901, 1269500]
50492A269500K5667K8237L1690L5623L9739M4302M9465N4839N9929O4496O8273
$$ y = [1269500, 1295167, 1323404, 1355094, 1390717, 1430456, 1474758, 1524223, 1579062, 1638991, 1703487, 1771760]
$$ [...]
##END NTUPLES=NMR SPECTRUM
##END=
