
##TITLE=UV1204_M3_1292-1211_7185246_wvG09XVc7x
##JCAMPDX= 6.0         $$ Bruker NMR JCAMP-DX V2.0
##DATA TYPE= NMR SPECTRUM
##DATA CLASS= NTUPLES
##ORIGIN= BRUKER
##OWNER= Administrator
$$ 1.72 TOPSPIN		Version 2.1
$$ 2012-12-05 23:32:25.039 -0500  Administrator@X
$$ Compression mode = diff/dup
##.OBSERVE FREQUENCY= 400.02188249412
##.OBSERVE NUCLEUS= ^1H
##.ACQUISITION MODE= SIMULTANEOUS (DQD)
##.ACQUISITION SCHEME= undefined
##.AVERAGES= 64
##.DIGITISER RES= 22
##SPECTROMETER/DATA SYSTEM= spect
##.PULSE SEQUENCE= noesygpps1d.comp
##.SOLVENT NAME= COFFEE_meoh
##.SHIFT REFERENCE= INTERNAL, COFFEE_meoh, 1, 14.96083
##AUDIT TRAIL= $$ (NUMBER, WHEN, WHO, WHERE, PROCESS, VERSION, WHAT)
$$ ##TITLE= Audit trail, TOPSPIN		Version 2.1
$$ ##JCAMPDX= 5.01
$$ ##ORIGIN= Bruker BioSpin GmbH
$$ ##OWNER= Administrator
$$ $$ E:\/data/COFFEE/nmr/UV1204_M3_1292-1211_7185246_wvG09XVc7x/12/pdata/1/auditp.txt
$$ ##AUDIT TRAIL=  $$ (NUMBER, WHEN, WHO, WHERE, PROCESS, VERSION, WHAT)
(   1,<2012-12-05 23:32:18.654 -0500>,<Administrator>,<X>,<go>,<TOPSPIN 2.1>,
      <created by zg
	started at 2012-12-05 23:20:49.140 -0500,
	POWCHK enabled, PULCHK disabled,
       configuration hash MD5:
       86 BA 57 50 F2 9D 5C 9B 26 00 A9 28 5F 66 2E 89
       data hash MD5: 64K
       8D AB 80 AB FE D4 82 69 96 1C 2B 40 CD F6 F4 B6>)
(   2,<2012-12-05 23:32:22.024 -0500>,<Administrator>,<X>,<proc1d>,<TOPSPIN 2.1>,
      <Start of raw data processing
       efp LB = 0.3 FT_mod = 6 PKNL = 1 PHC0 = 0 PHC1 = 0 SI = 128K 
       data hash MD5: 128K
       64 4E FA 57 0E EC 26 5C 2E 8D CC 9F E6 78 C2 07>)
(   3,<2012-12-05 23:32:23.169 -0500>,<Administrator>,<X>,<proc1d>,<TOPSPIN 2.1>,
      <pk PHC0 = -81.93054 PHC1 = 0 
       data hash MD5: 128K
       20 46 FA 9A 57 13 2D 3B AB B3 A6 D0 99 66 9B A2>)
(   4,<2012-12-05 23:32:23.910 -0500>,<Administrator>,<X>,<proc1d>,<TOPSPIN 2.1>,
      <abs ABSG = 1 
       data hash MD5: 128K
       FD 03 D6 E7 42 8E 31 BF A5 C2 76 78 6A 7F 02 F1>)
(   5,<2012-12-05 23:32:24.096 -0500>,<Administrator>,<X>,<proc1d>,<TOPSPIN 2.1>,
      <abs ABSG = 2 
       data hash MD5: 128K
       10 C8 2B 93 3D C2 60 50 71 AC 97 38 30 0E 90 31>)
(   6,<2012-12-05 23:32:24.281 -0500>,<Administrator>,<X>,<proc1d>,<TOPSPIN 2.1>,
      <abs ABSG = 3 
       data hash MD5: 128K
       8E 7D 0F 78 7E B4 DB FA 73 A6 1A 64 EA FA 43 56>)
(   7,<2012-12-05 23:32:24.466 -0500>,<Administrator>,<X>,<proc1d>,<TOPSPIN 2.1>,
      <abs ABSG = 4 
       data hash MD5: 128K
       B0 8A 5E 3D 42 3F 53 4F BB 47 69 8B 0D A7 18 A4>)
(   8,<2012-12-05 23:32:24.651 -0500>,<Administrator>,<X>,<proc1d>,<TOPSPIN 2.1>,
      <abs ABSG = 5 
       data hash MD5: 128K
       5A 89 82 10 CF DB BB 36 AE 73 F5 47 B3 4E 38 D6>)
$$ ##END=
$$ 
$$ $$ hash MD5
$$ $$ 4A 93 B8 1A 42 39 B1 91 E1 1A AB ED AF 49 85 73
##$RELAX= 
##$RELAX= 
##$RELAX= 
##$RELAX= 
##$RELAX= 
##$RELAX= 
##$RELAX= 
##$RELAX= 
$$ Bruker specific parameters
$$ --------------------------
##$DU= <E:\>
##$EXPNO= 12
$$ [...]
##$TP07= 0
##$TPNAME0= <>
##$TPNAME1= <>
##$TPNAME2= <>
##$TPNAME3= <>
##$TPNAME4= <>
##$TPNAME5= <>
##$TPNAME6= <>
##$TPNAME7= <>
##$TPOAL= (0..7)
0.5 0.5 0.5 0.5 0.5 0.5 0.5 0.5
##$TPOFFS= (0..7)
0 0 0 0 0 0 0 0
##$TUNHIN= 0
##$TUNHOUT= 0
##$TUNXOUT= 0
##$USERA1= <user>
##$USERA2= <user>
##$USERA3= <user>
##$USERA4= <user>
##$USERA5= <user>
##$V9= 5
##$VALIST= <valist>
##$VCLIST= <CCCCCCCCCCCCCCC>
##$VD= 0
##$VDLIST= <DDDDDDDDDDDDDDD>
##$VPLIST= <PPPPPPPPPPPPPPP>
##$VTLIST= <TTTTTTTTTTTTTTT>
##$WBST= 1024
##$WBSW= 4
##$XGAIN= (0..3)
0 0 0 0
##$XL= 0
##$YL= 0
##$YMAX_a= 5983810
##$YMIN_a= -11512805
##$ZGOPTNS= <>
##$ZL1= 120
##$ZL2= 120
##$ZL3= 120
##$ZL4= 120
##$ABSF1= 14.96083
##$ABSF2= -5.597352
##$ABSG= 5
##$ABSL= 3
##$ALPHA= 0
##$AQORDER= 0
##$ASSFAC= 0
##$ASSFACI= 0
##$ASSFACX= 0
##$ASSWID= 0
##$AUNMP= <proc_prof1d_extract.lims>
##$AXLEFT= 0
##$AXNAME= <>
##$AXNUC= <1H>
##$AXRIGHT= 0
##$AXTYPE= 0
##$AXUNIT= <>
##$AZFE= 0.1
##$AZFW= 0.1
##$BCFW= 0
##$BC_mod= 0
##$BYTORDP= 0
##$COROFFS= 0
##$CY= 15
##$DATMOD= 1
##$DC= 0
##$DFILT= <>
##$DTYPP= 0
##$F1P= 0
##$F2P= 0
##$FCOR= 0.5
##$FTSIZE= 131072
##$FT_mod= 6
##$GAMMA= 0
##$GB= 0
##$INTBC= 1
##$INTSCL= 1
##$ISEN= 128
##$LB= 0.3
##$LEV0= 0
##$LPBIN= 0
##$MAXI= 10000
##$MC2= 0
##$MEAN= 0
##$ME_mod= 0
##$MI= 0
##$NCOEF= 0
##$NC_proc= -2
##$NLEV= 6
##$NOISF1= 0
##$NOISF2= 0
##$NSP= 0
##$NTH_PI= 0
##$NZP= 0
##$OFFSET= 14.96083
##$PC= 1
##$PHC0= -81.93054
##$PHC1= 0
##$PH_mod= 1
##$PKNL= yes
##$PPARMOD= 0
##$PPDIAG= 0
##$PPIPTYP= 0
##$PPMPNUM= 2147483647
##$PPRESOL= 1
##$PSCAL= 4
##$PSIGN= 0
##$PYNMP= <proc.py>
##$REVERSE= no
##$SF= 400.020009702907
##$SI= 131072
##$SIGF1= 0
##$SIGF2= 0
##$SINO= 400
##$SIOLD= 131072
##$SPECTYP= <>
##$SREGLST= <1H.CDCl3>
##$SSB= 0
##$STSI= 131072
##$STSR= 0
##$SW_p= 8223.68421052631
##$SYMM= 0
##$S_DEV= 0
##$TDeff= 65536
##$TDoff= 0
##$TI= <>
##$TILT= no
##$TM1= 0
##$TM2= 0
##$TOPLEV= 0
##$USERP1= <user>
##$USERP2= <user>
##$USERP3= <user>
##$USERP4= <user>
##$USERP5= <user>
##$WDW= 1
##$XDIM= 131072
##$YMAX_p= 407570048
##$YMIN_p= -13673
##$CURPLOT= <Network HP LaserJet P1505>
##$CURPRIN= <$Network HP LaserJet P1505>
##$DFORMAT= <normdp>
##$LAYOUT= <+/1D_H.xwp>
##$LFORMAT= <normlp>
##$PFORMAT= <normpl>
##$SURQMSG= 1
$$ End of Bruker specific parameters
$$ ---------------------------------
##NTUPLES= NMR SPECTRUM
##VAR_NAME=  FREQUENCY,     SPECTRUM/REAL,   SPECTRUM/IMAG
##SYMBOL=    X,             R,               I
##VAR_TYPE=  INDEPENDENT,   DEPENDENT,       DEPENDENT
##VAR_FORM=  AFFN,          ASDF,            ASDF
##VAR_DIM=   131072,        131072,          131072
##UNITS=     HZ,            ARBITRARY UNITS, ARBITRARY UNITS
##FACTOR=    0.0627417313425164, 1,          1
##FIRST=     8223.62146879497, 1241,         -52392
##LAST=      0,             2725,            -53219
##MIN=       0,             -13673,          0
##MAX=       8223.62146879497, 407570048,    0
$$ Real data points
##PAGE= N=1
##DATA TABLE= (X++(R..R)), XYDATA
$$ [...]
63949F18745L7482M2464M8850N7658O8156P8739Q9245J00962J14265J27783J40253
63938A524602J51753J62442J71445J77995J82567J85745J86675J83796J76492
63929C103512J65007J49251J28922J04607P7812M9893K1672o242l3594o0722q7774
63918C612344j13683j36646j55404j69422j78360j82500j83355j82451j79499
63909B131024j73105j63372j52333j41300j29489j16120j02475r0464q0130p0037
63899I12199n9647m9931m1829l5380l0316k6444k3292k0382j7980j6738j6415
63888E73845j5905j4756j3745j3523j3512j2744j1194r561q199o932n689m606
63876D43479l514j905M22K996N131O617P931R740J2157J4535J6168J7171J8290
$$ y = [618745, 656227, 698691, 747541, 805199, 873355, 952094, 1041339, 1142301, 1256566, 1384349, 1524602, 1676355, 1838797, 2010242, 2188237, 2370804, 2556549, 2743224, 2927020, 3103512, 3268519, 3417770, 3546692, 3651299, 3729111, 3779004, 3800676, 3794434, 3760840, 3700118, 3612344, 3498661, 3362015, 3206611, 3037189, 2858829, 2676329, 2492974, 2310523, 2131024, 1957919, 1794547, 1642214, 1500914, 1371425, 1255305, 1152830, 1062366, 982236, 912199, 852552, 802621, 760792, 725412, 695096, 668652, 645360, 624978, 606998, 590260, 573845, 557940, 543184, 529439, 515916, 502404, 489660, 478466, 468905, 460706, 453774, 448085, 443479, 439965, 438060, 438482, 441478, 446609, 453226, 461157, 470897, 483054, 497589, 513757, 530928, 549218]
63863E49218J9765K0800K0515J9101J7629J6803J6293J5314J3556J1476R867R146
63851G39483Q956Q361O522L320n65m128o732q610j0637j3294j5977j7718j8515
63838F70466j9368k0878k2530k3637k4285k4716k4548k3435k2004k1106k0404
63827D23555j8869j6589j4903j4479j4345j3377j1785j0489r748r179q545p774
63815B73473o649n185m046l818m169m387m439m767n219n121m344l454k737j861
63801B13277p38M5J7m84p94o82l73j94n05j500k787l533l344k672k107j737j465
63784A90424j436j615j467o80J78L78J19J37L78%j175k125j907q13K05P21Q69
63767A82191O89J16m93n49j5M26J74o52j455j786j575r83k38M04O85M16l25j052
$$ y = [549218, 568983, 589783, 610298, 629399, 647028, 663831, 680124, 695438, 708994, 720470, 730337, 739483, 748439, 756800, 763322, 766642, 766077, 761949, 755217, 746607, 735970, 722676, 706699, 688981, 670466, 651098, 630220, 607690, 584053, 559768, 535052, 510504, 487069, 465065, 443959, 423555, 404686, 388097, 373194, 358715, 344370, 330993, 319208, 308719, 298971, 289792, 281247, 273473, 266824, 261639, 257593, 253775, 249606, 245219, 240780, 236013, 230794, 225673, 221329, 217875, 215138, 213277, 212539, 212584, 212601, 212117, 211323, 210641, 210268, 210074, 209569, 208069, 205282, 201749, 198405, 195733, 193626, 191889, 190424, 188988, 187373, 185906, 185226, 185404, 185782, 185901, 186038, 186416, 186416, 185241, 183116, 181209, 180396, 180601, 181322, 182191, 182880, 182996, 182503, 181954, 181939, 182365, 182539, 181887, 180432, 178646, 177071, 176088, 175850, 176254, 176939, 177355, 177030, 175978]
63749A75978j135m36M68R08Q38O30L72o8l11L95J988L141K696J213M06J092K390
63732A90565K965K477J595J106J313J958K446K343J896J802K369L191L841M396
63718B24263N022N431N242M598L885L113K094J050M13J3q62k428l944m566m231
63703B39093l434k560j727j037n43k11p4k55o37p24j41R06J857K381K532K510
63687B37936K571K918L479L849L760L447L252L062K546J819J430J599J901J820
63673B75389J318O95J55k01k61k5K40K17m6j09L91J255J790J448M29m85q47j086
63655B80267j878l097l897l899l744m155m833m843l877k605j777j524j624j873
63641B36641j927j249K65J850K547K303J936K048K440K664K690K769K993L380
$$ y = [175978, 174843, 174407, 174875, 175783, 176621, 177251, 177623, 177555, 177244, 177639, 179627, 182768, 185464, 186677, 187083, 188175, 190565, 193530, 196007, 197602, 198708, 200021, 201979, 204425, 206768, 208664, 210466, 212835, 216026, 219867, 224263, 229285, 234716, 239958, 244556, 248441, 251554, 253648, 254698, 255111, 255124, 254262, 251834, 247890, 243324, 239093, 235659, 233099, 231372, 230335, 229792, 229581, 229507, 229252, 228615, 227891, 227750, 228656, 230513, 232894, 235426, 237936, 240507, 243425, 246904, 250753, 254513, 257960, 261212, 264274, 266820, 268639, 270069, 271668, 273569, 275389, 276707, 277402, 277557, 277356, 277095, 277070, 277310, 277527, 277481, 277372, 277763, 279018, 280808, 282256, 282685, 282200, 281353, 280267, 278389, 275292, 271395, 267496, 263752, 259597, 254764, 249921, 246044, 243439, 241662, 240138, 238514, 236641, 234714, 233465, 233730, 235580, 238127, 240430, 242366, 244414, 246854, 249518, 252208, 254977, 257970, 261350]
63627B61350M060N030N842O064N967O300P334Q496R127R286R620J0678J2485J4566
63613C76205J6252J7216J7896J9196K1488K4109K6117K7410K8745L0663L2732
63602F38029L3931L3552L1577K8344K4116J8923J2819O208o4m997p942q963q796
63589G96737q397q389q874r832j1549j4371j8018k1468k3781k4868k5230k5152
63577E96808k4518k3305k1858k0443j8820j6467j3259r786o913n032l708k177
63565D30522j55J914L441M342N013N855O974Q221R300R958J0266J0666J1568J2958
63551E30843J4593J6455J8698K1217K3605K5631K7602L0110L3524L7633M1422
63540H21333M3153M1042L4353K4094J2595K214n743j1131j4273j5386j4705j2839
$$ y = [261350, 265410, 270440, 276282, 282346, 288313, 294613, 301947, 310443, 319570, 328856, 338476, 349154, 361639, 376205, 392457, 409673, 427569, 446765, 468253, 492362, 518479, 545889, 574634, 605297, 638029, 671960, 705512, 737089, 765433, 789549, 808472, 821291, 827499, 827435, 822438, 814496, 805533, 796737, 788340, 779951, 771077, 761245, 749696, 735325, 717307, 695839, 672058, 647190, 621960, 596808, 572290, 548985, 527127, 506684, 487864, 471397, 458138, 448352, 441439, 436407, 432699, 430522, 430367, 432281, 435722, 440064, 445077, 450932, 457906, 466127, 475427, 485385, 495651, 506317, 517885, 530843, 545436, 561891, 580589, 601806, 625411, 651042, 678644, 708754, 742278, 779911, 821333, 864486, 905528, 939881, 963975, 976570, 978784, 973041, 961910, 947637, 932251, 917546, 904707]
63528I04707j0615q649p419p650r957j3944j8324k2288k6177l0270l3670l5229
63516F80515l5148l4564l3790l2086k9215k6081k3490k1198j8746j6400j4633
63505C95164j3353j2161j0905r503p767n917m726m538m664m353l807l625l668
63492C06177l380k848k680k899k782j857m41Q31J504J488J153J143J608J893J558
63477C00468J272J924L208L998L942L656L397K747J757J206J294J060k67k142
63463C27520l523m116m256m179m024m022m118l828l013k247j928j562n14R75K179
63448B89344K877L333L675L880M066M255M265M330N296P410R575J0690J1323J2962
63434C77281J5887J9053K1946K5189K8903L1641L1670K8712K3823J8222J2784
$$ y = [904707, 894092, 885443, 878024, 870374, 860417, 846473, 828149, 805861, 779684, 749414, 715744, 680515, 645367, 610803, 577013, 544927, 515712, 489631, 466141, 444943, 426197, 409797, 395164, 381811, 369650, 358745, 349242, 341475, 335558, 330832, 326294, 321630, 317277, 313470, 309845, 306177, 302797, 299949, 297269, 294370, 291588, 289731, 289290, 290121, 291625, 293113, 294266, 295409, 297017, 298910, 300468, 301740, 303664, 306872, 310870, 314812, 318468, 321865, 324612, 326369, 327575, 328869, 329929, 329662, 327520, 323997, 319881, 315625, 311446, 307422, 303400, 299282, 295454, 292441, 290194, 288266, 286704, 286190, 287165, 289344, 292221, 295554, 299229, 303109, 307175, 311430, 315695, 320025, 325321, 332731, 342306, 352996, 364319, 377281, 393168, 412221, 434167, 459356, 488259, 519900, 551570, 580282, 604105, 622327, 635111]
63423F35111Q284N392M445N425Q075J1958J6552K1346K5787K9382L2196L4889
63411H38842L7644L9341L8559L5214L0281K4104J6246P303n50n611q258r789j0645
63398A032681j0794j0978j2203j4388j6825j9696k3887k9198l4030l7131l8680
63387G84871l9235l8571l6272l2809k9300k6423k4031k1634j8892j5817j2787
63376D89100j0247q154n936l230m40J741L131M133N156O332P724R397J1242J3006
63362E22955J4690J6620J8933K1250K3158K4929K7308L0459L3554L5711L6982
63351H06549L7961L8624L8145L5890L1980K6722K0157J2614N168j068n879r682
63339A037181j2455j3619j3062j1817j1471j2968j6090j9891k3673k7403l1183
$$ y = [635111, 643395, 648787, 653232, 658657, 666732, 678690, 695242, 716588, 742375, 771757, 803953, 838842, 876486, 915827, 954386, 989600, 1019881, 1043985, 1060231, 1067534, 1066984, 1061373, 1053115, 1043326, 1032681, 1021887, 1010909, 998706, 984318, 967493, 947797, 923910, 894712, 860682, 823551, 784871, 745636, 707065, 670793, 637984, 608684, 582261, 558230, 536596, 517704, 501887, 489100, 478853, 470699, 464763, 461533, 461093, 462834, 465965, 470098, 475254, 481586, 489310, 498707, 509949, 522955, 537645, 554265, 573198, 594448, 617606, 642535, 669843, 700302, 733856, 769567, 806549, 844510, 883134, 921279, 957169, 989149, 1015871, 1036028, 1048642, 1053810, 1052742, 1046863, 1037181, 1024726, 1011107, 998045, 986228, 974757, 961789, 945699, 925808, 902135, 874732, 843549]
63328H43549l4443l6220l6267l5364l4131l2142k8747k4288j9784j5677j1667
63317E34819p695m361k435k473m818r130j3915j7339j8724j8725j8016j6659j4782
63304C85747j2938j1383r772p968o450n468m603l687l407m216n287n398m521l676
63290B96973l517l748l863l722l413l065k794k514j951j154p03r32j326j226p88
63275B62257o09p28o98m86m64n66k90M48J128J494J810K138K025J239K66k66k09
63258B68489K98J130K030K534K439K039J730J659J889K501L275L680L549L386
63244C00628L718M416M944N158N442O182P326Q491R369J0020J0768J1724J2539
63231D00725J2836J2717J2583J2503J2256J1922J1874J2035J1839J1162J0800
$$ y = [843549, 809106, 772886, 736619, 701255, 667124, 634982, 606235, 581947, 562163, 546486, 534819, 527124, 522763, 520328, 517855, 513037, 503907, 489992, 472653, 453929, 435204, 417188, 400529, 385747, 372809, 361426, 351654, 343686, 337236, 331768, 327165, 323478, 320071, 315855, 310568, 305170, 300649, 296973, 293456, 289708, 285845, 282123, 278710, 275645, 272851, 270337, 268386, 267232, 266529, 265597, 264271, 263045, 262257, 261648, 260920, 260222, 259736, 259272, 258706, 258416, 258864, 259992, 261486, 263296, 265434, 267459, 268698, 268964, 268698, 268489, 268787, 269917, 271947, 274481, 276920, 278959, 280689, 282348, 284237, 286738, 290013, 293693, 297242, 300628, 304346, 308762, 313706, 318864, 324306, 330488, 337814, 346305, 355674, 365694, 376462, 388186, 400725, 413561, 426278, 438861, 451364, 463620, 475542, 487416, 499451, 511290, 522452, 533252]
63220E33252J1493J2890J3953J4169J3885J3645J3617J3672J3551J2926J1491
63209F78544R087N741J686k536o245r113j1333j3193j4604j5286j5235j4792j4287
63196E78434j3765j2947j1388q868n795k976q34J033L313O192R240J1841J3617
63183E67097J4633J5413J6579J8203J9716K0589K0899K0978K0851K0352J9633
63172G74943J9089J8816J8439J7584J6269J4772J3199J1236Q375M511J81m026
63160I13388q221j2939j8130k2920k6581k9170l0926l1667l1330l0525k9890k9144
63148F11945k7553k5099k2535k0317j8166j5767j3275j1091r560q889q849q593
63136D22251p327n333l765l260l267k884j928q87k45j12k39j69L99J300K112K688
$$ y = [533252, 544745, 557635, 571588, 585757, 599642, 613287, 626904, 640576, 654127, 667053, 678544, 687631, 693372, 695058, 692522, 686277, 677164, 665831, 652638, 638034, 622748, 607513, 592721, 578434, 564669, 551722, 540334, 531466, 525671, 522695, 521861, 522894, 526207, 532399, 541639, 553480, 567097, 581730, 597143, 613722, 631925, 651641, 672230, 693129, 714107, 734958, 755310, 774943, 794032, 812848, 831287, 848871, 865140, 879912, 893111, 904347, 912722, 917233, 917414, 913388, 905167, 892228, 874098, 851178, 824597, 795427, 764501, 732834, 701504, 670979, 641089, 611945, 584392, 559293, 536758, 516441, 498275, 482508, 469233, 458142, 448582, 439693, 430844, 422251, 414924, 409591, 405826, 402566, 399299, 396415, 394487, 393600, 393355, 393243, 393004, 392835, 393234, 394534, 396646, 399334]
63120C99334L148L456L481L491M019N014N689N460M658L993L792M039M656N321
63106D59551N427M743L873L574L827L997L728L213K722K369K355K855L607L948
63092E09789L454K321J032o7q08j125j109j026j088j305j568j806j974j961j671
63077E01088j142n75j95p3n3R9M97J090J796K592L497M482N416O106O491O866
63061E37982P777R444J1435J3060J4137J5051J6202J7638J9286K1159K3238K5450
63049G31859K7836L0440L2905L4512L4892L4469L4008L3937L4190L4446L4368
63038A097862L3924L3570L3730L3967L3317L1791L0786L1232L1920L0579K6475
63027A449153K0866J5050R065K587l983j0108j6038k2249k8412l3669l7627m0360
$$ y = [399334, 402482, 405938, 409419, 412910, 416929, 421943, 427632, 433092, 437750, 441743, 445535, 449574, 454230, 459551, 464978, 469721, 473594, 477168, 480995, 484992, 488720, 491933, 494655, 497024, 499379, 502234, 505841, 509789, 513243, 515564, 516596, 516529, 515721, 514596, 513487, 512461, 511373, 510068, 508500, 506694, 504720, 502759, 501088, 499946, 499371, 499176, 499103, 499050, 499149, 499646, 500736, 502532, 505124, 508621, 513103, 518519, 524625, 531116, 537982, 545759, 555203, 566638, 579698, 593835, 608886, 625088, 642726, 662012, 683171, 706409, 731859, 759695, 790135, 823040, 857552, 892444, 926913, 960921, 994858, 1029048, 1063494, 1097862, 1131786, 1165356, 1199086, 1233053, 1266370, 1298161, 1328947, 1360179, 1392099, 1422678, 1449153, 1470019, 1485069, 1494134, 1496721, 1492738, 1482630, 1466592, 1444343, 1415931, 1382262, 1344635, 1304275]
63015A304275m1577m0705l7917l4285l0627k6823k2537j8016j3593q955l575K290
63003A027955P797J2628J7282K2090K6614L0273L3024L4967L5863L5670L5199
62992A319362L5461L6311L6516L5371L3593L2299L1540L0323K7816K4051J9464
62981A662107J4191P921L78q167j6895k5063l2649m0087m7365n3617n7887o0007
62969A342860o0516n9937n8427n6003n2747m8838m4610m0530l6895l3602l0428
62958H20327k7421k4768k2383k0020j7770j6089j5235j4966j4892j4825j4669
62947F17289j4270j3644j3122j3012j3130j2938j2172j1142j0399j0175j0270
62936D83015j0284r875q873p423o035n280n231n346n058m356l543k699j742r32
$$ y = [1304275, 1262698, 1221993, 1184076, 1149791, 1119164, 1092341, 1069804, 1051788, 1038195, 1029240, 1025665, 1027955, 1035752, 1048380, 1065662, 1087752, 1114366, 1144639, 1177663, 1212630, 1248493, 1284163, 1319362, 1354823, 1391134, 1427650, 1463021, 1496614, 1528913, 1560453, 1590776, 1618592, 1642643, 1662107, 1676298, 1684219, 1684597, 1676430, 1659535, 1634472, 1601823, 1561736, 1514371, 1460754, 1402867, 1342860, 1282344, 1222407, 1163980, 1107977, 1055230, 1006392, 961782, 921252, 884357, 850755, 820327, 792906, 768138, 745755, 725735, 707965, 691876, 676641, 661675, 646783, 631958, 617289, 603019, 589375, 576253, 563241, 550111, 537173, 525001, 513859, 503460, 493285, 483015, 472731, 462856, 453983, 446560, 440525, 435245, 430014, 424668, 419610, 415254, 411711, 409012, 407270, 406338]
62922D06338p09r42q97k16N21N65l9o95j111j420j653j670j538j537j672j605
62906C91720j202q35r88j716k519k732k128j221p20o06j31J013K023K061J479
62891C83498J237J387J149M65L08J094J799J301j16j322j825j935j836j408q74
62876C82922q00j283j725j626j218j080j420j868j928j507j081j244j986k550
62862C61606k235j200k87j25o22j266j567j317p30l42m79q29q17l74k0m5r0K81
62844C49542Q94J187R88P18P87J100J225R23L77m5j44k7Ml39j073j819j999j357
62826C50942l44K81K85K47P18J375J349M19n49n80L19J310J808J993K294K765
62810C64632L148L330L372L283L064K927L185L797M271M177L614L124L237M182
$$ y = [406338, 405629, 404687, 403790, 403574, 404095, 404660, 404621, 403926, 402815, 401395, 399742, 398072, 396534, 394997, 393325, 391720, 390518, 389683, 388695, 386979, 384460, 381728, 379600, 378379, 377659, 377053, 376922, 377935, 379958, 382019, 383498, 384735, 386122, 387271, 387736, 388044, 389138, 390937, 392238, 392122, 390800, 388975, 387040, 385204, 383796, 382922, 382122, 380839, 379114, 377488, 376270, 375190, 373770, 371902, 369974, 368467, 367386, 366142, 364156, 361606, 359371, 358171, 357884, 357759, 357137, 355871, 354304, 352987, 352257, 351915, 351436, 350607, 349790, 349416, 349396, 349351, 349261, 349542, 350436, 351623, 352611, 353329, 354116, 355216, 356441, 357364, 357741, 357696, 357552, 357525, 357529, 357190, 356117, 354298, 352299, 350942, 350598, 350879, 351164, 351411, 352129, 353504, 354853, 355272, 354723, 354143, 354462, 355772, 357580, 359573, 361867, 364632, 367780, 371110, 374482, 377765, 380829, 383756, 386941, 390738, 395009, 399186, 402800, 405924, 409161, 413343]
62796D13343N772P390Q341Q476Q302Q368Q729R290J0325J2155J4480J6610J8349
62783E49930K0160K2377K4882K7688L1241L5673M0272M4173M7300N0117N2687
62772I46500N4512N5137N4422N2170M8089M2237L5194K7519J9339J0600J524p467
62760A339776j6115k4330l1829l8023m2462m5348m7358m8908m9777m9583m8426
62749H97617m6756m4770m2314l9374l6213l3008k9752k6628k4000k1840j9674
62738E33288j7402j5558j4318j2828j0371p729o462o856p493o999n474l826k468
62725D15504j226o6P78J289J761K359K929L332L765M570N818P150Q170Q939R892
62710D74964J1259J2804J4365J6265J8867K1919K4869K7710L0964L4772L8592
$$ y = [413343, 419115, 426505, 434846, 443322, 451624, 459992, 468721, 478011, 488336, 500491, 514971, 531581, 549930, 570090, 592467, 617349, 645037, 676278, 711951, 752223, 796396, 843696, 893813, 946500, 1001012, 1056149, 1110571, 1162741, 1210830, 1253067, 1288261, 1315780, 1335119, 1345719, 1347243, 1339776, 1323661, 1299331, 1267502, 1229479, 1187017, 1141669, 1094311, 1045403, 995626, 946043, 897617, 850861, 806091, 763777, 724403, 688190, 655182, 625430, 598802, 574802, 552962, 533288, 515886, 500328, 486010, 473182, 462811, 455082, 448620, 441764, 434271, 427272, 421798, 417972, 415504, 414278, 414212, 414990, 416279, 418040, 420399, 423328, 426660, 430425, 434995, 440813, 447963, 456133, 465072, 474964, 486223, 499027, 513392, 529657, 548524, 570443, 595312, 623022, 653986, 688758, 727350]
62699G27350M2015M5372M9214N3591N8108O2372O6027O8692P0176P0650P0228
62688A383795O8529O4903N8977N0828M0792K9305J6772L456j0337k3852l6040
62677A647128m6324n4974o2383o8262p1929p3197p2586p0783o8172o4821o0703
62666I32994n6028n1487m7872m5096m2072l8045l3646l0012k7199k4319k1119
62655E16099j8372j6487j4789j2682j0771r913r768r168p784o558o396p048p551
62642C78812p286o338n161m217l722l500l146k448j616r82n99k88J5J34q7n26
62626C39045q95j087j252j496j591j179l22L60L00l23o86j81J001K153K764K868
62610C39479K883L268M210N361N940N406M209L567M270N831P164P955Q893J0563
$$ y = [727350, 769365, 814737, 863951, 917542, 975650, 1038022, 1104049, 1172741, 1242917, 1313567, 1383795, 1452324, 1517227, 1576204, 1627032, 1667824, 1697129, 1713901, 1717357, 1707020, 1683168, 1647128, 1600804, 1545830, 1483447, 1415185, 1343256, 1270059, 1197473, 1126690, 1058518, 993697, 932994, 876966, 825479, 777607, 732511, 690439, 652394, 618748, 588736, 561537, 537218, 516099, 497727, 481240, 466451, 453769, 442998, 433085, 423317, 414149, 406365, 399807, 393411, 386363, 378812, 371526, 365188, 360027, 355810, 352088, 348588, 345442, 342994, 341378, 340396, 339797, 339509, 339524, 339658, 339571, 339045, 338150, 337063, 335811, 334315, 332724, 331545, 331223, 331583, 331883, 331560, 330874, 330693, 331694, 333847, 336611, 339479, 342362, 345630, 349840, 355201, 361141, 366547, 370756, 374323, 378593, 384424, 391588, 399543, 408436, 418999]
62596D18999J2630J4434J5919J7495J9231K0775K2052K3429K5013K6234K6428
62585F42639K5459K3454K0310J5909J0719N646J178l022p482j2157j6363j9446
62573F86844k1323k2401k3061k3317k3013k2303k1642k1170k0364j8623j6171
62562D53456j3974j2732j2177j1495j0197q359o316m428l092k607k874l345l481
62549C58379l167k651k133j590j048p60q23p44J01J456K125J393J55l4J045K025
62533C53729J860J143J093J856K593K876L110L645M278M854N771P498R894J2295
62519D16495J4130J5365J6567J8512K1456K4757K7584K9921L2469L5464L8221
62508F90941M0067M1109M1675M1467L9833L6573L1995K6369J9795J2569N200j824
$$ y = [418999, 431629, 446063, 461982, 479477, 498708, 519483, 541535, 564964, 589977, 616211, 642639, 668098, 691552, 711862, 727771, 738490, 744136, 745314, 742292, 734810, 722653, 706290, 686844, 665521, 643120, 620059, 596742, 573729, 551426, 529784, 508614, 488250, 469627, 453456, 439482, 426750, 414573, 403078, 392881, 384522, 378206, 373778, 370686, 368079, 365205, 361860, 358379, 355212, 352561, 350428, 348838, 347790, 347030, 346207, 345463, 345564, 347020, 349145, 350538, 350693, 350659, 351704, 353729, 355589, 356732, 357825, 359681, 362274, 365150, 368260, 371905, 376183, 381037, 386808, 394306, 404200, 416495, 430625, 445990, 462557, 481069, 502525, 527282, 554866, 584787, 617256, 652720, 690941, 731008, 772117, 813792, 855259, 895092, 931665, 963660, 990029, 1009824, 1022393, 1027593, 1025769]
62496A025769q091j3300j7578k1380k4740k6930k7419k6784k5921k4637k1979
62485G87010j7866j3365r157m798M8M576P848J0189J2675J5608J8310K0195K1204
62472H52477K1227J9912J7235J3694R702N226K45m809r463j3786j8253k3024k7625
62459H42758l1344l3807l5036l5132l4174l2508l0766k9203k7265k4308k0694
62448E08521j7562j5391j3495j1217q908p199n956m718l610k929k183n89J562
62435D16326L082L530L625L848L742L039K425K343J913M5k868n363o738p512q227
62420D13210q761q884q571p628n834l785k743l149l925l915l361l322l938m249
62406C41145l652k640j911j432q61k85kJ39N38J107J274Q52L75L75P52J148J590
$$ y = [1025769, 1017678, 1004378, 986800, 965420, 940680, 913750, 886331, 859547, 833626, 808989, 787010, 769144, 755779, 746622, 741824, 741872, 746448, 754296, 764485, 777160, 792768, 811078, 831273, 852477, 873704, 893616, 910851, 924545, 934247, 939473, 939718, 934909, 925446, 911660, 893407, 870383, 842758, 811414, 777607, 742571, 707439, 673265, 640757, 609991, 580788, 553523, 529215, 508521, 490959, 475568, 462073, 450856, 441948, 434749, 428793, 424075, 420465, 417536, 415353, 414764, 416326, 419408, 422938, 426563, 430411, 434153, 437192, 439617, 441960, 443873, 443918, 441050, 435687, 428949, 421437, 413210, 404449, 395565, 386994, 379366, 373532, 369747, 367004, 363855, 359930, 356015, 352654, 349332, 345394, 341145, 337493, 334853, 332942, 331510, 330649, 330364, 330362, 330501, 331039, 332146, 333420, 334272, 334647, 335022, 335774, 336922, 338512]
62389C38512K318L167L562L234K562K125K169K545K995L366L746M417N494O635
62375C86847P344P613P926Q558R241R687J0127J0922J1984J2980J3938J5199J6840
62362E29206J8636K0571K2906K5648K8531L1672L5784M1160M6882N1591N4911
62351I07498N7530N9826O1020N9945N6266N0524M3256L4599K4755J4487M884l311
62339A371279j0147j6377k2848k9783l6521m2062m5874m8027m8724m8076m6384
62328I76456m4117m1348l7618l2828k7966k4316k2044k0184j8039j6008j4817
62317F77171j4534j4762j5345j6278j7191j7511j7155j6626j6366j6288j5968
62306D99147j5057j3491j1527r683q406p710p232o633n811m778l552k218r24J83
$$ y = [338512, 340830, 343997, 347559, 350793, 353355, 355480, 357649, 360194, 363189, 366555, 370301, 374718, 380212, 386847, 394191, 401804, 409730, 418288, 427529, 437216, 447343, 458265, 470249, 483229, 497167, 512366, 529206, 547842, 568413, 591319, 616967, 645498, 677170, 712954, 754114, 800996, 852587, 907498, 965028, 1024854, 1085874, 1145819, 1202085, 1252609, 1295865, 1330464, 1355219, 1369706, 1374590, 1371279, 1361132, 1344755, 1321907, 1292124, 1255603, 1213541, 1167667, 1119640, 1070916, 1022840, 976456, 932339, 890991, 853373, 820545, 792579, 768263, 746219, 726035, 707996, 691988, 677171, 662637, 647875, 632530, 616252, 599061, 581550, 564395, 547769, 531403, 515115, 499147, 484090, 470599, 459072, 449389, 440983, 433273, 426041, 419408, 413597, 408819, 405267, 403049, 402125, 402308]
62292D02308R72J357J410J444J743K293K837L147L081K665K270K501L508M649
62278D36185N245N411N654N876N595N039N112O002O775O774O554O870P562Q315
62264E22969R768J2649J6229J8960K0637K2722K6281L0761L5199L9595M4393M9405
62252H49568N4068N8226O1876O4506O5303O3813N9860N3253M4184L3665K2849
62241A431171J2183J782p752j5827k2935l0225l7901m4974n0762n5661n9976o2893
62229A056230o3290o1019n6862n1764m6597m2111l8409l4804l0787k6792k3459
62218E80336k0657j7984j5730j4359j3355j1691r479p940p585p515o929o265o113
62205D34734n950m876l089j665j189j349j657j779j276J18J903L178L687M044
$$ y = [402308, 403280, 404637, 406047, 407491, 409234, 411527, 414364, 417511, 420592, 423257, 425527, 428028, 431536, 436185, 441430, 446841, 452495, 458371, 463966, 469005, 474117, 480119, 486894, 493668, 500222, 507092, 514654, 522969, 532737, 545386, 561615, 580575, 601212, 623934, 650215, 680976, 716175, 755770, 800163, 849568, 903636, 961862, 1023738, 1088244, 1153547, 1217360, 1277220, 1330473, 1374657, 1408322, 1431171, 1443354, 1445136, 1437384, 1421557, 1398622, 1368397, 1330496, 1285522, 1234760, 1179099, 1119123, 1056230, 992940, 931921, 875059, 823295, 776698, 734587, 696178, 661374, 630587, 603795, 580336, 559679, 541695, 525965, 511606, 498251, 486560, 477081, 469141, 461556, 454041, 447112, 440847, 434734, 428784, 423908, 420819, 419154, 417965, 416616, 414959, 413180, 411904, 412022, 413925, 417103, 420790, 424834]
62191D24834M779N782O774P753Q713R486J0129J1068J2431J3630J3991J3657J3414
62178E56441J3745J4355J4670J4489J4042J3585J3077J2389J1814J2214J4374
62167G05195J8189K2711K7078L1147L5152L9107M2784M6021M8628N0003M9286
62156A115301M6048M0666L3925K6388J8266R778J426o247j3042j9186k4923l0166
62144A198234l4611l8126m0831m2763m3637m3075m1052l8051l4741l1486k8175
62133G81686k4513k0536j6697j3362j0384p416m573k496j642j778k226k398k036
62120F71629j072M69K507M836O981Q195P903O186L676R33j710l701m224l038j067
62105F98503K33K0j663m394p640j0590j2355j2587j1709j0372q888p240n393l415
$$ y = [424834, 429613, 435395, 442169, 449922, 458635, 468121, 478250, 489318, 501749, 515379, 529370, 543027, 556441, 570186, 584541, 599211, 613700, 627742, 641327, 654404, 666793, 678607, 690821, 705195, 723384, 746095, 773173, 804320, 839472, 878579, 921363, 967384, 1016012, 1066015, 1115301, 1161349, 1202015, 1235940, 1262328, 1280594, 1290372, 1291798, 1285551, 1272509, 1253323, 1228400, 1198234, 1163623, 1125497, 1084666, 1041903, 998266, 955191, 914139, 876088, 841347, 809861, 781686, 757173, 736637, 719940, 706578, 696194, 688778, 684205, 681709, 680067, 678289, 676063, 673665, 671629, 670557, 671026, 673533, 678369, 685350, 693545, 701448, 707634, 711310, 712243, 710533, 706832, 702608, 699570, 698503, 698736, 698756, 697093, 692699, 685059, 674469, 662114, 649527, 637818, 627446, 618558, 611318, 605925, 602510]
62091F02510j388O13K475M024N117N782O335P147Q296R510J0586J1633J2795J3974
62077F99409J5074J6259J7645J8906J9689K0242K1180K2652K4173K5303K5998
62066I26530K6261K6046K5678K5885K7044K8767L0526L2177L3585L4108L3050
62055A249657L0412K6705K2167J6684J0426M069j787p086j2122j7145k2220k7251
62043A272509l2011l6335m0266m3782m6392m7361m6537m4689m2763m0986l8906
62032H12481l6191l3033k9787k6558k3385k0573j8442j6791j4992j2777j0640
62021E69312r142q172p297o630o701p419p880p483o652o057n630m994m396m371
62007D76488m653m316l148k084j905k109j583l8J732K828L079K938K863K880K618
$$ y = [602510, 601122, 601735, 604210, 608234, 613351, 619133, 625468, 632615, 640911, 650421, 661007, 672640, 685435, 699409, 714483, 730742, 748387, 767293, 786982, 807224, 828404, 851056, 875229, 900532, 926530, 952791, 978837, 1004515, 1030400, 1057444, 1086211, 1116737, 1148914, 1182499, 1216607, 1249657, 1280069, 1306774, 1328941, 1345625, 1356051, 1360120, 1358333, 1351247, 1339125, 1321980, 1299760, 1272509, 1240498, 1204163, 1163897, 1120115, 1073723, 1026362, 979825, 935136, 892373, 851387, 812481, 776290, 743257, 713470, 686912, 663527, 642954, 624512, 607721, 592729, 579952, 569312, 560170, 551998, 544701, 538071, 531370, 523951, 516071, 508588, 501936, 495879, 490249, 485255, 480859, 476488, 471835, 467519, 464371, 462287, 460382, 458273, 456690, 456652, 458384, 461212, 464291, 467229, 470092, 472972, 475590]
61992D75590J858R65M76K82l59j752l202l923m123m647n774o979p806q321q656
61977D23629q695q434q156p917p318o123m743l764l209k779k512k708l196l307
61963C50768k764k119k034k339k227j196L63J555J737R94N7k35M32J631K688L308
61947C50619L683M074M515M933N315N707O200P040Q552J0784J3339J5665J7387
61934D57813J8335J8473J8091J7740J7665J7430J6541J5330J4565J4217J3264
61923F39464J1075Q316N966L900J255k070n090p013q077q819r138q566p129n374
61909F08700l651j788N19L244O064Q667J0955J2927J4431J5070J4487J2663R870
61896G12158O391K538j232m564p545j0381j2722j3843j3664j2994j2472j1839
$$ y = [475590, 477448, 478413, 478889, 479171, 478812, 477060, 473858, 469935, 465812, 461165, 455391, 448412, 440606, 432285, 423629, 414934, 406500, 398344, 390427, 383109, 376986, 372243, 368479, 365270, 362491, 359979, 357271, 354075, 350768, 348004, 345885, 343851, 341512, 339285, 338089, 338452, 340007, 341744, 342738, 342795, 342560, 342992, 344623, 347311, 350619, 354302, 358376, 362891, 367824, 373139, 378846, 385046, 392086, 400638, 411422, 424761, 440426, 457813, 476148, 494621, 512712, 530452, 548117, 565547, 582088, 597418, 611983, 626200, 639464, 650539, 658855, 664821, 668721, 669976, 667906, 662816, 655803, 647726, 638907, 629769, 621203, 614074, 608700, 605049, 603261, 603780, 607024, 613088, 621755, 632710, 645637, 660068, 675138, 689625, 702288, 712158, 718549, 721087, 719855, 715291, 707746, 697365, 684643, 670800, 657136, 644142, 631670, 619831]
61884F19831j0709r502q898q775q475p950p725p871p816p370p087p329p699p736
61870E04889p511p171o456n238m037l402l109k506j434l20M70R38J318K013L465
61855D71909N625P795R423J0918J3032J5715J8190K0133K2012K4087K5808K6590
61843F71237K6696K6792K6860K5998K3380J9157J4350R927O036K122k223o623
61831H43709j0200j2299j2864j2348j1377j0228q366m846L50N655R210J0788J1769
61818G98953J3150J4306J3871J1276P004J826l683r166j4402j9168k2994k5351
61806G65622k6208k6241k6190k6239k6090k5349k3742k1301j8565j6202j4230
61795E15265j2017r304o785n232m488l847l058k421k106j997k146k690l325l374
$$ y = [619831, 609122, 599620, 590722, 581947, 573472, 565522, 557797, 549926, 542110, 534740, 527653, 520324, 512625, 504889, 497378, 490207, 483751, 478513, 474476, 471074, 467965, 465459, 464025, 463705, 464175, 465113, 466431, 468444, 471909, 477534, 485329, 494752, 505670, 518702, 534417, 552607, 572740, 594752, 618839, 644647, 671237, 697933, 724725, 751585, 777583, 800963, 820120, 834470, 844397, 850433, 852555, 850332, 843709, 833509, 821210, 808346, 795998, 784621, 774393, 766027, 761181, 761531, 767186, 776396, 787184, 798953, 812103, 826409, 840280, 851556, 858560, 860386, 856703, 847537, 833135, 813967, 790973, 765622, 739414, 713173, 686983, 660744, 634654, 609305, 585563, 564262, 545697, 529495, 515265, 503248, 493944, 487159, 481927, 477439, 473592, 470534, 468113, 466007, 464010, 461864, 459174, 455849, 452475]
61781D52475k573j439p07o74j100j500j461q91p0O29R58P31j71j456k376k445
61765D37930j992j574j127k58P61J098N56kK94J313K281K716K681K429K123J773
61749D51002J234L62o81j484j873k118k553l161l610l540k816j763j138j408k073
61734D24380k132j368o22n35o09j3J106J805J624J080Q41R78J261J630K099K389
61718D33914K094J268N67O49J495K433K851K713K310J751R58J3q16j431j944k404
61702D46421k755l120l677m219m268l774l290l149l045k706k520k906l460l473
61688D00059l056k948l237l128k210j190q77r91o66J68O73L32k97l43K26N93J13
61671C83221r69j828j932j439q51m14k3M16P04N62L8m76o39m69k52k32n03r73
$$ y = [452475, 449902, 448463, 447756, 447082, 445982, 444482, 443021, 442130, 442060, 442689, 443647, 444378, 444207, 442751, 440375, 437930, 435938, 434364, 433237, 432979, 433740, 434838, 435394, 435392, 435686, 436999, 439280, 441996, 444677, 447106, 449229, 451002, 452236, 452598, 451917, 450433, 448560, 446442, 443889, 440728, 437118, 433578, 430762, 428999, 427861, 426453, 424380, 422248, 420880, 420258, 419723, 419114, 419101, 420207, 422012, 423636, 424716, 425557, 426535, 427796, 429426, 431525, 433914, 436008, 437276, 437843, 438492, 439987, 442420, 445271, 447984, 450294, 452045, 453003, 453016, 452200, 450769, 448825, 446421, 443666, 440546, 436869, 432650, 428382, 424608, 421318, 418169, 415124, 412418, 409898, 406992, 403532, 400059, 397003, 394055, 390818, 387690, 385480, 384290, 383413, 382422, 381756, 381924, 382597, 382929, 382632, 382289, 382515, 383108, 383221, 382252, 380424, 378492, 377053, 376202, 375788, 375765, 376181, 376885, 377447, 377485, 377009, 376370, 375901, 375649, 375417, 374914, 373941]
61653C73941j351j226m57N41J141J127P92M51K27L35J081K233K938K716K239K460
61637C89188L159L193K171J072Q08R23L35j063k249k452k028j833k150k540k528
61622C84006k164j830j702j682j736j996k337k243j466n85l72p67j004p57m95
61607C62870p09j427k558m016n270n594n066m659m807m816m220l812m376n154
61593C06386m795l356k124j657j375j053j300k239k935k755k275k204k274k006
61579B74038j749k091k699k729k073j411j103q43l73R0K63J52k07q37j543j855
61563B55030j486o83K5L04K18J32M00J053J700J911J624J165Q59P87Q91J117J364
61546B66411J489J405J222J121J096R07M20q1j04M12R51J046Q41P35P04M12n1
$$ y = [373941, 372590, 371364, 370907, 371448, 372589, 373716, 374508, 374959, 375186, 375521, 376602, 378835, 381773, 384489, 386728, 389188, 392347, 395540, 397711, 398783, 399591, 400514, 400849, 399786, 397537, 395085, 393057, 391224, 389074, 386534, 384006, 381842, 380012, 378310, 376628, 374892, 372896, 370559, 368316, 366850, 366265, 365893, 365126, 364122, 363365, 362870, 362161, 360734, 358176, 354160, 348890, 343296, 338230, 333571, 328764, 323948, 319728, 315916, 311540, 306386, 301591, 298235, 296111, 294454, 293079, 292026, 290726, 288487, 285552, 282797, 280522, 278318, 276044, 274038, 272289, 270198, 267499, 264770, 262697, 261286, 260183, 259340, 258967, 259057, 259320, 259472, 259265, 258428, 256885, 255030, 253544, 252861, 252886, 253190, 253408, 253540, 253940, 254993, 256693, 258604, 260228, 261393, 262252, 263039, 263930, 265047, 266411, 267900, 269305, 270527, 271648, 272744, 273651, 274071, 273990, 273886, 274298, 275249, 276295, 277136, 277871, 278575, 278987, 278936]
61529B78936j46L09P66O76J72k64n36r12j400j612j283o65l12m77q34q31l96j95
61511B70996q69k072k678k079r01j75j69m09n50o94q89q70l74M53J158J296O69
61494B61843n06j595j865j079K26J129J122N48J44J17n8p23j241p10O78J636J351
61477B61017M04j93k10lL30Q61J282J189P69N28N00L79K40L84N25L0r01j242o42
61458B65247j6j70o29n34j4J98N6J47O06R85J174J519J890J532K61q93q28L28
61440B70859J539K154K283K136J682J057P91J264K208K911K930K443K037K120
61426B98414K530K705K263J435Q33Q46J281J629J523J057P01Q45J319J521J202
61411C20104Q89J184J812J891J122J53m02p09j148j551j513j154r21q84p91o93
$$ y = [278936, 278790, 279099, 279865, 280541, 280713, 280449, 279913, 279001, 277601, 275989, 274706, 274041, 273729, 273252, 272418, 271587, 271191, 270996, 270127, 268055, 265377, 263298, 262397, 262222, 262053, 261644, 261094, 260400, 259511, 258641, 258267, 258720, 259878, 261174, 261843, 261337, 259742, 257877, 256798, 257024, 258153, 259275, 259823, 259967, 260084, 260026, 259303, 258062, 257352, 258030, 259666, 261017, 261421, 261228, 261018, 261015, 261345, 262206, 263488, 264677, 265446, 265974, 266474, 266853, 267093, 267477, 268002, 268032, 267131, 265889, 265247, 265231, 265061, 264432, 263898, 263884, 264082, 264138, 264285, 264891, 265876, 267050, 268569, 270459, 271991, 272252, 271359, 270531, 270859, 272398, 274552, 276835, 278971, 280653, 281710, 282501, 283765, 285973, 288884, 291814, 294257, 296294, 298414, 300944, 303649, 305912, 307347, 308180, 309026, 310307, 311936, 313459, 314516, 315217, 316062, 317381, 318902, 320104, 320993, 322177, 323989, 325880, 327002, 327155, 326753, 326044, 324896, 323345, 321832, 320678, 319757, 318873, 318082, 317389]
61395C17389r00j311j444j211j101j388j684j543j025m34R3M77N81N26P42J398
61379C09165K083K350K279K110J809J364J174J548K088K144J721J343J181R65
61365C33324P88J159K051K602K191J312R01J093J271J084Q56R18J101J186J468
61350C53305K439L956N140N311M817M630N216O081O486O256N751N263M776M180
61336D23607L498K897K634K885L458L777L366K334J168J54p39j477j813j641j258
61321D42850j109j305j536j467j121q19o82m04K77J057J425J553K293L974N791
61306D50777O799P059P254P611P935Q438R608J1228J2313J2209J1065R156O516
61293E67968L500R27q39k294l851n114n620n751o195o881p177o864o267n625m968
$$ y = [317389, 316489, 315178, 313734, 312523, 311422, 310034, 308350, 306807, 305782, 305348, 305441, 305918, 306499, 307025, 307767, 309165, 311248, 313598, 315877, 317987, 319796, 321160, 322334, 323882, 325970, 328114, 329835, 331178, 332359, 333324, 334112, 335271, 337322, 339924, 342115, 343427, 344328, 345421, 346692, 347776, 348632, 349550, 350651, 351837, 353305, 355744, 359700, 364840, 370151, 374968, 379598, 384814, 390895, 397381, 403637, 409388, 414651, 419427, 423607, 427105, 430002, 432636, 435521, 438979, 442756, 446122, 448456, 449624, 449778, 449039, 447562, 445749, 444108, 442850, 441741, 440436, 438900, 437433, 436312, 435493, 434811, 434407, 434684, 435741, 437166, 438719, 441012, 444986, 450777, 457576, 464635, 471889, 479500, 487435, 495873, 505481, 516709, 529022, 541231, 552296, 561452, 567968, 571468, 572395, 571556, 569262, 565411, 560297, 554677, 548926, 542731, 535850, 528673, 521809, 515542, 509917, 504949]
61278E04949m474m278l982l017j495j73N45R47J387J845K287K881L638M279M622
61263E09961M686M321L369K309K081K901L898M425N026O353P644P382N352L084
61249E72792K024K027K029J504P47J79q0j39k71q18j793k790l465l923m312m304
61233E59407l560k533k185k774l437l251k303j344p14p7R12K136L216L915M211
61218E51619M250M305M663N361O102O545O678O794P082P392P427P133O678O042
61204F38071M908L171J427N54Q45J803K857L879M884N671O123O588P513Q864J0248
61189G07406J1529J2784J3704J3550J1955R414O752M394K358P07l91r68j244j322
61175G90628j139p75o04r47j709k473k988l444m217n410o736p848q667r367j0109
$$ y = [504949, 500475, 496197, 492215, 489198, 487703, 487530, 488075, 489022, 490409, 492254, 494541, 497422, 501060, 505339, 509961, 514647, 518968, 522337, 524646, 526727, 529628, 533526, 537951, 542977, 549330, 556974, 564356, 569708, 572792, 574816, 576843, 578872, 580376, 581123, 581302, 581222, 581083, 580812, 579994, 578201, 575411, 571946, 568023, 563711, 559407, 555847, 553314, 551129, 548355, 544918, 541667, 539364, 538020, 537306, 537229, 538141, 540277, 543493, 547408, 551619, 555869, 560174, 564837, 570198, 576300, 582845, 589523, 596317, 603399, 610791, 618218, 625351, 632029, 638071, 642979, 646150, 647577, 648131, 648976, 650779, 653636, 657515, 662399, 668070, 674193, 680781, 688294, 697158, 707406, 718935, 731719, 745423, 758973, 770928, 780342, 787094, 791488, 793846, 794553, 794162, 793194, 791950, 790628, 789489, 788714, 788110, 787163, 785454, 782981, 779993, 776549, 772332, 766922, 760186, 752338, 743671, 734304, 724195]
61160G24195j0896j1634j2215j2520j2465j2073j1484j0873j0322r786r113q186
61148E92628p045n864m756l706k665j706j065j079k009l661n289o092o023n784
61134E35884n898o108n885n203m422l615k504j030M71J690K598L275L817M501
61120E17571N664P358R346J1477J3717J5743J7049J7641J8271J9533K1036K1855
61108F96261K1722K1356K1535K2167K2433K1786K0577J9604J9133J8498J6829
61097I21901J3972J0526P092L824O77k308n102p782j0355j2659j4581j6214j7629
61084H71362j8699j9243j9270j9009j8798j8876j9086j8787j7457j5474j3873
61073F72790j3137j2571j1241r232p509o673o333n745m651l337k166j292p01k59
$$ y = [724195, 713299, 701665, 689450, 676930, 664465, 652392, 640908, 630035, 619713, 609927, 600814, 592628, 585583, 579719, 574963, 571257, 568592, 566886, 565821, 564742, 562733, 559072, 553783, 547691, 541668, 535884, 529986, 523878, 517993, 512790, 508368, 504753, 502249, 501219, 501690, 503380, 505978, 509253, 513070, 517571, 523235, 530593, 539939, 551416, 565133, 580876, 597925, 615566, 633837, 653370, 674406, 696261, 717983, 739339, 760874, 783041, 805474, 827260, 847837, 867441, 886574, 905072, 921901, 935873, 946399, 953491, 957315, 957992, 955684, 950582, 942800, 932445, 919786, 905205, 888991, 871362, 852663, 833420, 814150, 795141, 776343, 757467, 738381, 719594, 702137, 686663, 672790, 659653, 647082, 635841, 626609, 619100, 612427, 606094, 600349, 595698, 592361, 590195, 588903, 588202, 587943]
61059E87943K83J097K062K865L434M155N417P040Q406R197R664J0105J0459J0729
61045F72856J1386J2927J5202J7626J9842K1748K3137K3960K4886K6853K9921
61034I00344L3158L5798L7941M0005M2174M4604M7578N0965N3966N5843N6628
61023A399004N6902N7327N8636O1628O6777P4091Q3435R4524J06515J18359J30032
61012B307230J42989J59275J80863K10075K49650L01832L68119M50251N50326
61003D920610O69465Q08050R68663J157633J382145J645171J938530K228392K437095
60994A8155754K448426K162236J576667Q27214J31825l23932m69401l46212n7146
60985B4105431K66610M71105M08042Q234o55249j388616j982450k317037k390960
$$ y = [587943, 588226, 589323, 591385, 594250, 597684, 601839, 607256, 614296, 622702, 631899, 641563, 651668, 662127, 672856, 684242, 697169, 712371, 729997, 749839, 771587, 794724, 818684, 843570, 870423, 900344, 933502, 969300, 1007241, 1047246, 1089420, 1134024, 1181602, 1232567, 1286533, 1342376, 1399004, 1455906, 1513233, 1571869, 1633497, 1700274, 1774365, 1857800, 1952324, 2058839, 2177198, 2307230, 2450219, 2609494, 2790357, 3000432, 3250082, 3551914, 3920033, 4370284, 4920610, 5590075, 6398125, 7366788, 8524421, 9906566, 11551737, 13490267, 15718659, 18155754, 20604180, 22766416, 24343083, 25170297, 25302122, 24978190, 24508789, 24162577, 24105431, 24372041, 24843146, 25251188, 25259422, 24604173, 23215557, 21233107, 18916070, 16525110]
60976A6525110k275351k053174j788024j520816j274397j057820q72054p15647
60968D967827n86590m81657l96934l29305k76469k35925k04887j80889j61684
60959B113487j45093j29780j15755j03432r2543q2480p3019o3987n5060m6696
60949A205642m0577l7864l7466l7152l6025l4688l3396l1519k8913k6375k4340
60938H37327k2244j9739j7474j6104j5311j4571j4081j4191j4457j4105j3132
60927F61918j2175j1487j0793j0086r790j0049j0366j0197r482q441p223n959
60915E45870m879m127l696l670m219n147n793n766n460n433n417m666l190j998
60901D82409j771j981j765j191r89j350j664j363m75N99J351J319N48k07l40l48
$$ y = [16525110, 14249759, 12196585, 10408561, 8887745, 7613348, 6555528, 5683474, 4967827, 4381237, 3899580, 3502646, 3173341, 2896872, 2660947, 2456060, 2275171, 2113487, 1968394, 1838614, 1722859, 1619427, 1526884, 1444404, 1371385, 1307398, 1252338, 1205642, 1165065, 1127201, 1089735, 1052583, 1016558, 981870, 948474, 916955, 888042, 861667, 837327, 815083, 795344, 777870, 761766, 746455, 731884, 717803, 703612, 689155, 675050, 661918, 649743, 638256, 627463, 617377, 607587, 597538, 587172, 576975, 567493, 559052, 551829, 545870, 540991, 536864, 533168, 529498, 525279, 520132, 514339, 508573, 503113, 497680, 492263, 487597, 484407, 482409, 480638, 478657, 476892, 475701, 474712, 473362, 471698, 470335, 469860, 470459, 471810, 473129, 473677, 473470, 473130, 472782]
60885D72782j141k452k898j966q81r18j700k025j627j144p21J62J513K499K559
60870D62042K132J993K399L133L891M409M597M811N634P139Q571R070Q532P575
60856E35928O835O465O273O152O290O902P850Q693R159R291Q998P930O172M779
60842F37717M911O472Q155Q941R014R070R230R114Q676Q448Q912R884J0605J0493
60828G59642R779R234R157Q809P245M596K041M23o35k035m114o545q989j1305
60814G77303j3296j4778j5882j6914j7828j8207j7870j7210j6701j6287j5588
60803E96742j4525j3460j2584j1573j0071q314o885n908m928l692k669k414k719
60790D97000k798k317j764j783k407l158l606l665l424k969k420k045k204l078
$$ y = [472782, 471641, 469189, 466291, 464325, 463444, 462526, 460826, 458801, 457174, 456030, 455309, 455471, 456984, 459483, 462042, 464174, 466167, 468566, 471699, 475590, 479999, 484596, 489407, 495041, 502180, 510751, 519821, 528353, 535928, 542763, 549228, 555501, 561653, 567943, 574845, 582695, 591388, 600547, 609838, 618836, 626766, 632938, 637717, 642628, 649100, 657255, 666196, 675210, 684280, 693510, 702624, 711300, 719748, 728660, 738544, 749149, 759642, 769421, 778655, 787812, 796621, 803866, 808462, 810503, 810926, 810291, 808256, 804142, 797597, 788608, 777303, 764007, 749229, 733347, 716433, 698605, 680398, 662528, 645318, 628617, 612330, 596742, 582217, 568757, 556173, 544600, 534529, 526215, 519330, 513422, 508494, 504802, 502133, 499719, 497000, 494202, 491885, 490121, 488338, 485931, 482773, 479167, 475502, 472078, 469109, 466689, 464644, 462440, 459362]
60776D59362m370n450n846n604n047m382l686l102k787k676k522k180j732j426
60762D08552j606k530m009n285n667n212m571m231m211m345m438m188l427k535
60748C52297k059j813r66O80K106K257J404P11P11Q64N73j6l80l51k41n24j422
60731C53831k593l209k683j431n67o33r78o47M03J357J619J312O91l19j646k588
60715C41919k454j564j074j591k543l166l558m192m803m591l555k718k717k884
60701C00509k273j121n40r83j740j972j579r49m06j89m37q49p57M7Q43Q77M46
60684B88927M88J174J666J402J001J307K126K554K313K033K151K296K069J819
60670C13326K099K705K986K895L118L906M405L574J611q5l77M54J172J052O32
$$ y = [459362, 454992, 449542, 443696, 438092, 433045, 428663, 424977, 421875, 419088, 416412, 413890, 411710, 409978, 408552, 406946, 404416, 400407, 395122, 389455, 384243, 379672, 375441, 371230, 366885, 362447, 358259, 354832, 352297, 350238, 348425, 347459, 348139, 350245, 352502, 353906, 354617, 355328, 356192, 356765, 356749, 356369, 356018, 355777, 355253, 353831, 351238, 348029, 345346, 343915, 343348, 342715, 341737, 341090, 341493, 342850, 344469, 345781, 346472, 346153, 344507, 341919, 339465, 337901, 336827, 335236, 332693, 329527, 325969, 321777, 316974, 312383, 308828, 306110, 303393, 300509, 298236, 297115, 296575, 295592, 293852, 291880, 290301, 289352, 288946, 288757, 288320, 287471, 286714, 286761, 287604, 288481, 288927, 289415, 290589, 292255, 293657, 294658, 295965, 298091, 300645, 302958, 304991, 307142, 309438, 311507, 313326, 315425, 318130, 321116, 324011, 327129, 331035, 335440, 339014, 340625, 340540, 340163, 340617, 341789, 342841, 343473]
60655C43473R14K120L526M495N097N538N505M695L705L546M193M429L481K068
60641C96785J272R63J91j270k685l619m433n334n805n464m796m402m087l403k682
60626C51231k694l394l803l269k160j158m79n3O0j76m79n07j94L59R77J292R22
60609C36475Q0l62J16R83J301Q58J86j50O2P26J336J167K19l88L21J755K519K349
60591C49553K190K407K229J372Q18J222J635R12n12j350j393j390j425p65O70
60576C56173J986K665L243M301N706P170Q755J0451J1956J3260J4764J6402J7438
60563D74270J7608J7644J7939J7390J4593R749M416m35n055r491j2669j3491j2188
60550E20280r996p811n738l673j738L9J991M531P726J1263J4736J7865K0555K2911
$$ y = [343473, 344387, 346507, 350033, 354528, 359625, 365163, 370668, 375363, 379068, 382614, 386807, 391236, 394717, 396785, 398057, 399020, 399211, 397941, 395256, 391637, 387204, 381870, 376065, 370601, 365805, 361403, 357316, 353913, 351231, 348537, 345143, 341340, 338071, 335911, 334753, 334274, 334221, 334281, 334105, 333626, 333119, 332925, 333284, 334261, 335553, 336475, 336555, 336193, 336309, 337292, 338593, 339451, 339637, 339487, 339549, 340275, 341611, 342778, 342997, 342609, 342930, 344685, 347204, 349553, 351743, 354150, 356379, 357751, 358569, 359791, 361426, 362338, 361826, 360476, 359083, 357693, 356268, 355503, 356173, 358159, 360824, 364067, 368368, 374074, 381244, 389999, 400450, 412406, 425666, 440430, 456832, 474270, 491878, 509522, 527461, 544851, 559444, 569193, 573609, 573174, 568119, 558628, 545959, 532468, 520280, 510284, 502473, 496735, 493062, 491324, 491363, 493354, 497885, 505611, 516874, 531610, 549475, 570030, 592941]
60536E92941K5180K7441K9281K9830K8286K4435J8711J1888M797j798p290j1303
60524G72399j3717j4730j4874j4750j4604j4220j3330j2045j0690r408q082o567
60512F25382m800k747n14J645L596N445P182Q520R486J1023J4292J9369K5143
60499G23022L0669L6028M1650M7382N2676N7338O1456O4768O6488O5850O2585
60488A309912N7049N0047M2321L3919K4158J2598j26j2763k4692l6252m7744n8576
60476A349851o7551p3733p6731p6445p3120o7717o1698n6065n0739m5237l9714
60465F61101l4865l0833k6892k2548j8415j5415j3504j1844j0129q903q508q412
60453D50833p940p095o266n513m658l843l477l637l864l630k849j914j294j086
$$ y = [592941, 618121, 645562, 674843, 704673, 732959, 757394, 776105, 787993, 792790, 790992, 783702, 772399, 758682, 743952, 729078, 714328, 699724, 685504, 672174, 660129, 649439, 640031, 631949, 625382, 620582, 617835, 617321, 618966, 622562, 628007, 635189, 643709, 653195, 664218, 678510, 697879, 723022, 753691, 789719, 831369, 878751, 931427, 988765, 1050221, 1114989, 1181477, 1247327, 1309912, 1366961, 1417008, 1459329, 1493248, 1517406, 1530004, 1529878, 1517115, 1492423, 1456171, 1408427, 1349851, 1282300, 1208567, 1131836, 1055391, 982271, 914554, 852856, 796791, 746052, 700815, 661101, 626236, 595403, 568511, 545963, 527548, 512133, 498629, 486785, 476656, 467753, 459245, 450833, 442893, 435798, 429532, 424019, 419361, 415518, 412041, 408404, 404540, 400910, 398061, 396147, 394853, 393767]
60439C93767r49n73j03N9j61l98l75k79m62r91j590j872j628j099q54j153j521
60422C79818j272m51J78Q6n62j310j723j310O7J524J689L50j076j317p68o10r74
60405C72339r44j30P31Q49L73N3L29R35J222Q27J41n7M31R10P42K64L23J078J756
60386C82172J613P93J74M76J450K055J636Q62R22J828K396K051J708K152K618
60371D04906K019Q67P19J935L208L262K101N59m49l19P24J475R94p5k90O29J629
60354D23894K080K427K942L117K798K771L615M871N951O914P720P688O469M824
60340D88081L567K359M60j909l858n056n742n894n263m149l272k915k778k664
60326D50967k666k777k795k618k252j639r30o37j047j630j552o78M10J325K199
$$ y = [393767, 392818, 392245, 392142, 392201, 392040, 391642, 391267, 390988, 390526, 389535, 387945, 386073, 384445, 383346, 382492, 381339, 379818, 378546, 378095, 378273, 378359, 377797, 376487, 374764, 373454, 373521, 375045, 376734, 377084, 376008, 374691, 373923, 373313, 372339, 371395, 371265, 371996, 372845, 373218, 373271, 373600, 374535, 375757, 376584, 376725, 376668, 377099, 378009, 378751, 379015, 379338, 380416, 382172, 383785, 384578, 384752, 385228, 386678, 388733, 390369, 391231, 392153, 393981, 396377, 398428, 400136, 402288, 404906, 406925, 407792, 408511, 410446, 413654, 416916, 419017, 419576, 419127, 418808, 419532, 421007, 422001, 421926, 421636, 422265, 423894, 425974, 428401, 431343, 434460, 437258, 440029, 443644, 448515, 454466, 461380, 469100, 476788, 483257, 488081, 491648, 494007, 494467, 492558, 488700, 483644, 477902, 472008, 466745, 462596, 459324, 456409, 453631, 450967, 448301, 445524, 442729, 440111, 437859, 436220, 435290, 434653, 433606, 431976, 430424, 429746, 430156, 431481, 433680]
60311D33680L193M196N132O139P388Q965J0935J3338J6141J9382K3011K6374K8182
60298F06056K7440K4194J9051J2389M545l593j0955j7103k2039k5366k6433k5360
60286E62826k3178k0773j8285j5650j3085j0741q479o276m485l318k516j798j349
60273D32893j461j910k098j732j171j038j543k256k594k511k450k512k142j062
60259D06413q9k45j260j804j295n56m34o08l54J99L90J74J34M97Q62R05Q31R31
60241D04691J157J301J283J088P33M08M38Q83J358J485J354J342J504J500J162
60226D21687Q74J036J398J276M55n21j037j010o02K23J400K381K605K276K132
60211D34573K469K884L038L131L438L869M183M219L778K736J579J261K085L170
$$ y = [433680, 436873, 441069, 446201, 452340, 459728, 468693, 479628, 492966, 509107, 528489, 551500, 577874, 606056, 633496, 657690, 676741, 689130, 693675, 690082, 679127, 662024, 639985, 614619, 588186, 562826, 539648, 518875, 500590, 484940, 471855, 461114, 452635, 446359, 441874, 438556, 436040, 434242, 432893, 431432, 429522, 427424, 425692, 424521, 423483, 421940, 419684, 417090, 414579, 412129, 409617, 407475, 406413, 406324, 406079, 404819, 403015, 401720, 401164, 400730, 400122, 399768, 399967, 400357, 400531, 400665, 401162, 402024, 402929, 403760, 404691, 405848, 407149, 408432, 409520, 410253, 410661, 411099, 411982, 413340, 414825, 416179, 417521, 419025, 420525, 421687, 422561, 423597, 424995, 426271, 426726, 426205, 425168, 424158, 423556, 423779, 425179, 427560, 430165, 432441, 434573, 437042, 439926, 442964, 446095, 449533, 453402, 457585, 461804, 465582, 468318, 469897, 471158, 473243, 476413]
60197D76413L559L512L952M893N227M217K511J301J008J214J485J652J455N98
60183E12997p03j696j926j764j824k098k184k165k604l518m043l484k303j521
60169D81164j466j694j920k290k733k730k011r40l6M82M89j24j015j377p72M07
60153D63434J574K586L314L229K162J095J296K725M119M647M697M878N078M936
60139E09770M609M504M643M752M702M426L709K521J329O48L83P9l28n10m43n51
60123E44243j021j487j629j608j587j242k50R96J718J781J782K083K348K278K306
60108E50711K993M045M550M195L595L275K853J630l34k191l235l525l518l561
60094E61483l791m242m729m813m119k713r97O69K085K973L075K631K441L012L797
$$ y = [476413, 479972, 483484, 487436, 492329, 497556, 501773, 504284, 505585, 506593, 507807, 509292, 510944, 512399, 512997, 512294, 510598, 508672, 506908, 505084, 502986, 500802, 498637, 496033, 492515, 488472, 484988, 482685, 481164, 479698, 478004, 476084, 473794, 471061, 468331, 466320, 465380, 465344, 465826, 466315, 466191, 465176, 463799, 463027, 463434, 465008, 467594, 470908, 474137, 476299, 477394, 478690, 481415, 485534, 490181, 494878, 499756, 504834, 509770, 514379, 518883, 523526, 528278, 532980, 537406, 541115, 543636, 544965, 545613, 545996, 546075, 545747, 545237, 544794, 544243, 543222, 541735, 540106, 538498, 536911, 535669, 535419, 536415, 538133, 539914, 541696, 543779, 546127, 548405, 550711, 553704, 557749, 562299, 566494, 570089, 573364, 576217, 577847, 577513, 575322, 572087, 568562, 565044, 561483, 557692, 553450, 548721, 543908, 539789, 537076, 536079, 536748, 538833, 541806, 544881, 547512, 549953, 552965, 556762]
60079E56762L745K628J306M73k11j293k373k581k079k121l428n251o446o799o788
60064E25544o629o265n988o220o742o833o293n671n413n311n042m701m467m211
60050D45758l791l440l383l329k741j576l61M63R36J276J496J485J331J378J871
60035D37373K539K787K360J807J910K630L000K272Q41k86p78j233k228l554m561
60020D44879m916m798m538m339m317m552m966n228m944m090l147k628k471k161
60006C87784j503r10p34o44q7P98J253Q84P6o11j057j372j464j138m33L42Q24
59989C82008Q57P17J041K159L457L854L125K223J968K002J605J046J256K346L322
59974D12986L437L019K691K447K005J496J281J336J335J199J067Q59L67k19k71
$$ y = [556762, 560507, 563135, 564441, 564914, 564703, 563410, 561037, 558456, 556377, 554256, 550828, 545577, 539131, 532332, 525544, 518915, 512650, 506662, 500442, 493700, 486867, 480574, 474903, 469490, 464179, 459137, 454436, 449969, 445758, 441967, 438527, 435144, 431815, 429074, 427498, 427137, 427600, 428536, 429812, 431308, 432793, 434124, 435502, 437373, 439912, 442699, 445059, 446866, 448776, 451406, 454406, 456678, 457519, 457233, 456455, 455222, 452994, 449440, 444879, 439963, 435165, 430627, 426288, 421971, 417419, 412453, 407225, 402281, 398191, 395044, 392416, 389945, 387784, 386281, 385371, 384637, 383993, 383906, 384704, 385957, 386841, 386917, 386306, 385249, 383877, 382413, 381275, 380842, 381184, 382008, 382865, 383582, 384623, 386782, 390239, 394093, 397218, 399441, 401409, 403411, 405016, 406062, 407318, 409664, 412986, 416423, 419442, 422133, 424580, 426585, 428081, 429362, 430698, 432033, 433232, 434299, 435158, 435525, 435306, 435035]
59959D35035N89K022L255L668L061J690K06o63o84l41k82n73p30m98k75m92q31
59942D44157o12P9K02q36k137k258j088j2j89j326k388k878k907k534j752q67
59926D22654l42k06j47l8N4L30J099K128K759K856L046L707M219L749K531J769
59910D50168K245L478M328M214L568L229L595M282M608M281L550K761J939R62
59896D97208r6r98j659k204k647k758k358j627r22l35L52J195J820J888J711J964
59880D90534K719L215K858K121J991K770L861M623M865M479L332J674J19j063
59866E28098k190l395m169m116l671l459l312k641j529o60k09M40J653K927L620
59851E07387L806M107N053O789Q955J0627J0872R635P698N502K668q26l707m514
$$ y = [435035, 435624, 437646, 440901, 444569, 447630, 449320, 449526, 448863, 448179, 447838, 447556, 446983, 446253, 445755, 445480, 444988, 444157, 443545, 443624, 443826, 442990, 440853, 438595, 437507, 437495, 437306, 435980, 433592, 430714, 427807, 425273, 423521, 422654, 422312, 422106, 421959, 421921, 421975, 422305, 423404, 425532, 428291, 431147, 434193, 437900, 442119, 445868, 448399, 450168, 452413, 455891, 460219, 464433, 468001, 471230, 474825, 479107, 483715, 487996, 491546, 494307, 496246, 497208, 497112, 496114, 494455, 492251, 489604, 486846, 484488, 482861, 481939, 481604, 481956, 483151, 484971, 486859, 488570, 490534, 493253, 496468, 499326, 501447, 503438, 506208, 510069, 514692, 519557, 524036, 527368, 529042, 529161, 528098, 525908, 522513, 518344, 514228, 510557, 507098, 503786, 501145, 499616, 498956, 498747, 499187, 500840, 503767, 507387, 511193, 515300, 520353, 527142, 536097, 546724, 557596, 567231, 574929, 580431, 583099, 582273, 578566, 574052]
59837E74052l339j617l65L45L48r66l571o270p966q766r271r371q592p173n906
59822E01572n050m246l450l103l283l440l273l133l176k819j612j48N96N20L82
59807D66337O57J029J068Q32O37N93N36J72p74k257l652m194l795l183l099l558
59791D47349m103m473m722m835m595l927l203k985l401l915l827l087k366k202
59777C95708k247j742n96L76M49k23q87j027o87j89K24N22Q68J329J654J491Q89
59760C95912L27J19J69L37P62J495K200K501K460K378K373K409K550K845L152
59745D21989L342L474L520L233K624K222K400K763K764K591K710K803K112Q35
59731D59382J57O37J429J478P65p0o44q54o02p8J35k32p05p91o02l72K1M42J17
$$ y = [574052, 570713, 569096, 568731, 569076, 569424, 568458, 564887, 558617, 550651, 541885, 532614, 523243, 514651, 507478, 501572, 496522, 492276, 488826, 485723, 482440, 479000, 475727, 472594, 469418, 466599, 464987, 464839, 465435, 465955, 466337, 466994, 468023, 469091, 469923, 470560, 471153, 471689, 471861, 471087, 468830, 465178, 460984, 457189, 454006, 450907, 447349, 443246, 438773, 434051, 429216, 424621, 420694, 417491, 414506, 411105, 407190, 403363, 400276, 397910, 395708, 393461, 391719, 391123, 391499, 391948, 391725, 390838, 389811, 389124, 388935, 389159, 389681, 390549, 391878, 393532, 395023, 395912, 396239, 396358, 396527, 396864, 397626, 399121, 401321, 403822, 406282, 408660, 411033, 413442, 415992, 418837, 421989, 425331, 428805, 432325, 435558, 438182, 440404, 442804, 445567, 448331, 450922, 453632, 456435, 458547, 459382, 459539, 460176, 461605, 463083, 463848, 463778, 463134, 462280, 461678, 461600, 461735, 461503, 460798, 460007, 459405, 459033, 459054, 459496, 459613]
59712D59613j184k222j647L9J063P98L36N69J020R93P10O28N97M84Q03J880K928
59695D67408K972K278K008K614L415L681L324K501J257j59j168j387j025n96m32
59680D86691m77m35j25J68p8q40j398j313j161j664k473k668k343k600l795m807
59664D60682m570l455k448j728r11j78j05m94l91N68J595J813J282P46Q16J634
59648D54856K893L865L879L055K244J926J607O41p43j779k270k693l306l837m039
59633D56299l985l631k780j726j291j729k080j309K68J400J499J099P50L05m47
59618D42642j150j391j333j400j731k326l322m533n070m113k008nJ050J276J079
59603D17665O78L38L66N86L33n24j122o59M52J091Q36K43j53m07o04m48J91P79
$$ y = [459613, 458429, 456207, 454560, 454599, 455662, 456460, 456796, 457365, 458385, 459378, 460088, 460716, 461313, 461797, 462600, 464480, 467408, 470380, 472658, 474666, 477280, 480695, 484376, 487700, 490201, 491458, 491299, 490131, 488744, 487719, 487123, 486691, 486214, 485779, 485654, 485822, 485744, 484904, 483506, 482193, 481032, 479368, 476895, 474227, 471884, 469284, 465489, 460682, 456112, 452657, 450209, 448481, 447570, 447392, 447287, 446793, 446402, 446970, 448565, 450378, 451660, 452406, 453222, 454856, 457749, 461614, 465493, 468548, 470792, 472718, 474325, 474966, 474223, 472444, 470174, 467481, 464175, 460338, 456299, 452314, 448683, 445903, 444177, 442886, 441157, 439077, 437768, 438036, 439436, 440935, 442034, 442784, 443089, 442642, 441492, 440101, 438768, 437368, 435637, 433311, 429989, 425456, 420386, 416273, 414265, 414260, 415310, 416586, 417665, 418343, 418681, 419047, 419633, 419966, 419442, 418320, 417661, 418113, 419204, 420040, 420283, 420130, 419723, 419119, 418671, 418862, 419641]
59585D19641P15K46K02P84J214P68j90p57p95j129k298l625l957l016j628p20
59569D05455n08p09j082j517j846j814j259l12N61P91K29o28j103r93n54j0N89
59552C95290J035J081R53J276K230L192L571L531L513L517L343L313L991N361
59538D35197O823Q197J0078J3064J6829K0029K0896J8027J1337K581n455j0755
59526E46848j3080j3290j2077r674o426l105n16R46J408J346J330J649K072K085
59512D99516J416L05q23j828k863l987m948n521n828o133o378o226n668n228n323
59497D40483n645n423m322k761j481j007j446k412l122k860j637k23O10Q20R12
59482D10486J221J569J737J936K570L561M294M404M341M761N498N666M882L811
$$ y = [419641, 420356, 420602, 420804, 421588, 422802, 423570, 423380, 422623, 421828, 420699, 418401, 414776, 410819, 407803, 406175, 405455, 404947, 404238, 403156, 401639, 399793, 397979, 396720, 396408, 396969, 397760, 397989, 397361, 396258, 395265, 394711, 394701, 395290, 396325, 397406, 398359, 399635, 401865, 405057, 408628, 412159, 415672, 419189, 422532, 425845, 429836, 435197, 442020, 450217, 460295, 473359, 490188, 510217, 531113, 549140, 560477, 563058, 557603, 546848, 533768, 520478, 508401, 498727, 492301, 489196, 488680, 489626, 491034, 492380, 493710, 495359, 497431, 499516, 500932, 501237, 500414, 498586, 495723, 491736, 486788, 481267, 475439, 469306, 462928, 456702, 451034, 445806, 440483, 434838, 429415, 425093, 422332, 420851, 419844, 418398, 415986, 412864, 410004, 408367, 408144, 408754, 409574, 410486, 411707, 413276, 415013, 416949, 419519, 423080, 427374, 431778, 436119, 440880, 446378, 452044, 456926, 460737]
59468D60737L263L173K879K040Q49l38j095r01L29J748K262J770J202J302J909
59453D81129K631L571M972O610P977Q845R305R459R353R069Q639P903O587M492
59439E80542J575j889n203p563q684q909q656q043p201o524o331o433o345n776
59425D94560m750l411j887l24J202K592L673M451N481P494J0498J3604J6069J8129
59411E67381K0504K3464K6630K9098K9269K5141J5963L707p777j5374j8261j7237
59399F82508j3455p987j844M121Q928J0901Q061m9j1108k1208k7494k9550k8524
59386E73300k5623k1643j7362j3661j0984q983o973m778k916j908j560j202n24
59373D55183J58N64J006J976L304M156L983L224K808L072L506L622L664M143M909
$$ y = [460737, 464000, 467173, 470052, 472092, 472941, 472603, 471508, 470607, 470936, 472684, 474946, 476716, 477918, 479220, 481129, 483760, 487331, 492303, 498913, 506890, 515735, 525040, 534499, 543852, 552921, 561560, 569463, 576050, 580542, 582117, 580228, 575025, 567462, 558778, 549869, 541213, 533170, 525969, 519445, 513114, 506681, 500336, 494560, 489810, 486399, 484512, 484188, 485390, 487982, 491655, 496106, 501587, 509081, 519579, 533183, 549252, 567381, 587885, 611349, 637979, 667077, 696346, 721487, 737450, 741157, 733380, 718006, 699745, 682508, 669053, 661066, 659222, 663343, 672271, 683172, 691233, 691184, 680076, 658868, 631374, 601824, 573300, 547677, 526034, 508672, 495011, 484027, 475044, 468071, 463293, 460377, 458469, 456909, 455707, 455183, 455341, 455905, 456911, 458887, 462191, 466347, 470330, 473554, 476362, 479434, 482940, 486562, 490226, 494369, 499278]
59358D99278N224M804M246M214M577M859N174O089P575Q760R054R014R662J1185
59344E93715J2778J3728J4135J4470J4809J4810J4284J3407J2348J1028R360P560
59332G46432N931M390K476p1k856n128o601p817r505j1582j3000j2869j1621j0700
59318F67479j0971j1795j1910j0859r220p675o436n448m605l694k567j466p18
59305E80115l1J354L645O207Q530J0902J3697J6450J8174J8161J5993J1246M042
59292G08485m201j1336j5946j7889j7666j5924j3548j1352r414p275n029l578
59280E75327l463m010m059l258k103j110m02J04O20J525L006M651N810O323O595
59265E85556O924P178P201P154P168O954O016M193J786p66l152n169o666p594
$$ y = [499278, 504502, 509306, 513552, 517766, 522343, 527202, 532376, 538465, 546040, 554800, 563854, 572868, 582530, 593715, 606493, 620221, 634356, 648826, 663635, 678445, 692729, 706136, 718484, 729512, 738872, 746432, 752363, 756753, 759229, 759158, 756302, 751174, 744573, 736756, 727251, 715669, 702669, 689800, 678179, 667479, 656508, 644713, 632803, 621944, 612724, 605049, 598613, 593165, 588560, 584866, 582299, 580833, 580115, 580084, 581438, 585083, 591290, 599820, 610722, 624419, 640869, 659043, 677204, 693197, 704443, 708485, 704284, 692948, 677002, 659113, 641447, 625523, 611975, 600623, 591209, 583934, 578905, 575327, 571864, 567854, 563795, 560537, 558434, 557324, 556922, 557026, 557646, 559171, 562177, 566828, 572638, 578961, 585556, 592480, 599658, 606859, 614013, 621181, 628135, 634151, 638344, 640130, 639364, 636212, 631043, 624377, 616783]
59251F16783q020q106q115q334q779q978q373p092n983n652n597m792l005j077
59237E24880K16R93J738K397K557K236J967K057K276K301K105J753J219N82Q7
59222E49364k87r90k307l774m591m587m344m356m469m321l927l449k776j821j065
59207E02300j141j787j875p86P16J456J255Q62Q78J358K261L450M231L793K332
59192E19303J093R53J510J903J924J906K063K442L144L987M378M056L664L920
59178E56246M471M248K904J189k5m89l11L96J310J856J708J114O33P10J481K718
59162E80159L891M583M882N099N231N028M558M245M222M041L177J584l68k213
59148F28119l522m032l898l654l809m429n140n465n204m579m009l700l578l559
$$ y = [616783, 608763, 600657, 592542, 584208, 575429, 566451, 558078, 550986, 545003, 539351, 533754, 528962, 525957, 524880, 525096, 526089, 527827, 530224, 532781, 535017, 536984, 539041, 541317, 543618, 545723, 547476, 548695, 549277, 549364, 549077, 548087, 545780, 542006, 537415, 532828, 528484, 524128, 519659, 515338, 511411, 507962, 505186, 503365, 502300, 501159, 499372, 497497, 496711, 497427, 498883, 500138, 501000, 501878, 503236, 505497, 508947, 513178, 516971, 519303, 520396, 521349, 522859, 524762, 526686, 528592, 530655, 533097, 536241, 540228, 544606, 548662, 552326, 556246, 560717, 564965, 567869, 569058, 569033, 568544, 568233, 568629, 569939, 571795, 573503, 574617, 575250, 575960, 577441, 580159, 584050, 588633, 593515, 598614, 603845, 608873, 613431, 617676, 621898, 625939, 629116, 630700, 630332, 628119, 624597, 620565, 616667, 613013, 609204, 604775, 599635, 594170, 588966, 584387, 580378, 576678, 573100, 569541]
59134E69541l596l410k634j449n96m43m93k38K6j96o54p77o35n89l32P09K161
59117E56395K973K981L200M343N954P261Q011Q144P592O791O483O595O077M476
59103F37276K822K253K505K532J989J255M51n69j539j968j948k085k598l102l254
59088F34020l179l159l238l220k893k376k227k894l969m471m119l767m246n307
59074E84955o241o929p614q069p820o970o097n431m792m223m035m193m208l698
59060E04635k776j894j619k281l460m088l554k428j657j361r93l80J48M15M50
59045D79157N9q68j683j490l69O49R10P05M18Mm63n36q0M26O64R53J523J968J939
59026D83886J885K447L509M418M977N607O571P540P982P779P365P377Q063Q853
$$ y = [569541, 565945, 562535, 559901, 558452, 557856, 557413, 556920, 556682, 556708, 556512, 555858, 555081, 554446, 553857, 553525, 554234, 556395, 559368, 562349, 565549, 569892, 575846, 583107, 591118, 599262, 606854, 613645, 620128, 626723, 632800, 637276, 640098, 642351, 644856, 647388, 649377, 650632, 651083, 650514, 648975, 647007, 645059, 642974, 640376, 637274, 634020, 630841, 627682, 624444, 621224, 618331, 615955, 613728, 610834, 606865, 602394, 598275, 594508, 590262, 584955, 578714, 571785, 564171, 556102, 548282, 541312, 535215, 529784, 524992, 520769, 516734, 512541, 508333, 504635, 501859, 499965, 498346, 496065, 492605, 488517, 484963, 482535, 480878, 479517, 478524, 478144, 478292, 478707, 479157, 479216, 478348, 476665, 475175, 474806, 475455, 476365, 477070, 477488, 477492, 477029, 476493, 476413, 476839, 477503, 478456, 479979, 481947, 483886, 485771, 488218, 491727, 496145, 501122, 506729, 513300, 520840, 528822, 536601, 543966, 551343, 559406, 568259]
59012E68259Q744P300N198L512K627K025J117p2j072j548j551j325j016o29j15
58997E91454O27J683K923L943M442M625M829M812L904K133N38m0n3n20j654k885
58981F20761l933m922n549n150l807k473j624o26J086K970M166M795N646O952
58967F18292Q204R067R721J0261J0429J0182R961J0080J0188R689Q529P238O200
58954G38041N184L742J795l35k419m574o895r090j0721j1665j2155j2389j2354
58941F66165j2044j1596j1145j0635r868q736p430o431o113o244o104n271m072
58928E60476k990j997q67Q7K55l47r70j065p79m43j19R6j59j023k005k411j983
58911E43756q72O16K021K765K631K102J885K279L132M272N604O954Q133R116J0028
$$ y = [568259, 577003, 584303, 589501, 593013, 595640, 597665, 598782, 598710, 597638, 596090, 594539, 593214, 592198, 591569, 591454, 592081, 593764, 596687, 600630, 605072, 609697, 614526, 619338, 623242, 625375, 625913, 625873, 625820, 625300, 623646, 620761, 616828, 611906, 606357, 601207, 597400, 594927, 593303, 592677, 593763, 596733, 600899, 605694, 611340, 618292, 626496, 635563, 645284, 655545, 665974, 676156, 686117, 696197, 706385, 716074, 724603, 731841, 738041, 743225, 746967, 748762, 748427, 746008, 741434, 734539, 725449, 714728, 703063, 690908, 678519, 666165, 654121, 642525, 631380, 620745, 610877, 602141, 594711, 588280, 582167, 575923, 569819, 564548, 560476, 557486, 555489, 554622, 554709, 554964, 554617, 553647, 552582, 551803, 551360, 551241, 551337, 551178, 550155, 548150, 545739, 543756, 542884, 543500, 545521, 548286, 550917, 553019, 554904, 557183, 560315, 564587, 570191, 577145, 585278, 594394, 604422]
58896F04422J0915J1663J2021J1634J0389Q849Q081Q683J0177J1599J2549J3322
58884G34304J4247J5326J6423J7381J7870J7479J6089J3905J1090P780M405J612
58872H87911m91k634n600r207j2406j4306j4847j4526j3815j2964j2030j0887
58860G64198r354p571o172n827o594p870r006r775j0318j0778j1145j1345j1308
58847F47135j0987j0360r475q484p649p119o702o051n155m470m310m407m378m412
58833E53176m906n601n752n178m485m093l737l249l022l190l068k129j017o68
58819E03081p62m4J816L622M129L447K668K609L203L886M222M201M054L809L222
58804E47163K281J432J020P61J30r67k248l435m198m126l345k831l382m504n008
$$ y = [604422, 615337, 627000, 639021, 650655, 661044, 669893, 677974, 686657, 696834, 708433, 720982, 734304, 748551, 763877, 780300, 797681, 815551, 833030, 849119, 863024, 874114, 881894, 886299, 887911, 887420, 884786, 879186, 869979, 857573, 843267, 828420, 813894, 800079, 787115, 775085, 764198, 754844, 747273, 741101, 735274, 728680, 720810, 711804, 702029, 691711, 680933, 669788, 658443, 647135, 636148, 625788, 616313, 607829, 600180, 593061, 586359, 580308, 575153, 570683, 566373, 561966, 557588, 553176, 548270, 542669, 536917, 531739, 527254, 523161, 519424, 516175, 513153, 509963, 506895, 504766, 503749, 503081, 502319, 502275, 504091, 507713, 511842, 515289, 517957, 520566, 523769, 527655, 531877, 536078, 540132, 543941, 547163, 549444, 550876, 551896, 552657, 552787, 551820, 549572, 546137, 541939, 537813, 534468, 531637, 528255, 523751, 518743]
58789E18743m500l534k585j753j345j734k422k261q49R60K151K508K428K514L359
58774E11680M857N683M522J973P0l94p71k256m039m764m643m870n666o266o349
58759D88767o298o151n491m315l122k162j287n39o0M60J493K768L416L148K653
58744D73280K589K768K643K180J960K533L908N571O918P677P875P551O843O267
58730E40563O330O732O588N680M852M770N007M975M981N515O056N610M178K736
58716F14573J902J524J501K025K987L927M751N691O548O708O046N042L922K448
58702F69595O92q70k296m286p031r718j1693j3253j4727j5599j5353j4561j4111
58689E46789j3766j2548j0457q757q308q484q167p139n969m982m028l176k882
$$ y = [518743, 514243, 510709, 508124, 506371, 505026, 503292, 500870, 498609, 497760, 498720, 500871, 503379, 505807, 508321, 511680, 516537, 522220, 526742, 528715, 528785, 528391, 527620, 525364, 521325, 516561, 511918, 507048, 501382, 495116, 488767, 482469, 476318, 470827, 466512, 463390, 461228, 459941, 459402, 459342, 459802, 461295, 464063, 467479, 470627, 473280, 475869, 478637, 481280, 483460, 485420, 487953, 491861, 497432, 504350, 512027, 519902, 527453, 534296, 540563, 546893, 553625, 560213, 565893, 570745, 575515, 580522, 585497, 590478, 595993, 602049, 607659, 611837, 614573, 616475, 617999, 619500, 621525, 624512, 628439, 633190, 638881, 645429, 652137, 658183, 663225, 667147, 669595, 670287, 669417, 667121, 662835, 655804, 646086, 634393, 621140, 606413, 590814, 575461, 560900, 546789, 533023, 520475, 510018, 501261, 492953, 484469, 476302, 469163, 463194, 458212, 454184, 451008, 448126]
58676D48126l262l593l000j471P9P87O08J87K02R37K258L759N018N891O494O915
58660D69935P053O807O225N343M064K315K63j770l492m681n265n372n116m308
58646D72001k766j013j23n08j355j723j769k282l230l631k918j680q18m61k0R06
58630D48610K040K692K445J636J086J195J447J131L83L9M93J239J676J839K026
58615D69977K203K243K433L202M344N018M704L817L086K590J835P08j59k93k11
58600E05497p88j909k394j540j14N11q4j159j831j793j173k65M92P97R26J550
58584D96723K895M313N004N006N181O155P579Q598Q849Q608Q090P193O078N449
58570E85721N677O081N788N100N203O536Q278R593J0623J1887J3446J5082J6686
$$ y = [448126, 444864, 441271, 438271, 436800, 436879, 437666, 438274, 438461, 438663, 439600, 441858, 445617, 450635, 456526, 463020, 469935, 476988, 483795, 490020, 495363, 499427, 501742, 502005, 500235, 496743, 492062, 486797, 481425, 476309, 472001, 469235, 468222, 468099, 467591, 466236, 464513, 462744, 460462, 457232, 453601, 450683, 449003, 448185, 447724, 447704, 448610, 450650, 453342, 455787, 457423, 458509, 459704, 461151, 462282, 462665, 462704, 463197, 464436, 466112, 467951, 469977, 472180, 474423, 476856, 480058, 484402, 489420, 494124, 497941, 501027, 503617, 505452, 506160, 506001, 505708, 505497, 504709, 502800, 500406, 498866, 498752, 499263, 499179, 498020, 496189, 494396, 493223, 492958, 493450, 494247, 495173, 496723, 499618, 503931, 508935, 513941, 519122, 525277, 532856, 541454, 550303, 558911, 567001, 574194, 580272, 585721, 591398, 597479, 603267, 608367, 613570, 620106, 628384, 637977, 648600, 660487, 673933, 689015, 705701]
58557G05701J8009J8584J8351J7793J7029J5393J2557R359O783M586J901j200
58545H44846l681n059n971p148q461r266r245q781q662r427j0786j1931j2605
58532G33823j3341j4356j4849j4039j2396j0965r935q789p484o381n213l289q89
58519F11897O70P76L78P11J829K823K932J997L83j150j922j991k064k489k792
58504F11988k416j577j004j088j572j910j784j400j319j831k457k333j154M58
58490E90601J524J553Q77K97L79R27J349J511J869K661L512M155M929O075P145
58475F29364P745Q364R540J0712J0818R811Q569P401N694L155M36j728l239m296
58461G02346m985n402n598n251l984k048j31J497L038M371N045N149N451O281
$$ y = [705701, 723710, 742294, 760645, 778438, 795467, 810860, 823417, 832776, 839559, 844145, 846046, 844846, 841165, 836106, 830135, 822987, 814526, 805260, 796015, 787234, 778572, 769145, 758359, 746428, 733823, 720482, 706126, 691277, 677238, 664842, 653877, 643942, 635153, 627669, 621288, 616075, 612786, 611897, 612567, 613343, 613721, 614432, 616261, 619084, 622016, 624013, 624396, 623246, 621324, 619333, 617269, 614780, 611988, 609572, 607995, 606991, 605903, 604331, 602421, 600637, 599237, 597918, 596087, 593630, 591297, 590143, 590601, 592125, 593678, 594555, 594852, 595231, 596158, 597507, 599018, 600887, 603548, 607060, 611215, 616144, 622219, 629364, 637109, 645473, 655013, 665725, 676543, 686354, 694923, 702324, 708018, 711173, 711609, 709881, 706642, 702346, 697361, 691959, 686361, 681110, 677126, 675078, 674947, 676444, 679482, 683853, 688898, 694047, 699498, 705779]
58447G05779O963O666N370L728K367J441O02p11k635m516n491n343m495l424k466
58432G03835j803j169Q6K047L792M534M734N253O025O550P130Q378R860J0485
58418G69737J0079R257P974N712K954R30k40j644l600n106n529n399n163m574
58404G75388l793l595l968l888l118k733l191l361k360j008l74j03P66K291L878
58389G50831N157N740N151L824L178L746M244L488K159J621J902K171K402L218
58375G98832M578N759O386O576O437O158O202O666P014P015P277Q154Q928Q857
58361H94839Q306Q002P920P795Q003Q989J0340J1315J1725J1588J0634R017P738
58348A016211P429P364O584N306M344L858L738M466O393Q675J0085J0534J0834
$$ y = [705779, 712742, 719408, 724778, 728506, 730873, 732314, 732916, 732205, 729570, 725054, 719563, 714220, 709725, 706301, 703835, 702032, 700863, 700949, 702996, 706788, 711322, 716056, 721309, 727334, 733884, 741014, 749392, 759252, 769737, 779816, 789073, 797047, 802759, 805713, 806643, 806403, 804759, 801159, 796053, 790524, 785125, 779962, 775388, 771595, 768000, 764032, 760144, 757026, 754293, 751102, 747741, 745381, 744373, 743999, 743896, 744662, 746953, 750831, 755988, 761728, 766879, 770703, 773881, 777627, 781871, 785359, 787518, 789139, 791041, 793212, 795614, 798832, 803410, 809169, 815555, 822131, 828568, 834726, 840928, 847594, 854608, 861623, 868900, 877054, 885982, 894839, 903145, 911147, 919067, 926862, 934865, 943854, 954194, 965509, 977234, 988822, 999456, 1008473, 1016211, 1023640, 1031004, 1037588, 1042894, 1047238, 1051096, 1054834, 1059300, 1065693, 1074368, 1084453, 1094987, 1105821]
58335A105821J1399J2140J3067J4076J4568J4285J4048J4638J5552J5880J5829
58324A261303J6126J6383J5467J3407J1581J0820J0472R548Q110P084P194Q258
58312A395753R419J0071J0483J1219J2110J2568J2812J3719J5270J6396J6767
58301A536587J7327J8515J9310J9014J8575J9055J9976K0358K0386K0771K1436
58290A751310K2050K2982K4533K6029K6830K7347K8095K8656K8755K9268L0860
58279B046715L2632L3457L3776L4701L6282L7985L9940M2350M4524M5913M7296
58268B475571M9535N2071N3969N5565N7711O0255O2615O4959O7549O9925P1982
58257C141707P4633P8223Q1545Q3791Q5894Q8573R0789R1847R3168R6038R9421
$$ y = [1105821, 1117220, 1129360, 1142427, 1156503, 1171071, 1185356, 1199404, 1214042, 1229594, 1245474, 1261303, 1277429, 1293812, 1309279, 1322686, 1334267, 1345087, 1355559, 1365107, 1373217, 1380301, 1387495, 1395753, 1405172, 1415243, 1425726, 1436945, 1449055, 1461623, 1474435, 1488154, 1503424, 1519820, 1536587, 1553914, 1572429, 1591739, 1610753, 1629328, 1648383, 1668359, 1688717, 1709103, 1729874, 1751310, 1773360, 1796342, 1820875, 1846904, 1873734, 1901081, 1929176, 1957832, 1986587, 2015855, 2046715, 2079347, 2112804, 2146580, 2181281, 2217563, 2255548, 2295488, 2337838, 2382362, 2428275, 2475571, 2525106, 2577177, 2631146, 2686711, 2744422, 2804677, 2867292, 2932251, 2999800, 3069725, 3141707, 3216340, 3294563, 3376108, 3459899, 3545793, 3634366, 3725155, 3817002, 3910170, 4006208, 4105629]
58246D105629J02242J05967J12260J19807J26354J32483J40381J50069J59856
58237E255048J69577J80420J92200K03697K15091K27552K41147K55495K71525
58228G211752K90114L10138L30426L52325L77735M06009M35715M67916N04681
58219A0686811N45901N90695O40352O96705P59431Q28428R06947R98629J103609
58210A7757508J221431J355684J511712J692496J901621K147748K440888K787015
58202C2816103L192219L670241M241046M926004N751797O755774P978834R453529
58194G8785547J1204165J3253494J5620653J8315036K1335377K4654667K8164001
58187B11332940L1582384L4364860L5654165L4373846K9584705K1048464R628684
$$ y = [4105629, 4207871, 4313838, 4426098, 4545905, 4672259, 4804742, 4945123, 5095192, 5255048, 5424625, 5605045, 5797245, 6000942, 6216033, 6443585, 6684732, 6940227, 7211752, 7501866, 7812004, 8142430, 8494755, 8872490, 9278499, 9714214, 10182130, 10686811, 11232712, 11823407, 12463759, 13160464, 13919895, 14748323, 15655270, 16653899, 17757508, 18978939, 20334623, 21846335, 23538831, 25440452, 27588200, 30029088, 32816103, 36008322, 39678563, 43919609, 48845613, 54597410, 61353184, 69332018, 78785547, 89989712, 103243206, 118863859, 137178895, 158514272, 183168939, 211332940, 242915324, 277280184, 312934349, 347308195, 376892900, 397941364, 407570048]
58180D07570048k887043j4519607k3850084l0279176l3811537l4763375l3639761
58173B33819465l1085607k7762940k4201056k0741741j7579111j4807093j2443458
58166H5198459j0458861q811263p457980o349830n435842m677202m047536l522130
58158C4437815l077399k698988k380012k111284j880933j682088j512812j368716
58150A7725583j242352j129185j028002r36115q49953p69857o98737o36402n79786
58141I855194n27986m82365m42540m06868l76213l52645l34836l18736l02423
58132F310582k86531k70705k53597k35958k19913k05497j91335j78145j67952
58123D300949j60124j51770j42107j33192j26255j20248j14169j08117j02027
$$ y = [407570048, 404683005, 390163398, 366313314, 336034138, 302222601, 267459226, 233819465, 202733858, 174970918, 150769862, 130028121, 112449010, 97641917, 85198459, 74739598, 65928335, 58470355, 52120525, 46684683, 42007481, 37959945, 34437815, 31360416, 28661428, 26281416, 24170132, 22289199, 20607111, 19094299, 17725583, 16483231, 15354046, 14326044, 13389929, 12539976, 11770119, 11071382, 10434980, 9855194, 9327208, 8844843, 8402303, 7995435, 7619222, 7266577, 6931741, 6613005, 6310582, 6024051, 5753346, 5499749, 5263791, 5043878, 4838381, 4647046, 4468901, 4300949, 4140825, 3989055, 3846948, 3713756, 3587501, 3467253, 3353084, 3244967, 3142940]
58114C142940r5740r0231q6492q3528p9631p5143p1647o9064o6055o2708o0322
58103B302379n8851n7040n4815n3150n1915n0155m8161m6998m6292m4752m2512
58092A747738m0746l9383l7416l5103l3531l2455l0792k8912k8047k7821k6837
58081A386695k5391k5051k5716k5655k4510k3655k3483k2853k1529k0728k0788
58070A127336k0665k0119k0185k0899k0823j9429j7963j7221j6472j5230j4146
58059I24184j3462j2372j0745r747j0023j0788j1424j2348j3612j4190j3515j2340
58047G79618j1418j0562r645r100q845q118o991o673p553q384q105p275o812o619
58033F63518o331o333p007p916q565r156r863j0157r666q939q664q721q622q281
$$ y = [3142940, 3047200, 2956969, 2870477, 2786949, 2707318, 2632175, 2560528, 2491464, 2425409, 2362701, 2302379, 2243528, 2186488, 2131673, 2078523, 2026608, 1976453, 1928292, 1881294, 1835002, 1790250, 1747738, 1706992, 1667609, 1630193, 1595090, 1561559, 1529104, 1498312, 1469400, 1441353, 1413532, 1386695, 1361304, 1336253, 1310537, 1284882, 1260372, 1236717, 1213234, 1190381, 1168852, 1148124, 1127336, 1106671, 1086552, 1066367, 1045468, 1024645, 1005216, 987253, 970032, 953560, 938330, 924184, 910722, 898350, 887605, 877858, 867835, 857047, 845623, 833275, 819663, 805473, 791958, 779618, 768200, 757638, 747993, 738893, 730048, 721930, 714939, 708266, 700713, 692329, 684224, 676949, 670137, 663518, 657187, 650854, 643847, 635931, 627366, 618210, 608347, 598190, 588524, 579585, 570921, 562200, 553578, 545297]
58019E45297p824p191o501o240o597p077p073o451n430m414l938m146m352l801
58005D64262k831k373k453k219j463r08p79l71N99J367J391J122J042Q76M02Q5
57989D57749K27K72l73j473k480l301l961m171l794l265l104l363l862m477m965
57974D15659n017m749m592m505l930k796j880j754j984j773j007k30Q5m4k23r9
57958C81161J85J79j55k88j06l76j493k455k191j358j409k195k056l94J455K208
57942C70712K070J742J396J245J834L033L852L951M295N594P052P535P109O565
57928D27985O155N549M529K979Q11j595l406m394n287o603p833q362q416q464
57914C93648q337p738p014o688o601o232n506m727m045l439k924k426j842j469
$$ y = [545297, 537473, 530282, 523781, 517541, 510944, 503867, 496794, 490343, 484913, 480499, 476561, 472415, 468063, 464262, 461431, 459058, 456605, 454386, 452923, 452015, 451236, 450865, 451464, 452831, 454222, 455344, 456386, 457262, 457664, 457749, 457976, 458248, 457875, 456402, 453922, 450621, 446660, 442489, 438695, 435430, 432326, 428963, 425101, 420624, 415659, 410642, 405893, 401301, 396796, 392866, 390070, 388190, 386436, 384452, 382679, 381672, 381442, 381527, 381483, 381260, 381161, 381346, 381525, 381370, 381082, 380976, 380600, 379107, 376652, 374461, 373103, 371694, 369499, 367443, 367049, 368504, 370712, 372782, 374524, 375920, 377165, 378999, 382032, 385884, 389835, 394130, 399724, 406776, 414311, 421420, 427985, 434140, 439689, 444218, 447197, 448008, 446413, 443007, 438613, 433326, 426723, 418890, 410528, 402112, 393648, 385311, 377573, 370559, 363871, 357270, 351038, 345532, 340805, 336760, 333321, 330397, 327971, 326129, 324660]
57900C24660j759k463k693k252k028k552k962k165m02J116J688J561J273J202
57886C12224J466J791J728J288R88J017R30M40j53p44j764l224m238m230l925
57871C03594m345n333n979n968n680n308m703l942l292k803k400k169k031j524
57857B48117m65M99O22J06j34M46J715L249M537N036M616L843L373L238L026K459
57841B84283J516L56n43o53j40J20l29r42j122j127j475k024k326k384k326j853
57825B69031p30N24J263J691K414L334L803L730L767M353N193N714N581M784L465
57810C17917J689p11l738o592q058p843o937o333o041n773n635n548m854l449
57796B48094k460k804l709l766k875k003j559j229j072j402j850j769j399j379
$$ y = [324660, 322901, 320438, 317745, 315493, 313465, 310913, 307951, 305786, 305384, 306500, 308188, 309749, 311022, 312224, 313690, 315481, 317209, 318497, 319485, 320502, 321432, 321872, 321719, 320975, 319211, 315987, 311749, 307519, 303594, 299249, 293916, 287937, 281969, 276289, 270981, 266278, 262336, 259044, 256241, 253841, 251672, 249641, 248117, 247652, 248151, 248773, 248879, 248745, 249191, 250906, 254155, 258692, 263728, 268344, 272187, 275560, 278798, 281824, 284283, 285799, 286155, 285612, 284959, 284819, 284939, 284610, 283668, 282546, 281419, 279944, 277920, 275594, 273210, 270884, 269031, 268301, 268825, 270088, 271779, 274193, 277527, 281330, 285060, 288827, 293180, 298373, 304087, 309668, 314452, 317917, 319606, 318895, 315157, 308565, 300507, 292664, 285727, 279394, 273353, 267580, 261945, 256397, 251543, 248094, 245634, 242830, 239121, 235355, 232480, 230477, 228918, 227689, 226617, 225215, 223365, 221596, 220197, 218818]
57782B18818j272p3J841K804K268J582J959K935L562L910M520N276N672N598N166
57767B64566M410L637L382L398K506K48k099l101l163l797n217n962n078l497
57753B50233k719k947l239l008k632k567k586k199j430q20p45j043j363j576j720
57738B19639j708j359p14j99l79j330k284k158p77P49J211P17L04L77L52o8k55
57721B12118L16J209J751J899J786J177Q5o99o26l90j004k184k715k166j340j108
57705B08109j634k619l461l336k026n89k76r14j233p17j3M02P95J142Q03l13j276
57688A92844j385j008p21m57j00L7k4M82J963L626M565N087O162Q084J0568J3698
57672B43421J7759K2386K6869L1337L6731M3498N0949N7895O2937O3803N7412
$$ y = [218818, 217546, 217473, 219314, 222118, 224386, 225968, 227927, 230862, 234424, 238334, 242854, 248130, 253802, 259400, 264566, 268976, 272613, 275995, 279393, 281899, 282147, 280048, 276947, 273784, 269987, 264770, 258808, 253730, 250233, 247514, 244567, 241328, 238320, 235688, 233121, 230535, 228336, 226906, 226086, 225341, 224298, 222935, 221359, 219639, 217931, 216572, 215858, 215659, 215280, 213950, 211666, 209508, 208731, 209480, 210691, 211408, 211712, 212089, 212441, 212373, 212118, 212434, 213643, 215394, 217293, 219079, 220256, 220341, 219642, 219016, 218626, 217622, 215438, 212723, 210557, 209217, 208109, 206475, 203856, 200395, 197059, 195033, 194444, 194168, 193254, 192021, 191304, 191291, 191693, 192488, 193630, 194433, 194120, 192844, 191459, 190451, 189730, 189273, 189173, 189210, 189186, 189668, 191631, 195257, 199822, 204909, 211071, 219155, 229723, 243421, 261180, 283566, 310435, 341772, 378503, 422001, 472950, 530845, 593782, 657585, 714997]
57661G14997M1762J8065r128l4046n2225o1909o3953o0701n4644m7607m0605l4069
57649C15937k8034k2404j7257j2941r692p304n409m013l420l532l637l222k604
57636A92468k258j897q95N19J371J358J261J640J933J409K72p69j489j916j778
57621A91229r74k02k05p89j348j929k757l227k586j455j262k090k478j657o54
57606A67616n96j121j245q87o38o77p65q50r94j045r34r72j373j869k153k280
57590A49217k272j945j488j576k382l054k847k196j945k058j870j270o89k53K15
57575A23587M83N8r14j698j968k106k343k326j795j141r10j060j059n60K44Q59
57559A07351R41N32o7o13j026j240j161p96k14O52J830K883L096K344J316O84
$$ y = [714997, 756759, 774824, 765696, 731650, 679425, 617516, 553563, 492862, 438218, 390611, 350006, 315937, 287903, 265499, 248242, 235301, 225609, 218305, 212896, 208883, 205463, 201931, 198294, 195072, 192468, 190210, 188313, 187418, 187937, 189308, 190666, 191927, 193567, 195500, 196909, 197181, 196412, 194923, 193007, 191229, 190255, 190053, 189848, 189059, 187711, 185782, 183025, 179798, 177212, 175757, 174495, 172405, 169927, 168270, 167616, 167020, 165899, 164654, 163767, 163129, 162452, 161687, 160837, 159843, 158798, 157864, 156892, 155519, 153650, 151497, 149217, 146945, 145000, 143512, 141936, 139554, 136500, 133653, 131457, 129512, 127454, 125584, 124314, 123625, 123372, 123587, 124070, 124128, 123214, 121516, 119548, 117442, 115099, 112773, 110978, 109837, 108927, 107867, 106808, 106248, 106492, 107351, 108292, 108824, 108757, 108144, 107118, 105878, 104717, 103921, 103707, 104359, 106189, 109072, 112168, 114512, 115828, 116512]
57543A16512M19K42K22L77K17o07j488j464n47K85M65M63Q27J244J000O6p68q23
57525A16642l08q2o47j468j499m17R40J526J206O65M54N93Q96J229J428J295Q49
57508A23302K94j57l58k50r9m61j480k408k290j193k02j86r55j792k249k270j937
57491A05309j518j422j803k284k364k006j564j252r78o87n86q22j128r97k68N84
57475H6214R33O36J13k50m89p91j064j037p13m56o02j102j594j756j552j104m00
57458G4986P02K030K852K438R61n21j174j160j130j306j404j250r56o14j76K97
57442G4575N62M96K21n5k10k06j09o8j37j76m3J78L04K67J07j72m78n84l95j94
57422G3883k75n16o27o50q12r45o19R0N25L66J85O09J295J249K00q46p03O21J900
$$ y = [116512, 116931, 117173, 117395, 117772, 117989, 117382, 115894, 114430, 113883, 114168, 114633, 115096, 115923, 117167, 118167, 118233, 117465, 116642, 116334, 116252, 115605, 114137, 112638, 112221, 113161, 114687, 115893, 116558, 117012, 117605, 118501, 119730, 121158, 122453, 123302, 123596, 123439, 123081, 122831, 122732, 122271, 120791, 118383, 116093, 114900, 114698, 114512, 113557, 111765, 109516, 107246, 105309, 103791, 102369, 100566, 98282, 95918, 93912, 92348, 91096, 90118, 89431, 88845, 88023, 86895, 85898, 85630, 86214, 87147, 87783, 87896, 87646, 87157, 86366, 85302, 84265, 83552, 83096, 82494, 81392, 79798, 78042, 76490, 75386, 74986, 75688, 77718, 80570, 83008, 83969, 83448, 82274, 81114, 79984, 78678, 77274, 76024, 75068, 74454, 74278, 74575, 75137, 75633, 75854, 75799, 75589, 75383, 75274, 75206, 75069, 74893, 74850, 75028, 75332, 75599, 75706, 75534, 75056, 74472, 74077, 73883, 73608, 73092, 72465, 71815, 71003, 70058, 69439, 69529, 70054, 70420, 70605, 71214, 72509, 73758, 73958, 73112, 72409, 73030, 74930]
57403G4930J980Q67m81j176j018l53L55P50P23M75L44M60P02R50J144J102O70
57386H2424J40J32Q17J592J837J678J604J667J488R79M55J40l9r7J21O03R93Q85
57368I7419J10j148k241k257r08Q26J451N89n96q42j61N31P11O34O13N56L41K29
57350I5857N43J140J471J220O60K41jl86r71j354j194o64j35K70N65N93K50j76
57332I7929l45l99o87j044r44l65Q0P8J8K47M71L33M3j28m16j019j374p98L20
57313I2000Q57N57L59Q80J415J044N3n17l43L8L37Q54J574J858J407Q98J037J524
57295A05832J585J189J020J362J792J958J945J799J323N49j53p15j495k453k933
57280A12605k730k734l753n260o142o271o410o732o565n698m863m573m369l731
$$ y = [74930, 76910, 77777, 77296, 76120, 75102, 74749, 75104, 75854, 76577, 77052, 77396, 77856, 78558, 79508, 80652, 81754, 82424, 82564, 82696, 83513, 85105, 86942, 88620, 90224, 91891, 93379, 94358, 94813, 94953, 94914, 94817, 94938, 95541, 96534, 97419, 97529, 96381, 94140, 91883, 90975, 91801, 93252, 93841, 93245, 92403, 92242, 92773, 93484, 94118, 94731, 95287, 95628, 95857, 96400, 97540, 99011, 100231, 100891, 101132, 101131, 100745, 99774, 98420, 97226, 96562, 96427, 96697, 97262, 97855, 98105, 97929, 97584, 97185, 96498, 95454, 94510, 94145, 94225, 94303, 94321, 94568, 95039, 95372, 95415, 95287, 94871, 93852, 92478, 91680, 92000, 92857, 93414, 93773, 94653, 96068, 97112, 97165, 96648, 96305, 96343, 96680, 97534, 99108, 100966, 102373, 103271, 104308, 105832, 107417, 108606, 109626, 110988, 112780, 114738, 116683, 118482, 119805, 120354, 120201, 119486, 117991, 115538, 112605, 109875, 107141, 103388, 98128, 91986, 85715, 79305, 72573, 66008, 60310, 55447, 50874, 46505, 42774]
57266D2774k954k469k033j261n38m85q03n10O95K009K590K472K267K380K785L157
57250E0076L108K565K002K028K627L112K987K470K041J847J784J857K057K163
57236H2724K029J874J931J984J679J203J118J596K159K382K319K125J704J054
57222A07881N97Q09J644K575L097L034K510J929J806K347L245L971M164L686K719
57207A46014J953K233L550M761M806L953L247L052K927K730K905L520L939L811
57193A93401L660M018M581M793M803N169N925O555O697O405N803M994M263M058
57179B65125M640N849P148P883P818P473P579Q058Q054P192O302O372P347Q445
57165C65285R260R897J0373J0640J1014J1824J2720J3039J2846J2954J3806J4975
$$ y = [42774, 39820, 37351, 35318, 34057, 33519, 33034, 32231, 31721, 32416, 34425, 37015, 39487, 41754, 44134, 46919, 50076, 53184, 55749, 57751, 59779, 62406, 65518, 68505, 70975, 73016, 74863, 76647, 78504, 80561, 82724, 84753, 86627, 88558, 90542, 92221, 93424, 94542, 96138, 98297, 100679, 102998, 105123, 106827, 107881, 108478, 109287, 110931, 113506, 116603, 119637, 122147, 124076, 125882, 128229, 131474, 135445, 139609, 143295, 146014, 147967, 150200, 153750, 158511, 163317, 167270, 170517, 173569, 176496, 179226, 182131, 185651, 189590, 193401, 197061, 201079, 205660, 210453, 215256, 220425, 226350, 232905, 239602, 246007, 251810, 256804, 261067, 265125, 269765, 275614, 282762, 290645, 298463, 305936, 313515, 321573, 329627, 336819, 343121, 349493, 356840, 365285, 374545, 384442, 394815, 405455, 416469, 428293, 441013, 454052, 466898, 479852, 493658, 508633]
57153E08633J5941J6769J7709J8622J9158J9223J9089J9161J9663K0429K1042
57142G15439K1408K1972K3071K4242K4765K4613K4361K4288K4283K4656K6049
57131I79147K8394L0680L2225L3448L4975L6624L7856L8838M0225M2210M4382
57120A379004M6491M8783N1528N4712N8342O2768O8506P5790Q4350R3590J03094
57109B126958J13073J24324J37791J54224J74233J98429K27430K61905L02764
57100C821131L51146M08257M75457N54573O47828P57037Q82811J024419J180053
57091A0102712J346797J520320J694844J863568K019188K153906K259216K326550
57083B5287101K349279K324439K251582K129049J951562J712275J407688J041013
$$ y = [508633, 524574, 541343, 559052, 577674, 596832, 616055, 635144, 654305, 673968, 694397, 715439, 736847, 758819, 781890, 806132, 830897, 855510, 879871, 904159, 928442, 953098, 979147, 1007541, 1038221, 1070446, 1103894, 1138869, 1175493, 1213349, 1252187, 1292412, 1334622, 1379004, 1425495, 1474278, 1525806, 1580518, 1638860, 1701628, 1770134, 1845924, 1930274, 2023864, 2126958, 2240031, 2364355, 2502146, 2656370, 2830603, 3029032, 3256462, 3518367, 3821131, 4172277, 4580534, 5055991, 5610564, 6258392, 7015429, 7898240, 8922659, 10102712, 11449509, 12969829, 14664673, 16528241, 18547429, 20701335, 22960551, 25287101, 27636380, 29960819, 32212401, 34341450, 36293012, 38005287, 39412975, 40453988]
57075D0453988O22547J68686k99410p58624j187830j570177j892388k143541k316149
57066C1077102k408550k425560k376806k274641k132896j965845j786583j605546
57058A4100675j430118j265260j114313r79131q59924p55584o64667n86090n18817
57049E926771m61340m11990l69584l33234l01620k73256k47473k24470k04185
57040C099619j85755j68323j51812j36546j22612j09758r7357q4355o9983n4699
57030A918419l9544k4374p777J0704K9277M5268N6020N7429M3777J2472l0716
57019B070955p3433j04973j22059j27112j23495j13848j01037q7949p5946o4863
57009A076240n4607m5952l9581l5197l1903k8987k6113k3279k0881j9505j9285
$$ y = [40453988, 41076535, 41245221, 40945811, 40187187, 38999357, 37429180, 35536792, 33393251, 31077102, 28668552, 26242992, 23866186, 21591545, 19458649, 17492804, 15706221, 14100675, 12670557, 11405297, 10290984, 9311853, 8451929, 7696345, 7031678, 6445588, 5926771, 5465431, 5053441, 4683857, 4350623, 4049003, 3775747, 3528274, 3303804, 3099619, 2913864, 2745541, 2593729, 2457183, 2334571, 2224813, 2127456, 2043101, 1973118, 1918419, 1878875, 1854501, 1846724, 1857428, 1886705, 1931973, 1987993, 2045422, 2089199, 2101671, 2070955, 1997522, 1892549, 1770490, 1643378, 1519883, 1406035, 1304998, 1217049, 1141103, 1076240, 1021633, 975681, 936100, 900903, 869000, 840013, 813900, 790621, 769740, 750235, 730950]
56998G30950j9553j9374j8422j7175j6252j5689j4912j3455j1514r751q590p818
56986E58445o858n367l426j320P36K469L281K356o44n007r311j2399j4010j4467
56972D94478j4098j3096j1725j0292q908p391n482l168q26J029K302L599N666
56959D32088Q559J1586J4034J5590J5984J4785J1785P242J540m979j1493j6558
56947E00163j9117j9388j8333j6552j4165j1450q869o472l925j135J683M481P368
56934C94289J0159J2556J4809J7482K0336K2078K1456J8100J2159L941n532j4235
56922E27598k0322k3460k4557k4375k3004k0554j7620j4853j2450j0336q454o733
56910C20880n029l452k500k542l179l481k983k118j490j006l4J638L461M774N457
$$ y = [730950, 711397, 692023, 673601, 656426, 640174, 624485, 609573, 596118, 584604, 574853, 566263, 558445, 551587, 546220, 542794, 541474, 542210, 544679, 547960, 550316, 549672, 544665, 535354, 522955, 508945, 494478, 480380, 467284, 455559, 445267, 436359, 428968, 423486, 420318, 419492, 420521, 422823, 426422, 432088, 440647, 452233, 466267, 481857, 497841, 512626, 524411, 531653, 533193, 528214, 516721, 500163, 481046, 461658, 443325, 426773, 412608, 401158, 392289, 385817, 381892, 380757, 382440, 386921, 394289, 404448, 417004, 431813, 449295, 469631, 491709, 513165, 531265, 543424, 547365, 541833, 527598, 507276, 483816, 459259, 434884, 411880, 391326, 373706, 358853, 346403, 336067, 327613, 320880, 315851, 312399, 309899, 307357, 304178, 300697, 297714, 295596, 294106, 293100, 293066, 294704, 298165, 302939, 308396]
56895C08396N779N952O159O758Q015R666J1053J1773J2010J2204J2528J2620J1729
56882D34642R167M809q06o842j2533j7093j9716k0013j8390j5740j2719r481n955
56869C09330k120K007O351J0781J5200J9611K4038K8494L3146L8125M2933M6190
56857E74086M6316M2266L3654K0853N611q954k0074k7149l1274l3051l1843k7337
56845E43104k0829j4192q124k070M482J1406J8501K5956L4053M2748N1673O0257
56833G46965O7654P2545P3108O7378N4008L3315P868j8146m0521n6635o5838o8772
56821H72929o6573o0706n2936m4680l6270k7305j7906r025j282N931J3587K1712
56809E97476K9571L6808M3427M8698N0856M8157L9790K5920P753j2139l0358m4262
$$ y = [308396, 314175, 320127, 326286, 333044, 341059, 350725, 361778, 373551, 385561, 397765, 410293, 422913, 434642, 443809, 448618, 447812, 440970, 428437, 411344, 391628, 371615, 353225, 337485, 324766, 315285, 309330, 307210, 309217, 315568, 326349, 341549, 361160, 385198, 413692, 446838, 484963, 527896, 574086, 620402, 662668, 696322, 717175, 722786, 713832, 693758, 666609, 635335, 602284, 570441, 543104, 522275, 508083, 499959, 497889, 502371, 513777, 532278, 558234, 592287, 635035, 686708, 746965, 814619, 887164, 960272, 1027650, 1081658, 1114973, 1122841, 1104695, 1064174, 1007539, 941701, 872929, 806356, 745650, 692714, 648034, 611764, 584459, 566553, 557528, 556246, 562177, 575764, 597476, 627047, 663855, 707282, 755980, 806836, 854993, 894783, 920703, 928456, 916317, 885959, 841697]
56797H41697n2950n6688n6017n1802m5516l8763l2437k6590k0936j5237r523m108
56785D31130O67M910R126J3669J8359K2606K5455K5483K1422J3308K772q160j8202
56772E62545k6614l2584l5492l5621l3963l1380k8232k4761k1414j8675j6682
56761B57127j5065j3202j0874q735p674p609p347n996m083k847k701k930k724
56748A65340j994j200p94r11j344j733j899j927j869j575r89l90q2k1K5J18J87
56731A48942J64n7n34r99r90n46l11o27q85l84O05J239J358J588K267K936K991
56714A56757K315J117l09j519k043j809j233p42m47k55l8K72N10K84m82j119p90
56697A50469M46J659K094J817J255O74K54J44J63p0n44p35l72J85N66R10J357
$$ y = [841697, 788747, 732059, 676042, 624240, 578724, 539961, 507524, 480934, 459998, 444761, 435238, 431130, 431797, 436707, 445833, 459502, 477861, 500467, 525922, 551405, 572827, 586135, 588907, 580747, 562545, 535931, 503347, 467855, 432234, 398271, 366891, 338659, 313898, 292484, 273809, 257127, 242062, 228860, 217986, 209251, 201577, 193968, 186621, 180625, 176542, 173695, 170994, 168064, 165340, 163346, 162146, 161352, 160441, 159097, 157364, 155465, 153538, 151669, 150094, 149105, 148715, 148633, 148612, 148637, 148755, 148942, 149106, 149049, 148515, 147516, 146526, 145980, 145669, 145042, 144157, 143773, 144378, 145617, 146975, 148563, 150830, 153766, 156757, 159072, 160189, 159880, 158361, 156318, 154509, 153276, 152534, 152087, 151832, 151794, 152066, 152576, 152860, 152378, 151259, 150469, 150915, 152574, 154668, 156485, 157740, 158414, 158668, 158812, 158975, 158905, 158361, 157626, 157254, 157439, 158005, 158915, 160272]
56680A60272J538J058K01m68q60j162j150m61N55R97O40J97J81J50m15j091j025
56663A59157j88N63N78P5l75m68j90L62R74J426J761K140K407K175J491R76J007
56646A73871J189J016P08Q10J243J393J103R33J272J727J689J104M13l2k50m74
56630A87715q42j169j027k61O57J075R01N21J09m34r41r85o99q02j524k127k011
56613A78156j680j914k505k607k031j375r93o63k56qM4J86M03K23n44j332j459
56596A61645q51N0Q07J153R57M14J8R4M38O00L40k71r72j310q53L23J459J825
56578A65866J451R73P69O63M38K81M82R75J448J755J988K140K070J834J850K557
56562A87540L961N646P118Q078Q514Q666Q766Q691P982O449M557K961J798P73
$$ y = [160272, 161810, 162868, 163069, 162601, 161741, 160579, 159429, 158968, 159523, 160520, 161160, 161357, 161538, 161688, 161273, 160182, 159157, 158969, 159532, 160110, 160185, 159810, 159342, 159152, 159514, 160488, 161914, 163675, 165815, 168222, 170397, 171888, 172864, 173871, 175060, 176076, 176784, 177594, 178837, 180230, 181333, 182266, 183538, 185265, 186954, 188058, 188471, 188439, 188189, 187715, 186873, 185704, 184677, 184416, 185073, 186148, 187049, 187570, 187679, 187245, 186304, 185319, 184620, 183818, 182294, 180167, 178156, 176476, 174562, 172057, 169450, 167419, 166044, 165051, 164388, 164132, 164124, 164168, 164354, 164757, 164980, 164436, 163104, 161645, 160794, 160844, 161651, 162804, 163761, 164175, 164193, 164287, 164725, 165325, 165665, 165394, 164422, 163112, 162259, 162582, 164041, 165866, 167317, 168290, 169059, 169722, 170160, 170441, 170923, 171898, 173346, 175101, 177089, 179229, 181299, 183133, 184983, 187540, 191501, 197147, 204265, 212343, 220857, 229523, 238289, 246980, 254962, 261411, 265968, 268929, 270727, 271500]
56548B71500j70p24p59n82n50p65j196j694j894j525r50r03j490j895j462o20
56532B54321l52j015k050k689k676k399k473k993l256k603j452r19j277j652j465
56517B25050j298j726k199j998j577j884k750l063k401j424p23k72m0j70m12k44
56501B02869K04J94m89j218j489j451j196m42P08J472J352P39J22n89j406j696
56485A97684r83J66Q24Q31O09K54l16o37n9J141J840J423M51k50m90m37p7N48
56467B02522R48O65K2j44M46J174J410J249J109R35M44n4K06J329K303K143J071
56450B17778J44j6L26O78Q58R02R21J088J478J805J641R57K02j88j64P2L53O25
56432B29460R08J134J011K70q26j466j161l39K72N52Q66J256J392J169P57J10
$$ y = [271500, 271330, 270606, 269847, 269265, 268715, 267950, 266754, 265060, 263166, 261641, 260691, 259788, 258298, 256403, 254941, 254321, 253969, 252954, 250904, 248215, 245539, 243140, 240667, 237674, 234418, 231815, 230363, 229444, 228167, 226515, 225050, 223752, 222026, 219827, 217829, 216252, 214368, 211618, 208555, 206154, 204730, 204007, 203735, 203695, 203525, 203113, 202869, 203073, 203267, 202778, 201560, 200071, 198620, 197424, 196982, 197690, 199162, 200514, 201253, 201375, 200786, 199380, 197684, 196701, 196867, 197691, 198522, 199131, 199385, 199069, 198432, 198373, 199514, 201354, 202777, 203228, 202978, 202488, 202051, 201974, 202522, 203470, 204135, 204157, 204013, 204459, 205633, 207043, 208292, 209401, 210336, 210780, 210726, 210932, 212261, 214564, 216707, 217778, 217922, 217906, 218232, 218910, 219768, 220670, 221591, 222679, 224157, 225962, 227603, 228560, 228762, 228574, 228410, 228482, 228835, 229460, 230368, 231502, 232513, 232783, 231957, 230491, 229330, 228991, 229263, 229815, 230681, 231937, 233329, 234498, 235255, 235365]
56416B35365r15j952k229j423m4J156J772J768J434J286J561J864J699J246J021
56401B43609J007P85L69J23o1o08j233j084j19O66O89M99O61Q98Q74Q57R44N19
56383B49395o89j726j549n11J83L5m41o65m00M01J445J985J629J000R38J255J084
56366B53369K66l93k78L68R96J355J384J035M17j41l76k21K57Q18J112J004P98
56349B61770Q70J224J571J685J481R65L15j31j89L9L86O81O35J10l97j64P44J559
56331B73154K090K978M318N032M392L249K834L114L266L199L306L282K515J407
56317C18136J000J304J250M00m49o03l29l2M00J038J533J729J961K323K305J641
56301C33607R11Q31J452K394L424M385M945M885M377L728L052K398J956J918K325
$$ y = [235365, 234450, 232498, 230269, 228846, 228802, 229958, 231730, 233498, 234932, 236218, 237779, 239643, 241342, 242588, 243609, 244616, 245401, 245770, 245893, 245832, 245224, 243991, 242907, 242788, 243454, 244143, 244642, 245303, 246201, 247075, 247932, 248876, 249395, 248706, 246980, 245431, 244920, 245103, 245138, 244697, 244032, 243632, 244033, 245478, 247463, 249092, 250092, 251030, 252285, 253369, 253635, 253242, 252964, 253332, 254328, 255683, 257067, 258102, 258519, 258378, 258002, 257781, 258038, 258856, 259968, 260972, 261770, 262640, 263864, 265435, 267120, 268601, 269566, 269881, 269750, 269561, 269600, 269986, 270667, 271302, 271412, 271015, 270851, 271595, 273154, 275244, 278222, 282540, 287572, 291964, 295213, 298047, 301161, 304427, 307626, 310932, 314214, 316729, 318136, 319136, 320440, 321690, 322090, 321641, 321038, 320709, 320677, 321077, 322115, 323648, 325377, 327338, 329661, 331966, 333607, 334518, 335349, 336801, 339195, 342619, 347004, 351949, 356834, 361211, 364939, 367991, 370389, 372345, 374263, 376588]
56286C76588L082L949M561M735M700M727M733M635M809N554O319O269N608N456
56272D45725O343P646Q711R678J0856J2029J2911J3616J4303J4922J5669J7037
56260E89446J8977K0687K1799K3117K5518K8729L1952L5263L9489M4897N0917
56249I30791N7168O3933P1401P9021Q6026R2306R8523J05317J12402J18429J21864
56238A937181J22175J19993J15939J09650J00257Q7524P2028N4334L4610J3191
56228B766882q832k9858m8552o4341p7408q8303r7364j04393j08840j10338j09062
56217A919591j05701j01207r6443r1791q6994q1563p5423o9103o3251n8065n3250
56206A036800m8454m3571l8781l4391l0707k7794k5337k2886k0299j7750j5330
$$ y = [376588, 379670, 383619, 388180, 392915, 397615, 402342, 407075, 411710, 416519, 422073, 428392, 434661, 440269, 445725, 452068, 459714, 468425, 478103, 488959, 500988, 513899, 527515, 541818, 556740, 572409, 589446, 608423, 629110, 650909, 674026, 699544, 728273, 760225, 795488, 834977, 879874, 930791, 987959, 1051892, 1123293, 1202314, 1288340, 1380646, 1479169, 1584486, 1696888, 1815317, 1937181, 2059356, 2179349, 2295288, 2404938, 2505195, 2592719, 2664747, 2719081, 2753691, 2766882, 2758050, 2728192, 2679640, 2615299, 2537891, 2449588, 2352224, 2247831, 2138991, 2028653, 1919591, 1813890, 1712683, 1616240, 1524449, 1437455, 1355892, 1280469, 1211366, 1148115, 1090050, 1036800, 988346, 944775, 905994, 871603, 840896, 813102, 787765, 764879, 744580, 726830, 711500]
56195G11500j2989j0984r951j0058j0454j0108q991p847o975o016m916m175l944
56182F04092l653k987k441k404k347j565j80J113J891K071J698J208J322K055
56168E99873K464K035J656K291L381L728L456L723M765N573N630N610O052O477
56154F56714O425O439P464R755J2660J5092J6184J6097J6221J7894K0871K3851
56142H25667K6453K9706L4445M0254M6423N3019O0414O8446P6436Q3412Q7845
56131A432520Q7947Q2994P4143O3586N3278M4561L8323L4753L3001L1429K8240
56120B004775K2183J3253K883o852j4388j9075k1187k2245k4892l1151m0679n1395
56108A811230o1517o9984p5361p6163p2609o6656n9686n1481m2069l3092k6261
$$ y = [711500, 698511, 687527, 677576, 667518, 657064, 646956, 637965, 630118, 623143, 617127, 612211, 608036, 604092, 600439, 597452, 595011, 592607, 590260, 588695, 588515, 589628, 591519, 593590, 595288, 596496, 597818, 599873, 602337, 604372, 606028, 608319, 611700, 615428, 618884, 622607, 627372, 632945, 638575, 644185, 650237, 656714, 663139, 669578, 677042, 686797, 699457, 714549, 730733, 746830, 763051, 780945, 801816, 825667, 852120, 881826, 916271, 956525, 1002948, 1055967, 1116381, 1184827, 1261263, 1344675, 1432520, 1520467, 1603461, 1677604, 1741190, 1794468, 1839029, 1877352, 1912105, 1945106, 1976535, 2004775, 2026958, 2040211, 2043094, 2036242, 2021854, 2002779, 1981592, 1959347, 1934455, 1903304, 1862625, 1811230, 1749713, 1679729, 1604368, 1528205, 1455596, 1388940, 1329254, 1277773, 1235704, 1202612, 1176351]
56097A176351k1426j7216j2947r006n918l840k526j309M20K344L490L693L934
56084A116044M839N835O391O944P837Q405Q098P650P984Q711Q884Q647Q968J0072
56070A225309J1255J2126J3051J4387J5914J7124J7689J7780J8068J9011K0082
56059A401796K0438K0362K1084K2769K3976K3776K3209K3652K4837K5652K6032
56048A657583K6620K7193K6816K5436K4126K3791K4388K5355K6156K6689K7528
56037A941681K9368L1876L3847L4936L6238L8482M0723M1850M2406M3728M5987
56026B361122M8361N0493N2587N4516N5980N7273N8896O0806O2806O5115O7798
56015B995753P0329P2533P5240P9088Q3512Q7816R2319R7374J02312J06573J10984
$$ y = [1176351, 1154925, 1137709, 1124762, 1115756, 1109838, 1105998, 1103472, 1102163, 1102583, 1104927, 1108417, 1112110, 1116044, 1120883, 1126718, 1133109, 1140053, 1147890, 1156295, 1164393, 1172043, 1180027, 1188738, 1197622, 1206269, 1215237, 1225309, 1236564, 1248690, 1261741, 1276128, 1292042, 1309166, 1326855, 1344635, 1362703, 1381714, 1401796, 1422234, 1442596, 1463680, 1486449, 1510425, 1534201, 1557410, 1581062, 1605899, 1631551, 1657583, 1684203, 1711396, 1738212, 1763648, 1787774, 1811565, 1835953, 1861308, 1887464, 1914153, 1941681, 1971049, 2002925, 2036772, 2071708, 2107946, 2146428, 2187151, 2229001, 2271407, 2315135, 2361122, 2409483, 2459976, 2512563, 2567079, 2623059, 2680332, 2739228, 2800034, 2862840, 2927955, 2995753, 3066082, 3138615, 3213855, 3292943, 3376455, 3464271, 3556590, 3653964, 3756276, 3862849, 3973833]
56004C973833J16582J22971J29184J35340J42186J49757J57806J66709J76638
55995E271006J86723J96429K06812K18993K32344K45735K59590K75148K92648
55986G385428L11839L33291L57545L84017M12443M44181M80368N20118N62439
55977A1191669O08602O60590P18757P83263Q56344R40572J036436J144297J267351
55968A9207881J410073J575644J768087J995280K266538K589043K970643L424892
55960C7208081L970011M625197N412846O363124P511226Q889723J0525442J2440163
55952I6945813J4649056J7159445J9970797K3059937K6333733K9550682L2225719
55945B59895182L3555427L2470231K7956306J9628908Q224631m435726j6122816
$$ y = [3973833, 4090415, 4213386, 4342570, 4477910, 4620096, 4769853, 4927659, 5094368, 5271006, 5457729, 5654158, 5860970, 6079963, 6312307, 6558042, 6817632, 7092780, 7385428, 7697267, 8030558, 8388103, 8772120, 9184563, 9628744, 10109112, 10629230, 11191669, 11800271, 12460861, 13179618, 13962881, 14819225, 15759797, 16796233, 17940530, 19207881, 20617954, 22193598, 23961685, 25956965, 28223503, 30812546, 33783189, 37208081, 41178092, 45803289, 51216135, 57579259, 65090485, 73980208, 84505650, 96945813, 111594869, 128754314, 148725111, 171785048, 198118781, 227669463, 259895182, 293450609, 325920840, 353877146, 373506054, 381730685, 377294959, 361172143]
55938C61172143k5092584l0610989l2883449l2634102l0703504k7828543k4565740
55931A56853232k1286415j8210664j5454095j3061724j1028813r322754p903497
55924F0585270o730849n763173m960694m291876l732916l262890k863710k522907
55916B6456255k231588j980449j761157j569800j404773j262195j136706j025403
55908A4084184r27385q40443p61652o90463o28050n74048n26762m85624m50576
55899H199181m19570l89739l60795l34656l11933k91239k71663k53430k36139
55890E330017k18676k01180j85017j70628j57035j43610j30638j18139j05775
55881C899319r4201q5119p9621p7374p7364p8422p9348p9683q0268q2220q5586
$$ y = [361172143, 336079559, 305468570, 272585121, 239951019, 209247515, 181418972, 156853232, 135566817, 117356153, 101902058, 88840334, 77811521, 68488767, 60585270, 53854421, 48091248, 43130554, 38838678, 35105762, 31842872, 28979162, 26456255, 24224667, 22244218, 20483061, 18913261, 17508488, 16246293, 15109587, 14084184, 13156799, 12316356, 11554704, 10864241, 10236191, 9662143, 9135381, 8649757, 8199181, 7779611, 7389872, 7029077, 6694421, 6382488, 6091249, 5819586, 5566156, 5330017, 5111341, 4910161, 4725144, 4554516, 4397481, 4253871, 4123233, 4005094, 3899319, 3805118, 3719999, 3640378, 3563004, 3485640, 3407218, 3327870, 3248187, 3167919, 3085699, 3000113]
55870C000113q9761r4437r9002j01734j01079r7476r2684q7667q2293p6567p0835
55859B006578o5080n9284n4223n0679m8155m5634m3173m1489m0282l8530l6232
55848A483817l4452l3553l2833l1956l1460l1573l1706l1359l0603k9490k7910
55837A136922k6148k4670k3327k1673j9994j9054j8814j8433j7585j6721j5905
55826I14598j4539j2550j0884j0335j0696j1393j2215j3050j3580j3698j3754
55815G77904j4020j4310j4278j3767j2775j1490j0434j0077j0197j0042r154p728
55803F39632o148m675l473k591j885j286r58q89o59q8K47j77q09o06N04J518J703
55786F19360J300R43R64J342J641R56j486n478r937j3795j6443j7490j6803j4807
$$ y = [3000113, 2910352, 2815915, 2716913, 2615179, 2514100, 2416624, 2323940, 2236273, 2153980, 2077413, 2006578, 1941498, 1882214, 1827991, 1777312, 1729157, 1683523, 1640350, 1598861, 1558579, 1520049, 1483817, 1449365, 1415812, 1382979, 1351023, 1319563, 1287990, 1256284, 1224925, 1194322, 1164832, 1136922, 1110774, 1086104, 1062777, 1041104, 1021110, 1002056, 983242, 964809, 947224, 930503, 914598, 900059, 887509, 876625, 866290, 855594, 844201, 831986, 818936, 805356, 791658, 777904, 763884, 749574, 735296, 721529, 708754, 697264, 686830, 676753, 666556, 656514, 647360, 639632, 633484, 628809, 625336, 622745, 620860, 619574, 618616, 617727, 617068, 616980, 617227, 617050, 616241, 615635, 616139, 617657, 619360, 620660, 621603, 622567, 623909, 625550, 626506, 625020, 619542, 609605, 595810, 579367, 561877, 545074, 530267]
55772E30267j2206r406o414l201J79L374N261M301K21n054q986j0694j0921j0303
55758D66418q840o812m885l230j601m33n80j850l008l627m767p121r630j0786
55744C99248j0567j0120j0020r755q722o996n077l374k071j305j307k212l632
55731C24090m706m867m331l557k622j692j602k946m869n849n678n475n676n306
55717B64914l740j954j197j301j230n89J98Q21J358J940K678L610M304L988K607
55702B76407J195N56P3j354l618n509o366o731p260p762p580o434m664k932j862
55687B16159j702k139k554k539k112j512q52J6J254K547L089K403J101K75P6m27
55671B13083j696k800k705j843j604k424l292l194k279j354q01l83J56P45J089
$$ y = [530267, 518061, 508655, 502241, 499040, 499219, 502593, 507854, 512155, 512376, 507322, 498336, 487642, 476721, 466418, 457578, 450766, 445881, 442651, 441050, 440617, 440037, 438187, 435179, 431552, 426785, 419664, 410034, 399248, 388681, 378561, 368541, 358786, 350064, 343068, 337991, 334617, 332546, 331241, 329934, 327722, 324090, 319384, 314517, 310186, 306629, 304007, 302315, 300713, 297767, 292898, 287049, 281371, 275896, 270220, 264914, 261174, 259220, 258023, 256722, 255492, 254903, 255101, 255922, 257280, 259220, 261898, 265508, 269812, 273800, 276407, 277602, 278158, 278231, 276877, 273259, 267750, 261384, 254653, 247393, 239631, 232051, 225617, 220953, 218021, 216159, 214457, 212318, 209764, 207225, 205113, 203601, 202749, 202765, 204019, 206566, 209655, 212058, 213159, 213434, 213510, 213083, 211387, 208587, 205882, 204039, 202435, 200011, 196719, 193525, 191246, 189892, 189091, 188708, 188864, 189609, 190698]
55656A90698R96N95L31N26R95J217J005P26Q51J369J890K128K066J753J221O68
55640B09035M58P25J089R72J25j299k961m395n005m570l804l808m715n429n067
55625A71351m120l645l729l533k644j511n81K03Q12Q52K26m70o82o11q05j312
55609A49801j726j879k029k357k623k475j980j640j821k250k269j643q71n24n53
55594A23161n37l17n7J68L82M52K65M9J06K77J23l56p03o66m56l19k74k87k79
55575A20732L6Q44J859K610L043L364L523L403L296L470L477K742J661J123R59
55560A56142Q5j624k907k963k593k777l265l384l289l375l281k594j937k192k966
55545A17080l019k077j122r11j127j162r63q02p75p36m59J63Q62J100P67M73P14
$$ y = [190698, 191694, 192289, 192620, 193146, 194141, 195358, 196363, 197089, 197940, 199309, 201199, 203327, 205393, 207146, 208367, 209035, 209493, 210218, 211307, 212279, 212404, 211105, 208144, 203749, 198744, 194174, 190370, 186562, 181847, 176418, 171351, 167231, 163586, 159857, 156324, 153680, 152169, 151588, 151791, 152603, 153455, 153681, 153211, 152529, 151918, 151113, 149801, 148075, 146196, 144167, 141810, 139187, 136712, 134732, 133092, 131271, 129021, 126752, 125109, 124238, 123714, 123161, 122624, 122307, 122250, 122418, 122800, 123252, 123517, 123566, 123672, 123949, 124072, 123716, 123013, 122347, 121891, 121572, 121298, 121011, 120732, 120768, 121612, 123471, 126081, 129124, 132488, 136011, 139414, 142710, 146180, 149657, 152399, 154060, 155183, 156142, 156227, 154603, 151696, 148733, 146140, 143363, 140098, 136714, 133425, 130050, 126769, 124175, 122238, 120046, 117080, 114061, 111984, 110862, 109951, 108824, 107662, 106699, 105897, 105122, 104386, 103927, 104090, 104952, 106052, 106819, 107292, 108006]
55528A08006J088Q38m7q43j043p06j31K90J05o45j118o79n0n51k173l335k839
55511I6167j290j33M7k43l96l44k97l61m28l56j98j98m77p79p48m31k04k85n06
55492H8540o21n78m16j81Ok8k99o26p34m35K22R28J332J376J210Q28J22n95o56
55473H9395Q0Q87J027N94O0n04j225j820j931j741j627j411o97J93M66J0m29l56
55455H0971o9M6N7O7j14n71r88j056q32m71m7K86L09J05OP6Q2K7K14N97O28R7
55433G9420l33J14J269K097J782N09p07r27j34Q03J119R20O44J48r49k125k091
55416H1559m28J654K671K393J623R34L53p9k20k49n89j310k020k393k430k158
55400G9311j431l02O87R30M78J03M27J094J140K25q42j053l67M46Q52Q97O55J5
$$ y = [108006, 109094, 109932, 109885, 109042, 107999, 107293, 107162, 107452, 107557, 106912, 105794, 105115, 105065, 104514, 102341, 99006, 96167, 94877, 94744, 94791, 94548, 94152, 93808, 93511, 93150, 92722, 92366, 92168, 91970, 91493, 90714, 89966, 89535, 89331, 89046, 88540, 87919, 87341, 86925, 86744, 86750, 86722, 86423, 85797, 85063, 84628, 84850, 85778, 87110, 88486, 89696, 90524, 90646, 90051, 89395, 89475, 90362, 91389, 91983, 92043, 91539, 90314, 88494, 86563, 84822, 83195, 81784, 81087, 81280, 81746, 81756, 81327, 80971, 80902, 80948, 81005, 81072, 80958, 80387, 79399, 78343, 77511, 77040, 76993, 77279, 77588, 77693, 77699, 77775, 77857, 77884, 78098, 78695, 79323, 79420, 79087, 79201, 80470, 82567, 84349, 84858, 84151, 83224, 83090, 83893, 85012, 85932, 86576, 86724, 85775, 83650, 81559, 81131, 82785, 85456, 87849, 89472, 90406, 90759, 90680, 90460, 90211, 89622, 88312, 86292, 83899, 81469, 79311, 77880, 77578, 78265, 79195, 79673, 79776, 80203, 81297, 82437, 82662, 81820, 80767, 80400, 80846, 81698, 82595, 83250, 83265]
55382H3265q50j403j356r27l32N02J406J768J284N91N30J076J400R88J71m54p44
55365H6915r87j379j784j993k034k061j985j467m53N90J188J375J375J040J86
55350G8526p00p45K04J333J845J704J303R41Q01R20R23L64o08j345j624j769j751
55333H0322j022L01J041M75m82m90L45Q10L21n65j231j545j392o13M28R79Q28
55316G8510M97L75K46j60o51q80p24k83J70K00l08p36m04L40M74j55n06O3P44
55297G6812N18k76n21q5Q2m79j024p75l0M08L59L06N39Q49R97J037J074R93O68
55278H1452J71l54q60j264j312q02J12J059J753K007J557L59r60j424p18M44J153
55261H2373J226R86N35k78j303j969j839j053j95J31k27p72o98K17J268J652J440
$$ y = [83265, 82415, 81012, 79656, 78729, 78397, 78899, 80305, 82073, 83357, 83948, 84478, 85554, 86954, 87942, 88113, 87659, 86915, 85928, 84549, 82765, 80772, 78738, 76677, 74692, 73225, 72772, 73362, 74550, 75925, 77300, 78340, 78526, 77826, 77081, 77285, 78618, 80463, 82167, 83470, 84411, 85212, 86132, 87055, 87419, 86811, 85466, 83842, 82073, 80322, 79300, 79601, 80642, 81117, 80635, 80145, 80490, 81300, 81621, 81056, 79825, 78280, 76888, 76275, 76703, 77682, 78510, 79007, 79382, 79628, 79468, 78817, 77937, 77213, 76930, 77100, 77300, 76992, 76256, 75852, 76192, 76666, 76511, 76005, 76068, 76812, 77330, 77054, 76533, 76448, 76530, 76051, 75027, 74252, 74222, 74630, 74989, 75295, 75834, 76683, 77680, 78717, 79791, 80784, 81452, 81623, 81269, 80409, 79145, 77833, 77031, 77143, 78202, 79955, 81962, 83519, 83878, 82918, 81494, 80776, 81220, 82373, 83599, 84585, 85120, 84842, 83539, 81570, 79731, 78678, 78483, 78614, 78387, 77615, 76917, 77134, 78402, 80054, 81494]
55244H1494J280J279Q57k37j395j913j823j573j310q59j79N60J144J289O98m33
55228G8879j173p22N60J472J365P17K32l7k99l44J33P36O44k75j145j153n04K8
55210G9114J38J98M78O88L87l51r22p86m0O51P11K59q6nJ95J67R6K79L91k38j489
55189G9835k240j586QJ198J251O87M14N79M91l56j486j898j262l33M3r1j32Pj33
55170G4996o04p02P1J250J950J855J388J118J274J614J633J068K75k06m20q67
55154H5693j504j620r87l09j20P7Q11J538J486J027J082J450J055k08j139r90
55138H7342l95j26K3M81R47R73P95P88O86Q5o08o58j33K07P1q3Q0L04K47m7l63
55117I0616n74n76l33r0j28l41l46j20k9j30K3O11J027N68n19j212q99%O85Q82
$$ y = [81494, 82774, 84053, 84910, 84673, 83278, 81365, 79542, 77969, 76659, 75800, 75621, 76181, 77325, 78614, 79312, 78879, 77706, 76984, 77544, 79016, 80381, 81098, 81330, 81293, 80994, 80650, 80783, 81519, 82163, 81888, 80743, 79590, 79086, 79114, 79252, 79450, 79928, 80616, 81003, 80652, 79730, 78944, 78904, 79555, 80266, 80525, 80439, 80434, 80629, 80796, 80892, 81171, 81562, 81324, 79835, 77595, 76009, 76017, 77215, 78466, 79153, 79567, 80146, 80637, 80281, 78795, 76897, 75635, 75302, 75345, 75254, 75122, 75129, 74996, 74392, 73690, 73761, 75011, 76961, 78816, 80204, 81322, 82596, 84210, 85843, 86911, 87186, 86980, 86560, 85693, 84189, 82569, 81582, 81273, 81153, 81230, 82041, 83579, 85065, 86092, 87174, 88624, 89679, 89471, 88332, 87342, 86947, 86821, 86844, 87325, 88272, 89245, 90040, 90828, 91514, 91599, 90991, 90333, 90200, 90407, 90478, 90395, 90475, 90779, 91026, 90979, 90616, 90042, 89466, 89133, 89043, 88915, 88574, 88228, 88108, 88079, 87949, 87972, 88583, 89610, 90178, 89659, 88447, 87548, 87548, 88233, 89115]
55097H9115Q79R17Q91P42P40J151J712J761J021L1m04j00L65L46j61o51p66o76
55079I6913p39r94j122r35o18l94j78J64L94J61l66n64j86L09M97N89R27J218
55061I5076R38K49j19L2M0n56j201j011k2Q14P86J68k90k91k08m21p55p03j50
55042I2376L44J67n77j205j264q74l51J07K99ko02q56m11K89O27N94N26M26J50
55023H9763%L17O20J15q61r35L37J592J444L06m88o83r38j199o26P00J394O02
55005I1460p31j168n11M35J192J820K208K015J316O13J83q7k43j34J72L26J71
54988I9037q0k34l57m97n24m11l98o24q03n19K10R55J337J317J033N84J61P4M22
54969A00683P91O57J63N2O20J128P25k98q44m51K48O26P96R77Q50J59n22m10L76
$$ y = [89115, 89994, 90911, 91802, 92544, 93284, 94435, 96147, 97908, 98929, 98960, 98556, 98456, 98821, 99167, 99006, 98355, 97589, 96913, 96174, 95180, 94058, 93123, 92505, 92111, 91933, 92097, 92491, 92652, 92286, 91722, 91536, 91845, 92342, 92931, 93858, 95076, 96014, 96263, 96144, 96176, 96216, 95660, 94459, 93448, 93426, 94240, 95026, 95194, 94904, 94613, 94405, 93984, 93229, 92526, 92376, 92720, 92887, 92310, 91105, 89841, 88967, 88616, 88723, 89022, 89020, 88418, 87562, 87151, 87440, 88067, 88661, 89187, 89613, 89763, 89763, 90080, 90700, 90815, 89954, 89019, 89356, 90948, 92392, 92698, 92210, 91527, 90589, 89390, 88764, 89464, 90858, 91460, 90729, 89561, 89050, 89485, 90677, 92497, 94705, 96720, 98036, 98649, 98832, 98745, 98502, 98368, 98540, 98866, 99037, 98957, 98723, 98366, 97869, 97345, 96934, 96536, 95912, 95109, 94590, 94800, 95755, 97092, 98409, 99442, 100026, 100187, 100261, 100683, 101474, 102131, 102294, 102346, 102966, 104094, 104819, 104521, 103677, 103226, 103474, 104100, 104896, 105873, 106723, 106882, 106360, 105950, 106326]
54950A06326R50Q57M90K87J01l57r09j070p02k30j53m53o24l12J71K72k3k12q1
54931A04328N0K5K10P73J208J070P20P37J042J233J447K116L022L455L240K918
54915A27594K892L101L539M402N603O705P416P599O822M646J469j606l870n394
54901A70918o230o173n482m965m963m947m518m086m009l795k844j488o13n73j000
54886A15232j402j462j100n42j08L43J242K342K693K033J414J771K557K805K819
54871A30637L662N250O266O059N469N402N566N062L629J774R6j158k203l559n472
54856A66480p369q211p617o216m862l809k898k073j443j088j056j392j930k261
54842A14255k178j981k122k545k612j832n53K74J03n61q00m29q5j93m08l19j53
$$ y = [106326, 107276, 108133, 108623, 108910, 109011, 108654, 107745, 106675, 105973, 105743, 105590, 105137, 104513, 104201, 104372, 104644, 104621, 104409, 104328, 104378, 104403, 104613, 105386, 106594, 107664, 108384, 109121, 110163, 111396, 112843, 114959, 117981, 121436, 124676, 127594, 130486, 133587, 137126, 141528, 147131, 153836, 161252, 168851, 175673, 180319, 181788, 180182, 176312, 170918, 164688, 158515, 153033, 148068, 143105, 138158, 133640, 129554, 125545, 121750, 118906, 117418, 116805, 116232, 115232, 113830, 112368, 111268, 110726, 110618, 110961, 112203, 114545, 117238, 119271, 120685, 122456, 125013, 127818, 130637, 134299, 139549, 145815, 151874, 157343, 162745, 168311, 173373, 177002, 178776, 178872, 177714, 175511, 171952, 166480, 159111, 150900, 143283, 137067, 132205, 128396, 125498, 123425, 121982, 120894, 119838, 118446, 116516, 114255, 112077, 110096, 107974, 105429, 102817, 100985, 100432, 100706, 100809, 100248, 99448, 99019, 98934, 98741, 98333, 98014, 97861]
54825I7861k65m34k79r9m83j227j383n18O76J266J084O58N05P42J068J013M16
54808A00601k69l72K30J011J406J262O52k75j159j466r56J5P42P09Jo76n31N13
54790A01438J690K235K142J828J424Q94N12N32O07K12m46p15n78o65j089j187
54774A08834n97K39Q63J361J753J754J510J810K868L749L683L326L793M999N947
54759A45892O366O941P865Q209P157N199L565K742J995L67k155m615o195p005
54745A76328p573p819p183n685m142l129k431j815j602j871j903j171l42l79j027
54730A28256j191n80J2L0k03k78k26l5N53J484K281K794L489M632N767O306O204
54713A59295N756N215M807M576M029K484J03k045l322m248n443o528o861o677
$$ y = [97861, 97596, 97162, 96883, 96784, 96301, 95074, 93691, 93173, 93849, 95115, 96199, 96857, 97362, 98104, 99172, 100185, 100601, 100332, 99960, 100190, 101201, 102607, 103869, 104521, 104246, 103087, 101621, 100665, 100680, 101422, 102131, 102132, 101456, 100925, 101438, 103128, 105363, 107505, 109333, 110757, 111651, 112163, 112695, 113302, 113514, 113068, 112353, 111775, 111110, 110021, 108834, 108237, 108476, 109339, 110700, 112453, 114207, 115717, 117527, 120395, 124144, 127827, 131153, 134946, 139945, 145892, 152258, 159199, 167064, 175273, 182430, 187629, 191194, 193936, 195931, 196298, 194143, 189528, 183333, 176328, 168755, 160936, 153753, 148068, 143926, 140797, 138366, 136551, 134949, 133078, 131175, 130004, 129662, 129283, 128256, 127065, 126485, 126497, 126527, 126324, 126046, 125820, 125785, 126338, 127822, 130103, 132897, 136386, 141018, 146785, 153091, 159295, 165051, 170266, 175073, 179649, 183678, 186162, 186265, 184220, 180898, 176650, 171207, 164679, 157818, 151141]
54699A51141o608o431n396l694k491k277k197j405k80K67Q2l66q40j373j656j273
54683A15203n04j42m00o44m59l21p41j277j092k38L48J37l75n26l70l50n67q18
54665A06864j048j276j242o32L79J212J567J638J610J326O80K5j62J37M18K18
54649A11714m38j115j402j230q16m48k99l88n35m15R7O14N58l2l48K26J239J648
54631A08630J097J82l73l84K8P20J335J279K93j090j950j751o39P58J635J430
54615A11200L09q33j090l26Q32J608J604R59J77k72l35k76j69J85P41R96N79j95
54597A15694p34q74p90m12M38J395J625Q10l52r31p32k18K80Q33J456J758J298
54580A20544J42j088j747j749j513j446j500j296n90M12J191J401J247J262J564
$$ y = [151141, 144533, 138102, 132706, 129012, 126521, 124244, 122047, 120642, 120362, 120629, 120711, 120345, 119505, 118132, 116476, 115203, 114699, 114557, 114157, 113513, 113054, 112733, 111992, 110715, 109623, 109385, 109733, 109870, 109495, 108969, 108599, 108249, 107682, 106864, 105816, 104540, 103298, 102666, 103045, 104257, 105824, 107462, 109072, 110398, 111078, 111103, 110941, 111078, 111496, 111714, 111276, 110161, 108759, 107529, 106713, 106265, 105966, 105578, 105043, 104628, 104725, 105339, 105897, 105865, 105517, 105743, 106982, 108630, 109727, 109909, 109536, 109152, 109180, 109900, 111235, 112514, 112807, 111717, 109767, 108016, 107377, 108135, 109770, 111200, 111509, 110676, 109586, 109260, 110092, 111700, 113304, 114263, 114440, 114168, 113833, 113557, 113388, 113573, 114314, 115310, 115889, 115694, 114960, 114086, 113296, 112884, 113322, 114717, 116342, 117152, 116800, 115869, 115137, 114919, 115199, 116032, 117488, 119246, 120544, 120686, 119598, 117851, 116102, 114589, 113143, 111643, 110347, 109757, 110169, 111360, 112761, 114008, 115270, 116834]
54565A16834J504M36j150j904j253k06Ll91j86Q50J550J066K5n23n44o74r66q42
54547A13629j57N69J005J390J885K146J852J247Q12P21Q72J191J527J556J125
54532A31370N58K71J75j79q86j462j432q64j97K11K95J77Nk03n61j071j431j320
54514A23456q85o88j009j471j511j055m58N0N26R20R43M40k70o63n75l53m57q67
54496A16073j019l91Q01J715J825J504J433J647J570R79L37O8p5m61q26n22M61
54479A25119J274J116J25q55j219j038o55j67M78J013R01J12n54k54P81J488J283
54462A28948O80M39O12Q13R33J051R51L68l69n98j89L07M84M99N49M47J4n27q59
54443A34553j013j169j280j148p68l07Q6L06K40j12n53q13p95n98m10l50l00J5
$$ y = [116834, 118338, 118774, 117624, 115720, 114467, 114261, 114264, 113873, 113687, 114537, 116087, 117153, 117178, 116655, 116111, 115437, 114471, 113629, 113472, 114041, 115046, 116436, 118321, 120467, 122319, 123566, 124378, 125099, 125971, 127162, 128689, 130245, 131370, 131928, 132199, 132374, 132195, 131309, 129847, 128415, 127551, 127354, 127565, 127860, 128037, 128042, 127839, 127278, 126207, 124776, 123456, 122571, 121883, 120874, 119403, 117892, 116837, 116379, 116429, 116955, 117875, 118818, 119258, 118988, 118325, 117750, 117397, 116940, 116073, 115054, 114663, 115464, 117179, 119004, 120508, 121941, 123588, 125158, 126137, 126474, 126542, 126467, 126006, 125180, 124658, 125119, 126393, 127509, 127634, 126779, 125560, 124522, 123867, 123700, 124178, 125191, 126092, 126204, 125650, 125396, 126177, 127665, 128948, 129628, 130067, 130679, 131492, 132425, 133476, 134427, 134795, 134426, 133828, 133639, 133946, 134430, 134929, 135478, 135925, 135939, 135412, 134553, 133540, 132371, 131091, 129943, 129175, 128868, 128954, 129260, 129500, 129388, 128835, 128022, 127227, 126629, 126219, 125869, 125569, 125584]
54425A25584N39P00J12o49o24J85Q11Q00Q15J310J589R23m8j55N23Q37L68j05
54407A33515MK86K30l2k37m65o05j63Q99J708J518P12J76J19J54J79M86J092J656
54388A41232K002K195K126J525M61n25r44p50k75M2r5n46q57q19p39q60q03j37
54370A42233P00P51j16q37m26P72J505J030k30j226j242l49P84J411J170K58p25
54353A45463j109o29K96Q77P31K27j09k82o15j053j143p21j91L7J27O31J837L338
54335A47712M250L996K966K209K156K014Q81q14j723j457j146j872l225m005l819
54320A48123l303l003k749k189j443r55q94q81m10M10P48Lj223j599p07M15O77
54303A31020L32L45P96P79j96j407j801j128L3R37J159P77L36M31J058J523J177
$$ y = [125584, 126123, 126823, 126935, 126286, 125662, 125847, 126658, 127458, 128273, 129583, 131172, 132095, 132047, 131892, 132415, 133252, 133620, 133515, 133519, 133805, 134035, 134003, 133766, 133301, 132696, 132533, 133432, 135140, 136658, 137370, 137546, 137665, 137819, 137998, 138484, 139576, 141232, 143234, 145429, 147555, 149080, 149541, 149016, 148072, 147322, 147047, 147089, 146994, 146448, 145591, 144772, 144033, 143173, 142370, 142233, 142933, 143684, 143568, 142731, 142305, 143077, 144582, 145612, 145382, 144156, 142914, 142565, 143349, 144760, 145930, 146188, 145463, 144354, 143725, 144021, 144898, 145629, 145856, 145747, 145465, 144850, 143797, 142654, 141933, 141742, 141779, 141906, 142537, 144374, 147712, 151962, 155958, 158924, 161133, 163289, 165303, 166184, 165370, 163647, 162190, 161044, 159172, 155947, 151942, 148123, 144820, 141817, 139068, 136879, 135436, 134481, 133587, 132706, 132296, 132706, 133454, 133457, 132234, 130635, 129928, 130343, 131020, 131352, 131697, 132493, 133272, 133076, 131669, 129868, 128740, 128773, 129710, 130869, 131646, 131982, 132413, 133471, 134994, 136171]
54286A36171Q2j116j791j687r18J14Q64J032Q49P83R83J114Q24K28k08k50j81
54269A36893l67p33q78o20j66K49O48J027J163Q87L97mk89o01q53q15m97j54J05
54250A35392M06Q02J176J423J509J298O96N2k0N81J076N90q27k179k556j957j076
54233A36386m74j72P3K89L40K79L64O52Q25O40K82N6p0l09o65r99j341j708j823
54214A32625j432q45o06o72m75R5M16R0m71p15p03p16n87mQ30J389J565J678J831
54195A33293J726J149K83m90q79q80q40j184j800j941j155M0P37P95P73R21Q45
54178A31393K67m94r58r61n75j2K84l6o17o64k3M60J3j076j895j902j125J88J586
54159A23853K356K120J360Q91Q07M71m67j444j601p25N18J193Q91N6m91l89oK10
$$ y = [136171, 136253, 135137, 133346, 131659, 130741, 130855, 131719, 132751, 133600, 134383, 135366, 136480, 137304, 137532, 137324, 137074, 136893, 136526, 135793, 134915, 134295, 134129, 134378, 135026, 136053, 137216, 138103, 138500, 138496, 138207, 137606, 136753, 135938, 135441, 135287, 135392, 135798, 136600, 137776, 139199, 140708, 142006, 142702, 142754, 142734, 143315, 144391, 144981, 144154, 141975, 139419, 137462, 136386, 135912, 135740, 135813, 136102, 136442, 136721, 137085, 137737, 138562, 139202, 139484, 139540, 139470, 139161, 138496, 137497, 136156, 134448, 132625, 131193, 130348, 129742, 129070, 128595, 128690, 129106, 129196, 128725, 128010, 127307, 126591, 126004, 126000, 126830, 128219, 129784, 131462, 133293, 135019, 136168, 136451, 135961, 135082, 134202, 133362, 132178, 130378, 128437, 127282, 127322, 128059, 128854, 129627, 130548, 131393, 131660, 131166, 130208, 129247, 128672, 128660, 128944, 128908, 128291, 127627, 127604, 128064, 128077, 127001, 125106, 123204, 122079, 122267, 123853, 126209, 128329, 129689, 130580, 131387, 131858, 131391, 129947, 128346, 127621, 128139, 129332, 130223, 130279, 129788, 129399, 129393, 129603]
54141A29603K83M28N10K64j75l71j72J97M82M73r4j154j878j362J99J597K055
54124A30885J927J761J434P09K1k7L62M39%m11l54j7K31L08L59M96P05Q33O86
54105A40347L29J84N08R66J031P49O50Q94J022O33j01p32j031r98p35m58l72l70
54087A42516j75J56K31m4k13L5L81L96K71M54Q63R68O19K64L02O76J140J578J864
54068A52282J808J429J088J067J190J072O06N1l56o08p24n12K34J275J866J432
54052A63200L74j86M03J518K042J719J314J480J943K062J805J785K493L811N176
54037A90939O063O404O680P437Q573R317R243Q967R450J0699J1755J1898J1237
54024C08662R907P432L512r56m330n767n806n507n460n675n908n839n315m648
$$ y = [129603, 129886, 130314, 130824, 131088, 130913, 130542, 130370, 130567, 131049, 131522, 131428, 130274, 128396, 127034, 127233, 128830, 130885, 132812, 134573, 136007, 136716, 136737, 136710, 137072, 137511, 137511, 137100, 136746, 136729, 136960, 137268, 137627, 138123, 138828, 139661, 140347, 140676, 140860, 141368, 142334, 143365, 144114, 144764, 145658, 146680, 147313, 147212, 146480, 145449, 144451, 143716, 143258, 142886, 142516, 142341, 142497, 142728, 142684, 142471, 142506, 142887, 143283, 143554, 144008, 144871, 145839, 146458, 146722, 147024, 147700, 148840, 150418, 152282, 154090, 155519, 156607, 157674, 158864, 159936, 160542, 160593, 160237, 159629, 158905, 158393, 158627, 159902, 161768, 163200, 163574, 163388, 163791, 165309, 167351, 169070, 170384, 171864, 173807, 175869, 177674, 179459, 181952, 185763, 190939, 197002, 203406, 210086, 217523, 226096, 235413, 244656, 253623, 263073, 273772, 285527, 297425, 308662, 318569, 326001, 329513, 328557, 324227, 318460, 312654, 307147, 301687, 296012, 290104, 284265, 278950, 274302]
54010B74302m420m751n046m751m137l942m410n042n296n157m937m773m495l822
53996B09323k655j332n44q03j858k752k710j861j045r10j305j577j416j203j443
53981A85909j998k152j512n38j4j83o46r57j016r69r84j103j118p06R1O83N81
53964A73368J29J20P40J362J475J268J142J137J156J307J667J938J800J378J046
53949A91033Q96P55O24P15J110J604J929J952J726J466J493J995K857L683M006
53934B17844L556K590J877K051K872L568L880M290N048N586N363M764M607N091
53920B72987N800O385O671O322N243M212M334N717P278Q001P870P440P010O500
53906C61770N692M425K823J415O95M84J48n06j037j141j147j468j992k335k375
$$ y = [274302, 269882, 265131, 260085, 255334, 251197, 247255, 242845, 237803, 232507, 227350, 222413, 217640, 213145, 209323, 206668, 205336, 204792, 203989, 202131, 199379, 196669, 194808, 193763, 192853, 191548, 189971, 188555, 187352, 185909, 183911, 181759, 180247, 179709, 179695, 179512, 178866, 177909, 176893, 175924, 174940, 173837, 172719, 172013, 172104, 172787, 173368, 173497, 173617, 174357, 175719, 177194, 178462, 179604, 180741, 181897, 183204, 184871, 186809, 188609, 189987, 191033, 191929, 192684, 193308, 194023, 195133, 196737, 198666, 200618, 202344, 203810, 205303, 207298, 210155, 213838, 217844, 221400, 223990, 225867, 227918, 230790, 234358, 238238, 242528, 247576, 253162, 258525, 263289, 267896, 272987, 278787, 285172, 291843, 298165, 303408, 307620, 311954, 317671, 324949, 332950, 340820, 348260, 355270, 361770, 367462, 371887, 374710, 376125, 376820, 377304, 377452, 376946, 375909, 374768, 373621, 372153, 370161, 367826, 365451]
53891C65451k277k231k358k633k830k790k754l047l439l407k938k411j620K03
53877C30919K949N201N865N406M634K985p10o029j0839j3507j4209j3875j2883
53864B85907j1326r734q711q129p350o053m536l299k686k765l236l523l205k386
53850B08968j542j092j134j472j730j627j263j012j016j007p51m54m59p11q22
53835A92876o89o46j000j565j836j503p01J30N81N71L19P1j92o15j081j144n33
53818A83043M47J188J361J095O76L26K24M60Q72J247J673K394L243L641L421L229
53802B08540L703M533M872M545M279M679N456N813N249L918K500J832K273L363
53788B65555M212M357L948L240K295J184N8j038k023k506k221j775k157l376m295
$$ y = [365451, 363174, 360943, 358585, 355952, 353122, 350332, 347578, 344531, 341092, 337685, 334747, 332336, 330716, 330919, 333868, 339069, 344934, 350340, 354974, 357959, 357249, 351220, 340381, 326874, 312665, 298790, 285907, 274581, 264847, 256136, 248007, 240657, 234604, 230068, 226769, 224083, 221318, 218082, 214559, 211354, 208968, 207426, 206334, 205200, 203728, 201998, 200371, 199108, 198096, 197080, 196073, 195322, 194868, 194409, 193698, 192876, 192187, 191541, 190541, 188976, 187140, 185637, 184936, 185066, 185647, 186218, 186537, 186608, 186416, 185801, 184720, 183576, 183043, 183490, 184678, 186039, 187134, 187810, 188136, 188360, 188820, 189692, 190939, 192612, 195006, 198249, 201890, 205311, 208540, 212243, 216776, 221648, 226193, 230472, 235151, 240607, 246420, 251669, 255587, 258087, 259919, 262192, 265555, 269767, 274124, 278072, 281312, 283607, 284791, 284849, 283811, 281788, 279282, 277061, 275286, 273129, 269753, 265458]
53773B65458m210l804l939m317m123l471l162l366l518l426l513l824l724k958
53759B14103k234k317k942l126k368j180m71o10j148j418j291j154j114q07k28
53744A91695j18q72j609j201O3Q14N56J86L96O58L03l16m79j82J45M62R01J175
53726A92577R63O57R12J571J769J188N14M95J039J489J459J121Q29P48P79Q28
53710B08938J026J564K281K708K644K429K410K438K184J732J425J268R97O63P46
53695B35453J500K547L280L480L451L637M099M269L416J580j59p48l49J2j59m01
53679B64908l19k63n98r45p91m67p75j775k621k664k131j527r41k66L00M33J79
53662B49737j40l49n06o15n95m85m15l83l28m56j082k060k627k126o83Q95J785
$$ y = [265458, 261248, 257444, 253505, 249188, 245065, 241594, 238432, 235066, 231548, 228122, 224609, 220785, 217061, 214103, 211869, 209552, 206610, 203484, 201116, 199936, 199465, 198855, 197707, 196289, 194998, 193844, 192730, 191923, 191695, 191577, 190705, 189096, 187895, 187958, 188772, 189328, 189514, 189910, 190568, 190871, 190555, 190076, 189894, 190039, 190501, 191402, 192577, 193540, 194197, 195109, 196680, 198449, 199637, 200151, 200646, 201685, 203174, 204633, 205754, 206583, 207331, 208110, 208938, 209964, 211528, 213809, 216517, 219161, 221590, 224000, 226438, 228622, 230354, 231779, 233047, 234044, 234707, 235453, 236953, 239500, 242780, 246260, 249711, 253348, 257447, 261716, 265132, 266712, 266553, 265805, 265456, 265468, 265309, 264908, 264589, 264326, 263728, 262783, 261992, 261525, 260750, 258975, 256354, 253690, 251559, 250032, 249091, 248825, 249125, 249558, 249737, 249597, 249248, 248742, 248127, 247532, 247047, 246632, 246249, 245921, 245465, 244383, 242323, 239696, 237570, 236887, 237782, 239567]
53645B39567J642P42k01n17j57L10M60N10Q66J419J644J342Q72O58Q03J164J532
53628B52656J669J505J339J620K418L293L761L729L405L077K956L084L310L443
53614B91265L497L547L504L272L053L156L479L612L467L377L496L491L099K549
53600C37864K167J848J284M76k79p34q16n85k60j24k28l87n49r05j436j778j745
53583C33813j619j617j422o92K88Q87Q44L12n69j558k115j912j474j611k214k335
53567C17006j533n03j27m69j016j409j512j203n24J09K46j36o41p77j33J313K829
53550C11520L246K174P30M93J759L300L923L738L663M088M561M667M688N203O270
53535C64023P217P313O575N835O025P295Q903J0047J0711J1487J2626J3602J3817
$$ y = [239567, 241209, 241951, 241750, 241233, 241076, 241386, 241846, 242356, 243222, 244641, 246285, 247627, 248499, 249157, 249960, 251124, 252656, 254325, 255830, 257169, 258789, 261207, 264500, 268261, 271990, 275395, 278472, 281428, 284512, 287822, 291265, 294762, 298309, 301813, 305085, 308138, 311294, 314773, 318385, 321852, 325229, 328725, 332216, 335315, 337864, 340031, 341879, 343163, 343639, 343360, 342626, 341810, 341225, 340965, 340841, 340613, 340226, 339677, 338772, 337336, 335558, 333813, 332194, 330577, 329155, 328463, 328751, 329638, 330482, 330794, 330225, 328667, 326552, 324640, 323166, 321555, 319341, 317006, 315473, 314970, 314843, 314374, 313358, 311949, 310437, 309234, 308710, 308819, 309065, 308929, 308288, 307511, 307378, 308691, 311520, 314766, 316940, 317670, 318163, 319922, 323222, 327145, 330883, 334546, 338634, 343195, 347862, 352550, 357753, 364023, 371240, 378553, 385128, 390963, 396988, 404283, 413186, 423233, 433944, 445431, 458057, 471659, 485476]
53522D85476J3390J2946J2899J3313J4292J5902J7714J9041J9788K0604K1886
53511F67251K3174K3903K4267K4819K5539K5850K5508K4854K4273K3807K3382
53500I36627K2998K2624K2151K1539K0823K0018J9219J8654J8414J8284J8096
53489A159447J8087J8444J8824J8682J7962J6990J5933J4928J4472J4862J5317
53478A343948J4613J2694J0737R360P734N052J913n99k504m664p334r936j2097
53465A368917j4015j5794j7175j8026j8489j8605j8321j7993j8217j9102k0166
53454A173014k1137k2190k3193k3370k2220k0368j8992j8549j8523j8260j7597
53443I48615j6640j5380j3746j1815r788p795n852m022k532j655j425j499j345
$$ y = [485476, 498866, 511812, 524711, 538024, 552316, 568218, 585932, 604973, 624761, 645365, 667251, 690425, 714328, 738595, 763414, 788953, 814803, 840311, 865165, 889438, 913245, 936627, 959625, 982249, 1004400, 1025939, 1046762, 1066780, 1085999, 1104653, 1123067, 1141351, 1159447, 1177534, 1195978, 1214802, 1233484, 1251446, 1268436, 1284369, 1299297, 1313769, 1328631, 1343948, 1358561, 1371255, 1381992, 1391352, 1399086, 1404138, 1406051, 1405452, 1402948, 1398284, 1390950, 1381014, 1368917, 1354902, 1339108, 1321933, 1303907, 1285418, 1266813, 1248492, 1230499, 1212282, 1193180, 1173014, 1151877, 1129687, 1106494, 1083124, 1060904, 1040536, 1021544, 1002995, 984472, 966212, 948615, 931975, 916595, 902849, 891034, 881246, 873451, 867599, 863577, 861045, 859390, 857965, 856466, 855121]
53430H55121n73R37L076N566P995J0000J1497J2638J3558J4347J5252J6707J8829
53417I84950K1037K2447K2838K3009K4036K6145K8559L0379L1487L2474L4002
53406A281363L6348L9353M2447M4847M6131M6746M7610M9167N1071N2846N4400
53395A792329N5679N6274N5878N4946N4340N4366N4511N4235N3513N2482N0865
53384B389418M8207M4612M0955L8097L5874L3099K8814K3481J8556J4743J1085
53373B726941O177j6o117j1034j5178j9857k5866l2870l9844m5840n0460n3886
53361B432150n6470n8297n9232n9272n8676n7672n6322n4693n2965n1268m9643
53350A817640m8233m7194m6324m5076m3272m1552m0779m0972m1119m0109l7801
$$ y = [855121, 854548, 855485, 858561, 864127, 872122, 882122, 893619, 906257, 919815, 934162, 949414, 966121, 984950, 1005987, 1028434, 1051272, 1074281, 1098317, 1124462, 1153021, 1183400, 1214887, 1247361, 1281363, 1317711, 1357064, 1399511, 1444358, 1490489, 1537235, 1584845, 1634012, 1685083, 1737929, 1792329, 1848008, 1904282, 1960160, 2015106, 2069446, 2123812, 2178323, 2232558, 2286071, 2338553, 2389418, 2437625, 2482237, 2523192, 2561289, 2597163, 2630262, 2659076, 2682557, 2701113, 2715856, 2726941, 2733118, 2733102, 2726985, 2715951, 2700773, 2680916, 2655050, 2622180, 2582336, 2536496, 2486036, 2432150, 2375680, 2317383, 2258151, 2198879, 2140203, 2082531, 2026209, 1971516, 1918551, 1867283, 1817640, 1769407, 1722213, 1675889, 1630813, 1587541, 1545989, 1505210, 1464238, 1423119, 1383010, 1345209]
53339A345209l5082l2901l1268k9298k6342k2874k0035j8358j7374j6434j5432
53328A079811j4534j3677j2853j2467j2838j3393j2987j1163q706o717n485m572
53316I50419l709l099k797k226p13J589L755N179O294P876R900J1570J2481J3175
53302A009694J4399J6233J8232K0057K1637K2984K4170K5335K6421K7175K7629
53291A253966K8314K9480L0401K9950K7828K4856K2076J9997J8532J7169J5254
53280A517823J2565R660P202M977K153j516n341q699j1687j4574j7168j9175k0691
53267A455529k1973k3132k4329k5833k7470k8517k8621k8370k8481k8822k8886
53256A161095k8848k9321l0219l0668l0157k9094k8100k7284k6404k5365k4322
$$ y = [1345209, 1310127, 1277226, 1245958, 1216660, 1190318, 1167444, 1147409, 1129051, 1111677, 1095243, 1079811, 1065277, 1051600, 1038747, 1026280, 1013442, 1000049, 987062, 975899, 967193, 960476, 954991, 950419, 946710, 943611, 940814, 938588, 937875, 939464, 943219, 948398, 954692, 962568, 972468, 984038, 996519, 1009694, 1024093, 1040326, 1058558, 1078615, 1100252, 1123236, 1147406, 1172741, 1199162, 1226337, 1253966, 1282280, 1311760, 1342161, 1372111, 1399939, 1424795, 1446871, 1466868, 1485400, 1502569, 1517823, 1530388, 1540048, 1547250, 1552227, 1554380, 1552864, 1547523, 1538824, 1527137, 1512563, 1495395, 1476220, 1455529, 1433556, 1410424, 1386095, 1360262, 1332792, 1304275, 1275654, 1247284, 1218803, 1189981, 1161095, 1132247, 1102926, 1072707, 1042039, 1011882, 982788, 954688, 927404, 901000, 875635, 851313]
53245H51313k3603k3555k4146k4690k4356k3000k1197j9471j7978j6852j6242
53234F16223j5853j4985j3352j1433r811q601p724p306p386p665p896q281r037
53221D86893r878j0294j0191r914r784r906j0199j0338r913q947q068p727p605
53208C64129p149o447o019n980o034o165o598p075o854n725m394l601l402l543
53194B85143l995m600m751m025k883k108j760j328q48j054k198l424l724l174
53180B45271k673k742l050l058k624j936j256q39q33j068j197j134j126j257j200
53165B19278p23j09K38L79O47J002J063O86R5n64j342k087k384k083j471q07n8
53148B11760O94J031P13N6m69p02o57l42o2m00j416k202j858n86O97J537K041
$$ y = [851313, 827710, 804155, 780009, 755319, 730963, 707963, 686766, 667295, 649317, 632465, 616223, 600370, 585385, 572033, 560600, 550789, 542188, 534464, 527158, 519772, 512107, 504211, 495930, 486893, 477015, 466721, 456530, 446616, 436832, 426926, 416727, 406389, 396476, 387529, 379461, 371734, 364129, 356980, 350533, 344514, 338534, 332500, 326335, 319737, 312662, 305808, 300083, 295689, 292088, 288686, 285143, 281148, 276548, 271797, 267772, 264889, 262781, 261021, 259693, 258845, 257791, 255593, 252169, 248445, 245271, 242598, 239856, 236806, 233748, 231124, 229188, 227932, 227093, 226260, 225192, 223995, 222861, 221735, 220478, 219278, 218555, 218446, 218684, 219063, 219710, 220712, 221775, 222461, 222556, 221992, 220650, 218563, 216179, 214096, 212625, 211818, 211760, 212454, 213485, 214198, 214254, 213785, 213083, 212426, 212084, 212022, 211622, 210206, 208004, 206146, 205560, 206257, 207794, 209835]
53131B09835K101J426L62k32j03O6k87q69j135r86n47J55Q92J165Q97P59J217
53114B14716J725J349kj517k381k342j640q22m19l85n9Q13J432Q99m23j271j130
53097B08543p29q30j276j551j592j584j457j054n62l59n58r28j118q44q9P67J302
53080A96081J587K029K519K260Q68q30j617j244m96q2j8j8Q8L36N78M25l65j396
53062B00705j977j963j786j643j240n14Pp5m26n09k92K2M97J215J817J919J687
53045A97444J438Q82m94k336l494l319k311j338p87o24o82o11r5N51N65k00r04
53028A83685q40l32n6j1J50K30k09r25j172p55j83J68L39L08m0l04K12J407K216
53009A83888J921J028M94N43P34P64O96O38O16O21N02J3p82j412j573j461j297
$$ y = [209835, 211936, 213362, 213724, 213492, 213389, 213455, 213168, 212299, 211164, 210178, 209631, 209786, 210678, 211843, 212740, 213499, 214716, 216441, 217790, 217788, 216271, 213890, 211548, 209908, 209086, 208667, 208282, 208223, 209036, 210468, 211367, 210944, 209673, 208543, 207814, 206984, 205708, 204157, 202565, 200981, 199524, 198470, 197908, 197549, 196991, 196063, 194945, 194101, 194012, 194779, 196081, 197668, 199697, 202216, 204476, 205344, 204514, 202897, 201653, 201157, 201075, 201057, 201039, 201127, 201463, 202041, 202466, 202101, 200705, 198728, 196765, 194979, 193336, 192096, 191582, 191589, 191514, 191088, 190579, 190287, 190309, 190806, 192021, 193838, 195757, 197444, 198882, 199764, 199270, 196934, 193440, 190121, 187810, 186472, 185685, 185061, 184379, 183768, 183673, 184224, 184789, 184589, 183685, 182845, 182513, 182457, 182446, 182596, 182826, 182617, 181692, 180520, 179765, 179582, 179750, 180089, 180397, 180357, 180053, 180265, 181672, 183888, 185809, 186837, 187331, 187874, 188608, 189372, 190068, 190706, 191322, 191943, 192445, 192458, 191676, 190264, 188691, 187230, 185933]
52992A85933r40l52Qk60p34o47N9P13Q76P85Q08R89J248J446J297N67l86q37o04
52973A89969k69k35p6O82J610J849J355R41J093J400J337J030Q40O97M20L34Q73
52956B03850J647J631M09j234k316k625k485k063j448r99r77j068q34m55l88n14
52940A90131l26R2R6m33q19o78m42n05m95L5P72J061P26M0p30j314j378r35m59
52921A84439k16M2L69K18o28j347j063q9O51R91J333J505R14k36r74r07n97n40
52903A83865o30p84j098j299r45l55l34p77o42L22J028P84L72O26J051Q48M36
52886A82468O98J447J800J599J283Q10p6p69m03N85Q12j8p10m75J6K2pO40J634
52867A91356K125K023J938K140K310K160J695R81J06o57j039j028q02m89k65l76
$$ y = [185933, 184993, 184641, 184649, 184389, 183655, 183008, 183067, 183780, 184656, 185441, 186249, 187238, 188486, 189932, 191229, 191796, 191410, 190573, 189969, 189700, 189465, 189389, 190071, 191681, 193530, 194885, 195826, 196919, 198319, 199656, 200686, 201526, 202223, 202643, 202977, 203850, 205497, 207128, 207537, 206303, 203987, 201362, 198877, 196814, 195366, 194367, 193390, 192322, 191488, 191033, 190645, 190131, 189805, 189897, 189993, 189560, 188741, 188063, 187621, 187116, 186621, 186656, 187428, 188489, 189215, 189255, 188525, 187211, 185833, 184898, 184439, 184223, 184265, 184634, 184852, 184224, 182877, 181814, 181725, 182376, 183367, 184700, 186205, 187119, 186883, 185909, 185002, 184405, 183865, 183235, 182451, 181353, 180054, 179109, 178754, 178420, 177643, 177001, 177323, 178351, 179135, 179507, 180133, 181184, 182032, 182468, 183166, 184613, 186413, 188012, 189295, 190105, 190029, 189260, 188857, 189442, 190254, 190236, 189526, 189051, 189067, 189089, 189082, 189722, 191356, 193481, 195504, 197442, 199582, 201892, 204052, 205747, 206728, 206834, 206177, 205138, 204110, 203308, 202819, 202554, 202178]
52851B02178q64j362j461j080m09J99K23o99k129l029k992k820l337m058l811
52836A74549k385p98P4K97K73J07j33j44J86N02M96L89N97J155J683J720J025
52819A79593k03j242j400q09k73j90j31K99P51P89O93R70J496J815K016K480L012
52802A89666K955K185J156L6j387k845l602l563l518l784l548k199n37J68j93
52787A70990p17q80q51p43l83R4L19L13M55P34P74O20P59J173J169M38l84n67
52769A73313j81K59M87M41N5m41m19L19J010P67k04q51o23J4L87L94L05J72j93
52750A75011q09j295j166m11L34M26N4J06R99K064K396J938J301P91K59k53l31
52733A81414K06J088J965K602K662J897P48J88O16J288J241L82o62j415j795j773
$$ y = [202178, 201314, 199952, 198491, 197411, 197002, 197201, 197424, 196725, 194596, 191567, 188575, 185755, 182418, 178360, 174549, 172164, 171366, 171440, 171737, 172010, 172117, 171984, 171840, 172026, 172528, 173024, 173413, 174010, 175165, 176848, 178568, 179593, 179390, 178148, 176748, 175939, 175666, 175476, 175345, 175644, 176395, 177184, 177877, 178847, 180343, 182158, 184174, 186654, 189666, 192621, 194806, 195962, 195998, 194611, 191766, 188164, 184601, 181083, 177299, 173751, 171552, 171015, 171183, 170990, 170273, 169393, 168542, 167799, 167416, 167510, 167829, 168142, 168597, 169331, 170105, 170725, 171484, 172657, 173826, 174264, 173880, 173313, 173132, 173391, 173878, 174319, 174374, 173933, 173514, 173833, 174843, 175610, 175406, 174555, 173932, 173946, 174333, 174727, 175032, 175204, 175011, 174202, 172907, 171741, 171330, 171664, 172090, 172144, 172250, 173249, 175313, 177709, 179647, 180948, 181739, 181998, 181745, 181414, 181620, 182708, 184673, 187275, 189937, 191834, 192582, 192770, 193386, 194674, 195915, 196297, 195635, 194220, 192425, 190652]
52717A90652j367q91o83o14l34N0M1l99p09o32o60j182j604j035L54J351J162
52700A83500K74l46m06k99l42n11p46j004j027n12L88J086J196Q66L99p8l53K0
52682A82105J135K295K632K077J269N81j52r14j198p75k36k13m70l67O9K18n4
52665A88002k17l1O6j89l40K8O22J096J727K677L146K244N37l47K40J357K017
52648B02635K258K234J443l33k139k916k922l048l202k474p92P54J319J099O00
52633A94516km72l65K81P29M84m5j66K90J073J862K232J775O99j52k64l6r5m49
52614B01895p80j041j301j383j114o59j72M78J208J465R76K81m2j74m02k39Q37
52597A99833K120K281J193R9j31P3J9k04j99j5R2J31K00K31K49M59Q53J067R49
$$ y = [190652, 189285, 188394, 187711, 187097, 186763, 186813, 186854, 186455, 185746, 185114, 184454, 183272, 181668, 180633, 180987, 182338, 183500, 183774, 183428, 183022, 182723, 182381, 181870, 181124, 180120, 179093, 178581, 178969, 180055, 181251, 182117, 182516, 182438, 182085, 182105, 183240, 185535, 188167, 190244, 191513, 192094, 191942, 191028, 189830, 189055, 188819, 188606, 188136, 187769, 187838, 188056, 188002, 187785, 187754, 187820, 187631, 187291, 187319, 187941, 189037, 190764, 193441, 196587, 198831, 199368, 199021, 199261, 200618, 202635, 204893, 207127, 208570, 208237, 206098, 203182, 200260, 197212, 194010, 191536, 190744, 191498, 192817, 193916, 194516, 194514, 194042, 193677, 193958, 194687, 195171, 195126, 194960, 195250, 196323, 198185, 200417, 202192, 202891, 202739, 202475, 202439, 202344, 201895, 201115, 200074, 198773, 197390, 196276, 195617, 195445, 195923, 197131, 198596, 199572, 199853, 199811, 199637, 199235, 198996, 199833, 201953, 204234, 205427, 205526, 205395, 205468, 205487, 205283, 205084, 205069, 205161, 205292, 205492, 205723, 205972, 206431, 207284, 208351, 209300]
52578B09300P78P42O29L34K09M74P17M02l30q42p97m64l38o48j165j371r96m15
52560B06219k54n83q93q47o20l81l9L03K70j43l84j56J52K52M80J012J225O19
52542B06232j99l17J03K00j23k14J5j35q59j338r65j90K44K95L56N56P95J052
52524B05508J209R71L77N6M65J177J329O45l74j117j330j050m57J64N81Q32J114
52507B10100J546K089K615K963L005K760K336J754R92J76n09j172k084l093l621
52492B19857l366k661j874r94j12J94m28j334j514q16P0O98J205J622J639J311
52476B13497J270J797K259J911R18O2k64l06l48l66k48%L89R58J533J746J465
52459B26273J096J292K213L159L071J600m50j866k180j887j619j539j564j688
$$ y = [209300, 210078, 210820, 211449, 211783, 211992, 212466, 213183, 213585, 213255, 212413, 211616, 211152, 210814, 210166, 209001, 207630, 206634, 206219, 205965, 205382, 204489, 203642, 203022, 202641, 202602, 202905, 203175, 203032, 202648, 202492, 202644, 202896, 203376, 204388, 205613, 206232, 206033, 205716, 205819, 206019, 205896, 205682, 205697, 205562, 204703, 203365, 202400, 202210, 202454, 202749, 203105, 203661, 204456, 205508, 206717, 207688, 208065, 208121, 208586, 209763, 211092, 211737, 211363, 210246, 208916, 207866, 207409, 207573, 208154, 208986, 210100, 211646, 213735, 216350, 219313, 222318, 225078, 227414, 229168, 230160, 230336, 229827, 228655, 226571, 223478, 219857, 216491, 213830, 211956, 210962, 210850, 211044, 210616, 209282, 207768, 206952, 207022, 207720, 208925, 210547, 212186, 213497, 214767, 216564, 218823, 220734, 221652, 221714, 221450, 221144, 220796, 220430, 220182, 220182, 220571, 221529, 223062, 224808, 226273, 227369, 228661, 230874, 234033, 237104, 238704, 238254, 236388, 234208, 232321, 230702, 229163, 227599, 225911]
52445B25911j865j858j592j356j361j303q07r0K38K6k26p2M04Q33R54O12j97j081
52427B17170j381q51o5J51l65r65r63l04N71J247J568J443Q47J23l0P20J831K471
52409B23218K611K995L988N100N943O887Q211R206Q936P527N767L730Q01k817
52395B92103n795p108p026o321n382m484m046l976l472k216j060q26r95n49M13
52380B39260Q86N84K05K31L77M35P06J325J949K402K974L717M095L760L203L138
52364B69247L504L566K839J628O24J88Qm80j319j950j988j752j533q94O20K298
52348B74606K825K062J268J271J498J254J020J625K858L831M255M504M708M745
52334C12330M907N715P013P957Q060P722P630Q143R264J0736J2072J2949J3590
$$ y = [225911, 224046, 222188, 220596, 219240, 217879, 216576, 215769, 215679, 215917, 215943, 215717, 215645, 216049, 216882, 217836, 218448, 218251, 217170, 215789, 214938, 214873, 215024, 214659, 213694, 212731, 212427, 212998, 214245, 215813, 217256, 218103, 218226, 218196, 218916, 220747, 223218, 225829, 228824, 232812, 237912, 243855, 250742, 258953, 268159, 277095, 284622, 290389, 294119, 294920, 292103, 286308, 279200, 272174, 265853, 260471, 255987, 251941, 247965, 244493, 242277, 241217, 240391, 239396, 238847, 239260, 240146, 240730, 240935, 241166, 241543, 241978, 242684, 244009, 245958, 248360, 251334, 255051, 259146, 262906, 266109, 269247, 272751, 276317, 279156, 280784, 281408, 281596, 281604, 281124, 279805, 277855, 275867, 274115, 272582, 271688, 272308, 274606, 277431, 279493, 280761, 282032, 283530, 284784, 285804, 287429, 290287, 294118, 298373, 302877, 307585, 312330, 317237, 322952, 329965, 337922, 345982, 353704, 361334, 369477, 378741, 389477, 401549, 414498, 428088]
52321D28088J4382J5204J5615J5623J5679J5841J5616J4794J3817J3073J2373
52310E90105J1504J0719J0285R913R185Q292P757P639P446O822N902M971M137
52297F94677L411K840K480K324K245J897Q96o90k185l001l447m304n659o595o360
52282F78529n327m368l602k435o92R71K038K873M073N474O430O867P436Q545R779
52267G16591J0546J0828J0954J1004J0843J0517J0152R579Q556P351O637O630
52255H30188O756O464N982N940O385O663O259N383M530L747K662J134m73j793
52241H89827k896m002m928n223m829m268l994l888l601l176l019l339l918m297
52227H34449m063l007j350K29J086J204J114J245J581J872J951J813J649J892
$$ y = [428088, 442470, 457674, 473289, 488912, 504591, 520432, 536048, 550842, 564659, 577732, 590105, 601609, 612328, 622613, 632526, 641711, 650003, 657760, 665399, 672845, 679667, 685569, 690540, 694677, 698088, 700928, 703408, 705732, 707977, 709874, 710770, 710080, 707895, 704894, 701447, 697143, 691484, 684889, 678529, 673202, 668834, 665232, 662797, 662105, 663076, 665114, 667987, 672060, 677534, 683964, 690831, 698267, 706812, 716591, 727137, 737965, 748919, 759923, 770766, 781283, 791435, 801014, 809570, 816921, 823558, 830188, 836944, 843408, 849390, 855330, 861715, 868378, 874637, 880020, 884550, 888297, 890959, 892093, 891620, 889827, 886931, 882929, 878001, 872778, 867949, 863681, 859687, 855799, 852198, 849022, 846003, 842664, 838746, 834449, 830386, 827379, 826029, 826258, 827344, 828548, 829662, 830907, 832488, 834360, 836311, 838124, 839773, 841665]
52213H41665K847M217N285N740N971O361O712O652O289N977N727N346N001N081
52199I18871N433N329M405L186K429K292K395K391K132J598J047R87J562K087
52185I56144J741O49j67o1M83N01m14j900l300m146m460m779n610o742p406p229
52169I13304o567n715m489l069k452l158l912k866j41K018J954N07l35J74J247
52154H86500J996K221K047J559Q95K12m54j004j131p42k83k24l94l52j59k01l69
52137H90117j38N30J017R90R19J371K239L023L560M175N316P204R667J2173J4256
52122I56419J6013J7890J9929K1600K2562K3134K3749K4267K4244K3564K2404
52111A195775K0756J8452J5680J3041J0938R109O915M019P58k136m169n462o407
$$ y = [841665, 844512, 848729, 854014, 859754, 865725, 872086, 878798, 885450, 891739, 897716, 903443, 908789, 913790, 918871, 924304, 929633, 934038, 937224, 939653, 941945, 944340, 946731, 948863, 950461, 951508, 952495, 954057, 956144, 957885, 958534, 958367, 958306, 958789, 959290, 958876, 956976, 953676, 949530, 945070, 940291, 934681, 927939, 920533, 913304, 906737, 901022, 896533, 893464, 891012, 887854, 883942, 881076, 880935, 882953, 884907, 885414, 885079, 885253, 886500, 888496, 890717, 892764, 894323, 895218, 895430, 894976, 893972, 892841, 892099, 891816, 891592, 891198, 890846, 890687, 890486, 890117, 889979, 890509, 891526, 892516, 893435, 894806, 897045, 900068, 903628, 907803, 913119, 920323, 929990, 942163, 956419, 972432, 990322, 1010251, 1031851, 1054413, 1077547, 1101296, 1125563, 1149807, 1173371, 1195775, 1216531, 1234983, 1250663, 1263704, 1274642, 1283751, 1290666, 1294685, 1295443, 1293307, 1289138, 1283676, 1277269]
52098A277269p065p094o353n316m704m815n367n802n638m759l682l381m466o514
52084A202313q368r171q926q119p025n532l582j567o4Q47J805L369N154O213O358
52069A173705O538P639R375J0794J1438J1452J0880R657Q204P210O710N999M632
52056A284233K859R22j325l658n180n425n224n669o560o882o572o800q316j0465
52042A215938j2191j3284j4104j4742j5039j5049j4852j4223j3038j1759j0863
52031A066794r994q422o316m801m519m716m227k947j907k016l107m245m769m895
52017I99913n324o343p511q316q805r252r516r327q983r179j0063j1149j2154
52004H83991j3271j4412j5096j5407j6186j7632j8577j8015j6745j6348j6994
$$ y = [1277269, 1270204, 1263110, 1256757, 1251441, 1246737, 1241922, 1236555, 1230753, 1225115, 1220356, 1216674, 1213293, 1208827, 1202313, 1193945, 1184774, 1175848, 1167729, 1160704, 1155172, 1151590, 1150023, 1149959, 1150806, 1152611, 1155980, 1161134, 1167347, 1173705, 1180243, 1187882, 1197257, 1208051, 1219489, 1230941, 1241821, 1251478, 1259682, 1266892, 1273602, 1279601, 1284233, 1287092, 1288014, 1286689, 1283031, 1277851, 1272426, 1267202, 1261533, 1254973, 1248091, 1241519, 1234719, 1226403, 1215938, 1203747, 1190463, 1176359, 1161617, 1146578, 1131529, 1116677, 1102454, 1089416, 1077657, 1066794, 1056800, 1048378, 1042062, 1037261, 1032742, 1028026, 1023799, 1020852, 1018945, 1016929, 1013822, 1009577, 1004808, 999913, 994589, 988246, 980735, 972419, 963614, 954362, 944846, 935519, 926536, 917357, 907294, 896145, 883991, 870720, 856308, 841212, 825805, 809619, 791987, 773410, 755395, 738650, 722302, 705308]
51993G05308j7454j7068j6395j5752j4439j2043r457p887p411p322p217p046o473
51980E59344n205l855l658n083p238q830r356r160q709q193p666p230o888o391
$$ y = [705308, 687854, 670786, 654391, 638639, 624200, 612157, 602700, 594813, 587402, 580080, 572863, 565817, 559344, 554139, 550284, 546626, 541543, 534305, 525475, 516119, 506959, 498250, 490057, 482391, 475161, 468273, 461882]
$$ [...]
##END NTUPLES=NMR SPECTRUM
##END=
