
##TITLE=UV1215_M5_1296-1170_10_7229370_8bzgtBLeyR
##JCAMPDX= 6.0         $$ Bruker NMR JCAMP-DX V2.0
##DATA TYPE= NMR SPECTRUM
##DATA CLASS= NTUPLES
##ORIGIN= BRUKER
##OWNER= Administrator
$$ 1.72 TOPSPIN		Version 2.1
$$ 2013-01-23 19:39:22.434 -0500  Administrator@X
$$ Compression mode = diff/dup
##.OBSERVE FREQUENCY= 400.02188249412
##.OBSERVE NUCLEUS= ^1H
##.ACQUISITION MODE= SIMULTANEOUS (DQD)
##.ACQUISITION SCHEME= undefined
##.AVERAGES= 8
##.DIGITISER RES= 22
##SPECTROMETER/DATA SYSTEM= spect
##.PULSE SEQUENCE= zg30
##.SOLVENT NAME= COFFEE_meoh
##.SHIFT REFERENCE= INTERNAL, COFFEE_meoh, 1, 14.98509
##AUDIT TRAIL= $$ (NUMBER, WHEN, WHO, WHERE, PROCESS, VERSION, WHAT)
$$ ##TITLE= Audit trail, TOPSPIN		Version 2.1
$$ ##JCAMPDX= 5.01
$$ ##ORIGIN= Bruker BioSpin GmbH
$$ ##OWNER= Administrator
$$ $$ E:\/data/COFFEE/nmr/UV1215_M5_1296-1170_10_7229370_8bzgtBLeyR/30/pdata/1/auditp.txt
$$ ##AUDIT TRAIL=  $$ (NUMBER, WHEN, WHO, WHERE, PROCESS, VERSION, WHAT)
(   1,<2013-01-23 19:39:14.419 -0500>,<Administrator>,<X>,<go>,<TOPSPIN 2.1>,
      <created by zg
	started at 2013-01-23 19:38:07.513 -0500,
	POWCHK enabled, PULCHK disabled,
       configuration hash MD5:
       86 BA 57 50 F2 9D 5C 9B 26 00 A9 28 5F 66 2E 89
       data hash MD5: 64K
       4E 9A 77 73 90 B6 43 7D DC 16 8D A3 B0 90 76 63>)
(   2,<2013-01-23 19:39:17.497 -0500>,<Administrator>,<X>,<proc1d>,<TOPSPIN 2.1>,
      <Start of raw data processing
       efp LB = 0 FT_mod = 6 PKNL = 1 PHC0 = 0 PHC1 = 0 SI = 32K 
       data hash MD5: 32K
       FB FE A0 02 F2 7C A0 D1 A7 31 69 A3 59 6F 99 68>)
(   3,<2013-01-23 19:39:17.966 -0500>,<Administrator>,<X>,<proc1d>,<TOPSPIN 2.1>,
      <pk PHC0 = 97.77283 PHC1 = 0 
       data hash MD5: 32K
       E3 66 FF FB 06 D3 FF C9 34 2E A6 E2 DA FA 6F C7>)
(   4,<2013-01-23 19:39:18.200 -0500>,<Administrator>,<X>,<proc1d>,<TOPSPIN 2.1>,
      <abs ABSG = 1 
       data hash MD5: 32K
       0C D0 7D 13 1E 47 7A BB E1 10 52 46 86 8A 17 F5>)
(   5,<2013-01-23 19:39:18.341 -0500>,<Administrator>,<X>,<proc1d>,<TOPSPIN 2.1>,
      <abs ABSG = 2 
       data hash MD5: 32K
       A5 74 BA 28 9B 73 DE 98 B1 06 6D 87 77 6B 04 ED>)
(   6,<2013-01-23 19:39:18.481 -0500>,<Administrator>,<X>,<proc1d>,<TOPSPIN 2.1>,
      <abs ABSG = 3 
       data hash MD5: 32K
       97 9F F5 B1 C2 CD 0F E5 CD 03 4E 6D 45 07 79 75>)
(   7,<2013-01-23 19:39:18.622 -0500>,<Administrator>,<X>,<proc1d>,<TOPSPIN 2.1>,
      <abs ABSG = 4 
       data hash MD5: 32K
       E6 10 9D 62 2D 4F 13 FE 64 B4 5D C7 2A 8E D6 3F>)
(   8,<2013-01-23 19:39:18.778 -0500>,<Administrator>,<X>,<proc1d>,<TOPSPIN 2.1>,
      <abs ABSG = 5 
       data hash MD5: 32K
       BF 11 7C 61 AB CD 42 4C C6 E6 16 0A 97 BC D5 7B>)
$$ ##END=
$$ 
$$ $$ hash MD5
$$ $$ 8E C1 CF 12 AB 59 24 1B 97 04 4B 83 F6 2F 1E 7D
##$RELAX= 
##$RELAX= 
##$RELAX= 
##$RELAX= 
##$RELAX= 
##$RELAX= 
##$RELAX= 
$$ Bruker specific parameters
$$ --------------------------
##$DU= <E:\>
##$EXPNO= 30
$$ [...]
150 150 150 150 150 150 150 150
##$TP07= 0
##$TPNAME0= <>
##$TPNAME1= <>
##$TPNAME2= <>
##$TPNAME3= <>
##$TPNAME4= <>
##$TPNAME5= <>
##$TPNAME6= <>
##$TPNAME7= <>
##$TPOAL= (0..7)
0.5 0.5 0.5 0.5 0.5 0.5 0.5 0.5
##$TPOFFS= (0..7)
0 0 0 0 0 0 0 0
##$TUNHIN= 0
##$TUNHOUT= 0
##$TUNXOUT= 0
##$USERA1= <user>
##$USERA2= <user>
##$USERA3= <user>
##$USERA4= <user>
##$USERA5= <user>
##$V9= 5
##$VALIST= <valist>
##$VCLIST= <CCCCCCCCCCCCCCC>
##$VD= 0
##$VDLIST= <DDDDDDDDDDDDDDD>
##$VPLIST= <PPPPPPPPPPPPPPP>
##$VTLIST= <TTTTTTTTTTTTTTT>
##$WBST= 1024
##$WBSW= 4
##$XGAIN= (0..3)
0 0 0 0
##$XL= 0
##$YL= 0
##$YMAX_a= 686053
##$YMIN_a= -583433
##$ZGOPTNS= <>
##$ZL1= 120
##$ZL2= 120
##$ZL3= 120
##$ZL4= 120
##$ABSF1= 14.98509
##$ABSF2= -5.573092
##$ABSG= 5
##$ABSL= 3
##$ALPHA= 0
##$AQORDER= 0
##$ASSFAC= 0
##$ASSFACI= 0
##$ASSFACX= 0
##$ASSWID= 0
##$AUNMP= <proc_prof1d_extract_pilot.lims>
##$AXLEFT= 0
##$AXNAME= <>
##$AXNUC= <1H>
##$AXRIGHT= 0
##$AXTYPE= 0
##$AXUNIT= <>
##$AZFE= 0.1
##$AZFW= 0.1
##$BCFW= 0
##$BC_mod= 0
##$BYTORDP= 0
##$COROFFS= 0
##$CY= 15
##$DATMOD= 1
##$DC= 0
##$DFILT= <>
##$DTYPP= 0
##$F1P= 0
##$F2P= 0
##$FCOR= 0.5
##$FTSIZE= 32768
##$FT_mod= 6
##$GAMMA= 0
##$GB= 0
##$INTBC= 1
##$INTSCL= 1
##$ISEN= 128
##$LB= 0
##$LEV0= 0
##$LPBIN= 0
##$MAXI= 10000
##$MC2= 0
##$MEAN= 0
##$ME_mod= 0
##$MI= 0
##$NCOEF= 0
##$NC_proc= -8
##$NLEV= 6
##$NOISF1= 0
##$NOISF2= 0
##$NSP= 0
##$NTH_PI= 0
##$NZP= 0
##$OFFSET= 14.98509
##$PC= 1
##$PHC0= 97.77283
##$PHC1= 0
##$PH_mod= 1
##$PKNL= yes
##$PPARMOD= 0
##$PPDIAG= 0
##$PPIPTYP= 0
##$PPMPNUM= 2147483647
##$PPRESOL= 1
##$PSCAL= 4
##$PSIGN= 0
##$PYNMP= <proc.py>
##$REVERSE= no
##$SF= 400.02
##$SI= 32768
##$SIGF1= 0
##$SIGF2= 0
##$SINO= 400
##$SIOLD= 32768
##$SPECTYP= <>
##$SREGLST= <1H.CDCl3>
##$SSB= 0
##$STSI= 32768
##$STSR= 0
##$SW_p= 8223.68421052631
##$SYMM= 0
##$S_DEV= 0
##$TDeff= 65536
##$TDoff= 0
##$TI= <>
##$TILT= no
##$TM1= 0
##$TM2= 0
##$TOPLEV= 0
##$USERP1= <user>
##$USERP2= <user>
##$USERP3= <user>
##$USERP4= <user>
##$USERP5= <user>
##$WDW= 1
##$XDIM= 32768
##$YMAX_p= 480033152
##$YMIN_p= -699886
##$CURPLOT= <Network HP LaserJet P1505>
##$CURPRIN= <$Network HP LaserJet P1505>
##$DFORMAT= <normdp>
##$LAYOUT= <+/1D_H.xwp>
##$LFORMAT= <normlp>
##$PFORMAT= <normpl>
##$SURQMSG= 1
$$ End of Bruker specific parameters
$$ ---------------------------------
##NTUPLES= NMR SPECTRUM
##VAR_NAME=  FREQUENCY,     SPECTRUM/REAL,   SPECTRUM/IMAG
##SYMBOL=    X,             R,               I
##VAR_TYPE=  INDEPENDENT,   DEPENDENT,       DEPENDENT
##VAR_FORM=  AFFN,          ASDF,            ASDF
##VAR_DIM=   32768,         32768,           32768
##UNITS=     HZ,            ARBITRARY UNITS, ARBITRARY UNITS
##FACTOR=    0.250966925370066, 1,           1
##FIRST=     8223.43324360094, 105670,       -40512
##LAST=      0,             -99356,          -239358
##MIN=       0,             -699886,         0
##MAX=       8223.43324360094, 480033152,    0
$$ Real data points
##PAGE= N=1
##DATA TABLE= (X++(R..R)), XYDATA
$$ [...]
19563a07998A4757a7755e030q6736m3363d9443I7809f2080j33931K0006A14457
19551a38032D7595c89168A95865a6487k10236P7551g1976k135A05022a35988C40266
19539A88719H403i1193B9274a77267N9226j46598i7362j1725m809G6147b45575
19527A6150R293K8783a15182J9293A56980J77922A112b50256B53303b27510j67734
19516c95244D50816i0213j40443a03839m4917d1553j27369k22236a11418n8060
19506a69478C18102b21616c8524A01930N7784m3497g906A25182b03044g3717j27791
19495b01508G6153M4807a39003m4596e3315j63746A7316e4534D8227Q9188J70214
19484C07629c18084o1282A89833a07720B22420g5883F1826a58214l5177i1233
$$ plain form
19563 -107998 14757 -17755 -5030 -91766 -135129 -49443 97809 -62080 -196011 -176005 114457
19551 -138032 47595 -389168 195865 -16487 -226723 -149172 -71976 -74111 105022 -135988 340266
19539 188719 8403 -91193 29274 -177267 -118041 -264639 -97362 -109087 -113896 76147 -245575
19527 16150 25443 54226 -115182 -95889 156980 334902 1112 -250256 253303 -227510 -395244
19516 -395244 450816 -90213 -230656 -103839 -148756 -41553 -168922 -391158 -111418 -169478
19506 -169478 318102 -221616 -38524 101930 159714 116217 -7906 125182 -203044 -73717 -201508
19495 -201508 76153 120960 -139003 -183599 -53315 -217061 17316 -54534 48227 137415 307629
19484 307629 -318084 -379366 189833 -107720 222420 -75883 61826 -158214 -193391 -91233
19473G1566a54027l8552J8738B57118H2516J05584a10727k72103a48068C0323
19462f7195k92993J29406g6229j46108m0477E2786J89576I1183a5072j2255A86081
19450a33572j26863A13700b44650P5879D4008a56135k18249E4317B6488N70c45858
19438g5600H404N1919b49211g5782k87513A29598J72461c31088a30462D9184O5502
19427A14686d35476J66853j91224e1035k76629J66a5820A4542Q3837b00556n2758
19416b53314J13658j42691c9269k01013E740N17M24464c71761f0180j40807G9234
19404a34480p284p3837J04366M8629A11493c312j65459j83191R3622R3774K9218
19393a35348b9934j83099c1748k276j0509j31153a7834d998C03678G6738e19878
$$ plain form
19473 71566 -154027 -192579 -173841 257118 82516 188100 -110727 -382830 -148068 30323
19462 -67195 -360188 -230782 -76229 -222337 -262814 52786 242362 91183 -15072 -27327 186081
19450 -133572 -260435 113700 -244650 -168771 44008 -156135 -374384 54317 26488 27058 -345858
19438 -75600 8404 60323 -249211 -75782 -363295 129598 302059 -331088 -130462 49184 114686
19427 114686 -435476 -268623 -459847 -51035 -327664 -327498 -15820 14542 98379 -200556 -253314
19416 -253314 -139656 -282347 -39269 -240282 5740 6257 430721 -371761 -60180 -200987 79234
19404 -134480 -141764 -215601 -111235 -62606 111493 -3312 -168771 -351962 -258340 -164566 -135348
19393 -135348 -29934 -213033 -31748 -34024 -44533 -175686 -17834 -4998 303678 76738 -519878
19381c10895E9467a20262l0060c8520k3603j89117a1153A29694K8654b57793k0002
19370b77795l1603g305D0341a15677i494B88367c43769e4956j58253M9642E4745
19358a41399j16043a09736m395A15040b31662e155m205k87635M0586h2381k0111
19347a02492E229K9862I775f1731A55013b3030k36125A12451b07627K8663o6211
19336b45175A76941D202h2956A80671c09401f2704n5295D1546Q8783k9824a31158
19324b35091B02183l5394n6648B3447R3976b57154h166H463a52886B17858c15919
19312a11979L1043a7304k80424K1337C67440g0738B1686i789B3830b61698B53649
19300B54705a39115B69171F7082a08246j61363h9371k8426A9954K87182a22831
$$ plain form
19381 -310895 59467 -120262 -150322 -38520 -62123 -251240 -11153 129694 158348 -257793 -277795
19370 -277795 -309398 -7305 40341 -115677 -9494 288367 -343769 -54956 -213209 -163567 54745
19358 -141399 -257442 -109736 -114131 115040 -231662 -5155 -9360 -296995 -256409 -82381 -102492
19347 -102492 5229 35091 9775 -61731 155013 -23030 -259155 112451 -207627 -178964 -245175
19336 -245175 176941 4202 -82956 180671 -309401 -62704 -117999 41546 130329 100505 -131158
19324 -235091 202183 166789 110141 23447 117423 -257154 -8166 8463 -152886 217858 -315919
19312 -111979 -80936 -17304 -297728 -276391 367440 -70738 21686 -9789 23830 -261698 253649
19300 254705 -139115 269171 67082 -108246 -269609 -89371 -117797 19954 307136 -122831
19289A13540i8567k8805H3104J37331d1086r2139D0615b43173E2545L17818e6835
19277b23183A0419a92329j0924F121b73932A72255c2424j10813c7661k57583a44407
19265a60726c8018l8007m7367o4468c5645E2818k3137b29613E3980O8324b31569
19253f3205m39880K35958a9529q662j88732D6150b07106M6325C7637P4518M798
19242A16953A5686O7562f9522n1004A05032K8187o1648b08239d227E6136N5222
19231A11358D3041d1181j19349B06718i9213j9286q3977b250o2855C7084f7186
19219a31917L4626j02012A22666k5181A1538c54795J73982Q4123A21853c12413
19208G2645J01666J05253C6637g8260a4447j42530L1892c3751k18638P5192D30114
$$ plain form
19289 113540 -98567 -127372 83104 220435 -41086 -133225 40615 -243173 52545 370363 -56835
19277 -223183 10419 -192329 -203253 6121 -273932 172255 -32424 -143237 -37661 -295244 -144407
19265 -160726 -38018 -76025 -123392 -187860 -35645 52818 29681 -229613 53980 122304 -231569
19253 -63205 -503085 -267127 -19529 -28191 -216923 46150 -207106 -160781 37637 112155 116953
19242 116953 15686 83248 -69522 -120526 105032 133219 71571 -208239 -4227 56136 111358
19231 111358 43041 -41181 -160530 206718 -99213 -118499 -202476 -2250 -65105 37084 -67186
19219 -131917 -97291 -199303 122666 97485 11538 -354795 -180813 -96690 121853 -312413
19208 72645 174311 279564 36637 -78260 -14447 -156977 -125085 -33751 -252389 -177197 430114
19196B87054I6743a75087f8075o1956c3621A93810H5876a83817F4569a99975g9401
19184a37195A3403M0251K20506D2577R5564M8852b14270j03746E0919i9775j3701
19173a13476d7186r2212B4971d4422l06756A37705f7277B05371h2642l972p2799
19162a59413d3146k27351J20908m4303M4177J2751E9663b82651J32134B98536
19151i8141B3958c37165i022B18030C330a90362A31043a27447o5961g4976k02296
19140b77272a5184A2709K7266L9892K91786G8401j7706P9785c4861L877a556C3848
19127G0602B7776b53954d9289m13185b942n2700B22245g4403C1360L82645a34950
19115B3263a21035N9021A38536N5201m9093e3127m34470A1834a329C5620a21641
$$ plain form
19196 287054 96743 -175087 -68075 -130031 -33621 193810 85876 -183817 64569 -199975 -79401
19184 -137195 13403 53654 274160 42577 138141 186993 -214270 -318016 50919 -99775 -113476
19173 -113476 -47186 -139398 24971 -44422 -351178 137705 -67277 205371 -82642 -86614 -159413
19162 -159413 -43146 -270497 -149589 -193892 -149715 -136964 59663 -282651 -150517 298536
19151 -98141 23958 -337165 -9022 218030 3330 -190362 131043 -127447 -193408 -74976 -277272
19140 -277272 -15184 12709 39975 79867 371653 78401 60695 140480 -34861 -30984 -1556 33848
19127 70602 27776 -253954 -49289 -462474 -2942 -55642 222245 -74403 31360 414005 -134950
19115 23263 -121035 -62014 138536 193737 144644 -53127 -487597 11834 -1329 35620 -121641
19103I104L6499b94370A89827K7885b25302O5711P005j59896I7682b43224f7959
19091B50222a664H9510d05803C22522b07305B0697N5588d38005J94532M4739A09088
19079b31049k0656B15703i4488j51635B36778A13779b95195B7294g0551k36441
19069c06992J13556O1464G2945o501L9615l6830J85216a51216n2552B94736a17825
19057a80568q3839a01900j45130P4733A09389c33570a09348j57813O2549h0494
19046a36227o3957D4137a05658n8906C4575a65164D0573a68254e7225j19653k00895
19035c77773g4193A28902a79459F4032j3952j4696M04247a47164E4979D276K73016
19024B77292l5961o1509e1850A2188K32772b0496I7895a82277a4598B75702H1173
$$ plain form
19103 9104 45603 -294370 189827 217712 -225302 -159591 -152586 -312482 97682 -243224 -67959
19091 250222 -1664 89510 -405803 322522 -207305 20697 76285 -438005 -243473 -198734 109088
19079 -231049 -251705 215703 -94488 -246123 236778 113779 -295195 27294 -70551 -306992
19069 -306992 -193436 -131972 72945 66444 106059 69229 254445 -151216 -203768 294736 -117825
19057 -180568 -264407 -101900 -247030 -172297 109389 -333570 -109348 -267161 -204612 -80494
19046 -136227 -200184 44137 -105658 -164564 34575 -165164 40573 -168254 -57225 -176878 -377773
19035 -377773 -74193 128902 -179459 64032 50080 35384 439631 -147164 54979 4276 277292
19024 277292 241331 179822 -51850 12188 244960 -20496 97895 -182277 -14598 275702 81173
19012H898R9083k4479a56282D35631b10770E4387g2782k0841n4654d4747j3171
19001e7918C1269a33536c3593r1412j89615A50262k7967P3493p1181a67730B16531
18989G5542p104e8565A39301a37340O3070Q210d483A03820d55005A25424d12837
18977A12517R1348d34965B52594J63719f0622l05290o8166K06836K5048E0609
18966E3316r004a83827j0908G0307a16454M635L3937B03391e8516j81103e5776
18954b00750E2160e0575l7579C51963F065c25293J16482j86096e7192j11193F9575
18942I960a50617A95922a09186L2089A51352d0374a6771j4005j48876h6342J4606
18931g1736B28306b95309A5967b83274J09480J4024O928A54226e8579L713p1041
$$ plain form
19012 8898 107981 83502 -156282 435631 -210770 54387 -72782 -93623 -148277 -44747 -57918
19001 -57918 31269 -133536 -33593 -125005 -314620 150262 122295 195788 124607 -167730 216531
18989 75542 68438 -58565 139301 -137340 -74270 -66060 -4483 103820 -455005 125424 -412837
18977 112517 203865 -434965 252594 416313 -60622 -365912 -434078 -227242 -202194 50609
18966 53316 44312 -183827 -194735 70307 -116454 -111819 -77882 203391 -58516 -239619 -55776
18954 -200750 52160 -50575 -88154 351963 6065 -325293 -208811 -394907 -57192 -168385 69575
18942 9960 -150617 195922 -109186 -77097 151352 -40374 -16771 -30776 -179652 -86342 -71736
18931 -71736 228306 -295309 15967 -283274 -173794 -159770 -152842 154226 -58579 -54866 -125907
18920a25907H4736b39285f8968A60366c6138A6914J28010n9036a27153i22k9020
18909b9942A9549b44674j42980b3146m2879n8541I7817g8068j11830J6195j42678
18898c16381G8578J4991b49188F2419k1974l303i9370a1240j45337H8767b06034
18886C34091b75769A64607m3554F629J13880c33867B13285a45203H4596b26986
18875A2682M19798b39864p0893a37974B90393C5071f4407n2257C62821n8570a48963
18863G788K83421A02227J25998b34253K1206A50809c5547G1418a753D6304J60481
18852B06785q2943b57258E8747b44231E290J32969a7004j95109I9726a49351l8383
18841a87734R3111A7851a25587I6165J22777l6876b51524a14005m5990q4279C1844
$$ plain form
18920 -125907 84736 -239285 -68968 160366 -36138 16914 144924 85888 -127153 -922 -29942
18909 -29942 19549 -244674 -387654 -23146 -66025 -124566 97817 -78068 -189898 -173703 -316381
18898 -316381 78578 93569 -249188 62419 40445 37142 -99370 -11240 -156577 88767 -206034
18886 334091 -275769 164607 121053 6629 120509 -333867 213285 -145203 84596 -226986
18875 12682 432480 -239864 -310757 -137974 290393 35071 -64407 -116664 362821 304251 -148963
18863 7788 291209 102227 228225 -234253 -213047 150809 -35547 71418 -1753 46304 206785
18852 206785 123842 -257258 58747 -244231 5290 138259 -17004 -212113 99726 -149351 -187734
18841 -187734 -94623 17851 -125587 96165 218942 182066 -251524 -114005 -159995 -244274 31844
18829A60623N4360a68538E4467c03790J17445b129j90142N0327n4057B28027K40952
18818D68979e093B25338O9268A01858b8107B94854a04511B5649L5900K43309b88215
18806I8900A41Q3239f0144k50355o6199L2614c4247j14033A61075f6607B433d2328
18793h2091j55279D28731F9052b33057B14852c04477a01747k2561a5223F6835
18782c6373k24604a14552a7092j83017Q1117E5340g0307A64841D798a94820I962
18770B9611b11084F1439a46989k05524D41511c10905a40695j38626C8392i6537
18759a09680a1505D2052a2990I5038a23296j3925O2822C1487a23673r2521M2774
18748a73420B63815F5835c99508c8283l36075f5002m8219A75956J6908b03775
$$ plain form
18829 160623 214983 -168538 54467 -303790 -186345 -2129 -192271 -141944 -196001 228027 468979
18818 468979 -5093 225338 294606 101858 -28107 294854 -104511 25649 61549 304858 -288215
18806 98900 141 83380 -60144 -310499 -376698 -344084 -34247 -148280 161075 -66607 2433 -42328
18793 -82091 -237370 428731 69052 -233057 214852 -304477 -101747 -124308 -15223 66835
18782 -36373 -260977 -114552 -17092 -200109 -118992 55340 -70307 164841 4798 -194820 9962
18770 29611 -211084 61439 -146989 -352513 441511 -310905 -140695 -279321 38392 -96537
18759 -109680 -11505 42052 -12990 95038 -123296 -137221 -74399 31487 -123673 -216194 -173420
18748 -173420 263815 65835 -399508 -38283 -374358 -65002 -113221 175956 192864 -203775
18737a63966r0297J07676r2040h7871j69578A71361m4297a8257k18260B12216
18726E5457b10633b3875r8338A64483h2389C26749a08151o3598C881J30711b99522
18714A23929O1542c38455J03701A7367J53434a30861l8412O4446k82216J55969
18704b31074H8509a99081n7767F6260a02120A13237b04588L2057G3607g5866k22439
18693b98305B68200a91443N2552N9427j10118E9270a65786E7158i1401K9675A09437
18681A33213c13012C85920e20947f6047j1213A09727a15759l339B25800I9417
18670a26251k88858J60493C24212f2841o0601e768j5869p187A5841K57453a49060
18658A4325a69724n3684k09339D8251b54742l3686D2656J25535j5938b70546C19651
$$ plain form
18737 -163966 -254263 -146587 -238627 -87871 -257449 171361 127064 -18257 -236517 212216
18726 55457 -210633 -23875 -122213 164483 -82389 326749 -108151 -171749 3881 134592 -299522
18714 123929 185471 -338455 -234754 17367 170801 -130861 -169273 -104827 -387043 -231074
18704 -231074 88509 -199081 -256848 66260 -102120 113237 -204588 -172531 73607 -75866 -298305
18693 -298305 268200 -191443 -138891 -79464 -189582 59270 -165786 57158 -91401 -61726 109437
18681 133213 -313012 385920 -520947 -66047 -77260 109727 -115759 -119098 225800 99417
18670 -126251 -415109 -254616 324212 -62841 -123442 -5768 -21637 -28824 15841 273294 -149060
18658 14325 -169724 -223408 -432747 48251 -254742 -288428 42656 168191 152253 -270546 319651
18646b24360D27572a02101b2245E5049b65901b6659j1095c03E9730M6862a13112
18634c1346H1341L8037a57966b2474G8918J64173h5997q5487I3918g7023A5915
18622b07475C4975c88176i9591J5450j31035R6208C7597b11672h8065k6438N6195
18611e8308m02149H0245b645A30059I210N4836J2724a9808q8485n5011f7003j39494
18599b06497a00107d9959J7835C599b57634J26726N5593A33739a26398o5370C17666
18587c69495A08919f5093j64955h5758C7924a62466A62955b29662F4205b48302
18576h7386D7446a58888k9525h1396A12241a78770F4081J8296b89958H358i973
18564a77346B70814d3503k94183j08203R2399E2734J23840a54695A70735a60518
$$ plain form
18646 -224360 427572 -102101 -22245 55049 -265901 -26659 -37754 -303 59730 106592 -113112
18634 -31346 81341 119378 -157966 -22474 78918 243091 -85997 -171484 93918 -77023 15915
18622 -207475 34975 -388176 -99591 -84141 -215176 -118968 37597 -211672 -88065 -114503 -58308
18611 -58308 -460457 80245 -2645 130059 9210 64046 76770 -19808 -108293 -163304 -67003 -206497
18599 -206497 -100107 -49959 -32124 3599 -257634 -130908 -75315 133739 -126398 -191768 317666
18587 -369495 108919 -65093 -230048 -85758 37924 -162466 162955 -229662 64205 -248302
18576 -87386 47446 -158888 -188413 -81396 112241 -178770 64081 82377 -289958 8358 -9973
18564 -177346 270814 -43503 -337686 -445889 -353490 52734 176574 -154695 170735 -160518
18553c16755J51696j34224a11366q8311j2703c7171C08936l7824D9622e7594A9366
18541g453n6759j10304D175b38139A60863K17486H5211C8680J12036i1926C75805
18529c01567A46913b90271k384d9091l04405D1964b70005d0458B68913J14457
18519C83370I0477h9539A34890d894G6209b67875n0672g7335G5165e63204C43032
18507I9385p136K82195i614A1039a99061A47850a9026J789B41867a36999C3116
18495c8495L11C00532a64449n3778M1459n3626J1204g8704j27891r721b3840A09510
18482G9859b38448g0969C15434I3345P2504j991c30920A5252f3885H7452a38024
18470b66040A47456b10057l167h1144E0850i2038A40177J01813K8978j20194a16416
$$ plain form
18553 -316755 -165059 -299283 -111366 -199677 -212380 -37171 308936 271112 49622 -57594 19366
18541 -7453 -64212 -174516 4175 -238139 160863 378349 85211 38680 150716 -91926 375805
18529 -301567 146913 -290271 -292655 -49091 -353496 41964 -270005 -40458 268913 383370
18519 383370 90477 -89539 134890 -4894 76209 -267875 -318547 -77335 75165 -563204 343032
18507 99385 92249 374444 -9614 11039 -199061 147850 -19026 -17237 241867 -136999 33116
18495 -38495 -38184 300532 -164449 -218227 -176768 -230394 -219190 -78704 -206595 -216316 -23840 109510
18482 79859 -238448 -70969 315434 93345 165849 163858 -330920 15252 -63885 87452 -138024
18470 -266040 147456 -210057 -213224 -81144 50850 -92038 140177 241990 270968 150774 -116416
18458b29047H6925L9843b19829G5028J7819d0095j35702A24072D057d37983d4599
18446a62943k23306j29648a01556A42987a92894F2387c57594a42014r1457j07476
18436c40947B01201a6017l8456k72F8621L1712J19028n9763c96860h011B02611
18424c6680J8161A78105E7309j637a56823j82793A41936b05197P9724F9862J9617
18413H9479J70939a050G6314b27419f8705B01537E4589a36783p2375I4666j8051
18402G6615k7618J17164k8474c33266f7465A20433g9489H8498a25773j34592a07892
18390b85991r2914a3199E0557a51209J1599A29152b25411k1951f8596q5158F1275
18378A29490j4794J33316r8488d1204j72121B39819d8082m5385B15557b94308
$$ plain form
18458 -229047 86925 126768 -219829 75028 92847 -40095 -175797 124072 4057 -437983 -44599
18446 -162943 -386249 -515897 -101556 142987 -192894 62387 -357594 -142014 -233471 -340947
18436 -340947 201201 -16017 -54473 -54745 68621 100333 219361 159598 -396860 -8011 202611
18424 -36680 -18519 178105 57309 55672 -156823 -339616 141936 -205197 -125473 69862 89479
18413 89479 260418 -1050 76314 -227419 -68705 201537 54589 -136783 -209158 94666 76615
18402 76615 48997 166161 137687 -333266 -67465 120433 -79489 88498 -125773 -260365 -107892
18390 -285991 -378905 -13199 50557 -151209 -139610 129152 -225411 -247362 -68596 -153754 61275
18378 129490 114696 248012 149524 -41204 -213325 239819 -48082 -93467 215557 -294308
18367E7180M1793a99561M2778j49599G8755d7868I106a16200k47244h8589A2754
18355h0946R183A48115M9850c7310I7035a64252B3694L1558b07754C33173a37662
18343G1211L4755e2480o2021H2959a24148e545H7257J4497C7945b6797J2867d239
18330a12012C51191a12215r0946q7939a09562A4126J44993f878j40037k06265
18320c53180B91830A24200b24621c9171B71214a73576f160p1048n3663n4524j41604
18309c26999a31709f4736A88781F2032J0992B6145d57F4528j2205b89034C07214
18297h3888A16123J98242j10675F4981b33901c0906j94171C9501c9601a1031I9169
18285D5567f1670B03521M0234c3279j3273A0287a17775I3196a26128j04415p6484
$$ plain form
18367 57180 98973 -199561 -156783 -306382 78755 -47868 9106 -116200 -363444 -88589 12754
18355 -80946 -71763 148115 197965 -37310 97035 -164252 23694 55252 -207754 333173 -137662
18343 71211 105966 -52480 -114501 82959 -124148 -5545 87257 101754 37945 -26797 -13930 -4239
18330 -112012 351191 -112215 -203161 -291100 -109562 14126 159119 -6878 -146915 -353180
18320 -353180 291830 124200 -224621 -39171 271214 -173576 -6160 -77208 -130871 -185395 -326999
18309 -326999 -131709 -64736 188781 62032 73024 26145 -457 64528 52323 -289034 307214
18297 -83888 116123 314365 203690 64981 -233901 -30906 -225077 39501 -39601 -11031 99169
18285 45567 -61670 203521 243755 -33279 -46552 10287 -117775 93196 -126128 -230543 -307027
18274c07027a10298k3911A03698d7968I2693a80519e3763C86574c44135B5719
18263b14080d5878p1163n5161I0073b78013a30962j65759a1507k70251A97711
18252c4934C38537H8355J0160h6965F2643K87418b98411a17000B906P0759b25820
18240b04677D14757e6576f948j47125h599j54539J2883D24792g1823F0544r156
18229E1388E050L1945J37101f0370C3584b26557B13363J6569a00998c8873k03280
18218b42153A19643e6995l6910k69408N5480L958a563o503k15796H3494c43174
18206D993b65748J26839D4036c0883F7481K14069a75015h3681D9263g5271A89557
18194B87853K654d90417i283D0474J88263G6074h0412B44784b87961d1454D8753
$$ plain form
18274 -307027 -110298 -134209 103698 -47968 92693 -180519 -53763 386574 -344135 25719
18263 -214080 -45878 -117041 -172202 90073 -278013 -130962 -296721 -11507 -281758 197711
18252 -34934 338537 88355 98515 -86965 62643 350061 -298411 -117000 2906 73665 -225820
18240 -204677 414757 -56576 -6948 -154073 -8599 -163138 -150255 424792 -71823 60544 51388
18229 51388 5050 36995 174096 -60370 33584 -226557 213363 229932 -100998 -38873 -242153
18218 -242153 119643 -56995 -93905 -363313 -307833 -303875 -1563 -8066 -223862 83494 -343174
18206 4993 -265748 -138909 44036 -30883 67481 281550 -175015 -83681 49263 -75271 189557
18194 287853 290507 -490417 -9283 40474 228737 76074 -80412 244784 -287961 -41454 48753
18182D8616g2144F7079d9968C31185a7498B7185R638K00148p2121E1838J8526
18171G0364L54046b25618C12545c23505R4566A5033J9976a8621l09032A1490b67105
18159a32867O4197J7375p8748D9216b2219C1023Q8652d6165I4847a52398d264
18147c3950I5974b02B15236D8584L5943h607A3657d02612c4026l09407J32497
18136b10936A30978J5223p2280a99319h2695k29290D3334K8546J61685d1115l83746
18125d24861a31885j28504d9076A41334a76949j38582i988B40853f7316c0481
18114a55864m465I7440p337F553b03963b598A0086a28885m4768B87043h6056B31576
18101a01135N0157A15089b13713f9749l486j15476e1158b355j42904j22652A29783
$$ plain form
18182 48616 -72144 67079 -49968 331185 -17498 27185 36823 236971 164850 51838 70364
18171 70364 424410 -225618 312545 -323505 -228939 15033 35009 -18621 -327653 11490 -267105
18159 -132867 -68670 -51295 -130043 49216 -22219 31023 119675 -46165 94847 -152398 -4264
18147 -33950 95974 -202 215236 48584 84527 -8607 13657 -402612 -34026 -343433 -210936
18136 -210936 130978 146201 73921 -199319 -82695 -311985 43334 71880 233565 -41115 -424861
18125 -424861 -131885 -260389 -49076 141334 -176949 -315531 -9988 240853 -67316 -30481
18114 -155864 -160329 97440 90103 6553 -203963 -2598 10086 -128885 -173653 287043 -86056 231576
18101 -101135 -50978 115089 -213713 -69749 -73235 -188711 -51158 -2355 -145259 -267911 129783
18089E042f2595k57743A4665d8090F1407a93198F4427J53466c2000G2514K06820
18078B79334D4099J27598b21819B641a46615E1162i0156b7363C9744a11820a363
18066D6206J09567i6521B64711b8655k5732b6194B91427a57529k36844a468j55687
18055a57155A27789a98568n796a2138A51100b2235D2356a73430C68705g8266j46715
18044b24981G0658A9934a40230j2583A11124I663J89158a82677C50188a59635
18033a82778M9851r219A74831a21246k9816J6536F8443a73975j32642A77113a08683
18021G8803J90030c6803j97631G0221J21496a2232d442j3537F0052M27331c80566
18009a00170F131b83199J8602A78562a11686c4498r02A95385c23545D39694B16312
$$ plain form
18089 5042 -62595 -320338 14665 -48090 61407 -193198 64427 217893 -32000 72514 279334
18078 279334 44099 171697 -221819 2641 -146615 51162 -90156 -27363 39744 -111820 -1363
18066 46206 155773 -96521 264711 -28655 -54387 -26194 291427 -157529 -394373 -1468 -157155
18055 -157155 127789 -198568 -204364 -12138 151100 -22235 42356 -173430 368705 -78266 -224981
18044 -224981 70658 19934 -140230 -152813 111124 9663 198821 -182677 350188 -159635
18033 -182778 -132927 -142146 174831 -121246 -151062 -134526 68443 -173975 -306617 177113 -108683
18021 78803 268833 -36803 -234434 70221 191717 -12232 -4442 -17979 60052 487383 -380566
18009 -100170 6131 -283199 -264597 178562 -111686 -34498 -35400 195385 -323545 439694 216312
17997c3646j26115E3730a85002M9339k62270B95277B4137d1808k9990K9337r4498
17986a36959B29288i6656L6715j1307p1352p865d776G2228J20700p4283l4162
17975H4483a71272C3805J48315k4581d3796B04814A6780J3553b15499F6754R1373
17964A58127l6729a38786I3649L413a59516k86964a81669b9500H7323l4425e7736
17952b3052A52734D7150f950j03165n4567I4180c12935J52601B14876b86509C1967
17940a13259d1946o6167C22534a04922D8244b07345C0776b44627j37767e8704
17929a38590f4033j45432i8871I0609b6162A82439b81977A90074E47a82176m1073
17918b23249P1292a7893q5731A69002k2007a79112o1179I8004a86272A86497d416
$$ plain form
17997 -33646 -159761 53730 -185002 -135663 -397933 295277 24137 -41808 -71798 -42461 -136959
17986 -136959 229288 -96656 -59941 -71248 -142600 -150465 -4776 72228 192928 118645 84483
17975 84483 -171272 33805 182120 157539 -43796 204814 16780 30333 -215499 66754 158127
17964 158127 121398 -138786 93649 97062 -159516 -446480 -181669 -29500 87323 52898 -57736
17952 -23052 152734 47150 -6950 -110115 -164682 94180 -312935 -160334 214876 -286509 31967
17940 -113259 -41946 -108113 322534 -104922 48244 -207345 30776 -244627 -382394 -58704
17929 -138590 -64033 -209465 -98871 90609 -26162 182439 -281977 190074 547 -182176 -223249
17918 -223249 -151957 -17893 -103624 169002 146995 -179112 -240291 98004 -186272 186497 -4416
17906G1079a73654I4892a12343o5353D9185J39887b31642K6729e0656o0354j50105
17895b61115q4211g4556a0651j39049A40460l5224J6209a2124H8254D2334R1341
17884A33675e9426j8165j57254E710g0567B000a80996P906G091c4456B70833n5016
17872B15817b00565b7493k63520F0833B0966h9610k7009j3965B77405G2303J01493
17861A73796j5551g8301C4698a09918k31718J66159E8914b28786h2548l0246m0819
17850a53613A03607a3092l5491D36572I5003J97943L6026A03512J07811I6798
17839A32594a04807B7267a26319B9210a04191b4284C7823N6023J7323d4459F3336
17827b88466A50909O4988a19473B83443h3918j17804A61994K60203H2366a83373
$$ plain form
17906 71079 -173654 94892 -112343 -177696 49185 189072 -231642 -204913 -50656 -111010 -261115
17895 -261115 -345326 -74556 -10651 -149700 140460 105236 121445 -12124 88254 42334 133675
17884 133675 -59426 -77591 -234845 5710 -70567 2000 -180996 -173090 7091 -34456 270833 215817
17872 215817 -200565 -27493 -291013 60833 20966 -89610 -116619 -130584 277405 72303 173796
17861 173796 158245 -78301 34698 -109918 -341636 -175477 58914 -228786 -82548 -112794 -153613
17850 -153613 103607 -13092 -48583 436572 95003 292946 328972 103512 211323 96798
17839 132594 -104807 27267 -126319 29210 -104191 -24284 37823 93846 111169 -44459 63336
17827 -288466 150909 215897 -119473 283443 -83918 -201722 161994 422197 82366 -183373
17816h3164G1662e7566D24833J13093a14050k2526r2064I1014M2847a55770A84426
17804a91761O3949B32333j2218a84012j30400J26205L8747A13876J36989A0666
17793a88062D7352b29598F0528R732c40448C2376L3724j210j878a8432o2161C17052
17780h1072q3181A59515h9017B08269E2258A5166J99886e9624j38381F2274K7585
17769H9859n586l6086K06037g2910C3899N869c29753a28691C734O1121N49411
17758F14266A29802Q5496a32936A4183N0923K22263q4387a56952A96337D9922
17747d304l5652A7084g3973C8035b00324P6395d1079A99080A7767h3568j6931
17736a00499l8199A10798c00785H6604e25153D27694A9795b26161g28n5356C3945
$$ plain form
17816 -83164 71662 -57566 424833 537926 -114050 -136576 -228640 91014 133861 -155770 184426
17804 -191761 -127812 232333 220115 -184012 -314412 -188207 -149460 113876 250865 10666
17793 -188062 47352 -229598 60528 70260 -340448 32376 66100 64890 63012 -18432 -80593 317052
17780 -81072 -164253 159515 -89017 208269 52258 15166 215052 -59624 -198005 62274 89859
17769 89859 84273 48187 254224 -72910 33899 39768 -329753 -128691 3734 64855 614266
17758 614266 129802 215298 -132936 14183 65106 287369 202982 -156952 196337 49922
17747 -4304 -39956 17084 -73973 38035 -200324 -123929 -41079 199080 17767 -83568 -100499
17736 -100499 -138698 110798 -300785 86604 -525153 427694 19795 -226161 -728 -56084 33945
17724a06388c4217k4878A64564C208f6286j21014A40121b34143h693m80587h5952
17712a82952F8946b981H316b2149o460j99621B03769a73368e0103j3403j864L966
17700f1404A71069M9628n61g5527A55394m8084j8596a16860C67916H8330b12396
17688H6033c43367Q4726i234n56C84639d42664E28195j95811D5739K42357a81875
17676a32239B77390d2912A46396J4834m2286a26231A50597c15574e4151K2245
17666c1906B57917c0005A97290c32282J55400G0444c3830j58031B47925l9210
17656B08715b415E3464K33029d62576a82374F223a1059C6272B025N1628b9955
17644G08K1614O6456N5387N8334E5081d08669D186K6309e1287A89530f1642A77834
$$ plain form
17724 -106388 -34217 -59095 164564 3208 -66286 -187300 140121 -234143 -8693 -489280 -85952
17712 -182952 68946 -2981 8316 -22149 -28609 -228230 203769 -173368 -50103 -63506 -65370 -61404
17700 -61404 171069 220697 220136 -75527 155394 107310 88714 -116860 367916 88330 -212396
17688 86033 -343367 -258641 -9234 -9790 384639 -442664 528195 332384 45739 288096 -181875
17676 -132239 277390 -42912 146396 161230 118944 -126231 150597 -315574 -54151 -31906
17666 -31906 257917 -30005 197290 -332282 -176882 70444 -33830 -191861 247925 208715
17656 208715 -2415 53464 286493 -462576 -182374 6223 -11059 36272 2025 53653 -29955
17644 708 22322 88778 144165 202499 55081 -408669 4186 30495 -51287 189530 -61642 177834
17631H7597K91869D7596O8949A7408a21486r9040j89310a02583A88916C5805a79776
17619b88635A78534G6373l849j7599M2575d6269B61583P4880b5645k6795j41722
17608a94162L834C5434J11938a23425A55900F2869c91338a58432M6220G0415j9861
17597E0554f9257B132a01135k8247e081B2758a2712A01711K1058N4360a7538A19921
17584B78731b636A19155a07015B53146N05o1687J7023D7605L8411a3674j41552
17573a55226o9695h342B25847q6000o0733a92785A06443J47101l1178b46224I0908
17561A92185O572e34417h0780o684A2725J62510K5985F3031a41267c7707A59626
17549A57533a20527B44678a83818I9260K06837e3583A28470J00789m0034J34874
$$ plain form
17631 87597 379466 47596 116545 17408 -121486 -220526 -409836 -102583 188916 35805 -179776
17619 -288635 178534 76373 72524 54925 97500 -46269 261583 336463 -25645 -52440 -194162
17608 -194162 -190328 35434 147372 -123425 155900 62869 -391338 -158432 -112212 70415 50554
17597 50554 -69257 2132 -101135 -129382 -5081 22758 -12712 101711 122769 177129 -17538 119921
17584 278731 -2636 119155 -107015 253146 253651 191964 208987 47605 86016 -13674 -155226
17573 -155226 -224921 -8342 225847 139847 79114 -192785 106443 253544 222366 -246224 90908
17561 192185 198757 -534417 -80780 -87464 12725 175235 201220 63031 -141267 -37707 159626
17549 157533 -120527 244678 -183818 99260 306097 -53583 128470 229259 189225 324099
17539C24099d5814I7145c09721l40198E8460i9473C00731C0870g9578C79128F0916
17527C32096A56286f7658G9883L5865L15925j69749j11550c0157B44258C9477
17516G0103i0195J9114J6582B32791A7486k882a12229B34944C6235d9372C21835
17504A86734J07748a15742B45460K16416p1258e3969B58132i1224C09329K28667
17494E37996A05237e7611B86498I6581d2409F24Q4740L64464j5433B02184C5135
17482B53730f1624j24959q2106C5506a17956a4723B35309N7700B2303d85A8192
17470B41959D5185L15628j40867a13531A35948a824G479N0493l896J5370J61697
17459B31143g823p248k92559D26883B10081i6391C26517r1834J96767B06446N0142
$$ plain form
17539 324099 -45814 97145 -309721 -649919 58460 -99473 300731 30870 -79578 379128 60916
17527 332096 156286 -67658 79883 115748 431673 261924 150374 -30157 244258 39477
17516 70103 -90195 -71081 -54499 232791 17486 14604 -112229 234944 36235 -49372 321835
17504 186734 294482 -115742 245460 461876 390618 -53969 258132 -91224 309329 537996
17494 537996 105237 -57611 286498 96581 -42409 624 85364 449828 434395 202184 35135
17482 253730 -61624 -186583 -268689 35506 -117956 -14723 235309 293009 22303 -485 18192
17470 241959 45185 360813 219946 -113531 135948 -1824 7479 57972 54076 69446 231143
17459 231143 -7823 -15071 -307630 426883 210081 -96391 326517 234683 431450 206446 256588
17448B56588C0138M47183j11977Q0419f4118I0014J95296J19573d8381C76760
17437A8951a6203D77915B06325K3863K44115e4269B67336L31532B04871L24123
17427E28994F1639L6502a297C71496J0426J82733d3720E39441f8964A07721f2219
17415B33881J86208J64546q6347j75578H8070C4534F041N90087A35469K24126
17405C59595a4620B19368J19070f2730C26466B2540b57845a19350E4940K72210
17395C27150A48215b56718H8267L27614a6086C10877c3807B61659j27015C4J37905
17384A37939J92080B9980J53120k4479B694L68768R1740a57838H4915J09600a85394
17372A34251a02767C2840f8564I9992l0352N5845J08170j14766a04667A53682
$$ plain form
17448 256588 30138 477321 365344 445763 -64118 90014 285310 404883 -48381 376760
17437 18951 -16203 477915 206325 230188 474303 -54269 267336 598868 204871 528994
17427 528994 61639 98141 -1297 371496 381922 564655 -43720 539441 -68964 107721 -62219
17415 233881 420089 584635 498288 322710 88070 34534 6041 596128 135469 359595
17405 359595 -14620 219368 338438 -62730 326466 22540 -257845 -119350 54940 327150
17395 327150 148215 -256718 88267 415881 -16086 310877 -33807 261659 134644 34 137939
17384 137939 330019 29980 183100 158621 2694 371462 463202 -157838 84915 194515 -185394
17372 134251 -102767 32840 -68564 99992 69640 125485 233655 118889 -104667 153682
17361C24819j529R0283j56393N6249F4841a97548C99186j15112P3282a26252B64145
17349A71149c2447B10736c39274A11422c6418j83623i6501D66445j74625L4739
17339C26559A08718g7096C83688a66236B16321i7280B85822o9466o0988F084L55383
17328C61467A18490C2561J09898a02802J1483p7987D08640A38266a3304C13585
17317A70919J44429c71681A50705M3861b26411D45899F1808N4150K24619D4350
17306B55039M0961j09071P2669r4988K7262a09394B97059A33203g1486A59915
17295C94506K1031a31430B70024Q7420E0640K77616j08020J71465A72898A8513
17284E52696j05859B225a63509b7838A08826l2913N3768N8034K19053A51645n6763
$$ plain form
17361 324819 323290 413573 257180 313429 64841 -197548 399186 284074 357356 -126252 264145
17349 171149 -32447 210736 -339274 111422 -36418 -220041 -96501 466445 291820 326559
17339 326559 108718 -77096 383688 -166236 216321 -97280 285822 216356 155368 6084 361467
17328 361467 118490 32561 142459 -102802 -91319 -169306 408640 138266 -13304 313585
17317 170919 315348 -371681 150705 194566 -226411 445899 61808 115958 340577 44350
17306 255039 296000 186929 259598 164610 191872 -109394 297059 133203 -71486 159915
17295 394506 415537 -131430 270024 357444 50640 328256 220236 391701 172898 18513
17284 552696 446837 2225 -163509 -27838 108826 75913 129681 187715 406768 151645 94882
17273I4882K20290J97041i9666D99473a18488B82831R3362L5539j25548I2969
17262A54731K9419E7872J76887P621O0497A50300L38975C7244J87710L9479j08418
17251A56015K72322g2514A33357o2921K49570J01148a50338B02269J09838A50272
17240B62707f1035A54444L5157c3886C46479a3814B06879A03421K29958A59236
17229C75925p3937D3796J95765a52832B65510j04645K87797j33668G1948J55435
17219B27383L0929F7108J81877A23499Q4307K66852A24128J06109j4114J75404
17209C91527G9682J49172K49890k10043R8174c849D08452J04016A70791L76156
17199E46947A85973p1034b03071A17744j0327J12681Q4646Q6815R5459B30492
$$ plain form
17273 94882 315172 512213 -99666 499473 -118488 282831 376193 411732 286184 92969
17262 154731 184150 57872 234759 242380 302877 150300 489275 37244 224954 264433 156015
17251 156015 428337 -72514 133357 70436 320006 421154 -150338 202269 312107 150272
17240 262707 -61035 154444 189601 -33886 346479 -13814 206879 103421 333379 159236
17229 375925 301988 43796 239561 -152832 265510 160865 448662 314994 71948 227383
17219 227383 258312 67108 248985 123499 207806 474658 124128 230237 216123 391527
17209 391527 79682 228854 478744 268701 366875 -3849 408452 512468 170791 546947
17199 546947 185973 114939 -203071 117744 107417 220098 304744 391559 487018 230492
17188G93382C09437K5249A31503J4769L20160j83669P8494J91738B38680L91137
17178F29817k67782n5713o0896F3090a99130D4985R9303K48872K2643j39519K83941
17167E60225k20777j0534K90136C04628P1350m1157l3363o7568K11668A51980
17156D91797j00972j24592f337p9725D74122A30845d6718A90907J40052L42440
17146F73399C04111p9096k9579R7964J26j37417b52953C72197M1212o9514J37087
17135D80982O2761j90411J60135n0751k28950L69640j97727m9843G3818M05118
17125D78936A98464k4485K89069j11561K98637r4632k69468J78615A54686N92202
17115G46888B23503K87407k15174J11941J11647O730B26815K06304j27895P8237
$$ plain form
17188 793382 309437 334686 131503 146272 466432 282763 361257 552995 238680 629817
17178 629817 362035 306322 245426 63090 -199130 44985 144288 393160 415803 276284 560225
17167 560225 339448 328914 619050 304628 375978 334821 301458 233890 445558 151980
17156 491797 390825 266233 -6337 -86062 474122 130845 -46718 190907 330959 673399
17146 673399 304111 225015 195436 293400 293526 156109 -252953 372197 413409 343895 480982
17135 480982 543743 353332 513467 462716 233766 603406 405679 355836 73818 478936
17125 478936 198464 173979 463048 351487 650124 555492 286024 464639 154686 746888
17115 746888 223503 510910 295736 407677 519324 526054 226815 433119 305224 383461
17105C83461A52733Q2465P1633K82839l6380k01187k1279j11930M24480A79046
17094D85486l323j61600R7586K09294q9474k38127K03467k15152L79Q816J12135
17083D09487L8427J4158J61801Q6284C41988J42988j10436M30170l22869m0413
17073D41428B09391O05148C74877n0260K29440k19657J06907K46521J66053C01749
17062F90360j9098N2448B45610L69634j21504Q0175K2205j79087A58930M76551
17052F35481k02391k3056J66706J23326k33158L29100j81626B44498O9900K46182
17042E60580k7602m1673K61514j31935B77760M31799k94190N61002r994k93637
17032F72740r9904j59616L45486j6216j18768K1231K04658q2477o5938L029j0849
$$ plain form
17105 383461 152733 235198 306831 589670 553290 352103 330824 218894 643374 179046
17094 485486 482163 320563 418149 627443 537969 299842 503309 288157 288536 297352 409487
17083 409487 447914 462072 623873 710157 341988 484976 374540 804710 481841 441428
17073 441428 209391 814539 374877 324617 554057 334400 441307 687828 853881 301749
17062 690360 671262 723710 245610 615244 493740 573915 596120 417033 158930 635481
17052 635481 433090 410034 576740 700066 466908 796008 614382 244498 314398 560580
17042 560580 532978 491305 752819 620884 277760 709559 415369 976371 966377 672740
17032 672740 572836 413220 758706 742490 623722 644953 849611 767134 701196 704225 693376
17021F93376l1827O5573l7468p9154m6551K35371q9061J63847j60416J42481j71388
17010F84783j143k4460J15287M0270m00223L86080k9223j74086l7009O2612N62033
16999A184921l98276k10317L52935k06267M6751j0284n7641N2453L2384J86153
16989I72812j37288K8105M565k29954O8207L33458n17051L99019L25529j42294
16979A105108j97050k7760p6088K78351m2087p7045K12925j58358m5712M11171
16969A383455m18474J15474K1177J4073k533O7263m7422K21629j99057j07079
16959A048506n2165R4841K76821n8174Q2888l44591K78677k09452J67398j12998
16949A171751m253K39153j7990R893P8339j60745l07204K03218n3276J54840R3448
$$ plain form
17021 693376 661549 727122 689654 610500 563949 799320 710259 874106 713690 856171 684783
17010 684783 683640 659180 774467 814737 414514 800594 771371 597285 560276 622888 1184921
16999 1184921 786645 576328 929263 722996 769747 759463 701822 754275 786659 972812
16989 972812 835524 863629 868194 638240 706447 1039905 522854 921873 1247402 1105108
16979 1105108 908058 880298 804210 1082561 1040474 963429 1176354 1017996 972284 1383455
16969 1383455 964981 1080455 1101632 1115705 1113172 1180435 1133013 1354642 1155585 1048506
16959 1048506 996341 1091182 1368003 1309829 1392717 1048126 1326803 1117351 1284749 1171751
16949 1171751 1167498 1406651 1388661 1398554 1476893 1316148 1008944 1212162 1158886 1313726 1407174
16938A407174l64272M44884j34957J52019L5396j51703J59186j43841j22243L60498
16928A642141k8539k53214J87696k8309N45732k39584l19610p4379M3626J23529
16918A599089J04459k11275K86258k37284J16506R3271K43546n50098K61023J1760
16908A717255J79923M03215n66359K97571K4038m9124j864L6026M9642j44292
16898A946031k17493J47182M11103K39390k59392l77612L38278l47990j51058
16889A728439O23313j16277M5286J23347k92151K97292J81388j21664J0547Q9290
16879B568810l9219k82823L52272R3900L60224o08306K65776p6916K92284J55663
16869C081665k3952l06811L85325O869k43291K91507j1546o0885R225q0977L18939
$$ plain form
16938 1407174 1042902 1487786 1352829 1504848 1540244 1388541 1547727 1403886 1281643 1642141
16928 1642141 1613602 1360388 1548084 1519775 2065507 1825923 1506313 1431934 1475560 1599089
16918 1599089 1703548 1492273 1778531 1541247 1657753 1751024 1994570 1444472 1705495 1717255
16908 1717255 1897178 2300393 1734034 2031605 2055643 2006519 2004655 2040681 2090323 1946031
16898 1946031 1728538 1875720 2286823 2526213 2266821 1889209 2227487 1879497 1728439
16889 1728439 2351752 2235475 2280761 2404108 2111957 2409249 2590637 2468973 2479520 2568810
16879 2568810 2529591 2246768 2599040 2692940 3053164 2444858 2710634 2633718 2926002 3081665
16869 3081665 3057713 2750902 3136227 3143096 2899805 3191312 3179766 3118881 3128106 3047129 3366068
16858C366068K97437q4522m1161j44572N07846j23505l59626q7474M58363K44836
16848D033690j50743J0874N3272J16803k24717M07852J08094L1770j97557M54585
16838D643923n822J43150o4538J97277k3190J97729k24252n6924N90495l64992
16828E032856K98823j07284L67464k2781J30750J53082R9115K93040j86389N16300
16818F574976k53976J54974L71655R4028M1918m5715K67003M42907j26965J47163
16808G667968M80088l3279Q3752J81309K1249Q64672k86300K59014K6630N67671
16798I832774J81904o9927P45883K28328J53142M23239J42904K67131n101O82976
16788A2583253J89624L42270N11434K37711M22095M60498M98736M63944L65709
$$ plain form
16858 3366068 3663505 3578983 3537822 3393250 3901096 3777591 3417965 3330491 3788854 4033690
16848 4033690 3882947 3893821 3947093 4063896 3839179 4247031 4355125 4386895 4189338 4643923
16838 4643923 4638101 4781251 4716713 4913990 4890800 5088529 4864277 4807353 5397848 5032856
16828 5032856 5331679 5224395 5591859 5569078 5699828 5852910 5952025 6245065 6058676 6574976
16818 6574976 6321000 6475974 6847629 6941657 6983575 6937860 7204863 7647770 7520805 7667968
16808 7667968 8148056 8114777 8198529 8379838 8401087 9265759 8979459 9238473 9265103 9832774
16798 9832774 10014678 9944751 10690634 10918962 11072104 11495343 11638247 11905378 11900277 12583253
16788 12583253 12772877 13115147 13626581 13864292 14286387 14746885 15245621 15709565 16075274
16779A6075274L32578L78106P22828O31893Q20841P802J025912N14452O63078
16770B1172764J119163N12242Q01178R01165R40212P22261J337431J013479R80831
16761B9500726J084499J465633J216510J256309J825171J383679J414844K058769
16753D1206140J914068K073560K014717K332418K179781K134667L259676K834259
16745E9949286L004840L357607L574778L702485L960694M056106M681444M395579
16737I0682819N368974N107529N633176N497730O183693O259308O601318O340024
16729A37674571O750587O619663O717164N910248N951128N601730M795095M349426
16721A84369612K736753K070714J040650J72277j094169k076243k855858m502342
$$ plain form
16779 16075274 16407852 16785958 17508786 18140679 18961520 18969322 19995234 20509686 21172764
16770 21172764 22291927 22804169 23605347 24506512 25446724 26168985 27506416 28519895 29500726
16761 29500726 30585225 32050858 33267368 34523677 36348848 37732527 39147371 41206140
16753 41206140 43120208 45193768 47208485 49540903 51720684 53855351 57115027 59949286
16745 59949286 62954126 66311733 69886511 73588996 77549690 81605796 86287240 90682819
16737 90682819 96051793 101159322 106792498 112290228 118473921 124733229 131334547 137674571
16729 137674571 144425158 151044821 157761985 163672233 169623361 175225091 180020186 184369612
16721 184369612 187106365 189177079 190217729 190390006 189295837 187219594 184363736 179861394
16713A79861394n134689n322734o000664o195000p179385o672075o653239o965708
16705A29737900o469719o592301o291452n741843n849334n173320n190262m585876
16697H3843793n002548l907792m221860l491954l606644k987637l206889l009120
16689E4409349k662489k618747k276294k175237k446850j571122k077460j373114
16681C7208036j578180j835327j342388j084206j536166j207313j195920j394411
16673B6034125p21418o76443j105065p29207o75052p74854q77252j037148n27283
16664A8910403p94267o17530m13556n00231m79856m78754m93461k61198n94275
16655A4277275l75015k12770p15860n42475m89936M3149n78400k76839Q446n15841
$$ plain form
16713 179861394 174726705 169403971 163403307 157208307 150028922 143356847 136703608 129737900
16705 129737900 123268181 116675880 110384428 104642585 98793251 93619931 88429669 83843793
16697 83843793 78841245 74933453 70711593 67219639 63612995 60625358 57418469 54409349
16689 54409349 51746860 49128113 46851819 44676582 42229732 40658610 38581150 37208036
16681 37208036 35629856 33794529 32452141 31367935 29831769 28624456 27428536 26034125
16673 26034125 25312707 24636264 23531199 22801992 22126940 21352086 20474834 19437686 18910403
16664 18910403 18116136 17498606 17085050 16584819 16104963 15626209 15132748 14871550 14277275
16655 14277275 13902260 13689490 12973630 12431155 11941219 11984368 11405968 11129129 11137575 10621734
16645A0621734n20212K32700l48256l59731j15377n37548l41390j74185N7621
16636H515356m93845J9689k39167j83023l04929L22012m87340n0292j88824j21369
16626F788268j30140j99148k08890K4137p9722l98252L8220k1912l18517L21728
16616E815772n24693L24416o51705P3346K77602n16985r0263K60173r808o19324
16606D338531j09257L46738l46341J07900l45809L0059k6062k85753K04127o3733
16596C850400J45633o42858K97631n1206l88454L99915l14503k39990K76556k86415
16586C046709R5137J86642n32943M20184k41605L4044N8201k79377J23436k24053
16576B686375K09286k22246K49492j68565J62429m61323L84918n98425J38561
$$ plain form
16645 10621734 10101522 10334222 9985966 9626235 9510858 8973310 8631920 8457735 8515356
16636 8515356 8021511 8041200 7802033 7619010 7314081 7636093 7148753 7098461 6909637 6788268
16626 6788268 6658128 6458980 6250090 6274227 6194505 5796253 5834473 5812561 5494044 5815772
16616 5815772 5291079 5615495 4963790 5037136 5314738 4797753 4707490 4967663 4957855 4338531
16606 4338531 4229274 4576012 4229671 4337571 3991762 4021821 3995759 3710006 3914133 3850400
16596 3850400 3996033 3353175 3650806 3599600 3211146 3611061 3296558 3056568 3333124 3046709
16586 3046709 3141846 3328488 2795545 3215729 2974124 3008168 3066369 2786992 2910428 2686375
16576 2686375 2895661 2673415 2922907 2754342 2916771 2455448 2840366 2241941 2380502
16567B380502j13743K43854k17953Q4924k67821j6371j26548L85212j61981l84829
16557A805246L3892o3179M01158k27203N640j95615J67503j78394k60418L47084
16547A835714k24048l10584N67511k41375O5118o071K43709k01901Q7232j41621
16537A673684j7792N5461l55240K75718k47244k34453J79888o3455R9741K0224
16527A386532k10270N92214n98343N55183k05473j98488K9403J66399j67889N1655
16517A400923n5231p3362N3802l48612K40396j29090K38449j46839q2644J24571
16507A222363j32329k8082J95535k91468J69743J3573k02754j86991N56248j04451
16497A211387j12904l10458N76893l5550l92132l8607J88948l00948j55237L19159
$$ plain form
16567 2380502 2266759 2510613 2292660 2377584 2109763 2093392 1966844 2352056 2190075 1805246
16557 1805246 1839138 1775959 2177117 1949914 1955554 1759939 1927442 1749048 1488630 1835714
16547 1835714 1611666 1301082 1868593 1627218 1692336 1686265 1929974 1728073 1815305 1673684
16537 1673684 1655892 1711353 1356113 1631831 1384587 1150134 1330022 1266567 1366308 1386532
16527 1386532 1176262 1768476 1170133 1725316 1519843 1321355 1350758 1517157 1349268 1400923
16517 1400923 1345692 1272330 1326132 977520 1217916 1088826 1327275 1180436 1097792 1222363
16507 1222363 1090034 1061952 1257487 966019 1135762 1149335 946581 759590 1315838 1211387
16497 1211387 1098483 788025 1364918 1329368 937236 898629 1087577 786629 631392 950551
16487I50551J76224k03960K03814k91862L13511k81572J55628q7402q5289K5130
16477H74773J02010k95449N6822J15437L79802l79998r7540K36316D19170M84529
16467I03699j97445M5565j36381L04911j41933B58412K07181L11202k97982L37699
16457H16512n1722r7880J20878L848l299j56401o1576m3938K20007j19149j888
16446F25392j0482Q2041J26173j00080l13460R0192K18684j65530m6944L56553
16436H62539l81858J80408C00268K27716j17782K32098j02832J94256l43007J07873
16426D98590K06620B36953J24360R3013k0304P4323n2604Q7867p9714L40582l88529
16415D15947O2744p1727L17012k7636k50903J81677q3916j46417m8681K74875
$$ plain form
16487 950551 1126775 922815 1126629 834767 1148278 866706 1022334 934932 849643 874773
16477 874773 976783 681334 738156 853593 1233395 853397 755857 992173 419170 903699
16467 903699 706254 751819 615438 920349 778416 258412 465593 776795 478813 816512
16457 816512 764790 666910 787788 791636 788337 631936 570360 526422 746429 627280 625392
16446 625392 614910 696951 823124 723044 409584 499776 718460 552930 505986 862539
16436 862539 480681 661089 300268 527984 410202 642300 539468 733724 390717 498590
16426 498590 705210 236953 361313 454326 434022 508345 455741 543608 463894 804476 415947
16415 415947 478691 406964 723976 696340 445437 627114 543198 396781 348100 622975
16405F22975J5691k25989r7140K35710k60678R4748p3876J91653j24366L26219
16395G04947C17498F9301O7519M17171k5782o4864J29461j21015j14631Q9438
16385D46598R7396j98744G768K22368Q7853K53772k76609J36893J9060j53012
16375B98093O3415L1208A89343K35488k2640J28557J15295B07524F5225K49691
16365C14916J00155j18212J26580N8302j84686k8224N1889l9581c08647B76030
16354A17464K85854R6584K7033B47229j7970D6898M76239j833k3183j46942G2325
16342A57448k9429o2030b3495A57502J36412P7756A50381J02165J41116K36540
16332F30202A66839J22392J40789j99335N4334q8412j5476J85450j41840K9751
$$ plain form
16405 622975 638666 412677 315537 551247 290569 385317 311441 503094 378728 704947
16395 704947 317498 69301 136820 553991 528209 463345 592806 471791 357160 446598
16385 446598 543994 345250 7768 230136 317989 571761 295152 432045 451105 298093
16375 298093 361508 392716 189343 424831 402191 530748 646043 207524 65225 314916
16365 314916 415071 296859 423439 481741 297055 268831 320720 281139 -308647 276030
16354 117464 403318 499902 526935 247229 229259 46898 523137 521304 498121 351179 72325
16342 157448 128019 65989 -23495 157502 293914 371670 150381 252546 393662 630202
16332 630202 166839 289231 430020 230685 285019 196607 181131 366581 224741 254492
16322B54492h2855A83366K16139j1440G2644L26248A43264J79745G6299K72631
16312C48930B9733K46467o091o8313P162b1072C20874A21727R7529g9257p482
16301h6739H6969l2200J67833c00142C19687n185J81070f6214A34075F2276b8929
16289B99659n0074a4344A74104R2327J2898A13625E4253K96902a51817C8760a35203
16277F6021f9153B75019L0881b55826C02982I4711d0939B19230J21415I3552e8977
16265A73122K10510a50527C14794A2124L41985j5367b8738h22A45450J22583e0601
16253A27372C6549Q9204M70686B94673o2839E6622J6036N2228J90625e9330J9090
16242d0240j4019C92371J13218E1955K4941J64588j19831a01842r490A67304L151
$$ plain form
16322 254492 -82855 183366 399505 388065 72644 398892 143264 323009 76299 348930
16312 348930 29733 276200 270109 201796 208958 -21072 320874 121727 219256 -79257 -86739
16301 -86739 86969 54769 222602 -300142 319687 314502 495572 -66214 134075 62276 -28929
16289 299659 249585 -14344 174104 266431 279329 113625 54253 351155 -151817 38760 -135203
16277 66021 -69153 275019 305900 -255826 302982 94711 -40939 219230 340645 93552 -58977
16265 173122 383632 -150527 314794 12124 354109 338742 -28738 -822 145450 268033 -50601
16253 127372 36549 125753 596439 294673 231834 56622 72658 124886 315511 -59330 -40240
16242 -40240 -54259 392371 505589 51955 76896 241484 121653 -101842 -111332 167304 170455
16231A70455C5828O7520f7761A16350a18863D13214a52157B73763C4672J95863
16221B30535E2579K37670j26685K2017G1753B6163N6462J04140a15322C59278
16210A11398K34172a1812F8552O7022A7647K67153j10468H0664J13291M48141
16200F42096B40816G0145a84812a7060M500A4107L27535A63858d1169C40073E7115
16188h4987C3930a57374K4974F8744h1814B48907j22805a056A86370k2043L8862
16177B03189a07061B47651B0653L28108H2653e030A2167a27442p8281K092A22785
16165A48259e2636B8610b65677o5865C64465d9817n2967C0183K89536j02793F0271
16153A16580e0050B14817d60801e9583A42878a11988B40753b5002B58984R6630
$$ plain form
16231 170455 35828 103348 -67761 116350 -118863 413214 -152157 273763 34672 230535
16221 230535 52579 290249 163564 185581 71753 26163 82625 186765 -115322 359278
16210 111398 345570 -11812 68552 135574 17647 284800 174332 80664 193955 642096
16200 642096 240816 70145 -184812 -17060 -12560 14107 341642 163858 -41169 340073 57115
16188 -84987 33930 -157374 -132400 68744 -81814 248907 126102 -1056 186370 164327 203189
16177 203189 -107061 247651 20653 348761 82653 -5030 12167 -127442 -205723 -203631 122785
16165 148259 -52636 28610 -265677 -331542 364465 -49817 -102784 30183 319719 216926 60271
16153 116580 -50050 214817 -460801 -59583 142878 -111988 240753 -25002 258984 355614
16143C55614j20751g2433D5477L56412B59Q8572M3333a41582J0912B1498b5833
16131d7001B74597k5672h7462B64048c79766d7973a1608C00544h7467C0496J4862
16120D5358L9664b36679c4339A62379D691J70240J35668l9122c6656j97516A33089
16108i613p4666c1597j7986F3253k6778d459I3156M06193H8701a97275A6548f1660
16095A40907K5155B3858K49303E0927a41034r6984C47227d0158I0794P7175J07098
16084B75067d01246J08515k3153A06121F727J94186d0160o7360A39293b186j07422
16073a09608d6617I3043a43957p4583B45249a28155B1266J42708b72376F6832
16062a80527a9887C0375a06043A30153a82721J1010F7621b64063A40610J74393
$$ plain form
16143 355614 234863 -72433 45477 401889 259 88831 132164 -141582 -130670 21498 -25833
16131 -47001 274597 248925 -87462 264048 -379766 -47973 -11608 300544 -87467 30496 45358
16120 45358 85022 -236679 -34339 162379 4691 174931 310599 271477 -36656 -234172 133089
16108 -9613 -84279 -31597 -49583 63253 36475 -4459 93156 499349 88701 -197275 16548 -61660
16095 140907 166062 23858 273161 50927 -141034 -238018 347227 -40158 90794 167969 275067
16084 275067 -401246 -292731 -315884 106121 6727 200913 -40160 -107520 139293 -2186 -109608
16073 -109608 -46617 93043 -143957 -218540 245249 -128155 21266 163974 -272376 66832
16062 -180527 -19887 30375 -106043 130153 -182721 -171711 67621 -264063 140610 315003
16052C15003p9425e5585B83320p0308b5385A95514a8765A86618F1486g6317B20305
16040B098J88013J63368A4944b93063b1251k3970I3741r875C9921J27771n3591
16029A14101J51037b05951g026j69033P0992q2470j46103C08721A03618c16221
16018A16160I822c02103A1355L01919j41834b30268d4159m8500k301C25773q4560
16007B41213b11967B72441r3683i4779F935L04823g9627C54408G7540b53521b5821
15995a5033B15584a93955I1946c42982a20215j7056B8011f9520o0457C91419c02338
15983d7904B51638a60048C64559k6409B7516J86383D2567f1248B60492b6829D99890
15971a68132P0487b4273A77262a6526B00712b23691a04583j45647j85899J86214
$$ plain form
16052 315003 235578 -55585 283320 213012 -25385 195514 -18765 186618 61486 -76317 220305
16040 2098 190111 353479 14944 -293063 -21251 -45221 93741 83866 39921 167692 114101
16029 114101 265138 -205951 -7026 -176059 -105067 -187537 -333640 308721 103618 -316221
16018 116160 9822 -302103 11355 313274 171440 -230268 -44159 -92659 -94960 325773 241213
16007 241213 -211967 272441 178758 -94779 6935 311758 -79627 354408 77540 -253521 -25821
15995 -15033 215584 -193955 91946 -342982 -120215 -137271 28011 -69520 -129977 391419 -302338
15983 -47904 251638 -160048 364559 338150 27516 213899 42567 -61248 260492 -26829 499890
15971 -168132 -97645 -24273 177262 -16526 200712 -223691 -104583 -250230 -436129 -249915
15961b49915e6977l3433B27492h7415J5215A93091G3408H233g6381C368K3759
15950B7127b20476A0895c85574d6605C41507e9947F0954A9768a24901A49518n8240
15939I1278C2912h2015k98823c4439J4319n8655I7940a58530L9450a9003B33721
15927D965b12529p4528i461B30170c85616a55183B0080a50274A5015b88495A30735
15915b12490q9069e9522j53327D716d7795j12307M4699B51626b86543a5706A16431
15903h0126j14370H3350M3868F0829e4171D7700a84580A25261C9030P3244J56360
15892B68634D7266c07287B91898a37058M0376M006A9091C601a32616H5024J63870
15881B48894b04503j48342b5960j41221o8240d8060j06509a8816C04986e6742
$$ plain form
15961 -249915 -56977 -90410 227492 -87415 -72200 193091 73408 8233 -76381 3368 27127
15950 27127 -220476 10895 -385574 -46605 341507 -59947 60954 19768 -124901 149518 91278
15939 91278 32912 -82015 -380838 -34439 -20120 -78775 97940 -158530 -119080 -19003 233721
15927 4965 -212529 -287057 -9461 230170 -385616 -155183 20080 -150274 15015 -288495 130735
15915 -212490 -301559 -59522 -212849 4716 -47795 -160102 -115403 251626 -286543 -15706 116431
15903 -80126 -194496 83350 127218 60829 -54171 47700 -184580 125261 39030 112274 268634
15892 268634 47266 -307287 291898 -137058 -96682 -92676 19091 3601 -132616 85024 248894
15881 248894 -204503 -352845 -25960 -167181 -235421 -48060 -154569 -18816 304986 -56742
15870H7929i1884o8840A2018a43643e3667K4943B6532Q6446b5254j44133A13309
15858F1904a4532G0022a36355N0790j38900F0319c6797j52775L5659A31443K42891
15847C74334d8145m6533j22107a08071l04903h8499K4347A31891b9006i589j09240
15836a18829A17919B9610R2503a37969B53205k5447H6323a70769G8606a15116
15825C20240c29459F6577k0952a75423N7625D2244d9390l8555H8619b99774a04326
15813B32083a25660l21104d2557A70553F4278g0308j91868B0681b51583J00508
15803a51075R427G4127Q6105r758d1075C05992c17193P3337M4184B54033o2741
15792A91292a7194B03829B7487b36463H2511b90616A81146E7407P8797a74675
$$ plain form
15870 87929 -91884 -160724 12018 -143643 -53667 -28724 26532 112978 -25254 -169387 113309
15858 61904 -14532 70022 -136355 -85565 -224465 60319 -36797 -189572 -153913 131443 374334
15847 374334 -48145 -94678 -216785 -108071 -412974 -88499 -64152 131891 -29006 -9589 -118829
15836 -118829 117919 29610 122113 -137969 253205 227758 86323 -170769 78606 -115116
15825 320240 -329459 66577 45625 -175423 -117798 42244 -49390 -87945 88619 -299774 -104326
15813 232083 -125660 -446764 -42557 170553 64278 -70308 -262176 20681 -251583 -151075
15803 -151075 -141648 74127 160232 150474 -41075 305992 -317193 -243856 -199672 254033 191292
15792 191292 -17194 203829 27487 -236463 82511 -290616 181146 57407 136204 -174675
15781a29222L3296q349j76268J17921I6117M3524J02431D8486B1039d3827J5833
15770b7994b199A39802j0733K5390a51102A89924a0374j43111e7330A39035j1151
15759A27884O289L09856F5691M379K35714i6023H0979O090a01577H4856h7979
15747C5713g7844B12373K3759g1582B1351K0629J6779a25228A1957i9898d3548
15735a35121E2051J34181K08426I1034h8690J3878C7557K34762a08539d2237q456
15724e0693A67568a77099A41960L34826c1494l3693A10643b3003M183A19715a05806
15712A8639O4604a76009A7558b84007D4906M855J5543Q5829p3579J03423a9354
15700a29746p4416I75J7201b75339j86732H3302J56819e1964C24201A26361F438
$$ plain form
15781 -129222 -95926 -104275 -280543 -162622 96117 139641 242072 48486 21039 -43827 -27994
15770 -27994 -2199 139802 129069 154459 -151102 189924 -10374 -153485 -57330 139035 127884
15759 127884 134173 444029 65691 70070 305784 -96023 80979 87069 -101577 84856 -87979
15747 35713 -77844 212373 236132 -71582 21351 41980 58759 -125228 11957 -99898 -43548
15735 -135121 52051 186232 394658 91034 -88690 -74812 37557 272319 -108539 -42237 -50693
15724 -50693 167568 -177099 141960 476786 -31494 -65187 110643 -23003 -18820 119715 -105806
15712 18639 83243 -176009 17558 -284007 44906 49761 65304 151133 77554 180977 -19354
15700 -129746 -204162 975 18176 -275339 -462071 83302 240121 -51964 324201 126361 6438
15688B64670G1542M230K24768a59776B5663J10056b6987o9608D3131F056K43170
15677B49226b21599H1821B7744f535j08395G8325K46421a4359G0475R6444d9517
15665c82909d1025l12459C38370g6025j8414D0473r370a4317j03604A13788l913
15654A09875b06356m2163E4505A1608a60699A08922a30432A68624J6539c0605
15643E1996j4500i0331B1565J30887A934a94160L6913M2159I7548h923j54887
15632a63810A44334m6319d2961j6657k33327D9117Q8572c4985B06896H1102a12410
15620c4171C793f5434j8526H1428k9903b07438A11560e03570C05619a48703a1396
15608A47677f3190A54107E4459i3722q6555B1300h8735K4442j81099N3555l6498
$$ plain form
15688 264670 71542 75772 300540 -159776 25663 135719 -26987 -96595 43131 6056 249226
15677 249226 -221599 81821 27744 -6535 -114930 78325 324746 -14359 70475 166919 -49517
15665 -382909 -41025 -353484 338370 -76025 -94439 40473 31103 -14317 -117921 113788 109875
15654 109875 -206356 -248519 54505 11608 -160699 108922 -130432 168624 185163 -30605
15643 51996 37496 -90331 21565 152452 1934 -194160 -157247 -115088 97548 -8923 -163810
15632 -163810 144334 98015 -42961 -59618 -292945 49117 137689 -34985 206896 81102 -112410
15620 -34171 3793 -65434 -83960 81428 51525 -207438 111560 -503570 305619 -148703 -11396
15608 147677 -63190 154107 54459 -93722 -180277 21300 -88735 -64293 -245392 -191837 -228335
15597b28335H3770h2749K7935C9097Q4431J23215H9866a665j95377D5555b10184
15585c15908f8813m5054M3415H6127J26636b06739F1973J20402d0974B7582b09960
15573D0920a1878E9671c43632I9074b26246B32103a6781m9057G337M6396J97746
15562B51479l0798r801J63372A41347c352C92171a0774C4699b90568a40586o2300
15551b02886f8667A91181c06520J52112B00934a95387B69232A05061a21558A27189
15540A15993j862a11154B36794a53355A10230a64463j65737H7716N3651L4203
15530A75570a56285A34195K00439a90082H2824b88775J39336A63330a7833j67147
15520a84980K0441H7140L03689f8536J560B37321A2629N7872e3315l30181A13605
$$ plain form
15597 -228335 83770 -82749 -54814 39097 123528 246743 89866 -1665 -197042 45555 -210184
15585 -315908 -68813 -113867 -70452 86127 212763 -206739 61973 182375 -40974 27582 -209960
15573 40920 -11878 59671 -343632 99074 -226246 232103 -16781 -65838 7337 53733 251479
15562 251479 220681 210880 374252 141347 -3352 392171 -10774 34699 -290568 -140586 -202886
15551 -202886 -68667 191181 -306520 -154408 200934 -195387 269232 105061 -121558 127189
15540 115993 114131 -111154 236794 -153355 110230 -164463 -330200 87716 141367 175570
15530 175570 -156285 134195 334634 -190082 82824 -288775 -149439 163330 -17833 -184980
15520 -184980 -164539 87140 390829 -68536 -66976 237321 12629 70501 -53315 -383496 113605
15508b67432e882l2823k05533a4841C28296b13107P7669A7154b13105K375l6455
15497b47185D3190f1917B40140h9209C80056E2063J7563J96311j12207m8480C8128
15485d6117B1298k516h3868D7607j0815n08L47989c0943m0183k46624J02497E5130
15472A71260b44395C42520A1144b12865A99331J96104A04413a09163q7265G4475
15461d32961a4376l00474N1230N2126d1930k7880H2006J45808G7270K901L624
15450H3795L1732a0194A89188h837k29949g1383F0747k7465b8826j27571A17046
15438C6254K5345R3519i2559B39347d6207k17156B07709b46941B7082c6236k77763
15427c13999a6476m06394B08284r5240H802b02490k51104a30449H4764b8643E4204
$$ plain form
15508 -267432 -5882 -38705 -244238 -14841 328296 -213107 -135438 17154 -213105 -210730 -247185
15497 -247185 43190 -61917 240140 -89209 380056 52063 69626 265937 153730 105250 38128
15485 -46117 21298 18782 -83868 47607 36792 36284 384273 -30943 -71126 -317750 -215253 55130
15472 171260 -244395 342520 11144 -212865 199331 395435 104413 -109163 -196428 74475
15461 -432961 -14376 -314850 -263620 -211494 -41930 -69810 82006 227814 77270 80171 83795
15450 83795 115527 -10194 189188 -8837 -238786 -71383 60747 33282 -28826 -156397 117046
15438 36254 61599 155118 -92559 239347 -46207 -263363 207709 -246941 27082 -36236 -313999
15427 -313999 -16476 -422870 208284 113044 8802 -202490 -453594 -130449 84764 -28643 54204
15415a8750k77815A63483H0627d66051a02561H4899g8650B9152J38211e9865I4922
15403A22230E2133b27393o4250H7105J04143J62061d758A46620M73687A09403
15392g532m17564C20703b5555B63311b05647b5380l1941K2384l27084a19738M9311
15381g0427D3357a16677k09918H0911l5903K5335g2157G0307g5007k3808k63985
15370c62800A59223a77837A38688c9276A85375A1643J60448b87659j17561A01619
15359I3075b51744r9907a36836C89822D231g6844J8168b6204j75190A647Q4099
15348H5746e8023K925D71907D0829A0373P9709K72128a55483A84735b21976k0663
15337b42639e0693I7537J16847C6624m99b61953G4648a96161m932C36073A58740
$$ plain form
15415 -18750 -296565 163483 80627 -466051 -102561 84899 -78650 29152 167363 -59865 94922
15403 122230 52133 -227393 -291643 87105 191248 353309 -4758 146620 620307 109403
15392 -7532 -425096 320703 -25555 263311 -205647 -25380 -57321 -34937 -362021 -119738 -70427
15381 -70427 43357 -116677 -326595 80911 45008 70343 -72157 70307 -75007 -98815 -362800
15370 -362800 159223 -177837 138688 -39276 185375 11643 172091 -287659 -405220 101619
15359 93075 -251744 -351651 -136836 389822 4231 -76844 -58676 -26204 -201394 1647 85746
15348 85746 -58023 -55098 471907 40829 10373 90082 362210 -155483 184735 -221976 -242639
15337 -242639 -50693 97537 214384 36624 36125 -261953 74648 -196161 -201093 336073 158740
15325H4934N9323F596Q566J52840C3447E015O9935J25177b64940j71783A56745
15313i5783A52570N3291J9498a58534A48311E0152N02447c28137D0332a32135
15302A513b26177a06523D87398A86330a55743B69581l2881l634O1310o8536J71814
15291C97654G7527b4312j78466O2389B20775J1607j10162a59869B40340I2476
15280h204m78888B95085J2814H8071D3787L66912I6517J19407m4762M9591d7391
15268D2260N5578c3975E2407J63723C7546P1715L39329d0982C68907b8014k44737
15257b72751C84392A77680J64562D0069J81720p8813a15198F2694K5802R10015
15247I98511P84630l38553L8356k36508n27061l01795A27655J88579a25020A35701
$$ plain form
15325 84934 144257 6596 15162 168002 33447 5015 74950 200127 -264940 -436723 156745
15313 -95783 152570 205861 225359 -158534 148311 50152 552599 -328137 40332 -132135
15302 1513 -226177 -106523 487398 186330 -155743 269581 236700 233066 294376 225840 397654
15291 397654 77527 -24312 -202778 -140389 220775 232382 122220 -159869 240340 92476
15280 -8204 -487092 295085 307899 88071 43787 410699 96517 215924 171162 220753 -47391
15268 42260 97838 -33975 52407 216130 37546 109261 448590 -40982 368907 -28014 -272751
15257 -272751 384392 177680 342242 40069 221789 142976 -115198 62694 88496 998511
15247 998511 1783141 1444588 1482944 1246436 719375 417580 127655 316234 -125020 135701
15236h4273D4205J84100a2616k13140A24050E0050a86703n6556a12112I0385a06523
15224c1705o0707C29352E6541b7822A72867h8342J0287E9073A8336b1722F4088
15212C4223a82781R204H7463h4587j4597A05206c1280C9861N5214e34666C41918
15200f4466j87979B30105c44884h0516A37095J8651H54N7082a16350B28600r6145
15189A32455d2209A80337a5461n5011c917r3893h085B11863b37990P6884g2007
15177B98459F2832L40207I5913R7425E6480a09188p7546K5365D21044F2954A551
15165d4192I8097B2378a05341A68270B572L6959J62884L21493k47590b32991A47995
15153B30351l4991M3047l2296A02452m7229J15519C8525J59834P5657C4005c5528
$$ plain form
15236 -84273 44205 228305 -12616 -225756 124050 50050 -186703 -243259 -112112 90385 -106523
15224 -31705 -92412 329352 56541 -27822 172867 -88342 -78055 59073 18336 -21722 64088
15212 34223 -182781 -173577 87463 -84587 -99184 105206 -31280 39861 95075 -534666 341918
15200 -64466 -252445 230105 -344884 -80516 137095 155746 854 57936 -116350 228600 132455
15189 132455 -42209 180337 -15461 -70472 -3917 -97810 -8085 211863 -237990 -161106 -72007
15177 298459 62832 403039 95913 193338 56480 -109188 -186734 -161369 421044 62954 1551
15165 -44192 98097 22378 -105341 168270 2572 39531 202415 523908 276318 -232991 147995
15153 230351 195360 238407 206111 102452 55223 170742 38525 198359 274016 34005 -35528
15141D7048j5484M047J31823A9127c8525B65911K7218A18706m9209a41260C27999
15129e9551k53240I7751b1003I278J33354k0033D4333a95967A31154J81536p5664
15118B37026J3062K6074c6018A18107O2668a01036E58842A60379b78407a8195
15107B94772Q66E4705A9278J81264I2057J55856f6897C70838j08741a18374I9902
15095C11394H7287N6691J091n1718m2792L88059A9053J65550j1493K0766f230
15083A45777h716A34352A8235K49809M6161A04431b7346f066C07914g490q9564
15072i7054A57323E2954J61421H4905f7660A86321a59135c0261j1562B94464C7207
15060C40924A40383m1740g1076j8792I6547J82464B4029K00194n2234P8161H4535
$$ plain form
15141 47048 31564 35611 167434 19127 -38525 265911 293129 118706 69497 -141260 327999
15129 -59551 -312791 97751 -21003 9278 142632 122599 44333 -195967 131154 312690 237026
15118 237026 250088 276162 -36018 118107 180775 -101036 558842 160379 -278407 -18195
15107 294772 295638 54705 19278 200542 92057 247913 -66897 370838 262097 -118374 99902
15095 311394 87287 143978 145069 93351 50559 438618 19053 184603 173110 193876 -6230
15083 145777 -8716 134352 18235 268044 314205 104431 -27346 -6066 307914 -7490 -97054
15072 -97054 157323 52954 214375 84905 -67660 186321 -159135 -30261 -41823 294464 37207
15060 340924 140383 98643 -71076 -89868 96547 279011 24029 224223 171989 250150 84535
15048B58239n3153J37501H9724Q5627L7956r1679K54442C8021J78218k4579K8172
15037B19832E6294b6103B70150b70628C65055e7520B2056J43194J2425J35443
15027C13118B5543J07173J37038C8399J23546l1323l5857A5192K06978Q3056K1402
15016C26628A48295b13710B66831r8235L51626A18650l5376C8242J72849D0880
15005A02650K6960R905D9179J93762J29171a69681B75077j4552O3270a59708C80519
14993A66212p3091D5935J87522L86598A62698q792d5359A45008J12210k4026B274
14981A53341N4078k9747J38706I3630R0003g1170B54721R7312j43152H8787L4639
14970A23426L9835j4492O1774B6923L95310N938j7293K12487A70243A0308O83393
$$ plain form
15048 258239 205086 342587 89724 175351 213307 121628 376070 38021 216239 191660 219832
15037 219832 56294 -26103 270150 -270628 365055 -57520 22056 165250 177675 313118
15027 313118 25543 132716 269754 38399 161945 130622 94765 15192 222170 305226 326628
15016 326628 148295 -213710 266831 168596 520222 118650 83274 38242 211091 40880
15005 102650 129610 139515 49179 242941 372112 -169681 275077 260525 323795 -159708 380519
14993 166212 93121 45935 233457 620055 162698 153906 -45359 145008 257218 233192 2274
14981 153341 207419 177672 316378 93630 183633 -71170 254721 352033 208881 88787 123426
14970 123426 163261 148769 210543 26923 422233 428171 410878 623365 170243 10308 693701
14959F93701a23249C05360Q2460r2054B8647R8624J24057o8703K74815J57289
14949F14729B1945K52739L6P0439b18748C86164Q1726a42959E06454H2431K49461
14938C31892p8765J59458r8234A5182N64340k45974j48455J48191A52042O387
14928A58429J15598A18878K35261J50103A23888m9330N3041n7159N29435k41412
14918C58463J43648B38868q2546K45892A20817L37354j60781K6335Q3614F8126
14907C75743L3337j60124l1889K61342n290A78110J01162J59069A36052M73471
14897F09523A98205l216N14723B07994L89622B49416L03120B18968J16248q076
14887C27140k1320N0798J27426n5115Q6666k16971M68612B88978R9722J25427
$$ plain form
14959 693701 -123249 305360 387820 295766 28647 127271 251328 182625 457440 614729
14949 614729 21945 274684 274720 345159 -218748 386164 467890 -142959 506454 82431 331892
14938 331892 253127 412585 314351 15182 579522 333548 185093 333284 152042 158429
14928 158429 274027 118878 354139 504242 123888 74558 127599 70440 599875 358463
14918 358463 502111 238868 156322 402214 120817 458171 297390 323725 407339 68126
14907 375743 409080 248956 217067 478409 473119 178110 279272 438341 136052 609523
14897 609523 198205 194989 709712 207994 597616 249416 552536 218968 335216 327140
14887 327140 305820 356618 484044 428929 515595 298624 767236 288978 388700 514127
14877E14127q4955p030A830O16401A62184j4587L47257n4717A33442K90619M0298
14866D64359r2220q3689J0578j0970P5128J11195K41579l56930J30885k4555L17048
14855G82408H9567M58126o3936n0297M2727J34347j21518K7386M0716k6270A34955
14843D51646K80427l9488C26241J49794H8327L14546m145J69175D0205N0793L09644
14832D00642J57542J77313j23886k03353J884J70723j2505k81567L64784p3743
14822E77834B41464M98325k58169p7395J26162m0304j39186j63079L72544P3146
14812F33508l5662Q6065m7968o7655J64923A55670L44479l1694M87055D67374
14801D26853G7167O92604C65376K59421j58639l9740n33L11500J83840D25205
$$ plain form
14877 514127 429172 422142 1830 618231 162184 147597 494854 440137 133442 424061 464359
14866 464359 372139 288450 299028 288058 363186 474381 715960 359030 489915 465360 782408
14855 782408 89567 547693 483757 433460 476187 610534 489016 516402 557118 530848 134955
14843 451646 732073 692585 326241 476035 88327 402873 398728 567903 40205 90998 400642
14832 400642 558184 735497 611611 408258 410142 580865 568360 286793 651577 577834
14822 577834 241464 739789 481620 404225 530387 490083 350897 187818 560362 633508
14812 633508 597846 683911 635943 568288 733211 155670 500149 468455 955510 467374
14801 426853 77167 769771 365376 624797 466158 426418 425885 737385 921225 425205
14790F62398j30764J27526k80287n0267K85710k26627L06523j53532m5420O4117
14780E59377M38911m56503B43029J81055k3394J86965j22696N67757l38620Q8388
14770G82484J11285C80980J67611K65265C81744J83782P3061k6123M57850D73390
14759A59105O82919k95098J66679j79984R0508j1780L21145k60932m0460p7947
14749E54155R6519K43456k65880L5599l23652K16801J52943J20569l0533r6568
14739G03409J20016K72915m33022J32532L36405m01069k35282O6473J85592O365
14729G54334K25304K7313N0011l41679R9425P0725l00945Q7323O42886E25107
14718I33345r6513J98984M0418n15096p910K08567k57979N07426m08529O80667
$$ plain form
14790 662398 531634 659160 378873 328606 614316 387689 694212 540680 495260 559377
14780 559377 998288 541785 243029 424084 400690 587655 464959 1032716 694096 782484
14770 782484 893769 380980 548591 813856 381744 565526 638587 612464 1070314 473390
14759 159105 842024 546926 713605 533621 624129 612349 933494 672562 632102 554155
14749 554155 650674 894130 628250 663849 340197 556998 709941 830510 799977 703409
14739 703409 823425 1096340 663318 795850 1132255 731186 495904 562377 747969 754334
14729 754334 979638 1006951 1056962 715283 814708 885433 584488 671811 1314697 525107
14718 933345 836832 1035816 1076234 561138 553228 761795 503816 1011242 602713 1283380
14708A283380E59026K77674J4297L51065j30151k3218j47674Q8678m83621L16424
14698H22500j87261K07968K36119l74851M2609L93932K26384m54240J11891j77250
14688H47801M35340k40114J14296m55391R6029K53515k9847j47826K38851M8066
14678A160720L3312m7589N8490l56157R172K89862l36290J23439J03668J15436
14668A154063N8152l67641n7224L20422J33957L9131n3268K24071j79516l8837
14658A233310k58398p3K54157j90570J75301l6886O7417J15723q8911j5768q021
14647A247281j63968J40219j14042K61912K605R4424k72399J51316K56036l70886
14637A232498K63802q5082p1938J06122M129j5531J20305j3948j31646l1421J6597
$$ plain form
14708 1283380 559026 836700 850997 1202062 1071911 1048693 901019 989697 506076 822500
14698 822500 635239 843207 1079326 704475 747084 1141016 1367400 913160 1025051 847801
14688 847801 1283141 1043027 1157323 701932 797961 1051476 1021629 873803 1112654 1160720
14678 1160720 1194032 1146443 1204933 848776 857948 1147810 811520 934959 1038627 1154063
14668 1154063 1212215 844574 787350 1107772 1241729 1280860 1227592 1451663 1272147 1233310
14658 1233310 974912 974839 1228996 1038426 1213727 1176841 1244258 1359981 1271070 1255302 1247281
14647 1247281 1083313 1223532 1109490 1371402 1374007 1468431 1196032 1347348 1603384 1232498
14637 1232498 1496300 1411218 1339280 1445402 1449531 1434000 1554305 1540357 1408711 1377290 1393887
14626A393887K3610J04322M4322k23372P0232J4666J75472J47199l99874M08206
14616A758670P7909l93663K9719M6243Q2888J96258l03153M17026J05088k53816
14606A763169l17215P5546J77378k94618p1209M14577j97514k03452N10309k85681
14596A571290K04933k6290k41489K30307J41828N1594k16066M21612j82511J11270
14586B066478k30751K0463j29157j24230M88749M55937m96629k90205K90406J55908
14576B206969j85843L23347k39201K1400k08230L66282Q0950o6418m894N5455
14566B349817K00884n1410j52162L12600J95538l9684q6458J00185M21095k87686
14556B962719J54352j810M88082O24880l782P73245O16518J903166K659476P554913
$$ plain form
14626 1393887 1417497 1521819 1566141 1342769 1413001 1427667 1603139 1750338 1350464 1758670
14616 1758670 1836579 1442916 1472635 1518878 1601766 1798024 1494871 1911897 2016985 1763169
14606 1763169 1445954 1521500 1698878 1404260 1333051 1747628 1550114 1346662 1856971 1571290
14596 1571290 1776223 1749933 1508444 1738751 1880579 1932173 1716107 2137719 1955208 2066478
14586 2066478 1835727 1856190 1727033 1602803 2091552 2547489 2050860 1760655 2051061 2206969
14576 2206969 2021126 2344473 2105272 2126672 1918442 2284724 2365674 2299256 2294362 2349817
14566 2349817 2550701 2499291 2347129 2659729 2855267 2815583 2729125 2829310 3250405 2962719
14556 2962719 3117071 3115261 3603343 4228223 4224441 4997686 5614204 7517370 10176846 17731759
14546A7731759J9622127J7368454k7169613A2115765E646611k291129r70005m9326
14538B336151l6603l01543K88304k61622J71324j62022K66645k88675l1913M78172
14528B458218j21786p7217j52736N58979k71606o7017K70499L27298j67605l20020
14518B437007N14920k66735K8604K20761O0235J40397j01576k11689J03878N6381
14508B982183J43575q4254J30377K96298p4406J46883j42582K9538j05630m2057
14498C279925P59164o70064M98179n03740L62136r0248J00025J39614k11708M04309
14488D067592n30436K79045J05385K3244O2905N6162J59841P6098K32021r4083
14478D437774k71198J49586L4235L88076q00374O15566j42074M32574l06307L81914
$$ plain form
14546 17731759 37353886 54722340 27552727 12115765 5646611 3355482 2385477 2336151
14538 2336151 2299548 1998005 2286309 2024687 2196011 2033989 2300634 2011959 1980046 2458218
14528 2458218 2336432 2259215 2106479 2665458 2393852 2326835 2597334 2924632 2757027 2437007
14518 2437007 2951927 2685192 2713796 2934557 2994792 3135189 3033613 2821924 2925802 2982183
14508 2982183 3125758 3041504 3171881 3468179 3393773 3540656 3398074 3427612 3321982 3279925
14498 3279925 4039089 3369025 3867204 3363464 3725600 3635352 3735377 3874991 3663283 4067592
14488 4067592 3537156 3816201 3921586 3944830 4007735 4063897 4223738 4299836 4531857 4437774
14478 4437774 4166576 4316162 4350397 4738473 3938099 4553665 4411591 4844165 4537858 4919772
14468D919772Q8843m35818J71554M39988k24964O7418K14659M05763m92408K4205
14458E179012K38219j60722N4743J6432J34735n101J50411j40615L96354p99l20888
14447E541781L18134K91021j3437J62825m4502l41907N08863R1139Q7813o0948
14437F540782L09582j23057J88013L06965J76372o1143L86222j00770N5125J04736
14427G782827j78157L10806j32939M3566L35359K08754l71246N18720l4413K07822
14417H691099m5245L24587L68795J38209j00498L49460j10954q5223L78537L21741
14407A0230508J53913N9692J9377Q4513K30545K0790J33081J41118O55866p9744
14397A1649659K43616L667K03808N70290m9782K93597M00157l29479P35946J12460
$$ plain form
14468 4919772 5008615 4572797 4744351 5184339 4959375 5026793 5241452 5647215 5154807 5179012
14458 5179012 5417231 5256509 5311252 5327684 5462419 5457318 5607729 5467114 5863468 5862669 5541781
14447 5541781 5859915 6150936 6137499 6300324 6255822 5913915 6422778 6513917 6601730 6540782
14437 6540782 6850364 6727307 6915320 7222285 7398657 7337514 7723736 7622966 7678091 7782827
14427 7782827 7604670 7915476 7782537 7826103 8161462 8370216 7998970 8517690 8483277 8691099
14417 8691099 8645854 8970441 9339236 9477445 9376947 9726407 9615453 9530230 9908767 10230508
14407 10230508 10384421 10444113 10463490 10548003 10778548 10799338 10932419 11073537 11729403 11649659
14397 11649659 11893275 11896942 12100750 12671040 12621258 12914855 13315012 12985533 13721479 13833939
14387A3833939K07344M90547j08649J76836N43766K24989K91733L32770P5967
14378A6069242J88372N36496J31472O37533M25175K44798J13705L70145L56257
14369A9073195L95429M17694N70425J14083M94878Q29517K94863M54293M46843
14360B3091220M64483N39028P08277M92557M6988P45986P21626N48160O89286
14351B8047611J088655L29083J115355P02266O15693Q73112Q48628R45730J044863
14342C5610996N21269J049131P14735J396234R47715J438227Q67774J107591J429118
14333D5082790J222622J705754J445527J725200R89577J979631J589968K086784
14325E7827853J514398K058954J936237K641708K245558K190086K753577K788560
$$ plain form
14387 13833939 14041283 14531830 14423181 14600017 15143783 15368772 15660505 15993275 16069242
14378 16069242 16257614 16794110 16925582 17563115 17988290 18233088 18346793 18716938 19073195
14369 19073195 19468624 19886318 20456743 20570826 21065704 21895221 22190084 22644377 23091220
14360 23091220 23555703 24094731 24803008 25295565 25342553 26088539 26810165 27358325 28047611
14351 28047611 29136266 29465349 30580704 31282970 31898663 32771775 33620403 34566133 35610996
14342 35610996 36132265 37181396 37896131 39292365 40240080 41678307 42546081 43653672 45082790
14333 45082790 46305412 48011166 49456693 51181893 52171470 54151101 55741069 57827853
14325 57827853 59342251 61401205 63337442 65979150 68224708 70414794 73168371 75956931
14317G5956931K595083K688515K992308L666381L498848L541065L712156M093283
14309A02744570M311356M544641M502021N200272N399659N499414N979626N979276
14301A44160835O613730O854322P567159Q022293Q429537Q555151R171001J0115233
14293B09489261J0104226J0912856J1471206J1978113J2333873J3029482J3567964
14286B92886981J3842857J4583390J4977535J4994478J5115834J5154326J4446748
14279C96002149J4777628J3708903J3326515J2225239J0461659R226667O392243
14272D76121003L182448P29701j227335k068691l671518m517333o293176p918950
14264D54336149j0584366j1813004j3427231j4979132j5277757j5914880j5893920
$$ plain form
14317 75956931 78552014 81240529 84232837 87899218 91398066 94939131 98651287 102744570
14309 102744570 107055926 111600567 116102588 121302860 126702519 132201933 138181559 144160835
14301 144160835 150774565 157628887 165196046 173218339 181647876 190203027 199374028 209489261
14293 209489261 219593487 230506343 241977549 253955662 266289535 279319017 292886981
14286 292886981 306729838 321313228 336290763 351285241 366401075 381555401 396002149
14279 396002149 410779777 424488680 437815195 450040434 460502093 469728760 476121003
14272 476121003 479303451 480033152 478805817 476737126 473065608 468548275 462255099 454336149
14264 454336149 443751783 431938779 418511548 403532416 388254659 372339779 356445859
14257C56445859j6195932j5593934j5392464j3922797j4117368j3519672j2945268
14250B54758424j2694462j1789451j1235239j0614843j0512392q454823q933753
14243A80523461q646115p740517p970309o776144p029773n713102n723494n585381
14235A25338626n529373n147579m760416m368038l692355l833262m032190l949295
14227I0026118l235198l329741l058901k707063k967203k483160k211880k624534
14219F7408438k158690k183967k093370j833626j880775k051848j112224j759918
14211E2334020j640175j458662j617432j405328m80266q97775j820574j716378
14203D1297430r99982j438141r52168m34729r95876j221820q78387r04698q20335
$$ plain form
14257 356445859 340249927 324655993 309263529 295340732 281223364 267703692 254758424
14250 254758424 242063962 230274511 219039272 208424429 197912037 189457214 180523461
14243 180523461 171877346 164136829 156166520 149390376 142360603 136647501 130924007 125338626
14235 125338626 119809253 114661674 109901258 105533220 101840865 98007603 93975413 90026118
14227 90026118 86790920 83461179 80402278 77695215 74728012 72244852 70032972 67408438
14219 67408438 65249748 63065781 60972411 59138785 57258010 55206162 54093938 52334020
14211 52334020 50693845 49235183 47617751 46212423 45732157 44834382 43013808 41297430
14203 41297430 40297448 38859307 37907139 37472410 36476534 35254714 34376327 33471629 32651294
14194C2651294l34739j056332o43137p84602n90165j315467k18389p76343p20795
14185B6211325m59707o34596j23132p45182o36182n10568o11974l07146m25141
14176B1757697j25608j024931k22725l02058l44752o39984k56528l64612o44820
14167A7831679j16145k99355l22397n00361Q3705j67902l96236l97010l63686
14158A5352292l18115R2493n19387j15703o36182J53150m08533o3224j95324k73036
14148A3068431l43105j89972k4100j24350m10383j03595k17178J48518o15418
14139A1188848M8401j89477k75131K39245k55607l86039l98714K04172j96216
14130I979482j2680m82852J5779j40854j4717K19908l99566q1217l50068J1133
$$ plain form
14194 32651294 32316555 31260223 30617086 29832484 29242319 27926852 27708463 26932120 26211325
14185 26211325 25751618 25117022 24993890 24248708 23612526 23101958 22489984 22182838 21757697
14176 21757697 21632089 20607158 20384433 20082375 19737623 19097639 18841111 18476499 17831679
14167 17831679 17715534 17416179 17093782 16593421 16677126 16509224 16112988 15715978 15352292
14158 15352292 15034177 15126670 14607283 14491580 13855398 14008548 13600015 13536791 13341467 13068431
14148 13068431 12725326 12535354 12511254 12386904 11976521 11872926 11655748 11804266 11188848
14139 11188848 11237249 11047772 10772641 11011886 10756279 10370240 9971526 10175698 9979482
14130 9979482 9966802 9483950 9499729 9358875 9344158 9564066 9164500 9083283 8733215 8744348
14120H744348m15179J14437l25855k4651j99114r8460J60579L4346O7586n59392
14110G498645q3175q7068K847o5024m40734J95269l91461J00857K9480K4691j84237
14099F600090L0100l63814L4419q5039k4595J41024n33792j3556K16517r3417
14089E907937m8079l34604j64411L05305j56521K10447k05174k40367J82292k02865
14079E253960K58274n36477J16228k5689O1860j7851J29887m92055j07784K98813
14069D939166o6503N9393n14447K17833q1911J20009k60756J67147k73091O5804
14059D372644j33939J06927Q7594m51958N44323m37593k37916K09692n09264L87221
14049C937731p5122L94151n68597N2160m6884K2525J30307k59667k65874K24832
$$ plain form
14120 8744348 8329169 8443606 8117751 8093100 7893986 7795526 7956105 7990451 8058037 7498645
14110 7498645 7415470 7328402 7331249 7266225 6825491 7020760 6629299 6730156 6759636 6784327 6600090
14099 6600090 6630190 6266376 6300795 6215756 6191161 6332185 5798393 5784837 6001354 5907937
14089 5907937 5859858 5525254 5360843 5666148 5509627 5720074 5514900 5274533 5456825 5253960
14079 5253960 5512234 4975757 5091985 5066296 5128156 5110305 5240192 4748137 4640353 4939166
14069 4939166 4872663 4932056 4417609 4635442 4553531 4673540 4412784 4579931 4306840 4372644
14059 4372644 4238705 4345632 4433226 3981268 4525591 4087998 3850082 4059774 3550510 3937731
14049 3937731 3862609 4256760 3688163 3740323 3693439 3715964 3846271 3586604 3320730 3545562
14039C545562k93303K61667J54113k35917j55919K57420j40818j0968j23889L40548
14029C598496k39564l51771K76508n420J18571q9473m89309n9820M33182J10966
14019C302366l70427N9935M6335Q1569k96667N4096j88363j98629L60101O5625
14009B915941j34276l04526L08251n85901L47460L52003o96261M66367m64451
14000B204607J73823L4819P1923N5833j29266l7438j51165J75169K8117L25701
13990B752123j88323O38841K148488N013495J7003172K7379525k1657667A6364656
13981I556662k707081j342358p78417q21424J4612m80822k05244k13376P230O9672
13971C099454k91610j97974j7838j07851K2231J04188k23207L70969k3097l19825
$$ plain form
14039 3545562 3252259 3513926 3668039 3432122 3276203 3533623 3392805 3381837 3257948 3598496
14029 3598496 3358932 3007161 3283669 3278249 3396820 3307347 2818038 2758218 3191400 3302366
14019 3302366 2931939 2991874 3038209 3119778 2823111 2877207 2688844 2490215 2850316 2915941
14009 2915941 2781665 2477139 2785390 2199489 2546949 2898952 2202691 2669058 2204607
14000 2204607 2378430 2413249 2485172 2541005 2411739 2374301 2223136 2398305 2426422 2752123
13990 2752123 2563800 3202641 5351129 10364624 27367796 54747321 33089654 16364656
13981 9556662 6849581 5507223 4728806 3907382 3921994 3441172 3235928 3022552 3029782 3099454
13971 3099454 2807844 2609870 2592032 2484181 2506412 2610600 2387393 2758362 2735265 2415440
13961B415440k15665L21029r3942L4259L1005j69881K32862n82310J55000L11324
13951B439121k9353n3654j4859l94396K75558k03862L74771l21997j80663L51996
13941B242662j85617l6879L7210j47376o7761J10526l4729J94748m59278K68549
13931A922055L34588n49957M7568K73886n0994N812j32795o25313N05139k21621
13921A508368M31939j37876J39678k70200k99799M83116j03042n4124j03677J27662
13911A722045j36627K73653l47839k06672J24522K47780j66823k6654j15996K15291
13901A582680m3258N5635o1978l16718O14709n55321K24675l25757M70614o972
13891A638309L5711j07778q4682Q7695q24j52482j019l3642J02502J52062m27452
$$ plain form
13961 2415440 2199775 2520804 2426862 2461121 2492126 2322245 2555107 1972797 2127797 2439121
13951 2439121 2409768 2356114 2341255 1946859 2222417 2018555 2393326 2071329 1890666 2242662
13941 2242662 2057045 2020166 2057376 1910000 1842239 1952765 1918036 2112784 1653506 1922055
13931 1922055 2256643 1706686 1754254 2028140 1977146 1982958 1850163 1224850 1729989 1508368
13921 1508368 1940307 1802431 1942109 1671909 1372110 1855226 1752184 1698060 1594383 1722045
13911 1722045 1585418 1859071 1511232 1304560 1429082 1676862 1510039 1483385 1367389 1582680
13901 1582680 1539422 1595057 1533079 1216361 1831070 1275749 1500424 1174667 1645281 1638309
13891 1638309 1674020 1566242 1481560 1569255 1568431 1415949 1414930 1381288 1483790 1635852 1208400
13880A208400L2883J9243K8720k26519J03807J50197j33082J1000k237N14026
13870A706438m25708k1503r2068K22112l7620r6973l80421M88383k58900J62879
13860A266619k01699j51930N78281j84676k65158p961m1631M90636k05143o5230
13850A212108k051k70760K73924n9436k6800P7111o5587K40464k54042J83016
13840A307947n6284m8938j89750J27020j28198n4704L8222n1209K04705K24847
13830A373658n40777J21375K36916q2122m74009L05541K33962k69572M3240j40480
13820H07732L01525k71140L64000l11533M22923l30413J41687j48156J52416l56558
13810G72483N89908n33541j34214K6174M76184j55579k13571M4067J79562j67468
$$ plain form
13880 1208400 1241283 1260526 1289246 1062727 1166534 1316731 1183649 1194649 1192412 1706438
13870 1706438 1280730 1259227 1167159 1389271 1351651 1254678 874257 1362640 1103740 1266619
13860 1266619 1064920 912990 1491271 1306595 1041437 1033476 991845 1482481 1277338 1212108
13850 1212108 1210057 939297 1213221 1153785 1126985 1204096 1138509 1378973 1124931 1307947
13840 1307947 1251663 1202725 1012975 1139995 1011797 957093 995315 944106 1148811 1373658
13830 1373658 832881 954256 1191172 1109050 635041 940582 1174544 904972 948212 807732
13820 807732 1109257 838117 1202117 890584 1313507 983094 1124781 976625 1129041 772483
13810 772483 1362391 828850 694636 720810 1196994 1041415 827844 871911 1051473 884005
13800H84005M0258K8610k1457k72022O04377l39812o4993J89013J04659j73755
13790I78883l07275K67754k57376J32624j41798N22521j50101k05400n1048J84155
13780I72939l92872K34915l7021j1174J90850k7976Q5559k28650k66679l858M61427
13769I77460j48147k89340J58379j24292L28998J57504n01158K50114j30527q729
13759F70262O1537J88953j58047O524j39236J36304J15552D29369K17773j177
13749F45965n8077K61853j99227K60743R17k30910J90945j75799j32424p2690
13739D91296K73916j97725M43836j47281C77436L97430j07373J75216J1723k41430
13729F13002j62835R7653K10088j11339J27451l49496J36945K39450C71343J69768
$$ plain form
13800 884005 924263 952873 931416 659394 1263771 923959 858966 1047979 1152638 978883
13790 978883 671608 939362 681986 814610 672812 1195333 1045232 839832 788784 972939
13780 972939 580067 814982 777961 766787 957637 929661 1015220 786570 519891 516033 977460
13769 977460 829313 539973 698352 574060 903058 1060562 559404 809518 678991 670262
13759 670262 731799 920752 762705 769229 629993 766297 881849 429369 647142 645965
13749 645965 587888 849741 650514 911257 912174 681264 872209 696410 563986 491296
13739 491296 765212 567487 1011323 864042 377436 774866 667493 842709 854432 613002
13729 613002 450167 547820 757908 646569 774020 424524 561469 800919 371343 541111
13719E41111O8521j94058J06881q9996L45772j56636m1693J38268J9186k70206
13709D67150m0033J76742j22359q4908K90662j56562O3544j17131l5936K690J36540
13698E80399j01463k8067j45009M93713C83621p2648K67610N52461D90409n8807
13688D31602M5364L9517J49264A43720P08626k10390K57376C47298L97114l42184
13678D02228J28433K40998j45449j70674K2135J00786M3712L15462B59383Q2981
13668C42364A43562K40328J87457Q3912p9146k01954J92842k31958J70844J01812
13658F07699K0738j75022J38603B38721J93887K92466l29915L66055j98893r5531
13648D66790l5338k3663N8450L9300L14176l48112J24782E589P56570l67095j63474
$$ plain form
13719 541111 609632 415574 522455 432459 778231 621595 579902 718170 737356 467150
13709 467150 427117 603859 481500 396592 687254 530692 594236 477105 441169 443859 580399
13698 580399 478936 450869 305860 799573 383621 310973 578583 1131044 490409 431602
13688 431602 476966 516483 665747 143720 852346 641956 899332 347298 744412 402228
13678 402228 530661 771659 626210 455536 477671 578457 622169 937631 259383 342364
13668 342364 143562 383890 571347 655259 576113 374159 567001 335043 505887 607699
13658 607699 628437 453415 592018 238721 432608 725074 395159 761214 562321 466790
13648 466790 431452 407789 466239 505539 819715 471603 596385 5589 762159 395064 231590
13637B31590Q6146J85757p5800J47433J04304q6997j70240J96266k78585O4272
13627D04146F1560K93347L91860m6823J92778m42911J32942j1895p1066j69725
13617C30067J15565K07711k23522L1366K70667l38883J20637J08435k68167j1329
13607C42547j40410K27854R3835b4922E52001j12027j1067j76378K42731K91406
13597G86666k76528K42472A57552L4150L64649j35229A36197K26060L18339j3480
13587F67116o0657J2399B58217l1101L37329k74728n9771n0659J90460J01547
13577D71294A55858J83527j33631K14911l3600j10906J28514K4404A33516M76647
13567F10163j79502J60571q1913q7542j43153j32981a4096A51422J03175K04228
$$ plain form
13637 231590 317736 503493 427693 575126 679430 592433 422193 618459 339874 404146
13627 404146 61560 354907 746767 699944 892722 449811 582753 570858 499792 330067
13617 330067 445632 653343 429821 461187 731854 392971 513608 622043 353876 342547
13607 342547 202137 429991 523826 -24922 552001 439974 428907 252529 495260 786666
13597 786666 510138 752610 157552 191702 556351 421122 136197 362257 680596 667116
13587 667116 606459 618858 258217 227116 564445 289717 229946 179287 369747 471294
13577 471294 155858 339385 205754 420665 387065 276159 404673 429077 133516 610163
13567 610163 430661 591232 509319 421777 278624 145643 -14096 151422 254597 458825
13557D58825m7760j55839J74368j92705J35892j35022d1203D77401p0200o6934
13547C40267K96207K20177i0817C43325J95875F222J56066J58852i070E98111
13536B53802J35203M9472K06388G3862J25922q9461J91132J78417J22311B13825
13525C84316A12220J21105m3025J66993A09074L34931M2160N6678j19449N3976
13515D77370M9186q6891A56200K06007A52958P1396J28709O7830h1424B97011
13504A43917P8053k0938R4951K08142A28967O0514p1219L61387r5888K46308k49241
13493C80828J92700a2526E91346H5198B9797L28435O8695j91218L6391K10365
13483D82465A74775L76348k66982j06707L29952B14354P4173A17947L03374j82714
$$ plain form
13557 458825 411065 255226 429594 236889 372781 237759 -41203 477401 407201 340267
13547 340267 636474 856651 -90817 343325 539200 6222 162288 321140 -9070 598111
13536 253802 389005 438477 644865 73862 199784 110323 301455 479872 602183 213825
13525 384316 112220 233325 190300 357293 109074 444005 486165 542843 423394 477370
13515 477370 526556 439665 156200 362207 152958 224354 353063 420893 -81424 297011
13504 143917 221970 201032 295983 504125 128967 189481 118262 479649 383761 630069 380828
13493 380828 573528 -12526 591346 85198 29797 358232 426927 235709 272100 482465
13483 482465 174775 551123 284141 177434 507386 214354 288527 117947 421321 238607
13473B38607N310J29483d3822C03002D8807M1718K40495A60287K20500j18363
13463B62424A12229O1019j4698J56506j41979A502K93414L5360E7770J33542J59665
13452C50977A27979O7472c3129A90727h4135C70025b8537B51360M6442j27288
13442A70514J5462J37755q0224F8815L00752r5228j17395K70946A56815M4100
13432B00915N4559m5674a67039A26648M1506g558B65661R5342a69498F1520J8373
13421G9893J53763J70449j30059J02853m7333j03339M88143b6118C68223A34583
13410D24816j78318a24165B82523N9357j52982J13053K15013i6181D53885k07415
13400B46470Q3765j48664K06532j61520I1394K16375K4580A57266R2659Q7554
$$ plain form
13473 238607 243917 373400 -43822 303002 48807 90525 331020 160287 380787 262424
13463 262424 112229 173248 158550 315056 173077 1502 294916 330276 57770 191312 350977
13452 350977 127979 195451 -33129 190727 -84135 370025 -28537 251360 297802 170514
13442 170514 185976 323731 243507 68815 369567 274339 156944 427890 156815 200915
13432 200915 255474 209800 -167039 126648 168154 -7558 265661 361003 -169498 61520 79893
13421 79893 233656 404105 274046 376899 329566 226227 714370 -26118 368223 134583
13410 424816 246498 -124165 282523 341880 188898 301951 516964 -96181 453885 246470
13400 246470 330235 181571 388103 226583 91394 307769 332349 157266 249925 337479
13390C37479A03711P2658K33494H7500P749J29233E8355b4290a91I4763J08065
13379B02828H3645L35335l4394L7751G8868J1377K55402r0039C1648K09958n6851
13368A84755a04290A70852C5008Q4216J12720J06694A45714K44274k0374r1354
13358B78260j11675o3533b4778C46311r792J63133j97953J43K1697f182C67253
13346B45614J08920q5946j32832L2604R3006O3397L83834C49557K33411B78240
13335F4504L81500i2978C88950A33820K29963p0139C8066J48294o3833h2862A57192
13323B25318M7599j23714L1359J20002J16503j97899A04582J31135L3021L12755
13313E81493B89542J8914Q6293g2091B49235p7573K0666K6264O22231C68228b1028
$$ plain form
13390 337479 103711 176369 409863 87500 95249 224482 58355 -24290 -191 94763 202828
13379 202828 83645 418980 384586 422337 78868 90245 345647 255608 31648 241606 184755
13368 184755 -104290 170852 35008 119224 231944 338638 145714 389988 369614 278260
13358 278260 166585 103052 -24778 346311 336519 499652 301699 301842 323539 -6182 367253
13346 245614 354534 268588 135756 168360 261366 324763 708597 349557 582968 278240
13335 64504 446004 -92978 388950 133820 363783 293644 38066 186360 122527 -82862 157192
13323 225318 272917 149203 180562 300564 417067 219168 104582 235717 268738 581493
13313 581493 289542 308456 394749 -72091 249235 171662 192328 218592 840823 368228 -21028
13301A53081d4942D08454j771f2829E3628b10544G4501K0256j4676a94229B45426
13289C71441A14681O0087H526P9644m053A6921K32409j23817E859L41548B3750
13277C75947N134A55459a87085A92028J18884j01418P5207K5748h3992o1984C12270
13265B51043F1290b59648B36101I8409a49063F3737M9438l2791J38564p9545i380
13253E4747j9218b8171A27881c7991B09585j2208J66691N466i4653A04306J08495
13242B12801q0964a23779A07139j6056L6094a41319I8654b06949C54381c2579
13231D5378J50529K61753a13542A38388J31252D80J81696f5377H0120R6069a12365
13219B69255o1749L09983A03976h6193B98591l1906E8147J36311m7643K31930
$$ plain form
13301 153081 -44942 408454 406683 -62829 53628 -210544 74501 94757 80081 -194229 245426
13289 371441 114681 174768 8526 88170 84117 16921 249330 125513 5859 347407 23750
13277 375947 381081 155459 -187085 192028 310912 209494 284701 310449 -83992 -145976 312270
13265 251043 61290 -259648 236101 98409 -149063 63737 113175 80384 218948 139403 -9380
13253 54747 35529 -28171 127881 -37991 209585 197377 364068 369534 -94653 104306 212801
13242 212801 131837 -123779 107139 91083 127177 -141319 98654 -206949 354381 -32579
13231 45378 195907 457660 -113542 138388 269640 480 182176 -65377 80120 176189 -112365
13219 269255 207506 517489 103976 -86193 298591 266685 58147 194458 146815 378745
13209C78745k0178j66953J9766N0621d5514B01859l5145K3503a2399j5109A55691
13197D5256K9149K55918j22799J673c643B5059b6167B17282R4911g3351p6350
13186a49701C20676i5242B37842q3359Q5919K5098D4130M51782k21379k5390r5682
13175A53461e3345B07108p8564J43103J31104a47802B16509b1262n9883a3993
13164C42633j61317Q1220G6399a05822B69584A16861a08385d5942j76859a3601
13153C07632A28999l4380a22706l89040C14396A26578R9155J96849A80503M560
13143A85063G2379a74984C30215C6349L68216g17D1187J30038M6510b65287d5311
13131C07977J4048J43949b06864C26302e901j55640b3686C91566c2825A27231
$$ plain form
13209 378745 358567 191614 211380 262001 -45514 201859 166714 190217 -12399 -27508 155691
13197 45256 74405 330323 207524 209197 -3643 25059 -26167 217282 312193 -73351 -149701
13186 -149701 320676 -95242 237842 154483 240402 265500 44130 495912 274533 249143 153461
13175 153461 -53345 207108 128544 271647 402751 -147802 216509 -21262 -81145 -13993
13164 342633 181316 262536 76399 -105822 269584 116861 -108385 -45942 -222801 -13601
13153 307632 128999 94619 -122706 -511746 314396 126578 225733 422582 180503 185063
13143 185063 72379 -174984 330215 36349 404565 -717 41187 171225 217735 -265287 -45311
13131 307977 322025 465974 -206864 326302 -5901 -161541 -23686 391566 -32825 127231
13120a34024E9942J41256G5292d80666a7821A18775M7525a39599A73276a38339
13109B6451O1480M3306A0221J53769M45154a62976C9659K16840K5831j06532K5352
13098B01150k2893b15936A05593C3895d158B69586C2609Q6963Q9845d30877C37677
13086F0675K70422A61981p975b5128B04541e0260D60947B24091j06122a81606
13075B37303A5439L40870A74444J21001e8329C45609H3603L16676B1733B401J48058
13064A50459b98187c9231e690o9157I3960b5812L571k7860a3673D351L00426Q0572
13052C85349A36455K84513e4232k88410a67370N5215A06150J60066j10631l7374
13042A18211b694C00341o3557R2069c03820a19628r388A9633K43628n7089G1585
$$ plain form
13120 -134024 59942 201198 75292 -480666 -17821 118775 166300 -139599 173276 -138339
13109 26451 87931 131237 10221 163990 609144 -162976 39659 256499 282330 175798 201150
13098 201150 178257 -215936 105593 33895 -4158 269586 32609 119572 209417 -430877 337677
13086 60675 331097 161981 154006 -25128 204541 -50260 460947 224091 117969 -181606
13075 237303 15439 356309 174444 295445 -58329 345609 83603 400279 21733 2401 150459
13064 150459 -298187 -39231 -5690 -74847 93960 -25812 -22241 -50101 -13673 4351 304777 385349
13052 385349 136455 420968 -54232 -342642 -167370 -112155 106150 266216 155585 118211
13042 118211 -2694 300341 236784 328853 -303820 -119628 -129016 19633 263261 206172 71585
13030A89163B739J53921O7121a00389B96393d82C14783A4355Q7555f2944E7321
13018D5846K07283d2118E00852A31594J5148J0217M7450a46372H3726A022L02788
13007C03810A43960o1258J99964J12853a4605A97020m3201K43309j91181M9517
12997B55464A00772J95764C4971J62482B5633l152L59766E8593L1220J28493N3845
12986B72151b66662A13373m3562b03760Q1388J2235B47046J61119a69182C3410
12975A28540P6404J12211H7857A372J83656M8166a72620B43439K03738m0188c03688
12963A17242f9421A33877b46359e7922R943B59648f2831A52364P1383J58705a04660
12951a3819j81296A22511f2191E2533c05617C23986D8299J70010q0953a50561
$$ plain form
13030 189163 2739 156660 223781 -100389 296393 -482 314783 14355 101910 -62944 57321
13018 45846 253129 -42118 500852 131594 146742 156959 204409 -146372 83726 1022 303810
13007 303810 143960 82702 282666 395519 -14605 197020 153819 397128 205947 255464
12997 255464 100772 296536 34971 197453 25633 22481 382247 58593 89813 218306 272151
12986 272151 -266662 113373 69811 -203760 -122372 -110137 247046 408165 -169182 33410
12975 128540 204944 317155 87857 1372 185028 233194 -172620 243439 447177 406989 -303688
12963 117242 -69421 133877 -246359 -57922 -47979 259648 -62831 152364 223747 382452 -104660
12951 -13819 -195115 122511 -62191 52533 -305617 323986 48299 218309 137356 -150561
12940f6797j96891A61832E7012P2392a5204H036a12720A34447L5977J30216b70741
12928F3953K92437F6887b82746N0739B05086G3570k8453J47635J32179C6083K54049
12917B90132a43465B29019a89308B04974c6681j9380b4067C7006M7530c99202
12906e7888A58072J06226A0821a27430b4146n1821k298C61600F4143a88884j56011
12895c44895i0476a3906D05210j34533e1949p9278k06394B58040j1774A05321
12884I3860m0524i9462m8244L8322K9256C03644a36162D9484O8100n3169K17457
12873B81872H5327K42433a3277n5531H7409B7902a03693l6234B25829o7908J39139
12862B97060q0120A7777i8844M169B17649H4911K18982a4583l1170B57444D2896
$$ plain form
12940 -66797 -263688 161832 57012 129404 -15204 8036 -112720 134447 170424 300640 -270741
12928 63953 356390 66887 -282746 -232007 205086 73570 45117 192752 324931 36083 290132
12917 290132 -143465 229019 -189308 204974 -36681 -56061 -24067 37006 84536 -399202
12906 -57888 158072 264298 10821 -127430 -24146 -75967 -78265 361600 64143 -188884 -344895
12895 -344895 -90476 -13906 405210 270677 -51949 -131227 -337621 258040 246266 105321
12884 93860 53336 -99462 -147706 -109384 -80128 303644 -136162 49484 117584 64415 281872
12873 281872 85327 327760 -13277 -68808 87409 27902 -103693 -139927 225829 157921 297060
12862 297060 216940 17777 -98844 -94675 217649 84911 303893 -14583 -45753 257444 42896
12850c6942B6974i9944G431a0064k67400A92498n3683k8913e0210j70991A00830
12838c42123d9576b2980B43786d1224B00504b761n1252p067m8650j75028a35063
12826H4450J78414a3750L704j94713L2507D60687j25680b3026A40629g5477j54305
12815b29782q1014G2947a47553B2654b0976j20638A20945a16590E5924j1829J04685
12804A48780J11638m8818h0782n4922m4910l6494C5388o907K05763A04824a89952
12792A35039D1424G657J75949a53069n1570A54754J34290m63H9071g0309m5533
12781a15842I8337K13977h4277j42646f6686C004a39278e7102j37007B23579m1333
12770A82246b14485C89430c45293B90903j33953b20407A3449c5293A07313a28126
$$ plain form
12850 -36942 26974 -99944 7431 -10064 -277464 192498 138815 109902 -50210 -221201 100830
12838 -342123 -49576 -22980 243786 -41224 200504 -2761 -54013 -61080 -109730 -284758 -135063
12826 84450 262864 -13750 -10046 -204759 -172252 460687 335007 -23026 140629 -75477 -229782
12815 -229782 -310796 72947 -147553 22654 -20976 -141614 120945 -116590 55924 44095 148780
12804 148780 260418 211600 -80782 -135704 -180614 -217108 35388 28481 234244 104824 -189952
12792 135039 41424 7657 183606 -153069 -204639 154754 289044 288581 89071 -70309 -115842
12781 -115842 98337 312314 -84277 -226923 -66686 3004 -139278 -57102 -194109 223579 182246
12770 182246 -214485 389430 -345293 290903 156950 -220407 13449 -35293 107313 -128126
12759A15986a14944J9979I6723J25558K25510C2966M4433b38594B86220c7541
12748B11265a06585J4164G3096l0302R7046b02260A3816d70209B55734A12600
12737H4273A9172J0593P1520J17482J91250A58783G5601J84114l5994a54212c053
12725e8054D8219r321R3879M9282H3530b5600d844F6010g9786D861M8691K94404
12713C47956i4648A19749e0603E1884J62299A06493O62649A38680N35028B96507
12702E5854K60666j25582q3204k4114J70147D6951k657c113A02915e2857A41127
12690A57903i5691C6674a49234B30645G0831b13944O8593f3820l1960C79540k0215
12679C59325o802A50932p2792J5990B6039L56770l1132i0398m8599O2296E9560
$$ plain form
12759 115986 -114944 -94965 96723 222281 447791 32966 77399 -238594 286220 -37541
12748 211265 -106585 -92421 73096 42794 139840 -202260 13816 -470209 255734 112600
12737 84273 19172 29765 101285 218767 410017 158783 75601 259715 223721 -154212 -3053
12725 -58054 48219 38898 132777 182059 83530 -25600 -4844 66010 -79786 4861 53552 347956
12713 347956 -94648 119749 -50603 51884 214183 106493 769142 138680 673708 296507
12702 55854 316520 190938 107734 83620 253767 46951 44294 -3113 102915 -52857 141127
12690 157903 -95691 36674 -149234 230645 70831 -213944 -145351 -63820 -95780 379540 359325
12679 359325 352523 150932 78140 94130 26039 382809 351677 -90398 -138997 -76701 59560
12667A599L05923C757a46467C48855B3990i6643I4722N3068c5687A17633Q8142
12656B05775m7512l804K15858A09715R609E7659g7215b3283k27320c4306j9225
12645e3531B8371O1993K23957G2610a20226D1342A6824P437K63657a46529C8107
12633B31874B714L637K37650K97694k17212m8524M7797j24067O660q4127L2661
12622A54883Q0597B36a35311c0618B23446M8687r0736a33369m7699A87971L5822
12611B23793p7644D6459p265c06898B710L94057A2767K1598K48610J7836a22620
12599B8645R0463b7815a49r5448A66845b37332B97074g7644B35148a30241A69221
12587b696j25696A1707K78048e4007C82308b1750j65322A02221f1482C03349d8874
$$ plain form
12667 1599 307522 3757 -146467 348855 23990 -96643 94722 147790 -35687 117633 205775
12656 205775 158263 154459 370317 109715 119324 57659 -77215 -23283 -250603 -34306 -53531
12645 -53531 28371 90364 314321 72610 -120226 41342 16824 24261 287918 -146529 38107
12633 231874 2714 6351 244001 541695 324483 275959 323756 199689 206349 122222 154883
12622 154883 235480 236 -135311 -30618 223446 272133 181397 -133369 -181068 187971 223793
12611 223793 146149 46459 39194 -306898 2710 396767 12767 34365 282975 300811 -122620
12599 28645 119108 -27815 -149 -95597 166845 -237332 297074 -77644 235148 -130241 169221
12587 -2696 -128392 11707 289755 -54007 382308 -21750 -187072 102221 -61482 303349 -48874
12575A7887i2634G6130b93437d047A26415A9536L62110j82280e6733B0884L33718
12564C54602a52682H8198J25614a61455A28318A0807c6553j22080D3271a44496
12553c17508A46113a56380F6572J10139d7344A67286a20991A22982b13744j7753
12543b31497A2775J11264d6778C36516a44782A61624B3243K23943o180b08814
12532c5515B25435b8237k05536E86905Q4656d9896A06264k2120J45985b51844
12521d47948A31570d05190B02251a88850H6703P6895D9918b33526C47650b13765
12510B49643a77555Q1173n5161A38250d01131P0786B390J02789a28384D7183J97517
12499B44700F419N8414Q1652a36159F2884a20740l3617H3418a6309B16073F9731
$$ plain form
12575 17887 -92634 76130 -293437 -4047 126415 19536 381646 199366 -56733 20884 354602
12564 354602 -152682 88198 213812 -161455 128318 10807 -36553 -158633 43271 -144496
12553 -317508 146113 -156380 66572 176711 -47344 167286 -120991 122982 -213744 -231497
12543 -231497 12775 124039 -46778 336516 -144782 161624 23243 247186 241006 -208814
12532 -35515 225435 -28237 -233773 586905 671561 -49896 106264 84144 230129 -251844
12521 -447948 131570 -405190 202251 -188850 86703 163598 49918 -233526 347650 -213765
12510 249643 -177555 -96382 -151543 138250 -401131 -330345 2390 105179 -128384 47183 244700
12499 244700 6419 64833 146485 -136159 62884 -120740 -154357 83418 -16309 216073 69731
12487D2177o94a11813l7574e67A47615b23702C3180b13122A30516O4574f8497
12475E4657d10786A17090L1546D3227L8490b26504C35235a85871g330A7415O5314
12464H2729P2357J05918m6259a55368l007b8726C31858A7749J63611a61723B44862
12452C73334a67807A17543K4653f1612A61781D9116a8764l760j13644L8059d4397
12440C87313A80444k4967E5134P2880f2565A00760N5489J05280c2072j67908I0904
12428a058k77342C27360H0898K9228E0457b44262A93711q8046a8554q9239D4950
12416b71495B53237l8611c41869a09962J9146c9722A80859E1590b08228m3010
12406b51238A10426e4218I7263L51197g1133f351C9801a1005A10979m9741g7414
$$ plain form
12487 42177 41483 -111813 -149387 -567 147615 -223702 33180 -213122 130516 195090 -68497
12475 54657 -410786 117090 148636 43227 81717 -226504 335235 -185871 -7330 17415 82729
12464 82729 155086 261004 214745 -155368 -158375 -28726 331858 17749 181360 -161723 244862
12452 373334 -167807 117543 142196 -61612 161781 49116 -18764 -22524 -136168 -98109 -44397
12440 387313 180444 155477 55134 128014 -62565 100760 156249 261529 -32072 -199980 90904
12428 -1058 -278400 327360 80898 110126 50457 -244262 193711 105665 -18554 -107793 44950
12416 -271495 253237 214626 -341869 -109962 -90816 -39722 180859 51590 -208228 -251238
12406 -251238 110426 -54218 97263 448460 -71133 -6351 39801 -11005 110979 61238 -77414
12394a665B8100J68192J1217a35891A00980h34k95923I8556D968b37502O0613
12383a76889h4969H5800c60810C02642A01644a11940A6841i8016B81816H2911
12372A50214i1237A13679j3531a8896j96471D22736j90675A03805B1695e7368
12361a96857I8133J1920K6440k343g5765j1732A9907f4693C6463K8344J15897
12350A80704c30220e3655P979A81739b83640J38962A81834q311a44025f8328l8549
12339a06877C3348J78353a03694j84247H498a1760l1900B39455j817a38290m2760
12328a81050B01358g9621A55989A8918a46522C6291h0130A43546K06950a41374
12317i3334C32665a17130C274b8017B56139a06481A39830m0536J14395g0991j75688
$$ plain form
12394 -1665 28100 196292 207509 -135891 100980 -834 -296757 98556 4968 -237502 -176889
12383 -176889 -84969 85800 -360810 302642 101644 -111940 16841 -98016 281816 82911
12372 150214 -91237 113679 100148 -18896 -215367 422736 232061 103805 21695 -57368
12361 -196857 98133 110053 136493 134150 -75765 -87497 19907 -64693 36463 64807 180704
12350 180704 -330220 -53655 -45676 181739 -283640 -144678 181834 173523 -144025 -68328 -106877
12339 -106877 33348 211701 -103694 -287941 8498 -11760 -43660 239455 237638 -138290 -181050
12328 -181050 201358 -79621 155989 18918 -146522 36291 -80130 143546 350496 -141374
12317 -93334 332665 -117130 3274 -28017 256139 -106481 139830 99294 213689 -70991 -246679
12306b46679I1963L2947P6486b53878Q1850A4998J26150a64610a0476E7187b9774
12294a56474A778M2392n268d4247k62092C80519H8711b01372H7723A1701J25649
12283A37350J13933J56058A55120K3266p8020h8529q0264G0920J70179a3650A11704
12271B88157j40248L15530i2251D14328q5652a38376C43337e8030j38561a8290
12260C67121a27461C17192j29706d3284m8149A20383a83211A01867d2728E3270
12249B28471c6568q4393N6312j79355I0605a53199A80460h6182G2419K63222k4119
12238C11522m9848H4044d222B72884k9237E71d7801A1519g781F6964b6207B36891
12225B63823j14361J59770j12911H1253J59644r0079Q7800C9442M76978D7891
$$ plain form
12306 -246679 91963 124910 201396 -253878 -172028 14998 141148 -164610 -10476 57187 -29774
12294 -156474 1778 44170 38902 -44247 -306339 380519 88711 -201372 87723 11701 137350
12283 137350 251283 407341 155120 178386 100366 -88529 -168793 70920 241099 -13650 111704
12271 288157 147909 463439 -92251 414328 328676 -138376 343337 -58030 -196591 -18290
12260 367121 -127461 317192 187486 -43284 -91433 120383 -183211 101867 -42728 53270
12249 228471 -36568 -120961 -64649 -244004 90605 -153199 180460 -86182 72419 335641 311522
12238 311522 261674 84044 -4222 272884 243647 571 -47801 11519 -7781 66964 -26207 236891
12225 263823 149462 309232 196321 81253 240897 150818 238618 39442 516420 47891
12214B93960K20346j56849A61469B1942M11641j84331L5299A07246a99365B76728
12203B51243a40519D37051A53801e6551C13687D3360K0003J43408k1546J99245
12193C84470A38058J19459O898J0910J14099A70080A1672Q5865K2288M3167P670
12182A70662Q8708a88970j32332C43968F4523b26B43455g9513E53620g4134C47340
12170B28777n230c2229A9954b01883A40895b57669B72146n7114E6747L70172a06541
12158A07937c0823B98417J05617b6451j7751j26381B84025b2067a0085A47554
12147A85760I2241a07973C0878b1228D43709A38927c6392m1282A25064C8847b83663
12135b36613F0289C271a75229N6922L2872C57981j62541k9067a4469B0260K18645
$$ plain form
12214 293960 514306 357457 161469 21942 433583 249252 284551 107246 -199365 276728
12203 251243 -140519 437051 153801 -56551 313687 43360 63363 206771 185225 384470
12193 384470 138058 257517 264415 275325 389424 170080 11672 97537 119825 162992 170662
12182 170662 259370 -188970 -321302 343968 64523 -226 243455 -79513 553620 -74134 347340
12170 228777 223547 -32229 19954 -201883 140895 -257669 272146 215032 56747 426919 -106541
12158 107937 -30823 298417 404034 -26451 -44202 -170583 284025 -22067 -10085 147554
12147 185760 92241 -107973 30878 -21228 443709 138927 -36392 -77674 125064 38847 -283663
12135 -236613 60289 3271 -175229 -118307 -85435 357981 195440 166373 -14469 20260 238905
12124B38905a54441C30033A36450L4650a84274E56474A02143J12494f6934F0051
12113B9634P184J07933a95889A07327l161d81660e8968B75661a94080B32245b35768
12101d78333D6393N8000J84524I0245d26E1615a79511A7381a71909A2194J89298
12090B01492E9822a00419k80701J22552R2768a4945k29694R3730N2882A28799
12079b02649B8711L8967a76152G2158J34906J208017K05933F15330B30443K98692
12069E29135a09293d237r0681p941d5888J7017m2104A66001C263J60539i0672
12057a60829K5503O2100I0963K9909K20645j29853a09481E8371J00000c8369F2584
12045b93402C124a85774f7485j46318Q9853G910b35598a12827B17643O3763B8923
$$ plain form
12124 238905 -154441 330033 136450 171100 -184274 556474 102143 214637 -66934 60051
12113 29634 36818 144751 -195889 107327 104166 -481660 -58968 275661 -194080 232245 -235768
12101 -478333 46393 104393 288917 90245 -426 51615 -179511 17381 -171909 12194 201492
12090 201492 59822 -100419 -381120 -258568 -165800 -14945 -244639 -150909 -98027 128799
12079 -202649 28711 67678 -176152 72158 207064 1415081 1621014 615330 230443 529135
12069 529135 -109293 -4237 -94918 -102859 -45888 -28871 -70975 166001 3263 163802 -90672
12057 -160829 -135326 -73226 90963 120872 341517 211664 -109481 58371 158371 -38369 62584
12045 -293402 3124 -185774 -67485 -213803 -123950 7910 -235598 -112827 217643 281406 28923
12033G0904A600L336J41169K00563a78336P3905g692j5444k6050F2546M5519l5187
12021G2878C4328P4550D9548M3844a23982G2802L03135j49565N1123l2596E3755
12009b36292a02584l41314A06783e2648m0401K1015F8275A3351g6717k02795I3951
11997b22722A86097p3191J65449B2906R5367L22589e28124J23265a96365h7473
11986a18766B80823r1611o9449J29627N4519f0993j62811A29025B8593a23205
11975A53746a38253A16859C0021a42970B5123a51271g433q2227C36959a4728A12622
11963b62554K3786j37131a0388k72488B64527I7390a72101A02222J22467f9093
11952a11159j05364j58621D7154K5804d99912I8573b05550A092g5184G6720a5589
$$ plain form
12033 70904 1600 4936 146105 346668 -178336 -104431 -7692 -23136 -49186 62546 108065 72878
12021 72878 34328 108878 49548 93392 -123982 72802 375937 226372 277495 244899 53755
12009 -236292 -102584 -443898 106783 -52648 -93049 -72034 68275 13351 -76717 -279512 93951
11997 -222722 186097 112906 278355 22906 118273 440862 -528124 -404859 -196365 -87473
11986 -118766 280823 189212 119763 249390 303909 -60993 -223804 129025 28593 -123205
11975 153746 -138253 116859 30021 -142970 25123 -151271 -7433 -89660 336959 -14728 112622
11963 -262554 -238768 -375899 -10388 -282876 264527 97390 -172101 102222 224689 -69093
11952 -111159 -216523 -375144 47154 72958 -499912 98573 -205550 1092 -75184 76720 -15589
11940b12320G4664d7768d281n4761j35443G3904P1205a71537L5954C77472a103
11928A92663a3170B46666J59332b87857J18696l4219l9962a07692A30736b91962
11917b50593I5599h1622k05061C7449j0902L9456L48256a42919d7051o0947K313
11906a05685A06954A9292f8251A10768A3959K33156b26807B63460D2003O637g5402
11894a28142K4352G2319K17420a67606j60509a10028B55270o8925d1445j49641
11884a91086e297j09447j47473A46838f9127B197Q557b5693m2479K2190j46059
11873a92041A45584b6588k9659m4374o100f367k443m9220G38a40542c0646j62839
11861a93485e0359l14053i6738A29164E9643L1374m2674M3080b8711k2862p9651
$$ plain form
11940 -212320 74664 -47768 -4281 -59042 -194485 73904 145109 -171537 -135583 377472 -1103
11928 192663 -13170 246666 405998 -287857 -169161 -203380 -243342 -107692 130736 -291962
11917 -250593 95599 -81622 -286683 37449 26547 66003 414259 -142919 -47051 -107998 -105685
11906 -105685 106954 19292 -68251 110768 13959 247115 -226807 263460 42003 48640 -75402
11894 -128142 -103790 72319 289739 -167606 -328115 -110028 255270 186345 -41445 -191086
11884 -191086 -5297 -114744 -262217 146838 -69127 2197 10754 -25693 -68172 -45982 -192041
11873 -192041 145584 -26588 -56247 -100621 -106721 -6367 -8810 -58030 738 -140542 -30646 -193485
11861 -193485 -50359 -364412 -96738 129164 59643 91017 48343 91423 -28711 -51573 -131224
11850a31224l1370E0614j3830b2342j19449f2886L139D6064a88351K1263j19980
11839b87068B55437a41235F5543a79823B16313B5931d36912A67069i0821p3703
11829a64524C34100C7540K18479a78527K4532A42490a18931p1205j01954A74948
11818b68302Q6340c773l45145A72405N9036p4958a9164G2539i1195d1924j0244
11807e2168H6093o918b5956C28224A34741h925A8857C900c4715k54662e7437B07689
11794A72O9761Q4269b03062f8012b426m6145A05683d3503j97240P8285d1436K735
11782c8701k43160I3131c94512D1354J0393c07032B92612h4280A61557P9906J41902
11771C83365a28611D4255j1993b99957A07906a26349d6759k64450e3902j50456
$$ plain form
11850 -131224 -162594 50614 36784 -22342 -141791 -62886 -59747 46064 -188351 -167088 -287068
11839 -287068 255437 -141235 65543 -179823 216313 25931 -436912 167069 -90821 -164524
11829 -164524 334100 37540 256019 -178527 -153995 142490 -118931 -190136 -292090 174948
11818 -268302 -181962 -3773 -348918 172405 231441 156483 -19164 72539 -91195 -41924 -52168
11807 -52168 86093 79175 -25956 328224 134741 -8925 18857 3900 -34715 -289377 -57437 207689
11794 172 69933 154202 -203062 -68012 -2426 -48571 105683 -43503 -240743 -162458 -41436 -38701
11782 -38701 -281861 93131 -394512 41354 51747 -307032 292612 -84280 161557 241463 383365
11771 383365 -128611 44255 32262 -299957 107906 -126349 -46759 -311209 -53902 -204358
11761b04358b3768A1344l34a94876A93889p9738a62259M2053J0325n2028D0949
11749A1270c00613A55514J3258c4688q7574A61172P9370K83635b05811k8652l01009
11738e35472a02791A44079N0763g9935j2k44091l4321f5088C24232L7726g6146
11726a23608A28372g7355A96964b20937i2724J3279B58517i6196C68391a64749
11715f1769C68358o1720a71669H2458J87482j03757Q2597e7858j21358C9285J59953
11704A99238Q7783a46832A11761N5315R8831l5296J19890q8602a2346e430A0976
11692G4025L03721a57959A23093N5153c52902M1794g3266D0415I292Q0158i5710
11680a78902k1541E3881O1714J10287c9354H6676K8182a74781k8249R0163l1671
$$ plain form
11761 -204358 -23768 11344 11010 -194876 193889 114151 -162259 -120206 -109881 -161909 40949
11749 11270 -300613 155514 168772 -34688 -122262 161172 240542 524177 -205811 -234463 -535472
11738 -535472 -102791 144079 194842 -79935 -79947 -324038 -358359 -65088 324232 361958 -76146
11726 -123608 128372 -77355 196964 -220937 -92724 -79445 258517 -96196 368391 -164749
11715 -61769 368358 306638 -171669 82458 269940 166183 248780 -57858 -179216 39285 199238
11704 199238 287021 -146832 111761 167076 265907 230611 350501 261899 -12346 -5430 10976
11692 74025 377746 -157959 123093 178246 -352902 -311108 -73266 40415 9292 89450 -95710
11680 -178902 -200443 53881 115595 225882 -39354 86676 114858 -174781 -203030 -112867 -144538
11669a44538d0093A78725H562J96510r4194J2965b05363f0379F8095c8557o4609
11658a03166A45750b13820G5309d16657K8064D0584d2291j11925A84398i7141
11647a3866E9493J47112a83504N3712B12722a31809A20379J27054a90154K0447
11637a69707L7508A8427f6257j89812b6109j3106A55528m6062K11014A06436i1061
11625A57225A6223L58359a91014C34153a92866I8669J32328A8727a33070L0604
11615a02466r0053a5988A05900A6703J88020a913r8338A19190c84859A79163h1538
11603b6825B91399a91750B88760I2751A8430K93413E8227J20708b40881G2840
11592B30008K0545j15908k7458n11l8232k190b08746H6659J84678O935C7146h06
$$ plain form
11669 -144538 -40093 178725 8562 205072 110878 123843 -205363 -60379 68095 -38557 -103166
11658 -103166 145750 -213820 75309 -416657 -388593 40584 -42291 -154216 184398 -97141
11647 -13866 59493 206605 -183504 -129792 212722 -131809 120379 247433 -190154 -169707
11637 -169707 -132199 18427 -66257 -256069 -26109 -39215 155528 109466 320480 106436 -91061
11625 157225 16223 374582 -191014 334153 -192866 98669 230997 18727 -133070 -102466
11615 -102466 -192519 -15988 105900 16703 204723 -1913 -100251 119190 -384859 179163 -81538
11603 -26825 291399 -191750 288760 92751 18430 311843 58227 178935 -240881 72840
11592 230008 250553 134645 107187 106676 68444 66254 -208746 86659 271337 278272 37146 -806
11579B09881b55966F04432j52248D2334Q4660a93113A94821A8808K00015k1787
11569A97036e5083A01321g1676B83514I7238R1440a2620k00181A65038B626J29860
11558A32486b37207C29928C2624b53465P6651h1462B26032A8125D5e1074A72138
11546A21563k6684O3869a56588D74924c6372D388i4662k88816B84574a926C95787
11534e3864D9473b72203D2297L58893A93704j405e535G283J40554m5342e8395
11522A054c5424h866j43811A74439F335N4906J99289i5452C72399E1204h598F7343
11509B12469K19495q3265H8102K2519a63607e243B45397P1741D8495M7334M9733
11498A45562J95038A35803Q2202n2557P4388j18569J12164M7609I5301N3703N3024
$$ plain form
11579 209881 -255966 604432 452184 42334 126994 -193113 194821 18808 218823 197036
11569 197036 -55083 101321 -71676 283514 97238 188678 -12620 -212801 165038 2626 132486
11558 132486 -237207 329928 32624 -253465 -176814 -81462 226032 18125 45 -51074 172138
11546 121563 94879 158748 -156588 474924 -36372 4388 -94662 -383478 284574 -1926 395787
11534 -53864 49473 -272203 42297 401190 193704 192299 -5535 7283 147837 102495 -58395
11522 1054 -35424 -8866 -152677 174439 6335 61241 260530 -95452 372399 51204 -8598 67343
11509 212469 431964 348699 88102 110621 -163607 -5243 245397 317138 48495 95829 145562
11498 145562 340600 135803 218005 165448 239836 121267 233431 281040 95301 149004 202028
11487B02028J86652j39728a07424A78959b6093j04458B21548L3623d1047D03317
11476D31268K72654B52423p5126K25997j61783j06642a31363a597B42987J15529
11466C58516A28444M13762j67087F202b0602A49718K9905R8091n1716m2029H6046
11454H4759L17677G7549h5983A62402a41861A10529J2578H71J11418k5622j5836
11443G0831h0413E9148J41453K52839b3255F9992K9079L87091c70472g0423p6590
11432a47013j08572E439a33475B26754b93321B20000G9590L89146A57917a27985
11421c418F5003a76448A06692O7199h1803A58956b6296j41725A41429d9430I5328
11409a74297C75417i2750n4603L6914E5594L0000R0586a42467C38483G650d0044
$$ plain form
11487 202028 388680 248952 -107424 178959 -26093 -130551 221548 255171 -41047 403317
11476 431268 703922 252423 177297 403294 241511 134869 -131363 -1597 242987 358516
11466 358516 128444 542206 375119 6202 -20602 149718 179623 277714 225998 183969 86046
11454 84759 402436 77549 -85983 162402 -141861 110529 123107 871 112289 86667 70831
11443 70831 -80413 59148 200601 453440 -23255 69992 99071 486162 -370472 -70423 -147013
11432 -147013 -255585 5439 -133475 226754 -293321 220000 79590 468736 157917 -127985
11421 -3418 65003 -176448 106692 173891 -81803 158956 -26296 -168021 141429 -49430 95328
11409 -174297 375417 -92750 -147353 -110439 55594 85594 176180 -142467 338483 7650 -40044
11397a54078k0930A5245g5308j55170a07751C29685a40457O0139K4380G2791a69135
11385d63252R1644A1849b7513n6307j8959A40829o7793k4575L4290i4650c4666
11373E60616a09584F7534b06772A63550a28403M8839j92121i7207A39007e2660
11362H3596e1524A98593O6588r5785F4683J2189C842c4008l8711q1587k2392L691
11350a73007m6701A44004D5646a1025o5823B18515i7893k5141A3351b7828B32760
11338A66833b52411C661N4112d85768F4747a54786B41581a24196C3694K34555
11328B68249b47917J7929c2821j66415c9840j96894A37476a1815j61216K8812
11318a44219B224J04595a57265c1712G5348f0563B01836c84206a16667k4435O6238
$$ plain form
11397 -154078 -175008 15245 -75308 -230478 -107751 329685 -140457 -80318 -55938 72791 -169135
11385 -463252 -371608 11849 -27513 -83820 -102779 140829 73036 48461 82751 -94650 -34666
11373 560616 -109584 67534 -206772 163550 -128403 -79564 -271685 -97207 139007 -52660
11362 83596 -51524 198593 265181 169396 64683 76872 3842 -34008 -72719 -154306 -176698 -173007
11350 -173007 -219708 144004 45646 -11025 -76848 218515 -97893 -123034 13351 -27828 232760
11338 166833 -252411 3661 57773 -485768 64747 -154786 241581 -124196 33694 268249
11328 268249 -247917 -229988 -32821 -199236 -39840 -236734 137476 -11815 -173031 -144219
11318 -144219 2224 106819 -157265 -31712 75348 -60563 201836 -384206 -116667 -141102 -74864
11307g4864K3979k14648D1848A8053K584b73849R7537K3290n4463f4501a5491
11295b67818l799J26572B31136A10635o889b47339A68760C3124b60112g3356k19305
11284b92661A80488q7465C427N3793J4519b64142A55819R3269A07871m2310a99551
11272F3722a60176A52389a42999l4469B59615a48962G6911J35267b55717e9239
11261F6782a2921p1383E3496b9466A88903e5386I9320b84065a17371G6737g9061
11249a99618j8706F5068M08c0947A68655n1399b88823R6838L5045c2317A14734
11237A01681b29219l4655A51121M5745a56301A88950i8875B73886J3514a61391
11226A70616a52324B23198g404o9970k66889a69032L1887K5382L0367k47470b5279
$$ plain form
11307 -74864 -50885 -265533 41848 18053 20637 -273849 -176312 -153022 -207485 -64501 -15491
11295 -267818 -271617 -145045 231136 110635 103746 -247339 168760 33124 -260112 -73356 -292661
11284 -292661 180488 93023 3427 57220 71739 -264142 155819 249088 107871 65561 -199551
11272 63722 -160176 152389 -142999 -177468 259615 -148962 76911 212178 -255717 -59239
11261 66782 -12921 -84304 53496 -29466 188903 -55386 99320 -284065 -117371 76737 -79061
11249 -199618 -218324 65068 65476 -30947 168655 117256 -288823 -191985 -156940 -32317 114734
11237 101681 -229219 -263874 151121 196866 -156301 188950 -98875 273886 287400 -161391
11226 170616 -152324 223198 -7404 -77374 -344263 -169032 -137145 -111763 -81396 -328866 -25279
11214A31080J56641j24633D6695c92242h5865F2210R5870a99120C54802d90006
11203B8169a83808P4377E1906Q5399a011p9810A17669a73376A81224q7915a12350
11191f2177E6287O364h2288B74345d37776i235k95540N3865G9181N4007a74310
11179B38090b90436i4921A10306m4801c83226A14466A6606M1032J91286o3425
11169A85499a32649B11710b49985B21751p3148i9677C53795a94335G1288g7446
11158A27681K7631a96282k6184n7483A02223b6269l73394d54l9897r188j14186
11147a63725I1136a44432g1410E886K2060b31073g5970A73707H6250K00322d9440
11135b57228F7905K24003A19022N6728F4083J36659C1375a54040l1686p9408A99220
$$ plain form
11214 131080 287721 163088 46695 -392242 -85865 62210 158080 -199120 354802 -490006
11203 28169 -183808 -109431 51906 137305 -1011 -80821 117669 -173376 181224 93309 -112350
11191 -62177 56287 62651 -82288 274345 -437776 -9235 -304775 -250910 79181 133188 -174310
11179 238090 -290436 -94921 110306 65505 -383226 114466 16606 57638 248924 185499
11169 185499 -132649 211710 -249985 221751 148603 -99677 353795 -194335 71288 -77446
11158 127681 155312 -196282 -222466 -279949 102223 -26269 -399663 -454 -40351 -49539 -163725
11147 -163725 91136 -144432 -71410 5886 27946 -231073 -75970 173707 86250 286572 -49440
11135 -257228 67905 291908 119022 175750 64083 200742 31375 -154040 -185726 -265134 199220
11123C9644a95267F8351J52713B9375c5971B97492c46103I598K45366l9111A00884
11111A00809l0590Q2632J29910A13377J2096J37054D669L8538O219J61793m7344
11100A63875J87413j18268A08173J19061F6554K25688m5983I8119l9115J85638
11090B44642J78157k10663J84290f5584A13995Q6773K48768A93459J04072G292
11079H3964M45156k48534K38714A21809i9056G480M15571j64089Q4723j10491
11069B33194J7364P9124j5631J29620q3299k0967M7237A14920L53787L2327K17471
11058G18505l51417L87803l69243L02928K73679B81587L04567j27190L70356j23745
11048G05575p0100j11634J9781n6761L63408k10489J61055j11108l05261M46836
$$ plain form
11123 39644 -195267 68351 221064 29375 -35971 297492 -346103 9598 254964 215853 100884
11111 100809 70219 152851 282761 113377 125473 262527 4669 43207 49426 211219 163875
11100 163875 351288 233020 108173 227234 66554 292242 246259 98119 59004 244642
11090 244642 422799 212136 396426 -65584 113995 200768 449536 193459 297531 7292
11079 83964 529120 280586 519300 121809 -99056 7480 423051 258962 343685 233194
11069 233194 250558 329682 314051 443671 360372 339405 386642 114920 468707 501034 718505
11058 718505 367088 754891 385648 688576 962255 281587 586154 458964 829320 705575
11048 705575 635475 523841 543622 486861 850269 639780 800835 689727 384466 831302
11038H31302k6586j33813L07101l52349R523M09389m17651K25825q1689J99728
11028I70780m39102M36480k4303m55148L78339j32275l2130k03507J09456j65385
11018D43205P4685j6784R6606P5811K2240C45810M12121K8034q9471j68P7671
11007G73997k37281M0030r2009K93357k44099j15971J91213J61394j06006J48785
10997H13410k6626B41715L57297m1167M01950j8880m65912K46443K4719j11069
10987F35096M00769l42976L40853J40785j50933K30336l14155L52387o7340m2382
10977A182440M44342k08679M85212K51803M38628R4515K3746J16769j31534M9096
10967B746338j75510M8936q07813l1089O9264n67641M88339j1833l1988K0621
$$ plain form
11038 831302 804716 670903 978004 625655 635178 1044567 626916 852741 771052 970780
11028 970780 531678 968158 943855 488707 867046 734771 702641 499134 608590 443205
11018 443205 517890 501106 597712 673523 695763 345810 757931 785965 696494 696326 773997
11007 773997 536716 576746 484737 778094 533995 418024 609237 770631 664625 813410
10997 813410 786784 241715 599012 557845 959795 940915 475003 721446 746165 635096
10987 635096 1035865 692889 1033742 1174527 1023594 1253930 939775 1292162 1224822 1182440
10977 1182440 1626782 1418103 1903315 2155118 2593746 2688261 2712007 2828776 2697242 2746338
10967 2746338 2570828 2619764 1811951 1780862 1850126 1282485 1770824 1758991 1727003 1747624
10957A747624k23073L01433K69672k47223j78158l19237J04353q1863n68419j86825
10947F18284J93688k81796k39904j13192L78024G5192L21818d1048C91371C4947
10936C0183L22378l0535J48803E4531f7099A5756J92183I7616E007K33444a15581
10924A14158D746L474g8816k1358A89984i2191l4904G0705b30424j731k45A05012
10911b26954A40588a79609B96586a87671n4436J01061D908K81356o8445J3731
10901B31550G0632K7224f8222r5512d5307q7203p9275H0108b5635k15194G758
10889b0393H5313d21638F8997b694B2294K13410A4667b3180l4421A21198A4422
10877c4955j59038m4119l1625A05587a20149N7776j81995R4528G1420L637A0491
$$ plain form
10957 1747624 1524551 1825984 2095656 1848433 1670275 1351038 1455391 1373528 805109 618284
10947 618284 811972 530176 290272 177080 555104 75192 397010 -41048 391371 34947
10936 30183 352561 322026 470829 54531 -67099 15756 207939 97616 5007 238451 -115581
10924 114158 4746 8220 -78816 -100174 189984 -92191 -127095 70705 -230424 -232155 -232400 105012
10911 -226954 140588 -179609 296586 -187671 -242107 -141046 4908 286264 217819 231550
10901 231550 70632 97856 -68222 -163734 -45307 -132510 -211785 80108 -25635 -240829 7758
10889 -20393 85313 -421638 68997 -2694 22294 235704 14667 -23180 -57601 121198 14422
10877 -34955 -193993 -238112 -269737 105587 -120149 -62373 -244368 -149840 71420 75057 10491
10865c93554G4172a41914A22682d37189i1833K0274l0619G8507J90005d8452A72839
10853A08330a17113B92323i613B53290c3056D5713c93752J86974C05530D2686
10842D0544J96185p5286b28910C15510A32743p210E2399J00077b58931A94832
10831C3463n858N826M853b866k91396J3514A68414o1209a79670B56409C7943J73570
10819B11513A01709b30633A72092B1523a42145A42272h2674A44996g8414a6372
10808A77381d2022A87417b8376o7019A64288b90338I0557a6406p117C33332b13622
10796d34897J88436J00352K916C08725b59998D34949b4241j6579I0236l8471b25021
10784e1792A4564a47134j10075F0990a11111j43584q503A97622F6580e1065p9802
$$ plain form
10865 -393554 74172 -141914 122682 -437189 -91833 -71559 -102178 78507 268512 -48452 172839
10853 108330 -117113 292323 -9613 253290 -33056 45713 -393752 -206778 305530 42686
10842 40544 236729 161443 -228910 315510 132743 125533 52399 152476 -258931 194832
10831 33463 27605 33431 38284 -2866 -294262 -280748 168414 107205 -179670 256409 37943 211513
10819 211513 101709 -230633 172092 21523 -142145 142272 -82674 144996 -78414 -16372
10808 177381 -42022 187417 -28376 -95395 164288 -290338 90557 -16406 -23523 333332 -213622
10796 -434897 -246461 -146109 -143193 308725 -259998 434949 -24241 -40820 90236 51765 -225021
10784 -51792 14564 -147134 -257209 60990 -111111 -254695 -263198 197622 66580 -51065 -130867
10773a30867j9093j31653K1458B2704c08963B1063b14296P3373f6324m8283j59367
10762b73974O631C36766A23674n3837a14000B22264a12980L8681a9332j5502H1578
10750C86388b38833o009B01820l8088a07708K1449j27847l5100E0847h5061A71149
10738f11759B37428a33379K7655k9313M799o9634G3133R9384B5938c01465a04688
10726b63627A13678a95327C9727c82081D9418P8703P5600k9712c06043A3008c66770
10714b28650A71045b52642o7674A16539k1929m4862J50440a12179E08712b06221
10703A05713a30954D1311f193k21320E8585K88149j09499C1481e1262m3853A07872
10691A1535a27313L1694H938a23857j28798n7048I0759b194F8617b64919a23615
$$ plain form
10773 -130867 -149960 -281613 -260155 22704 -308963 21063 -214296 -140923 -66324 -114607 -273974
10762 -273974 -267343 336766 123674 69837 -114000 222264 -112980 -74299 -19332 -34834 81578
10750 386388 -238833 -244842 201820 163732 -107708 -86259 -214106 -249206 50847 -85061 171149
10738 -611759 237428 -133379 -105724 -135037 -130238 -199872 73133 172517 25938 -301465 -104688
10726 -263627 113678 -195327 39727 -382081 49418 128121 203721 174009 -306043 13008 -366770
10714 -228650 171045 -252642 -320316 116539 94610 49748 200188 -112179 508712 -206221
10703 105713 -130954 41311 -6193 -227513 58585 346734 237235 31481 -51262 -95115 107872
10691 11535 -127313 -95619 8938 -123857 -252655 -309703 90759 -2194 68617 -264919 -123615
10679c07033D1416e0589A28368C0998J11607l0075D2620c68217a66043H1516c29084
10667F9671b01973P7824K4120F960c23808b6234q0866A00786f1023I8619b07055
10655B02401h0892c3314k69637E5303d4740A8098a07450B47485o9923b9358F8301
10643a09328H5710A9152J09272b77255D8264h8826c0031A25612K9764m6858a96914
10631h4690l45957a78928A8459a85633b9190k78649A33818a15158Q224B06369
10620h5348D8347L2513M2617e42226d9745j73307B37595h564j58769m5296j74657
10609c87286C4444b27887k33007J52759J05070k1888D242b0344G9045O0957j5685
10598A24317J2979n911c46095e5559F2917e4779l31651A59087a15165H1978h1136
$$ plain form
10679 -307033 41416 -50589 128368 30998 142605 112530 42620 -368217 -166043 81516 -329084
10667 69671 -201973 -124149 -100029 6960 -323808 -26234 -107100 100786 -61023 98619 -207055
10655 202401 -80892 -33314 -302951 55303 -44740 18098 -107450 247485 177562 -29358 68301
10643 -109328 85710 19152 128424 -277255 48264 -88826 -30031 125612 155376 108518 -196914
10631 -84690 -430647 -178928 18459 -185633 -29190 -307839 133818 -115158 -106934 206369
10620 -85348 48347 80860 123477 -542226 -49745 -223052 237595 -8564 -167333 -212629 -387286
10609 -387286 34444 -227887 -460894 -308135 -203065 -224953 4242 -20344 79045 140002 124317
10598 124317 137296 131385 -346095 -55559 62917 -54779 -386430 159087 -115165 81978 -81136
10586b90421f3735C1360K0439j4870e1063k48683I3540c84091H09a91377A44869
10574b51835J13590H2051h4574G2482c75979d7744A83234p3292J16632r7926c3989
10562A76430J00639a65878D05968A96882D2862Q7498f2626A16482d51756a09287
10551c16908E6998K40569e0009e199A5019b10592c6160A3497L7279g5125E3173
10539a91817p6506a9104j49923f8218G5067a16869n925m6432j8011e5918A02213
10527g8347l51872b8879o1445b0687q3561R465p1750N5365I256K24406a69419
10515B35354a12955j77666A58393G45g4501n7257E1500P902a73134g1275C8970
10503G1726Q8868p7868e0528B30204a53977l9541A18331a0074D1112e7880A01462
$$ plain form
10586 -290421 -63735 31360 51799 36929 -51063 -299746 93540 -384091 809 -191377 144869
10574 -251835 -138245 82051 -84574 72482 -375979 -47744 183234 109942 226574 128648 -33989
10562 176430 277069 -165878 405968 196882 42862 130360 -62626 116482 -451756 -109287
10551 -316908 56998 297567 -50009 -5199 15019 -210592 -36160 13497 50776 -75125 53173
10539 -191817 -268323 -19104 -169027 -68218 75067 -116869 -122794 -169226 -187237 -55918 102213
10527 -78347 -430219 -28879 -90324 -20687 -104248 -94783 -166533 -111168 9256 233662 -169419
10515 235354 -112955 -290621 158393 745 -74501 -131758 51500 59402 -173134 -71275 38970
10503 71726 160594 82726 -50528 230204 -153977 -193518 118331 -10074 41112 -57880 101462
10491b10450J02655A09768G877a74635A52560a22938B12396c79668i3691A82406
10480D17101j04476N4070K29956I0303N2129b79663E7371J7964a49901A3839a77968
10468G2532K2226d3268A7850b3793j17888r662H8126J88180E4437b07701P2331
10457a35370o3638A68018c41820J05934d8961A1651a9380j00450J8690A9465c5560
10445E8364b04814e5086A57825k8957a43797B61388o5627a41524c0027j09074
10435a39101A73025N9728D4490a78166k0775o023B98142I7980a59434g6132a2063
10423A14400a84210A71693m6617c3927o9100k2157H748e5650A10061c2367F2157
10411B3136f3014k0538D6996g2424n109B4137J77722A993L68120j36551E5753
$$ plain form
10491 -210450 -107795 109768 7877 -174635 152560 -122938 212396 -379668 -93691 182406
10480 417101 312625 366695 596651 90303 142432 -279663 57371 75335 -149901 13839 -177968
10468 72532 94758 -43268 17850 -23793 -141681 -151343 88126 276306 54437 -207701 -135370
10457 -135370 -199008 168018 -341820 -235886 -48961 11651 -19380 -119830 -101140 19465 -35560
10445 58364 -204814 -55086 157825 128868 -143797 261388 195761 -141524 -30027 -139101
10435 -139101 173025 232753 44490 -178166 -198941 -204964 298142 97980 -159434 -76132 -12063
10423 114400 -184210 171693 125076 -33927 -103027 -125184 8748 -55650 110061 -32367 62157
10411 23136 -63014 -83552 46996 -72424 -77533 24137 201859 1993 370113 233562 55753
10399d28861C32930o3205a51558L2117q452A70574J03445A28366b80630A92586
10388B42692A10175Q727f4780R212E5011J52708e5978H6905p052b3108o9222C8582
10375A75966N84292a09464A86558K4086n2741K80823d5858D12456j24782L32240
10365F19914B12669L76718B86351N3521D9007K60224n8978K77276A40511K59586
10355D00097r6061I2708B4499K82235A21264O70058j03507k01765A17637J50945
10345B68582A06365N04065j76059J68584r0491a04081A17651I409N91361k18068
10335C82702A2073D66e1638A03281i6818A97982N4647e1224l948B2516M4592N7362
10323A24470O2647J6494K55837k14981o7785L60067A17540b04880e9880o8569
$$ plain form
10399 -428861 332930 269725 -151558 -119441 -127893 170574 274019 128366 -280630 192586
10388 242692 110175 118902 -64780 -55568 55011 207719 -55978 86905 79853 -23108 -92330 38582
10375 175966 760258 -109464 186558 210644 157903 438726 -45858 412456 287674 619914
10365 619914 212669 589387 286351 339872 49007 309231 250253 527529 140511 400097
10355 400097 304036 92708 24499 306734 121264 791322 687815 486050 117637 268582
10345 268582 106365 610430 434371 602955 512464 -104081 117651 9409 600770 382702
10335 382702 12073 466 -51638 103281 -96818 197982 252629 -51224 -55172 22516 67108 124470
10323 124470 187117 203611 459448 244467 176682 536749 117540 -204880 -59880 -128449
10313a28449e5131B76204f4994D45873a62424j29462D6502k1437L04225O697D2075
10301C05744p5501G0970J17100c461D14220a15594l36675C06960a01877r5601
10291a97478A33854a40507j96026a1533j6616k20328h5155H7218b8960l65805
10281c94765e1535A74473b53635D5338a80497h1068B4061g5548c6012j88496C79782
10269F9332k6671q777e8971m8035k59171C4896d11314D3938b01659H2747M24966
10258E07713j76211L1315L9382A15624K7057g2403J6910A57059i1622B06194J60214
10247C66408m5039o3215a85756j46075M5911A2292a97539D32506b56593a18970
10236I0966P083K00198a37237q7797p4994J33793M4939r4344M6521L7247r1695
$$ plain form
10313 -128449 -55131 276204 -64994 445873 -162424 -291886 46502 25065 329290 335987 42075
10301 305744 230243 70970 188070 -3461 414220 -115594 -452269 306960 -101877 -197478
10291 -197478 133854 -140507 -336533 -11533 -28149 -248477 -85155 87218 -28960 -394765
10281 -394765 -51535 174473 -253635 45338 -180497 -81068 24061 -75548 -36012 -224508 379782
10269 69332 42661 33884 -58971 -107006 -366177 34896 -411314 43938 -201659 82747 507713
10258 507713 331502 362817 402199 115624 142681 -72403 -55493 157059 -91622 206194 366408
10247 366408 321369 258154 -185756 -331831 -285920 12292 -197539 432506 -256593 -118970
10236 90966 98049 298247 -137237 -225034 -300028 -166235 -121296 -215640 -169119 -131872 -223567
10225b23567G4745l6990J70032e4222A20880g5217a7930j73939A78442H3336c8555
10213h581m353A33205D670b4336p0942A2043b67769B69782O6435d5024A41202
10201c98779A05651h5609F5975O2804a51025P4384j68558A97038b05739L0921
10191a74818j86390F7752J10992a65880R097b5164p1689k25987O3430P5068d6671
10179b32119e626I5400m2842A1217a93484A58794b89936I2553a11097C067M263
10168G330J86198c38714G130O7735a71962r995H7632f6549k10236K2027G2202
10156H9235a56861B98180g5709j76620H0015b44784B9775a25088q5397B38047
10145A49002d5594j69193c3872d432l13138C4b10048j1274i6319B42601d483n2125
$$ plain form
10225 -223567 74745 37755 207787 -54222 120880 -75217 -17930 -191869 178442 83336 -38555
10213 -8581 -12934 133205 4670 -24336 -95278 12043 -267769 269782 336217 -45024 141202
10201 -398779 105651 -85609 65975 128779 -151025 -76641 -245199 197038 -205739 -174818
10191 -174818 -361208 67752 178744 -165880 -156783 -25164 -96853 -322840 -259410 -184342 -46671
10179 -232119 -5626 95400 52558 11217 -193484 158794 -289936 92553 -111097 3067 7330
10168 7330 193528 -338714 7130 74865 -171962 -181957 87632 -66549 -276785 -254758 72202
10156 89235 -156861 298180 -75709 -252329 80015 -244784 29775 -125088 -210485 238047
10145 149002 -45594 -214787 -33872 -4432 -317570 34 -210048 -221322 -96319 242601 -4483 -56608
10133e6608I3588j5096a76241d2658k53352J23864A97766a08241b0786j87479
10123b08265N9607p6738B79685D6246J55675d3618m9296c7204C7136d8163G1193
10111c53997Q3856C37408a40085B61656b8775I1634g5068q5928c0528j29584g2521
10099I6098k4931d8779n6496L372A96067d4217j3763k09818J08574N0825A22018
10087H4583d92048A61002i2914j73377m581A45597h1092A674R2711b24368m2322
10076b66690H2164g5708r3366A01233b88152c2210j50729B06967j6498a25068
10065a02359a3878l32310A43840b52673A64667f2037B57028H102K42166E1332
10054A56675e0519l27017R5220h3213j2796o8995O6708k6405k04135A57882a80172
$$ plain form
10133 -56608 93588 78492 -176241 -42658 -296010 -172146 197766 -108241 -20786 -208265
10123 -208265 -148658 -225396 279685 46246 201921 -43618 -92914 -37204 37136 -48163 71193
10111 -353997 -270141 337408 -140085 261656 -28775 91634 -75068 -160996 -30528 -160112 -72521
10099 96098 71167 -48779 -105275 -101903 196067 -44217 -57980 -267798 -159224 -108399 122018
10087 84583 -492048 161002 -92914 -266291 -270872 145597 -81092 1674 94385 -224368 -266690
10076 -266690 82164 -75708 -169074 101233 -288152 -32210 -182939 206967 190469 -125068
10065 -102359 -13878 -346188 143840 -252673 164667 -62037 257028 8102 250268 51332
10054 156675 -50519 -377536 -282316 -83213 -96009 -165004 -98296 -124701 -328836 157882 -180172
10042d1473h995j5698k06837A20138b49682h0829k00500H5500i5426n5104A06506
10030I844b62539M1065e9049j58699p6887Q7536j794A53867k7452h4266k19876
10019c04142D9787d38075J15310J51058P2539r9642M0346j00256B46826a73630
10008c44128h2124l49460f3890A4392J7628R0722k0037J80445c81504A74233K44704
9997D18937H417a98172D171b05821J939A88109a35298C3550b32096a3833A39082
9985a68225A81941b43684a06737B31020I6609b69668C4097a51351L8714A04057
9974i2951G1562a96405K2551j3823n1866f8209a4732A46461d0582k3488A49921
9962a89753j27180R1740n3613a36944F7866b61228O3053A85243J3549d6948n6345
$$ plain form
10042 -41473 -8995 -24693 -231530 120138 -249682 -80829 -281329 85500 -95426 -150530 106506
10030 9844 -262539 -221474 -59049 -217748 -294635 -207099 -208893 153867 126415 -84266 -304142
10019 -304142 49787 -438075 -322765 -171707 -99168 -198810 -158464 -258720 246826 -173630
10008 -344128 -82124 -431584 -63890 14392 32020 122742 102705 283150 -381504 174233 418937
9997 418937 8417 -198172 4171 -205821 -203882 188109 -135298 33550 -232096 -13833 139082
9985 -168225 181941 -243684 -106737 231020 96609 -269668 34097 -151351 -112637 104057
9974 -92951 71562 -196405 -173854 -187677 -239543 -68209 -14732 146461 -40582 -64070 149921
9962 -189753 -316933 -225193 -278806 -136944 67866 -261228 -198175 185243 198792 -46948 -103293
9951a03293I6856h4567o1957G4825a01405L2867A36576a04058j7971m27983e8571
9939D880a05371a3634k45331B07090g721m788k87959R0277q1845l4172a27210
9927b20223I2757l7908g4297m0190k6887k39165C4109P8852d71339H1815L6497
9916A18312A8221J8836b42228h8352C61969a96656C52797a4286M317j23282L1971
9905a01280E3604i8898A13565a62099B47009e4818j62951j0289g9634a1842H6600
9893D6739J1618j4572J29673b57341j7778a02804C60642a56714A1855P0998a53909
9881A31599e21485b56377M6612h8598j30804A48833a77869P920N6725a4994A29356
9869A2363L23531a51115B57575E9267c74379P9317J03338D6077b17950f0200G7682
$$ plain form
9951 -103293 96856 -84567 -146524 74825 -101405 -68538 136576 -104058 -122029 -550012 -58571
9939 4880 -105371 -13634 -258965 207090 -7721 -12509 -300468 -210191 -292036 -326208 -127210
9927 -220223 92757 54849 -74297 -114487 -141374 -380539 34109 112961 -471339 81815 118312
9916 118312 18221 37057 -242228 -88352 361969 -196656 352797 -14286 -9969 -133251 -101280
9905 -101280 53604 -98898 113565 -162099 247009 -54818 -217769 -228058 -79634 -11842 86600
9893 46739 58357 43785 173458 -257341 -275119 -102804 360642 -156714 11855 82853 -153909
9881 131599 -521485 -256377 -209765 -88598 -219402 148833 -177869 -169949 -113224 -14994 129356
9869 12363 335894 -151115 257575 59267 -374379 -295062 -191724 46077 -217950 -60200 77682
9857C0868Q840g6923k66385f5560o4928D1188L7865c09292a52181A94278b03260
9845c54551R4594C0584d1082B27423P9697d8482a0974l04965E2698d42981A54892
9833i9205C59970A76542a65400P4055L4294A7828a7629j31073f5689A22393a03605
9821a89624j65348D795K66022b60178F891d2108k29359B30706I5017i9401K0146
9810g9255F6477b87054K2999N8933J0863l47925h7573H0142c45920I8461K08475
9799C06936a48152A95015E5622P1203d64907a7165l94588a69062h3407a1104q1354
9788i2458C61142h0200E7986K41397H8027b30550K3463L6224C1929b31869E6213
9776c8586j71322a03813j16899c810A8484a20996B5208b31951k4075A28413O9348
$$ plain form
9857 30868 39708 -76923 -343308 -65560 -130488 41188 79053 -309292 -152181 194278 -203260
9845 -354551 -259957 30584 -41082 227423 307120 -48482 -10974 -315939 52698 -442981 154892
9833 -99205 359970 176542 -165400 -91345 -57051 17828 -17629 -148702 -65689 122393 -103605
9821 -189624 -354972 4795 270817 -260178 6891 -42108 -271467 230706 95017 -99401 -79255
9810 -79255 66477 -287054 -264055 -205122 -194259 -542184 -87573 80142 -345920 98461 306936
9799 306936 -148152 195015 55622 126825 -464907 -17165 -411753 -169062 -83407 -11104 -92458
9788 -92458 361142 -80200 57986 299383 88027 -230550 -207087 -170863 31929 -231869 56213
9776 -38586 -209908 -103813 -220712 -3810 18484 -120996 25208 -231951 -256026 128413 197761
9765A97761a75075A72064E4621A9428b16834Q9967a1967j40482A10727J207f3580
9753c3395j39189n151J3492E3066K4942c18384h9133K9565k54706b5334j6582
9742d1916B51811h7388j60741j8978g2243j07770j80542a74830A54148a99233
9731a51854A38271E8806K64619E5823J46975b76652Q4709A24047c4331A30017
9720A42666a64061A5149P6176b6663j09300m61414A07365g1616o9352h425j60611
9709a69036P5531o9526l09443J48209B80604E8198h0273K9902B67157f4161b9803
9697b38242a16061n2026J3952F6851C2752a42810n5083e977A386b27094O1002
9686a66092F4270K18842b62747j66675f9066k24120n837H7820m3233J07261J5249
$$ plain form
9765 197761 -175075 172064 54621 19428 -216834 -126867 -11967 -152449 110727 111934 -63580
9753 -33395 -172584 -177735 -164243 53066 78008 -318384 -89133 -59568 -314274 -25334 -41916
9742 -41916 251811 -87388 -248129 -267107 -72243 -180013 -360555 -174830 154148 -199233
9731 -151854 138271 58806 323425 55823 202798 -276652 -191943 124047 -34331 130017
9720 142666 -164061 15149 91325 -26663 -135963 -597377 107365 -71616 -140968 -8425 -169036
9709 -169036 -93505 -163031 -472474 -324265 280604 58198 -80273 -50371 267157 -64161 -29803
9697 -238242 -116061 -168087 -154135 66851 32752 -142810 -197893 -5977 1386 -227094 -166092
9686 -166092 64270 283112 -262747 -429422 -69066 -293186 -299023 87820 44587 151848 167097
9675A67097c27200J46484m9746A98340c00108J18683C292a89297j4674R7511d5265
9663a86057A12298K8222c00969j01a20803J4550M6818A18205a80455D3999c20282
9651c34491J63209A51173g3530l2657n6339j42225A32225c68089B5454e9899E7772
9639b83269B32557d5872B55052m0405c12546J28481a2785l0383j33970K6205E2028
9627C7774f0010A71489j8335o0090g1863c1851I3992a13089e2060k9426r2141
9616a73627M674L3431H5294i7698o573M3789j13074M153l01568a40946A37800
9604c30654A07518a84601A42735b67274K6809j01111g8563C24644I9880a22868
9593A78805a34353N1680c9362A28439a20452G705c62815J34506a3684j62336B00955
$$ plain form
9675 167097 -327200 -180716 -230462 198340 -300108 -181425 3292 -189297 -203971 -106460 -45265
9663 -186057 112298 140520 -300969 -301070 -120803 -106253 -59435 118205 -180455 43999 -320282
9651 -334491 -171282 151173 -73530 -106187 -162526 -304751 132225 -368089 25454 -59899 57772
9639 -283269 232557 -45872 255052 214647 -312546 -184065 -12785 -43168 -177138 -150933 52028
9627 37774 -60010 171489 153154 93064 -71863 -31851 93992 -113089 -52060 -81486 -173627
9616 -173627 -168953 -135522 85294 -97698 -104271 -60482 -173556 -169403 -470971 -140946 137800
9604 -330654 107518 -184601 142735 -267274 -240465 -341576 -78563 324644 99880 -122868
9593 178805 -134353 -82673 -39362 128439 -120452 7705 -362815 -228309 -13684 -176020 200955
9581a15301H3313h2298L4683A02590d14043e3936A53623a61445A60861b17570
9570a08216q1326Q2958q5497c0823k83181a14239H8844a9452j15869P060A7483
9558e5573K9a0780l17157B36378C7289b00634d6446A74431j990e4112k90065a00504
9545F2537J48266F4310J26141I0957b59375A18050a70674H4446J35637d4781m1859
9534h6640b3538j03305j58907C0315c00792A24754B7153d52450J94026C8087J05696
9523A43783E0664d7478k32853A57353D7016b4829j155H9531c30798a13839n3906
9512a67745B3708K84842j25857a13789l5017o0983H6944b98536f3663j60022A22481
9500d03548J06103f0733B5513a07307J3630j32592n2960e3776A63639b37890g8607
$$ plain form
9581 -115301 83313 -82298 -47615 102590 -414043 -53936 153623 -161445 160861 -217570
9570 -108216 -189542 -106584 -192081 -30823 -314004 -114239 88844 -19452 -135321 -128261 17483
9558 -55573 -55544 -10780 -327937 236378 37289 -200634 -46446 174431 172441 -54112 -344177 -100504
9545 62537 210803 64310 190451 90957 -259375 118050 -170674 84446 220083 -44781 -86640
9534 -86640 -23538 -126843 -285750 30315 -300792 124754 27153 -452450 -258424 38087 143783
9523 143783 50664 -47478 -280331 157353 47016 -24829 -25984 89531 -330798 -113839 -167745
9512 -167745 23708 308550 182693 -113789 -148806 -209789 86944 -298536 -63663 -223685 122481
9500 -403548 -297445 -60733 25513 -107307 -93677 -226269 -279229 -53776 163639 -237890 -78607
9488A06678J88524a26520j66559c9533A52218M5811C1632A3015e1116j31553M2756
9477a39913j4227j34440A01702A7998d48204B5466c46981E9284B3196c10615f4503
9465c488j38664d822A03434a0068D1015J5790b20581B55025G0L2296F691J29177
9453A35868b69627P7098q6105i3851r1028r079N0418D0761c26874L3812e6723
9441a63737c7252L776a6313A98196k7049b35162c8239M314j3055A56663a49865
9429c84610H6110a44557f8224j49287j73762A39271a239m1278A28306R3782e2298
9417b31149j1120b7018A44506a07857c442D6971i4957A53825b15106A25321a7532
9405A16954M1943d1858h920F8376c62510A45992N8337c4366k39832A97749b979
$$ plain form
9488 106678 295202 -126520 -293079 -39533 152218 198029 31632 13015 -51116 -182669 -139913
9477 -139913 -154140 -288580 101702 17998 -448204 25466 -346981 59284 23196 -310615 -64503
9465 -3488 -142152 -4822 103434 -10068 41015 56805 -220581 255025 70 32366 6691 135868
9453 135868 -269627 -192529 -278634 -93851 -184879 -193958 -143540 40761 -326874 -293062 -56723
9441 -163737 -37252 -33476 -16313 198196 171147 -235162 -38239 -33925 -46980 156663 -149865
9429 -384610 86110 -144557 -68224 -217511 -391273 139271 -1239 -42517 128306 222088 -52298
9417 -231149 -242269 -27018 144506 -107857 -3442 46971 -94957 153825 -215106 125321 -17532
9405 116954 158897 -41858 -8920 68376 -362510 145992 204329 -34366 -274198 197749 -2979
9393B84028A933e4394q1809c1739j428A02495a63463f0734j44334M8181e5668
9381b73743e3218j07765D93025B44094J23747A5655a04316l5222L0250R064B2902
9369d62986a05590K6325j32201N0772B03218a02266j55737m1706E5165b41174
9358a33751k75623i5942K3015B92114A9350a62810N2818E2730a20654k80280a06301
9346g7559Q250A16811L18571g4319b814C467J1979c9166k03414D1621J91144D5906
9333b55147B30373A3684b50263r0760D3683K44841e1769D52691b79733j49930
9323d29663h7084B580d34430G0855b10994R2535b8967K098A43373a83193G1325
9311a05195k5591d2709A51222E3002b45106l52129C76371c70713a31471B9253
$$ plain form
9393 284028 1933 -54394 -136203 -31739 -33167 102495 -163463 -60734 -205068 -156887 -55668
9381 -273743 -53218 -160983 493025 244094 367841 15655 -104316 -139538 -109288 -100224 22902
9369 -462986 -105590 -79265 -211466 -160694 203218 -102266 -258003 -299709 55165 -241174
9358 -133751 -409374 -95942 -72927 292114 19350 -162810 -109992 52730 -120654 -400934 -106301
9346 -77559 -69309 116811 435382 -74319 -2814 3467 15446 -39166 -242580 41621 232765 45906
9333 -255147 230373 13684 -250263 -341023 43683 288524 -51769 452691 -279733 -429663
9323 -429663 -87084 2580 -434430 70855 -210994 -118459 -28967 -26869 143373 -183193 71325
9311 -105195 -130786 -42709 151222 53002 -245106 -597235 376371 -370713 -131471 29253
9300C12882b72845B38008e8865A45910b15173G8691b03400A96535a61712l2029
9290a93741e3578l8664l5350K4613I1424b63957A6793c76383a03056D1241J11925
9279A53166r353c3121k57262R1763e4487J5127A21594a80868H9697n534h6576
9267c26657P9533R5314e0153a2771A9833J3968c7699j5110B24604a99587j66788
9256c66375a52942m3662j8994h0709A0342K38793c69481a06188M3727A79339b43443
9244B7338J39984l0802K8536b5612I1002d7850H6358a58697N3701B7046b36573
9232a05519B39680b7918E5018a73410O1222j55351M9626C3343b04308c3990j41196
9221a75186a5138l46319J22759O6836G2885K97038A0284h3966n8928B28911H6394
$$ plain form
9300 312882 -272845 238008 -58865 145910 -215173 78691 -203400 196535 -161712 -193741
9290 -193741 -53578 -92242 -127592 -102979 91424 -263957 16793 -376383 -103056 41241 153166
9279 153166 143813 -33121 -290383 -198620 -54487 -39360 121594 -180868 89697 84163 -86576
9267 -326657 -247124 -151810 -50153 -12771 19833 33801 -37699 -52809 224604 -199587 -366375
9256 -366375 -152942 -196604 -215598 -80709 10342 249135 -369481 -106188 -62461 179339 -243443
9244 27338 167322 136520 165056 -25612 91002 -47850 86358 -158697 -104996 27046 -236573
9232 -105519 239680 -27918 55018 -173410 -112188 -267539 -217913 33343 -204308 -33990 -175186
9221 -175186 -15138 -361457 -238698 -171862 72885 369923 10284 -83966 -142894 228911 86394
9209c95444d4779B66279f535B73797B312K99038b63168N6097C39279b35956p9491
9198c15447A22089G859c50142J66298A05377b22275P7082f9690j71486C4981E461
9186c8299B7179b39696b191q8818q6515d7348B11482r4375I666a83448L0250F7014
9173B52133i1070d3270j97887B83365d50291G3555P8397a38499H4782a11522H1837
9161a74454n0613H0637c8009C688L3000M3611e0204A0530K2910a45959j5792B55343
9148A06357i6722C3671a40494L6483d7643o0244d9242j33227D2930H072l360b25179
9135c15926b7889D9055L1013a63427P9813A69622d4814p230B67476a01773k61616
9124c63389l9386i8271l0461k1688L24f2615J1366A01094b50438K0361L01C30286
$$ plain form
9209 -395444 -44779 266279 -6535 273797 2312 301350 -263168 -207071 339279 -235956 -315447
9198 -315447 122089 7859 -350142 -183844 105377 -222275 -145193 -69690 -241176 34981 5461
9186 -38299 27179 -239696 -2191 -91009 -177524 -47348 211482 117107 9666 -183448 -153198 67014
9173 252133 -91070 -43270 -241157 283365 -450291 73555 151952 -138499 84782 -111522 81837
9161 -174454 -225067 80637 -38009 3688 36688 80299 -50204 10530 33440 -145959 -161751 255343
9148 106357 -96722 33671 -140494 -104011 -47643 -107887 -49242 -182469 42930 8072 4712 -225179
9135 -315926 -27889 49055 80068 -163427 -83614 169622 -44814 -52044 267476 -101773 -363389
9124 -363389 -402775 -98271 -128732 -150420 -150096 -62615 -51249 101094 -250438 -230077 -229776 330286
9111A13785a31062o6326N8225I3277a2586I276d12361a30264f2325k64181g7071
9099a09652j43954j23739D8693f3034A4619K58416j06545K9069H662c90685A06291
9087a73548h2745b5217G96K10733a86186A79436c70072M4402A4034b27406R0428
9076a36978C38114b82702d7982P126j53430f7164j59843G1288b5198j04322n2393
9065a81913a4301p2469p2022n4662a3565j66596A2665R5409b11760C4118a24183
9053A40895g9172I1663N484N2522A8671b3223B08197d7867l76654A30540N9930
9042A90470J19504A7683c0259q2933e6297k02205e1269k67406j39943N375K04188
9031b49055A26986n8390L7216m6184h6446m33938g6592l05154B87521b35847n6371
$$ plain form
9111 113785 -131062 -197388 -139163 93277 -12586 9276 -412361 -130264 -62325 -326506 -77071
9099 -109652 -253606 -377345 48693 -63034 14619 273035 166490 195559 8662 -390685 106291
9087 -173548 -82745 -25217 796 211529 -186186 179436 -370072 -325670 14034 -227406 -136978
9076 -136978 338114 -282702 -47982 -40856 -194286 -67164 -227007 71288 -25198 -129520 -181913
9065 -181913 -14301 -86770 -158792 -213454 -13565 -180161 12665 108074 -211760 34118 -124183
9053 140895 -79172 91663 97147 149669 18671 -23223 208197 -47867 -424521 130540 190470
9042 190470 309974 17683 -30259 -113192 -56297 -258502 -51269 -318675 -458618 -453243 -249055
9031 -249055 126986 68596 105812 59628 -86446 -520384 -76592 -381746 287521 -235847 -292218
9020b92218j61897K06894A39937A4871i2239A53635b03872A18200n7699b37024
9009F1935b60461A04911J3000D5407O3854P5b36042a2851k31126b8918k86386
8998c15304B3701d08330A58224b30100Q6150A23763L8568a07423o7436B38158
8987a55180A47018b83296Q5090b6855A438J50644b68620a09700B0962c59690A33005
8975a14302D1362J2142A3898K4368O2192b1156q2887i325A48994b04035l3589
8964b37624B3521a77585B19797a9400j56414f933B60189b14456l02799A83355
8953A80468d25434J78243a07426j3975j14020C97364a71470G0811J25434b48209
8942a79075j41188a49791O3882C0622a49671j12455a00321o4651D03921n3240
$$ plain form
9020 -292218 -454115 -247221 139937 14871 -92239 153635 -203872 118200 60501 -237024
9009 61935 -260461 104911 117911 45407 109261 109336 -236042 -12851 -243977 -28918 -315304
8998 -315304 23701 -408330 158224 -230100 -143950 123763 162331 -107423 -174859 238158
8987 -155180 147018 -283296 -198206 -26855 1438 152082 -268620 -109700 20962 -359690 133005
8975 -114302 41362 53504 13898 38266 100458 -21156 -104043 -9325 148994 -204035 -237624
8964 -237624 23521 -177585 219797 -19400 -175814 -6933 260189 -214456 -517255 183355
8953 180468 -425434 -247191 -107426 -121401 -235421 397364 -171470 70811 196245 -248209
8942 -179075 -320263 -149791 -85909 30622 -149671 -262126 -100321 -164972 403921 350681
8932C50681f842A87026a07610d5980r6587A02355J48383J59167K36344N86993
8922A233242L516998J5087130I466016C485251A083237E30742k15220J08472j16629
8913C07365G2623K47706j00967a841F6979M79017B50722A17214b28124C47696
8902a94175a5097C7571a33525N3174k00600O1541F5334b01911l947j1412c8641
8890c20242A09542i0487P093j2828b4008A82398a01270d8879j10415C4371J8804
$$ plain form
8932 350681 -6842 187026 -107610 -45980 -142567 102355 250738 409905 646249 1233242
8922 1233242 4750240 19837370 9466016 3485251 1083237 530742 315522 423994 307365
8913 307365 72623 320329 219362 -1841 66979 545996 250722 117214 -228124 347696
8902 -194175 -15097 37571 -133525 -80351 -280951 -219410 65334 -201911 -205858 -217270 -38641
8890 -320242 109542 -90487 -83394 -96222 -24008 182398 -101270 -48879 -159294 34371 53175
$$ [...]
##END NTUPLES=NMR SPECTRUM
##END=
