
##TITLE=UV1216_M5_1296-1170_20_7229458_uisxWrOONC
##JCAMPDX= 6.0         $$ Bruker NMR JCAMP-DX V2.0
##DATA TYPE= NMR SPECTRUM
##DATA CLASS= NTUPLES
##ORIGIN= BRUKER
##OWNER= Administrator
$$ 1.72 TOPSPIN		Version 2.1
$$ 2013-01-23 19:15:53.073 -0500  Administrator@X
$$ Compression mode = diff/dup
##.OBSERVE FREQUENCY= 400.02188249412
##.OBSERVE NUCLEUS= ^1H
##.ACQUISITION MODE= SIMULTANEOUS (DQD)
##.ACQUISITION SCHEME= undefined
##.AVERAGES= 64
##.DIGITISER RES= 22
##SPECTROMETER/DATA SYSTEM= spect
##.PULSE SEQUENCE= noesygpps1d.comp
##.SOLVENT NAME= COFFEE_meoh
##.SHIFT REFERENCE= INTERNAL, COFFEE_meoh, 1, 14.96122
##AUDIT TRAIL= $$ (NUMBER, WHEN, WHO, WHERE, PROCESS, VERSION, WHAT)
$$ ##TITLE= Audit trail, TOPSPIN		Version 2.1
$$ ##JCAMPDX= 5.01
$$ ##ORIGIN= Bruker BioSpin GmbH
$$ ##OWNER= Administrator
$$ $$ E:\/data/COFFEE/nmr/UV1216_M5_1296-1170_20_7229458_uisxWrOONC/32/pdata/1/auditp.txt
$$ ##AUDIT TRAIL=  $$ (NUMBER, WHEN, WHO, WHERE, PROCESS, VERSION, WHAT)
(   1,<2013-01-23 19:15:47.386 -0500>,<Administrator>,<X>,<go>,<TOPSPIN 2.1>,
      <created by zg
	started at 2013-01-23 19:04:18.047 -0500,
	POWCHK enabled, PULCHK disabled,
       configuration hash MD5:
       86 BA 57 50 F2 9D 5C 9B 26 00 A9 28 5F 66 2E 89
       data hash MD5: 64K
       BD 59 3A A0 14 58 5A 3D 75 06 E6 F2 9B F3 DF BF>)
(   2,<2013-01-23 19:15:50.386 -0500>,<Administrator>,<X>,<proc1d>,<TOPSPIN 2.1>,
      <Start of raw data processing
       efp LB = 0.3 FT_mod = 6 PKNL = 1 PHC0 = 0 PHC1 = 0 SI = 128K 
       data hash MD5: 128K
       81 58 D0 E6 2E A4 F4 4E D9 85 D8 69 D1 DC 1C 84>)
(   3,<2013-01-23 19:15:51.401 -0500>,<Administrator>,<X>,<proc1d>,<TOPSPIN 2.1>,
      <pk PHC0 = -76.99768 PHC1 = 0 
       data hash MD5: 128K
       FE 73 AC 7D 87 2B 5B F8 04 55 4B CA D7 90 A6 AB>)
(   4,<2013-01-23 19:15:52.058 -0500>,<Administrator>,<X>,<proc1d>,<TOPSPIN 2.1>,
      <abs ABSG = 1 
       data hash MD5: 128K
       D7 07 6A 6A 1E D6 5E 33 1B 91 17 1E F1 4B 70 8D>)
(   5,<2013-01-23 19:15:52.214 -0500>,<Administrator>,<X>,<proc1d>,<TOPSPIN 2.1>,
      <abs ABSG = 2 
       data hash MD5: 128K
       AE 0B 6A C8 A9 56 DC FA 84 75 A4 37 E9 E8 3D 98>)
(   6,<2013-01-23 19:15:52.386 -0500>,<Administrator>,<X>,<proc1d>,<TOPSPIN 2.1>,
      <abs ABSG = 3 
       data hash MD5: 128K
       D0 40 07 FF 39 97 24 44 01 9E 16 F8 87 DF 57 E8>)
(   7,<2013-01-23 19:15:52.573 -0500>,<Administrator>,<X>,<proc1d>,<TOPSPIN 2.1>,
      <abs ABSG = 4 
       data hash MD5: 128K
       71 4F 38 19 FE 9D 5E FC 40 E9 3D C8 3D 8C 45 23>)
(   8,<2013-01-23 19:15:52.730 -0500>,<Administrator>,<X>,<proc1d>,<TOPSPIN 2.1>,
      <abs ABSG = 5 
       data hash MD5: 128K
       F9 33 99 A5 E2 3C E3 81 E9 A3 48 22 0D C3 A4 37>)
$$ ##END=
$$ 
$$ $$ hash MD5
$$ $$ D0 33 70 D1 FA 53 A6 E3 21 90 0F 8B 29 89 30 D4
##$RELAX= 
##$RELAX= 
##$RELAX= 
##$RELAX= 
##$RELAX= 
##$RELAX= 
##$RELAX= 
##$RELAX= 
$$ Bruker specific parameters
$$ --------------------------
##$DU= <E:\>
##$EXPNO= 32
$$ [...]
##$TP07= 0
##$TPNAME0= <>
##$TPNAME1= <>
##$TPNAME2= <>
##$TPNAME3= <>
##$TPNAME4= <>
##$TPNAME5= <>
##$TPNAME6= <>
##$TPNAME7= <>
##$TPOAL= (0..7)
0.5 0.5 0.5 0.5 0.5 0.5 0.5 0.5
##$TPOFFS= (0..7)
0 0 0 0 0 0 0 0
##$TUNHIN= 0
##$TUNHOUT= 0
##$TUNXOUT= 0
##$USERA1= <user>
##$USERA2= <user>
##$USERA3= <user>
##$USERA4= <user>
##$USERA5= <user>
##$V9= 5
##$VALIST= <valist>
##$VCLIST= <CCCCCCCCCCCCCCC>
##$VD= 0
##$VDLIST= <DDDDDDDDDDDDDDD>
##$VPLIST= <PPPPPPPPPPPPPPP>
##$VTLIST= <TTTTTTTTTTTTTTT>
##$WBST= 1024
##$WBSW= 4
##$XGAIN= (0..3)
0 0 0 0
##$XL= 0
##$YL= 0
##$YMAX_a= 6005063
##$YMIN_a= -12905360
##$ZGOPTNS= <>
##$ZL1= 120
##$ZL2= 120
##$ZL3= 120
##$ZL4= 120
##$ABSF1= 14.96122
##$ABSF2= -5.596962
##$ABSG= 5
##$ABSL= 3
##$ALPHA= 0
##$AQORDER= 0
##$ASSFAC= 0
##$ASSFACI= 0
##$ASSFACX= 0
##$ASSWID= 0
##$AUNMP= <proc_prof1d_extract.lims>
##$AXLEFT= 0
##$AXNAME= <>
##$AXNUC= <1H>
##$AXRIGHT= 0
##$AXTYPE= 0
##$AXUNIT= <>
##$AZFE= 0.1
##$AZFW= 0.1
##$BCFW= 0
##$BC_mod= 0
##$BYTORDP= 0
##$COROFFS= 0
##$CY= 15
##$DATMOD= 1
##$DC= 0
##$DFILT= <>
##$DTYPP= 0
##$F1P= 0
##$F2P= 0
##$FCOR= 0.5
##$FTSIZE= 131072
##$FT_mod= 6
##$GAMMA= 0
##$GB= 0
##$INTBC= 1
##$INTSCL= 1
##$ISEN= 128
##$LB= 0.3
##$LEV0= 0
##$LPBIN= 0
##$MAXI= 10000
##$MC2= 0
##$MEAN= 0
##$ME_mod= 0
##$MI= 0
##$NCOEF= 0
##$NC_proc= -2
##$NLEV= 6
##$NOISF1= 0
##$NOISF2= 0
##$NSP= 0
##$NTH_PI= 0
##$NZP= 0
##$OFFSET= 14.96122
##$PC= 1
##$PHC0= -76.99768
##$PHC1= 0
##$PH_mod= 1
##$PKNL= yes
##$PPARMOD= 0
##$PPDIAG= 0
##$PPIPTYP= 0
##$PPMPNUM= 2147483647
##$PPRESOL= 1
##$PSCAL= 4
##$PSIGN= 0
##$PYNMP= <proc.py>
##$REVERSE= no
##$SF= 400.020009548013
##$SI= 131072
##$SIGF1= 0
##$SIGF2= 0
##$SINO= 400
##$SIOLD= 131072
##$SPECTYP= <>
##$SREGLST= <1H.CDCl3>
##$SSB= 0
##$STSI= 131072
##$STSR= 0
##$SW_p= 8223.68421052631
##$SYMM= 0
##$S_DEV= 0
##$TDeff= 65536
##$TDoff= 0
##$TI= <>
##$TILT= no
##$TM1= 0
##$TM2= 0
##$TOPLEV= 0
##$USERP1= <user>
##$USERP2= <user>
##$USERP3= <user>
##$USERP4= <user>
##$USERP5= <user>
##$WDW= 1
##$XDIM= 131072
##$YMAX_p= 427117541
##$YMIN_p= -11557
##$CURPLOT= <Network HP LaserJet P1505>
##$CURPRIN= <$Network HP LaserJet P1505>
##$DFORMAT= <normdp>
##$LAYOUT= <+/1D_H.xwp>
##$LFORMAT= <normlp>
##$PFORMAT= <normpl>
##$SURQMSG= 1
$$ End of Bruker specific parameters
$$ ---------------------------------
##NTUPLES= NMR SPECTRUM
##VAR_NAME=  FREQUENCY,     SPECTRUM/REAL,   SPECTRUM/IMAG
##SYMBOL=    X,             R,               I
##VAR_TYPE=  INDEPENDENT,   DEPENDENT,       DEPENDENT
##VAR_FORM=  AFFN,          ASDF,            ASDF
##VAR_DIM=   131072,        131072,          131072
##UNITS=     HZ,            ARBITRARY UNITS, ARBITRARY UNITS
##FACTOR=    0.0627417313425164, 1,          1
##FIRST=     8223.62146879497, 2842,         -57842
##LAST=      0,             3620,            -57270
##MIN=       0,             -11557,          0
##MAX=       8223.62146879497, 427117541,    0
$$ Real data points
##PAGE= N=1
##DATA TABLE= (X++(R..R)), XYDATA
$$ [...]
63910B804417j99481j92728j84273j74566j63592j51248j37870j24183j10951
63901A365525r8740q7703p7581o8081n9243n1338m4549l8940l4435l0676k7206
63890G47033k4020k1595k0077j8935j7719j6655j5955j5089j3429j1173q962o923
63878E56501m848k992j773q33P17L040N384P299R245J1675J4248J6388J8237K0439
63864F52727K3149K5675K7238K7871K8336K9134K9868K9855K9119K8279K7465
63853I58716K6029K3533K0409J7212J3818R827N322O38m173r104j3671j7234j9759
63840A011563k1847k4163k7068l0439l3516l5367l5836l5620l5189l4267l2801
63829F65450l1595l1117l0467k8560k5807k3610k2393k1235j9299j6764j4346
$$ plain form
63910 2804417 2604936 2412208 2227935 2053369 1889777 1738529 1600659 1476476 1365525
63901 1365525 1266785 1179082 1101501 1033420 974177 922839 878290 839350 804915 774239 747033
63890 747033 723013 701418 681341 662406 644687 628032 612077 596988 583559 572386 563424 556501
63878 556501 551653 548661 546888 546055 546772 549812 555196 562495 571740 583415 597663 614051 632288 652727
63864 652727 675876 701551 728789 756660 784996 814130 843998 873853 902972 931251 958716
63853 958716 984745 1008278 1028687 1045899 1059717 1069544 1074866 1075504 1071331 1062227 1048556 1031322 1011563
63840 1011563 989716 965553 938485 908046 874530 839163 803327 767707 732518 698251 665450
63829 665450 633855 602738 572271 543711 517904 494294 471901 450666 431367 414603 400257
63818D00257j2711j2246j2596j2590j1366r484q166p637p082o061n028m421m169
63805B86700m119m156l899l092k271k148k440k300j816j969k895l512l190k714
63791B46179k907l292k946j978j339j538k151k421j988j208r02j478k283k333
63777B17415j659j265j611j888j248oQ61R09N37L59O79J267J434O94n12j108o30
63760B14228K79P66O42J81l69p88q24n46l51l97l40O7N11N83L60K85O39J272J667
63741B17865J295K36n97l24Q40J950K598L155L679L599K754J905J718J945K129
63726B44747K395K935L329L202L032L478M215M288L521K761K664K934K938K481
63712B88920J744Q36k24j257k010k469k863l281l452l055k266j650j463j326q43
$$ plain form
63818 400257 387546 375300 362704 350114 338748 329264 321098 313461 306379 300318 295290 290869 286700
63805 286700 282581 278425 274526 271434 269163 267015 264575 262275 260459 258490 255595 252083 248893 246179
63791 246179 243272 239980 237034 235056 233717 232179 230028 227607 225619 224411 223509 222031 219748 217415
63777 217415 215756 214491 212880 210992 209744 209738 210599 211508 212045 212404 213083 214350 215784 216478 215966 214858 214228
63760 214228 214507 215273 215915 216096 215727 214939 214115 213569 213218 212821 212481 212548 213059 213642 214002 214287 214926 216198 217865
63741 217865 219160 219396 218799 218475 219315 221265 223863 227018 230697 234296 237050 238955 240673 242618 244747
63726 244747 247142 250077 253406 256608 259640 263118 267333 271621 275142 277903 280567 283501 286439 288920
63712 288920 290664 291500 291276 290019 288009 285540 282677 279396 275944 272889 270623 268973 267510 266184 265341
63697B65341k37N2J64O56J618K498K888L001L189L460L673L804L740L190K049
63682B99086O88l21o74m72j18j7k08l52k98m09q97j117k72J285K253K154J954
63665C02265K518L114K327J00j934k228r66K88L32o42j681k393l163m141m687
63650B89109m253l333k826k732k259j149j30O4m62j041j097m30O30J378J477J502
63634B74448K187L256L776L574L397L622L791L737M124N343O664P163O903O661
63620C38646P000Q081R836J1772J3097J3596J4029J5207J7011J8854K0620K2628
63608E10377K4915K7078K8686K9494K9445K8720K7463K5301K1535J6108J0031
63597G79153M539J75l060n220o536p512q456r162r452r765j0773j2712j5290j7985
$$ plain form
63697 265341 265104 265156 265320 265976 267594 270092 272980 275981 279170 282630 286303 290107 293847 297037 299086
63682 299086 299774 299453 298779 298307 298189 298172 297964 297612 297314 296905 296008 294891 294619 295904 298157 300311 302265
63665 302265 304783 307897 310224 310324 308390 306162 305196 305484 305816 305174 303493 301100 297937 293796 289109
63650 289109 284856 281523 278697 275965 273706 272557 272427 272491 272029 270988 269891 269461 270091 271469 272946 274448
63634 274448 276635 279891 283667 287241 290638 294260 298051 301788 305912 311255 317919 325082 331985 338646
63620 338646 345646 353727 363563 375335 388432 402028 416057 431264 448275 467129 487749 510377
63608 510377 535292 562370 591056 620550 649995 678715 706178 731479 753014 769122 779153
63597 779153 783692 783867 780807 775587 769051 761539 753083 743921 734469 724704 713931 701219 685929 667944
63583F67944k0191k1483k1987k2174k2052k1135j9309j7193j5258j3252j0889
63572D63021q521o531m734k898j365m17M52J881L599M816N416N989O799P510P894
63557D82911Q180Q620R232J0019J1106J2609J4696J7586K1149K4735K7792L0513
63545F79148L3381L6197L8020L7910L5297K9820K1572J1675K129n335j0147j2690
63533H96977j3560j3235j2203j1052j0222r757r505r672j0923j3702j7543k1363
63521G44240k4344k6277k7256k7504k7457k7325k6647k4855k2292k0028j8554
63510D71701j7439j6302j5265j4163j2334r790p723p126p453p406o526n346m457
63497C40371m042m017m030l590k666j832j432j155p99p89j300j563q37M81J490
$$ plain form
63583 667944 647753 626270 604283 582109 560057 538922 519613 502420 487162 473910 463021
63572 463021 454500 447969 443235 440337 438972 438555 439007 440888 444487 449303 454719 460708 467507 475017 482911
63557 482911 491091 499711 508943 518962 530068 542677 557373 574959 596108 620843 648635 679148
63545 679148 712529 748726 786746 824656 859953 889773 911345 923020 925149 919814 909667 896977
63533 896977 883417 870182 857979 846927 836705 826948 817443 807771 796848 783146 765603 744240
63521 744240 719896 693619 666363 638859 611402 584077 557430 532575 510283 490255 471701
63510 471701 454262 437960 422695 408532 396198 386408 378685 371559 364106 356700 350174 344828 340371
63497 340371 336329 332312 328282 324692 322026 320194 318762 317607 316808 316019 314719 313156 312319 312800 314290
63482C14290K035K507K864K781K534K719L305L736L857L903L769L130K190J456
63468C55076Q02m13k206l662m054l667l350l590m108m248l686k897k515k286j302
63453C13894L99J502J297R44J775L216L826L735M376N978P213P551Q211J0070
63439C73987J2078J2889J3028J4294J7465K1530K5038K7435K8976K9759K9070
63428F05549K5859K0075J3328P759M388K945L029M620P471J0955J4725J8810K2938
63415G62451K6441K9122L1331L2946L2995L0714K6379K0677J4051P081Q13m074
63403A010927p863j1026j3211j3801j3145j2587j3269j5334j8162k1004k3487
63392H48038k5801k8269l0589l1841l1554l0364k9105k7689k5407k2206j8951
$$ plain form
63482 314290 316325 318832 321696 324477 327011 329730 333035 336771 340628 344531 348300 351430 353620 355076
63468 355076 355878 355465 353259 349597 345543 341876 338526 334936 330828 326580 322894 319997 317482 315196 313894
63453 313894 314293 315795 317092 318036 319811 323027 326853 330588 334964 340942 348155 355706 363917 373987
63439 373987 386065 398954 411982 426276 443741 465271 490309 517744 546720 576479 605549
63428 605549 631408 651483 664811 672570 676958 679903 682932 687552 695023 705978 720703 739513 762451
63415 762451 788892 818014 849345 882291 915286 946000 972379 993056 1007107 1014188 1015001 1010927
63403 1010927 1003064 992038 978827 965026 951881 939294 926025 910691 892529 871525 848038
63392 848038 822237 793968 763379 731538 699984 669620 640515 612826 587419 565213 546262
63381E46262j6411j4547j2911j1266r575p716n556l216j058O44J939L161M619
63368D74369O327Q049R633J1178J2802J4428J5962J7580J9546K1796K4001K6080
63356F61751K8355L0915L3175L4446L4734L4407L3084K9654K3810J6897J0571
63345I71799N065l54n517r110j0495j0716j1121j1850j2374j2855j4113j6476
63333H61883j9484k2571k5348k7348k8188k8091k7687k7130k5771k2925j8729
63322E88611j4188j0437p922o124m277k500j989l795p597j1907j5296j7180j7720
63309D67679j7372j6524j5287j3662j1935j0552r507q263o601n096m397m412m550
63296C39521m456m085l478k874k651k813k891k763k909l454l646k979k104j774
$$ plain form
63381 546262 529851 515304 502393 491127 481552 473836 468280 465064 464006 464650 466589 469750 474369
63368 474369 480696 488745 498378 509556 522358 536786 552748 570328 589874 611670 635671 661751
63356 661751 690106 721021 754196 788642 823376 857783 890867 920521 944331 961228 971799
63345 971799 976864 976510 970993 961883 951388 940672 929551 917701 905327 892472 878359 861883
63333 861883 842399 819828 794480 767132 738944 710853 683166 656036 630265 607340 588611
63322 588611 574423 563986 556064 549940 545663 543163 541174 537379 529782 517875 502579 485399 467679
63309 467679 450307 433783 418496 404834 392899 382347 372840 364577 357976 352880 348483 344071 339521
63296 339521 335065 330980 327502 324628 321977 319164 316273 313510 310601 307147 303501 300522 298418 296644
63282B96644j575p60K04K24o38j214r88m84KP87J708J950J377R16J068J085K48
63265C00554q68j214o63R1O45J122J569J754J609J476J746K358K718K334J605
63250C16836J588K742M277N204N588O120O824P084O787O564O894P696Q815J0161
63236D03180J1418J2359J3397J5010J6761J7787J8249J9131K0642K1922K2520
63225E92376K2929K3309K2954K1627K0262J9633J9316J8727J8310J8738J9654
63214H17835K0121J9819J9014J7787J6030J3857J1391Q481N092J500k362p181
63202I41384j3119j8932k3026k5109k6093k6630k6482k5284k3212k0812j8476
63191F94209j6180j3559j0375o990m028j567Q88L517N944Q064J0338J2897J5074
$$ plain form
63282 296644 295069 294309 294513 294737 294099 292885 291897 291413 291415 292202 293910 295860 297237 298153 299221 300306 300554
63265 300554 299686 298472 297809 297900 298545 299667 301236 302990 304599 306075 307821 310179 312897 315231 316836
63250 316836 318424 321166 325443 330647 336235 342355 349179 356263 363050 369614 376508 384204 393019 403180
63236 403180 414598 426957 440354 455364 472125 489912 508161 527292 547934 569856 592376
63225 592376 615305 638614 661568 683195 703457 723090 742406 761133 779443 798181 817835
63214 817835 837956 857775 876789 894576 910606 924463 935854 944335 949427 950927 948565 941384
63202 941384 928265 909333 886307 861198 835105 808475 781993 756709 733497 712685 694209
63191 694209 678029 664470 654095 647105 643077 641510 642398 645915 651859 659923 670261 683158 698232
63178F98232J6408J7396J8607J9670J9934J9564J9222J8978J8438J7592J6794
63167I00835J6045J5098J4009J2920J1374Q715N034R97l235q133j3664j8788k2440
63154I18767k4638k6270k8031k9802l0909l0854k9783k8254k6626k4835k2776
63143F15989k0559j8353j6283j4608j3516j2597j1093q953p043n936n203m364
63131D77481l870m214m688m019k118k30N91L85j98m40L39K225M153M786M213L927
63115D78323M751N726N609M637L989M058M209M019L785L765L714L409L021K696
63101E35711K265J707J465J767K008J399J50o13k22P91J482J565J339J001N20
63086E52335Mk73k62k15l08l94j61N26J412K007K072J976K170K416K081J337J282
$$ plain form
63178 698232 714640 732036 750643 770313 790247 809811 829033 848011 866449 884041 900835
63167 900835 916880 931978 945987 958907 970281 978996 984030 985027 981792 973659 959995 941207 918767
63154 918767 894129 867859 839828 810026 779117 748263 718480 690226 663600 638765 615989
63143 615989 595430 577077 560794 546186 532670 520073 508980 500027 492984 487048 481845 477481
63131 477481 473611 469397 464709 460690 458572 458342 458933 459318 459120 458680 459019 461244 465397 470183 474396 478323
63115 478323 483074 488800 494409 499046 503035 507093 511302 515321 519106 522871 526585 529994 533015 535711
63101 535711 537976 539683 541148 542915 544923 546322 546472 545859 545637 546428 547910 549475 550814 551815 552335
63086 552335 552339 552066 551804 551589 551281 550887 550726 551252 552664 554671 556743 558719 560889 563305 565386 566723 568005
63069E68005K438L921M791N562P296R657J1162J1294J1214J2098J3827J5711J7671
63056F94647K0025K2717K5303K7469K9324L1376L4274L8134M2130M5239M7353
63045A057991M9110N0705N1569N1339N0426M9463M8755M8361M8113M7553M6492
63034A599877M5588M5537M5825M5178M3318M1142L9012L6008L1209K4645J6549
63023B013888O874l896j4484k4100l3095m1732m9287n5021n9072o1721o2650o1719
63011A553985n9495n6241n1392m4953l8343l2688k7199k0519j2959n989o8N589
62999A209728J1383J6778K1316K5041K7976L0071L1630L2942L3711L3631L3217
62988A507424L3212L3479L3317L2536L1287K9264K6103K2300J8556J4402Q689
$$ plain form
63069 568005 570443 574364 579155 584717 592013 601670 612832 624126 635340 647438 661265 676976 694647
63056 694647 714672 737389 762692 790161 819485 850861 885135 923269 965399 1010638 1057991
63045 1057991 1107101 1157806 1209375 1260714 1311140 1360603 1409358 1457719 1505832 1553385 1599877
63034 1599877 1645465 1691002 1736827 1782005 1825323 1866465 1905477 1941485 1972694 1997339 2013888
63023 2013888 2020762 2016866 2002382 1978282 1945187 1903455 1854168 1799147 1740075 1678354 1615704 1553985
63011 1553985 1494490 1438249 1386857 1341904 1303561 1270873 1243674 1223155 1210196 1204207 1204139 1209728
62999 1209728 1221111 1237889 1259205 1284246 1312222 1342293 1373923 1406865 1440576 1474207 1507424
62988 1507424 1540636 1574115 1607432 1639968 1671255 1700519 1726622 1748922 1767478 1781880 1790569
62977A790569J294o777j4980k3614l2470m0339m6355n0900n4691n7750n9662o0253
62965A344072n9561n7630n4588n0743m6484m2382l9140l6939l5019l2561k9802
62954H59223k7655k6333k5173k3744k2283k1019j9803j8620j7721j7100j6340
62943F23432j5226j4041j3103j2433j1902j1321j0446r244q049p089o145n091
62931D99342m366m292m384m062l672l857m251l872k635j465q83n69l68n99j142
62916D58925j231o28k00p81k065l053l169k629k102k159k814l498l718l572l275
62901D24031k594j409l65j78n11l79M74J462K139K374J867N55o29o33J55M39K1
62884D26819m4N83R43N15O4J64K34j86n01k21j2n86j463j784j552j255r25n56
$$ plain form
62977 1790569 1791863 1785086 1770106 1746492 1714022 1673683 1627328 1576428 1521737 1463987 1404325 1344072
62965 1344072 1284511 1226881 1172293 1121550 1075066 1032684 993544 956605 921586 889025 859223
62954 859223 831568 805235 780062 756318 734035 713016 693213 674593 656872 639772 623432
62943 623432 608206 594165 581062 568629 556727 545406 534960 525716 517667 510578 504433 499342
62931 499342 494976 490684 486300 482238 478566 474709 470458 466586 463951 462486 461603 461034 460666 460067 458925
62916 458925 457694 457066 456866 456085 454020 450967 447798 445169 443067 440908 438094 434596 430878 427306 424031
62901 424031 421437 420028 419663 419485 418974 418595 419069 420531 422670 425044 426911 427466 426837 426204 426359 426798 426819
62884 426819 426775 427358 428301 428816 428880 429044 429278 429092 428591 428370 428358 427772 426309 424525 422973 421718 420793 420237
62866D20237o99j688k744k840k051j306j118j347j796k206j979p80P27J489J324
62851D03223R80R94J147J053P34N14O08Q85R00L45n19j104j265j353j456j185
62835D04501n16j56n60j134j099o10l68m50k92L23R78J307J411J541J811K204
62819D08891K504K350J659J018J151K045K952L284L148K957K889K974L397M344
62805D45563N505O090N651M787M605N430O473O973P238Q020R321J0463J1153J1724
62791E48996J2397J3062J3928J5634J8403K1636K4651K7391L0267L3645L7704
62780G97714M2342M7101N1560N5835O0329O4958O9122P2458P5064P7044P8354
62769A491881P8913P8135P4548O7024N6498M5313L4501K2876R407m752j7590k8683
$$ plain form
62866 420237 419538 417850 415106 412266 410215 408909 407791 406444 404648 402442 400463 399683 400410 401899 403223
62851 403223 404203 405197 406344 407397 408131 408645 409253 410138 411038 411383 410864 409760 408495 407142 405686 404501
62835 404501 403985 403829 403269 402135 401036 400426 400058 399608 399316 399639 400617 401924 403335 404876 406687 408891
62819 408891 411395 413745 415404 416422 417573 419618 422570 425854 429002 431959 434848 437822 441219 445563
62805 445563 451068 457158 462809 467596 472201 477631 484104 491077 498315 506335 515656 526119 537272 548996
62791 548996 561393 574455 588383 604017 622420 644056 668707 696098 726365 760010 797714
62780 797714 840056 887157 938717 994552 1054881 1119839 1188961 1261419 1336483 1413527 1491881
62769 1491881 1570794 1648929 1723477 1790501 1846999 1892312 1926813 1949689 1959096 1954344 1936754 1908071
62757A908071l9034m9007n7695o4258o8874p2070p3919p4227p3144p1246o9006
62746A195591o6362o2927n8697n4225m9883m5291m0131l5153l1500k9134k6907
62735F95381k4297k1935k0210j8497j6337j4271j2761j1278r288p305o002n040
62723E28160l727k263j279o50J94J274K287L447N051O542P128P093P477Q592R923
62708E79249J1391J3589J6639J9900K2967K6051K9132L1746L3969L6698M0448
62697H61779M4636M8580N2554N7164O2149O6493O9493P1099P1393P0326O7965
62686A543631O4450N9531N2545M3092L1585J8858N426q511k2416l5143m5650n3779
62674A653619o0079o5026o8572p0394p0303o8593o6139o3867o1771n8800n4250
$$ plain form
62757 1908071 1869037 1820030 1762335 1698077 1629203 1557133 1483214 1408987 1335843 1264597 1195591
62746 1195591 1129229 1066302 1007605 953380 903497 858206 818075 782922 751422 722288 695381
62735 695381 671084 649149 628939 610442 594105 579834 567073 555795 546507 539202 533200 528160
62723 528160 524433 522170 520891 520241 520435 521709 523996 527443 532494 539036 546164 553257 560734 569326 579249
62708 579249 590640 604229 620868 640768 663735 689786 718918 750664 784633 821331 861779
62697 861779 906415 954995 1007549 1064713 1126862 1193355 1262848 1333947 1405340 1475666 1543631
62686 1543631 1608081 1667612 1720157 1763249 1794834 1813692 1819118 1810607 1788191 1753048 1707398 1653619
62674 1653619 1593540 1528514 1459942 1389548 1319245 1250652 1184513 1120646 1058875 1000075 945825
62663I45825m9038m4809m1997l9521l6363l2578k8664k4922k1779j9774j8699
62652E87681j7556j5857j4247j3323j2625j1541j0415r946r935r486q158o247
62640D48345m303k908k531k915k964j961n34J97M6m04r20j719k670l263l316l056
62624D15124k536j692q32m24m45m69l56k43j8O23J581K307K426K013J465J379
62608D19903K249L816N092N540N840O857Q329R399J0118J1362J3454J5827J8079
62595E35865K0453K3084K5665K8051L0483L2966L5111L6758L8099L8958L8634
62584H84127L6770L3863L0504K6557K1469J5084P874N16o549j3231j9560k5233
62572I92191k9608l2383l4048l5279l6040l5763l4351l2471l0822k9460k7947
$$ plain form
62663 945825 896787 851978 809981 770460 734097 701519 672855 647933 626154 606380 587681
62652 587681 570125 554268 540021 526698 514073 502532 492117 482171 472236 462750 454592 448345
62640 448345 444042 441134 438603 435688 432724 430763 430229 430426 430472 430068 429148 427429 424759 421496 418180 415124
62624 415124 412588 410896 410064 409640 409195 408726 408370 408127 408109 408732 410313 412620 415046 417059 418524 419903
62608 419903 422152 425968 431060 436600 442440 449297 457626 467025 477143 488505 501959 517786 535865
62595 535865 556318 579402 605067 633118 663601 696567 731678 768436 806535 845493 884127
62584 884127 920897 954760 985264 1011821 1033290 1048374 1056248 1056764 1050215 1036984 1017424 992191
62572 992191 962583 930200 896152 860873 824833 789070 754719 722248 691426 661966 634019
62561F34019k5856k3172k0447j8393j7066j5735j3933j2163j1076j0285q908p022
62549D49963n693n371n173m115k439j278j306k083k547k048r57j91p5NN61J135
62533D18388R93L35M9M79J185J797K330K770L142L952N749Q143J0048J1100J2026
62518D82486J3468J5198J6870J8762K1266K4148K6799K8979L0993L3392L6486
62507G48847L9822M2172M2559M1275L9320L6919L3335K8238K2317J6235R819K833
62495A103691m196j0465j5687j9855k2702k4051k4289k3891k2705k0265j6643
62484H98942j2502q446m649j001K696O489R938J2181J2633J1454R102N774J625
62471I44236k755o632r916j3216j6994k0967k4445k7104k9220l1194l2940l3825
$$ plain form
62561 634019 608163 584991 564544 546151 529085 513350 499417 487254 476178 465893 456985 449963
62549 449963 444270 438899 433726 429611 427172 425894 424588 422505 419958 417910 416953 416762 416687 416692 417253 418388
62533 418388 419381 419716 419765 420244 421429 423226 425556 428326 431468 435420 441169 449312 459360 470460 482486
62518 482486 495954 511152 528022 546784 568050 592198 618997 647976 678969 712361 748847
62507 748847 788669 830841 873400 914675 953995 990914 1024249 1052487 1074804 1091039 1100858 1103691
62495 1103691 1099495 1089030 1073343 1053488 1030786 1006735 982446 958555 935850 915585 898942
62484 898942 886440 877994 873345 872344 875040 881529 891467 903648 916281 927735 936837 942611 944236
62471 944236 941481 934849 924933 911717 894723 873756 849311 822207 792987 761793 728853 695028
62459F95028l3291l1415k8781k5955k3225k0735j8488j6227j3641j0872q498o869
62447D57031n639m133k219n77Jl85n90M32K332L688L777L515M113N282N524M126
62431D76278K032N90N8l27j312k983m874o376p165p400p409p262o829o222n777
62416D15022n580n286m648l919l577l755m053l891l182k542k648l266l337k314
62402C63024r26k13k43l64l19l41l29J46J009J655J863K049K479K899L159L531
62386C79079M119M561M587M379M132L810L620M143N572P212Q194Q373Q203Q047
62372D58031Q023Q272Q875R576R910R809R864J0839J2829J5050J6771J8346K0819
62359F17014K4417K8084L1040L4006L8105M3013M7255N0111N2027N3206N2906
$$ plain form
62459 695028 661737 630322 601541 575586 552361 531626 513138 496911 483270 472398 463900 457031
62447 457031 451392 447259 445040 444463 444464 444079 443489 443921 446253 449941 453718 457233 461346 466628 472152 476278
62431 476278 478310 478900 478958 478631 477319 474336 469462 463086 455921 448521 441112 433850 427021 420799 415022
62416 415022 409442 404156 399508 395589 392012 388257 384204 380313 377131 374589 371941 368675 365338 363024
62402 363024 362098 361885 361642 361278 360959 360618 360289 360435 361444 363099 364962 367011 369490 372389 375548 379079
62386 379079 383198 387759 392346 396725 400857 404667 408287 412430 418002 425214 433408 441781 449984 458031
62372 458031 466054 474326 483201 492777 502687 512496 522360 533199 546028 561078 577849 596195 617014
62359 617014 641431 669515 700555 734561 772666 815679 862934 913045 965072 1018278 1071184
62348A071184N0433M5875L9571L1697K2893J4362O892L42n558j0617j4843j8939
62336A233292k3505k8206l2227l5107l6742l7095l6378l5047l3239l0689k7600
62325H77457k4956k3432k2522k1401k0156j9477j9430j9345j8805j8120j7788
62314F52025j7887j8077j7902j7100j5797j4340j2943j1638j0561r806q991p545
62302D89438n603m082l540l497l218k669k200j741r59O9Q73J222J373J757K599
62287D69822L658M266L890K833J994J811J861J659J323J237J541K155K862L196
62273E04108K838K302K546L611M503M777N288O770Q667J0176J1650J3866J6636
62260E97738J9293K2076K5801L0397L4994L9364M4043M8959N3131N5960N7750
$$ plain form
62348 1071184 1121617 1167492 1207063 1238760 1261653 1276015 1282907 1283249 1277691 1267074 1252231 1233292
62336 1233292 1209787 1181581 1149354 1114247 1077505 1040410 1004032 968985 935746 905057 877457
62325 877457 852501 829069 806547 785146 764990 745513 726083 706738 687933 669813 652025
62314 652025 634138 616061 598159 581059 565262 550922 537979 526341 515780 505974 496983 489438
62302 489438 483835 479753 476213 472716 469498 466829 464629 462888 461929 461998 462871 464093 465466 467223 469822
62287 469822 473480 477746 481636 484469 486463 488274 490135 491794 493117 494354 495895 498050 500912 504108
62273 504108 506946 509248 511794 515405 519908 524685 529973 536743 545410 555586 567236 581102 597738
62260 597738 617031 639107 664908 695305 730299 769663 813706 862665 915796 971756 1029506
62249A029506N8572N7540N3878M7969M0839L3118K5002J6806Q974J703n014j1160
62237A357733j6751k1964k6982l1731l5922l9230m1430m2510m2646m1918m0127
62226I76522l7189l3671l0540k8349k6863k5541k4139k2743k1544k0651j9933
62215F85359j9012j7602j5947j4645j3985j3578j2830j1541j0013q665p607o600
62203E33334n420m259l617l605l527k478l73J829L033L048K619K602L203M020
62189E30409M753N626O981Q545R520R524R167R380J0331J1232J1197J0098Q551
62176F45314P277O472N764M842M032M109N482P800J0436J3160J6170J9697K3815
62163G74370K8372L2918L6772L9377M0591M0493L9043L6072L1504K5510J8572
$$ plain form
62249 1029506 1088078 1145618 1199496 1247465 1288304 1321422 1346424 1363230 1372204 1373907 1368893 1357733
62237 1357733 1340982 1319018 1292036 1260305 1224383 1185153 1143723 1101213 1058567 1016649 976522
62226 976522 939333 905662 875122 846773 819910 794369 770230 747487 725943 705292 685359
62215 685359 666347 648745 632798 618153 604168 590590 577760 566219 556206 547541 539934 533334
62203 533334 527914 523655 520038 516433 512906 510428 510055 511884 514917 517965 520584 523186 526389 530409
62189 530409 535162 540788 547769 556314 565834 575358 584525 593905 604236 615468 626665 636763 645314
62176 645314 652591 659063 664827 669669 673701 677810 683292 691092 701528 714688 730858 750555 774370
62163 774370 802742 835660 872432 911809 952400 992893 1031936 1068008 1099512 1125022 1143594
62152A143594J1482N062l55n046r451j3703j7739k1552k5101k8122l0362l1874
62140I76833l2818l2946l1717k9014k5619k2627k0355j8058j4950j1326q343o706
62128G22354n951n241m354l530k748j777o69L94J676L612N969P910R017R696J0414
62113G46772J1056J1220J0637R088O497L355O37j042j850k181k120j728j340j320
62099G87681j831k953m574o016o339n371l975k954k192j106M36K100L569M606
62085G61081N063N139N382N983O470O423O184O458P489Q933J0403J1806J3303
62072H60117J5049J6840J8009J8141J7796J7989J8842J9522J9693K0189K1710
62061A063897K3662K4911K5149K4748K3736K1679J8332J3870Q682L369j333n132
$$ plain form
62152 1143594 1155076 1160138 1159783 1154737 1145286 1131583 1113844 1092292 1067191 1039069 1008707 976833
62140 976833 944015 911069 879352 850338 824719 802092 781737 763679 748729 737403 729060 722354
62128 722354 716403 711162 706808 703278 700530 698753 698084 698478 700154 703766 709735 717645 726662 736358 746772
62113 746772 757828 769048 779685 788773 795270 798625 799262 798220 796370 794189 792069 790341 789001 787681
62099 787681 785850 782897 778323 772307 765968 760597 756622 753668 751476 750370 750806 752906 756475 761081
62085 761081 766144 771283 776665 782648 789118 795541 801725 808183 815672 824605 835008 846814 860117
62072 860117 875166 892006 910015 928156 945952 963941 982783 1002305 1021998 1042187 1063897
62061 1063897 1087559 1112470 1137619 1162367 1186103 1207782 1226114 1239984 1248666 1252035 1250702 1245570
62049A245570q500j1973j5440j8511k1309k4332k7744l1147l3984l5934l7056
62038I79640l7676l7876l7171l5226l2826l1331l0907l0207k8098k4883k1431
62027F32008j8133j5294j3441j2364j0869q485o584o530p504p518o120m593l832
62014E10741l484l238l432m040m233l451k034n28Q82J925K148J672J442K196L572
61999E00138M625M917M797M780M870M477L129J165n02j470k257l360m560n498
61985E15251o364p329p897p635p135p357q244q893q819q229p241n849m606m274
61971D15379m636m510l238j454k14J22j06l69l10M7L32L62M68R46J451J486J241
61954D06997J356J975K688L232L621L759L588L440L680M184M776N832P685R789
$$ plain form
62049 1245570 1237070 1225097 1209657 1191146 1169837 1145505 1117761 1086614 1052630 1016696 979640
62038 979640 941964 904088 866917 831691 798865 767534 736627 706420 678322 653439 632008
62027 632008 613875 598581 585140 572776 561907 553422 546838 540308 532804 525286 519166 514573 510741
62014 510741 507257 504019 500587 496547 492314 488863 486829 486301 487183 489108 491256 492928 494370 496566 500138
61999 500138 504763 509680 514477 519257 524127 528604 531733 532898 532396 530926 528669 525309 520749 515251
61985 515251 508887 501558 493661 486026 478891 471534 463290 454397 445578 437349 430108 424259 419653 415379
61971 415379 410743 406233 402995 401541 401327 401449 401343 400974 400664 400711 401043 401405 401873 402819 404270 405756 406997
61954 406997 408353 410328 413016 416248 419869 423628 427216 430656 434336 438520 443296 449128 456813 466602
61940D66602J1312J2307J3418J4712J5818J6907J8376J9688J9789J8805J8035
61929F45769J8027J7803J6360J3984J1552R417P457N468L145K84k665m891o246
61916G35464p249p964p731o306m356k439l53K091M493O579Q789J1514J4263J6131
61902G62926J6632J5734J3578J0637P657M942K082j317m995q402j1243j3406j4767
61889G80058j5355j5403j5089j4581j4289j4500j4664j3797j1848j0035r509j0163
61877F20825j1047j1358j0762r337p660o516o102n704m504k502m93O63P49L92
61863E46644N20J442K661L819N306P387R359J0504J1378J3061J5428J7447J9005
61850F63961K0997K3519K5480K6431K7362K9047L0819L1632L1238K9669K6640
$$ plain form
61940 466602 477914 490221 503639 518351 534169 551076 569452 589140 608929 627734 645769
61929 645769 663796 681599 697959 711943 723495 732912 740369 745837 748982 749266 746601 741710 735464
61916 735464 728215 720251 712520 706214 701858 699419 699066 701157 705650 712229 721018 732532 746795 762926
61902 762926 779558 795292 808870 819507 827164 832106 834188 832871 827876 819474 808231 794825 780058
61889 780058 764703 749300 734211 719630 705341 690841 676177 662380 650532 640497 630988 620825
61877 620825 609778 598420 587658 578321 570661 564145 558043 552339 547835 545333 544840 545503 546252 546644
61863 546644 547164 548606 551267 555086 560392 567779 577138 587642 599020 612081 627509 644956 663961
61850 663961 684958 708477 733957 760388 787750 816797 847616 879248 910486 940155 966795
61839I66795K2304J7630J3175Q389K906k399o446r266j1396j2734j2932j2176
61827I63850j0558p384k266L488P765R807J0564J1091J1397J0831Q803N073o2
61814A022399n850j1644j7175k2095k5726k7833k9089l0182l0811l0283k8742
61803G62969k7057k5680k4307k2570k0474j8170j5784j3525j1603j0094r064q564
61791E56077q322p792o763n616m669l754k738j928j541j318j114j325k104k685
61777E04408k261j190n36o88j117j315j292j218j218j511k167k692k412j320j08
61762D83363P04J257J852K334K219J417N73N51J413K161J784N01n05n49r5P7k16
61745D98841p41j328j852k135k217k367k599k535j917r16J44R24R95K28p54j125
$$ plain form
61839 966795 989099 1006729 1019904 1028293 1031199 1028800 1022354 1013088 1001692 988958 976026 963850
61827 963850 953292 945908 943642 947130 954895 964702 975266 986357 997754 1008585 1017388 1022461 1022399
61814 1022399 1016549 1004905 987730 965635 939909 912076 882987 852805 821994 791711 762969
61803 762969 735912 710232 685925 663355 642881 624711 608927 595402 583799 573705 564641 556077
61791 556077 547755 539963 533200 527584 522915 519161 516423 514495 512954 511636 510522 509197 507093 504408
61777 504408 502147 500957 500421 499733 498616 497301 496009 494791 493573 492062 489895 487203 484791 483471 483363
61762 483363 484067 485324 487176 489510 491729 493146 493719 494270 495683 497844 499628 500129 499624 499075 498980 499057 498841
61745 498841 498100 496772 494920 492785 490568 488201 485602 483067 481150 480234 480378 481302 482297 482525 481771 480646
61729D80646q96o44l52M85J588J980J637J630K187K088Q30j53L76J449J569J220
61713D95640J929L536M302L478K023P61m83j712k248j942j726k342l380l984l821
61698D90031l042k035j467j893k975l684l548l132l037l086k798k177j599j368
61684D54190j658k561l785m619m569l922l428l422l479l002k081j518j867k612
61670D11667k799k331k053k417k782k399j485p92n86o17o87o42k07N81J121J019
61654C94591O97O65O37J27m92m57J66O34Q07J245K117K916L433M066M875N191
61638D21218M541L369K353J568O73m15j501k465l269l773l827l504l104k935l081
61623D05848l355l463l333l157l031k739k086j293q33r04j312j712j882j832j788
$$ plain form
61729 480646 479750 479106 478754 479239 480827 482807 484444 486074 488261 490349 491179 491026 491402 492851 494420 495640
61713 495640 497569 501105 505407 508885 510908 511669 511186 509474 507226 505284 503558 501216 497836 493852 490031
61698 490031 486989 484954 483487 481594 478619 474935 471387 468255 465218 462132 459334 457157 455558 454190
61684 454190 452532 449971 446186 441567 436998 433076 429648 426226 422747 419745 417664 416146 414279 411667
61670 411667 408868 406537 404484 402067 399285 396886 395401 394609 394023 393406 392719 392077 391870 392451 393572 394591
61654 394591 395288 395953 396590 396717 396225 395768 395934 396568 397375 398620 400737 403653 407086 411152 416027 421218
61638 421218 425759 429128 431481 433049 433722 433307 431806 429341 426072 422299 418472 414968 411864 408929 405848
61623 405848 402493 399030 395697 392540 389509 386770 384684 383391 382558 381654 380342 378630 376748 374916 373128
61608C73128j962k332k780l384m169m692m416l671l544m458n479n434m273k846
61594C19688j838j435j616k128k479k410k155j895j398o04r3l44r35j091p33l69
61578B98165k75l48n87j085j684k070k070j585n85M69P30n8j041j262p09L4O35
61561B86674R50P20P9k05K69P65M57k31k80L57Q51Q19O48O17O41P87J160J414
61543B96492J086L52k44n66o40n1J483L172L868L600L382L560L369K343J113N40
61527C22859P35J168J212N35n39j178j084j082j896k743k223n01O93L91m26l96
61511C15525M57J058P32k56j140j284o99j05j98q45j334j295q78l17J51J31m95
61494C09208j101j003m05RJ61M70Q46Q01M14K45L16J64j09J17Q38J350J410J454
$$ plain form
61608 373128 371166 368834 366054 362670 358501 353809 349393 345722 342178 337720 332241 326807 322534 319688
61594 319688 317850 316415 314799 312671 310192 307782 305627 303732 302334 301730 301637 301293 300358 299267 298534 298165
61578 298165 297890 297542 296955 295870 294186 292116 290046 288461 287876 288345 289075 289017 287976 286714 286005 286039 286674
61561 286674 287624 288344 288423 288218 288487 289252 289709 289478 289198 289555 290406 291225 291873 292490 293131 293918 295078 296492
61543 296492 297578 297930 297686 297120 296480 296429 297912 301084 304952 308552 311934 315494 318863 321206 322319 322859
61527 322859 323594 324762 325974 326509 325970 324792 323708 322626 320730 317987 315764 315263 315956 316347 315921 315525
61511 315525 315982 317040 317772 317516 316376 315092 314393 314288 314090 313245 311911 310616 309738 309421 309572 309703 309208
61494 309208 308107 307104 306699 306708 306869 307339 308185 308986 309400 309645 309961 310125 310016 310133 310971 312321 313731 315185
61476C15185J502J006P0k68M81J442J574R36K54r3j62q2j7r4j63n7q8n48q33l2
61456C20013J490K240J693J099J565K361K080P19m03m50J18M00O3m87n66J68J359
61439C33462K296K733L048L571M134M418M357M025L489K953K709K793K920K833
61425C79741K478J923J402J310J774K367K695K921L217L099K092P76K06M09M31
61410D06841j38p34j034j469k192k541k087j456j502k174k684k491j786j360j960
61395C81233l429m501m006k269p54l23o02q95r43p15k74O2J45N31J700K841K615
61378C70416J131JJ25O69O59L35L42O56J075J811K794L198K544J586J297J573
61362C90212J723J660J781K044K063J910K111K919M034N050N787O274O640O995
$$ plain form
61476 315185 316687 317693 317763 317495 317976 319418 320992 321928 322182 322089 321927 321845 321828 321734 321571 321514 321426 320878 320045 320013
61456 320013 321503 323743 325436 326535 328100 330461 332541 333260 332857 332407 332525 332925 332988 332501 331935 332103 333462
61439 333462 335758 338491 341539 345110 349244 353662 358019 362044 365533 368486 371195 373988 376908 379741
61425 379741 382219 384142 385544 386854 388628 390995 393690 396611 399828 402927 405019 405795 406001 406410 406841
61410 406841 406703 405969 404935 403466 401274 398733 396646 395190 393688 391514 388830 386339 384553 383193 381233
61395 381233 377804 373303 369297 367028 366274 365951 365349 364454 363511 362796 362522 362584 362729 363260 364960 367801 370416
61378 370416 371547 371548 371673 372342 373001 373336 373678 374334 375409 377220 380014 383212 385756 387342 388639 390212
61362 390212 391935 393595 395376 397420 399483 401393 403504 406423 410457 415507 421294 427568 434208 441203
61348D41203P353P756Q359R073R342Q769P740O889O128M971L657K971K966K833
61334E30010K191J566J349J231R37O03R3j142l018m490m813m403m011l699l087
61319E09317k084r09J51P90R31R65J165J077L09j87J052L807O081O634O398O842
61303E42339Q116R492J0560J1148J0898R742Q118O183L527J98k781m559n419o082
61289F01480o694p020o970o498n675n068n308n974n926m929l902l262k329q50
61275E31075L32Q47J610L151M424M436L903L997M425M116L088K305K237K691L684
61260E76321N366P363R043J0256J1101J1447J1236J0741J0010Q583O379M143K472
61247F84461J124k35j399k308l381m577n196n243n824p300q273p592o127n354
$$ plain form
61348 441203 448556 456312 464671 473744 483086 491855 499595 506484 512612 517583 521240 524211 527177 530010
61334 530010 532201 533767 535116 536347 537284 537887 537980 536838 533820 529330 524517 520114 516103 512404 509317
61319 509317 507233 506324 506475 507265 508196 509161 510326 511403 511712 511525 512577 516384 522465 529099 535497 542339
61303 542339 550455 559947 570507 581655 592553 602295 610413 616596 620123 620321 617540 612981 607562 601480
61289 601480 594786 587766 580796 574298 568623 563555 558247 552273 546347 541418 537516 534254 531925 531075
61275 531075 531407 532254 533864 537015 541439 545875 549778 553775 558200 562316 565404 567709 569946 572637 576321
61260 576321 581687 589050 598093 608349 619450 630897 642133 652874 662884 671467 677846 681989 684461
61247 684461 685585 685350 683951 681643 678262 673685 668489 663246 657422 650122 641849 634257 628130 622776
61233F22776n243m914m397m194l924k918j602p55j2J482L346M408M530M565M757
61218F17905M591M055L766L835L822L720L964M504M844M873M768M335L289J932
61204F74203P14m32j492j663l01J889L782N436P589R971J1594J2534J4013J6517
61190G54354J8999K0104J9346J7023J3891J0920Q628O669M583K654J376N60j80
61177H78927o24o25j035k776n307p251q253r104j0236j1255j1855j2122j2054
61164G86430j1732j1780j2602j3464j3381j2662j2360j2521j2228j1264j0351
61153F52085r712q667o843m667k502l34J476K246J968J375P95k00j877l866n736
61138F15541p285q127p781o369m664l319k471j982j526o66O47J933L064M692P194
$$ plain form
61233 622776 617533 612619 608222 604028 600104 597186 595584 594829 594817 596299 599645 604053 608583 613148 617905
61218 617905 622496 626551 630317 634152 637974 641694 645658 650162 655006 659879 664647 668982 672271 674203
61204 674203 674917 674485 672993 671330 671029 672918 676700 682136 689725 699696 711290 723824 737837 754354
61190 754354 773353 793457 812803 829826 843717 854637 863265 869934 874517 877171 878547 879107 878927
61177 878927 878303 877678 876643 873867 868560 861309 853056 843952 833716 822461 810606 798484 786430
61164 786430 774698 762918 750316 736852 723471 710809 698449 685928 673700 662436 652085
61153 652085 642373 633706 626863 622196 619694 619360 620836 623082 625050 626425 627220 627020 625143 621277 615541
61138 615541 608256 600129 592348 585979 581315 577996 575525 573543 572017 571351 571998 573931 576995 581687 588881
61123E88881R792J1621J3046J4858J6754J7828J8169J8703J9686K0635K1454K2351
61111G93778K2873K2380K1412K1210K1802K1900K0845J9404J8308J7141J5174
61100A016227J2399R326O370L670Q49k927q010j3378j7426j9634k0808k1835k2938
61087I21885k3964k4580k4268k2942k1418k0615k0459k0148j9269j7892j6050
61076F90280j3864j1876j0448r221p802o476n475m270k481q08k7K37O92J140J162
61061F20763J243J959K782L010L113L791M568M806N307P175R798J1711J2821J4009
61047G06856J5280J6232J7663K0523K3729K5237K5089K5266K6689K8372K9490
61036I60426L0188L0458L0126K9968L0894L2290L2998L3567L5391L8004L9645
$$ plain form
61123 588881 598673 610294 623340 638198 654952 672780 690949 709652 729338 749973 771427 793778
61111 793778 816651 839031 860443 881653 903455 925355 946200 965604 983912 1001053 1016227
61100 1016227 1028626 1037952 1044322 1047992 1048841 1045914 1037904 1024526 1007100 987466 966658 944823 921885
61087 921885 897921 873341 849073 826131 804713 784098 763639 743491 724222 706330 690280
61076 690280 676416 664540 654092 644871 637069 630593 625118 620848 618367 617559 617532 617769 618461 619601 620763
61061 620763 622006 623965 626747 629757 632870 636661 641229 646035 651342 658517 668315 680026 692847 706856
61047 706856 722136 738368 756031 776554 800283 825520 850609 875875 902564 930936 960426
61036 960426 990614 1021072 1051198 1081166 1112060 1144350 1177348 1210915 1246306 1284310 1323955
61025A323955M0213M1224M2956M4178M4678M5491M6647M7429M8889N3263O0585
61014A839508O8687P6740Q6028R7031J08867J22001J38499J59374J84969K17977
61004C099681K62245L18611L86377M69027N73075P01176Q53327J034827J250623
60995H948969J484703J696666J851840J945921J979555J911065J666941J227123
60987B2712783O92678K40147o405n3333Q241R8480J76116J87799M2982l21206
60977B3778282q54736j401440j802672j991702j997240j884490j709326j511023
60969A0625653j316729j139585r80001q35301p06147n93810m97053m14349l45551
60960C797127k89682k43974k06267j75834j51126j29556j10242r4442q2421p2296
$$ plain form
61025 1323955 1364168 1405392 1448348 1492526 1537204 1582695 1629342 1676771 1725660 1778923 1839508
61014 1839508 1908195 1984935 2070963 2167994 2276861 2398862 2537361 2696735 2881704 3099681
61004 3099681 3361926 3680537 4066914 4535941 5109016 5810192 6663519 7698346 8948969
60995 8948969 10433672 12130338 13982178 15928099 17907654 19818719 21485660 22712783
60987 22712783 23405461 23645608 23639203 23585870 23594111 23692591 23868707 24056506 24099488 23778282
60977 23778282 22923546 21522106 19719434 17727732 15730492 13846002 12136676 10625653
60969 10625653 9308924 8169339 7189338 6354037 5647890 5054080 4557027 4142678 3797127
60960 3797127 3507445 3263471 3057204 2881370 2730244 2600688 2490446 2396004 2313583 2241287
60950B241287o2696n4218m7468m1923l7635l5954l7447m0675m3855m6379m8222
60939A744815m9353n0325n1908n3687n4329n3557n2409n1368m9777m7488m5375
60928A185239m3750m1812l9252l6933l5335l3657l1150k8176k5380k2876k0803
60917H26115j9586j9075j8318j6694j4505j2247j0129q470p524o756n392l801
60905F83618l094l227k798j249J29J00q42j483j629j796j986j827j634k297m069
60890F55916o018o927o482n438m733m567m556m510m679n107n479n760o330p108
60876E78222p356o830o396o801p587p937p809p428o499n031m084m508n501n628
60862D88827m778l889l303k679k077j777j434o84k55r76k123k185j111j55K74
$$ plain form
60950 2241287 2178591 2124373 2076905 2034982 1997347 1961393 1923946 1883271 1839416 1793037 1744815
60939 1744815 1695462 1645137 1593229 1539542 1485213 1431656 1379247 1327879 1278102 1230614 1185239
60928 1185239 1141489 1099677 1060425 1023492 988157 954500 923350 895174 869794 846918 826115
60917 826115 806529 787454 769136 752442 737937 725690 715561 707091 699567 692811 687419 683618
60905 683618 680524 677297 674499 673250 673379 673479 672637 671154 669525 667729 665743 663916 662282 659985 655916
60890 655916 649898 642971 636489 631051 626318 621751 617195 612685 608006 602899 597420 591660 585330 578222
60876 578222 570866 564036 557640 550839 543252 535315 527506 520078 513579 508548 504464 499956 494455 488827
60862 488827 484049 480160 476857 474178 472101 470324 468890 468206 467951 466975 464852 462667 461556 461401 461675
60847D61675R62J990K329J623Q59P24O54M2q15j598k626m011m991m796l638k383
60831D46000j666j579j704j410n40L29P80J294K294K991K339Q64J87P92J551J552
60815D54074J174R52O22k03j275k056k255j837j114q26j349j980j797j117j072
60800D39941j831k357k071j627j800k522l301l792l808l549l783m920n996n602
60786C92982l885k511k469l091l432l482l556l488l090k633k389k204j851j351
60772C53550p48k6O39J057J351J689J895J929K339L435M451M490L898L630L596
60757C87175L012K123K118L234M335M530L960K906J478L75N29J560J949J137K16
60742D20637%k33j393l127m516n345n940o430o741o793o350n350m504m701n589
$$ plain form
60847 461675 462637 464627 466956 468579 469438 470162 470816 470858 470043 468445 465819 461808 456817 452021 448383 446000
60831 446000 444334 442755 441051 439641 439101 439430 440210 441504 443798 446789 449128 449992 450179 450971 452522 454074
60815 454074 455248 456200 456822 456619 455344 453288 451033 449196 448082 447256 445907 443927 442130 441013 439941
60800 439941 438110 435753 433682 432055 430255 427733 424432 420640 416832 413283 409500 404580 398584 392982
60786 392982 389097 386586 384117 381026 377594 374112 370556 367068 363978 361345 358956 356752 354901 353550
60772 353550 352802 352776 353415 354472 355823 357512 359407 361336 363675 367110 371561 376051 379949 383579 387175
60757 387175 390187 392310 394428 397662 401997 406527 410487 413393 414871 415246 415775 417335 419284 420421 420637
60742 420637 420637 420404 419011 415884 411368 406023 400083 393653 386912 380119 373769 368419 363915 359214 353625
60727C53625n795m805l653l247l138k507j537r68r95j234j366j317j160j097j188
60712C19618j070l87N03R53R82J078J183Q08J03j63K25P34J084J430J569J099
60696C29749M44N76J568K484K803K851K800K517K486L436M861N330M633M130M598
60681C75266N251N417N600O199O576O256N739N362M622L366K313J661N47j226
60667D32949k415k338k199l148m390m664m414m837n739n980n381m677l994k914
60653C75859j675r18n14Q8O18L81k75k06P72J619J657J331J116O83m55k073l496
60636C74512m266m305l754k956k362k206k209j790o51P28J475J407J382K029K548
60621C59582J674l15j640j294j90L66L30L81O11O21M01L12M68O79Q03P89O20M68
$$ plain form
60727 353625 347830 343025 339372 336125 332987 330480 328943 327975 326980 325746 324380 323063 321903 320806 319618
60712 319618 318548 318161 318664 319617 320599 321677 322860 323668 323771 323608 323833 324567 325651 327081 328650 329749
60696 329749 330193 330769 332337 334821 337624 340475 343275 345792 348278 351714 356575 361905 366538 370668 375266
60681 375266 380517 385934 391534 397733 404309 410565 416304 421666 426288 429654 431967 433628 434175 432949
60667 432949 430534 428196 425997 422849 418459 413795 409381 404544 398805 392825 387444 382767 378773 375859
60653 375859 374184 373266 372752 372840 373458 373839 373564 373358 374130 375749 377406 378737 379853 380536 380081 378008 374512
60636 374512 370246 365941 362187 359231 356869 354663 352454 350664 350013 350741 352216 353623 355005 357034 359582
60621 359582 361256 360941 359301 358007 357817 358183 358513 358894 359505 360126 360527 360839 361307 361986 362789 363578 364198 364666
60603C64666N51P05N23N7k02j33j42l66m35j55L06R91K092L161L352K776K544
60586C80291L149L748L533K796K103J378M68k69n45n42k92N15J622K099J759J634
60570D03447K479L839N224P017R286J1041J1738J2445J4136J5840J5945J4608
60558E27045J3210J1920R517N548J178k338m847o647p650p677o857n506l898k314
60544E20684r09M44J947L598N336P182R012J0606J2230J4630J7965K1232K3316
60531F47273K4196K4488K4103K2126J7895J1837N229n72m895q080j0778j2854
60519G39968j3460j2407j0823j0000r981r781q613o542m269k607j899j627q40
60506F47119R24L357N913Q202J0023J1647J3949J7551K1930K6206L0562L5799
$$ plain form
60603 364666 365217 365922 366445 366502 366300 366167 366025 365659 365224 365069 365375 366366 368458 371619 374971 377747 380291
60586 380291 383440 387188 390721 393517 395620 396998 397466 397197 396652 396110 395818 396333 397955 400054 401813 403447
60570 403447 405926 409765 414989 422006 431292 442333 454071 466516 480652 496492 512437 527045
60558 527045 540255 552175 561692 567240 568418 566080 561233 554586 546936 539259 532402 526896 522998 520684
60544 520684 519775 520219 522166 525764 531100 538282 547294 557900 570130 584760 602725 623957 647273
60531 647273 671469 695957 720060 742186 760081 771918 777147 776575 771680 763600 752822 739968
60519 739968 726508 714101 703278 693278 683297 673516 664903 658361 654092 651485 649586 647959 647119
60506 647119 648043 651400 657313 665515 675538 687185 701134 718685 740615 766821 797383 833182
60494H33182M1640M6801N0887N4767N8673O1325O1514N9231N4703M7705L8588
60483A409016K8604J8279O660o784k0592l2719m2594n0737n7312o2105o5152o6277
60471A058287o4777o0587n5098m9870m5016l9815l4298k9360k5764k3674k2599
60460F07429k1370j8971j5897j3703j2737j1591r445p423o588o058m593k836k303
60447D73914l026l808m118m249m097l352k457k105k105j908j772k194k707k506
60433D33510j765j229q73k11N09N97J07l29n24o80p46p34j079j854k223j631p01
60416D20144j06N28J520J999J281L70N88J501J788J356R89O43j41p47k60P27Q87
60399D33067L40L23R95J388J268J242J262Q12L90J019K344L033K963L165L681
$$ plain form
60494 833182 874822 921623 972510 1027277 1085950 1147275 1208789 1268020 1322723 1370428 1409016
60483 1409016 1437620 1455899 1462559 1455775 1435183 1402464 1359870 1309133 1251821 1189716 1124564 1058287
60471 1058287 993510 932923 877825 827955 782939 743124 708826 679466 653702 630028 607429
60460 607429 586059 567088 551191 537488 524751 513160 503715 496292 489704 483646 479053 476217 473914
60447 473914 470888 467080 462962 458713 454616 451264 448807 446702 444597 442689 440917 438723 436016 433510
60433 433510 431745 430516 429643 429432 429941 430538 430645 430316 429792 429112 428366 427632 426553 424699 422476 420845 420144
60416 420144 420038 420566 422086 424085 425366 425736 426324 427825 429613 430969 431958 432601 432460 431713 431453 432180 433067
60399 433067 433407 433730 434725 436113 437381 438623 439885 440697 441087 442106 444450 447483 450446 453611 457292
60384D57292L444K427J881K156K223J758J782K677L385L312L309L908M220L515
60370D97289K550K335K695K897K763K363J582O54K90O32R61R34J238K406L820
60355E25409M594M729M861N470O705Q443J0125J1161J1686J2322J3035J3000J1773
60342F43313R799P535M872J691j695m965p978j0334j1426j1186j0292r449q911
60329E90974q636q353p628o405n343m927m681l972l224l261l787l695k739j729
60315E22594j168p65k92K62J334L440O085Q184R602J1226J3493J6024J8663K1613
60301F30295K4376K5857K5711K4386K1678J6664R513K064m078r071j3842j8524
60289G35029k2405k4759k5276k4170k2163j9900j7356j4368j1472r422q116o965
$$ plain form
60384 457292 460736 463163 465044 467200 469423 471181 472963 475640 479025 482337 485646 489554 493774 497289
60370 497289 499839 502174 504869 507766 510529 512892 514474 515128 515418 516050 517011 517945 519183 521589 525409
60355 525409 530003 534732 539593 545063 551768 560211 570336 581497 593183 605505 618540 631540 643313
60342 643313 653112 660647 665519 667210 665515 660550 652572 642238 630812 619626 609334 599885 590974
60329 590974 582338 573985 566357 559952 554609 549682 545001 541029 537805 534544 530757 527062 524323 522594
60315 522594 521426 520661 520369 520631 521965 525405 531490 539674 549276 560502 573995 590019 608682 630295
60301 630295 654671 680528 706239 730625 752303 768967 778480 780544 776466 767395 753553 735029
60289 735029 712624 687865 662589 638419 616256 596356 579000 564632 553160 543738 535622 528657
60277E28657o044n783n737m985l697k992l209l556l554l519l469k918k005j623
60263D75566k032k445k243j621r29l50k09m61j63J264K570K066L20m68K24O49
60247D71738j40q52l24O59R81Q73Q35M67m33r67n22R2Jl45j45L92P38J081J688
60228D75817K089J886J540J508J435R80O54R35J411J528J469J582J789K165L186
60213D99974M668N506N281N075N797O672O457N383M713M914N312N231M604L753
60199E73340L211L412M131M545M167L247K136R99K99N38J172Q44p72k391k917
60184E95961k803k962l337l382l120k908k778k727k981l445l492k825j899j113
60170E56189l45M47R32J031R69N22p05k031k088q16K36J12m09m80n02r42j233
$$ plain form
60277 528657 522613 516830 511093 506108 502411 499419 496210 492654 489100 485581 482112 479194 477189 475566
60263 475566 473534 471089 468846 467225 466296 465946 465737 465276 465113 466377 468947 471013 471333 470865 471089 471738
60247 471738 471598 470746 470422 471081 472062 472935 473770 474237 473804 472837 472315 472407 472408 472063 471918 472310 473048 474129 475817
60228 475817 477906 479792 481332 482840 484275 485255 485909 486844 488255 489783 491252 492834 494623 496788 499974
60213 499974 504642 510148 515429 520504 526301 532973 539430 544813 549526 554440 559752 564983 569587 573340
60199 573340 576551 579963 584094 588639 592806 596053 598189 599188 599487 600025 601197 602041 601269 598878 595961
60184 595961 593158 590196 586859 583477 580357 577449 574671 571944 568963 565518 562026 559201 557302 556189
60170 556189 555844 556291 557223 558254 559223 559745 559040 557009 554921 554105 554341 554453 554044 553564 553062 552120 550887
60153E50887q86m88n69n87k3N97P83J091J999K791K722K320K424K772K718K530
60137E71081K832L462L945M471N417O454P056P265P276O925O231N629N058L770
60123F46872J770K67n8j16p28j158m58Q32J567J661J614J298N18q3P8M06Q7n98
60105F53771r77j252j865k478k713l123m156m989m696l788l325l248k896k439
60091F11826k369k246j398k83K62N43J402K614L289L378L463L455K924K216J893
60076F30969J515L48j191k178k838m069n673o650o965p467q196q252p481o836
60062E65036o918p308p450p189o375m909l274k242k061k546l513m432m299k820
60048D99700j199o26o02P1J257J931K080K601L496L773L168K566K611L040L442
$$ plain form
60153 550887 550001 549513 548944 548357 548334 548931 549714 550805 552804 555595 558317 560637 563061 565833 568551 571081
60137 571081 573913 577375 581320 585791 591208 597662 604718 611983 619259 626184 632415 638044 643102 646872
60123 646872 648642 648909 648851 648735 648007 646849 646391 647223 648790 650451 652065 653363 653881 653798 653876 654282 654369 653771
60105 653771 652794 651542 649677 647199 644486 641363 637207 632218 627522 623734 620409 617161 614265 611826
60091 611826 609457 607211 605813 605530 605792 606335 607737 610351 613640 617018 620481 623936 626860 629076 630969
60076 630969 632484 632832 631641 629463 626625 622556 616883 610233 603268 595801 587605 579353 571872 565036
60062 565036 558118 550810 543360 536171 529796 524887 521613 519371 517310 514764 511251 506819 502520 499700
60048 499700 498501 497875 497273 497344 498601 500532 502612 505213 508709 512482 515650 518216 520827 523867 527309
60033E27309L594L072J570l81j900k823l407l424k681j994k384l553m396m742
60019E03860n229n728n447m508l961m113m232l974l811l811l409k604k168k293
60005D48572k146j208m9O23Q38R65J084J070P72P8p21q97k61K51j92r08o27O03
59987D47847J605J905K052K303K267J904J567J055j09j344j354o6R78N66r02k338
59971D57936l115k989j936n43K37J42j47K6P11J716K797L424L244K741K685K909
59955D69838K551J474N33L37O28Q98P94l6j594k969l088k115j248j119j295j334
59939D62255j324j274r48n26n59j123j657j761j486r18j36N37R78J638K744L548
59923D59988L404L102L876N460O526O818P332Q377R082R002Q721Q410P295N150
$$ plain form
60033 527309 530903 533975 535545 535164 533264 530441 527034 523610 520929 518935 516551 512998 508602 503860
60019 503860 498631 492903 487456 482948 478987 474874 470642 466668 462857 459046 455637 453033 450865 448572
60005 448572 446426 445218 445169 445792 446630 447595 448679 449749 450521 450599 449878 448981 448720 448971 448779 447871 447244 447847
59987 447847 449452 451357 453409 455712 457979 459883 461450 462505 462396 461052 459698 459632 460610 461176 460274 457936
59971 457936 454821 451832 449896 449353 449590 449732 449585 449611 450322 452038 454835 458259 461503 464244 466929 469838
59955 469838 472389 473863 474396 474733 475361 476259 477053 477017 475423 472454 469366 467251 466003 464884 463589 462255
59939 462255 460931 459657 458709 458183 457624 456501 454844 453083 451597 450679 450543 451080 452058 453696 456440 459988
59923 459988 463392 466494 470370 475830 482356 489174 496506 504883 513965 522967 531688 540098 547393 552543
59909E52543L054J982J648J368J117J067R27L78l64r13j157j120r49j116j983
59894E56482l032l306k665j904j501j094l20O40J540K390L101L479L593L673L677
59879E64753L618M019N148O090N617L962K609K372K683K783K558K022J068m7p92
59864F08463j127j476j891k071k088k261k412k153j721j623j679j423j155j443
59850E83940j862j483l76P19J984M179O846Q457Q505P842O794M692J646q86j938
59835F29059k032j776r01N94J726J733R86nj468l527n475o537o694o318n752n455
59819E88158n754o212o085n465m949m295k741p33K20k10o74l87l40j497l200m215
59803E41621m262l628k429j060m53r92j927k480k720k842k538j735j088j074j317
$$ plain form
59909 552543 555597 557579 559227 560595 561712 562779 563706 564084 563720 562807 561650 560530 559581 558465 556482
59894 556482 553450 550144 547479 545575 544074 542980 542660 543300 544840 547230 550331 553810 557403 561076 564753
59879 564753 568371 572390 577538 583628 589245 593207 595816 598188 600871 603654 606212 608234 609302 609255 608463
59864 608463 607336 605860 603969 601898 599810 597549 595137 592984 591263 589640 587961 586538 585383 583940
59850 583940 582078 580595 580219 580938 582922 587101 593947 602404 610909 618751 625545 630237 631883 630997 629059
59835 629059 627027 625251 624350 624944 626670 628403 629389 629384 627916 624389 618914 612377 605683 599365 593613 588158
59819 588158 582404 576192 570107 564642 559693 555398 552657 551924 552144 551934 551260 550873 550533 549036 545836 541621
59803 541621 537359 533731 531302 530242 529789 528797 526870 524390 521670 518828 516290 514555 513467 512393 511076
59788E11076j377j387j512j561j567j878k361k374j894j607j654j320l84L84N14
59773D91098M69N15J69o08q68m2J161J931K460L171L824M091M192M350M359M133
59757E24405L916L626K946K319K698L981M919N039N282O168O753O238N345N119
59743E88754N371N316M877M462M106L632L073K407J521P03L32l4j225k919l843
59728F16533l723l570l771l442k273j267j011q35n27j081k709l787l178k023j842
59713E81494k204j910j248j381k269k828k548j725o33M52R74Q06O62J004J370
59698E70016J422J636K139K114J274P48J276J833J294L34K04O69O66J65j47k66
59682E85377n06m57K18O42j99j751k751l175l939n089n809n912n947o027n776
$$ plain form
59788 511076 509699 508312 506800 505239 503672 501794 499433 497059 495165 493558 491904 490584 490200 490584 491098
59773 491098 491567 492082 492251 491643 490775 490733 491894 493825 496285 499456 503280 507371 511563 515913 520272 524405
59757 524405 528321 531947 534893 537212 539910 543891 548810 553849 559131 565299 572052 578290 583635 588754
59743 588754 594125 599441 604318 608780 612886 616518 619591 621998 623519 624222 624554 624520 623295 620376 616533
59728 616533 612810 609240 605469 602027 599754 598487 597476 596641 596114 595033 592324 588537 585359 583336 581494
59713 581494 579290 577380 576132 574751 572482 569654 567106 565381 564748 565200 566174 566980 567642 568646 570016
59698 570016 571438 573074 575213 577327 578601 579349 580625 582458 583752 584086 584290 584959 585625 585790 585643 585377
59682 585377 584871 584414 584632 585274 585075 583324 580573 577398 573459 568370 562561 556649 550702 544675 538899
59667E38899n292m972m617l715k467j578j169p56j43M21P56Q03N56M23J040K246
59651E20435K970K781K591L152L817L720L096K401J168j005l213m331m582m802
59637E28198m935m559m080l963l504j900lO12p3o70n73m60p80j161j400j796k434
59620D96519l020l407l543l182k393j954k339k851k665k112j936j895j286l00
59606D63636L88R01J717K406K216J596J727K669L241K765J741Q52L18K45N82P76
59590D87776L38l36n28l09k79n11o83r23j567k296k459k026j424p23J06N11o7
59573D74600j221k029k250k176j793j028m21m96p81n22lr2q05j393j642j892k035
59556D54021j509l53P68J494J920J932J311M64K20Q61J937K975L838M548N287
$$ plain form
59667 538899 533607 528635 524018 520303 517836 516258 515089 514333 514190 514611 515367 516170 516726 517149 518189 520435
59651 520435 523405 526186 528777 531929 535746 539466 542562 544963 546131 545126 541913 537582 533000 528198
59637 528198 523263 518704 514624 510661 507157 505257 505254 505866 505793 505123 504550 504090 503310 502149 500749 498953 496519
59620 496519 493499 490092 486549 483367 480974 479020 476681 473830 471165 469053 467117 465222 463936 463636
59606 463636 464024 464925 466642 469048 471264 472860 474587 477256 480497 483262 485003 485855 486173 486418 487000 487776
59590 487776 488114 487778 487250 486941 486662 486151 485468 484545 482978 480682 478223 476197 474773 474050 474156 474667 474600
59573 474600 473379 471350 469100 466924 465131 464103 463682 463186 462405 461883 461880 461788 460983 459590 457948 456056 454021
59556 454021 452512 452159 452927 454421 456341 458273 459584 460048 460268 461129 463066 466041 469879 474427 479714
59541D79714O377P798R149J0341J1872J4011J6364J8547K0221K0081J6162Q349
59529F38986l98o534r022r084p928o026l924k181o74R74K498L245K931J572o70
59514F03765l003m349m816n776p660r019q817q175q446q906q110o439n476n621
59500E09152o062o373o495n841m126k401j701j385m61L59j76j423j642p65k97
59485D70363p80j253j038l15Q52K328L123K495J523J811L019L492K985K730L077
59470D94412L129K745K891L845M733M995M707L616J529m26p20M39J536K174L254
59455E32859M874O004O406O933P751Q041P689P537P684P220N894M454L081J112
59441F17539j473l809n572p185q463q546p389n904m622l510k870k946k858j547
$$ plain form
59541 479714 486091 493889 503038 513379 525251 539262 555626 574173 594394 614475 630637 638986
59529 638986 638588 632054 623032 613948 606020 599994 596070 593889 593215 594189 596687 599932 602863 604435 603765
59514 603765 600762 596413 591597 585821 578161 569142 560325 552150 543704 534798 526688 520249 514773 509152
59500 509152 503090 496717 490222 484381 480255 477854 476153 474768 474307 474666 474490 473067 471425 470660 470363
59485 470363 469583 468330 467292 466977 467829 470157 473280 475775 477298 479109 482128 485620 488605 491335 494412
59470 494412 497541 500286 503177 507022 511755 516750 521457 525073 526602 526176 525456 525895 527431 529605 532859
59455 532859 537733 543737 550143 557076 564827 572868 580557 588094 595778 602998 608892 613346 616427 617539
59441 617539 616066 612257 606685 599500 591037 582491 575102 569198 564576 561066 558196 555250 552392 550845
59427E50845M19J720K524L999N946P129P774R414J2136J4288J5198J5962J7268
59414F64622J8511J9463K0705K2069K2669K2533K1904J8902J0902j016j1739j7389
59402H12136j8518j7153j3637q088k378J682M478O736O941K843n109j3634j9575
59389G36724k1860k1190j8990j6501j4082j1536r077p192n613l617j565p41j273
59376F03487j614o44R58K041K494K807L195L658M092M025L192K343K407K972L015
59361F38428K840L586M941N354M712M640N742O716O798P041Q255R651J0510J1397
59347G30611J2701J3634J3716J3774J4426J4986J4739J4019J3147J1657R232O292
59335H82934L046o45m179o515p913r689j1863j3008j2830j2833j3661j3983j2982
$$ plain form
59427 550845 551264 552984 555508 559507 565453 572582 580356 589770 601906 616194 631392 647354 664622
59414 664622 683133 702596 723301 745370 768039 790572 812476 831378 842280 841264 829525 812136
59402 812136 793618 776465 762828 754740 752362 754044 758522 765258 772199 775042 769933 756299 736724
59389 736724 714864 693674 674684 658183 644101 632565 623488 616296 610683 607066 605501 604760 603487
59376 603487 601873 601229 602187 604228 606722 609529 612724 616382 620474 624499 627691 630034 632441 635413 638428
59361 638428 641268 644854 649795 655149 659861 664501 670243 676959 683757 690798 699053 708704 719214 730611
59347 730611 743312 756946 770662 784436 798862 813848 828587 842606 855753 867410 876642 882934
59335 882934 885980 885335 881156 874641 866728 857039 845176 832168 819338 806505 792844 778861 765879
59322G65879j1812j1496j1351j0601r745r142q128o681o070o693p112o471n842
59309F54735n923n492l758k186k193k760k230q62L49J819M341P141Q917R865J0837
59294F72600J1536J1137R740P553L671k515r459j4626j7018j7260j6012j3715
59282F25632j1155q897o607l965j525J93J585K983L890M213N092P302R879J1450
59268F40070J2025J2326J2461J2270J1966J1339R469O247L107J185p7j561l069
59255G27758m352n966p856q647p753o721o926p343o335m371l075k645k054j053
59241F52661j84N37J427K202K575L049L955M572M419M370N150N784N029L368K067
59226G00981J164p9j511k424k921l618m546n457o459p346p233n962m828m809n215
$$ plain form
59322 765879 754067 742571 731220 720619 710874 701732 693604 686923 680853 674160 667048 660577 654735
59309 654735 648812 643320 639562 637376 635183 632423 630193 629331 629680 631499 635840 642981 651898 661763 672600
59294 672600 684136 695273 705013 712566 716237 713722 704263 689637 672619 655359 639347 625632
59282 625632 614477 605580 598973 595008 593483 593676 595261 598244 602134 606347 611439 618741 628620 640070
59268 640070 652095 664421 676882 689152 701118 712457 721926 728173 731280 732465 732388 730827 727758
59255 727758 723406 717440 709584 700937 693184 686463 679537 672194 665859 661488 658413 655768 653714 652661
59241 652661 652477 653014 654441 656643 659218 662267 666222 670794 675213 679583 684733 690517 695546 698914 700981
59226 700981 702145 702066 700555 698131 695210 691592 687046 681589 675130 667784 660551 654589 649761 644952 639737
59211F39737n201n277n933o227n346m338m521n243n070m231m002m367m240l434
59197E72307k760k466k056j291l06Q15J659J513P13Q47K539M213M299L412K980
59182E86418L041K979L148M028M834M698M260M473M818M421L873M220N095N589
59168F45895N998O989Q016Q376Q788J0033J0973R984P477N079L037N11k233m086
59154G24837n094o298p882r183j0174j1322j2334j2579j2248j1774j0782q998
59142F06169p366o817o815o519o376o940p303o488n364n258n627n082l771k749
59128E23694j992j008m70r95j239M66L257M893N117N572O853Q041Q853R966J1286
59113E82294J1899J1643J1045J0093Q764Q110Q939J0094R933Q849Q216P735O119
$$ plain form
59211 639737 634536 629259 623326 617099 611753 607415 602894 597651 592581 588350 584348 579981 575741 572307
59197 572307 569547 567081 565025 563734 563428 564243 565902 567415 568128 568975 571514 575727 580026 583438 586418
59182 586418 589459 592438 595586 599614 604448 609146 613406 617879 622697 627118 630991 635211 640306 645895
59168 645895 651893 658882 666898 675274 684062 694095 705068 715052 722529 727608 730645 731156 728923 724837
59154 724837 719743 713445 705563 696380 686206 674884 662550 649971 637723 625949 615167 606169
59142 606169 598803 591986 585171 578652 572276 565336 558033 551545 546181 540923 535296 530214 526443 523694
59128 523694 521702 520694 520224 519229 517990 518456 521713 526606 531723 537295 544148 552189 561042 571008 582294
59113 582294 594193 605836 616881 626974 635738 643848 652787 662881 672814 681663 689879 697614 703733
59100G03733L823K525K276J517k25j921l090m112m693m154l158l050l624l453
59086F82394k286j146m35J55J93j011k796l971m882o610q607r257q394p278o430
59071F19639n561n029n231n175l915k726l375m945n044l631k781k999k806j828
59057E64593j360j684j668j274j736k941l253k327j533j303o17N22P59o6n49k66
59041E45297l38r86j050l53j12m97k24R35J666J587J822K615K830K372K624L925
59025E62113N050N764P324R845J1741J2519J3482J4773J4541J2166R641Q391P074
59012F94424M131L23k767m844o072n987m735l747l741l461j753N17J903K435L051
58997F69677M002M882N411N430M868M119L586K771R64j160k101j747j477j927
$$ plain form
59100 703733 707556 710081 712357 713874 713649 711728 708638 704526 699833 695679 692521 689471 685847 682394
59086 682394 680108 678962 678527 678682 678875 677864 675068 671097 666215 659605 650998 641741 633347 626069 619639
59071 619639 614078 609049 603818 598643 594728 592002 588627 583682 578638 575007 572226 569227 566421 564593
59057 564593 563233 561549 559881 558607 556871 553930 550677 548350 546817 545514 544897 545419 546178 546112 545563 545297
59041 545297 544959 543973 542923 542570 542458 541961 541737 542672 544338 545925 547747 550362 553192 555564 558188 562113
59025 562113 567163 572927 580251 590096 601837 614356 627838 642611 657152 669318 678959 687350 694424
59012 694424 698555 698878 696111 691267 685195 679208 674473 670726 666985 663524 661771 662288 664191 666626 669677
58997 669677 673679 678561 683972 689402 694270 698389 701975 704746 705710 704550 702449 700702 699225 697298
58983F97298k342k361k664l536m299m530m345l420j298J238K899L895N502P642
58969F89679Q862Q843Q867R634J0483J0961J1309J1297J0565R965J0596J1587
58957H12648J1019Q816O394L763k14m817p767q862j0310j2873j4676j4639j4192
58944G54290j4559j4914j4391j3508j2518j0638p922n828n002m489l765l445l462
58931F39849k810j644j320j870j855j068q60j352j114j12n7j177j650j005j022
58916F20933k283k931k079j341j700j784p36J26LJ75J412K550L053M253O551Q186
58900F34388Q390Q915J0788J2343J2305J2095J3132J4377J4592J4595J5341J6075
58888G87336J6254J7048J9117K1096K1862K2075K1951K0085J6130J2023Q893N457
$$ plain form
58983 697298 694956 692595 689931 686395 682096 677566 673221 669801 668503 669741 672640 676535 682037 689679
58969 689679 698541 707384 716251 725885 736368 747329 758638 769935 780500 790465 801061 812648
58957 812648 823667 832483 838877 842640 842426 837609 829842 820980 810670 797797 783121 768482 754290
58944 754290 739731 724817 710426 696918 684400 673762 665840 660012 655010 650521 646756 643311 639849
58931 639849 637039 635395 634075 632205 630350 629282 628422 627070 625956 625844 625787 624610 622960 621955 620933
58916 620933 618650 615719 613640 612299 610599 608815 608079 608205 608208 608383 609795 612345 615398 619651 626202 634388
58900 634388 642778 651693 662481 674824 687129 699224 712356 726733 741325 755920 771261 787336
58888 787336 803590 820638 839755 860851 882713 904788 926739 946824 962954 974977 983870 989327
58876I89327J173k056l383n209r378j3892j6038j6240j6228j5766j4034j2050
58864H66226j0987r889p752n965o138p326p870q213r419j0623j0538r880r926
58851G51700j0113r454q714q906r156q312p136o759o535n676n347o823q937r700
58837F40132r120q503q228q076q244q367p202m953l890m893n582l963j691j234
58823E56186j972j750m35P67J906L479M575M330L904M656N753N759N087M711M095
58808F01051K665J612J924K314J359M1k37k88j419k807l094k900l258l397k548
58793E91018k136l483n097n024m129m260m822m131k585j585p48R02K434K603K567
58778E61524L995N824N909M630L934L894L139J600L8k070n300q106q570p382o429
$$ plain form
58876 989327 990500 988444 985061 979852 970474 956582 940544 924304 908076 892310 878276 866226
58864 866226 855239 845350 837598 831633 825495 818169 810299 802086 792667 782044 771506 761626 751700
58851 751700 741587 732133 723419 714513 705357 697045 689909 683150 676615 670939 665592 658769 649832 640132
58837 640132 631012 622509 614281 606205 597961 589594 582392 577439 573549 568656 563074 559111 557420 556186
58823 556186 554214 552464 552029 552796 554702 558181 562756 567086 570990 575646 581399 587158 592245 596956 601051
58808 601051 603716 605328 607252 609566 610925 610966 610729 610441 609022 606215 603121 600221 596963 593566 591018
58793 591018 588882 585399 580302 575278 571149 566889 562067 557936 555351 553766 553018 553920 556354 558957 561524
58778 561524 565519 571343 577252 581882 585816 589710 592849 594449 594487 592417 587117 579011 570441 563059 556630
58763E56630n722m365l138l181l335j811N75J715J681K015K689K714K635L450
58749E52552M092K979J102O21J329J481J161J791L138L823M099N243O857P541
58735E97809P463P682P795O923O014O471P460P307O490O499O918O485N851O211
58721F93378O475M977K910K789M391N526N941P077Q702R143Q446Q153Q269P406
58707G83583N456L364R16k511n805p514q618j1063j4406j6747j8047j9535k0782
58694F68291k0394j8802j7475j6244j4206j2199j1402j0763q799o641o089o170
58682E19107n045l821m647o326n902l675k455k625k050l91N50N61J262K794L803
58667D91140M493O253Q645J0070J0914J2660J4551J4524J2702J0574P679K926
$$ plain form
58763 556630 550908 546543 543405 540224 536889 535078 535653 537368 539049 541064 543753 546467 549102 552552
58749 552552 556644 559623 560725 561346 562675 564156 565317 567108 570246 574069 578168 583411 590268 597809
58735 597809 605272 612954 620749 627672 633686 640157 647617 654924 661414 667913 674831 681316 687167 693378
58721 693378 699853 704830 707740 710529 714920 720446 726387 733464 742166 751309 759755 767908 776177 783583
58707 783583 789039 792403 793319 790808 785003 777489 768871 757808 743402 726655 708608 689073 668291
58694 668291 647897 629095 611620 595376 581170 568971 557569 546806 538007 531366 525277 519107
58682 519107 514062 510241 505594 499268 493366 489691 487236 484611 482561 482170 482720 483281 484543 487337 491140
58667 491140 495633 501886 510531 520601 531515 544175 558726 573250 585952 596526 604205 607131
58655F07131j859l797l673m672p079q312p685o945o532n446m454n232o709o326
58641E28410m517l804m007k778m00N94L19J352L747M922M536M749N490M317J367
58626E44297k83J48J77j103j736j169j233k054j333J299L352L777M144M866M436
58611E57585L116L222M872N505M291L037K207L30k028k218k65O93m18j305j006
58596E77618j444l196m171l685l658m507m110k048o77p08J58K820N069N649O152
58581E69262P528Q491Q648R420J0785J0813R472R093J0173J0524R443Q760R025
58568F91437Q724Q046R198J2224J4666J6151J8882K2915K5528K6088K6811K7838
58556I08508K6434K2197J8101J5130J0818M539p18l430n559q035r095q624r198
$$ plain form
58655 607131 605272 601475 597802 593130 586051 577739 570054 563109 556577 551131 546677 541445 534736 528410
58641 528410 523893 520089 516082 513304 512904 513498 513817 515169 518916 523838 528374 533123 538613 542930 544297
58626 544297 544014 544162 544339 543236 541500 540331 539098 537044 535711 537010 540362 544139 548283 553149 557585
58611 557585 560701 563923 568795 574300 578591 581628 583835 584165 582137 579919 579654 580347 579929 578624 577618
58596 577618 576174 572978 568807 565122 561464 556957 552847 550799 550122 549414 549572 552392 557461 563110 569262
58581 569262 576790 585281 593929 603349 614134 624947 634419 643512 653685 664209 673652 682412 691437
58568 691437 700161 708207 717405 729629 744295 760446 779328 802243 827771 853859 880670 908508
58556 908508 934942 957139 975240 990370 1001188 1005727 1005009 1001579 996020 987985 978890 970266 961068
58543I61068j1139j1529r854r490j1772j3735j3840j4686j7630j9826j9254j8025
58531G90288j7916j7146j4230j0883q575o223l495k214k524j871L51J512P71P29
58517G08574K249K635Q69l91r0q90l642n110l736k547l571m440l395k599l511
58502F80405l912k574k017l582m527l095j759k375k802j397k42q37j154O8P53
58487F50953K4N78L593O117O396O939R393J1430J1693J2643J5353J6724J5127
58474G66963J3505J3568J2360Q103L994K439Q85k739n823o267o535q446r257p068
58460G75682m900n116m980k087J044K108L462O939R501Q755P537Q257P976M037
58446H18215n02k266l302o228q571p390n026m747n009l223j052p82n81J628L687
$$ plain form
58543 961068 949929 938400 928546 919056 907284 893549 879709 865023 847393 827567 808313 790288
58531 790288 772372 755226 740996 730113 721538 715315 711820 709606 707082 705211 705562 707074 707845 708574
58517 708574 710823 713458 714327 713936 713846 712956 709314 704204 700468 697921 694350 689910 686515 683916 680405
58502 680405 676493 673919 671902 668320 663793 660698 658939 656564 653762 652365 652123 651286 650132 650200 650953
58487 650953 650977 651555 655148 661265 667661 674600 683993 695423 707116 719759 735112 751836 766963
58474 766963 780468 794036 806396 814499 818493 820932 821817 819078 813255 806988 800453 792007 782750 775682
58460 775682 770782 765666 760686 758599 759643 761751 765213 772152 781653 790408 797945 806202 814178 818215
58446 818215 817713 815447 812145 805917 797346 789956 784930 780183 775174 771951 770899 770117 769536 771164 774851
58431G74851L350K698L894M852L751L181N294P465P364P339R208R918P262M562
58417H54989M517L880m46n329p060p700j0119j2014j0719q863r360r767p395m833
58403G69781m663m022l35K993K686J865M026O414N808N148P647R960Q250N487
58389H21045N608N931K707j214j698j052k988n188m438l778o788r963q640n308
58375G84236m241l198J448O590P755P445R899J2724J2076J0807J2891J5152J3309
58362H86893J0857J2785J5941J5008J2600J3741J5587J2814Q225P636Q929O585
58350A027601K633K488M194K397r22k77K624K508J022L216P306Q335Q175J1483
58336A082783J5633J5258J2827J4135J7242J6652J4324J5520J7856J5746J1649
$$ plain form
58431 774851 778201 780899 784793 789645 793396 796577 801871 809336 816700 824039 833247 843165 850427 854989
58417 854989 859506 863386 862940 857611 850551 842851 832732 820718 809999 801136 791776 782009 774614 769781
58403 769781 765118 761096 760761 763754 766440 768305 772331 778745 784553 789701 797348 807308 815558 821045
58389 821045 826653 832584 835291 834077 832379 831327 828339 823151 818713 814935 808147 798184 789544 784236
58375 784236 779995 776797 778245 784835 792590 800035 809934 822658 834734 845541 858432 873584 886893
58362 886893 897750 910535 926476 941484 954084 967825 983412 996226 1004451 1012087 1021016 1027601
58350 1027601 1030234 1032722 1036916 1039313 1038391 1038114 1040738 1043246 1044268 1047484 1054790 1063125 1071300 1082783
58336 1082783 1098416 1113674 1126501 1140636 1157878 1174530 1188854 1204374 1222230 1237976 1249625
58325A249625J1495J2988J0069N017M312O370N203K386L410O151N057K670M768
58312A329521Q402P305M743P869J3726J4396J1743J3239J7255J6802J3905J5725
58300A474631K0093J9510J5898J6649J9731J7848J3595J4983J9534J8733J4749
58289A665954J6471K2225K3057K0079K1670K6411K6001K2347K4325L0182L0773
58278A929495K7580K9590L4992L4457L0083L2083L8954M0159L6455L7949M3901
58267B315698M4482M0879M3361N0874N3018N0762N4443O2772O5053O2538O5953
58256B909833P3532P3765O8172O8561P3597P1727O5313O7387P6297P8836P6663
58245C703683Q3286R6661J02172J01290J08961J23766J30143J29247J37161J53129
$$ plain form
58325 1249625 1261120 1274108 1284177 1289194 1293506 1299876 1305079 1307465 1310875 1317026 1322083 1324753 1329521
58312 1329521 1337923 1345228 1349971 1357840 1371566 1385962 1397705 1410944 1428199 1445001 1458906 1474631
58300 1474631 1494724 1514234 1530132 1546781 1566512 1584360 1597955 1612938 1632472 1651205 1665954
58289 1665954 1682425 1704650 1727707 1747786 1769456 1795867 1821868 1844215 1868540 1898722 1929495
58278 1929495 1957075 1986665 2021657 2056114 2086197 2118280 2157234 2197393 2233848 2271797 2315698
58267 2315698 2360180 2401059 2444420 2495294 2548312 2599074 2653517 2716289 2781342 2843880 2909833
58256 2909833 2983365 3057130 3125302 3193863 3267460 3339187 3404500 3471887 3548184 3627020 3703683
58245 3703683 3786969 3883630 3985802 4087092 4196053 4319819 4449962 4579209 4716370 4869499
58235D869499J61035J61973J72608J91446K00702K01852K14032K36748K50886
58226F660781K57362K76324L06919L28105L40811L67202M06464M35681M56859
58217I836508M96207N53855O03716O46685P11544P98848Q79776R56010J061602
58208A6544751J199379J339152J486239J683534J937531K217107K535833K954154
58200C1897680L486909M097242M797307N659398O715443P962047R487566J1463736
58192H5567328J3982850J7052612K0776296K5317340L0565810L5984842M0783031
58185B70030109M3860554M3431931L7354086K4770173P670688r667960k3215022
58178C94234559l1274357l4446844l4284804l2304394k9715729k7260880k5057162
$$ plain form
58235 4869499 5030534 5192507 5365115 5556561 5757263 5959115 6173147 6409895 6660781
58226 6660781 6918143 7194467 7501386 7829491 8170302 8537504 8943968 9379649 9836508
58217 9836508 10332715 10886570 11490286 12136971 12848515 13647363 14527139 15483149 16544751
58208 16544751 17744130 19083282 20569521 22253055 24190586 26407693 28943526 31897680
58200 31897680 35384589 39481831 44279138 49938536 56653979 64616026 74103592 85567328
58192 85567328 99550178 116602790 137379086 162696426 193262236 229247078 270030109
58185 270030109 313890663 357322594 394676680 419446853 427117541 417449581 394234559
58178 394234559 362960202 328513358 294228554 261924160 232208431 204947551 179890389
58171A79890389k2833613k0428465j7965669j5623150j3460615j1504410r814796
58164F8259671q400919p189576o129226n234894m503941l879755l328257k869109
58156B6723994k504330k189630j901046j662160j481621j325575j174131j047516
58148A3437985r54973q70924p81882p07282o54765o01284n36634m81713m46393
58139G402135m10982l65867l29438l10336k90101k59490k35855k28494k20975
58130D750597k03369j89425j86641j80557j63642j50233j48252j44313j30753
58121C253412j20200j19756j17016j05020r5763r5902r3461q1524p1559p0637
58111B282574o8214n7928n0444n2252n2990m6039m1199m4915m7621m2670l8874
$$ plain form
58171 179890389 157056776 136628311 118662642 103039492 89578877 78074467 68259671
58164 68259671 59858752 52669176 46539950 41305056 36801115 32921360 29593103 26723994
58156 26723994 24219664 22030034 20128988 18466828 16985207 15659632 14485501 13437985
58148 13437985 12483012 11612088 10830206 10122924 9468159 8866875 8330241 7848528 7402135
58139 7402135 6991153 6625286 6295848 5985512 5695411 5435921 5200066 4971572 4750597
58130 4750597 4547228 4357803 4171162 3990605 3826963 3676730 3528478 3384165 3253412
58121 3253412 3133212 3013456 2896440 2791420 2695657 2599755 2506294 2424770 2353211 2282574
58111 2282574 2214360 2156432 2105988 2053736 2000746 1954707 1913508 1868593 1820972 1778302 1739428
58100A739428m2567m5424m1366l8033m0628m1391l5629l1497l3697l4009k7855
58089A327332k3871k7115k8981k3857j9793k2522k4409j9642j5455j7894k0686
58078A083107j8416j6873k0442k2655j9100j6562j9884k2546j9535j6848j9009
58067H71237j9855j4969j0940j2872j4730j1274p801q956r522n491k831o078r294
58054G36624p476o048r930j3839j2589j0691j2620j3729r820n969o888q099n329
58041F13597l069n221o813l868j939n893j0313r155o095o398p127m541k668n444
58027E35053q306o615m601p086j0143q889o946r061j1592r470n865n889p181n435
58013D27974l029l683m582k198L2j925m563l100j25r6r58Q67K801J291p07R03
$$ plain form
58100 1739428 1696861 1651437 1610071 1572038 1531410 1490019 1454390 1422893 1389196 1355187 1327332
58089 1327332 1303461 1276346 1247365 1223508 1203715 1181193 1156784 1137142 1121687 1103793 1083107
58078 1083107 1064691 1047818 1027376 1004721 985621 969059 949175 926629 907094 890246 871237
58067 871237 851382 836413 825473 812601 797871 786597 778796 769840 760318 754827 751996 745918 736624
58054 736624 729148 723100 713170 699331 686742 676051 663431 649702 639882 633913 627025 618926 613597
58041 613597 610528 605307 598494 594626 592687 586794 576481 567326 561231 554833 547706 543165 540497 535053
58027 535053 526747 520132 515531 508445 498302 489413 482467 473406 461814 452344 446479 440590 433409 427974
58013 427974 424945 421262 416680 414482 414514 412589 408026 404926 404801 404705 403747 404614 407415 408706 407999 408902
57997D08902L787M370N065Q798J1898J0112O490N719N844L171Q6K16Q32k052n747
57982D67491n764m135n262p814q230q017j0154j2337j1121q813r145j0034p729
57969C58936m185l270l534j647Q27Q88M43K446M604L685K105L442N367M039J527
57954C75673J739K857J073j785j738l81j709m432m680l454m176n615m394j831
57940C47147j415j981k48K431K662J887L902P805R965J0743J2715J4579J3295
57927D23487J0189Q600P627M463N08j066j494l848o656o475m601m759o337o193
57913D13445n007n426o078l966p36n2q26L84K393J537j105j580m17j186l332l432
57897C84616k255l404n945n586k630j673l613m690l481k534k759k263r94r25j536
$$ plain form
57997 408902 412689 417059 422124 430922 442820 452932 459422 465141 470985 474156 474242 474458 475290 473238 467491
57982 467491 461727 457592 452330 444516 436286 428269 418115 405778 394657 385844 376699 366665 358936
57969 358936 354751 351481 347947 346300 347127 348015 348458 350904 355508 359193 361298 364740 370107 374146 375673
57954 375673 377412 380269 381342 379557 377819 377438 375729 371297 366617 363163 358987 353372 348978 347147
57940 347147 345732 343751 343503 345934 348596 350483 354385 362190 372155 382898 395613 410192 423487
57927 423487 433676 442276 449903 454366 454874 453808 452314 448466 441810 435335 430734 425975 419638 413445
57913 413445 408438 403012 396934 392968 392232 392180 391354 391738 394131 395668 394563 392983 392566 391380 388048 384616
57897 384616 382361 378957 373012 367426 364796 363123 359510 354820 351339 348805 346046 343783 342789 341864 340328
57882C40328m36J634J675ml91N49J00j692k172j387j900l566l677k090j208j189
57866C24574j74J289J007k07L22J955J870O08J259L687M901M674N418O931O677
57851C64791M994M639N399M442J821L60K55q70k816l044j901k220l837l898k620
57836C65495l158n655o884o064n672o158n313l285k823l988l912k229j561k128
57822C06665j335P67J106n54r14Q55J744O75K02J223J295k75q39M31O82j547l949
57805C06232m840n505o546o302m569l733m515m580k837j225p96OJ809K917K839
57790B68355L370M968N759N200M996N412M618K630J883K823L047J874J578K992
57776C19505M073M048M773O633P351O241N465N748M990K671J204J356O03k068
$$ plain form
57882 340328 339892 341526 343201 343197 342806 343355 343455 341763 339591 338204 336304 332738 329061 326971 325763 324574
57866 324574 324400 325689 326696 326489 326811 328766 330636 331244 332503 336190 341091 345765 351183 358114 364791
57851 364791 369785 374424 379823 384265 386086 386446 386701 385831 383015 379971 378070 375850 372013 368115 365495
57836 365495 362337 356682 349798 343734 338062 331904 326591 323306 320483 316495 312583 310354 308793 306665
57822 306665 305330 306097 307203 306649 305735 306590 308334 309009 309211 310434 311729 311454 310615 311046 311728 310181 306232
57805 306232 301392 295887 289341 283039 278470 274737 270222 265642 262805 261580 260784 260790 262599 265516 268355
57790 268355 271725 276693 282452 287652 292648 298060 302678 305308 307191 310014 313061 314935 316513 319505
57776 319505 323578 327626 332399 339032 346383 352624 358089 363837 368827 371498 372702 374058 374661 372593
57762C72593m020l699l347m816o527o861o914p615p603o177n045n149m860l310
57748B96650k263k773l254k634k257k829k753j327l51p07n57J230K989L366L448
57733B85978M050M103L329L295M158L722J475P6R89K099J667J146J855K249R08
57718C21099q79j774k595l802l828k187j200k366l956m342m670n930o508n189
57704B71873l724l894m623m402l866l774l107j531r34k159k938j565J50J21o26
57689B35001m52l04j487k615j843j59L76r3j91J76O43J970M591P250R038J0986
57673B62887J3960J7053J9883K4170L1097L9329M7352N5296O2569O6319O4372
57662G04287N6976M3997K3797k228k7290m4798n4065n7815n7071n2027m5286l9885
$$ plain form
57762 372593 368573 364874 361527 356711 350184 343323 336409 328794 321191 315014 309969 304820 299960 296650
57748 296650 294387 291614 288360 285726 283469 280640 277887 276560 276209 275502 274945 276175 279164 282530 285978
57733 285978 290028 294131 297460 300755 304913 308635 310110 310186 311175 313274 314941 316087 317942 320191 321099
57718 321099 320220 318446 315851 312049 308221 306034 304834 302468 298512 294170 289500 283570 277062 271873
57704 271873 268149 264255 259632 255230 251364 247590 244483 242952 242018 239859 236921 235356 235506 235627 235001
57689 235001 234549 234245 232758 230143 228300 228141 228517 228424 228233 228409 229052 231022 235613 242863 251901 262887
57673 262887 276847 293900 313783 337953 369050 408379 455731 511027 573596 639915 704287
57662 704287 761263 805260 829057 826829 799539 754741 700676 642861 585790 533763 488477 448592
57650D48592l5524l0318k4850k1032j8365j4833j0677p888o721n726m629m339
57638B63690m584m129k981k172j782j197o72p92j097q79m80l50k4N66K67j260
57622B42124k330j868j368k327l544l260k194k000k327j885j089j119j498j001
57608B14314J16Q73J428K103J971N02p18k37P19K14j196j662j202j228j951k568
57592B11478l100l841m005k975j875j873k112j307j57n5o82j016j369k269k678
57577A82164j688o18j040k037j889j112j293k122k274k040k429k666j424L60P02
57562A60594j27j82Q44J509J300R94P66J65m42m48l80p98p83M80J689J301K30
57545A66712L12J143J064K72J76N43Mj178j530j033q08p84j22O57M73r2R8L37
$$ plain form
57650 448592 413068 382750 357900 336868 318503 303670 292993 285105 278384 272658 268029 263690
57638 263690 259106 254977 251996 249824 248042 246845 246173 245381 244284 243405 242925 242575 242551 243117 243384 242124
57622 242124 239794 237926 236558 234231 230687 227427 225233 223233 220906 219021 217932 216813 215315 214314
57608 214314 214430 215303 216731 218834 220805 221307 220589 220352 221071 221285 220089 218427 217225 215997 214046 211478
57592 211478 208378 204537 200532 197557 195682 193809 191697 190390 190233 190178 189496 188480 187111 184842 182164
57577 182164 180476 179858 178818 176781 174892 173780 172487 170365 168091 166051 163622 160956 159532 159892 160594
57562 160594 160467 160285 161129 162638 163938 164932 165698 165863 165421 164973 164593 163795 163012 163492 165181 166482 166712
57545 166712 167024 168167 169231 169503 169679 170222 170226 169048 167518 166485 165677 164893 164771 165428 165901 165809 165907 166244
57527A66244n76j524o57J069J140j79k79J273K111J271O32J516K861L584M128
57512A82614M702M414L103K026J873J889J514J251J416J590J649J883J978J347
57498B13249M23J09J64k54r03r55p56j198j838j655j215j977l790n158n688o127
57482A82431o350n577m315l829l939l557l060l685m875m836l569k797k852k260
57468A26930o63N09O06O32J119J405J306J367J253J82q97o3K337L765L222K416
57452A45426K640K985K517J860J622J252M60j1J50K53J17M72J274J382M37n14
57436A62322p57p38q17p79p28r36q25J54R09jj677j871o08j70j253j915r65L10
57418A49655O39N58O73M55j62j05Q85J644J758K243L219L124J423o6J29J059J245
$$ plain form
57527 166244 165668 164144 163487 164556 165696 165517 165238 166511 168622 169893 170525 172041 174902 178486 182614
57512 182614 187316 191730 194833 196859 198732 200621 202135 203386 204802 206392 208041 209924 211902 213249
57498 213249 213672 213781 213945 213691 212788 211833 211077 209879 208041 206386 205171 203194 199404 194246 188558 182431
57482 182431 176081 170504 166189 162360 158421 154864 151804 148119 143244 138408 134839 132042 129190 126930
57468 126930 126267 126776 127382 128014 129133 130538 131844 133211 134464 134646 133749 133686 136023 139788 143010 145426
57452 145426 148066 151051 153568 155428 157050 158302 158762 158751 158901 159154 159271 159743 161017 162399 162836 162322
57436 162322 161565 160827 160010 159231 158503 157567 156742 156896 157805 157804 156127 154256 153648 153478 152225 150310 149345 149655
57418 149655 150294 150852 151525 151980 151818 151713 152598 154242 156000 158243 161462 164586 166009 165943 166072 167131 168376
57401A68376Q25N10J03n44o43R0N02k50j267j331n90J53O50Q23L33n89r59m06
57383A65786L56Q78J450J939J617O68K87P31Q98M20L90J287J980J707J334J671
57367A83399K103J938J708K064K626K827K788K584J869Q74N28R81J327J247J482
57352B10345K201K446J799J000M32m06j381j407l71L60N0m36m32m39o54l40M79
57335B13246N72m14j204j096r62j215p85P86K184K511K662L334L495K338R79O69
57319B27100Q79N45j94q80j841l087l557k797j949j853j627m70O84P07J6n56j137
57302B09983j706j214O71K431K848K823L603M661N047N325O404P638P957P760
57288B64231P966Q206P670O713O021N151L514J824Q86q1k283n269p604q846r467
$$ plain form
57401 168376 169201 169711 169814 169270 168627 168717 169219 168969 167702 166371 165781 165934 166584 167407 167740 167151 166192 165786
57383 165786 166142 167020 168470 170409 172026 172694 172981 173712 174610 175030 175420 176707 178687 180394 181728 183399
57367 183399 185502 187440 189148 191212 193838 196665 199453 202037 203906 204780 205308 206289 207616 208863 210345
57352 210345 212546 214992 216791 217791 218223 217817 216436 215029 214658 215018 215068 214632 214200 213761 213107 212767 213246
57335 213246 213818 213404 212200 211104 210142 208927 208142 208928 211112 213623 216285 219619 223114 225452 226431 227100
57319 227100 227979 228524 228330 227450 225609 222522 218965 216168 214219 212366 210739 210269 210953 211660 211676 211120 209983
57302 209983 208277 207063 207734 210165 213013 215836 219439 224100 229147 234472 240876 248514 256471 264231
57288 264231 272197 280403 288073 294786 300807 305958 309472 311296 312182 312101 309818 304549 296945 288099 278632
57273B78632r585r155q693q469p886o803o298o863p066n587l376k088j461j76
57259A95126J641K741K977L316M108M890N549O178O274N478M603M523M649L881
57245B55934K504J764J990K445K645K600K215J542J092J018O84j19m50L43J447
57230B77654J995K430L267L672K846J755J832K775L190K703K109J992K499L727
57216C14446N136N501M559L678L819M101L660L412M320N403N356M880N320O159
57202C79750O061N362N330N783N705N465O151P268P382O642O515P329Q150Q723
57188D71616R561J0442J0753J1006J2078J3365J3587J2962J2595J2238J0820Q792
57176F09815P720P840Q168Q735J0444J2897J4634J5515J6665J8084J8647J8432
$$ plain form
57273 278632 269047 259892 251199 242730 234844 228041 221743 214880 207814 202227 198851 196763 195302 195126
57259 195126 196767 199508 202485 205801 209909 214799 220348 226526 232800 238278 242881 247404 252053 255934
57245 255934 258438 260202 262192 264637 267282 269882 272097 273639 274731 275749 276433 276314 275864 276207 277654
57230 277654 279649 282079 285346 289018 291864 293619 295451 298226 301416 304119 306228 308220 310719 314446
57216 314446 319582 325083 329642 333320 337139 341240 344900 348312 352632 358035 363391 368271 373591 379750
57202 379750 385811 391173 396503 402286 407991 413456 419607 426875 434257 440899 447414 454743 462893 471616
57188 471616 481177 491619 502372 513378 525456 538821 552408 565370 577965 590203 601023 609815
57176 609815 617535 625375 633543 642278 652722 665619 680253 695768 712433 730517 749164 767596
57164G67596J8736J9643J9866J9277J9231J9993K0171J9245J8510J8833J9506
57153I80607J9999K0892K2427K3926K5255K7057K8975K9657K9129K9232L0801
57142A267957L2345L2483L1915L1845L2139L2249L2543L3401L4092L3837L3126
57131A627932L3055L3923L5228L6412L7187L7785L9012M1294M3745M5340M6855
57120B057768N0091N5135O0104O3973O7907P3348Q0385Q8760R8868J10988J24927
57109B932254J41095J60542J83423K09014K37970K72856L15824L67730M30704
57100E251412N09706O10206P35955Q90424J078421J304182J569185J873724K219080
57091A6042295K605464L028167L477091L937862M390049M805522N152872N403976
$$ plain form
57164 767596 786332 805975 825841 845118 864349 884342 904513 923758 942268 961101 980607
57153 980607 1000606 1021498 1043925 1067851 1093106 1120163 1149138 1178795 1207924 1237156 1267957
57142 1267957 1300302 1332785 1364700 1396545 1428684 1460933 1493476 1526877 1560969 1594806 1627932
57131 1627932 1660987 1694910 1730138 1766550 1803737 1841522 1880534 1921828 1965573 2010913 2057768
57120 2057768 2107859 2162994 2223098 2287071 2354978 2428326 2508711 2597471 2696339 2807327 2932254
57109 2932254 3073349 3233891 3417314 3626328 3864298 4137154 4452978 4820708 5251412
57100 5251412 5761118 6371324 7107279 7997703 9076124 10380306 11949491 13823215 16042295
57091 16042295 18647759 21675926 25153017 29090879 33480928 38286450 43439322 48843298
57083D8843298N533106N511279N310277M918195M347032L618563K745905J739037
57075H2566692O31541n06303j589256k552198l363472m012047m492804m805685
57067F1876468m959908m972101m861835m651545m367483m036072l679217l314334
57059B7033973k956471k617213k302662k015360j757695j531353j334766j164157
57051A1354296j016835q91287p84726o93293o14657n47995m91532m42352l98708
57042E472911l60366l26586k95780k67232k41168k17093j94057j72462j53550
57033C244617j36990j21063j05264r0573p7021o3089m7788l1351j3950L939J9947
57022B581414L1224L7507L9806L5534J8792j2265n0602q4907j07746j18238j19276
$$ plain form
57083 48843298 54376404 59887683 65197960 70116155 74463187 78081750 80827655 82566692
57075 82566692 83198233 82691930 81102674 78550476 75187004 71174957 66682153 61876468
57067 61876468 56916560 51944459 47082624 42431079 38063596 34027524 30348307 27033973
57059 27033973 24077502 21460289 19157627 17142267 15384572 13853219 12518453 11354296
57051 11354296 10337461 9446174 8661448 7968155 7353498 6805503 6313971 5871619 5472911
57042 5472911 5112545 4785959 4490179 4222947 3981779 3764686 3570629 3398167 3244617
57033 3244617 3107627 2986564 2881300 2790727 2713706 2650617 2602829 2571478 2557528 2561467 2581414
57022 2581414 2612638 2650145 2689951 2725485 2744277 2732012 2681410 2596503 2488757 2370519 2251243
57011B251243j14590j07281r8850q9460p9635p0780o3486n6763m9894m3696l9061
57000A437747l5498l2203k9324k7145k5141k2892k0920j9613j8280j6204j3697
56989A176830j1291q776n835k811j10K382M764O757Q085Q200N614q92r960j8097
56975A154860k3076k5537k6765k6746k5237k3065k1037j8827j5994j3023j0386
56964I25167p737m800j896J104N018R780J4067J7334K0490K3411K3463J8114Q044
56951A051559l648j4322k2702k8068l0251k9967k8113k5167k1741j8770j6388
56940H12422j3598r908o208l255l88L379Q037J3270J9291K5977L1973L5513L5304
56927I51809L0176J9398M343j1297k4090l2828l7600l8500l6299l2954k9954k7119
$$ plain form
57011 2251243 2136653 2029372 1930522 1841062 1761427 1690647 1627161 1570398 1520504 1476808 1437747
57000 1437747 1402249 1370046 1340722 1313577 1288436 1265544 1244624 1225011 1206731 1190527 1176830
56989 1176830 1165539 1156763 1150928 1148117 1148007 1150389 1155153 1161910 1169995 1178195 1183809 1182917 1172957 1154860
56975 1154860 1131784 1106247 1079482 1052736 1027499 1004434 983397 964570 948576 935553 925167
56964 925167 917430 912630 910734 911838 916856 926636 940703 958037 978527 1001938 1025401 1043515 1051559
56951 1051559 1047911 1033589 1010887 982819 952568 922601 894488 869321 847580 828810 812422
56940 812422 798824 788916 782708 779453 779065 782444 790481 803751 823042 849019 880992 916505 951809
56927 951809 981985 1001383 1005726 994429 970339 937511 899911 861411 825112 792158 762204 735085
56915G35085k3945k1005j8957j7361j5604j4031j3049j2202j1101j0210r813r361
56903E58446q655q386q613q178o628n168m545l637j463J060K928N021Q577J3042
56889E33801J7221K1288K5814K9990L2569L3560L3101K9834K2504J2498K839m741
56877G90278j0192j3470j4437j3917j2985j1544r105o361m338k518N30N070J0283
56864G07294J6023K3007L1423M0702N0269N9235O5567O6632O0443M6143K4590
56853A191328l41k2432l6961m3611m4832m2606l7992l2321k6613k0540j3538o228
56841H63313P78Q427J7815K8253L8635M9723O2939P7574R1086J01197J05305R8795
56829A543840P7361M1982jl9256o8970q6267r2044r0051q4324p6596o6846n5759
$$ plain form
56915 735085 711140 690135 671178 653817 638213 624182 611133 598931 587830 577620 567807 558446
56903 558446 549791 541405 532792 524614 517986 512818 508273 504636 503173 504233 507161 512182 520759 533801
56889 533801 551022 572310 598124 628114 660683 694243 727344 757178 779682 792180 795019 790278
56877 790278 780086 766616 752179 738262 725277 713733 704628 698267 693929 691411 691941 697011 707294
56864 707294 723317 746324 777747 818449 868718 927953 993520 1060152 1120595 1166738 1191328
56853 1191328 1190987 1168555 1131594 1087983 1043151 1000545 962553 930232 903619 883079 869541 863313
56841 863313 864091 872518 890333 918586 957221 1006944 1069883 1147457 1238543 1339740 1445045 1543840
56829 1543840 1621201 1663183 1663182 1623926 1554956 1468689 1376645 1286594 1202270 1125674 1058828 1003069
56817A003069m5043l5491k6355j6798o662M095J5434K6835L7994M9488O1407P1553
56805A139526P6103P1865N7200L2313N81l1127n5824p0550p6437p5759p0580o3318
56793I33993n6046m9080m1773l4429k7880k1727j4904p620q64N682J3225K1558
56781G20135K9032L4593L7853L7336L0867J8247J948j4905k9825m0629m5964m6607
56769G32081m4736m1720l7717l3155k8931k5233k1645j8300j5609j3233j0793
56758D41009r044q724q862q052o793o518o924o458n108m392m709m979m784m662
56744C51000m378l174j708j469k215k248j249n50n51k99J59m06j828k224r36M86
56728C28410Q17N83L64j68q75q27q7O2p17j285j092q67q46k75P62J008Q4r19j326
$$ plain form
56817 1003069 958026 922535 896180 879382 872720 876815 892249 919084 957078 1006566 1067973 1139526
56805 1139526 1215629 1287494 1344694 1377007 1377588 1346461 1290637 1220087 1143650 1067891 997311 933993
56793 933993 877947 828867 787094 752665 724785 703058 688154 680534 679670 685352 698577 720135
56781 720135 749167 783760 821613 858949 889816 908063 910011 895106 865281 824652 778688 732081
56769 732081 687345 645625 607908 574753 545822 520589 498944 480644 465035 451802 441009
56758 441009 431965 423241 414379 406327 399534 393016 386092 379634 374526 370134 365425 360446 355662 351000
56744 351000 346622 343448 341740 340271 338056 335808 334559 334009 333458 333159 333318 332912 331084 328860 327924 328410
56728 328410 329227 329810 330174 330006 329131 328304 328217 328279 327562 326277 325185 324318 323472 323197 323959 324967 325051 324132 322806
56709C22806j535j540q14R6Mo55k37J112J370lj093o87J13K52K67N07J52r05j385
56690C17825q84p04j438j878j277n72m10j42K71l59k051l029k677k703m047n070
56674B90855m402l290l263l585k920j621n61N96K112K899K321J817K834M588N454
56659B93834N299M828M052L007K613L210L514K578J502J562K035J546M59Q0M29
56644C30548N06J46L3L69O97O63K10m76p34l2R73J149P98J288K514K702J319P0
56626C42743J73P07P22Q17J336J107n18k191k645k501k644k546j709j003j096
56611C30752j195q13j060k613m117m161l302k635k061j407j460k339k570j450
56597B99569n01r45j634j246n98q58j262p27Pl6o0P80J335M25p05k71J094J655
$$ plain form
56709 322806 321271 319731 318917 319013 319017 318362 318125 319237 320607 320604 319511 318824 318937 319189 319456 319963 320115 319210 317825
56690 317825 316941 316237 314799 312921 311644 311072 310662 310520 310791 310432 308381 305352 302675 299972 295925 290855
56674 290855 286453 283163 279900 276315 273395 271774 271213 271809 273921 276820 279141 280958 283792 288380 293834
56659 293834 299133 303961 308013 311020 313633 316843 320357 322935 324437 325999 328034 329580 330039 330119 330548
56644 330548 331054 331200 331233 331602 332299 332962 333172 332696 331962 331930 332903 334052 334850 336138 338652 341354 342673 342743
56626 342743 342916 343623 344345 345162 346498 347605 347087 344896 342251 339750 337106 334560 332851 331848 330752
56611 330752 329557 328744 327684 325071 320954 316793 313491 310856 308795 307388 305928 303589 301019 299569
56597 299569 299068 298123 296489 295243 294645 293787 292525 291798 291805 291769 291709 292489 293824 294249 293544 293273 294367 296022
56579B96022J519J887K456K074J070O80Q92Q64O50O62L61o26j169l00R25J053
56563C09020N96Q40J576K076K978M962O723O669N544N114N206M416K897K019J979
56548C62615J926J859K248K462J693O75N28O76p9j230j411p86m63m02N6L35n13
56531C70189j826k265k067k318k820k711k425k909l573l172k050j464j437j173
56517C37979r30j405k054j971j660k026k441j888j029j138j886k266k551l294
56503C11440l485k107l40J17j71J89M45r97l266l957k798j543q24J53J222J340
56487B95418P90P93J157O92l60o72j94O0R5O52J366J395J170J444J488M21p63
56470C04952q05n84j311j767l03J716J752L68J82J399J889J190Q87J288J090K31
$$ plain form
56579 296022 297541 299428 301884 303958 305028 305708 306600 307464 308114 308776 309137 308511 307342 307042 307967 309020
56563 309020 309616 310456 312032 314108 317086 322048 328771 335440 340984 346098 351304 355720 358617 360636 362615
56548 362615 364541 366400 368648 371110 372803 373478 374006 374682 374603 373373 371962 371176 370713 370311 370367 370702 370189
56531 370189 368363 366098 364031 361713 358893 356182 353757 350848 347275 344103 342053 340589 339152 337979
56517 337979 337049 335644 333590 331619 329959 327933 325492 323604 322575 321437 319551 317285 314734 311440
56503 311440 307955 305848 305508 305625 305454 305643 306088 305091 301825 297868 295070 293527 292703 292856 294078 295418
56487 295418 296208 297001 298158 298850 298490 297818 297624 297684 297779 298431 299797 301192 302362 303806 305294 305715 304952
56470 304952 304147 303563 302252 300485 300182 301898 303650 304018 304200 305599 307488 308678 309565 310853 311943 312174
56454C12174j08p7p20j369o43N24J54j034p40N87L43j493k194r69R9M0J40P32
56436C05446N87PQ18K635K875J157O5P31J298O82K32O04M94l13m9J602K416J341
56418C22628J33R9J58m51n85K97Q08K22k92j55m99j662k216j663j425k050k130
56401C11217j109m76r54j087J08J524K160K599L284L594L508L925M618M267K995
56386C40173K315K186R90j139k081j471j396k511k849j473q5J84M20J082Q65l02
56370C34908l56J278K288J313J59N04J312J278J077J431J491P97M50R16J050N39
56354C50435P25J831K053O29q81j523k260l335l328k100j547k153j981l96N35
56339C36704j24l22J206K681K737K843M186N223M571L518L435L350K259J233J267
$$ plain form
56454 312174 312066 311989 311269 309900 309257 309781 309935 308901 308161 308748 309091 307598 305404 304435 304534 304574 304714 305446
56436 305446 306033 306040 306858 309493 312368 313525 313590 314321 315619 316301 316533 317137 317631 317318 317269 318871 321287 322628
56418 322628 322761 322860 323018 322567 321982 322279 323087 323309 323017 322862 322363 320701 318485 316822 315397 313347 311217
56401 311217 310108 309632 308678 307591 307699 309223 311383 313982 317266 320860 324368 328293 332911 337178 340173
56386 340173 342488 344674 345664 344525 342444 340973 339577 337066 334217 332744 332659 332843 333263 334345 335210 334908
56370 334908 334552 335830 338118 339431 339590 340094 341406 342684 343761 345192 346683 347480 347930 348846 349896 350435
56354 350435 351160 352991 355044 355673 354792 353269 351009 347674 344346 342246 340699 338546 336565 336169 336704
56339 336704 336580 336258 337464 340145 342882 345725 349911 355134 359705 363223 366658 370008 372267 373500 374767
56324C74767J393P91L99Q16J124J183K280M145M347K229L18J67J31j021j641n10
56308C90918P16N89L58J204J945J586J275J745J819J292K049M400N682M609L508
56293D23695M064M548L679L432N194O691N863M506M910N970N785N187N597O141
56279D95262N813N879P255Q249P529O662P135P740P450P781R648J1085J0768J0651
56265F08907J2300J3961J4131J4627J7031J9504K0360K1390K4336K7442K9034
56254H23023L1195L6179M2343M7247N1830N7945O4711P0862P7686Q6223R4498
56243A483742J00933J07161J14115J18817J18834J16288J13553J08640R9132Q6984
56233B568199P4801O0832M2662K2693M868j1325k8527m5711n9782p0812q0831
$$ plain form
56324 374767 376160 376951 377350 378166 379290 380473 382753 386898 391245 393474 393792 393959 394090 393069 391428 390918
56308 390918 391634 392223 392581 393785 395730 397316 398591 400336 402155 403447 405496 409896 415578 420187 423695
56293 423695 427759 432307 435986 439418 444612 451303 457166 461672 466582 472552 478337 483524 489121 495262
56279 495262 501075 506954 514209 522458 529987 536649 543784 551524 558974 566755 576403 587488 598256 608907
56265 608907 621207 635168 649299 663926 680957 700461 720821 742211 766547 793989 823023
56254 823023 854218 890397 932740 979987 1031817 1089762 1154473 1225335 1303021 1389244 1483742
56243 1483742 1584675 1691836 1805951 1924768 2043602 2159890 2273443 2382083 2481215 2568199
56233 2568199 2643000 2703832 2746494 2769187 2774055 2762730 2734203 2688492 2628710 2557898 2477067
56222B477067q9411r4906r8148j00631j01156r8356r4262r1290q8110q2648p6442
56211A461707p1861o7786o2376n7261n4456n2014m7402m2262l9102l6291l1355
56200H99541k6197k3816k2637j9562j5833j4400j4109j2126r615r358j0090q923
56188G12875p033p200q055o602m311m602o343n904l822l393m321l720j912j414
56174F44243j677n04R16nj848j378O41J303J277L081N668O476O730Q878J1068
56159F84869J0202Q142Q600J0275R663Q199R618J2442J2382J0338J0647J3019
56147H08396J3641J2848J4261J7547J9475K1066K6331L4811M2603M9871O0102
56136A120952P2819Q4118R3482J02945J10677J12640J09456J04494R6826Q3889
$$ plain form
56222 2477067 2387656 2292750 2194602 2093971 1992815 1894459 1800197 1708907 1620797 1538149 1461707
56211 1461707 1389846 1322060 1259684 1202423 1147967 1095953 1048551 1006289 967187 930896 899541
56200 899541 873344 849528 826891 807329 791496 777096 762987 750861 741246 731888 721798 712875
56188 712875 705842 698642 690587 683985 679674 675072 668729 662825 659003 655610 651289 647569 645657 644243
56174 644243 642566 642062 642978 642973 641125 639747 640388 641691 642968 646049 651717 658193 664923 673801 684869
56159 684869 695071 703213 711813 722088 731751 739950 749568 762010 774392 784730 795377 808396
56147 808396 822037 834885 849146 866693 886168 907234 933565 968376 1010979 1060850 1120952
56136 1120952 1193771 1277889 1371371 1474316 1584993 1697633 1807089 1911583 2008409 2092298
56126B092298O9402O0167N5976N0908M3547L7363L1827K2455R617j347r022j6686
56114B446505k4362k8763l1338l7886m9520o1928p3534q6161r7698j02708j00871
56103A751736r6731r1132q1191o8497n8483n1446m2931l3093k6810k4294k0708
56092A156420j5350j2233j1323q372l700j828k174L23N163O644M591M673P596
56079A130430Q174N803N568Q067Q469O539P184J0231J0353P976R252J4131J5839
56066A248016J3397J3247J6886J8508J6791J7265K0896K1884J9051J7850J9159
56055A442950J7641J3205J2142J4918J5017J1809J2004J6445J8295J6475J7564
56044A608465K2190K3173J9725J9490K3766K5000K1896K2277K7724L0329K8277
$$ plain form
56126 2092298 2161700 2221867 2277843 2328751 2372298 2409661 2441488 2463943 2473560 2472213 2463191 2446505
56114 2446505 2422143 2393380 2362042 2324156 2274636 2212708 2139174 2053013 1955315 1852607 1751736
56103 1751736 1655005 1563873 1482682 1414185 1355702 1304256 1261325 1228232 1201422 1177128 1156420
56092 1156420 1141070 1128837 1117514 1109142 1105442 1103614 1101440 1101763 1106926 1113570 1118161 1122834 1130430
56079 1130430 1138604 1144407 1149975 1158042 1166511 1173050 1180234 1190465 1200818 1208794 1218046 1232177 1248016
56066 1248016 1261413 1274660 1291546 1310054 1326845 1344110 1365006 1386890 1405941 1423791 1442950
56055 1442950 1460591 1473796 1485938 1500856 1515873 1527682 1539686 1556131 1574426 1590901 1608465
56044 1608465 1630655 1653828 1673553 1693043 1716809 1741809 1763705 1785982 1813706 1844035 1872312
56033A872312K9346L5160L7539L4546L4368L8977M0193L6498L7021M3844M7367
56022B287171M4643M4984N1653N5601N3596N4658O1926O6298O4769O6679P4692
56011B926670P8512P4845P4309Q0923Q4579Q1830Q3638R4004J01820J02801J07951
56000C891882J21029J29923J30266J34645J48098J58139J59901J66617J83410
55991E223910J96191J99003K06264K24795K40708K47841K61052K86724L09378
55982G395866L22955L44781L81987M16234M39397M70801N20293N69702O11216
55973A1473232O66632P46338Q28664R03851R96951J121633J256195J393493J566763
55964B0953752J795459K057991K352696K729223L220384L803790M474132N287427
$$ plain form
56033 1872312 1901658 1936818 1974357 2008903 2043271 2082248 2122441 2158939 2195960 2239804 2287171
56022 2287171 2331814 2376798 2428451 2484052 2537648 2592306 2654232 2720530 2785299 2851978 2926670
56011 2926670 3005182 3080027 3154336 3235259 3319838 3401668 3485306 3579310 3681130 3783931 3891882
56000 3891882 4012911 4142834 4273100 4407745 4555843 4713982 4873883 5040500 5223910
55991 5223910 5420101 5619104 5825368 6050163 6290871 6538712 6799764 7086488 7395866
55982 7395866 7718821 8063602 8445589 8861823 9301220 9772021 10292314 10862016 11473232
55973 11473232 12139864 12886202 13714866 14618717 15615668 16737301 17993496 19386989 20953752
55964 20953752 22749211 24807202 27159898 29889121 33109505 36913295 41387427 46674854
55956D6674854O289310P481607Q919452J0752467J3100126J5989018J9491635
55949A28698469K3775177K8839723L4269652L9302475M2873001M3336434L8562481
55942C79657412K7231790J0554934p599557k2815956l2608057l7058401l7620907
55935B79741258l5787759l2660439k9030636k5388908k1930201j8729839j5885769
55928A00327707j3458313j1398755r632137q142943o922809n909616n040904m309717
55920C5512513l716845l221324k784248k412686k117207j869468j640635j441048
55912A6309052j285095j153799j026275r13545q28943p56753o80312o11236n62344
55903H490750n19871m69407m22597l92324l66805l32946l01148k83078k67951
$$ plain form
55956 46674854 52964164 60445771 69365223 80117690 93217816 109206834 128698469
55949 128698469 152473646 181313369 215583021 254885496 297758497 341094931 379657412
55942 379657412 406889202 417444136 409844579 387028623 354420566 317362165 279741258
55935 279741258 243953499 211293060 182262424 156873516 134943315 116213476 100327707
55928 100327707 86869394 75470639 65838502 57695559 50772750 44863134 39822230 35512513
55920 35512513 31795668 28574344 25790096 23377410 21260203 19390735 17750100 16309052
55912 16309052 15023957 13870158 12843883 11930338 11101395 10344642 9664330 9053094 8490750
55903 8490750 7970879 7501472 7078875 6686551 6319746 5986800 5685652 5402574 5134623
55894E134623k43818k20380k08463j97984j78078j58728j51222j46368j32776
55885C496806j18367j13354j09599r6886q3075p8490p5986o5670n4521n2766n4819
55874B593273n1718m8992n4592o1914o1978o0316o5250p1164o9585o5594o7394
55863A914776p0375o6833o1113o0326o0061n3787m6610m5585m5921m0556l4005
55852A329604l3210l3920k9595k4800k6415l0199k9134k6652k8725l1097k7398
55841A008459k2054k2299k4811k2737j8777j9035k0776j8332j4557j4809j6066
55830G94206j3271r922j1203j3296j0547o677p710j0391q842o260q544j2473j1744
55817F63326r011j0403j3524j2318q866r072j1262r949o575n852n867k227K238
$$ plain form
55894 5134623 4890805 4670425 4461962 4263978 4085900 3927172 3775950 3629582 3496806
55885 3496806 3378439 3265085 3155486 3058600 2975525 2897035 2821049 2755379 2700858 2648092 2593273
55874 2593273 2541555 2492563 2437971 2376057 2314079 2253763 2188513 2117349 2047764 1982170 1914776
55863 1914776 1844401 1777568 1716455 1656129 1596068 1542281 1495671 1450086 1404165 1363609 1329604
55852 1329604 1296394 1262474 1232879 1208079 1181664 1151465 1122331 1095679 1066954 1035857 1008459
55841 1008459 986405 964106 939295 916558 897781 878746 857970 839638 825081 810272 794206
55830 794206 780935 771013 759810 746514 735967 729290 721580 711189 702347 696087 687543 675070 663326
55817 663326 654315 643912 630388 618070 609204 600132 588870 578921 572346 566494 560627 558400 560638
55804E60638K254L72K302O212O826N947Q536J2266J1379P391N732N181Q52n417
55790F30471p868p286q828j1881j1833r507r434j0821r476o720p427j1038j3082
55777E05270j3628j5796j7998j6178j1864r751r220o358k267j082j776k24K486
55764D01614K041o33j011O08L81j088j09K315K148L56J201L776L169q22l889n221
55748D04836p764j1300j2727j2546j3857j5711j4509j1267j0345j1619j0949p826
55736B64416n716n349m366l036l694n053l620j43J563J431K419M042L263Q82M92
55721B47531J750J274o40p89K77q38l460l611j323l79j117l12J980K232K57l90
55705B42442R22J170j36l30N11o91l903n518m662m218n124n146l772k964k766
$$ plain form
55804 560638 562892 563264 565566 571778 578604 584551 593087 605353 616732 624123 629855 635036 635888 630471
55790 630471 622603 615317 606489 594608 582775 573268 563834 553013 543537 536817 529390 518352 505270
55777 505270 491642 475846 457848 441670 429806 420055 410835 404477 402210 401128 399352 399128 401614
55764 401614 403655 403022 402011 402619 403000 401912 401803 404118 406266 406622 407823 411599 414768 413946 410057 404836
55748 404836 397072 385772 373045 360499 346642 330931 316422 305155 294810 283191 272242 264416
55736 264416 258700 253351 248985 245949 242255 237202 233582 233439 235002 236433 238852 242894 246157 247039 247531
55721 247531 249281 250555 249915 249126 249403 248565 245105 241494 240171 239792 238675 238363 240343 242575 242832 242442
55705 242442 243364 244534 244398 244068 244579 243888 239985 234467 229805 225587 220463 215317 211545 208581 205815
55690B05815j383M06J25j294o78J465J761K62K28J918K542K132L322N393M828
55675B26842J927O58J533R82j666k930j743j110k103k216q33n67j867j911j14
55660B14882O75l12n11O66O92o95m78J936L378K698K554L944M257K476J221J730
55644B39113J701r8j672k032l059n424o968o791o735p393o863m789l477l706l604
55629A78203k724k867l896l258q54K40q72j461l69Q0j152j827q81l50j187j496
55613A55329o45q16k724l972l322k516k376j343N79Q51r73j896n35P15K61k60
55597A36357J55j33j512j608L15J547O38k00N65J148L01k00O97J027l84j550j118
55580A36045q21j838k367j243l92j161j751p75Oq38j451Q8K391L202K679J997
$$ plain form
55690 205815 204432 204838 204963 203669 202991 204456 206217 206479 206707 208625 211167 213299 216621 222014 226842
55675 226842 228769 229427 230960 231942 230276 227346 225603 224493 222390 220174 219341 218774 216907 214996 214882
55660 214882 215557 215245 214734 215400 216092 215397 214919 216855 220233 222931 225485 229429 233686 236162 237383 239113
55644 239113 240814 240716 239044 237012 233953 228529 221561 214770 208035 200642 193779 188990 185513 181807 178203
55629 178203 175479 172612 168716 165458 164604 164844 163972 162511 162142 162222 161070 159243 158362 158012 156825 155329
55613 155329 154684 153868 151144 147172 143850 141334 138958 137615 138194 139045 138072 136176 135641 136356 136617 136357
55597 136357 136512 136379 134867 133259 133574 135121 135759 135559 136124 137272 137573 137373 138070 139097 138713 137163 136045
55580 136045 135224 133386 131019 129776 129384 128223 126472 125697 125703 124865 123414 123502 125893 129095 131774 133771
55564A33771J214M14N14J199P01j011j689o67J0m09R5K213L554K842K135K781
55548A47667K974J567N83J331J662j61k188k225j454j813k579k395j894j753p61
55533A38561J571L174K613J545J613J611K47j145j182j092k169l179k880k546
55519A36742l361l846k583j129j400k402k303j628j724k040j619j388k428l703
55505A05188l850l502l649l603k607j655j547j134M93K054K314K194K711K933
55491I6340K048J306J783K294J672R54J205J326K32r29q55l87n83o47J36N39l13
55474A06121r68j13J073J118P33Q91P38l88j041j30P93J18j091j175o17m12P3
55457A05723J207J370l66j918j243L43M89n10r69q45q95n99M17P03o90j988j355
$$ plain form
55564 133771 134985 135399 135913 137112 137813 136802 135113 134446 134456 134047 134142 136355 139909 142751 144886 147667
55548 147667 150641 152208 152791 154122 155784 155623 153435 151210 149756 147943 145364 142969 141075 139322 138561
55533 138561 140132 143306 145919 147464 149077 150688 150935 149790 148608 147516 145347 142168 139288 136742
55519 136742 133381 129535 126952 125823 124423 122021 119718 118090 116366 114326 112707 111319 108891 105188
55505 105188 101338 97836 94187 90584 87977 86322 84775 83641 84134 86188 88502 90696 93407 96340
55491 96340 98388 99694 101477 103771 105443 106397 107602 108928 109160 108231 107376 106989 106406 105759 105895 106434 106121
55474 106121 105153 105040 106113 107231 107964 108855 109593 109205 108164 108034 108827 108945 107854 106679 106062 105650 105723
55457 105723 106930 108300 107934 106016 104773 105116 105605 105095 104126 103281 102386 101787 102204 102907 102217 100229 98874
55440I8874P9L59j9L30P91K41l56K75R84J94r57m43J124J687J151P85N26k71o45
55421A04709N06J849J354l79j172p51m98p56q13p54j013r57j44J74r61k018j135
55404I7241P41J396P94M85O93N51K40M67P01L15K91J560K702J890lp49k29j2m32
55385A08642n79m24o24r08p72r19j926k596j763n05l67o51J15J323J433P75P01
55368A00955R83O82M58J401K514K101P73M11R97R87J82m18p92j564k149j624o95
55351A05202n17m98M32J454J198L75M84R41K13j189j574j025p22l11J184K657
55335A08304K140J65j014r44r43j194p55Kq7m88J97J288Q23j008k045j584r00
55318A01957n67K3O49M29j21K92J226J106J09j32O36J208J317J576J525L84o87
$$ plain form
55440 98874 98953 99312 99293 99623 100414 100655 100299 100574 101558 101752 100795 100352 101476 103163 104314 105099 105625 105354 104709
55421 104709 105215 107064 108418 108039 106867 106116 105618 104862 104049 103295 102282 101325 101181 101355 100394 98376 97241
55404 97241 97982 99378 100172 100657 101350 101901 102141 102608 103309 103624 103915 105475 108177 110067 110064 109315 109086 109074 108642
55385 108642 108063 107639 107015 106107 105335 104416 102490 99894 98131 97626 97259 96608 96723 98046 99479 100254 100955
55368 100955 101938 102620 103078 104479 106993 109094 109867 110278 111275 112262 112444 112026 111234 109670 107521 105897 105202
55351 105202 104685 104187 104619 106073 107271 107646 108130 109071 109284 108095 106521 105496 104774 104463 105647 108304
55335 108304 110444 110609 109595 108651 107708 106514 105759 105761 105674 105186 105383 106671 107494 106486 104441 102857 101957
55318 101957 101390 101413 102062 102491 102370 102662 103888 104994 105103 104971 105607 106815 108132 109708 111233 111617 110930
55301A10930M9J680J732J85o68l09n95k037k723j663l97l30q41q84m41K29R88
55284A04905J171K82o97m59M07K99p05j200r81r18p64K82J288O20r57j055N24
55267A02042J575J141M76K23m38j440j441l61K26j77l11L84R56R78J099J264O92
55250A06888j48N9R73R36n3l20M04O14J8P7J079J487P92L01M13j77j720k509j706
55231A07408o26l18j43L47M17j66n67o81j304k049j509j1L54q00j338j32J162
55214A00044J030K59l1j85n66l91N97J247R50O35Q38O79k58r25o98m08n54l50
55196A01913N30J131R75Q36R74N20n49r02j58L51K9P1J016J382R7j578j900q88
55178A03850L84J269J378M76o57p24J11L64k61m17L97R82P04M45N57J51p70p78
$$ plain form
55301 110930 110979 112659 114391 114576 113908 113599 113004 110967 108244 106581 106184 105854 105013 104129 103688 103917 104905
55284 104905 106076 106358 105661 105202 105609 105908 105203 104003 103022 102104 101340 101622 102910 103530 102573 101518 102042
55267 102042 103617 104758 105234 105457 105019 103579 102138 101777 102003 101826 101515 101899 102855 103833 104932 106196 106888
55250 106888 106740 106799 107772 108708 108655 108335 108739 109353 109371 109448 110527 112014 112806 113107 113520 113343 111623 109114 107408
55231 107408 106782 106464 106321 106668 107085 106919 106352 105671 104367 102318 100809 100798 101152 100352 99014 98882 100044
55214 100044 101074 101333 101302 101117 100551 100160 100757 102004 102954 103589 104427 105106 104848 103923 103225 102817 102263 101913
55196 101913 102443 103574 104549 105385 106359 106879 106330 105428 105270 105621 105650 105721 106737 108119 108216 106638 104738 103850
55178 103850 104234 105503 106881 107357 106700 105976 106087 106451 106190 105773 106170 107152 107856 108301 108858 109009 108239 107461
55160A07461M32J202O92J30K35j69j584k323j202L40N70j8j69o4l30n13j37J28
55142A04681j40l0J018J922J757J330J598J961J441L43n50j134j368q98j85m50
55126A11296j536j656k37R14M69l44OR67J287J105J020O83j29n10QL88n5l07L94
55107A13763R50L34n01l28K75L01K44Q33J194K98r63j040r6O31Q92J170J275Q69
55089A20101O09J163J843J620P93L04K13Q2P9M25N39q8r17j266j340j460j272
55072A21428o67l66o42o38J31P76N66R4m9l74j199j677j255p33p15n00L35Q22
55054A15337M16K11R48J393L76j134j662j465j386q85P59K485K669J497L67k25
55038A19701o18p48m80l40n28k36Q11J366N82m26m28q5l97o49J64J164R81J44
$$ plain form
55160 107461 107893 109095 109787 109917 110152 109983 108399 106076 104874 105214 105784 105766 105597 105533 105203 104690 104553 104681
55142 104681 104541 104511 105529 107451 109208 110538 112136 114097 115538 115881 115331 114197 112829 111931 111746 111296
55126 111296 109760 108104 107867 108781 109250 108906 108912 109879 111166 112271 113291 113974 113845 113335 113343 113731 113676 113369 113763
55107 113763 114713 115047 114546 114218 114493 114794 115038 115871 117065 117363 116400 115360 115264 115895 116787 117957 119232 120101
55089 120101 120710 121873 123716 125336 126129 126433 126646 126728 126807 127232 127771 127683 126766 125500 124160 122700 121428
55072 121428 120761 120395 119753 119115 119246 120022 120588 120682 120633 120259 119060 117383 116128 115395 114680 114180 114515 115337
55054 115337 115753 115964 116912 118305 118681 117547 115885 114420 113034 112149 112908 115393 118062 119559 119926 119701
55038 119701 119083 118335 117855 117515 116987 116751 117562 118928 119510 119084 118656 118571 118174 117525 117689 118853 119834 119978
55020A19978L4M28J95m27m05k3k59p07j67J117J781J556J352J470J359Q52K42
55003A28376m91j214j145o5P61L16m74k88L52J55n63n16L02Q50Q58P40L16n64
54985A27706r02Q6J288J190K98N0J15q53k327k265l07J631K151J732J131L37m81
54968A30580o59j41L15K92P2r4j10K94J027J180K60p48p02m7J39M8N56J336J374
54949A34972Q66Q43J183P42o82k027k535k267j332K8Q71M62m96p89l76KK97Q41
54931A30603J283J265J486K484L211K561J581K160M077N427N513N295N287N149
54917A77382N181O044O994O438M358K319R45o40k718m249m652m634m771m851m829
54902A78317n075n356m967m018l323l035k651k244k247k200j293jM71J82K49O95
$$ plain form
55020 119978 120012 120440 120635 120208 119803 119780 119521 118814 118647 119764 121545 123101 124453 125923 127282 128134 128376
55003 128376 127885 126671 125526 125461 126222 126538 126064 125776 126128 126283 125720 125204 125506 126356 127214 127954 128270 127706
54985 127706 126804 126890 128178 129368 129666 129716 129831 128978 126651 124386 124079 125710 127861 129593 130724 131061 130580
54968 130580 129921 129780 130095 130387 130459 130365 130255 130549 131576 132756 133016 132268 131566 131519 131658 131706 132262 133598 134972
54949 134972 135838 136681 137864 138606 137924 135897 133362 131095 129763 129791 130662 131124 130628 129839 129463 129465 129762 130603
54931 130603 131886 133151 134637 137121 140332 142893 144474 146634 150711 156138 161651 166946 172233 177382
54917 177382 182563 188607 195601 202039 206397 208716 209661 209021 206303 202054 197402 192768 187997 183146 178317
54902 178317 173242 167886 162919 158901 155578 152543 149892 147648 145401 143201 141908 141907 142378 142560 142809 143504
54886A43504M62m27n73N78J972K744L214L766M252M835N895O883O730N683N115
54871A94633N315N002L435J354m72k198l833m776n029n495o480p019o317m847
54857A63273l528k680k204j929j580j108j078j894k904l176k893k802k752k120
54843A30625j330j332j796j492l59M18M40M71P22M96k30n60l15k89o07m40L22
54826A24744P04L53P5K22J53k91k93L74P95M82R6P0j50q21j200q06k67k20m19
54807A23601m56m15m00k65j08r7K33J454K897L139K012Q58N58O24N21N13P81R08
54789A36358O71L79J54j39k32J50L95k41j105q76K93R85R20J285K441L222K974
54772A47634K529K528K469K108K256L376M750N721O483P038O818N910N262N050
$$ plain form
54886 143504 143966 143539 142966 143544 145516 148260 151474 155240 159492 164327 170222 177105 183835 189518 194633
54871 194633 199948 204950 208385 209739 209267 207069 203236 198460 193431 187936 181456 174437 168120 163273
54857 163273 159745 157065 154861 152932 151352 150244 149166 147272 144368 141192 138299 135497 132745 130625
54843 130625 129295 127963 126167 124675 124316 124734 125174 125645 126367 126863 126633 126073 125758 125469 124862 124422 124744
54826 124744 125448 125801 125876 126098 126251 125960 125667 126041 126836 127318 127414 127484 127334 126513 125313 124507 124240 124020 123601
54807 123601 123145 122730 122330 122065 121957 121860 122093 123547 126444 129583 131595 132453 133011 133635 134156 134669 135450 136358
54789 136358 137029 137408 137562 137423 137191 137341 137736 137495 136390 135514 135807 136792 137712 138997 141438 144660 147634
54772 147634 150163 152691 155160 157268 159524 162900 167650 173371 179854 186892 193710 199620 204882 209932
54758B09932M228K304J73j486l185n196o633o888o710o922p129o600n452m160
54744A56276k807j537q55q80j031r75r47q92l12O66J177R47O83P86Q30O31O87
54727A52447J210J782K293L035L799M042M091M784N908O465O453O669O638M829
54713B14445J334j706k984l415m040m522m603n001n846o016n109m313m274l896
54699A60054k449j068q49j144j072j099j618j660o47N2q55k309k440j376o48o38
54683A40234m95j7J11l01p23q70q83p78n77o01q80p67P7R65J131P30K81j85p38
54664A35714j032q37m67k33j21k98r50j462q64N01J111M61k75k46r6m08n93j38
54646A29767M18O66J027J498J195N1o12j27M13J67n5M52Q50L73k28k63m77j357
$$ plain form
54758 209932 214160 216464 216637 215151 211966 206770 200137 193249 186539 179617 172488 165888 160436 156276
54744 156276 153469 151932 151077 150197 149166 148191 147244 146352 146040 146706 147883 148830 149513 150299 151129 151760 152447
54727 152447 153657 155439 157732 160767 164566 168608 172699 177483 183391 189856 196309 202978 209616 214445
54713 214445 215779 214073 211089 207674 203634 199112 194509 189508 183662 177646 172537 168224 163950 160054
54699 160054 157605 156537 155688 154544 153472 152373 150755 149095 148448 148500 147645 145336 142896 141520 140872 140234
54683 140234 139739 139722 139833 139532 138809 137939 137056 136278 135701 135100 134220 133453 133530 134495 135626 136356 136637 136452 135714
54664 135714 134682 133845 133378 133145 133024 132726 131776 130314 129450 129951 131062 131523 131248 131002 130906 130498 129905 129767
54646 129767 130185 130851 131878 133376 134571 134622 134010 133883 134296 134463 134408 134860 135710 136083 135855 135592 135115 133758
54628A33758j677m30J221J678J189P44J13j067j637n29J022J067q7n62J10P02
54612A35615N27M7l37n43k44M62N03n99j461p36N58N25n62q15J76R37O43Q1JK37
54592A35015O16J205J553J009q2o66m06J89P51J110Q22k04r82o19K71M82L5k52
54574A39847l74q52j272p90K20N64R9k17k9R4r4k11j60j50M5P52J539J753J514
54555A42278J187M89o66j184j82J289J535P61N23J090J271P09L65O13O51Q4m67
54538A50346o29p01o15J02J086J272N33j61l42n17q19o55PL62J28n8M3j93r55
54519A48234j448j146n48k42j96l26q16j438j417n00O10J206J306J137O91Q8k22
54502A44973L8O59J229J334O65n47j333r27K26J030J041N37l00j367k051j654
$$ plain form
54628 133758 132081 131651 132872 134550 135739 136483 136596 135529 133892 133363 134385 135452 135365 134803 134913 135615
54612 135615 136142 136189 135852 135309 135065 135527 136030 135431 133970 133234 133792 134317 133755 132940 133116 134053 134696 134777 134778 135015
54592 135015 135631 136836 138389 139398 139316 138650 138244 138433 139184 140294 141116 140912 139930 139311 139582 140064 140099 139847
54574 139847 139473 138621 137349 136559 136779 137343 137442 137225 137196 137290 137196 136985 136825 136675 136720 137472 139011 140764 142278
54555 142278 143465 143954 143288 142104 141922 143211 144746 145507 146030 147120 148391 149100 149465 150078 150729 150813 150346
54538 150346 149717 149016 148401 148503 149589 150861 151394 151233 150891 150374 149555 148900 148907 149269 149397 149339 149382 149189 148234
54519 148234 146786 145640 145092 144850 144654 144328 143512 142074 140657 140157 140767 141973 143279 144416 145107 145195 144973
54502 144973 145011 145670 146899 148233 148898 148351 147018 146091 146317 147347 148388 148925 148625 147258 145207 143553
54486A43553m70M39N22J06l35n77m60l1K60J64J71P86J632K002J914J790J590
54469A53056J108O74O71P75N56L31M69M62k42j050j053m80j42LL64M33n01j712
54451A53722j787p73n6j88l92k17j12k49j75J44J81p3j5M57Q36R77J127J121O22
54432A55150jj87l03j025j852j641m54O24J284K100K856K483Q09r79j911k002
54416A54951j540q35n95j195j653q31N87R67L78M46J593K438K252J931K004J662
54400A62560N88q6M01J175J205P36M25K46O7J89N92O74L20J65M32N65L81L15K36
54381A71186n49j761k126j381p51q05n42O02J522J243N01L48N15L65K71P66J308
54364A70712J157P00P54J223J511J623J873K062J865J588J753K266K606K463J864
$$ plain form
54486 143553 143083 143522 144044 144150 143815 143238 142778 142747 143007 143171 143342 144128 145760 147762 149676 151466 153056
54469 153056 154164 154838 155509 156284 156840 157171 157640 158102 157860 156810 155757 155277 155135 155138 155502 155935 155434 153722
54451 153722 151935 151162 151106 150918 150526 150309 150197 149948 149773 149917 150098 150025 150010 150467 151303 152280 153407 154528 155150
54432 155150 155149 154962 154659 153634 151782 150141 149687 150311 151595 153695 156551 159034 159843 158864 156953 154951
54416 154951 153411 152576 151981 150786 149133 148302 148889 149856 150234 150680 152273 154711 156963 158894 160898 162560
54400 162560 163148 163062 163463 164638 165843 166579 167004 167250 167317 167506 168098 168772 169092 169257 169689 170254 170635 170950 171186
54381 171186 170637 168876 166750 165369 164618 163813 163271 163873 165395 166638 167139 167487 168002 168367 168638 169404 170712
54364 170712 171869 172569 173323 174546 176057 177680 179553 181615 183480 185068 186821 189087 191693 194156 196020
54349A96020J064N76N98M28p70k512l485l505l641m123l787k236r45j169k091
54334A70422k216j453p11l50k06k92m86k94K02J8j099j720o04J281J903Q04o36
54317A64563j240j117q89q09p91o19j28N24R20R06O87L03l65r31o99J99P48M98
54299A61760J06J7k81r95j166o1J421J804Q68m08j217j417j111n36j24l3N3M13
54281A59093R30J448J863J738P55l55m07L81M59o58j481q31L59O18P2k62k47l34
54263A63141k86L34J004Q82K32j4K57L69O9k97m92m12K53J455K263J840O37k77
54245A70958o83j075j380r22L64J575J774P78q79k271k598j822o65K93J058J529
54229A66034J221K24m05J2P04O18J3q2M53P42K72n66j152j146n75L7Ln92o93K74
$$ plain form
54349 196020 197084 197660 198258 198686 197916 195404 191919 188414 184773 180650 176863 174627 173682 172513 170422
54334 170422 168206 166753 166042 165692 165486 165194 164708 164414 164616 164634 163535 161815 161211 162492 164395 165199 164563
54317 164563 163323 162206 161317 160508 159717 159098 158970 159494 160414 161320 162007 162310 161945 161014 160315 160514 161262 161760
54299 161760 161866 161883 161602 160607 159441 159380 160801 162605 163473 163065 161848 160431 159320 158784 158660 158627 158680 159093
54281 159093 160023 161471 163334 165072 165827 165472 165065 165446 165905 165247 163766 162935 163294 163912 163984 163722 163475 163141
54263 163141 162855 163189 164193 165075 165307 165293 165550 165919 165988 165691 165199 164787 165040 166495 168758 170598 171235 170958
54245 170958 170275 169200 167820 166898 167262 168837 170611 171389 170510 168239 165641 163819 163154 163447 164505 166034
54229 166034 167255 167479 167074 167086 167790 168408 168421 168339 168792 169534 169806 169240 168088 166942 166367 166404 166407 165815 165122 165396
54209A65396J406J511P67K44K63K17k31q37j445k070k337j778p04j7o4l60m09
54192A59552k70k07k85l98l73o6M37Q01P93M69m6n99q13l86K84M41J41K76J121
54173A60872J763J448O47J25j85o11q90p30n41p22q07k96L00K31j81n6N13O04
54155A61484o2p70r31o96l78o5J13o4n14p40k57R52K275K746J955O89J12K95L14
54136A66458r2j26M66O74j27r51p14K7Q8m18m87L6M48O11J015J597J677J032J65
54117A71379m63o50j57R60J854J675P49J94M72J082J483J548J224N43r1k92k48
54100A81262l43n15n31n36o13l00N76J084K84j104j350J1J609K139J797J503J546
54083A86519J549J354J279J696K590L651M715N906P159P829P365O189N138M028
$$ plain form
54209 165396 166802 168313 169080 169324 169587 169804 169573 168736 167291 165221 162884 161106 160402 160385 160321 159961 159552
54192 159552 159282 159075 158790 158392 158019 157953 158390 159191 159984 160453 160407 159808 158995 158609 158893 159334 159475 159751 160872
54173 160872 162635 164083 164730 164855 164670 164059 163169 162439 161898 161176 160369 160073 160373 160604 160423 160367 160880 161484
54155 161484 161422 160652 159721 159025 158647 158582 158695 158631 158117 157377 157120 158072 160347 163093 165048 165737 165849 166144 166458
54136 166458 166366 166240 166706 167380 167253 166302 165588 165615 165703 165285 164798 164834 165282 165893 166908 168505 170182 171214 171379
54117 171379 170916 170266 170109 171069 172923 174598 175347 175541 176013 177095 178578 180126 181350 181893 181802 181510 181262
54100 181262 180919 180404 179873 179337 178724 178424 179000 180084 180368 179264 177914 177925 179534 181673 183470 184973 186519
54083 186519 188068 189422 190701 192397 194987 198638 203353 209259 216418 224247 231612 237801 242939 246967
54069B46967J826j481m304n430n495n722o150o088n477m700l663k244j112r51
54055A95976j238r13M8P44P76N87N38O23R27J520K032K097K016K298K793L022
54039B13846L016L164L511L945M631N633O480O790O810O769O327N365M542M211
54025B85040L633K301J215J601L077M369N166N837O007N032L446K308J391l17
54011C30106k564m025m469n023o124o896o868o735o882o707n886n090m824m647
53997B53366m176l824l901l952l566l073k848k622k050j430j231j434j715j976
53983B15568k297k575k442j551j6J307J443M42n24o53m87q36j449j610j461j588
53967B01271j777j359m55K20O51J389K318K623K072J277O91K64kPR2J19N47J696
$$ plain form
54069 246967 248793 247312 243008 237578 232083 226361 220211 214123 208646 203946 200283 198039 196927 195976
54055 195976 194738 193825 193873 194617 195393 195980 196518 197141 198068 199588 201620 203717 205733 208031 210824 213846
54039 213846 216862 220026 223537 227482 232113 237746 244226 251016 257826 264595 270922 276287 280829 285040
54025 285040 288673 290974 292189 293790 296867 301236 306402 312239 318246 323278 326724 329032 330423 330106
54011 330106 327542 323517 319048 314025 307901 301005 294137 287402 280520 273813 267927 262837 258013 253366
53997 253366 249190 245366 241465 237513 233947 230874 228026 225404 223354 221924 220693 219259 217544 215568
53983 215568 213271 210696 208254 206703 206687 207994 209437 209879 209355 208702 208215 207379 205930 204320 202859 201271
53967 201271 199494 198135 197680 197900 198551 199940 202258 204881 206953 208230 208921 209185 209183 209190 209282 209401 209948 211644
53949B11644K882L242L105L373L998M250M164M302M423L868L161L575N130O551
53935B67668P342Q321R810J0955J1288J1570J2432J3354J3565J2985J1726R688
53923D00704P018M104R36k607n739p173o797n827n075m138k578p26J031K671L984
53908C79788M529M405M129L599K310N89n86j118j785k603k661j867j370j715k143
53893C83501k242k792m186n392n416m738m406m689n330o250p230p719p559p166
53879C08386o684n830m835m413m462m022k953k326k641l029k872k832l423l914
53865B54150l614l074k970k882k214j435j354j920k555k930k716j515K36J238
53851B26445R49K51j69q89k298l319k847j480n78l83k69j58l63o35n07k22k46
$$ plain form
53949 211644 214526 217768 220873 224246 228244 232494 236658 240960 245383 249251 252412 255987 261117 267668
53935 267668 275010 283331 293141 304096 315384 326954 339386 352740 366305 379290 391016 400704
53923 400704 407722 411826 412762 410155 404416 397243 390446 384619 379544 375406 372828 372102 373133 375804 379788
53908 379788 384317 388722 392851 396450 398760 399349 398763 397645 395860 393257 390596 388729 387359 385644 383501
53893 383501 381259 378467 374281 368889 363473 358735 354329 349640 344310 338060 330830 323111 315552 308386
53879 308386 301702 295872 291037 286624 282162 278140 275187 272861 270220 267191 264319 261487 258064 254150
53865 254150 250536 247462 244492 241610 239396 237961 236607 234687 232132 229202 226486 224971 225207 226445
53851 226445 227394 227645 227476 226587 224289 220970 218123 216643 216065 215682 215413 215255 214892 214257 213750 213528 213282
53834B13282l53j31N1l98j190j545j319q99l71L36Q49Q06N76P57J257J563J567
53817B14838J521J440J241J074R87P09K15O7O54J625K532L407M172M278L587K899
53801B45246K881L239L600M347N698O690O267M790L477K797K440K309K489K610
53787B98880K324K066K359K600J715j20j523j744j542j988l111m045m116l552
53773B88203l276l952n144n713n179m266l824l799l656l292k988k833k679k379
53759B35223j776q64j58l61j347k066j848j132n89k87j40m13j146j766j893j867
53743B17570j975j848j201n28l99o57q45q01m07N25J572J790J025K91K93N90P54
53726B15749J202K044K348J632R94J492K350K180J125L56J20j58m44k38J65Q2
$$ plain form
53834 213282 212929 212798 212849 212451 211261 209716 208397 207498 207127 207463 208312 209118 209694 210451 211708 213271 214838
53817 214838 216359 217799 219040 220114 221101 221810 222025 222092 222746 224371 226903 230310 234482 238760 242347 245246
53801 245246 248127 251366 254966 259313 265011 271701 277968 282758 286235 289032 291472 293781 296270 298880
53787 298880 301204 303270 305629 308229 309944 309824 308301 306557 305015 303027 299916 295871 291755 288203
53773 288203 284927 280975 275831 270118 264939 260673 256849 253050 249394 246102 243114 240281 237602 235223
53759 235223 233447 232583 232425 232064 230717 228651 226803 225671 225082 224795 224655 224242 223096 221330 219437 217570
53743 217570 215595 213747 212546 212018 211619 210962 210117 209316 208909 209434 211006 212796 213821 214112 214405 214995 215749
53726 215749 216951 218995 221343 222975 223969 225461 227811 229991 231116 231472 231592 231434 230990 230752 230917 230999
53710B30999j78L31J529K422K737L137L818M119L703L024K467J987J701J996K834
53695B66626L708M312M643M527L804K869K313K082J672J022M99J26m62j291j957
53680B94493k146j828j128m25k27m96n93l25l63r96j295n24M88M96k46n57l14
53663B84014l98q85q00K19J340J776J580R96O5q67j218j015r02j103j098n23L19
53646B81500R55J219J113P52M74N01N65L29j4o1J26K78N33J099J607J538J095
53629B93609Q97J072J295J544K014K438K332J773J332J341J777K543L257L198
53615C20422K205J264J454K650L930M858N472N627N273M989N266N681N685N651
53601C80427O112O497N926M728L870L188J824M6q58o37m47j027j891k486k857
$$ plain form
53710 230999 230821 231152 232681 235103 237840 240977 244795 248914 252617 255641 258108 260095 261796 263792 266626
53695 266626 270334 274646 279289 283816 287620 290489 292802 294884 296556 297578 298077 298203 297741 296450 294493
53680 294493 292347 290519 289391 288966 288739 288243 287650 287325 286962 285966 284671 284147 284635 285131 284885 284328 284014
53663 284014 283616 282731 281931 282150 283490 285266 286846 287842 287907 287040 285822 284807 283905 282802 281704 281181 281500
53646 281500 282455 283674 284787 285539 286013 286514 287079 287408 287394 287333 287459 287737 288270 289369 290976 292514 293609
53629 293609 294506 295578 296873 298417 300431 302869 305201 306974 308306 309647 311424 313967 317224 320422
53615 320422 322627 323891 325345 327995 331925 336783 342255 347882 353155 358144 363410 369091 374776 380427
53601 380427 386539 393036 398962 403690 407560 410748 412572 412618 411760 411123 410676 409649 407758 405272 402415
53586D02415k878k162j079o49j054j348r90o13q36j364j690j783j645j128n35
53571C82661n81j353k058k106j718j242o83j44Q8J22M17R14J044P18N02O44P37
53554C77962N35L08J89j5j92N9N99Q11O43P46J349J877J937J824J819J807J874
53537C94132K393L300M000M285M495M692M508M031L966M676N840P185Q655R801
53523D65959J0044R740R851J0410J0506J0139J0643J2581J4569J5164J4899J5270
53511F09775J6504J7535J7822J8083J9215K1176K3011K3673K2924K1585K0752
53500H32055K0643K0606K0223J9806J9628J9387J8727J7866J7326J7372J7874
53489A041513J8391J8362J7682J7014J7045J7549J7786J7630J7489J7283J6579
$$ plain form
53586 402415 399537 397375 396296 395647 394593 393245 392255 391642 390806 389442 387752 385969 384324 383196 382661
53571 382661 382080 380727 378669 376563 374845 373603 372920 372776 372864 372986 373403 374317 375361 376079 376581 377225 377962
53554 377962 378497 378805 378994 378979 378787 378846 379445 380256 380899 381645 382994 384871 386808 388632 390451 392258 394132
53537 394132 396525 399825 403825 408110 412605 417297 421805 425836 429802 434478 440318 447503 456158 465959
53523 465959 476003 485743 495594 506004 516510 526649 537292 549873 564442 579606 594505 609775
53511 609775 626279 643814 661636 679719 698934 720110 743121 766794 789718 811303 832055
53500 832055 852698 873304 893527 913333 932961 952348 971075 988941 1006267 1023639 1041513
53489 1041513 1059904 1078266 1095948 1112962 1130007 1147556 1165342 1182972 1200461 1217744 1234323
53478A234323J5697J5550J6091J6064J4729J2824J1282R922Q094N814L563J500
53466A365453n22k559m630o830r004j0709j1723j2268j2597j2824j3153j3768
53454A254866j4401j4662j4790j5371j6322j6923j6949j6933j7173j7380j7457
53443A076505j7715j8058j7871j7008j5981j4831j2792r612o345m194l252k856
53431I35990k599k393k051j300k9J643L288M298M662N335P064R064R899R595R654
53416I92120J0881J2523J3813J5107J6904J8908K0656K2181K3499K4338K4882
53405A195812K5898K7613K9347L0661L1958L3577L5252L6923L9017M1459M3412
53394A570929M4604M5826M7549M9113M9907N0289N0569N0272M9234M8407M8514
$$ plain form
53478 1234323 1250020 1265570 1281661 1297725 1312454 1325278 1336560 1346482 1354576 1360390 1363953 1365453
53466 1365453 1364931 1362372 1357742 1350912 1341908 1331199 1319476 1307208 1294611 1281787 1268634 1254866
53454 1254866 1240465 1225803 1211013 1195642 1179320 1162397 1145448 1128515 1111342 1093962 1076505
53443 1076505 1058790 1040732 1022861 1005853 989872 975041 962249 952637 946292 942098 938846 935990
53431 935990 933391 930998 928947 927647 927618 929261 932549 936847 941509 946844 953908 962972 972871 982466 992120
53416 992120 1003001 1015524 1029337 1044444 1061348 1080256 1100912 1123093 1146592 1170930 1195812
53405 1195812 1221710 1249323 1278670 1309331 1341289 1374866 1410118 1447041 1486058 1527517 1570929
53394 1570929 1615533 1661359 1708908 1758021 1807928 1858217 1908786 1959058 2008292 2056699 2105213
53383B105213M8806M8117M6433M4455M2352L9932L7429L5135L2711K9708K6322
53372B536613K2883J9116J4675R926N497J321l198q458j4489k0993k7202l2236
53360B503455l6058l9459m2790m5507m7247m8421m9251m9253m8265m7022m5993
53349B004189m4689m2796m1056m0132l9549l8639l7712l7364l7361l7060l6275
53338A571556l5004l3061l0706k8792k7610k6371k4549k2672k1053j9000j6240
53327A286498j3942j3055j2772j2010j1333j1876j3200j3878j3662j3420j3345
53316A144005j2778j1596j0421r494q511p381o168m582k491o14K53L78N58J073
53302A072231K046M008O879R176R745R661J0872J3418J5645J6800J7721J9036
$$ plain form
53383 2105213 2154019 2202136 2248569 2293024 2335376 2375308 2412737 2447872 2480583 2510291 2536613
53372 2536613 2559496 2578612 2593287 2603213 2608710 2610031 2606833 2598375 2583886 2562893 2535691 2503455
53360 2503455 2467397 2427938 2385148 2339641 2292394 2243973 2194722 2145469 2097204 2050182 2004189
53349 2004189 1959500 1916704 1875648 1835516 1795967 1757328 1719616 1682252 1644891 1607831 1571556
53338 1571556 1536552 1503491 1472785 1443993 1416383 1390012 1365463 1342791 1321738 1302738 1286498
53327 1286498 1272556 1259501 1246729 1234719 1223386 1211510 1198310 1184432 1170770 1157350 1144005
53316 1144005 1131227 1119631 1109210 1099716 1091205 1083824 1077656 1073074 1070583 1069969 1070222 1070600 1071158 1072231
53302 1072231 1074277 1078285 1085164 1094340 1104085 1113746 1124618 1138036 1153681 1170481 1188202 1207238
53290A207238K0446K1820K3476K5083K5722K5288K4576K3790K2278J9989J7925
53279A457631J6646J5460J3575J1174Q874O817M678K042j268m828p662r317j0520
53266A503302j2124j3877j5204j6639j9151k2259k4314k4730k4649k5196k6283
53255A278876k7280k7813k7648k6848k6144k6197k6415k5676k4273k3713k4361
53244I92508k4712k3586k1793k0868k1150k1891k2407k2407k1748k0581j9303
53233G52062j8013j6515j4983j3912j3145j1863r936q377p943q058p791p212p041
53220F07273p504q269r176j0334j1620j2614j3018j2852j2354j1824j1420j0988
53208D75300j0309r487q883q598q397q131p865p596p152o534n974n683n734o098
$$ plain form
53290 1207238 1227684 1249504 1272980 1298063 1323785 1349073 1373649 1397439 1419717 1439706 1457631
53279 1457631 1474277 1489737 1503312 1514486 1523360 1530177 1534855 1536897 1535629 1530801 1523139 1513822 1503302
53266 1503302 1491178 1477301 1462097 1445458 1426307 1404048 1379734 1355004 1330355 1305159 1278876
53255 1278876 1251596 1223783 1196135 1169287 1143143 1116946 1090531 1064855 1040582 1016869 992508
53244 992508 967796 944210 922417 901549 880399 858508 836101 813694 791946 771365 752062
53233 752062 734049 717534 702551 688639 675494 663631 653695 645318 637375 629317 621526 614314 607273
53220 607273 599769 591500 582324 571990 560370 547756 534738 521886 509532 497708 486288 475300
53208 475300 464991 455504 446621 438023 429626 421495 413630 406034 398882 392348 386374 380691 374957 368859
53194C68859o535o586o078n469n280n361n158m598m119m017m151m241m044l387
53180B99835k491j970k067k193j764j154j186j977k965l760m186l834k479q16
53166B66993J58L66M96P29N74n6o12p88q66j049j238j479j956k425k371j766j022
53149B53688l31L04N60J35n49q71j022j549k084j745p11j76n15p69j98P45J381
53132B46293J654J636J200O83Q49J683K104J458M66J20M50R31J351J623J428P25
53116B64654J58K92Q36J072P09n1q89j457j516j255j164j384j583j528j331j027
53100B54536n54j94l98r93j248r05m88m33o13r32j566k332k575k025j121k37O93
53083B38615J520J719J338J194J610J736Q34m26q07j53N16L54m89j328j662j533
$$ plain form
53194 368859 362324 355738 349660 344191 338911 333550 328392 323794 319675 315658 311507 307266 303222 299835
53180 299835 297344 295374 293307 291114 289350 288196 287010 285033 282068 278308 274122 270288 267809 266993
53166 266993 267151 267517 268013 268742 269316 269260 268648 267860 266994 265945 264707 263228 261272 258847 256476 254710 253688
53149 253688 253357 253661 254221 254356 253807 252936 251914 250365 248281 246536 245825 245649 245134 244365 244167 244912 246293
53132 246293 247947 249583 250783 251466 252315 253998 256102 257560 258026 258146 258596 259527 260878 262501 263929 264654
53116 264654 264812 265104 265940 267012 267721 267670 266781 265324 263808 262553 261389 260005 258422 256894 255563 254536
53100 254536 253982 253788 253390 252397 251149 250244 249756 249323 248710 247778 246212 243880 241305 239280 238159 237922 238615
53083 238615 240135 241854 243192 244386 245996 247732 248566 248140 247333 247180 247696 248050 247561 246233 244571 243038
53067B43038j363j488j750j782j520j167p19m4O20Q52O59L74K2n56j014p98j20
53050B33244K06nj50k7r8l27R2J328K220J760M59m54n63k98o7j4k14n30o07m17
53030B35538l63n18m01J14L77l5n20l57J91L29o2l79k06K86O56N92J40j45L14
53011B35551J323J975J756J125P13M77Np64j483j701j106R1R44O17m23q50l01
52994B37949J73j68o52m56L6P7k2N77J731K363J899Q35o2m48l50N3N67J179J962
52975B47243K615K484J437L34J29P30J215R78K96j42K4N18P19L56r1J5N61P51
52957B60172J58q25j480j335k95J093J643O08j220k307k264j927j698j056k8L45
52941B49584l39j000p17j32k11o37n06J18M85M08J99j21o03q04l97J24J48p4m6
$$ plain form
53067 243038 241675 240187 238437 236655 235135 233968 233249 233205 233825 234677 235336 235710 235732 235176 234162 233364 233244
53050 233244 233450 233445 233295 233268 233170 232843 232935 234263 236483 238243 238702 238248 237685 237387 237320 237306 237092 236562 235955 235538
53030 235538 235175 234657 234256 234370 234747 234712 234192 233835 234026 234355 234293 233914 233708 233994 234650 235242 235382 235237 235551
53011 235551 236874 238849 240605 241730 242443 242920 242925 242161 240678 238977 237871 237962 238906 239523 239100 238250 237949
52994 237949 238122 237954 237302 236846 236882 236959 236937 237514 239245 241608 243507 244342 244280 243832 243482 243535 244102 245281 247243
52975 247243 249858 252342 253779 254113 254242 254972 256187 257165 257461 257319 257343 257861 258580 258936 258845 258860 259421 260172
52957 260172 260330 259505 258025 256690 256395 257488 259131 259739 258519 256212 253948 252021 250323 249267 249239 249584
52941 249584 249245 248245 247528 247396 247185 246548 246042 246160 246645 247053 247252 247131 246528 245724 245327 245451 245599 245525 245479
52922B45479p9o82j369j188k19M86M27J37J76M49N98M29j07p48q93k72M41L20
52904B43385o56j610j816j227k33N19L92n48j282r32J14P70P44P25J154J644J668
52887B42811J273Q44O04N02M01K69K57M57N82K22m80q90p73o06p55r34q04m78
52869B42502l9P85J882K432J997J385J620K559L285L358K886J813J08j600k401
52854B62572k127j379p83o98j258k047k196j564j299k326l713l723k247j008j202
52839B35002k132k432j786r47p06j260k168k586j899l27J196J860J591R23M70
52824B24799M07L88P7k46n6M93O57L35K84P73R39K80k28N30K023K847K747K633
52806B39682K796K510J462L33l27q47j690k625l067k780k050j450j438j808j779
$$ plain form
52922 245479 245400 244718 243349 242161 241942 242428 242855 242992 243168 243617 244215 244644 244537 243789 242896 242624 243065 243385
52904 243385 242729 241119 239303 238076 237843 238362 238754 238206 236924 235992 236106 236876 237620 238345 239499 241143 242811
52887 242811 244084 244928 245532 246034 246435 246704 246961 247418 248000 248222 247742 246852 246079 245473 244718 243784 242980 242502
52869 242502 242463 243248 245130 247562 249559 250944 252564 255123 258408 261766 264652 266465 266573 264973 262572
52854 262572 260445 259066 258283 257585 256327 254280 252084 250520 249221 246895 243182 239459 237212 236204 235002
52839 235002 232870 230438 228652 227705 226999 225739 223571 220985 219086 218759 219955 221815 223406 224329 224799
52824 224799 225206 225594 225671 225425 225369 225862 226519 226854 227138 227911 228850 229130 228902 229432 231455 234302 237049 239682
52806 239682 242478 244988 246450 246783 246456 245609 243919 241294 238227 235447 233397 231947 230509 228701 226922
52791B26922r98j89k35q94j139n83J95O16P37P88P77O59N08M43O07J026J331J029
52773B31600L02m9J65J27o01j155p98k92o71j374j117j33J19o02r12m2J010J087
52755B26664L62l46o71n83n3N65O51K34R3N37R34Q42P91J301J863J667Q40K36
52737B35927K71N97Q33J030J422J894J966J333M44K25J026K130K604K302J626
52722B55630P03m79j462j654j180p14o01p80j369k409l136k522p32Q02J035L69
52706B41501j62q0M30R67J165R36N93L92L9q06j685j761j035l85l24m69l79j38
52688B38799R6L89O31M80K3r9M77J381K020K083J488L95n77p66k36K93L54P8k70
52669B47039m72j83P04J484J233L0j151j796k175k258j401M81K281K935K649K348
$$ plain form
52791 226922 225924 225735 225500 224606 223467 222884 223079 223695 224432 225220 225997 226656 227164 227607 228214 229240 230571 231600
52773 231600 231902 231853 232018 232145 231544 230389 229591 229299 228628 227254 226137 226004 226123 225521 224609 224567 225577 226664
52755 226664 227026 226680 226009 225426 225373 225938 226589 226823 226916 227453 228387 229229 230020 231321 233184 234851 235691 235927
52737 235927 236198 236795 237628 238658 240080 241974 243940 245273 245717 245942 246968 249098 251702 254004 255630
52722 255630 256333 255854 254392 252738 251558 250844 250243 249463 248094 245685 242549 240027 239295 240097 241132 241501
52706 241501 241339 241259 241689 242656 243821 244757 245350 245742 245781 244975 243290 241529 240494 240109 239785 239316 238937 238799
52688 238799 238895 239284 239915 240395 240418 240319 240796 242177 244197 246280 247768 248163 247586 246820 246584 246877 247231 247309 247039
52669 247039 246567 246384 247088 248572 249805 249835 248684 246888 244713 242455 241054 241535 243816 246751 249400 251748
52653B51748K380K316J787J015N88P77J116Q52l4o43m69k92r79k006k200j583
52637B54373j168j160p91j0K14l25m84M22J526J909J972K444L037L072K541J666
52621B69238K33j626k736k181q50n04j517k548k431j442n51k05j57o3J11J62K1
52604B52954j03r1k13p22j238j110l73K08K09oL0L24P54J291J675J571J214J253
52586B57627J640J527O34j00J66R53J230Q21L67K55L33L81K93j0m32o92p42q78
52568B63373j128j035l80L22N03L03J49l8n88j342j705j392p40k24l6p8j93l34
52550B55437n06n90l95J2K45J75J50L47L58o0l49l4K31l41j137q55L54R47L18
52531B54307l93j98M56Q36J074J404J439J003O88Q61J012P85O18O69K27q64j354
$$ plain form
52653 251748 254128 256444 258231 259246 259834 260611 261727 262579 262545 261902 261433 261141 260162 258156 255956 254373
52637 254373 253205 252045 251254 251244 251458 251133 250649 251071 252597 254506 256478 258922 261959 265031 267572 269238
52621 269238 269471 267845 265109 262928 262078 261574 260057 257509 255078 253636 253085 252880 252723 252660 252771 252933 252954
52604 252954 252851 252760 252547 251825 250587 249477 249104 249312 249521 249515 249545 249869 250623 251914 253589 255160 256374 257627
52586 257627 259267 260794 261428 261328 261494 262447 263677 264498 264865 265120 265453 265834 266127 266117 265685 264993 264251 263373
52568 263373 262245 261210 260830 261152 261655 261958 262107 262069 261481 260139 258434 257042 256302 256078 256042 255964 255771 255437
52550 255437 254931 254341 253946 253958 254203 254378 254528 254875 255233 255173 254824 254790 255021 254680 253543 252688 253042 253989 254307
52531 254307 253914 253716 254172 255008 256082 257486 258925 259928 260616 261477 262489 263274 263892 264561 264788 263924 262570
52514B62570k98J258J606O69k09j45P51K237M007N202M973L514J782L64o33j082
52498B86566j078j294k140k910k674j772j371j752k082j795j279j041r99q03l14
52483B63262L35P56N08l12q90n28M92J327J586J466J199Q85O33M32J15j79M7Q54
52465B71988J558J678J645J969K348K299K019J821J272j09j727k523k402k116
52451B79720j966j658j258j245j642j982k120k303k369j783n81M61P80N73K93
52436B62920J17J0j36m33p72p72l14J64K82K80M88O64M39M6j8K48O00J099J739
52417B66651J982J517J027J347K113K302J810J499J863K633L577M709N747O304
52403C05081O669P398Q208Q192P134N624L846J334j819m603o277p080p431p239
$$ plain form
52514 262570 262272 263530 265136 265805 265596 265451 266202 268439 272446 277648 282621 286135 287917 288281 287648 286566
52498 286566 285488 284194 282054 279144 276470 274698 273327 271575 269493 267698 266419 265378 264379 263576 263262
52483 263262 263597 264353 264861 264549 263659 263131 263623 264950 266536 268002 269201 270086 270719 271151 271266 271087 271134 271988
52465 271988 273546 275224 276869 278838 281186 283485 285504 287325 288597 288488 286761 284238 281836 279720
52451 279720 277754 276096 274838 273593 271951 269969 267849 265546 263177 261394 260813 261274 262054 262627 262920
52436 262920 263037 263047 262911 262478 261706 260934 260620 260784 261066 261346 261834 262498 262937 262983 262965 263213 263813 264912 266651
52417 266651 268633 270150 271177 272524 274637 276939 278749 280248 282111 284744 288321 293030 298777 305081
52403 305081 311750 319148 327356 335548 342682 348306 352152 353486 351667 347064 340787 333707 326276 319037
52389C19037o407n257m095k962k076j837k070j936j003J22O11L63p2j11N70J890
52373B94767L274M044M077L831L652L496L257K912K377J654J058P69L86m96j328
52358C27730j105K31J607K148J894J154R5q13q40L0Q88J097J087J534K308K771
52342C41816K693K395K207K197K264K286K348K860M119N718O781O932O643O542
52328C97801O826P409Q228R172J0041J0772J1503J2325J3231J4175J4983J5305
52316E31771J5071J4780J4890J5133J4989J4621J4649J5124J5504J5566J5630
52305F97728J5862J6107J6438J7077J7688J7549J6591J5538J4872J4340J3609
52294H73399J2576J0966Q488N644L455K055N05j630l409l888l492l311l644m004
$$ plain form
52389 319037 312630 307373 303278 300316 298240 296403 294333 292397 291394 291516 292127 292490 292418 292307 292877 294767
52373 294767 298041 302085 306162 309993 313645 317141 320398 323310 325687 327341 328399 329168 329554 329058 327730
52358 327730 326625 326856 328463 330611 332505 333659 333754 332941 332101 332131 333019 334116 335203 336737 339045 341816
52342 341816 344509 346904 349111 351308 353572 355858 358206 361066 365185 370903 377684 384616 391259 397801
52328 397801 404627 412036 420264 429436 439477 450249 461752 474077 487308 501483 516466 531771
52316 531771 546842 561622 576512 591645 606634 621255 635904 651028 666532 682098 697728
52305 697728 713590 729697 746135 763212 780900 798449 815040 830578 845450 859790 873399
52294 873399 885975 896941 905429 911073 914528 916583 917088 915458 912049 908161 904669 901358 897714 893710
52280H93710m132m190m262m192l900l415k757j959j016K48J905L489M402M798
52266H78729N419O372O913O737O620P307Q499R506J0268J1061J1801J2357J3069
52253I94658J4217J5346J5798J5577J5088J4272J2720J0433P896N507L460J911
52241A126883Q19k11j384k293k572k738l690n518p381q557r039r099q840q344
52227A058036p874p715p918q266q361p908p103o486o244n851m750l122j581m02
52213I74455N45J271J653J833K164K716L276L790M359M788M659L974L274K997
52199A015754L091L364L793M250M389M180M174M768N423N227M187L394L659M449
52185A074102M569L555J947L45j233k951m640o029p169q277r272r746r410q389
$$ plain form
52280 893710 889578 885388 881126 876934 873034 869619 866862 864903 863887 864135 866040 869529 873931 878729
52266 878729 884148 890520 897433 904170 910790 918097 926596 936102 946370 957431 969232 981589 994658
52253 994658 1008875 1024221 1040019 1055596 1070684 1084956 1097676 1108109 1116005 1121512 1124972 1126883
52241 1126883 1127702 1127491 1126107 1123814 1121242 1118504 1114814 1109296 1101915 1093358 1084319 1075220 1066380 1058036
52227 1058036 1050162 1042447 1034529 1026263 1017902 1009994 1002891 996405 990161 984310 979560 976438 974857 974455
52213 974455 975000 976271 977924 979757 981921 984637 987913 991703 996062 1000850 1005509 1009483 1012757 1015754
52199 1015754 1018845 1022209 1026002 1030252 1034641 1038821 1042995 1047763 1053186 1058413 1062600 1065994 1069653 1074102
52185 1074102 1078671 1082226 1084173 1084518 1083285 1080334 1075694 1069665 1062496 1054219 1044947 1035201 1025791 1017402
52171A017402p138o134n529n023m228l212k411j952j502q93l83K1Q55K243L216
52156I85332K783J406N13O62J102J128R07P14L20l59p23k21Q77J934K726L282
52140A002383L302K456J047j50p31r20j033j097j028p89k24R52K768M766O435
52125A018137P858R662J2166J4832J6899J8403K0061K2027K3442K3604K3071K2908
52113A233070K3168K2862K1435J9546J8200J7695J7592J7262J6223J4423J2551
52102A434027J1665J2114J2938J2714J1029Q881P552P201O679M821J671j769m796
52089A524727p507j0065j2178j3658j4843j5976j6624j6290j5190j3810j2139
52078A376447j0039p999o726o147n588m778l954l077j779j8J914L949O096P912
$$ plain form
52171 1017402 1010264 1004130 998601 993578 989350 986138 983727 981775 980273 979380 978997 979018 979873 982116 985332
52156 985332 988115 989521 990034 990696 991798 992926 993833 994547 994867 994508 993785 993564 994441 996375 999101 1002383
52140 1002383 1005685 1008141 1009188 1009038 1008307 1007387 1006354 1005257 1004229 1003440 1003216 1004168 1006936 1011702 1018137
52125 1018137 1025995 1035657 1047823 1062655 1079554 1097957 1118018 1140045 1163487 1187091 1210162 1233070
52113 1233070 1256238 1279100 1300535 1320081 1338281 1355976 1373568 1390830 1407053 1421476 1434027
52102 1434027 1445692 1457806 1470744 1483458 1494487 1503368 1510920 1518121 1524800 1529621 1531292 1529523 1524727
52089 1524727 1517220 1507155 1494977 1481319 1466476 1450500 1433876 1417586 1402396 1388586 1376447
52078 1376447 1366408 1358409 1351683 1345536 1339948 1335170 1331216 1328139 1326360 1326342 1328256 1332205 1338301 1346213
$$ [...]
##END NTUPLES=NMR SPECTRUM
##END=
