
##TITLE=UV1217_M5_1296-1170_30_7229326_oI9TZXSJEr
##JCAMPDX= 6.0         $$ Bruker NMR JCAMP-DX V2.0
##DATA TYPE= NMR SPECTRUM
##DATA CLASS= NTUPLES
##ORIGIN= BRUKER
##OWNER= Administrator
$$ 1.72 TOPSPIN		Version 2.1
$$ 2013-01-23 22:19:09.368 -0500  Administrator@X
$$ Compression mode = diff/dup
##.OBSERVE FREQUENCY= 400.02188249412
##.OBSERVE NUCLEUS= ^1H
##.ACQUISITION MODE= SIMULTANEOUS (DQD)
##.ACQUISITION SCHEME= undefined
##.AVERAGES= 64
##.DIGITISER RES= 22
##SPECTROMETER/DATA SYSTEM= spect
##.PULSE SEQUENCE= noesygpps1d.comp
##.SOLVENT NAME= COFFEE_meoh
##.SHIFT REFERENCE= INTERNAL, COFFEE_meoh, 1, 14.96096
##AUDIT TRAIL= $$ (NUMBER, WHEN, WHO, WHERE, PROCESS, VERSION, WHAT)
$$ ##TITLE= Audit trail, TOPSPIN		Version 2.1
$$ ##JCAMPDX= 5.01
$$ ##ORIGIN= Bruker BioSpin GmbH
$$ ##OWNER= Administrator
$$ $$ E:\/data/COFFEE/nmr/UV1217_M5_1296-1170_30_7229326_oI9TZXSJEr/42/pdata/1/auditp.txt
$$ ##AUDIT TRAIL=  $$ (NUMBER, WHEN, WHO, WHERE, PROCESS, VERSION, WHAT)
(   1,<2013-01-23 22:19:03.509 -0500>,<Administrator>,<X>,<go>,<TOPSPIN 2.1>,
      <created by zg
	started at 2013-01-23 22:07:33.414 -0500,
	POWCHK enabled, PULCHK disabled,
       configuration hash MD5:
       86 BA 57 50 F2 9D 5C 9B 26 00 A9 28 5F 66 2E 89
       data hash MD5: 64K
       C7 F8 B0 DF DF 90 B5 16 D1 6F 7A C7 F1 AA 57 FE>)
(   2,<2013-01-23 22:19:06.556 -0500>,<Administrator>,<X>,<proc1d>,<TOPSPIN 2.1>,
      <Start of raw data processing
       efp LB = 0.3 FT_mod = 6 PKNL = 1 PHC0 = 0 PHC1 = 0 SI = 128K 
       data hash MD5: 128K
       E8 B2 2C 56 7C 11 04 72 69 AF 81 BA CF 2A 11 A9>)
(   3,<2013-01-23 22:19:07.603 -0500>,<Administrator>,<X>,<proc1d>,<TOPSPIN 2.1>,
      <pk PHC0 = -79.19495 PHC1 = 0 
       data hash MD5: 128K
       6B D1 31 B3 9D B9 94 F8 42 51 E5 CD 03 D7 59 E4>)
(   4,<2013-01-23 22:19:08.306 -0500>,<Administrator>,<X>,<proc1d>,<TOPSPIN 2.1>,
      <abs ABSG = 1 
       data hash MD5: 128K
       F0 0A 0F F2 31 24 43 AD 01 ED D0 09 9F D0 CE 92>)
(   5,<2013-01-23 22:19:08.462 -0500>,<Administrator>,<X>,<proc1d>,<TOPSPIN 2.1>,
      <abs ABSG = 2 
       data hash MD5: 128K
       A3 5D ED 3B 44 03 2A 44 28 72 64 E6 CF E7 9D 3D>)
(   6,<2013-01-23 22:19:08.634 -0500>,<Administrator>,<X>,<proc1d>,<TOPSPIN 2.1>,
      <abs ABSG = 3 
       data hash MD5: 128K
       5D DE AD 15 4F 53 3F E2 F5 11 97 EF 6A 94 66 6F>)
(   7,<2013-01-23 22:19:08.822 -0500>,<Administrator>,<X>,<proc1d>,<TOPSPIN 2.1>,
      <abs ABSG = 4 
       data hash MD5: 128K
       39 4A CD 74 26 4C A3 31 1B AA EA C7 D3 4F 6F AA>)
(   8,<2013-01-23 22:19:08.993 -0500>,<Administrator>,<X>,<proc1d>,<TOPSPIN 2.1>,
      <abs ABSG = 5 
       data hash MD5: 128K
       CF B1 3F 09 90 1C 90 28 BC 09 A2 D2 CA 28 35 3B>)
$$ ##END=
$$ 
$$ $$ hash MD5
$$ $$ 12 28 B9 7D 9D 6C 93 D1 68 79 9E 91 AD 76 D7 31
##$RELAX= 
##$RELAX= 
##$RELAX= 
##$RELAX= 
##$RELAX= 
##$RELAX= 
##$RELAX= 
##$RELAX= 
$$ Bruker specific parameters
$$ --------------------------
##$DU= <E:\>
##$EXPNO= 42
$$ [...]
##$TP07= 0
##$TPNAME0= <>
##$TPNAME1= <>
##$TPNAME2= <>
##$TPNAME3= <>
##$TPNAME4= <>
##$TPNAME5= <>
##$TPNAME6= <>
##$TPNAME7= <>
##$TPOAL= (0..7)
0.5 0.5 0.5 0.5 0.5 0.5 0.5 0.5
##$TPOFFS= (0..7)
0 0 0 0 0 0 0 0
##$TUNHIN= 0
##$TUNHOUT= 0
##$TUNXOUT= 0
##$USERA1= <user>
##$USERA2= <user>
##$USERA3= <user>
##$USERA4= <user>
##$USERA5= <user>
##$V9= 5
##$VALIST= <valist>
##$VCLIST= <CCCCCCCCCCCCCCC>
##$VD= 0
##$VDLIST= <DDDDDDDDDDDDDDD>
##$VPLIST= <PPPPPPPPPPPPPPP>
##$VTLIST= <TTTTTTTTTTTTTTT>
##$WBST= 1024
##$WBSW= 4
##$XGAIN= (0..3)
0 0 0 0
##$XL= 0
##$YL= 0
##$YMAX_a= 5818468
##$YMIN_a= -12269180
##$ZGOPTNS= <>
##$ZL1= 120
##$ZL2= 120
##$ZL3= 120
##$ZL4= 120
##$ABSF1= 14.96096
##$ABSF2= -5.597221
##$ABSG= 5
##$ABSL= 3
##$ALPHA= 0
##$AQORDER= 0
##$ASSFAC= 0
##$ASSFACI= 0
##$ASSFACX= 0
##$ASSWID= 0
##$AUNMP= <proc_prof1d_extract.lims>
##$AXLEFT= 0
##$AXNAME= <>
##$AXNUC= <1H>
##$AXRIGHT= 0
##$AXTYPE= 0
##$AXUNIT= <>
##$AZFE= 0.1
##$AZFW= 0.1
##$BCFW= 0
##$BC_mod= 0
##$BYTORDP= 0
##$COROFFS= 0
##$CY= 15
##$DATMOD= 1
##$DC= 0
##$DFILT= <>
##$DTYPP= 0
##$F1P= 0
##$F2P= 0
##$FCOR= 0.5
##$FTSIZE= 131072
##$FT_mod= 6
##$GAMMA= 0
##$GB= 0
##$INTBC= 1
##$INTSCL= 1
##$ISEN= 128
##$LB= 0.3
##$LEV0= 0
##$LPBIN= 0
##$MAXI= 10000
##$MC2= 0
##$MEAN= 0
##$ME_mod= 0
##$MI= 0
##$NCOEF= 0
##$NC_proc= -2
##$NLEV= 6
##$NOISF1= 0
##$NOISF2= 0
##$NSP= 0
##$NTH_PI= 0
##$NZP= 0
##$OFFSET= 14.96096
##$PC= 1
##$PHC0= -79.19495
##$PHC1= 0
##$PH_mod= 1
##$PKNL= yes
##$PPARMOD= 0
##$PPDIAG= 0
##$PPIPTYP= 0
##$PPMPNUM= 2147483647
##$PPRESOL= 1
##$PSCAL= 4
##$PSIGN= 0
##$PYNMP= <proc.py>
##$REVERSE= no
##$SF= 400.020009651929
##$SI= 131072
##$SIGF1= 0
##$SIGF2= 0
##$SINO= 400
##$SIOLD= 131072
##$SPECTYP= <>
##$SREGLST= <1H.CDCl3>
##$SSB= 0
##$STSI= 131072
##$STSR= 0
##$SW_p= 8223.68421052631
##$SYMM= 0
##$S_DEV= 0
##$TDeff= 65536
##$TDoff= 0
##$TI= <>
##$TILT= no
##$TM1= 0
##$TM2= 0
##$TOPLEV= 0
##$USERP1= <user>
##$USERP2= <user>
##$USERP3= <user>
##$USERP4= <user>
##$USERP5= <user>
##$WDW= 1
##$XDIM= 131072
##$YMAX_p= 441349955
##$YMIN_p= -12492
##$CURPLOT= <Network HP LaserJet P1505>
##$CURPRIN= <$Network HP LaserJet P1505>
##$DFORMAT= <normdp>
##$LAYOUT= <+/1D_H.xwp>
##$LFORMAT= <normlp>
##$PFORMAT= <normpl>
##$SURQMSG= 1
$$ End of Bruker specific parameters
$$ ---------------------------------
##NTUPLES= NMR SPECTRUM
##VAR_NAME=  FREQUENCY,     SPECTRUM/REAL,   SPECTRUM/IMAG
##SYMBOL=    X,             R,               I
##VAR_TYPE=  INDEPENDENT,   DEPENDENT,       DEPENDENT
##VAR_FORM=  AFFN,          ASDF,            ASDF
##VAR_DIM=   131072,        131072,          131072
##UNITS=     HZ,            ARBITRARY UNITS, ARBITRARY UNITS
##FACTOR=    0.0627417313425164, 1,          1
##FIRST=     8223.62146879497, 730,          -60062
##LAST=      0,             3560,            -60051
##MIN=       0,             -12492,          0
##MAX=       8223.62146879497, 441349955,    0
$$ Real data points
##PAGE= N=1
##DATA TABLE= (X++(R..R)), XYDATA
$$ [...]
67907 89952 88386 87611 87311 86593 84940 82696 80701 79578 79387 79861 80700 81546 81879 81316 80081 78890 78239
67890 78239 77988 77808 77730 77887 77859 76876 74901 73073 72643 73659 75092 76111 76737 77246 77506 77222 76519 75871
67872 75871 75544 75368 75027 74416 73781 73619 74352 75967 78059 80223 82159 83443 83670 83090 82601 82646 82487 81178
67854 81178 79046 77517 77510 78574 79618 79843 78907 76906 74515 72602 71412 70562 70043 70478 71939 73216
67838 73216 73077 71873 71026 71090 71166 70345 68970 68163 68629 70254 72443 74517 76017 77016 77996 79235 80531
67821 80531 81660 82764 83931 84673 84414 83488 83065 83787 84880 85021 83875 82334 81281 80575 79470 77714
67805 77714 75865 74583 73903 73328 72496 71562 70869 70384 69681 68483 67019 65645 64386 63149 62242 62181 62905
67788 62905 63637 63771 63526 63440 63542 63468 63188 63191 63907 65236 66640 67531 67664 67315 67005 66932 66888 66879 67449 68986 70965
67767 70965 72387 72895 72990 73227 73704 74381 75433 77091 79400 82203 85130 87615 89195 89834 89737 88984 87628
67750 87628 86025 84656 83651 82821 82071 81436 80900 80604 81042 82489 84325 85525 85743 85344 84458 82839 80703
67733 80703 78821 77449 75899 73571 70851 68666 67590 67629 68276 68538 67563 65599 63827 62930 62393 61506
67717 61506 60354 59407 58808 58531 58627 58846 58682 58282 58616 60097 61765 62539 62610 62725 62815 62406 61899 62196 63233
67698 63233 63977 63886 63418 63083 62863 62712 62786 63030 63170 63201 63248 62959 61779 59894 58208 57264 56860 56776 57103 57669
67678 57669 57884 57507 57048 57118 57820 58940 60229 61361 62114 62757 63782 65146 66285 66932 67334 67602 67576 67508
67660 67508 68124 69599 71114 71824 71743 71309 70705 70100 69988 70646 71609 72187 72207 71775 70747 69053 67248 66063
67642 66063 65496 64947 64224 63826 64169 65021 65906 66698 67537 68330 68629 68057 66771 65442 64742 64895 65797 67380
67624 67380 69569 71919 73651 74245 73794 72726 71465 70440 70112 70683 71957 73615 75458 77264 78728
67609 78728 79782 80714 81733 82597 82959 82849 82488 81818 80602 78948 77338 76089 75098 74218 73626 73582 73982
67592 73982 74375 74424 74141 73585 72553 70830 68763 67200 66654 66749 66793 66679 66761 66978 66640 65339 63608 62425
67574 62425 62297 63075 64382 65831 66935 67156 66213 64221 61581 58779 56326 54695 54140 54494 55190 55717
67558 55717 56148 57020 58573 60298 61495 62018 62139 61868 60968 59640 58623 58426 58864 59467 59929 59997 59374 58131
67540 58131 56915 56436 56871 57965 59340 60454 60668 59828 58634 57966 57921 57894 57530 57139 57093 57228 57060 56364
67522 56364 55284 54036 52775 51794 51559 52298 53588 54612 54986 55134 55658 56498 57062 57114 57166 57824 59004 59977
67504 59977 60097 59359 58302 57415 56638 55522 54024 52944 53235 54894 56824 57912 57999 57747 57799 58204 58533
67487 58533 58480 58340 58741 59709 60275 59431 57362 55268 54100 53943 54562 55760 57009 57489 56962 56204 56180 57146
67469 57146 58744 60407 61302 60525 58070 55299 53765 53702 54186 54586 55197 56454 58148 59607 60322 60253 59791
67452 59791 59483 59586 59884 59971 59614 58709 57229 55540 54483 54683 55861 57185 58207 59078 60034 61182 62678
67435 62678 64485 65937 66189 65336 64541 64734 65634 66429 66958 67657 68588 69188 69027 68305 67349 66034 64085 61793
67417 61793 59976 59148 59013 58994 58995 59361 60192 61084 61638 61895 62079 62132 61798 61045 60162 59446 59012 58891 59085 59448
67397 59448 59705 59720 59667 59846 60294 60711 60775 60501 60217 60213 60482 60778 60840 60523 59894 59268 58979 58933 58571 57583 56570
67376 56570 56628 58178 60451 62238 62877 62405 61061 59045 56779 55034 54484 55047 55833 55921 55137 53987 53009
67359 53009 52604 53325 55615 58940 61829 63288 63759 64123 64324 63805 62878 62600 63320 64353 65151 65756 65926
67342 65926 64924 62787 60854 60394 61315 62790 64395 65955 66926 66886 66315 66103 66488 67088 67722 68530 69527
67325 69527 70625 71941 73451 74558 74614 73824 73052 72771 72776 72839 73049 73395 73444 72678 71001 68959 67516 67321
67307 67321 67997 68535 68621 69068 70495 72198 73056 73133 73457 74447 75454 75848 75738 75521 75437 75707 76471 77433 78125
67288 78125 78573 79105 79465 78874 77218 75553 75020 75661 76613 77132 77130 76963 76908 76816 76307 75411 74753 74746 74945 74773
67268 74773 74568 75120 76324 77221 77462 77733 78535 79436 79976 80436 81168 81833 81993 81856 81777 81562 80997 80672 81393
67249 81393 82877 83799 83247 81657 80250 79907 80636 81790 82697 83198 83545 83803 83663 83053 82523 82581 82911 82752
67231 82752 81959 81160 80866 80947 81120 81475 82179 83014 83652 84271 85428 87165 88637 88961 88301 87685 87766 88186 88365
67212 88365 88460 89103 90420 91771 92397 91962 90574 88735 87276 86862 87442 88442 89497 90619 91719 92488
67196 92488 92801 92767 92268 91041 89403 88307 88291 88856 89257 89541 90331 91891 93806 95390 96081 95753 95002 94850
67178 94850 95678 96695 96883 96274 95788 95963 96414 96585 96476 96417 96543 96741 96918 97160 97730 98937 100825 102942
67160 102942 104543 105116 104641 103467 102158 101413 101766 103177 105018 106565 107444 107595 107069 106037 104897 104075
67144 104075 103643 103249 102570 101765 101367 101727 102674 103803 104972 106379 108205 110310 112284 113748 114597 114999
67128 114999 115163 115160 115072 115240 116062 117488 118995 120230 121379 122649 123737 124260 124425 124772 125368 125832 126063 126335
67110 126335 126622 126529 126110 126157 127307 129302 131488 133584 135553 137101 137873 138012 138116 138666 139678 140780 141456
67093 141456 141447 141151 141335 142176 142833 142364 140897 139508 139099 139791 141273 143223 145313 147237 148920 150457 151804
67076 151804 152796 153552 154556 156121 157968 159607 160991 162512 164303 165848 166566 166690 167222 168893 171370
67061 171370 173734 175543 177101 178749 180338 181525 182340 183191 184502 186472 189118 192339 195894 199335 202018
67046 202018 203429 203734 203836 204555 205821 207025 208052 209435 211469 213776 215973 218199 220558 222497 223334
67031 223334 223261 223312 224377 226577 229521 232788 236078 239193 242040 244625 247051 249559 252396 255522 258562
67016 258562 261204 263597 266242 269524 273394 277384 280944 283960 286989 290688 294984 299124 302717 306292
67002 306292 310462 314837 318303 320385 321977 324562 328901 334547 340500 346200 351798 357526 363075 367865
66988 367865 371854 375709 380133 385281 390862 396485 401803 406717 411580 416875 422577 428190 433548 439151
66974 439151 445468 452336 459370 466578 474172 482030 489716 496893 503527 509952 516906 525095 534350 543608
66960 543608 552036 559880 567915 576536 585750 595560 605730 615636 625058 634811 645798 657678 669266
66947 669266 680190 691277 703218 715664 727949 740075 752606 766016 780388 795413 810495
66936 810495 825228 839944 855455 872122 889543 907283 925421 944141 963262 982613 1002544
66925 1002544 1023546 1045473 1067587 1089458 1111480 1134320 1158064 1182143 1206070 1230043 1254683
66914 1254683 1280370 1307033 1334523 1362788 1391675 1420977 1450871 1481932 1514386 1547632 1580830
66903 1580830 1613687 1646376 1679053 1711961 1745650 1780444 1815840 1851101 1886379 1922522 1959674
66892 1959674 1996791 2032942 2068539 2104853 2142595 2181308 2219954 2257782 2294733 2331172 2367296
66881 2367296 2402782 2437119 2470092 2501717 2531885 2560512 2587946 2614702 2640663 2665040 2687274
66870 2687274 2707500 2725945 2742368 2756434 2768222 2777883 2785090 2789371 2790897 2790449 2788552 2784961 2779144
66857 2779144 2770978 2760780 2748794 2734890 2718873 2700928 2681526 2660793 2638138 2612765 2584574
66846 2584574 2554447 2523660 2493087 2462803 2432162 2400176 2366103 2329899 2292203 2253968 2216063
66835 2216063 2178954 2142461 2105902 2068748 2031164 1993770 1956974 1920736 1884806 1848915 1812866
66824 1812866 1776842 1741533 1707495 1674343 1640994 1606886 1572616 1539300 1507669 1477858 1449616
66813 1449616 1422355 1395273 1367755 1339666 1311240 1282949 1255542 1229766 1205695 1182522 1159279
66802 1159279 1135637 1111883 1088395 1065455 1043359 1022303 1002150 982567 963359 944477 925755
66791 925755 906975 888258 870137 853043 836883 821299 806248 792035 778717 765761 752501
66780 752501 738764 724808 710831 696953 683677 671755 661279 651255 640497 628757 616717
66769 616717 605144 594451 584801 576010 567399 558336 549059 540523 533241 526606 519534 511489 502763 494074
66755 494074 486078 479020 472595 466216 459473 452310 444882 437537 430861 425340 420827 416589 412020 407116
66741 407116 402228 397607 393224 388783 383853 378285 372551 367381 362990 358942 354770 350370 345738 340798
66727 340798 335692 330847 326478 322350 318253 314343 310705 306945 302693 298340 294749 292285 290485 288729
66713 288729 286825 284794 282426 279434 275997 272839 270522 268774 266720 263789 260147 256211 252156 248143
66699 248143 244664 242122 240198 238139 235669 233156 230849 228455 225708 222890 220489 218611 216946 215091
66685 215091 212731 209802 206701 204152 202555 201563 200435 198694 196352 193713 191199 189259 188195 187950 188058
66670 188058 187864 186964 185526 184017 182504 180525 177947 175577 174366 174112 173613 172140 170156 168482 167360
66655 167360 166568 165893 165155 164162 162985 161921 160912 159393 157075 154562 152852 152382 152807 153427 153547 152747
66639 152747 151102 149069 147020 145131 143716 143141 143170 142850 141459 139236 136934 135009 133592 132753 132272 131499
66623 131499 130035 128420 127664 128155 129334 130285 130333 129286 127529 125732 124108 122186 119641 117146 115832
66608 115832 115959 116651 116951 116720 116402 116244 116016 115367 114353 113556 113547 114272 115098 115489 115308 114447 112706 110268
66590 110268 107845 105962 104497 103257 102542 102613 103043 103193 103080 103171 103572 104046 104544 104997 104762 103207 100832
66573 100832 98961 98113 97452 96178 94687 93871 93846 93995 93951 93959 94366 95184 96120 96813 97061 96994 96962 97116 97249 97101
66553 97101 96679 96137 95515 94721 93638 92164 90331 88573 87645 88004 89293 90612 91314 91423 91346 91401 91638 91921
66535 91921 91986 91546 90546 89333 88379 87722 86875 85507 83994 83000 82587 82192 81474 80732 80243 79645 78375 76522
66517 76522 74847 74088 74532 76035 78038 79645 80175 79815 79435 79653 80207 80367 79785 78867 78402 78822 79756 80320
66499 80320 79933 78864 77904 77581 77739 77856 77625 77235 77106 77319 77372 76630 75014 73068 71359 70020 68874
66482 68874 67752 66698 66080 66464 67975 69789 70707 70385 69554 68859 68071 66820 65596 65457 66907 69386
66466 69386 71686 72680 72005 70413 69102 68504 68095 67624 67734 68833 70039 70157 69230 68218 67451 66464 65179
66449 65179 64227 63935 63993 64326 65413 67358 69392 70778 71605 72294 72818 72928 72764 72774 73202 73973 74900 75781
66431 75781 76445 76843 76970 76672 75789 74545 73499 73046 73243 74091 75558 77218 78318 78424 77742 76677 75409
66414 75409 74040 72814 71963 71559 71592 71909 72094 71789 71223 71082 71689 72696 73675 74589 75551 76479 77243 77812
66396 77812 78069 77787 76981 75963 74977 74083 73529 73676 74374 74877 74772 74573 74985 75901 76585 76595 76049 75113 73760
66377 73760 72106 70639 69940 70190 70996 71686 71895 71828 71814 71718 71172 70274 69540 69046 68241 66941 65927 66024 66974
66358 66974 67878 68472 69274 70479 71432 71404 70418 69044 67723 66621 65866 65559 65542 65475 65231 65077 65325 65939 66625
66339 66625 67258 68004 68991 70067 71028 71872 72657 73238 73416 73248 73001 72844 72785 72769 72608 71971 70766 69439 68550
66320 68550 68171 68064 68297 69123 70306 71153 71347 71218 71043 70652 69970 69422 69403 69757 70129 70480 70897 71210 71240
66301 71240 71182 71337 71644 71836 71927 72203 72795 73515 74045 74087 73499 72477 71515 70982 70901 71237 72109 73473 74822
66282 74822 75526 75327 74280 72501 70338 68600 68073 68705 69595 69880 69452 68788 68325 68161 68208 68410 68771 69241
66264 69241 69710 70116 70429 70499 70157 69607 69395 69657 69659 68647 67015 65937 65824 65932 65720 65798 66925 68702 70031
66245 70031 70540 70797 71245 71653 71711 71618 71807 72458 73398 74269 74701 74513 73891 73206 72648 72151 71648 71286 71342 71989
66225 71989 73109 74287 75067 75269 75028 74531 73919 73405 73227 73340 73333 72796 71654 70183 68898 68430 69147 70773
66207 70773 72586 74037 74917 74983 74011 72417 71288 71401 72518 73913 75253 76607 77950 79035 79586 79378
66191 79378 78382 76997 75800 74855 73706 72294 71297 71185 71496 71612 71736 72469 73840 75442 77097 78609
66175 78609 79215 78256 76334 74925 74778 75385 76028 76542 76933 77048 76913 76791 76693 76362 75957 76124 77075 78120
66157 78120 78358 77523 75946 74184 72844 72313 72382 72521 72637 73101 73918 74496 74512 74374 74442 74408 73975 73563 73716
66138 73716 74191 74335 74087 73913 73966 74004 74123 74817 76178 77621 78583 79032 79109 78775 78146 77736 77938 78481 78817
66119 78817 78872 79037 79530 80201 80978 82028 83275 84162 84241 83766 83312 82959 82266 81098 80022 79696 80237 81349
66101 81349 82756 84187 85277 85901 86483 87550 89026 90326 91155 91809 92623 93459 93908 93757 93156 92517 92355
66084 92355 92938 93933 94573 94316 93219 91648 89920 88380 87465 87299 87370 87053 86481 86499 87607 89208 90184 90037
66066 90037 89203 88323 87607 87049 86901 87524 88853 90315 91403 92098 92705 93477 94512 95719 96722 97035 96573
66049 96573 95862 95467 95347 95030 94312 93463 92747 92079 91256 90331 89660 89715 90843 92951 95318 96977 97503 97329
66031 97329 97167 97280 97545 98104 99504 101991 104886 107053 108040 108492 109329 110730 112134 113020 113348 113295 112968
66014 112968 112503 112195 112338 113064 114335 115926 117435 118606 119712 121303 123467 125638 127316 128685 130311
65999 130311 132544 135431 138870 142533 145878 148636 151163 153989 157143 160197 162727 164395 164846 164057 162736
65984 162736 161853 161647 161434 160424 158397 155576 152200 148448 144528 140708 137273 134434 132139 130065 127983
65969 127983 125985 124184 122470 120887 120016 120409 121707 122881 123430 123805 124463 125045 124880 123918 122740 121843
65953 121843 121382 121513 122576 124738 127709 130981 134299 137720 141159 144076 145835 146473 146878 148013 150031
65938 150031 152222 153732 154196 153898 153510 153571 153994 154193 153942 153867 154760 156596 158686 160753 163240 166415 169724
65921 169724 172439 174623 176983 179897 183008 185815 188282 190710 193231 195750 198301 201072 203917 206162
65907 206162 207243 207440 207559 207941 208204 208053 207834 208037 208650 209304 209674 209408 208058 205592 202719 200210 197984
65890 197984 195323 191821 187701 183314 178813 174285 169784 165218 160568 156190 152549 149715 147431 145507
65876 145507 143846 142316 141029 140468 140700 140780 139677 137747 136430 136426 137026 137390 137553 137717 137461 136431 135193
65859 135193 134605 134612 134441 133822 133322 133433 133970 134584 135336 136393 137440 137912 137822 137965 139016 140641 141900 142440
65841 142440 142773 143328 143788 143766 143602 143872 144478 144906 145173 145771 146731 147499 147877 148403 149591 151367 153468 155831
65823 155831 158375 160929 163673 167153 171534 176258 180659 184497 187623 189655 190385 190113 189159 187352 184415
65808 184415 180656 176866 173674 171184 169084 166877 164221 161250 158457 156184 154394 152944 151786 150846
65794 150846 150040 149435 149080 148736 148238 147973 148339 148797 148399 147515 148003 151054 155664 160013 163683 167619 172412
65777 172412 177638 182759 187710 192510 196936 200724 203610 205196 205264 204230 202728 200703 197413 192427 186268
65762 186268 179897 173945 168594 163919 160117 157531 156507 157168 159300 162579 166844 172093 178307 185486
65748 185486 193762 203274 213995 225811 238627 252180 265825 278725 290284 300265 308506 314593
65736 314593 317862 317734 314094 307353 298111 286888 274250 260912 247427 233975 220777 208419 197251
65723 197251 186786 176477 166919 159339 153758 148704 143176 137917 134119 131661 129443 126870 124185 121795
65709 121795 120079 119523 120167 121093 121227 120546 119804 119278 118563 117615 117162 117802 119249 120704 121661 122196 122718 123530
65691 123530 124469 125099 125412 126028 127363 128887 129706 129692 129558 129976 131138 133021 135580 138671 142308 146888
65675 146888 152737 159490 166469 173686 181992 192165 204229 217689 232015 246852 262106 277776
65663 277776 293423 307962 320436 330899 340038 347986 354083 357800 359344 359229 357773 355270 352287
65650 352287 349539 347655 347110 348127 350519 353754 357121 359788 360998 360528 358674 355446 350085 341835 330883
65635 330883 317913 303047 286041 267535 249244 232670 218168 205346 193744 182933 172620
65624 172620 162971 154477 147320 141336 136651 133714 132378 131565 130268 128498 126867 125645 124679 123863 123228
65609 123228 122706 122214 121838 121606 121168 120084 118505 117286 117241 118337 119749 120716 121239 121755 122249 122085 120876
65592 120876 119137 117695 116830 116433 116730 118170 120654 123494 126306 129439 133402 138225 143571 149165 155065
65577 155065 161717 169726 179298 189988 201314 213376 226431 240106 253724 267260 281086 294654
65565 294654 306244 314418 319147 321167 320877 318338 313767 307387 298985 288158 274949 260068 244608
65552 244608 229683 216012 203572 191825 180494 169947 160739 153050 146712 141528 137331 133939 131222
65539 131222 129098 127500 126522 126503 127588 129251 130684 131690 132728 134025 135149 135565 135138 133982 132310
65524 132310 130600 129325 128290 126750 124468 122115 120346 118997 117605 116200 115122 114409 113877 113545 113580
65509 113580 113957 114497 115050 115429 115375 114835 114070 113379 112967 113084 113853 114897 115634 116082 116803 117891 118722 118997
65491 118997 119323 120355 122046 124174 126850 129871 132353 133848 135252 137694 140932 143745 145486 146331 146330
65476 146330 145318 143648 141972 140262 137993 135289 132866 130720 128000 124586 121774 120720 120958 121107 120493
65461 120493 119371 118035 116494 114937 113847 113533 113876 114525 115136 115488 115574 115524 115331 114816 114002 113282 113043 113356
65443 113356 114247 115955 118556 121512 124058 126004 127785 129671 131374 132539 133282 133999 134881 135878 136909
65428 136909 137788 138079 137442 136172 134989 134168 133209 131646 129894 128941 129301 130543 131827 132570 132674 132406 132160
65411 132160 132151 132241 132177 131915 131541 130990 130162 129318 129003 129488 130526 131701 132840 134060 135690 138149 141544 145335
65393 145335 148680 151194 153060 154399 155005 154771 153911 152515 150342 147433 144545 142587 141813 141885 142442 143275
65377 143275 144096 144561 144530 144120 143577 143171 143057 143099 143089 143182 143825 145125 146672 148182 149898 152080 154500 156871
65359 156871 159443 162783 167159 172525 178883 186275 194555 203433 212539 221237 228690 234426 238563 241208
65345 241208 242082 241114 238891 235954 232054 226741 220319 213493 206404 198877 191398 184849 179290 173948 168596
65330 168596 164042 160906 158781 156996 155502 154437 153429 152002 150345 149065 148354 147811 146921 145387 143228
65315 143228 140945 139398 139071 139469 139526 138523 136457 133671 130526 127412 124772 123002 122295 122488 122977 123056
65299 123056 122645 122517 123525 125669 128207 130563 132745 134859 136726 138218 139620 141231 142757 143445 142839
65284 142839 141179 139114 137336 136457 136709 137529 137868 137339 136781 137171 138172 138404 137134 135020 132998 131176
65268 131176 129335 127899 127596 128304 129006 128981 128514 128195 128010 127424 126200 124841 124255 125076 127240 130103 132982
65251 132982 135557 137794 139623 140846 141314 141034 140172 139053 138030 137177 136165 134656 132797 131083 129743
65236 129743 128503 127101 125890 125674 126875 128912 130541 130914 130281 129583 129388 129381 128846 127384 125134 122521
65220 122521 119988 117822 116126 114951 114407 114417 114460 113966 113074 112614 113162 114455 115945 117466 118989 120134
65204 120134 120526 120473 120694 121343 121776 121399 120404 119546 119407 119967 120675 120884 120389 119645 119407 120093 121521 123139
65186 123139 124441 125277 125873 126504 127116 127472 127679 128234 129344 130506 131101 131192 131376 131903 132272 131786 130333 128581
65168 128581 127439 127269 127680 128194 128983 130574 132909 135183 136747 137686 138325 138744 139075 139765 141130 142975
65152 142975 144964 146948 148670 149786 150612 152182 155057 158736 162890 168354 175893 184654 193033 200721
65138 200721 208593 216786 224264 230455 236054 241873 248011 254477 261486 268537 274163 277388 278755 279278
65124 279278 279053 277671 275481 273549 272453 271698 270240 267235 262421 256200 249278 242049 234501 226739 219227
65109 219227 212280 205681 199112 192660 186627 181116 176054 171364 166923 162626 158646 155335 152672 150239
65095 150239 147906 146092 144997 144014 142378 140129 138004 136564 135856 135752 136163 136876 137521 137822 137777 137610 137552
65078 137552 137564 137290 136461 135406 134886 135335 136484 137743 138737 139425 140032 140979 142532 144337 145548 145566 144539
65061 144539 143120 141967 141439 141411 141428 141373 141870 143529 145855 147594 148234 148476 148989 149441 149149 148036 146470
65044 146470 144698 142951 141634 140899 140421 140040 140132 140833 141356 140774 139232 137762 137042 136845 136523 135560 133836
65027 133836 131784 130075 128797 127192 124732 122072 120387 120013 120362 120940 121691 122424 122733 122656 122804 123612 124944
65010 124944 126596 128710 131404 134303 136725 138237 138988 139649 140958 143105 145613 147938 150006 151920 153476
64995 153476 154428 155048 155814 156595 156722 155922 154724 153843 153628 154203 155618 157647 159830 161938 164126 166502
64979 166502 168890 171120 173127 174568 174821 173677 171697 169617 167641 165603 163406 160936 157858 154053
64965 154053 150161 147190 145540 144723 144009 143006 141682 140323 139580 140028 141343 142274 141801 140196 138582 137657
64949 137657 137217 136835 136504 136439 136596 136616 136103 134896 133284 131956 131461 131587 131588 131175 130908 131403 132550 133875
64931 133875 135264 136795 138088 138462 137746 136496 135308 134296 133230 131867 130210 128748 128338 129399 131333
64916 131333 133139 134446 135471 136163 136227 135955 136215 137342 138757 139947 141164 142809 144779 146839 149063
64901 149063 151502 153957 156525 159824 164201 169221 174398 179868 185762 191507 196476 200981 205882 211465
64887 211465 217264 222717 227414 231108 234110 237296 240856 243411 243275 240446 236425 232176 227309 221386
64873 221386 214946 208785 203112 197916 193502 190104 187432 185167 183557 183034 183468 184180 184530 184205 183128
64858 183128 181417 179326 176988 174320 171307 168215 165330 162674 160146 157784 155691 153786 151832 149673
64844 149673 147356 145104 143262 142146 141843 142144 142730 143364 143893 144154 144027 143588 143162 143108 143485 143974 144345 144911
64826 144911 146230 148247 150094 150962 150931 150687 150692 151066 152118 154444 158289 163054 167599 171039 173326 175247
64810 175247 177846 181725 186827 192765 199096 205290 210833 215546 219514 222490 223689 222519 219246 214712
64796 214712 209707 204839 200517 196587 192379 187661 183181 179672 176753 173628 170566 168706 168390 168701 168864
64781 168864 169209 170325 172019 173605 174714 175344 175610 175931 177031 179236 181974 184451 186636 189230 192833
64766 192833 197446 202649 207923 212910 217668 222580 227764 232664 236560 239448 242118 245294 248938 252541
64752 252541 255903 259386 263371 267690 271802 275355 278274 280294 280771 279164 275425 269678 261941 252585
64738 252585 242765 233837 226334 219950 214405 209808 206190 203273 200920 199365 198787 198971 199571 200420 201433
64723 201433 202476 203469 204419 205313 206258 207676 209991 213102 216619 220631 225697 231807 237878 242628 245613
64708 245613 247100 247270 246018 243379 239730 235565 231210 226646 221552 215719 209548 203805 198710 193631
64694 193631 188008 182285 177481 174026 171513 169528 168164 167579 167479 167412 167372 167770 168813 170228 171691 173275
64678 173275 175259 177635 180213 183199 187290 192935 199733 206812 213602 220005 226026 231527 236213 239551
64664 239551 240852 239768 236669 232296 227251 222096 217609 214346 211989 209649 206867 203991 201709 200672
64650 200672 201360 203606 206268 208176 209503 211449 214369 217107 218575 219199 220160 221878 224101 227064 231629
64635 231629 238277 246633 256019 265877 275599 284415 291734 297371 301364 303770 304658 304063 301879 297974 292446
64620 292446 285640 277911 269532 260789 251993 243352 234962 227049 220093 214563 210437 207124 204054 201330
64606 201330 199554 198902 198688 198073 197020 196173 196011 196478 197309 198276 199180 200071 201455 203788 206752 209578 212133
64589 212133 215132 219077 223571 227974 232246 236783 241845 247472 253603 259907 265840 271222 276449 281743
64575 281743 286552 290114 292387 293976 295288 296159 296137 294728 291468 286182 279279 271517 263459 255269 246957
64560 246957 238604 230392 222604 215569 209563 204826 201618 199935 199085 197931 195879 193443 191622 190866 190861
64545 190861 191073 191242 191477 192107 193351 195006 196595 197920 199239 200791 202390 203589 203931 202978 200599 197533
64529 197533 195167 194252 194115 193530 192106 190392 188892 187621 186510 185652 185051 184560 184189 184185 184659 185403 186118
64512 186118 186678 187148 187688 188432 189291 189995 190507 191302 192964 195527 198526 201701 205343 209857 215234 221168
64496 221168 227520 234299 241140 247061 251063 252880 252949 251706 249348 246301 243338 240847 238438 235846 233827
64481 233827 233396 234375 235505 236033 236349 236859 237097 236332 234394 231453 227570 222998 218528 215033 212918 212215
64465 212215 212803 214193 215576 216495 217211 218192 219609 221452 223491 224871 224517 222471 220170 218851 218302 217749
64449 217749 217197 217069 217193 217191 217467 218723 220748 222641 224105 225561 227079 228275 229471 231993 236895 243940
64433 243940 252024 260188 268207 276785 287239 300393 315665 331865 348952 368473 392153 420713
64421 420713 454280 493328 538925 592486 655456 728529 810585 898500 988290 1076443 1160468
64410 1160468 1238881 1311072 1376814 1435401 1485161 1523818 1549193 1559724 1554912 1535727 1504498
64399 1504498 1463980 1416041 1360847 1297221 1224206 1142636 1055231 965330 876026 790482 712010
64388 712010 642793 582774 530546 485129 446353 413879 386796 364238 345636 330340 317585
64377 317585 306898 297952 290122 282864 276445 271513 267955 264928 261991 259255 256335 252219 246585 240338
64363 240338 234344 228461 222392 216696 212126 208526 205181 201970 199465 198012 197400 197407 198191 199998 202808
64348 202808 206376 210473 214974 219628 223762 226454 227334 226972 226099 224669 222270 219265 216672 214796 212838
64333 212838 210157 207173 204592 202490 200738 199733 199998 201354 203092 204712 206093 207235 208319 209774
64319 209774 211800 214005 215867 217350 218749 220207 221770 223580 225500 226768 226553 224799 222155 219169
64305 219169 215879 212046 207442 202036 196312 191249 187559 184969 182619 180155 178041 176758 176073 175341 174324
64290 174324 173544 173768 175233 177366 179303 180630 181594 182717 184381 186688 189477 192516 195891 200038 205077
64275 205077 210276 214731 218554 222810 228120 233860 238961 242937 245811 247466 247585 246115 243574 240959
64261 240959 239270 238738 238596 238067 237518 237931 239235 240021 239165 236896 233872 230162 225753 221183 216815 212131
64245 212131 206653 201010 196265 192692 190122 188900 189278 190239 190287 189419 189047 189808 190692 190758 190579 191309 193103
64228 193103 195219 197117 198785 200332 201853 203514 205315 206929 208140 209297 211021 213507 216292 218631
64214 218631 220013 220478 220558 220814 221354 221918 222328 222594 222660 222365 221703 220852 219954 219113 218483 217956 216901 214782
64196 214782 212079 210005 209207 209343 210071 211679 214393 217837 221874 227371 235234 244937 254844 263927 272312
64181 272312 280056 286201 289487 289504 286743 281915 275608 268360 260585 252536 244611 237534 231803 226995 222020
64166 222020 216156 209594 202994 196929 191938 188640 187257 187067 186715 185259 182818 180286 178561 177968 178176
64151 178176 178642 179316 180818 183711 187687 191815 195534 198930 202004 204348 205858 207301 209529 212319 214490
64136 214490 215058 213896 211369 207921 204133 200712 198101 196267 194975 194154 193917 194427 195816 197959 200285
64121 200285 202106 203377 204953 207800 212045 216997 222034 227199 232911 239381 246501 254071 261770 268919
64107 268919 274642 278549 281096 282996 284407 285039 285063 285503 287475 291240 296160 301446 306702 311918 317131
64092 317131 322075 326061 328314 328574 327223 324683 320892 315663 309370 302955 297205 292207 287503 282517
64078 282517 276891 270710 264504 258890 254162 250324 247359 245193 243477 241771 240057 238747 238101 237923 237973
64063 237973 238308 238973 239710 240287 240865 241579 241979 241442 240178 239283 239654 241264 243671 246679 250118 253492 256553
64046 256553 260054 265247 272580 281364 290751 300413 310128 319433 328127 336576 344940 352442 358025 361556
64032 361556 363780 365146 365272 363605 360172 355541 350423 345447 340975 337005 333455 330574 328839 328428 329004
64017 329004 329958 330567 330055 327970 324554 320349 315434 309544 303024 297032 292432 288844 285165 280818 276202
64002 276202 272126 269097 267074 265699 264724 264199 264210 264621 265331 266585 268632 271172 273634 275918 278343 280904
63986 280904 283225 285389 288057 291542 295453 299585 304464 310482 317106 323550 329734 335954 342051 347721
63972 347721 353411 360170 368545 378132 388219 398450 408849 419638 431123 443569 457163 472092
63960 472092 488457 506035 524498 544113 565919 590970 619714 652320 689174 730783 777687
63949 777687 830969 892507 964361 1048192 1145471 1257622 1385435 1528799 1687476 1861597
63939 1861597 2050806 2253420 2467126 2689940 2919626 3152545 3383914 3608817 3822124
63930 3822124 4017884 4190067 4334112 4447085 4526617 4570775 4578916 4551606 4489521 4393323 4264797
63919 4264797 4107350 3925434 3724383 3510666 3290848 3069596 2849369 2632315 2421597
63910 2421597 2220573 2031673 1856569 1696521 1551964 1422515 1308004 1208751 1124308 1052767
63900 1052767 992026 940994 898775 863369 832214 803640 776953 751509 726650 702361 679090
63889 679090 656916 635564 615184 596338 579205 563429 548839 535809 524797 515991 509454 505156
63877 505156 502815 502078 502995 506030 511573 519715 530401 543442 558444 575112 593666 614557 637712
63864 637712 662438 688184 715046 743436 773528 805124 837675 870182 901394 930493 957555
63853 957555 983040 1006765 1027638 1044499 1057052 1065689 1070455 1070538 1065011 1053851 1037904 1017936 994128
63840 994128 966600 936013 903391 869505 834656 798957 762635 726148 690166 655385 622243
63829 622243 590801 560953 532693 506230 481909 459969 440245 422185 405370 389927 376150
63818 376150 363818 352312 341406 331420 322434 313899 305431 297597 291440 287340 284660 282401 279892
63805 279892 276937 273626 270042 266098 261771 257548 254296 252359 250953 248764 245171 240758 236707 233813
63791 233813 231859 229779 226660 222829 219687 218167 217605 216551 214525 212377 210953 210044 209000 207918 207648
63776 207648 208630 210129 210872 210256 208772 207277 206170 205425 205075 205226 205623 205704 205316 205009 205355 206180 206756 206579
63758 206579 205668 204320 202916 201908 201613 201905 202356 202716 203086 203590 204132 204600 205182 206335 208417 211320 214423
63741 214423 217023 218890 220384 221985 223869 225995 228379 230952 233255 234664 235042 234944 235079 235786 237177
63726 237177 239541 243260 248268 253891 259320 264163 268462 272401 276223 280323 284990 289850 293816 295884
63712 295884 295964 294752 292926 290680 288020 285106 282151 279137 275861 272257 268570 265252 262770 261500 261615
63697 261615 262872 264468 265447 265584 265775 267159 269816 272745 275220 277621 280615 284042 287157 289618 291556
63682 291556 292852 293096 292314 291164 290269 289789 289683 289828 289814 289181 288174 287875 289271 292399 296420 300194 302790
63665 302790 304007 304646 305808 307630 309060 309056 307599 305251 302207 298213 293155 287327 281223 275332 270017
63650 270017 265412 261534 258497 256377 254915 253787 253175 253535 254691 255764 256245 256560 257264 258296 259492
63635 259492 261239 263976 267464 271141 274927 279115 283777 288837 294488 300976 308165 315824 324070 332973
63621 332973 342053 350881 360018 370674 383507 398433 415477 434914 456418 478967 502043 526387
63609 526387 553121 582522 613951 646513 679237 710830 739752 764609 784307 797994 805268 806575
63597 806575 803173 796565 787939 778151 768065 758506 749663 740652 730004 716698 700594 682007 661203
63584 661203 638415 613938 588141 561795 536515 514227 495704 479992 465753 452847 442106
63573 442106 433975 428178 424519 423126 423747 425559 428054 431607 436762 443269 450180 456776 463183 470193
63559 470193 478599 488600 499701 511202 522810 534788 547676 562066 578575 597844 620600 647765
63547 647765 680234 718293 761219 807348 853959 896847 930879 952238 960492 958075 947889 932037
63535 932037 912642 892605 874661 860015 848360 838853 830547 822150 812073 798908 781745 760221
63523 760221 734653 706086 675901 645226 614806 585311 557390 531384 507275 485042 464850
63512 464850 446719 430278 415156 401493 389681 379616 370591 362093 354337 347813 342592 338389 334881
63499 334881 331552 327640 322972 318678 316202 315536 315159 313924 312179 310739 309622 308482 307612 307631 308500 309545
63483 309545 310345 311066 312115 313959 317079 321531 326659 331627 336082 339988 343187 345663 347868 350181 352202
63468 352202 353154 352708 350898 347597 342801 337188 331578 326080 320593 315875 313069 312147 311831 311210 310482 310022
63452 310022 309789 310011 311383 314016 317099 320237 324245 329950 336903 344169 351786 360541 370748 382215
63438 382215 395277 410938 429960 452503 478756 509084 543014 578284 611274 638539 658223
63427 658223 670402 676446 678242 678025 678414 681810 689481 701585 718247 740078 767381 799393 834832
63414 834832 872706 911847 949867 983352 1009415 1026820 1035780 1037203 1032324 1022670 1009971 995957
63402 995957 981960 968454 954987 940809 925456 908543 889179 866102 838614 807206 773274
63391 773274 738475 704291 671734 641094 612141 584833 559773 537748 518865 502444 487865
63380 487865 475290 465330 458129 453139 449791 448060 448127 449782 452529 456214 461186 467865 476462 487187
63366 487187 500346 515982 533643 552769 573284 595636 620285 647289 676446 707760 741600
63355 741600 778257 817246 857098 895802 931365 961931 985764 1001540 1008844 1008398 1001934 991773
63343 991773 980036 967814 955074 941532 927373 912926 897903 881362 862273 839835 813594
63332 813594 783875 752054 719912 688656 658862 631043 605621 582502 561553 543640 530424
63321 530424 522824 520232 521323 524670 528070 528226 522271 509648 492087 472016 451428 431753 413805
63308 413805 397632 382967 370008 359395 351345 345198 339985 335164 330653 326489 322714 319445 316798
63295 316798 314691 312874 311160 309499 307743 305533 302628 299389 296649 294965 294118 293474 292594 291380 289944
63280 289944 288678 288123 288274 288203 286936 284759 283064 282783 283419 283832 283513 282831 282381 282402 282684 282889 283101 284096
63262 284096 286699 290754 295010 298198 300030 301090 302110 303485 305262 307337 309739 312663 316122 319793
63248 319793 323483 327560 332409 337676 342681 347545 353184 360101 367918 376285 385476 395777 407000 419046
63234 419046 432302 446961 462511 478433 494903 512268 530293 548544 567105 586260 605762
63223 605762 625038 643907 662494 680628 697955 714624 731367 748851 767241 786220 805043
63212 805043 822717 838450 851855 862476 869435 871922 869782 863224 852265 836961 817965 796275
63200 796275 772547 747222 721274 696244 673390 653170 635624 620864 609027 600011 593531 589455
63188 589455 588053 589848 594979 602733 612015 622416 634498 648862 665314 683150 701835 721060
63176 721060 740491 759829 778823 797005 813928 830061 846766 864730 882812 899163 913078
63165 913078 924945 934646 941008 942860 939878 932224 920101 903862 884037 860987 834910 806269
63153 806269 775821 744266 712321 681095 651819 625041 600501 577871 557205 538607 522018
63142 522018 507491 495242 485160 476596 468880 461860 455835 451114 447703 445201 443056 441082 439639
63129 439639 439067 439110 439285 439636 440675 442637 445209 447972 450698 453291 455899 459017 463000 467470 471701
63114 471701 475541 479416 483443 487217 490601 494033 497818 501697 505427 509198 513116 516772 519729 522074
63100 522074 524078 525696 526817 527723 528817 530090 531308 532595 534366 536692 539039 540755 541621 541943 542258
63085 542258 542923 543848 544615 544941 544952 544995 545296 545881 546661 547487 548253 549073 550237 551848 553666 555496 557587 560433
63067 560433 564169 568514 573390 579361 587191 597046 608489 621248 635639 652035 670307 690203 712116
63054 712116 736931 765092 796230 829806 865730 904214 945360 988986 1034481 1080723 1126623
63043 1126623 1171956 1217224 1262566 1307340 1351011 1393797 1436071 1477762 1518896 1560108 1601907
63032 1601907 1643842 1685010 1724848 1762619 1796544 1824368 1844566 1856206 1858013 1848714 1828277 1797798
63020 1797798 1758238 1710314 1655766 1597474 1537845 1477956 1418675 1361625 1308472 1260057 1216907
63009 1216907 1179871 1149485 1125252 1106410 1093191 1086632 1087259 1094467 1107125 1124321 1145555 1170507
62997 1170507 1198667 1229095 1260794 1293367 1326952 1361322 1395529 1428816 1461436 1494041 1526481
62986 1526481 1557759 1587018 1614056 1638786 1660592 1678270 1690328 1695262 1691864 1679499 1658150 1628197
62974 1628197 1590284 1545362 1494727 1439852 1382144 1322866 1263256 1204602 1148025 1094231 1043684
62963 1043684 997023 954932 917401 883472 852110 823107 796773 772904 750605 729090 708287
62952 708287 688577 670243 653188 636895 620705 604418 588580 573937 560702 548573 537224
62941 537224 526398 515741 505077 494771 485428 477288 470243 464179 458907 454041 449474 445663 442863
62928 442863 440460 437856 435565 434443 434098 433272 431700 430370 429762 429164 428066 426967 426233 425329 423900 422486
62912 422486 421306 419401 416001 411991 408833 406586 404141 401034 397979 395784 394737 394970 396475 398643
62898 398643 400542 401806 402792 403883 405147 406633 408415 410309 411961 413303 414558 415854 417144 418406
62884 418406 419522 420030 419406 417708 415712 414342 413967 414139 413969 413012 411784 411070 410695 409537 406945 403491
62868 403491 400041 396777 393659 391144 389621 388558 387044 384993 383061 381585 380319 379162 378411 378249 378573
62853 378573 379332 380544 381948 383166 384237 385497 386898 387845 387803 386765 385126 383441 382249 381775 381748 381717
62837 381717 381483 381007 380202 379162 378407 378429 379058 379611 379554 378745 377329 375874 375364 376432 378599 380760 382342
62820 382342 383543 384595 385436 386210 387480 389622 392366 395163 397791 400458 403469 406912 410602 414348 418285
62805 418285 422776 427919 433385 438878 444470 450300 456323 462658 469772 477893 486566 495260 504184 514026
62791 514026 525173 537661 551693 567676 585837 606284 629309 655281 684440 717206 754388
62780 754388 796614 843884 896196 954133 1017993 1086596 1157843 1230431 1304200 1378765 1452627
62769 1452627 1523738 1590186 1650051 1701176 1741451 1769097 1782847 1782392 1768581 1742646 1705346 1657500
62757 1657500 1601127 1539123 1473692 1405829 1336338 1266387 1196970 1128825 1063266 1002128 946338
62746 946338 895271 847982 804347 764511 728116 694831 664984 638848 615778 594885 576136
62735 576136 559994 546237 533981 522735 512667 503852 495960 488838 482835 478365 475527 474200 474142
62722 474142 474866 475778 476609 477582 479145 481726 485705 491307 498349 506298 514724 523724 533907 545958 560122
62707 560122 576092 593559 612928 635319 661688 692109 726063 763261 803933 848433 896966
62696 896966 949786 1007345 1069910 1136996 1207352 1279552 1352421 1424702 1494459 1559166 1616469
62685 1616469 1664589 1701906 1726674 1737610 1734577 1718252 1689316 1648492 1597320 1538222 1473545
62674 1473545 1404884 1333471 1260835 1188764 1118852 1052309 989981 932340 879534 831536 788126
62663 788126 748773 712866 680162 650772 624619 601178 579925 560843 544298 530515 519193
62652 519193 509452 500138 490466 480494 470778 461556 452500 443334 434355 426102 418736 412020 405872 400804
62638 400804 397656 396786 397507 398542 399120 399336 399253 398171 395439 391672 388373 386281 384819 383245 381642 380450
62622 380450 379671 378993 378335 377906 378019 379016 381006 383524 385835 387756 389713 391869 393930 396103 399448 404579
62606 404579 410574 415934 420393 425098 431251 439242 449003 460461 473547 488304 505177 524852 547735
62593 547735 573868 603277 636009 671685 709308 747584 785345 821737 856188 888084 916272
62582 916272 939079 955138 964138 966580 962979 953598 938669 918375 892790 862403 828715 793813
62570 793813 759196 725386 692689 661773 633208 606854 582112 558690 536856 517031 499291
62559 499291 483261 468503 455059 443566 434569 427754 422069 416711 411723 407588 404512 402281 400540
62546 400540 398991 397433 395851 394421 393271 392343 391619 391359 391940 393449 395494 397372 398361 398122 397047 396150
62530 396150 396342 397808 400198 403262 407050 411588 416853 423179 431274 441514 453470 466431 480324
62517 480324 495870 513999 535359 560195 588299 619085 652099 687469 725549 766015 807651
62506 807651 849120 889585 928371 964311 995766 1021209 1039653 1050711 1054474 1051292 1041606 1026050
62494 1026050 1005698 981967 956191 929478 902950 877759 854756 834444 817385 804271 795486
62483 795486 790954 790618 794596 802616 813784 827215 842396 858415 873345 885093 892744 896625 897300
62470 897300 894902 889057 878774 862700 840286 812762 782435 750949 718598 685182 651074 617522
62458 617522 586249 558518 534142 511782 490676 471711 456253 444463 435511 428811 423960 419982
62446 419982 416020 412667 411220 411652 412684 413945 416483 420730 425510 429793 434013 438751 443385 447074
62432 447074 450003 452511 453882 453215 450748 447197 442459 436192 429086 422234 415629 408608 401487 395398
62418 395398 390588 386200 381801 377893 374674 371489 367936 364520 361713 359239 356845 355038 354375 354516 354596
62403 354596 354272 353922 353988 354504 355185 355707 355956 356150 356642 357590 358904 360482 362285 364230 366213 368254 370439
62386 370439 372828 375575 378943 382890 386861 390506 394505 400093 407628 416019 423799 430499 436887 444142
62372 444142 452851 462614 472486 482010 491816 502993 515927 530117 545140 561456 580111 601943
62360 601943 627331 656583 690234 728889 772773 821544 874559 931187 990565 1050991 1109826
62349 1109826 1164218 1211822 1250892 1280257 1299633 1309789 1311998 1307281 1296219 1279181 1256436 1228225
62337 1228225 1195025 1157610 1116827 1073725 1030144 988564 950719 916541 884947 855376 828064
62326 828064 803178 780490 759817 741069 723743 706983 690258 673517 656659 639433 621951
62315 621951 604745 588075 571606 554980 538411 522591 508275 495977 485675 476743 468569 461326
62303 461326 455778 452223 450003 448139 446074 443796 441772 440912 442002 444742 447693 449574 450468 451536 453754
62288 453754 457197 461300 465457 469412 473305 477349 481362 484718 486918 488206 489512 491687 494702 497585
62274 497585 499271 499666 499851 501176 504307 509152 515447 523130 532366 543468 556652 571694 588178 606458
62260 606458 628058 654605 686592 723679 765918 813850 867438 925702 987495 1051758 1116536
62249 1116536 1178420 1233661 1279741 1315715 1341489 1357247 1363356 1360400 1349220 1330856 1306109 1275069
62237 1275069 1237444 1193592 1144912 1093089 1039464 985450 932974 883816 838666 797409 760295
62226 760295 728188 701574 679868 662104 648019 637968 631783 628230 625852 624104 623229 623190 623322 623179
62212 623179 623119 623544 623919 623221 621212 618629 616012 612928 608560 602654 595641 588196 580907 574128 567851
62197 567851 561847 556115 551103 547453 545637 545759 547418 549828 552431 555549 560079 566458 574188 582508
62183 582508 591111 599977 608818 617112 624554 631128 636794 641452 645361 649407 654605 661206 668561 676287
62169 676287 685548 698671 717216 740868 768593 800351 836975 878614 924041 971321 1018327 1062554
62157 1062554 1101321 1132688 1155861 1170736 1177660 1177729 1172420 1162457 1147531 1127432 1102829 1074518
62145 1074518 1042660 1007440 969995 931965 894441 857999 823520 792191 764757 741333 721912
62134 721912 706504 694739 685784 678761 672946 667711 662718 658187 654523 651618 648947 646431 644750 644665
62120 644665 646436 650124 656039 664480 675209 687568 701029 715252 729547 742548 752685 758973
62108 758973 761413 760802 758289 755024 751931 749620 748326 747667 746440 743029 736583 727836 718512 709897 702382
62093 702382 696346 692702 692112 694113 697647 702179 707766 714313 721439 728982 737047 745563 754416 763977
62079 763977 774906 787397 801221 816550 833994 853633 874765 896843 919925 943818 967586
62068 967586 990588 1013447 1037274 1062317 1088082 1114457 1141888 1170417 1199213 1227123 1253089
62057 1253089 1275873 1293907 1305840 1311152 1310166 1303657 1292563 1277854 1260353 1240463 1217954 1192057
62045 1192057 1161986 1127592 1089590 1049210 1007715 966121 925118 885094 846317 809115 773849
62034 773849 740826 710423 683159 659325 638543 619967 602945 587285 573040 560331 549265
62023 549265 539577 530459 521291 512446 504736 498012 491049 483037 474468 466246 458610 451459 445129 440197
62009 440197 436803 434672 433496 432918 432496 432219 432784 434939 438740 443775 449778 456567 463701 470712 477460
61994 477460 483829 489354 493586 496635 498821 500001 499733 497983 495121 491351 486605 480935 474572 467662
61980 467662 460388 453272 446970 441780 437705 434771 432825 431104 428611 425099 421301 418070 415541 413173
61966 413173 410395 407198 404295 402626 402492 403273 404141 404881 405725 406638 407209 407204 406880 406753 407251 408539 410468
61949 410468 412856 415991 420631 427248 435511 444795 454976 466446 479657 494975 512581 532051 552344
61936 552344 572788 593709 615479 637245 657466 675684 692943 710297 727565 743715 757827
61925 757827 769267 777415 781720 781971 778392 771574 762312 751258 738821 725587 712737 701705 693513
61912 693513 688672 687466 689911 695635 704290 715897 730240 746160 762167 777696 792955 807443
61900 807443 819456 827317 830479 829106 823293 813191 799474 783196 765360 746770 728001 709364
61888 709364 691215 674294 659211 645491 631861 617842 604458 592864 582782 572921 562600 552314
61876 552314 542842 534402 526722 519512 512708 506462 500979 496369 492775 490626 490439 492194 495231 498991
61862 498991 503642 509755 517650 527346 538890 552364 567744 585073 604694 626980 651869 678921
61850 678921 707812 738562 771368 806378 843448 881836 920055 956285 989022 1017406 1041072
61839 1041072 1059765 1072947 1079695 1079203 1071637 1058352 1041223 1021946 1002123 983640 968405 957648
61827 957648 951724 950545 953995 961871 973645 988314 1004380 1020081 1033851 1044515 1050905 1051488 1044858
61814 1044858 1030739 1010199 984674 954994 921550 885222 847716 810867 775766 742648 711448
61803 711448 682268 655387 631091 609600 590981 574956 560863 548082 536539 526669 518752 512355
61791 512355 506601 501021 495994 492261 490029 488704 487470 485952 484231 482486 480883 479610 478626 477411
61777 477411 475448 473063 471328 470834 470954 470661 469813 469138 469121 469411 469410 469021 468683 468836 469526 470407 471130 471732 472579
61758 472579 473924 475715 477905 480663 484017 487545 490712 493312 495267 496263 496060 494995 493708 492408 490827
61743 490827 488812 486486 483892 481024 478269 476257 475121 474351 473539 472835 472498 472456 472584 473033 473913 474947
61727 474947 475769 476445 477454 479220 481755 484613 487173 489172 491029 493346 496085 498554 500355 501924 503893
61712 503893 506183 508035 508778 508291 506844 504669 501710 497824 493297 489009 485671 482954 479876 476150 472685
61697 472685 470478 469482 468899 468142 467082 465651 463762 461546 459217 456740 453978 451143 448758 447106 445942
61682 445942 444812 443428 441720 439718 437496 435129 432627 429929 427001 423988 421202 418875 416927 415119
61668 415119 413490 412404 411944 411553 410644 409364 408246 407249 405761 403660 401726 400742 400625 400713 400463 399695 398644
61651 398644 398080 398824 400764 402845 404527 406694 410451 415416 420058 423601 426773 430559 434891 438858 441730
61636 441730 443435 444242 444217 443032 440371 436521 432284 428070 423437 417922 412001 406697 402463 399124 396688
61621 396688 395386 394846 394148 392984 391993 391574 391168 390305 389592 389742 390030 388772 385277 380448 375353 370113
61605 370113 364524 359023 354333 350548 347100 343466 339459 335036 330373 326048 322619 319851 316802 312886
61591 312886 308552 304691 301675 299277 297307 295911 295199 294893 294506 293734 292636 291519 290668 290055 289289 287989
61575 287989 286283 284808 284073 283908 283728 283275 282880 282891 283117 283062 282598 282032 281513 280771 279654 278568 278070 278255
61557 278255 278933 280130 281903 283759 284907 285197 285284 285707 286348 286956 287605 288305 288731 288798 289009 289738 290636 291345
61539 291345 292341 294246 296594 298220 298884 299684 301621 304510 307529 310230 312566 314386 315399 315521 314999
61524 314999 314230 313502 312755 311623 309931 308080 306690 305908 305374 304718 303756 302386 300885 300147 300916 302670
61508 302670 303915 303807 302887 302020 301299 300390 299412 298832 298756 298743 298247 297103 295784 295260 296203 298185 300013 300977
61490 300977 301307 301334 300924 300028 299156 298777 298749 298814 299166 299982 300898 301551 302266 303521 305013 305973 306226 306240 306288 306207
61470 306207 306008 306048 306553 307459 308739 310357 311857 312574 312410 311936 311658 311593 311709 312235 313267 314446 315372 316129
61452 316129 317126 318578 320263 321710 322516 322675 322700 323169 324046 324672 324589 324164 324180 324978 326294 327885 330011 333185
61434 333185 337582 342770 347907 352144 354999 356608 357624 358655 359778 360779 361862 363695 366484 369410
61420 369410 371552 373216 375709 379698 384364 388397 391344 393622 395630 397321 398460 398910 398763 398366 398084
61405 398084 397790 396835 394747 391773 388494 385157 381715 378281 375105 372239 369606 367418 366116 365780 365845
61390 365845 365561 364635 363441 362598 362322 362141 361406 360081 358798 358051 357654 357244 357031 357672 359552 362485 365989
61373 365989 369493 372436 374578 376286 378129 380118 381599 382039 381701 381409 381816 383046 384925 387299 390041
61358 390041 392907 395673 398478 401833 406061 410911 416002 421533 428138 436018 444661 453558 462812 472741
61344 472741 483106 492974 501253 507295 511254 514006 516472 518900 520950 522448 523664 524774 525534 525703
61330 525703 525363 524545 522940 520273 516650 512247 507086 501496 496392 492652 490417 489311 489015 489274 489716
61315 489716 490231 491313 493513 496659 500080 503532 507511 512721 519546 527955 537596 548015 558993 570536
61301 570536 582484 594385 605846 616488 625282 630579 631453 628614 623446 616552 607971 598376 589030
61288 589030 580522 572392 564121 555801 547678 539729 532008 524875 518600 513149 508546 505043 502715 501279
61274 501279 500605 501100 503289 507130 511982 517162 522388 527691 532983 537873 542147 546382 551700 558639 566666
61259 566666 575177 584639 596132 609874 624752 639333 652808 664870 675181 683311 689004 692331
61247 692331 693632 693313 691580 688427 683996 678783 673285 667551 661345 654638 647744 641081 634941 629374
61233 629374 624162 619131 614563 610922 608057 605231 602252 599993 599293 599894 601145 603234 606808 611646 616622
61218 616622 621008 625019 629064 633206 637416 641635 645459 648369 650426 652246 654180 655975 657251 657812
61204 657812 657543 656622 655819 656010 657374 659603 662824 667612 674179 682406 692707 705927 722114 740197
61190 740197 759196 778843 798596 816905 832134 843681 851690 856361 858255 858747 859168 859603 859161 857332
61176 857332 854485 851075 846981 841781 835296 827638 818968 809369 798922 787827 776404 764890 753176
61163 753176 740871 727696 713787 699611 685669 672180 658959 645695 632599 620655 610931 603658
61151 603658 598248 594225 591749 591225 592690 595748 599799 604135 607918 610206 610110 607149 601656 594637 587004
61136 587004 579113 571275 564369 559427 556664 555397 554909 555018 555923 557960 561597 567260 575042 584784 596337
61121 596337 609509 623943 639496 656546 675467 695947 717350 739634 763250 788147 813495
61110 813495 838490 862901 886637 909272 930218 949042 965617 980309 993973 1007202 1019430
61099 1019430 1029141 1035023 1036606 1033856 1026777 1015512 1000450 982050 960833 937473 912608 886668
61087 886668 860299 834692 810828 788515 766798 745335 724706 705399 687312 670454 655442
61076 655442 642887 632719 624360 617207 610800 604902 599657 595418 592342 590348 589371 589334 589951 590936 592311
61061 592311 594211 596604 599469 602937 606874 610822 614843 619921 626839 635234 644546 655279 668213 682858
61047 682858 697952 713283 729735 747710 766802 787085 809333 833691 859323 885677 913076
61036 913076 941743 971266 1001360 1032218 1063805 1095655 1127678 1160498 1194914 1231666 1271482
61025 1271482 1314416 1359276 1404666 1450336 1496593 1543070 1589601 1637919 1690774 1749606 1814761
61014 1814761 1887618 1970387 2063785 2166979 2279878 2403801 2540741 2695177 2876780 3098610
61004 3098610 3372927 3712336 4134778 4662859 5318743 6127241 7126916 8370937 9911022
60995 9911022 11782765 13999893 16530024 19236373 21839490 23981685 25390631 26021011
60987 26021011 26056322 25787329 25489151 25372858 25568323 26071281 26685127 27057424 26838139
60978 26838139 25852859 24159108 21968163 19527476 17050937 14700368 12580325 10735263
60970 10735263 9162559 7838379 6735104 5823406 5072245 4454334 3949169 3539013 3205382
60961 3205382 2931206 2703247 2510654 2343921 2197079 2068280 1956257 1857898 1770525 1694188
60951 1694188 1629696 1575984 1530962 1493379 1462081 1434670 1408589 1382743 1356871 1330339 1302783
60940 1302783 1275101 1248589 1223769 1200890 1180535 1162722 1146293 1130389 1115804 1103779 1094214
60929 1094214 1086176 1079598 1075290 1073609 1074169 1076731 1081481 1088413 1097069 1106834 1117099 1127224 1136627 1144862
60915 1144862 1151593 1156762 1160637 1163167 1163412 1160358 1154251 1146272 1136881 1125465 1111754 1096488 1080354
60902 1080354 1063312 1045470 1027622 1010281 993010 975282 957249 939156 920838 902421 884748
60891 884748 868368 852724 837021 821375 806488 792635 779608 767207 755229 743265 731000
60880 731000 718466 705798 693073 680576 668792 657960 647960 638674 629961 621423 612926 605260
60868 605260 599396 594964 590416 584796 578478 572061 565689 559708 554763 550713 546500 541639 536875 532865
60854 532865 529191 525264 521160 516968 512267 506955 501687 496904 492397 488422 485991 485163 484229 481736 478351
60839 478351 475469 472835 468952 463291 456718 450091 443691 437938 433413 430099 427441 425220 423637 422600
60825 422600 421713 420992 421037 422411 425155 428743 432232 434775 436393 437931 439985 442326 444659 447184 449878
60810 449878 451937 452765 453021 453875 455572 457383 458634 459094 458675 457463 455865 454216 452493 450715 449145
60795 449145 447666 445597 442731 439913 437860 435933 432922 428606 423766 419060 414668 410664 406933 403017
60781 403017 398728 394593 391005 387442 383325 379191 376042 373865 371762 369271 366578 363663 360359 357249
60767 357249 355486 355507 356669 358272 360138 362151 363968 365503 367114 369110 371438 373917 376386 378704 381037
60752 381037 384008 388089 392912 397670 402052 406314 410624 414939 419403 424230 429100 433123 435391 435284
60738 435284 432513 427437 421185 414921 408992 403122 397208 391392 385605 379657 373677 367969 362537 357257
60724 357257 352345 348095 344363 340837 337676 335293 333611 332124 330606 329228 328009 326664 324970 322928
60710 322928 320718 318816 317865 317888 317946 317227 316196 315967 316725 317535 317680 317438 317457 318072 319347 321195 323253 325035
60692 325035 326388 327533 328708 330102 332031 334767 338212 342075 346262 350811 355619 360632 366047 371986
60678 371986 378247 384778 392034 400298 408875 416556 422727 427639 431868 435943 440086 443715 445540 444832
60664 444832 442289 439083 435486 431172 426380 421758 417292 412418 407127 402076 397641 393743 390523 388288
60650 388288 386744 385188 383614 382807 383232 384534 386192 387799 388611 387666 384709 380397 375505 370511 365964
60635 365964 362402 359707 357211 354637 352312 350383 348647 347276 346854 347394 348073 348314 348454 348959 349643 350073
60619 350073 350255 350516 351110 352165 353584 354811 355187 354777 354421 354829 356054 357917 360282 362757 364733 366010
60603 366010 366894 367512 367600 367144 366615 366316 366101 366022 366678 368521 371292 374408 377469 380167 382261 383942 385719
60586 385719 387588 388796 388757 387771 386582 385731 385653 386783 389046 391623 393771 395648 397979 401210 405329 410227
60570 410227 415820 422005 428892 436997 446953 459112 473515 490037 508338 527755 547250 565375
60558 565375 580441 591128 597020 598377 595512 588767 578979 567450 555439 544012 534221 526821 521856
60545 521856 519151 519150 522519 528921 537110 546565 558232 573262 591726 613078 637230 664399 694170
60532 694170 725100 755016 781461 802364 816766 824749 826516 822098 812201 798654 783400 767401
60520 767401 750978 734807 719908 706875 695744 686450 678897 672686 667364 663031 660312 659540 660247
60507 660247 661666 663645 666951 672638 681203 692567 706889 725093 748255 776852 811214 852471
60495 852471 902117 960320 1025312 1094853 1167695 1243053 1319048 1392398 1459637 1518223 1566453
60484 1566453 1602702 1625009 1631427 1620845 1593540 1550972 1495236 1428821 1354622 1275690 1194890
60473 1194890 1115015 1038965 969171 906642 851003 801543 757890 719671 686214 656932 631610
60462 631610 609975 591296 574675 559565 545828 533551 522941 514152 507007 501049 495879 491278
60450 491278 487066 483125 479522 476206 472695 468507 463901 459708 456393 453761 451614 450071 449084 448183 446985
60435 446985 445608 444401 443647 443548 444054 444573 444376 443395 442116 440648 438518 435611 432648 430339 428590 426966
60419 426966 425452 424363 423818 423668 423708 423712 423529 423352 423629 424520 425719 426863 427819 428571 429251 430308 432151 434517
60401 434517 436649 438153 439221 440000 440434 440818 441877 444040 447136 450896 455074 458970 461589 462634 462805
60386 462805 462905 463220 463890 465131 466861 468847 471404 475091 479444 482985 484954 486172 487767 489961 492676
60371 492676 496189 500341 504028 506494 508486 511104 514137 516523 517938 518825 519266 519064 518752 519424 521430
60356 521430 524158 527271 531393 537362 545401 555254 566722 579963 595476 613672 634024 654729 673601
60343 673601 689279 701269 709062 711804 708996 701196 689890 676722 662777 648543 634500 621438
60331 621438 609810 599135 588788 579287 571837 566440 561556 556102 550695 546251 542333 537965 533292
60318 533292 529301 526325 523981 522305 521841 522660 524251 526507 530063 535594 543406 553798 567287 584383
60304 584383 605522 631076 661038 694776 731256 768948 805084 835620 856963 867625 867702 857287
60292 857287 836494 806903 771892 735194 699584 666828 637969 613311 592569 575261 560782
60281 560782 548392 537732 529237 523403 519667 516606 513253 509589 505748 501460 496566 491519 487046 483508
60267 483508 480774 478457 476191 473916 471925 470465 469342 468154 466830 465677 464967 464676 464583 464478 464401 464722
60251 464722 465742 467139 468210 468760 469255 469934 470357 470187 469845 469948 470642 471867 473646 475548 476517 476005 474788
60234 474788 474032 474027 474428 475103 475898 476273 476196 476894 479517 483358 486472 487889 488176 488108 488052 488596 490471 493493
60216 493493 496581 499082 501261 503415 505494 507862 511450 516663 522852 529201 535484 541656 547429 552674
60202 552674 557698 562728 567523 571737 575306 578292 580783 582979 584967 586382 586821 586589 586411 586368 585748 584143
60186 584143 582055 580159 578514 576774 574792 572738 570902 569459 568261 566977 565739 565313 566066 567048 566909
60171 566909 565623 564484 564366 564782 564822 564230 563297 562272 561209 559959 558235 556070 554141 553030 552245 550687
60155 550687 548119 545501 543837 543322 543661 544450 545199 545741 546752 549135 552779 556700 560395 564143 567877
60140 567877 570917 573210 575808 579506 583828 588014 592245 597238 603182 609748 616653 623597 629997 635318
60126 635318 639466 642540 644581 645819 646684 647184 646737 644977 642402 639935 638232 637606 638159 639693 641879
60111 641879 644693 648194 651775 654380 655747 656686 657678 657970 656587 653629 649899 645835 641421 636724 631835
60096 631835 626676 621474 617073 614114 612165 610357 608649 607821 608300 609616 611069 612459 614109 616460 619649
60081 619649 623283 626679 629530 632140 634769 636963 637757 636396 632701 627029 620117 612714 605023 596691
60067 596691 587619 578498 570257 563131 556585 550018 543251 536436 529786 523434 517489 512215 508013 504960
60053 504960 502446 499727 496904 494889 494247 494513 494949 495463 496364 497571 498678 499751 501551 504765 509160
60038 509160 513617 517045 519275 521037 523018 525097 526634 527245 527014 526136 524794 523241 521525 519142 515482
60023 515482 510594 505105 499425 493530 487527 481807 476560 471690 467374 464097 461971 460503 459226 458081
60009 458081 457019 455821 454584 453838 453851 454168 454142 453578 452727 452007 451821 452211 452540 451950 450280 448125 446064
59992 446064 444439 443844 444924 447315 449596 450802 451470 452752 454984 457588 459889 461555 462552 463120 463546
59977 463546 463711 463147 461732 459927 458165 456404 454422 452107 449365 446371 444078 443720 445505 448391 451449
59962 451449 454726 458497 462510 466613 471316 476969 482857 487807 491282 493266 493623 492366 490294 488537
59948 488537 487506 486768 485823 484486 482648 480219 477377 474577 472295 470788 469875 468835 466921 464185 461505
59933 461505 459681 458925 459293 460969 463769 466948 469925 472816 475926 479222 482669 486521 490827 495105 499000
59918 499000 502870 507321 512559 518611 525645 533543 541536 548775 554971 560075 563681 565274 564869 563123
59904 563123 561016 559540 559147 559180 558319 555939 552605 549091 545587 542192 539389 537452 536017 534809 534253
59889 534253 534804 536249 538313 541374 545859 551320 556791 561809 566604 571639 577368 583932 590642 596378
59875 596378 601055 606030 612297 618796 623331 624770 623604 620799 616953 612382 607232 601514 595479 589762
59861 589762 584745 580176 575733 571512 567522 563402 559201 555796 553837 552901 552475 553099 555598 559725 564600
59846 564600 570160 577221 586311 597194 609124 620715 629984 635579 637875 638196 637424 636225 635986 638106
59832 638106 642359 646949 650174 651182 649369 644346 636682 627728 618480 609317 600716 593203 586388 579049
59818 579049 570623 562055 554908 550110 547641 546832 546726 546506 545793 544450 542317 539334 535572 530893 525109
59803 525109 518883 513725 510402 508006 505413 502971 501664 501199 500283 498508 496679 495357 494319 493483 493174
59788 493174 493295 493279 493063 493199 493846 494517 494966 495478 496145 496691 497023 497209 496939 495917 494707 494244 494476 494550 494353
59769 494353 494737 496002 497290 497895 498169 498679 499308 499704 499933 500258 500826 501830 503436 505400 507360 509543
59753 509543 512527 516282 520185 524023 528138 532602 537129 541884 547316 553060 558047 562002 565719 569519
59739 569519 572516 573962 574382 574797 575590 576667 577946 579104 579522 579001 577987 576729 574958 572745 570872
59724 570872 569844 569257 568631 568055 567433 565900 562819 558840 555240 552588 550605 548904 547281 545645 544170
59709 544170 543221 542769 542286 541564 541147 541578 542709 544160 545907 547956 550012 552021 554511 557727 560901 563071
59693 563071 564380 565802 567760 569625 570603 570554 569906 569185 568767 568802 569249 569987 570836 571432 571272 570033 567774
59676 567774 564765 561233 557296 553024 548544 544133 540025 536051 531723 526891 522007 517450 513024 508554
59662 508554 504593 501869 500336 499398 498870 499058 500066 501711 503935 506654 509464 512171 515265 519015 522488
59647 522488 524529 525395 526167 526740 525878 523369 520656 518839 517315 514983 511733 508182 504842 502114 500272
59632 500272 498968 497538 496119 495593 496121 496697 496526 495798 494688 492740 489859 486885 484487 482384 480248
59617 480248 478301 476365 473474 469332 465147 462063 459738 457530 456109 456531 458359 460055 460941 461596 462579
59602 462579 463832 465234 466798 468367 469812 471347 473007 474156 474215 473607 473161 472893 472181 471004 470135 470121
59586 470121 470731 471449 471909 471840 471112 469947 468754 467743 466854 465905 464568 462493 459758 456976 454663 452807
59570 452807 451206 449882 448912 448272 448093 448642 449853 451294 452740 454206 455292 455309 454357 453447 453141 452931 452450
59553 452450 452316 453064 454120 454828 455723 457762 460800 463975 467252 471479 477013 483306 489948 497343 506235
59538 506235 517250 531101 548641 569991 593301 614372 628234 632138 627429 618070 607348 596594
59526 596594 586725 579323 575382 574207 574612 576424 579836 584018 587535 589713 590656 590285 588256 584535 579207
59511 579207 572053 563100 553294 543846 535134 526845 518797 510987 503323 496025 489824 485000 480762 476389
59497 476389 472421 469802 468335 467054 465720 464798 464251 463488 462408 461474 460771 459950 459144 459063 460129 462173
59481 462173 464884 467863 470467 472459 474658 478119 482778 487675 492331 496944 501396 505161 508300 511529
59467 511529 515030 517986 519621 520100 520196 520583 521585 523168 525043 527182 530154 534574 540363 547035 554443
59452 554443 562713 571731 581325 591562 602127 611762 619284 624986 629933 633919 635244 632752 627081 619519
59438 619519 610598 600417 589626 579311 570183 562383 555900 550786 547033 544545 543260 543162 544185 546199
59424 546199 549181 553455 559686 568408 579557 592574 606896 622152 638198 655464 675054 697916
59412 697916 723980 752542 782642 811708 834231 844114 839384 823604 802310 779551 758230 741340
59400 741340 730903 726997 729304 738104 751632 763733 766908 757899 738928 714200 687280 661301
59388 661301 638903 620939 606580 595038 586031 578733 572036 566140 562300 560676 559959 559466 560037 562242
59374 562242 565173 567760 570130 572919 576311 580394 585497 591507 597668 603581 609657 616162 622689 629035
59360 629035 635700 642963 650218 656770 662703 668563 674782 681736 689717 698535 707679 717107 727280 738337
59346 738337 749933 761980 774807 788420 802338 816199 829769 842298 852727 860570 865775 867770
59334 867770 865725 859855 851362 840942 828427 814060 798868 783461 767688 751904 737327 724562
59322 724562 712947 701993 692299 684333 677413 670783 664716 659555 654551 648825 642966 638540 636211 635145
59308 635145 634190 633001 632101 632294 633948 636627 639599 642761 646766 652257 659561 669154 681665 697053
59294 697053 714131 730884 744664 752254 750992 740563 723291 702384 680368 659073 640004 624049
59282 624049 611334 601666 594683 589617 585732 583244 583020 585240 589241 594874 602902 613589 625840 638363
59268 638363 650933 663910 677155 689943 701457 710972 718107 723156 726578 728000 726429 721601 714311
59255 714311 705270 694657 683074 671845 661867 653084 645455 639411 634848 630791 626753 623518 621860
59242 621860 621419 621588 622613 624956 628326 632157 636443 641313 646346 651014 655323 659436 663219 666612 669773
59227 669773 672349 673349 672309 669861 666594 662241 656653 650774 645751 641675 637926 634150 630234 626031
59213 626031 621856 618595 616594 615024 613041 610867 608997 607091 604543 601508 598497 595559 592740 590663
59199 590663 589653 588878 587411 585671 584667 584213 583117 581009 578817 577355 576452 575768 575630 576614 578692 581164
59183 581164 583342 585175 587161 589565 591913 593662 595185 597400 600472 603725 606994 611063 616367 622275
59169 622275 628204 634647 642366 651338 661118 671504 682125 692055 700599 707886 714083 718658 721134 721896
59155 721896 721511 719807 716341 711184 704578 696431 686891 676800 666828 656738 646228 635828 626205
59142 626205 617179 608324 599925 592383 585204 577575 569620 562208 555816 550349 545802 542373 540115 538966
59128 538966 538792 539023 538836 538191 538039 539087 541166 544322 549431 556825 565302 573570 581859 591028 600914
59113 600914 610794 620807 631567 642823 653727 664013 673764 682404 689165 694246 698444 701997 704787
59100 704787 707236 709701 711349 710879 708243 704589 700723 696685 692565 688570 684496 680227 676543 674319
59086 674319 673119 671731 669826 667873 665643 662218 657545 652638 648023 643123 637397 630982 624007 616350
59072 616350 608459 601446 595929 591405 587071 582675 578393 574484 571200 568504 565892 562974 560044 557498
59058 557498 555002 551993 548800 546370 544979 544030 542999 541773 540182 538108 536062 534801 534324 533954 533406
59043 533406 533002 532880 532779 532703 533066 534055 535340 536450 537036 536975 536693 537086 538594 540715 542932 545611 549291
59026 549291 553692 558383 563972 571582 581463 593041 606015 620301 635114 649130 661514 671964
59014 671964 679961 684858 686566 685384 681572 675795 669442 663463 657482 651188 645964 643679 644278 646069
59000 646069 648143 650966 654773 659090 663944 669910 676652 682846 687886 692288 696086 698218 698023 696163
58986 696163 693550 690431 686915 683257 679165 673905 667646 661737 657165 653666 650827 649122 649286 651492
58972 651492 655687 662037 670427 680097 690252 700642 711336 722467 734369 747325 760869 773861
58960 773861 785504 795895 805485 814364 822022 827407 829354 827382 821814 812848 800214 784484 767823
58947 767823 752219 737467 722170 706324 691466 678521 667119 657085 649008 643013 638257 634022
58935 634022 630256 626831 623381 620060 617392 615237 612968 610713 609232 608494 607626 606377 605294 604306 602548
58920 602548 599907 597337 595233 592813 589649 586585 584554 583538 583198 583485 584226 585084 586328 588613 591805
58905 591805 595157 598913 604442 612395 621961 632374 643802 656231 668872 681385 694479 708474
58893 708474 722356 735082 746951 759045 772232 787295 805019 825396 847460 870325 893497
58882 893497 915785 935160 950451 962197 971145 976804 978172 975049 967910 957242 943648 927955
58870 927955 910773 892595 874549 858103 843714 830780 819183 809680 802310 795685 788595 781194
58858 781194 773872 766030 756858 746483 735507 724134 712464 701047 690489 680992 672627 665468 659240
58845 659240 653536 648450 644136 639762 634032 626858 619248 611484 602867 593545 584951 577866 571528 565270
58831 565270 559568 554765 550239 545662 541755 539044 537178 536110 536463 537951 539043 539179 539733 541771 544446
58816 544446 546871 549944 554770 560595 565897 570432 574717 578559 581613 584434 587396 589466 589556 588332 587142
58801 587142 585906 583699 580810 578517 577041 575206 572096 567851 562997 558012 553450 549588 546121 542879
58787 542879 540447 539397 539430 539957 541010 542803 544939 546848 548574 550557 553145 556743 561643 567185 571930
58772 571930 575194 577420 578589 577603 574101 569519 565255 560951 555771 550135 544802 539314 532959 526563
58758 526563 521765 518999 517535 516989 517580 519250 521703 524886 528501 531595 533594 535184 537205 539431 541436
58743 541436 543900 547814 552957 558327 563613 569190 575131 581254 587706 594670 601950 609533 617880 626946
58729 626946 635774 643821 651730 659912 667382 673018 677020 680185 682809 685368 689075 694485 700582 706579
58715 706579 713476 722465 732860 743168 753120 762933 771469 777047 779529 779881 778195 773759 766588 757214
58701 757214 745288 729970 711546 691368 670441 649190 628215 608116 588993 571081 555292
58690 555292 542156 531031 521320 513430 507389 501755 495386 489161 484364 480436 476068 471525 468034 465755
58676 465755 464194 463679 464419 464981 463885 462079 461768 463420 466137 470274 477235 486951 498020 510218 524511
58661 524511 540392 555418 567706 577024 583265 585764 584521 580468 574290 566414 558061 550617 543868
58648 543868 536507 528387 520711 514137 508342 503378 499679 496750 493543 490158 487572 485896 484627 484408
58634 484408 486489 490449 494469 497956 501856 506156 509239 510252 510250 510328 510298 509869 509639 510205 511480 513337 515920
58617 515920 519172 523135 528590 536135 544794 552953 560354 567603 574096 578373 580365 581251 581115 578904 574922
58602 574922 571180 568729 566620 564048 561556 559451 556926 553663 550688 548726 547099 545149 543500 543094
58588 543094 544019 545981 549086 553662 560028 568607 579363 591163 602690 613849 625162 636044 645097
58575 645097 651979 657552 662328 666228 669803 674073 679187 684724 691339 700508 712682 727201 743961
58562 743961 763582 785907 809905 834979 860817 886124 909163 929355 946612 959477 966051 966755
58550 966755 964147 959961 954235 947219 939840 932045 922861 912494 902376 892753 882140 869442 854763
58537 854763 838018 818807 798042 777704 758669 740500 723457 708664 696208 685244 676123 670184
58525 670184 667173 665147 663329 662887 664502 667299 670503 674027 677106 678597 678937 679591 680368 679632 677296
58510 677296 675070 673453 671128 667733 664485 661557 657618 652576 648041 644427 640435 636071 633161 631919
58496 631919 630036 626336 622443 619566 616564 612697 609558 608609 609217 610658 613670 618574 624146 629772 636492
58481 636492 644709 653232 661830 672217 685211 699433 714023 729836 746378 760389 769362 773995
58469 773995 775489 773077 766242 756898 747130 736867 725763 715290 706945 700334 694943 691899 692147 694715
58455 694715 698544 704214 712257 721660 731574 742473 753997 763654 769321 771216 770086 765640 758266 750066
58441 750066 742556 735353 728397 723082 719790 716878 713771 712420 713971 716560 718296 719884 722472 725495
58427 725495 728640 733388 740583 748911 757612 768021 780477 792527 802248 810510 817805 821957 821540 818598
58413 818598 815251 810460 802933 794356 786686 778864 769418 759837 752140 745351 737655 730014 724559 721283
58399 721283 719219 718892 720727 723035 724436 726325 730286 735154 739256 743170 747485 750344 750279 749133 749095
58384 749095 749240 748082 746977 747618 748587 747966 747110 748264 750627 752441 754828 759808 766403 772381 778120
58369 778120 785195 793014 800274 807949 817407 827500 836848 846885 859111 871539 881612 890599 901324
58356 901324 913497 924958 935454 945397 953061 956920 958815 961072 962708 962269 961863 964138 967722 970079
58342 970079 972572 978012 985433 992180 999170 1009193 1021739 1034364 1047471 1062893 1079458 1094762
58330 1094762 1109713 1126467 1143494 1157519 1168677 1178876 1186920 1190458 1191137 1192564 1194572 1194626 1193347
58317 1193347 1193492 1194962 1196130 1198533 1204811 1213425 1220892 1227893 1237726 1250110 1262112 1273843 1287612
58304 1287612 1302769 1316957 1331148 1347801 1365506 1381163 1395891 1412871 1430932 1446477 1460267
58293 1460267 1475905 1493016 1508411 1522767 1539617 1558830 1577542 1596388 1618369 1642817 1666902
58282 1666902 1691622 1719648 1749045 1776080 1802410 1832171 1863899 1893215 1921655 1954457 1991080
58271 1991080 2026532 2060938 2099025 2140986 2182730 2224504 2270379 2319778 2368336 2416578 2468741
58260 2468741 2523777 2576700 2628143 2683019 2740441 2794859 2846604 2901231 2959036 3015746 3073047
58249 3073047 3137391 3208505 3280254 3352793 3432444 3519563 3608472 3699695 3800079 3910285 4024463
58238 4024463 4142748 4271316 4409669 4551239 4697200 4855839 5027496 5204528 5387230
58229 5387230 5584788 5799227 6023981 6259866 6516336 6795173 7089701 7402079 7743911
58220 7743911 8117722 8516143 8941655 9407869 9919084 10469441 11065100 11725138 12457287
58211 12457287 13256629 14132435 15111182 16208624 17426677 18784337 20323170 22076452
58203 22076452 24065837 26338384 28974522 32052774 35648745 39886503 44955923 51073105
58195 51073105 58480700 67517724 78651018 92434472 109522784 130770595 157210619
58188 157210619 189747141 228660990 273051400 320220164 365271687 401674389 423216545
58181 423216545 426516909 412391036 385129144 350380564 313131521 276693341 242685822
58174 242685822 211582172 183378443 158038094 135575912 115953204 99035463 84640870
58167 84640870 72553009 62487153 54112903 47133540 41316237 36455765 32360758 28884997
58159 28884997 25931981 23416648 21251388 19372686 17746687 16337590 15096559 13988012
58151 13988012 12999695 12118064 11317159 10579294 9904228 9289573 8721888 8194075 7712166
58142 7712166 7277392 6878834 6510216 6176907 5879892 5608849 5357091 5127676 4918666
58133 4918666 4717653 4517564 4324105 4141536 3964727 3791236 3627818 3478290 3336992
58124 3336992 3200373 3073471 2959012 2851270 2746606 2649440 2562211 2479802 2399449 2326029
58114 2326029 2261928 2201332 2140020 2081457 2027854 1974501 1918551 1864570 1815715 1767774 1717505
58103 1717505 1668887 1625520 1584372 1542429 1502278 1465840 1429591 1391288 1354819 1323373 1294089
58092 1294089 1264238 1236395 1212751 1190347 1166731 1144635 1126570 1110304 1093806 1079123 1067275
58081 1067275 1054867 1039836 1025105 1012651 999403 982905 965542 949232 931459 910634 889999
58070 889999 872022 854133 834274 815547 801023 788782 776391 765559 758010 751262 742952 735157
58058 735157 730177 726040 720243 714010 708805 702540 693300 683212 674783 666900 658036 649768 643564 637736
58044 637736 631050 625638 622864 620097 615120 609858 606091 601448 593670 585120 578895 573834 567516 560918
58030 560918 555915 551199 544824 537979 532199 525584 515856 504695 495171 487231 479425 472642 468283 464873
58016 464873 460189 454770 450119 445626 440548 436633 435348 434739 432490 429893 429367 430190 430222 429831 430558 431698
58000 431698 431658 431146 431766 433014 433632 434316 436137 437949 438261 438037 438787 439580 438651 436361 433958 431192 427652
57983 427652 424475 422186 418945 413563 407943 403813 399529 393214 386587 382188 379039 374794 370231 367761
57969 367761 367015 365730 363815 362972 363259 363366 363353 364080 364909 364986 365603 368267 371571 372997 372717 372543 372299 370417
57951 370417 367197 364305 361798 358652 355465 353740 353216 352691 352705 354577 357580 359930 361956 365512 370867
57936 370867 376778 383039 390446 398867 407832 418273 431213 445343 458222 469043 478102 484736 488323
57923 488323 490127 491499 491321 487931 482406 477060 471844 465303 458003 451677 445737 438105 429145 421482
57909 421482 416035 411325 406664 403039 400676 398437 395778 392902 389106 383462 376969 371580 367264 362455
57895 362455 357087 352640 349449 346580 344178 343334 343730 344071 344755 347477 352114 356579 359915 363067 366471
57880 366471 369385 371793 374544 377260 378389 377596 376019 374022 370892 366927 363560 361149 358689 356011
57866 356011 354234 353814 354014 354449 355352 356256 356281 355643 355197 354770 353835 353346 354736 357485 359914 361995 364905
57849 364905 368155 369903 370067 370397 371282 371173 369488 367492 365782 363370 359815 355942 351878 346646 340344
57834 340344 334561 329987 325624 320886 316506 312857 309393 306243 304426 304017 303974 304115 305303 307401 309196
57819 309196 310649 313027 316409 319298 321210 323385 326327 328910 330610 332367 334380 335155 333671 330565
57805 330565 326373 320623 313538 306728 301221 296583 292742 290797 291099 292394 293774 295743 298472 300801
57791 300801 301994 302824 303988 305049 305815 307167 309572 312295 314892 317918 321391 324191 325860 327422 329625
57776 329625 331992 334413 337911 342813 347707 351270 353689 355389 355921 355113 353854 352675 350862 347850 344177
57761 344177 340221 335492 330049 325198 321831 319332 316885 314470 311853 308248 303924 300640 299414 299294
57747 299294 299310 300091 302428 305618 308467 310767 312725 314051 314688 315323 316328 317215 317801 318624 319500 319197 317450
57730 317450 315768 315211 314780 313169 310715 308431 306331 303951 301437 298949 296001 292441 289087 286464 283946
57715 283946 280943 277822 274866 271607 268027 265090 263117 260956 257756 254295 251546 249177 246494 243574
57701 243574 240565 237178 233857 231934 231599 231209 229735 228303 228018 227971 226971 225700 225364 225524 225147 224690
57685 224690 225277 226671 227852 228921 230765 233489 236778 241235 247919 257042 268388 282445 300028 321640
57671 321640 348454 383004 427520 482320 546918 621203 703126 785377 856165 903767 920475
57660 920475 904327 859786 796678 726146 656263 591103 532636 481957 439170 403675 374789
57649 374789 351457 331994 315156 300958 289580 280169 271782 264758 259923 256980 254828 252881 250996
57636 250996 248814 246380 244747 244642 245133 244841 243881 243283 243084 242486 241504 240966 240990 240712 239517 237593 235431
57619 235431 233543 232374 231704 230646 228883 227291 226590 226246 225577 224974 224898 224604 223152 220914 218809 216830
57603 216830 214594 212576 211388 210600 209656 209150 209729 210470 210028 208785 208188 208386 208142 206719 204408 201577
57587 201577 198658 196599 195844 195261 193551 191207 189572 188572 187176 185533 184651 184226 182804 180158 177653
57572 177653 176091 174863 173446 172159 171230 170491 170119 170361 170525 169615 167889 166402 165168 163334 161067 159603
57556 159603 159365 159574 159826 160487 161417 161902 162009 162488 163182 163156 162563 162681 163785 164652 164589 164343 164555 164907 165362
57537 165362 166644 168792 170661 171570 172125 172777 172928 172243 171553 171585 171876 171767 171502 171550 171735 171848 172331 173616
57519 173616 175392 177167 179029 181455 184853 189516 195382 201661 207405 212581 217841 223234 228033 231843
57505 231843 234864 237025 237990 238164 238537 239223 239256 238058 236040 233525 230271 226390 222569 218976 215078 210908
57489 210908 207342 204636 201857 198343 194693 191755 189632 188185 187503 187271 186622 185255 183867 182986 182213
57474 182213 181100 179907 178969 178113 177162 176203 175055 173364 171577 170819 171353 172169 172560 173033 174066 174992 174920
57457 174920 174016 173192 173087 173818 175064 176053 176182 175932 176352 177522 178497 178933 179474 180215 180218 179245 178598 179315 180707
57438 180707 181583 181882 182050 181853 180971 179987 179634 179681 179562 179574 180395 181823 182979 183467 183528 183379 183096 182880 182783
57419 182783 182421 181529 180536 180121 180492 181419 182595 183624 184131 184197 184233 184229 183745 182833 182211 182216 182373 182289 182110 181679
57399 181679 180301 177993 176042 175544 176128 176833 177503 178532 179867 181126 182251 183332 184197 184772 185489 186839
57383 186839 188807 191062 193186 194560 194762 194344 194354 194793 194548 193278 192214 192357 192990 192880 191991 191044 190256
57366 190256 189656 189916 191637 194187 196364 197955 199700 201949 204200 205850 206727 207102 207670 209206 211730
57351 211730 214351 216394 218223 220447 222878 224849 226098 226765 227010 227178 227829 229065 230305 231158 231909 232728
57335 232728 233203 233166 233183 233533 233552 232760 231795 231368 231097 230387 229724 229998 231103 232326 233629 235378 237156 238008
57317 238008 237773 237218 237012 237374 238501 240379 242229 243002 242543 241686 241221 241299 241774 242589 243808 245441 247195
57300 247195 248382 248598 248527 249340 251088 252577 253173 253706 255027 256756 258293 260020 262424 264852 266318 267000
57284 267000 267793 268848 269601 269875 269969 269993 269975 270248 270927 271410 271185 270657 270394 270171 269675 269510 270497 272452 274721
57265 274721 277407 280991 285124 288935 292242 295536 299017 302543 306142 309724 312747 315088 317718 321494
57251 321494 325834 329630 332900 336368 339977 343201 346402 350405 354891 358637 361340 363985 367348 371233
57237 371233 375189 378919 382006 384190 385866 387554 389208 390887 393506 397721 402551 406468 409515 412924
57223 412924 417032 421126 425180 429937 435200 439705 443090 446461 450609 455061 459337 463813 468729 473492
57209 473492 477605 481355 485119 488922 493076 498330 504875 511989 519084 526385 534334 543025 552433 562423
57195 562423 572416 581866 591154 601121 611604 621529 630710 640511 652269 665945 680755 696388 713142
57182 713142 731400 751220 772086 793066 813758 834832 856933 879312 900512 920201 939285
57171 939285 958430 977703 997503 1018428 1040074 1061356 1082270 1103972 1126763 1149441 1171136
57160 1171136 1192510 1214434 1236672 1258692 1280849 1303899 1327972 1352664 1377624 1402642 1427731
57149 1427731 1453426 1480400 1508650 1537719 1567752 1599449 1632947 1667731 1703712 1741298 1780275
57138 1780275 1819853 1860103 1902129 1946471 1992584 2040313 2090590 2144075 2200297 2258728 2319591
57127 2319591 2382975 2448349 2515781 2586631 2662288 2743100 2829142 2920966 3018873 3122510 3232110
57116 3232110 3349296 3475881 3612724 3760597 3921355 4097387 4290671 4503191 4737652
57107 4737652 4997133 5284820 5605031 5964128 6370174 6832735 7364001 7979671 8698747
57098 8698747 9544094 10544815 11737966 13167701 14883487 16938925 19389527 22287983
57090 22287983 25678678 29592996 34043957 39019705 44478689 50347873 56521720 62862247
57082 62862247 69205197 75371504 81171762 86395380 90798460 94116997 96113448 96632955
57074 96632955 95636346 93197725 89479456 84702878 79122482 73002190 66593168 60117418
57066 60117418 53760896 47674051 41973644 36742556 32029478 27851336 24198281 21039736
57058 21039736 18331264 16021960 14060342 12397098 10986075 9785709 8760618 7881594
57050 7881594 7124148 6467450 5894204 5390634 4946140 4552883 4204947 3896923 3622993
57041 3622993 3377631 3156911 2958547 2780612 2620726 2476584 2346785 2230723 2127719
57032 2127719 2036584 1956256 1886742 1829138 1784797 1755060 1742049 1749174 1780218 1837793 1921545
57021 1921545 2024755 2130340 2211978 2244091 2214424 2128095 2000620 1848725 1686666 1526413
57011 1526413 1376922 1242778 1124968 1023025 935884 861702 798344 744174 697911 658244
57001 658244 624197 595307 570793 549184 529355 511191 494611 478790 463106 448072 434448
56990 434448 422259 411583 403558 399527 399737 403804 411776 423670 438365 453730 467266 475964 476659
56977 476659 468069 452131 432264 410726 388522 366954 347620 331153 317305 306087 297583 290976
56965 290976 285236 280835 279466 281946 287679 296462 309606 328665 353728 383129 413898 441939 462532
56952 462532 471722 467770 451657 426552 396532 365164 334835 307112 283165 263524 247884 235641
56940 235641 226544 220761 218781 221353 228947 241152 257395 278434 306067 340800 380537 421711
56928 421711 460287 491122 508272 507944 490830 460759 422073 379207 337140 299761 267836 240016
56916 240016 215564 194848 177808 163637 151922 142679 135401 129398 124868 122255 120694 118598 115816
56903 115816 113817 113555 114459 115711 117316 119567 122551 126559 132136 139479 148398 158877 170993 184607
56889 184607 200001 218579 241899 270032 301598 334754 366821 393358 409501 412928 404798 387931
56877 387931 365208 339565 313890 290174 269464 252769 241123 234697 232818 235078 241747 253265
56865 253265 270332 294421 327209 369514 421631 484209 557140 636961 716039 784367 832011
56854 832011 851515 840787 804615 752147 692163 630951 573429 523718 483904 453812 432775
56843 432775 420588 416725 420390 432114 454076 488292 535735 597774 676952 775068 890764 1018566
56831 1018566 1148294 1264577 1349346 1388203 1376328 1319280 1229260 1120515 1005967 895350
56821 895350 794942 708301 636693 579275 534302 500902 479260 469272 470183 481829 505204 541429
56809 541429 591133 655023 733432 823803 918576 1005800 1071842 1104879 1098751 1055592 984665 897813
56797 897813 805511 715770 634201 563563 503927 454199 413390 380637 355266 337459 327978 326794
56785 326794 332898 345961 367218 398022 438126 485530 536699 585970 625645 648155 648902 627752
56773 627752 588809 538848 484636 430765 379855 334081 295130 262746 235010 210681 190131
56762 190131 173629 160146 148611 139035 131530 125307 119557 114397 110058 105971 101558 97139 93266
56749 93266 89775 86256 82786 79545 76315 72999 70035 67773 66063 64861 64487 64840 65105 64764 64121 63503
56733 63503 62771 62063 62031 62836 63809 64629 65879 67851 69699 70393 69760 68206 66372 65401 66352 68824 71219
56716 71219 72867 74688 77209 79392 80259 80338 80521 80673 80453 80381 81027 82065 83098 84371 85680 85698 83646
56699 83646 80755 78927 78711 79542 81006 82706 83768 83777 83589 84200 85431 86613 87684 88688 89143 89024 89367
56682 89367 90735 91992 91933 91238 91374 92305 92817 92522 92093 91909 91863 92208 93331 94891 96298 97770 99927
56665 99927 102604 104994 106606 107346 107209 106786 107441 109982 113640 117190 120461 123885 127369 130579 133558
56650 133558 136044 137080 136483 135744 136186 137119 137283 137231 138541 141243 143798 145293 145997 145943 144606 142065 139187
56633 139187 136648 134802 134188 134916 135810 135438 133811 131978 130342 128655 127291 126997 127461 127490 126630 125480
56617 125480 124521 123714 123096 122651 121801 120082 118058 116469 114953 112865 110876 110243 110779 111115 110894 111167 112568
56600 112568 114544 116472 118179 119263 119203 118369 117811 117933 118420 119318 120895 122468 122860 122227 122107 123374 125322
56583 125322 126990 128153 128666 128090 126518 124873 123848 123305 122968 122978 123510 124456 125739 127428 129517 132031
56567 132031 135114 138473 141176 142755 144113 146509 150114 154528 160091 167344 175516 182928 188833 193684
56553 193684 197739 200671 202552 204043 205537 207104 209115 211843 214582 216369 217408 218622 219964 220469
56539 220469 219895 219002 218156 216967 215362 213774 212124 209826 206949 204318 202333 200736 199510 198852 198226
56524 198226 196630 193954 190997 188097 184798 180973 177205 173907 171060 168798 167336 166292 165050 163662
56510 163662 162469 161123 159036 156554 154538 153123 152062 151875 153171 155087 155950 155451 154770 154660 154867 155343
56494 155343 156448 157854 158678 158819 158876 158848 158328 157875 158543 159994 160698 160129 159281 158861 158507 157931 157332 156532
56476 156532 155147 153752 153428 154136 154973 155912 157591 159472 160150 159647 159512 160403 161454 162304 163676 165484
56460 165484 166430 166202 166255 167548 169239 170397 171375 172631 173653 173950 173825 173484 172642 171590 171314 172031 172859
56443 172859 173387 174260 175817 177543 179186 180958 182392 182543 181647 180984 180882 180546 180017 180300 181322 181882 182131
56426 182131 183820 187341 190667 192146 192284 191921 190837 189299 188773 189679 190301 189333 187796 187088 186813 185982
56410 185982 184833 184043 183481 182985 183050 183582 183352 181787 179946 178740 177699 176524 176117 176847 177434 176986 176711
56393 176711 178198 181352 185243 189637 194397 198729 202336 205998 209858 212491 212933 212251 211937 212094 212363
56378 212363 213125 214474 215478 215765 216426 218117 219715 220152 220101 220578 221415 222376 224091 226506 228068 227990 227702
56361 227702 228542 229731 230223 230703 231824 232285 230858 228849 228264 228793 228875 228599 229236 230708 231784 232157 232410
56344 232410 232506 232104 231755 232149 232820 233107 233571 234941 236565 237485 238136 239448 241220 242945 245147 248278 251358
56327 251358 253442 255331 258044 260734 262041 262515 263622 265258 266333 267045 268452 270304 271394 271677 272242
56312 272242 273457 274766 275967 277216 278212 278733 279448 280979 282900 284851 287602 291571 295391 297629 298941
56297 298941 300887 303558 306103 308619 311691 314896 317566 320292 323974 328132 331791 335155 338817 342298
56283 342298 345157 348584 353987 360793 367390 373412 379472 385595 391719 398731 407190 415990 424081 432394
56269 432394 442142 452480 462026 471624 483207 496750 510725 524929 540583 558183 577370 598504
56257 598504 622421 649128 678551 711928 750699 794816 843913 899141 961904 1031768 1107681
56246 1107681 1190304 1280952 1379108 1483030 1591870 1704959 1819850 1933230 2042913 2146955
56236 2146955 2241877 2323964 2391297 2442450 2474572 2485397 2476105 2449723 2407809 2351117 2282184
56225 2282184 2204306 2118988 2027206 1932097 1837302 1743475 1649519 1556527 1467496 1383847 1305300
56214 1305300 1232509 1166544 1106213 1049085 995008 945741 901522 860900 823572 790420 761053
56203 761053 734145 709848 689080 670942 653698 637672 624250 612762 601520 591231 583924 579004
56191 579004 573844 567884 562730 558541 553972 549468 546920 546052 544675 542563 541545 541732 541224 539681 538643
56176 538643 538138 536541 534061 532852 533355 533918 534243 535686 537932 538988 538921 540110 543355 547180 551250 556920
56160 556920 563966 570441 576347 583970 593972 604462 614440 624808 635681 646161 657046 670240
56148 670240 685286 700185 715795 735550 760562 789106 821329 860176 907073 961102 1023404
56137 1023404 1098078 1187381 1289715 1403018 1525672 1652732 1775492 1886800 1983956 2066125
56127 2066125 2133291 2188910 2239191 2287603 2332879 2372863 2406375 2430576 2441138 2437018 2421882
56116 2421882 2399878 2373264 2344069 2313140 2276362 2226239 2158786 2075443 1978370 1869085 1752679
56105 1752679 1637825 1530470 1431579 1342015 1264550 1199602 1144198 1097094 1060149 1033015 1011537
56094 1011537 993351 980071 972063 966165 960679 957587 957637 958267 958558 961156 966950 972916 977505 983033
56080 983033 990430 996982 1001679 1007396 1015226 1022203 1027361 1034399 1045268 1056674 1066089 1075774 1087633
56067 1087633 1099652 1110865 1124378 1141827 1160099 1176971 1194681 1214522 1233459 1249740 1266266
56056 1266266 1284633 1301380 1314063 1325636 1338988 1352566 1365191 1379491 1396573 1413015 1427157
56045 1427157 1442734 1462344 1483273 1503750 1526978 1554555 1582277 1607178 1632549 1661326 1690905
56034 1690905 1719323 1750044 1785432 1821850 1856426 1892252 1931776 1971687 2009647 2049307 2093172
56023 2093172 2137362 2178937 2221264 2266589 2310856 2351981 2395541 2445909 2499403 2552671 2609816
56012 2609816 2674354 2742310 2810521 2883509 2964641 3048933 3132369 3219785 3315494 3414954 3514166
56001 3514166 3618275 3732091 3851328 3972299 4100797 4241794 4390086 4541017 4700425
55992 4700425 4873709 5055609 5241717 5439314 5655273 5884485 6122266 6376567 6655173
55983 6655173 6953019 7265801 7603505 7975905 8377791 8803978 9265422 9774231 10327071
55974 10327071 10921133 11571699 12295145 13090183 13956324 14914790 15989714 17186564 18513490
55965 18513490 20006470 21708766 23646609 25854897 28407588 31394965 34899475 39034916
55957 39034916 43989095 49994106 57292884 66194360 77143849 90701782 107515573 128404734
55949 128404734 154416215 186591761 225457735 270440640 319255632 367360366 408112236
55942 408112236 434395338 441349955 428447020 399367436 359983960 316122559 272331163
55935 272331163 231604043 195507957 164485421 138309135 116495968 98491012 83703087
55928 83703087 71563630 61596945 53411176 46653840 41023151 36300320 32325480 28952293
55920 28952293 26053712 23548684 21384415 19501611 17842684 16377530 15090965 13954625
55912 13954625 12935399 12019514 11203518 10470905 9799949 9185351 8630624 8126963 7659144
55903 7659144 7224455 6827065 6460975 6116210 5794757 5503248 5236354 4983622 4746244
55894 4746244 4531221 4334892 4147718 3969926 3807581 3658301 3515287 3380804 3261744
55885 3261744 3156038 3056748 2965543 2889238 2826846 2772577 2727845 2697658 2677933 2658103 2633607
55874 2633607 2604990 2567982 2516016 2450292 2376818 2295872 2204470 2106564 2010500 1918444 1827968
55863 1827968 1741602 1664936 1597231 1533510 1474186 1423349 1379305 1336076 1292994 1254042 1219106
55852 1219106 1184476 1150747 1121729 1096438 1070240 1043023 1018525 996591 973707 950227 929654
55841 929654 911662 892960 874037 857977 843698 827408 809696 794218 780379 764318 746269
55830 746269 730124 716515 702935 689772 679584 671344 662023 652891 647495 644226 637762 627329 616863
55817 616863 607528 596844 584908 574738 566352 556894 546786 539595 535711 532100 528348 526986 527805
55804 527805 527933 527721 530675 537216 544301 551372 560833 572208 581630 587743 592558 595991 595225 590210 584237
55789 584237 578127 569206 557001 544761 534315 524339 514591 506742 499892 490214 476468 461458 447035
55776 447035 432182 417180 405012 397202 392251 389396 390002 394234 400089 406470 413403 418766 419023 414029
55762 414029 407180 400245 392126 383102 375703 370392 364720 357827 351632 346545 340303 332235 324549 318028
55748 318028 310487 300942 291488 283522 275799 267658 260620 255308 250219 244990 241558 240665 240320 238988 237291
55733 237291 235591 233093 230344 229352 230165 230467 229375 228337 227532 225038 220551 216279 213042 209130 204207
55718 204207 200564 199032 197368 194393 192168 192240 193161 193705 195277 199047 203651 207802 212374 217920 222767
55703 222767 225555 227205 228571 228515 226020 221862 216632 209528 200686 192327 185950 180591 175269 170825 167934
55688 167934 165666 163455 162274 162537 163154 163863 166066 170066 174048 177189 181171 187087 193277 197839 200969
55673 200969 203303 204260 203543 202000 199612 195036 188627 183371 181131 180275 178653 176578 175213 174363 173773
55658 173773 174472 176976 180050 182844 186237 190617 194618 197660 201466 207154 212984 216816 218816 219903
55644 219903 219568 217193 213582 209337 203481 195555 187226 180016 173188 165644 158120 151702 145975 140358
55630 140358 135533 131843 128193 124269 121848 121967 122733 122003 120404 119585 119317 118612 118008 118286 118250 116253 112854
55613 112854 109886 107870 106260 105095 104466 103441 101416 99506 98907 99012 98771 98563 98889 98603 96492 93451
55597 93451 91152 89693 88434 87912 88811 90146 90604 90762 91906 93538 94222 94098 94452 95384 95928 95965 96096
55580 96096 96098 95364 94471 94545 95415 96016 96290 97078 98466 99686 100412 100877 101117 101225 101892 103520 105326 106344
55562 106344 106676 106772 106372 105298 104320 103956 103346 101610 99423 97880 96680 94911 92829 91420 90819 90490
55546 90490 90289 90215 89894 89475 90071 92165 94581 96212 97549 99219 100391 100327 100213 101501 103452 104302 103997
55529 103997 103761 103675 102737 100825 98702 96483 93866 91547 90607 90743 90687 90066 89405 88692 87523 86278 85633
55512 85633 85266 84487 83608 83192 82497 80386 77390 75130 73955 72840 71376 70183 69414 68527 67595 67414 68200
55495 68200 69467 71168 73661 76510 78580 79425 79644 79893 80471 81634 83282 84549 84605 83635 82298 80738
55479 80738 79044 77934 77818 77823 76994 75930 75886 76785 77436 77308 76750 75868 74550 73330 72862 72736 72019 70818
55461 70818 70217 70827 72330 74145 75654 76192 75691 74895 74222 73203 71800 71147 71845 72676 72383 71669 71906
55444 71906 72923 73759 74589 76036 77456 77883 77901 78564 79174 78332 76600 75816 76060 75742 74577 74063 74785 75558
55426 75558 75697 76051 77157 78201 78528 78629 78982 79237 79121 78988 79123 79508 80321 81550 82228 81435 79940 79414
55408 79414 80011 80321 79701 78980 78686 78272 77488 76959 76920 76721 76022 75251 74559 73544 72332 71700 71904 72502 73427
55389 73427 74963 76552 77007 76155 75061 74439 74088 73963 74377 75046 75302 75424 76396 78181 79660 80410 81030
55372 81030 81532 81098 79736 78572 77978 76966 74949 72624 70539 68314 65919 64265 63695 63214 62023 60700
55356 60700 60084 60091 60333 60908 61890 62926 63952 65366 67056 68217 68640 69177 70407 71787 72594 72754 72302
55339 72302 71036 69302 68154 68200 68994 69889 70656 71013 70581 69657 69085 69000 68633 67620 66512 65792 65422 65619
55321 65619 66823 68602 69739 69863 69892 70476 71228 71862 72852 74341 75549 75908 75782 75513 74769 73374 71836
55304 71836 70577 69562 69002 69333 70145 70287 69500 68740 68516 68152 67275 66670 66950 67504 67493 66858 65761 64179
55286 64179 62688 62482 63861 65714 67142 68478 70089 71391 71811 71593 70916 69400 67309 66046 66501 67921
55270 67921 69190 70147 70823 70645 69504 68532 68685 69506 70245 71185 72696 74050 74487 74637 75529 76885 77686
55253 77686 77865 78121 78480 78267 77291 76017 74795 73776 73324 73742 74770 75952 77140 78155 78495 77977 77077
55236 77077 76166 75057 73785 72919 72475 71539 69856 68757 69411 71005 71893 71847 71853 72269 72528 72371 72104 71765
55218 71765 71146 70534 70416 70516 70075 69095 68455 68756 69706 70641 71117 71048 70770 70842 71400 71968 72274 72778 73899
55199 73899 75229 76197 77078 78561 80571 82243 82934 82675 81801 80696 79760 79164 78636 77801 76601 75251 74072
55182 74072 73475 73680 74344 74950 75655 77086 79143 80774 81225 80763 79965 79097 78465 78351 78241 77180 75407
55165 75407 74517 75367 76941 78105 79229 81032 82882 83652 83553 83810 84886 86162 87006 87153 86373 84711 82860
55148 82860 81524 80692 80096 79880 80150 80440 80409 80510 81213 82144 82778 83352 84172 84647 84000 82509 81092 80102
55130 80102 79391 79116 79518 80249 80811 81314 82026 82564 82388 81715 81174 80954 80986 81472 82457 83369 83785 84128 84880
55111 84880 85722 86227 86694 87359 87571 86773 85673 85316 85610 85862 86125 86831 87679 88127 88466 89188 89887 90044 90285
55092 90285 91403 92679 92821 92208 92529 94302 96314 97475 97731 97162 95759 94253 93758 94260 94692 94597 94473
55075 94473 94400 93690 92177 90576 89328 88259 87581 87942 89124 89925 89802 89542 89910 90635 91089 91033 90443 89550
55057 89550 89214 90184 91750 92358 91811 91587 92511 93482 93224 92126 91444 91587 92071 92483 92633 92287 91482 90753
55039 90753 90521 90703 91230 92341 93897 95024 94942 93712 91804 89550 87494 86649 87635 89793 91692 92402
55023 92402 92020 91242 90735 90697 90773 90485 89800 89084 88619 88515 88964 90049 91309 92045 92128 92066 92234 92524 92711 92634
55003 92634 92075 91054 90233 90313 90999 91267 90776 90363 90938 92536 94638 96813 98787 100384 101626 102564 102940
54986 102940 102482 101492 100626 100062 99424 98503 97547 96853 96616 97040 98020 98859 99028 99076 100010 101831 103521 104414
54968 104414 104678 104483 103795 103143 103479 104849 106123 106491 106399 106597 107059 107376 107557 107865 108387 109152 110240 111445
54950 111445 112304 112690 112887 112886 112243 110876 109398 108331 107550 106835 106433 106750 107902 109716 111698 112898 112521
54933 112521 110966 109672 109671 110744 112200 113828 115768 118030 120552 123362 126501 130135 134814 141137 149064
54918 149064 158001 167460 176936 185298 191221 194371 195317 194146 190167 183358 175072 166781 158904 151416
54904 151416 144743 139306 134738 130362 126109 122453 119734 117959 116962 116408 115903 115411 115274 115682 116421 117213
54888 117213 117851 117987 117409 116665 116738 117950 119770 121883 124758 128874 134057 139927 146424 153566 161189 169121
54872 169121 177079 184215 189376 192007 192295 190367 186138 180031 172996 165551 157604 149471 142176 136336
54858 136336 131568 127423 124112 121843 120194 118668 117176 115614 113662 111458 109691 108578 107499 106125
54844 106125 105079 104896 105065 104797 104113 103490 102998 102449 101936 101604 101270 100758 100248 99930 99744 99722 100096 100818 101578
54825 101578 102455 103809 105322 106052 105758 105248 105012 104498 103310 102147 101820 102226 102939 103929 104976 105246 104367
54808 104367 103237 102930 103443 104201 105086 106207 107334 108298 109230 109781 109004 106886 105058 105010 106326 107653 108534
54791 108534 109216 109530 109316 109341 110425 112022 112893 112851 112640 112471 111954 111256 111110 111725 112631 113498 114225 114534 114481
54772 114481 115101 117490 121415 125812 130426 135922 142589 150061 158175 166980 175938 184172 191460 197954
54758 197954 202891 204761 202993 198508 192445 185224 177059 168481 160023 151986 144663 138243 132491 127194
54744 127194 122893 120481 120056 120774 121786 122695 123271 123498 123819 124641 125636 126199 126399 126750 127318 127917 128919
54727 128919 130882 133490 135944 138422 142144 147875 155239 163515 172160 180448 187528 193016 196765 198126
54713 198126 196416 192153 186787 181072 174712 167710 160875 154681 148734 142853 137695 133807 130870 128381
54699 128381 126297 124549 122727 120754 119177 118322 117817 117335 117111 117273 117365 117026 116531 116205 115929 115650 115717 116161
54681 116161 116237 115256 113428 111461 109774 108557 108044 108196 108505 108576 108603 108895 109363 109743 109909 109670 108804 107697
54663 107697 107325 108085 109117 109367 108944 108828 109515 110494 110953 110596 109917 109919 111349 113890 116277 117434 117312 116548
54645 116548 115699 115010 114536 114243 114208 114811 116259 117838 118292 117245 115691 114731 114435 114355 114439 114719 114629 113534
54627 113534 111751 110321 109823 110004 110445 110971 111349 111219 110546 109787 109448 109686 110356 111149 111677 111728 111523 111510 111864
54608 111864 112400 112994 113810 114986 116271 117182 117461 117278 117020 117001 117318 117804 118031 117557 116429 115330 114950 115202
54590 115202 115426 115385 115574 116293 116991 116961 116354 115909 115922 116049 115995 115771 115326 114512 113495 112730 112424 112428 112630 113017
54570 113017 113362 113366 113161 113236 113749 114386 114893 115254 115312 114757 113639 112466 111650 111276 111389 111988 112759 113397 114222
54551 114222 115779 117693 118718 118259 117199 116795 117361 118430 119648 120943 122239 123486 124717 125789 126435
54536 126435 126852 127652 128827 129338 128374 126596 125378 125083 124853 124020 122991 122551 122902 123598 124095 124049 123367 122224
54518 122224 120987 119994 119405 119311 119835 120987 122394 123385 123542 123183 123001 123215 123359 123048 122509 122074 121590 120878
54500 120878 120427 120857 121811 122151 121365 120102 119195 118756 118439 118028 117554 117345 118021 119802 121671 122054 120750
54483 120750 119393 119474 120601 121433 121692 122277 123741 125592 127160 128317 129207 129886 130484 131268 132278 133183 133717
54466 133717 134039 134485 135116 135665 135851 135607 135092 134578 134265 134076 133629 132653 131523 131170 132084 133467 133846 132698
54448 132698 131024 130090 130048 130217 130258 130372 130547 130347 129522 128321 127111 126161 125760 126101 126938 127802 128470 128888
54430 128888 128766 127844 126507 125582 125492 126074 127148 128576 129828 130191 129579 128595 127775 127327 127492 128378 129447
54413 129447 130008 130327 131343 133133 134656 135267 135482 135850 136105 136024 136182 137079 138257 138941 138941 138305 136864 134903
54395 134903 133606 133924 135411 136956 138237 139663 141260 142443 142741 142128 140912 139851 139964 141484 143247
54380 143247 143869 143359 142905 143227 143872 144080 143744 143399 143634 144568 145712 146457 146750 146999 147244 147080 146653 146893
54362 146893 148178 149513 149870 149750 150508 152504 154876 156907 158642 160266 161707 162947 164088 165104 166133
54347 166133 167763 170292 172780 173630 172231 169411 166266 163189 160105 157010 154058 151562 149978 149486 149632
54332 149632 149748 149646 149428 148877 147737 146455 145826 145830 145571 144640 143770 143773 144377 144602 143950 142744 141510 140449
54314 140449 139543 138910 138816 139258 139679 139413 138505 137753 137704 137973 137876 137410 137158 137475 138221 139130 139928 140214 139761 138932
54294 138932 138391 138392 138632 138714 138424 137736 136908 136441 136608 137183 137963 139214 141127 143162 144536 145221 145752 146257
54276 146257 146339 145922 145454 145187 144852 144245 143577 143081 142729 142540 142715 143257 143799 144025 144033 144134 144483 144967 145318 145335
54256 145335 145121 144993 144979 144673 143914 143355 143846 145340 146839 147424 146984 146028 145100 144415 143772 142837 141655 140710
54238 140710 140335 140449 141055 142452 144441 145937 146090 145456 145247 145656 145747 144872 143411 142124 141509 141748 142564
54221 142564 143079 142557 141407 140779 141104 141681 141807 141597 141514 141725 142218 143019 144041 145066 145976 146638 146642 145715 144361
54202 144361 143460 143210 143056 142687 142397 142376 142402 142437 142825 143599 144192 144112 143384 142178 140655 139370 139097 139850 140695
54183 140695 140943 140976 141437 142092 142075 140976 139305 138053 138056 139456 141476 143013 143667 144008 144669 145536 146035 145846
54165 145846 145099 144091 143039 141930 140499 138596 136583 135110 134451 134352 134471 134600 134546 134240 133985 134168 134755
54148 134755 135497 136504 137982 139472 140109 139779 139308 139335 139644 139834 139956 140193 140473 140775 141323 142151 142909 143310
54130 143310 143406 143328 143197 143351 144047 144890 145224 145148 145379 146011 146350 146242 146557 147836 149372 150224 150428 150557 150831
54111 150831 151341 152403 153870 154671 153960 152349 151159 150808 150682 150356 150115 150361 151114 152044 152550 152020 150537
54094 150537 149094 148633 149089 149827 150680 151890 153308 154312 154498 153916 152754 151313 150207 150037 150845 152259
54078 152259 154130 156600 159607 162669 165279 167338 169327 172156 176551 182363 188751 195317 202678 211516
54064 211516 221280 230194 236327 238484 236595 231784 225795 219804 213841 207584 201293 195577 190679 186558
54050 186558 183336 181036 179170 177292 175803 175560 176793 179020 181890 185402 189246 192709 195584 198727
54036 198727 203340 209817 217345 224462 230037 233986 237164 240534 244490 248889 253309 257065 259428 260318
54022 260318 260606 261307 262621 264005 264954 265356 265334 265147 265071 264990 264305 262633 260345 257984 255405 252004 247642
54005 247642 242842 238169 233845 229891 226256 222884 220002 218220 218023 219317 221726 224982 228617 231677
53991 231677 233374 233856 233812 233524 232817 231640 230032 227697 224333 220315 216367 212635 208719 204564 200646
53976 200646 197218 194082 191162 188674 186663 184988 183862 183734 184488 185378 185965 186522 187318 188116 188672 189141
53960 189141 189654 190026 190258 190842 192085 193458 194089 193805 193360 193709 195242 197577 199970 201953 203627 205320
53944 205320 207162 209266 212049 215800 219994 223626 226398 229061 232443 236633 241301 246313 251703 257398
53930 257398 263225 268901 273913 277862 281141 284786 289444 295017 301598 310084 321272 334839 349928
53917 349928 366383 384516 403598 421347 435165 443603 446682 445430 441396 436106 430430 424428 417938
53904 417938 411179 404664 398735 393408 388546 383973 379459 374830 370144 365641 361470 357529 353522 349040
53890 349040 343687 337403 330701 324332 318498 312633 306196 299430 293009 287122 281406 275732 270512 266097
53876 266097 262332 258935 255867 253008 249890 246173 242162 238395 234916 231407 227912 224909 222588 220433
53862 220433 217704 214150 210140 206245 202802 199838 197327 195381 194050 193032 191920 190838 190433 191019 192012
53847 192012 192511 192221 191508 190787 190254 190078 190506 191648 193280 194845 195664 195423 194551 193764 193111 191882 189665
53830 189665 187063 185027 183959 183845 184688 186175 187388 187652 187492 187961 189196 190383 191147 192120 193923 196236
53814 196236 198180 199200 199365 199174 199210 199736 200557 201536 203056 205553 208746 211945 215095 218939 224041 230175
53798 230175 236743 243237 249232 254485 259274 264112 268933 273006 275823 277664 279142 280598 282020 283077
53784 283077 283199 282208 280961 280678 281398 281779 280733 278507 275748 272367 268057 263290 258841 254667 250181
53769 250181 245491 241418 238189 234952 230922 226486 222723 220202 218549 216962 214820 211963 208735 205761
53755 205761 203484 201796 200214 198433 196641 195279 194604 194505 194646 194663 194309 193634 193026 192871 193110 193335 193368 193491
53737 193491 193963 194613 195174 195740 196530 197368 197810 197760 197640 197940 198822 200086 201274 201957 202206 202681 203872 205356
53719 205356 206241 206335 206457 207433 209176 210889 211933 212351 212712 213554 214902 216363 217745 219437 221960 225322
53703 225322 229011 232418 234958 236154 236163 236133 237451 240528 244649 248989 253279 257451 261131 263796 265220
53688 265220 265664 265701 265742 265570 264552 262598 260618 259634 259737 260368 261273 262432 263333 263203 262057 260720 259625
53671 259625 258299 256266 253886 252041 251409 252116 253594 254755 254871 254321 253963 253863 253400 252537 251944 251714 251037
53654 251037 249580 248191 247635 247503 247114 246732 247070 248116 249232 250007 250336 250100 249553 249687 251388 254309 257180
53637 257180 259116 260096 260373 260139 259794 259957 261030 263025 265828 269280 273015 276471 279105 280577 280936 280785
53621 280785 281022 282093 283673 285212 286582 288046 289946 292697 296716 301969 307755 313214 317966 322100
53607 322100 325817 329245 332366 334996 337123 339314 342362 346422 351033 356097 362064 368775 374876 379088
53593 379088 381585 383403 384841 385200 383933 381386 378405 375684 373426 371282 368652 365385 362002 359008
53579 359008 356212 353126 349783 346736 344426 342908 342035 341504 340843 339714 338247 336896 336041 335754 335646 334991
53563 334991 333455 331816 331334 332180 333182 333506 333815 335175 337481 339766 341533 342964 344198 345213 346222
53548 346222 347407 348472 349113 349727 350995 353020 355530 358563 362163 365706 368492 370863 373832 377625 381520
53533 381520 385155 389009 393518 398656 404634 412026 420762 429776 438237 446572 455771 466115 477053 487951
53519 487951 498543 508941 519594 531124 543995 558410 574518 592299 611217 630493 650012
53508 650012 670529 692681 716112 739894 763494 786902 809967 832126 852918 872495 891468
53497 891468 910348 929238 947966 966311 984084 1001276 1018334 1036038 1054667 1073338 1090701
53486 1090701 1106349 1121121 1135926 1150870 1165755 1180761 1196169 1211902 1227773 1243677 1259126
53475 1259126 1273210 1285566 1296772 1306994 1314908 1318996 1319496 1317968 1315185 1310623 1303926 1295554 1285686
53462 1285686 1273699 1259358 1243686 1228041 1212931 1198223 1183904 1170015 1156138 1141531 1125623
53451 1125623 1108185 1089295 1069463 1049577 1030441 1012339 995014 977878 960396 942653 925589
53440 925589 910318 897225 886024 876530 868838 862851 858264 855092 853594 853462 853615 853113 852041 851431
53426 851431 852673 856934 864424 873963 883703 892630 901219 910653 921835 935082 950183 966544 983787
53413 983787 1002342 1022981 1045613 1069051 1092252 1115455 1139930 1166943 1196959 1229343 1262759
53402 1262759 1296318 1330514 1366652 1405437 1446658 1490168 1536220 1584642 1634471 1684829 1735510
53391 1735510 1786412 1837170 1887837 1939176 1991582 2044169 2095547 2145040 2192538 2237606 2279529
53380 2279529 2318195 2354332 2388794 2421810 2452739 2480341 2503573 2522432 2537807 2550297 2559448
53369 2559448 2564237 2563775 2557218 2543670 2522818 2495368 2462307 2424005 2380589 2332927 2282633 2231181
53357 2231181 2179429 2127879 2076883 2026624 1977264 1929126 1882488 1837377 1793882 1752429 1713289
53346 1713289 1675817 1638565 1600295 1560834 1521087 1482401 1445680 1410865 1377308 1344703 1313433
53335 1313433 1283929 1256242 1230606 1207896 1188890 1173248 1159759 1147511 1136264 1125734 1115134
53324 1115134 1103752 1091609 1079338 1067484 1056115 1045026 1034199 1023963 1014681 1006365 998788 991934
53312 991934 986056 981331 977816 975833 975905 978121 981879 986602 992331 999315 1007366 1016052 1025334 1035630
53298 1035630 1047484 1061468 1078119 1097375 1118245 1139588 1161246 1183985 1208302 1233728 1259412
53287 1259412 1284932 1310270 1335218 1359087 1381018 1400617 1418293 1434844 1450483 1464383 1475435
53276 1475435 1483369 1488744 1491839 1492051 1488740 1482364 1474267 1465286 1454967 1442268 1426690 1408404 1387670
53263 1387670 1364773 1340488 1315897 1291393 1266373 1240248 1213257 1185829 1157702 1128484 1098780
53252 1098780 1069897 1042510 1016379 991285 967318 944211 921320 898614 876766 855806 834537
53241 834537 811914 788398 765336 743516 722962 703645 685603 668588 652251 636601 621909
53230 621909 608349 596123 585631 577075 570061 563956 558368 552942 547096 540431 533063 525077 515998
53217 515998 505384 493632 481560 469377 456757 443848 431495 420398 410553 401668 393666 386622
53205 386622 380461 374857 369278 363256 356792 350354 344296 338490 332760 327304 322277 317282 311851 306298
53191 306298 301490 297797 294724 291585 288124 284451 280802 277418 274428 271735 269181 266742 264447 262282
53177 262282 260336 258778 257443 255793 253589 251261 249255 247450 245693 244440 244141 244259 243717 242201 240294
53162 240294 238359 236139 233595 231403 230244 230053 230226 230191 229607 228378 226708 224975 223466 222360 221823 221745
53146 221745 221579 220926 220214 220242 221077 221924 222131 221752 221118 220491 220273 220853 221919 222510 222163 221610 221924 223296
53128 223296 225008 226338 227185 227989 229315 231279 233193 234042 233599 232770 232594 233172 233916 234534 235243 236119 236846
53111 236846 237242 237566 237995 238093 237195 235245 232920 230903 229344 228139 227341 226897 226238 224679 222300 219975
53095 219975 218428 217634 217266 217225 217429 217558 217427 217318 217501 217714 217552 217165 217050 217281 217385 216969 216153 215449 215512
53076 215512 216758 218809 220500 220916 220394 220050 220411 220931 220841 219974 218716 217532 216591 215597 214052 211956 210103
53059 210103 209249 209176 209002 208328 207571 207234 207371 207759 208095 208015 207420 206894 207314 208968 211361 213818 215818 216851
53041 216851 216570 215202 213347 211360 209402 207940 207401 207247 206254 204104 201997 201238 201743 202472 202849 203164
53025 203164 203775 204490 204791 204433 203808 203730 204692 206323 207799 208749 209432 210082 210644 211237 212258 213720 214939
53008 214939 215311 215057 214887 215177 215764 216286 216446 216134 215525 214965 214636 214491 214520 214745 214939 214808 214543 214742 215547
52989 215547 216310 216398 215959 215569 215480 215561 215728 216065 216675 217626 218866 220066 220807 221144 221704 223055 225190 227748
52971 227748 230387 232726 234345 235122 235392 235526 235581 235434 234933 233838 232101 230401 229823 230677 232037 232799 232712
52954 232712 232020 230699 228745 226803 225739 225641 225853 225871 225679 225272 224491 223425 222499 221973 221687 221336 220732 219799
52936 219799 218613 217535 216999 217045 217270 217295 217065 216690 216221 215700 215270 215075 215010 214656 213591 211978 210717 210693
52918 210693 211783 212930 213353 213300 213327 213268 212506 211064 209816 209498 209987 210711 211310 211669 211639 211176 210642 210608 211265
52899 211265 212261 213183 214014 214969 216072 217100 217867 218257 218095 217355 216628 216849 218283 220094 221286 221749 221941
52882 221941 221936 221412 220457 219590 218973 218280 217504 217180 217528 217994 218036 217847 217885 218207 218762 219917 222042 224768 227262
52863 227262 229185 230931 232842 234575 235380 234844 233382 232036 231681 232261 232864 232584 231172 228929 226356 224000
52847 224000 222207 220675 218552 215304 211341 207617 204822 203170 202571 202633 202662 202116 201046 199936 199222 199070
52831 199070 199409 199969 200480 201054 202109 203717 205265 206038 205923 205301 204494 203614 202741 201990 201532 201653 202500 203600
52813 203600 204069 203656 203238 203825 205464 207600 210183 213650 217836 221544 223386 222729 219801 215378 210593
52798 210593 206665 204356 203561 203412 202851 201305 198983 196520 194325 192436 190967 190225 190116 189895 189025 188087
52782 188087 188311 190160 192805 195051 196419 197223 197990 199118 200901 203444 206351 208676 209547 208968 207827
52767 207827 206965 206459 205992 205580 205453 205462 205248 204981 205225 206000 206607 206597 206309 206203 206271 206359 206399 206021 204689 202706
52747 202706 201359 201422 202195 202672 202978 203772 204853 205502 205884 206988 209148 211609 213635 215221 216559 217582
52731 217582 218296 219048 220259 222230 225091 228409 231038 232042 231699 230899 229634 227002 222833 218355 214881
52716 214881 212543 210747 209204 207943 206815 205586 204329 203370 202998 203406 204612 206199 207462 208087 208347
52701 208347 208509 208450 208215 208502 209976 212266 214174 214951 214986 215160 215844 216758 217614 218502 219544 220479 220969 221298
52683 221298 222292 224276 226385 227302 226591 225021 223630 222747 221875 220284 217737 214814 212453 211101 210499 210409
52667 210409 211073 212569 214128 214762 214473 214223 214700 215643 216356 216386 215617 214340 213397 213773 215715 218547 221500
52650 221500 224361 227153 229546 230946 231050 230201 229225 228824 228907 228658 227534 226031 225064 224742 224353 223520 222678
52633 222678 222269 222160 222192 222747 224265 226560 229098 231703 234533 237456 239841 240995 240639 239012 236699 234270
52617 234270 231916 229454 226729 223948 221574 219979 219262 219227 219500 219746 219896 220129 220685 221708 223142 224569
52601 224569 225325 225093 224433 224424 225674 227762 229665 230610 230516 229829 229092 228652 228720 229519 231066 232790 233708 233288
52583 233288 231986 230780 230358 230890 232218 233939 235573 236955 238282 239559 240348 240368 239955 239541 239047 238277
52567 238277 237506 237112 236965 236761 236625 236722 236650 235994 235151 234733 234363 233073 230823 228631 227157 226118 225257 224836
52549 224836 224901 224963 224802 224791 224993 224773 223785 222637 222077 222097 222328 222715 223322 223953 224474 225082 225833 226356 226480 226681
52529 226681 227477 228715 229857 230617 230994 231046 230949 230938 230936 230660 230248 230292 231004 231953 232864 233973 235279 236268 236909
52510 236909 238090 240350 242882 244673 245985 247691 249588 250575 250361 249879 249815 249697 248761 246966 244680 241955
52494 241955 238686 235280 232632 231322 231075 231165 231340 232091 233858 236200 238164 239405 240354 241272 241755 241507
52478 241507 241005 240901 241216 241654 242287 243319 244408 244919 244847 245013 246195 248334 250551 251830 251880 251559 252208
52461 252208 254305 257014 259230 260710 261791 262407 262014 260344 257750 254907 252496 251033 250461 249955 248565
52446 248565 246142 243327 240706 238349 236183 234442 233493 233335 233393 232886 231476 229600 228103 227566 228060 229340
52430 229340 230949 232218 232637 232343 231893 231593 231485 231895 233225 234996 235880 235129 233510 232414 232572 233963
52414 233963 236362 239368 242368 245078 247833 250972 254391 258119 262849 269276 277398 286925 297801 309523
52400 309523 320395 328353 332374 332501 328896 321848 312515 302755 294004 286813 281310 277413 274602 272160
52386 272160 269744 267350 264892 262430 260617 260219 261108 262289 262978 263202 263362 263790 264756 266482 269095 272805
52370 272805 277858 283881 289607 293877 296762 299117 301287 302972 304098 304903 305200 304456 302762 300917 299380
52355 299380 297829 296017 294396 293601 293828 294923 296539 298114 299243 300287 302050 304652 307275 309207 310578
52340 310578 311875 313289 314922 317141 320311 324440 329265 334439 339521 344246 348922 354236 360548 367782
52326 367782 376060 385831 397136 409246 421371 433395 445683 458497 471822 485389 498650 511105
52314 511105 522877 534713 547271 560686 574858 589714 605036 620484 635969 651647 667400
52303 667400 682861 698071 713514 729153 744038 757388 769622 781696 793685 804643 813706 820741
52291 820741 825871 828908 829548 827894 824584 820440 816066 811711 807402 803154 799044 795153 791501 788010
52277 788010 784550 781171 778368 776849 776869 777931 779366 781059 783453 787019 791942 798068 804826 811421 817487
52262 817487 823406 829801 837033 845429 855470 867159 879576 891833 904174 917409 931510 945652
52250 945652 959435 972939 985506 995638 1002561 1007053 1010259 1012507 1013737 1014286 1014441 1013676 1011130 1006698
52236 1006698 1001268 995988 991521 987663 983407 977716 970522 962750 955263 948204 941473 935187 929296 923320
52222 923320 917061 911165 906498 903118 900385 897843 895564 893763 892539 891983 892237 893420 895587 898687 902542
52207 902542 907011 912151 917911 923652 928445 932001 934978 938177 941794 945563 949272 952918 956755 961310
52193 961310 966956 973290 979359 984692 989652 994590 999177 1002862 1005516 1007203 1007753 1006882 1004398 999972 993212
52178 993212 984409 974843 965839 957727 950087 942674 935723 929500 923956 918762 913528 908251 903606 900459
52164 900459 898919 898294 898127 898699 900280 902505 904938 907720 911084 914606 917391 918701 918181 916005 913260
52149 913260 911594 911863 913456 915357 917295 919355 921186 922514 923853 925725 927454 927812 926723 925315 924259
52134 924259 923057 921186 919042 917395 916629 916988 919112 923763 931206 941083 952798 966010 980920 998006
52120 998006 1017250 1037776 1058618 1079641 1101248 1123244 1144569 1164253 1182207 1199001 1215263
52109 1215263 1231308 1246952 1261527 1274452 1285903 1296719 1307654 1319013 1330914 1343397 1356137
52098 1356137 1368420 1379559 1389127 1396790 1402249 1405388 1406121 1404013 1398372 1388950 1376362 1361739 1346115
52085 1346115 1330129 1314111 1298395 1283652 1270766 1260143 1251267 1243253 1235705 1228757 1222495 1216925
52073 1216925 1212490 1209974 1209701 1211219 1213977 1217893 1223059 1229302 1236393 1244426 1253624 1263842 1274528 1285133
52059 1285133 1295479 1305778 1316389 1327456 1338753 1349953 1360976 1371776 1381760 1389780 1394967 1397412
52047 1397412 1397794 1396460 1393082 1387191 1378805 1368493 1356993 1344800 1332061 1318764 1305119 1291729
52035 1291729 1279296 1267976 1257150 1246070 1234701 1223636 1213118 1202609 1191555 1180167 1168950
52024 1168950 1157754 1145979 1133580 1121163 1108998 1096649 1083770 1070653 1057748 1045350 1034124
52013 1034124 1025141 1018678 1013433 1007644 1000721 993177 985299 976663 966791 955528 942648 927747 910723
52000 910723 892072 872608 853190 834645 817570 802188 788599 776986 767221 758480 749758 740714
51988 740714 731542 722105 711777 700195 687688 674844 662067 649648 637731 626018 613876 601036
51976 601036 587920 575078 562518 549928 537543 526553 518411 513651 511477 510703 511004 512904 516618
51963 516618 521508 526945 533107 540377 548315 555784 561790 565678 566807 564859 560455 554887 549085 543199
51949 543199 537090 530841 524879 520012 517119 516399 517170 519008 522730 529488 539041 549843 560754 571799
51935 571799 583121 594258 604779 614727 623834 630968 634941 635476 632985 627859 620378 610851 599442
51922 599442 586244 571885 557613 544373 532263 521307 512293 506229 503305 503008 505156 510277 519059
51909 519059 531833 548536 568596 590555 611968 629882 641777 646542 644847 638410 628710 616503
51897 616503 602430 587352 571638 554638 535580 514978 494544 475688 458554 442696 428249
51886 428249 416063 406811 400350 396061 393674 393448 395486 399178 403720 409127 416260 425638 436533 447467
51872 447467 457438 466376 474483 481420 486228 487976 486462 482294 476337 469243 461559 454002 447237 441413
51858 441413 436346 432188 429547 428787 429522 431013 432780 434601 436177 437095 437035 435812 433297 429495 424725
51843 424725 419577 414570 409737 404509 398275 391297 384921 380526 378303 377390 377061 377277 378148 379504 381208
51828 381208 383288 385418 386804 387046 386679 386345 385756 384073 381217 378202 376127 375265 375211 375555 376262 377630
51812 377630 379967 383171 386607 389533 391634 392915 393157 391859 388992 385540 382918 381702 381098 379867 377718
51797 377718 375611 374647 374898 375469 375480 374685 373226 371271 369054 366955 365196 363551 361603 359312 357215 355949
51781 355949 355603 355618 355363 354777 354294 354149 354040 353616 353106 353230 354629 357623 362335 368698 376376 384909 393945
51764 393945 403114 411818 419422 425585 430134 432759 433238 431834 429053 425047 419695 413313 406782 400851
51750 400851 395682 391198 387412 384225 381232 377993 374379 370685 367611 366005 366156 367360 368677 370134
51736 370134 372670 376814 382068 387794 393979 400657 407016 411695 413782 413256 410833 407791 405651 405444 407156
51721 407156 409909 412472 413602 412550 409715 406501 404049 402292 400547 398642 396967 395660 394383 392923
51707 392923 391519 390514 390054 390251 391382 393672 396906 400289 402755 403597 402876 401176 398996 396666 394846
51692 394846 394603 396608 400387 404556 407643 408601 406942 402873 397270 391215 385492 380516 376474 373346 371009
51677 371009 369508 369072 369657 370706 371558 371919 371773 371130 370243 369839 370780 373459 377684 383030 389127 395727
51661 395727 402619 409273 414497 416864 415895 412637 408844 405790 404073 404113 406252 410529 416909 425678 436960
51646 436960 449597 460907 467983 469381 465608 458225 448563 437199 424460 411187 398764 388300
51634 388300 379976 373267 367616 362824 359004 356410 355221 355344 356461 358301 360673 363154 364987 365479 364455
51619 364455 362311 359795 357707 356438 355667 354756 353539 352453 351843 351565 351459 351753 352621 353671 354295 354318 354034
51602 354034 353780 353828 354467 355879 358088 361264 365935 372584 381162 391161 401883 412361 421278 427365 429931
51587 429931 428921 424750 418326 410892 403463 396539 390642 386786 386011 388555 393909 401588 411545 423881
51573 423881 438401 454373 470568 485844 500064 514336 529923 546863 563847 579336 592729
51562 592729 604814 617568 633498 654734 682448 716891 757481 802534 849140 893777 933215
51551 933215 964944 987207 999106 1000661 992530 975631 950979 919602 882482 840860 796665 752163
51539 752163 708949 667647 628773 593335 562190 535297 512170 492742 477222 465289 455938 448065
51527 448065 440889 433999 427347 421085 415222 409698 404923 401683 400140 399412 398592 397722 397220 396920 396440 396162
51511 396162 397008 399345 402690 406288 409391 411195 411232 409739 407123 403353 398421 393043 388092 383544 378873
51496 378873 374393 371240 369911 369584 369073 367820 365861 363529 361338 359556 357763 355375 352700 350774 350007
51481 350007 349630 348731 347222 345467 343533 341232 338634 336178 334356 333352 332812 332081 330888 329620 328674
51466 328674 327776 326432 324723 323079 321538 319905 318441 317592 317154 316553 315917 315981 316837 317734 318329 319298 321371
51449 321371 324528 328518 333481 339662 347066 355768 366095 378214 391951 406980 422419 436186 445759
51436 445759 450259 451173 450688 449962 449276 448754 448006 445661 440353 432055 421845 410624 398769 386841 375854
51421 375854 366623 359304 353684 349698 347494 347069 347892 349074 350158 351584 353992 357155 360158 362612 365038
51406 365038 367869 370803 373428 375836 378154 380060 381301 382283 383601 385342 387292 389509 392186 395210
51392 395210 398374 401849 406011 410929 416387 422331 429041 437047 447166 460474 477983 500341 527873
51379 527873 560637 598413 641005 688633 741519 798760 857905 915815 969596 1016638 1054505
51368 1054505 1081369 1096370 1099272 1090139 1069636 1039229 1000635 955347 904933 851401 796861 743107
51356 743107 691813 644659 602760 566215 534585 507582 484956 466061 450023 436187 424167
51345 424167 413708 404734 397202 390685 384462 378299 372700 368031 363891 359750 355736 352269 349327 346647
51331 346647 344273 342327 340477 338237 335582 332827 330135 327645 325760 324726 324098 323223 322105 321291 321091
51316 321091 321464 322475 324247 326521 328817 330984 333114 335053 336613 338218 340688 344215 348043 351322
51302 351322 353952 356377 358779 360568 360694 358604 355001 351284 348022 344432 339794 334852 331064 328788
51288 328788 327101 325319 323813 323158 323343 324177 325823 328383 331406 334357 337352 340918 345030 348783 351151
51273 351151 351911 351650 350947 349823 348205 346683 346274 347275 348827 350005 351048 352988 356206 359781 362325
51258 362325 363187 362774 361902 360880 359218 356353 352658 349316 347039 345322 343281 340755 338188 335890 334184
51243 334184 333936 335959 339700 343302 345344 346026 346351 346614 346256 344922 343045 341238 339537 337630 335679
51228 335679 334411 334190 334411 334215 333560 333019 332689 332070 331111 330572 330984 331910 332768 333810 335677 338396 341419
51211 341419 344321 346911 348980 350566 352271 354778 358189 362190 366523 370865 374667 377709 380447 383169
51197 383169 385196 385633 384573 382720 380208 376711 372513 368467 364954 361857 359530 358677 359113 359725 359945
51182 359945 360255 360886 361092 360350 359383 359181 359692 360239 360747 361649 362921 363951 364304 364002 363146 361824 360410
51165 360410 359503 359432 360071 361097 362250 363387 364503 365618 366500 366628 365693 364120 362895 362774 363667 364752
51149 364752 365168 364746 364155 364265 365372 367031 368527 369339 369299 368596 367602 366426 364652 361802 358061 354260
51133 354260 351066 348485 346181 343972 341924 340305 339571 340182 342242 345425 349254 353255 356897 359822 362250
51118 362250 364842 367920 371027 373448 375033 376346 378114 380630 383569 386314 388511 390349 392288 394651
51104 394651 397575 401114 404987 408349 410343 411051 411496 412445 413478 413518 412117 409866 407562 405339 402824
51089 402824 399945 397249 395279 393964 392935 392262 392356 393115 393743 393725 393514 393810 394507 394859 394548 394039 393909 394219
51071 394219 394689 395191 395942 397245 399042 400849 402396 404294 407590 412622 418884 426217 435343 446708 459429
51056 459429 471988 483433 493272 500889 506177 510531 516227 524834 536744 551735 568850 585996 600963
51043 600963 613085 623004 630737 634997 634675 630075 622371 612782 602593 592976 584107 575037 564833 553366
51029 553366 540769 527032 512617 498817 486897 477294 469960 464876 461852 460382 460226 461695 465004
51016 465004 469848 475890 483075 491084 499170 507036 515176 523812 532150 539501 546547 554621 564031 573919
51002 573919 583604 593237 603146 613253 623321 633282 643130 652757 661983 670654 678709 686232 693248 699386
50988 699386 703958 706564 707440 707225 706698 706722 707964 710428 713695 717805 723371 730629 738889 747328 755887
50973 755887 765048 775224 786836 800587 817245 837458 861978 891470 925620 963019 1002617 1044969
50961 1044969 1091461 1142535 1197171 1253758 1310877 1367411 1422526 1475487 1525226 1570304 1609718
50950 1609718 1643441 1671835 1694946 1712896 1726526 1736968 1744879 1750857 1756437 1763764 1774021 1786490
50938 1786490 1799082 1809383 1815445 1816405 1812696 1805426 1795412 1782905 1767851 1749950 1728661 1703691
50926 1703691 1675405 1644221 1609657 1570549 1526319 1477623 1425800 1372208 1318207 1265174 1214081
50915 1214081 1165187 1118423 1074045 1032903 996094 964227 936922 913057 891616 872090 854156
50904 854156 837379 821558 806940 793717 781526 769855 758755 748770 740285 733215 727082 721182
50892 721182 715029 709060 704509 702108 701242 700895 700962 701898 703423 704579 705069 705649 707006 709051 711609 715063
50876 715063 719859 725802 732341 739275 746908 755652 765707 776937 788893 801193 813961 827793 843271
50863 843271 860759 880625 903308 928975 957413 988366 1021860 1058208 1097973 1142025 1191345
50852 1191345 1246620 1308178 1376300 1451370 1533669 1623275 1720241 1824608 1936062 2053671 2176040
50841 2176040 2301601 2428722 2555600 2680062 2799389 2910391 3009873 3095217 3164697 3217482
50831 3217482 3253519 3273414 3278482 3271065 3254632 3233025 3209248 3185228 3162901 3145032 3134455 3132649
50819 3132649 3139370 3153315 3172441 3193608 3212515 3224471 3225404 3212458 3184145 3140069 3080434 3005731
50807 3005731 2916898 2815480 2703478 2583297 2458020 2331337 2206729 2086715 1973015 1867109
50797 1867109 1770259 1683203 1606258 1539541 1482756 1435014 1395301 1363009 1337656 1318362 1304092
50786 1304092 1294278 1288712 1286886 1287844 1290530 1293877 1296725 1298183 1297971 1296020 1291962 1285610 1277729 1269583
50772 1269583 1261590 1252929 1242393 1229112 1212563 1192703 1170354 1146855 1123074 1099116 1074970 1050811
50760 1050811 1026609 1002219 978285 956430 938057 923225 911040 900802 892448 886233 882406 881052
50748 881052 881932 884562 888713 894780 903515 915477 930796 949341 971092 996449 1026158 1060771 1100156
50735 1100156 1143721 1191058 1242123 1296911 1355252 1416893 1481387 1547859 1615186 1682508 1749332
50724 1749332 1815243 1879799 1942628 2003171 2060216 2111988 2156741 2192980 2219187 2233871 2236189
50713 2236189 2226437 2206004 2177211 2143169 2107353 2072919 2042362 2017559 1999773 1989508 1986584 1990338
50701 1990338 1999659 2013069 2028971 2045556 2060205 2069485 2070377 2061350 2041818 2011125 1969030 1917001
50689 1917001 1857959 1794639 1729079 1663667 1601387 1544340 1492843 1446539 1405746 1371177 1343037
50678 1343037 1321111 1305351 1295803 1292321 1294884 1303813 1319177 1340346 1366630 1397874 1433736 1472597
50666 1472597 1511848 1549235 1583433 1613594 1639132 1660212 1677904 1693475 1707630 1720549 1732469
50655 1732469 1743976 1755576 1766972 1776924 1784179 1788638 1791415 1793814 1796723 1801080 1808368 1820019 1836575
50642 1836575 1857819 1883609 1914160 1949577 1989482 2033124 2079526 2127422 2175265 2221447 2264582
50631 2264582 2303729 2338632 2369844 2398568 2426324 2454633 2484487 2515235 2543205 2561426 2561785 2539006
50619 2539006 2493673 2431800 2361584 2290471 2224315 2167453 2122232 2088798 2066249 2053910 2051003
50608 2051003 2055551 2064717 2076186 2088250 2098460 2103347 2100030 2087411 2065361 2033487 1991410 1939808
50596 1939808 1880535 1815920 1748321 1679985 1612758 1547901 1486342 1428814 1375656 1326870 1282682
50585 1282682 1243598 1209585 1179579 1152311 1127371 1105054 1085384 1067740 1051404 1036195 1022564
50574 1022564 1011225 1002615 996656 993148 992250 994236 998829 1005359 1013620 1023944 1036166 1049166 1061952
50561 1061952 1074774 1088760 1104862 1123642 1145705 1171542 1200988 1233286 1267807 1304368 1342865
50550 1342865 1382741 1422783 1461356 1496999 1528983 1557331 1582516 1605565 1628287 1652703 1679885
50539 1679885 1709731 1742081 1777563 1817149 1861402 1910502 1964534 2023443 2087248 2156713 2233353
50528 2233353 2318302 2411573 2512764 2621878 2738837 2862589 2991343 3123299 3256468 3388062
50518 3388062 3514733 3633320 3740822 3833925 3909291 3964377 3997529 4007518 3993594 3956008 3896000
50507 3896000 3815376 3716631 3603355 3479886 3350422 3218983 3090196 2969450 2861760 2770587
50497 2770587 2697865 2644930 2613077 2603088 2614234 2644004 2689070 2746305 2812186 2881132 2945327
50486 2945327 2996861 3029832 3040290 3025333 2983558 2916257 2827117 2720560 2600929 2472973 2341862
50475 2341862 2211984 2086021 1965430 1851400 1745133 1647612 1559422 1480655 1410810 1348933
50465 1348933 1293977 1245031 1201399 1162771 1129295 1101113 1077798 1058514 1042832 1031124 1024006
50454 1024006 1021409 1022181 1024517 1026908 1028822 1030531 1032340 1034168 1035826 1037377 1039105 1041502 1045356 1051449
50440 1051449 1059824 1069685 1080131 1090616 1100550 1109177 1116362 1122970 1129884 1137008 1143877 1150885 1159216
50427 1159216 1169747 1182555 1197240 1213135 1229390 1245668 1262708 1281611 1302564 1324837 1348122
50416 1348122 1373351 1402156 1435804 1474625 1518066 1565395 1616616 1672439 1733047 1797275 1863526
50405 1863526 1930997 1999197 2066667 2131231 2191518 2247315 2298257 2342873 2379048 2404697 2417831
50394 2417831 2416741 2400515 2369086 2322869 2263050 2192273 2114210 2032169 1948652 1866328 1788506
50383 1788506 1718113 1656723 1604990 1563492 1532753 1512939 1504063 1506158 1518720 1540051 1567434 1597809
50371 1597809 1628194 1655691 1677413 1690450 1692151 1680898 1656787 1621395 1576941 1525798 1470336
50360 1470336 1412470 1353274 1293643 1235280 1180315 1129842 1083499 1040630 1001110 964875 931578
50349 931578 901199 874239 850706 829628 810246 793172 779605 769788 763046 759047 758174 760658 766140
50336 766140 774323 785522 800205 818065 837490 855642 869218 875790 874950 868325 858375 847144 835858
50323 835858 825283 816134 809135 804828 803386 804501 807303 810570 813415 815942 818941 822675 826336 829037
50309 829037 831045 833471 836891 840912 845040 849291 853735 858102 862198 866302 870720 875246 879390 882976
50295 882976 886301 889835 893905 898412 902653 905656 906993 907275 907792 909826 914218 921174 930100 939550 947475
50280 947475 951780 951157 945878 937803 929274 921948 916666 914006 914285 917177 921965 928266 936022 944698 953149
50265 953149 960466 966437 970945 973451 973521 971634 969081 967092 966070 965493 964550 963089 961856 961543 961911 962415
50249 962415 963466 966272 971542 979235 989739 1004245 1023416 1046399 1071717 1098541 1126565 1155245
50237 1155245 1183876 1212018 1239274 1265015 1288894 1311335 1332969 1353758 1372974 1389602 1402186
50226 1402186 1408737 1407532 1398003 1380482 1355439 1323588 1286552 1246771 1206704 1168458 1133886 1104308
50214 1104308 1080008 1060384 1044585 1031578 1019651 1006494 990090 969472 944798 917150 888345
50203 888345 860382 834610 811356 790358 771500 755073 741508 730914 722811 716282 710396 704551
50191 704551 698549 692491 686565 680820 675202 669895 665367 661788 658645 655334 651911 648725 645487 641535
50177 641535 637080 633320 630999 629628 628496 627684 627519 627695 627686 627547 627629 627867 628046 628466 629654 631660 634220
50160 634220 637290 640745 643871 646068 648034 651464 657462 665826 675822 686824 698032 708395 717343
50147 717343 725176 732334 738555 743095 745529 746053 745148 743332 741282 740018 740772 744479 751332 760989 773300
50132 773300 788707 807837 830998 858330 890177 926918 968456 1014148 1063142 1114510 1167115
50121 1167115 1219664 1270975 1320173 1366954 1411946 1456562 1501950 1547993 1593506 1637100 1677293
50110 1677293 1711773 1737258 1750642 1750359 1736664 1710844 1674396 1628850 1576004 1517979 1456860 1394392
50098 1394392 1332155 1271875 1215228 1163340 1116753 1075840 1040830 1011380 986554 965321 946659
50087 946659 929257 911957 894912 879612 867214 857360 849092 842305 837531 834844 833846 834412 836594
50074 836594 839950 843842 848247 853406 858677 862722 864973 866072 866652 866524 865432 863757 861876 859395 855683
50059 855683 850797 845362 839831 834414 829488 825410 821852 817798 812468 806094 799664 794122 789912 787127
50045 787127 785722 785482 786061 787465 790406 795718 803242 811707 820053 828576 838371 849901 862533 875325
50031 875325 887740 899604 910936 922006 933212 944537 955195 963904 969649 972404 973249 973541 973707
50018 973707 972989 970550 966561 961891 957064 952144 947547 944404 943961 947010 954006 965266 980771 999982
50004 999982 1022094 1046467 1072736 1100619 1129644 1159180 1188817 1218710 1249240 1280198 1310566
49993 1310566 1339235 1365550 1388828 1407665 1420104 1424216 1418206 1400416 1370012 1327839 1276344 1218725
49981 1218725 1158326 1098286 1040994 987734 939114 895657 857689 825011 797168 773859 754616
49970 754616 738443 724333 711857 700725 690226 679954 670676 663477 658212 653857 650255 648326 648382
49957 648382 649481 650942 653460 658133 665189 674221 684886 696697 708742 720260 731053 740847 748820
49944 748820 754323 757639 759467 760102 759606 758204 755806 751540 744525 734877 723359 710307 695623 679686
49930 679686 663517 647992 633373 619661 606963 595402 585056 576053 568468 562204 557248 553986
49918 553986 552867 553763 555930 558589 561332 564064 566902 570142 574032 578531 583483 589037 595676 603774
49904 603774 613307 623994 635640 648289 662122 677051 692337 706680 718934 728683 736080 741234
49892 741234 744004 744324 742431 738604 732800 724728 714310 701927 688114 673203 657561 642106 628022
49879 628022 615624 603914 591807 579623 568845 560484 554286 549505 545745 542803 540284 537847 535619
49866 535619 534017 533345 533675 534885 536731 539221 542975 548833 556966 566807 577945 590600 604974 620604
49852 620604 636658 652353 666721 678558 687217 693188 697443 700467 702310 703090 702736 700423 694994 686076
49838 686076 674410 661181 647496 634413 622860 613290 605650 599729 595250 591669 588271 584730 581427
49825 581427 579181 578688 580106 583079 587258 592911 600724 610869 622601 635016 647835 660961 673625
49812 673625 684707 693845 701631 708630 714732 719581 723057 725112 725558 724258 721200 716187 708894 699541
49798 699541 689213 679133 669787 660981 652468 644096 635568 626631 617636 609482 602808 597492 593110 589616
49784 589616 587219 585741 584488 582827 580690 578382 576181 574284 572979 572586 573282 575171 578493 583571 590506
49769 590506 599020 608534 618296 627470 635397 641817 646791 650437 652939 654689 656137 657375 658090 657898 656494
49754 656494 653449 648131 640061 629307 616595 603108 590084 578254 567640 558104 549919 543419 538225
49741 538225 533451 528853 525181 523046 521927 520779 519229 517661 516419 515616 515664 517306 520773 525262 529583
49726 529583 533268 536879 541307 546953 553660 561299 570163 580652 592696 605648 618587 630504 640415
49713 640415 647785 652910 656517 658883 659679 658645 655895 651440 644991 636600 627104 617543 608467 600074
49699 600074 592601 586138 580410 575239 570984 568025 566079 564543 563397 563249 564625 567636 572167 577792
49685 577792 583617 588927 594072 600139 607543 615513 623235 631046 640166 651636 665849 682689 701424
49672 701424 720406 737401 750554 759093 763176 763345 760371 755556 750693 747284 745679 745186 745140 745565 746519
49657 746519 746994 744933 738507 727294 712284 695074 677205 659975 644382 630920 619476 609615
49645 609615 601138 594281 589335 586203 584536 584172 585104 586974 588945 590248 590620 590165 589040 587430 585505
49630 585505 583199 580345 577196 574387 572000 569116 564894 559842 555373 552145 549530 546831 544319 542677
49616 542677 541953 541601 541292 541168 541388 541896 542709 543993 545664 547245 548416 549521 551136 553218 555096 556401
49600 556401 557568 559148 560941 562321 563233 564368 566256 568591 570662 572126 573211 574339 575723 577222
49586 577222 578522 579529 580515 581761 583200 584722 586571 588939 591294 592800 593525 594561 596684 599482 602217
49571 602217 605016 608713 613860 620340 627696 635499 643659 652631 662931 674122 684748 693622 700725
49558 700725 706427 710465 712340 712155 710219 706264 700090 692774 686127 680949 676740 673206 670967 670472 671197
49543 671197 672439 674062 675867 676979 676731 675665 674838 674347 673407 671867 670936 672107 675791 681312 687953
49528 687953 695726 705181 716716 730167 745057 761128 778480 797105 816325 834699 850479 862182
49516 862182 869059 871363 870304 867569 864633 862391 861384 862181 865191 869940 874804 877851 877959 874944 868840
49501 868840 859629 847751 834245 820067 805639 791373 778191 766928 757508 749244 741824 735477
49489 735477 730237 725677 721538 718154 715955 714794 713982 712886 711442 710243 710113 711400 713625 715903 717663
49474 717663 718830 719492 719741 719886 720476 721907 724135 726858 729875 733204 736841 740459 743442 745343 746311
49459 746311 746844 747071 746585 745085 742853 740327 737496 734083 730075 725667 720843 715499 709936 704806 700475
49444 700475 696714 693026 689082 684916 681019 678158 676755 676395 676219 675848 675751 676761 679484 684102 690432
49429 690432 698128 706978 717036 728407 741064 754951 770030 786099 802875 820341 838315 855090
49417 855090 867175 871562 868488 861311 853627 847137 842245 839537 839866 843443 849674 857900 867819 879150
49403 879150 891266 903339 914741 925181 934620 943274 951775 961032 971579 983124 995016 1006973
49391 1006973 1018795 1029435 1037218 1041371 1042675 1042140 1039705 1034870 1027868 1019280 1009042 997001 984215
49378 984215 972506 962599 953783 945564 938683 934146 932195 932655 935473 940356 946482 953170 960349 967885
49364 967885 974870 980133 983216 984491 984561 983822 982315 979671 975414 969559 962697 955478 948363 941904 936661
49349 936661 932552 928892 925517 923394 923535 925566 927963 929618 930703 931868 932894 932409 929055 922982 915934
49334 915934 909567 903878 897736 890813 884286 879464 876493 874771 873964 873938 874140 873930 873583 874357 877257 881978
49318 881978 887277 892273 897161 902591 908608 914633 920503 926983 934773 943431 951933 960137 969039 979612
49304 979612 992083 1006346 1022352 1039860 1058316 1077040 1094796 1109146 1117282 1118149 1113180 1104514
49292 1104514 1093175 1079475 1064371 1049378 1035388 1022384 1010171 998706 987730 976779 965769
49281 965769 955235 945894 938149 931970 927022 922970 919832 918077 918305 920916 926008 933206 941468 949426
49267 949426 956145 961448 965501 968406 970226 970908 970064 967356 963290 959191 956221 954953 956040 960471 968614
49252 968614 979568 992038 1005253 1018383 1029582 1036548 1037951 1033752 1024321 1010016 991666 970938
49240 970938 949994 930835 914621 901161 889274 878101 868014 860046 854828 852486 853084 856370 861310
49227 861310 866692 872279 878796 886653 895252 903690 911709 919723 928183 937096 945999 954390 962281 970162
49213 970162 978201 985730 991914 996833 1001473 1006677 1012466 1018381 1024175 1030192 1037352 1046715 1058628 1072273
49199 1072273 1086292 1099864 1112954 1125655 1137769 1149065 1159613 1169694 1179554 1189234 1198408 1206420
49187 1206420 1212767 1217612 1221659 1225571 1229689 1234212 1239322 1245132 1251828 1260006 1270648 1284641 1302442
49174 1302442 1324228 1350313 1381295 1417787 1459801 1506086 1553833 1598951 1636835 1663529 1677156
49163 1677156 1678873 1672424 1662430 1652730 1645793 1642744 1643341 1646100 1649064 1650825 1650947 1649622 1647103 1643462
49149 1643462 1638834 1633937 1630151 1628713 1629779 1632665 1637048 1643459 1652356 1663229 1675031 1687212 1699869
49136 1699869 1713153 1726968 1741176 1755698 1770381 1785021 1799553 1814111 1828986 1844562 1861005
49125 1861005 1877803 1893908 1908617 1922297 1936060 1950858 1966908 1983773 2000837 2017939 2035630
49114 2035630 2054660 2075234 2097244 2121417 2149869 2185305 2229924 2285116 2351325 2427110 2508170
49103 2508170 2588187 2662132 2729968 2796950 2868289 2941416 3003408 3038007 3036928 3005006 2955067
49092 2955067 2898600 2840435 2779440 2712304 2637573 2557983 2479480 2407588 2344863 2291760 2248612
49081 2248612 2215543 2191184 2173006 2159032 2148434 2140621 2134695 2129780 2125201 2120356 2115023 2109752 2105341
49068 2105341 2101956 2099162 2096582 2093964 2090930 2087263 2083172 2078729 2073422 2066969 2060224 2054447 2049884 2045801
49054 2045801 2041665 2037493 2033265 2028952 2025092 2022493 2021275 2020843 2020818 2021386 2022830 2025385 2029509 2035731 2044290
49039 2044290 2055363 2069218 2085324 2101642 2115648 2126027 2132760 2136102 2136602 2135866 2135884 2137319 2139306
49026 2139306 2140989 2142273 2143047 2142880 2141873 2140832 2140198 2139661 2139216 2139670 2141603 2144503 2147512 2150536 2154191
49011 2154191 2159042 2165170 2172113 2179123 2185898 2193038 2201252 2210242 2219106 2227751 2236912 2246690 2256092 2264370
48997 2264370 2271858 2278997 2285340 2290052 2292760 2293495 2292495 2290556 2288913 2288106 2287382 2285675 2282738 2278966 2274671
48982 2274671 2270117 2265811 2262161 2258976 2255753 2252371 2249211 2246729 2245008 2243601 2241784 2239128 2235715 2231610
48968 2231610 2226436 2220039 2213226 2207174 2202255 2198215 2195283 2194116 2194687 2196306 2198951 2203501 2210266 2218228
48954 2218228 2226257 2234338 2243158 2253231 2264800 2277876 2291934 2306228 2320755 2336215 2352700 2369351
48942 2369351 2385703 2402471 2420465 2439628 2459877 2482030 2507040 2534869 2564897 2596942 2631143
48931 2631143 2667338 2705313 2745290 2787520 2831716 2877463 2924742 2973522 3023300 3073751 3125444
48920 3125444 3179249 3235245 3292698 3350763 3408667 3465579 3520910 3574604 3626743 3677163 3725779
48909 3725779 3772840 3818471 3862351 3904221 3944223 3982319 4017946 4050761 4081234 4110029 4137348
48898 4137348 4163391 4188740 4213588 4237193 4258861 4278944 4298016 4315543 4330311 4341745 4349878
48887 4349878 4354319 4354378 4350165 4342595 4332234 4318983 4303014 4285179 4266189 4245949 4223864 4199321
48875 4199321 4171792 4140974 4107054 4070432 4031100 3988528 3942193 3892035 3838641 3783381 3728139
48864 3728139 3674316 3622086 3571033 3521390 3474055 3429436 3386893 3345553 3305234 3266369 3229420
48853 3229420 3194665 3162306 3132460 3105082 3080079 3057536 3037784 3021229 3008082 2998238 2991384 2987183
48841 2987183 2985297 2985370 2987131 2990459 2995209 3001226 3008718 3018383 3030769 3045652 3062374 3080550 3099925
48828 3099925 3119790 3139247 3158080 3176788 3195909 3215909 3237512 3261102 3285793 3310010 3333165
48817 3333165 3355919 3378725 3401249 3423438 3445990 3469144 3492112 3514297 3536169 3558293 3580447
48806 3580447 3602403 3624697 3647857 3671722 3696298 3722383 3750456 3779706 3809090 3838552 3868212
48795 3868212 3897151 3924181 3949189 3972545 3993705 4011771 4027171 4041568 4056150 4070953 4085595
48784 4085595 4099464 4111112 4118462 4119929 4114917 4103445 4086031 4063800 4038029 4009552 3978969 3946982
48772 3946982 3913911 3879267 3842460 3803530 3762628 3719426 3673854 3626842 3579380 3531411 3482661
48761 3482661 3433980 3386699 3341076 3296631 3253599 3212731 3173947 3136623 3101140 3068741 3039787
48750 3039787 3013431 2989082 2966757 2945823 2924881 2903527 2883148 2865421 2850946 2839699 2831784
48739 2831784 2827148 2825367 2826155 2829288 2833596 2836936 2837809 2836456 2834016 2831290 2828734 2826852 2825900 2825662 2826046
48724 2826046 2827526 2830556 2834893 2839830 2844791 2849411 2853361 2856365 2858188 2858539 2857371 2855331 2853415 2851990
48710 2851990 2850532 2848482 2845999 2843784 2842514 2842562 2843889 2846081 2848735 2851789 2855312 2859173 2863270 2867853
48696 2867853 2873198 2879181 2885661 2893021 2901649 2911026 2919889 2927251 2932780 2936464 2938539 2939653 2940517 2941534
48682 2941534 2943179 2946257 2951045 2956533 2961346 2965087 2967947 2969410 2968470 2964911 2959194 2951218 2940422 2927113
48668 2927113 2912436 2896839 2879738 2861013 2841609 2822224 2802399 2781437 2759408 2736734 2713458
48657 2713458 2689168 2663010 2633707 2600575 2564888 2529322 2495664 2463829 2433399 2405066 2379953
$$ [...]
##END NTUPLES=NMR SPECTRUM
##END=
