
##TITLE=UV1218_M5_1296-1170_50_7229502_twBE4QybZ5
##JCAMPDX= 6.0         $$ Bruker NMR JCAMP-DX V2.0
##DATA TYPE= NMR SPECTRUM
##DATA CLASS= NTUPLES
##ORIGIN= BRUKER
##OWNER= Administrator
$$ 1.72 TOPSPIN		Version 2.1
$$ 2013-01-23 20:52:39.830 -0500  Administrator@X
$$ Compression mode = diff/dup
##.OBSERVE FREQUENCY= 400.02188249412
##.OBSERVE NUCLEUS= ^1H
##.ACQUISITION MODE= SIMULTANEOUS (DQD)
##.ACQUISITION SCHEME= undefined
##.AVERAGES= 8
##.DIGITISER RES= 22
##SPECTROMETER/DATA SYSTEM= spect
##.PULSE SEQUENCE= zg30
##.SOLVENT NAME= COFFEE_meoh
##.SHIFT REFERENCE= INTERNAL, COFFEE_meoh, 1, 14.98509
##AUDIT TRAIL= $$ (NUMBER, WHEN, WHO, WHERE, PROCESS, VERSION, WHAT)
$$ ##TITLE= Audit trail, TOPSPIN		Version 2.1
$$ ##JCAMPDX= 5.01
$$ ##ORIGIN= Bruker BioSpin GmbH
$$ ##OWNER= Administrator
$$ $$ E:\/data/COFFEE/nmr/UV1218_M5_1296-1170_50_7229502_twBE4QybZ5/30/pdata/1/auditp.txt
$$ ##AUDIT TRAIL=  $$ (NUMBER, WHEN, WHO, WHERE, PROCESS, VERSION, WHAT)
(   1,<2013-01-23 20:52:31.721 -0500>,<Administrator>,<X>,<go>,<TOPSPIN 2.1>,
      <created by zg
	started at 2013-01-23 20:51:25.346 -0500,
	POWCHK enabled, PULCHK disabled,
       configuration hash MD5:
       86 BA 57 50 F2 9D 5C 9B 26 00 A9 28 5F 66 2E 89
       data hash MD5: 64K
       A2 1C CF 84 3E 49 76 DC 90 51 A9 64 4C 08 29 A0>)
(   2,<2013-01-23 20:52:34.846 -0500>,<Administrator>,<X>,<proc1d>,<TOPSPIN 2.1>,
      <Start of raw data processing
       efp LB = 0 FT_mod = 6 PKNL = 1 PHC0 = 0 PHC1 = 0 SI = 32K 
       data hash MD5: 32K
       3D 7E F6 A1 2A 8F CB EE D5 40 93 95 1E 6E D4 BB>)
(   3,<2013-01-23 20:52:35.315 -0500>,<Administrator>,<X>,<proc1d>,<TOPSPIN 2.1>,
      <pk PHC0 = 99.92615 PHC1 = 0 
       data hash MD5: 32K
       67 B4 B2 05 DD B9 C0 D0 75 D2 9E 1E 4C C0 7D 13>)
(   4,<2013-01-23 20:52:35.549 -0500>,<Administrator>,<X>,<proc1d>,<TOPSPIN 2.1>,
      <abs ABSG = 1 
       data hash MD5: 32K
       AF E7 DD 0B C2 7C 84 DD 84 52 E4 CB ED EC AE FB>)
(   5,<2013-01-23 20:52:35.690 -0500>,<Administrator>,<X>,<proc1d>,<TOPSPIN 2.1>,
      <abs ABSG = 2 
       data hash MD5: 32K
       B1 06 09 9D 7C 09 51 BA 99 91 9A AE 71 45 E9 BB>)
(   6,<2013-01-23 20:52:35.830 -0500>,<Administrator>,<X>,<proc1d>,<TOPSPIN 2.1>,
      <abs ABSG = 3 
       data hash MD5: 32K
       D5 4C AD DB 2F CC E3 F3 A8 7F CB CA D6 E9 47 8B>)
(   7,<2013-01-23 20:52:35.986 -0500>,<Administrator>,<X>,<proc1d>,<TOPSPIN 2.1>,
      <abs ABSG = 4 
       data hash MD5: 32K
       9B F6 44 BC 4B D9 50 7A 0A 8A 4E A7 04 EE B8 15>)
(   8,<2013-01-23 20:52:36.143 -0500>,<Administrator>,<X>,<proc1d>,<TOPSPIN 2.1>,
      <abs ABSG = 5 
       data hash MD5: 32K
       C2 BD CC 93 FE 6E 0F 6A 29 51 51 48 2C 35 A4 3B>)
$$ ##END=
$$ 
$$ $$ hash MD5
$$ $$ A9 22 0A 5C C9 C9 0B 98 B8 FD A6 4B 0B 54 C7 89
##$RELAX= 
##$RELAX= 
##$RELAX= 
##$RELAX= 
##$RELAX= 
##$RELAX= 
##$RELAX= 
$$ Bruker specific parameters
$$ --------------------------
##$DU= <E:\>
##$EXPNO= 30
$$ [...]
150 150 150 150 150 150 150 150
##$TP07= 0
##$TPNAME0= <>
##$TPNAME1= <>
##$TPNAME2= <>
##$TPNAME3= <>
##$TPNAME4= <>
##$TPNAME5= <>
##$TPNAME6= <>
##$TPNAME7= <>
##$TPOAL= (0..7)
0.5 0.5 0.5 0.5 0.5 0.5 0.5 0.5
##$TPOFFS= (0..7)
0 0 0 0 0 0 0 0
##$TUNHIN= 0
##$TUNHOUT= 0
##$TUNXOUT= 0
##$USERA1= <user>
##$USERA2= <user>
##$USERA3= <user>
##$USERA4= <user>
##$USERA5= <user>
##$V9= 5
##$VALIST= <valist>
##$VCLIST= <CCCCCCCCCCCCCCC>
##$VD= 0
##$VDLIST= <DDDDDDDDDDDDDDD>
##$VPLIST= <PPPPPPPPPPPPPPP>
##$VTLIST= <TTTTTTTTTTTTTTT>
##$WBST= 1024
##$WBSW= 4
##$XGAIN= (0..3)
0 0 0 0
##$XL= 0
##$YL= 0
##$YMAX_a= 675261
##$YMIN_a= -576067
##$ZGOPTNS= <>
##$ZL1= 120
##$ZL2= 120
##$ZL3= 120
##$ZL4= 120
##$ABSF1= 14.98509
##$ABSF2= -5.573092
##$ABSG= 5
##$ABSL= 3
##$ALPHA= 0
##$AQORDER= 0
##$ASSFAC= 0
##$ASSFACI= 0
##$ASSFACX= 0
##$ASSWID= 0
##$AUNMP= <proc_prof1d_extract_pilot.lims>
##$AXLEFT= 0
##$AXNAME= <>
##$AXNUC= <1H>
##$AXRIGHT= 0
##$AXTYPE= 0
##$AXUNIT= <>
##$AZFE= 0.1
##$AZFW= 0.1
##$BCFW= 0
##$BC_mod= 0
##$BYTORDP= 0
##$COROFFS= 0
##$CY= 15
##$DATMOD= 1
##$DC= 0
##$DFILT= <>
##$DTYPP= 0
##$F1P= 0
##$F2P= 0
##$FCOR= 0.5
##$FTSIZE= 32768
##$FT_mod= 6
##$GAMMA= 0
##$GB= 0
##$INTBC= 1
##$INTSCL= 1
##$ISEN= 128
##$LB= 0
##$LEV0= 0
##$LPBIN= 0
##$MAXI= 10000
##$MC2= 0
##$MEAN= 0
##$ME_mod= 0
##$MI= 0
##$NCOEF= 0
##$NC_proc= -8
##$NLEV= 6
##$NOISF1= 0
##$NOISF2= 0
##$NSP= 0
##$NTH_PI= 0
##$NZP= 0
##$OFFSET= 14.98509
##$PC= 1
##$PHC0= 99.92615
##$PHC1= 0
##$PH_mod= 1
##$PKNL= yes
##$PPARMOD= 0
##$PPDIAG= 0
##$PPIPTYP= 0
##$PPMPNUM= 2147483647
##$PPRESOL= 1
##$PSCAL= 4
##$PSIGN= 0
##$PYNMP= <proc.py>
##$REVERSE= no
##$SF= 400.02
##$SI= 32768
##$SIGF1= 0
##$SIGF2= 0
##$SINO= 400
##$SIOLD= 32768
##$SPECTYP= <>
##$SREGLST= <1H.CDCl3>
##$SSB= 0
##$STSI= 32768
##$STSR= 0
##$SW_p= 8223.68421052631
##$SYMM= 0
##$S_DEV= 0
##$TDeff= 65536
##$TDoff= 0
##$TI= <>
##$TILT= no
##$TM1= 0
##$TM2= 0
##$TOPLEV= 0
##$USERP1= <user>
##$USERP2= <user>
##$USERP3= <user>
##$USERP4= <user>
##$USERP5= <user>
##$WDW= 1
##$XDIM= 32768
##$YMAX_p= 476917159
##$YMIN_p= -877810
##$CURPLOT= <Network HP LaserJet P1505>
##$CURPRIN= <$Network HP LaserJet P1505>
##$DFORMAT= <normdp>
##$LAYOUT= <+/1D_H.xwp>
##$LFORMAT= <normlp>
##$PFORMAT= <normpl>
##$SURQMSG= 1
$$ End of Bruker specific parameters
$$ ---------------------------------
##NTUPLES= NMR SPECTRUM
##VAR_NAME=  FREQUENCY,     SPECTRUM/REAL,   SPECTRUM/IMAG
##SYMBOL=    X,             R,               I
##VAR_TYPE=  INDEPENDENT,   DEPENDENT,       DEPENDENT
##VAR_FORM=  AFFN,          ASDF,            ASDF
##VAR_DIM=   32768,         32768,           32768
##UNITS=     HZ,            ARBITRARY UNITS, ARBITRARY UNITS
##FACTOR=    0.250966925370066, 1,           1
##FIRST=     8223.43324360094, 161355,       -141529
##LAST=      0,             -126719,         -185185
##MIN=       0,             -877810,         0
##MAX=       8223.43324360094, 476917159,    0
$$ Real data points
##PAGE= N=1
##DATA TABLE= (X++(R..R)), XYDATA
$$ [...]
23816 186120 178177 159285 -331963 421287 200355 56631 42007 165831 133098 -196096 -165058
23805 -165058 39446 -66848 -289685 -79563 -170744 -118273 -106438 242144 -144450 374302 130882
23793 -189427 42825 104709 71370 87963 -468775 -98156 -96876 -126230 -288655 25285 61763
23782 61763 -9454 16429 25255 -91337 -122912 -7453 -20912 -160056 28735 -285755 -8924 -136827
23770 -136827 -24297 46017 23452 205647 -97376 275340 -424428 -52003 14530 -67769 -209075
23759 -209075 -192299 121478 -86823 98820 -87714 -70990 -79253 108434 17605 17123 -28855 -196190
23747 -196190 -70755 -56701 -23418 50041 -305063 -62978 982 47307 185665 -349939 -194152
23736 -194152 -111122 -157796 -199830 -97133 68460 83263 178102 -176576 127622 -21345 -187386
23725 -187386 -97538 -221953 -139631 -248045 156475 -90025 -220589 157907 354095 443293
23715 443293 159139 210687 -117970 286294 210001 -242383 -50235 54304 -367009 -245200
23705 -245200 219221 -161686 -111674 -191459 -285090 113317 229611 -195932 -345882 113040
23694 34591 -180104 -153062 181934 103314 -3646 -117626 -77885 -63021 22762 -77023 50857
23682 151389 122355 -30205 -85444 -50984 1287 76194 6462 80719 -163977 88897 -87576 202488
23669 -31176 -117185 356644 -383836 -137037 220585 -61463 -117370 40942 143846 -64742 -201751
23658 -201751 130292 -270104 257477 -300227 -173003 95503 152925 -77152 -141525 -144102 -55687
23646 -155780 -119701 31736 -136028 21433 92731 -79495 -4492 126463 -284561 -39437 -94244
23635 -94244 -117504 74047 -189804 40294 123204 223077 69006 121914 -36413 -27439 209579
23623 -54992 -145252 59624 241685 -179139 101800 271017 136161 175886 -38658 -108807 -248705
23612 -248705 -95409 126095 -113590 -209044 -422358 123542 -104019 55304 -66938 59572
23601 86373 258544 162993 345181 41626 349 -244532 -245622 132825 -30657 186757 294727
23590 294727 299276 139589 185817 -23703 -163209 70915 288770 72919 -33236 -2656 -261455
23579 -261455 171886 257906 257837 -97967 -55060 41941 -191543 -123162 184918 313568 -23011
23567 -267063 -103762 -76313 -96017 153848 -219703 -125984 120780 130164 -11312 -134863 258096
23555 137216 329956 156514 -91960 134765 93759 -261719 -144458 -105586 102009 276329
23545 276329 114594 43652 257081 -236171 -63156 -331662 -163680 198491 316925 234434
23535 234434 135831 -168453 -63144 -194193 -23809 145061 -56349 -280570 -8375 1708 99488
23524 99488 -364873 -160460 232505 273064 -3888 -46035 -269490 -6238 78152 -763 250271
23512 -4618 -147180 -147383 29200 -74298 114167 -99301 -260776 -284496 -289912 143175 -324869
23500 68638 132888 26270 -102092 15095 153400 65801 274999 128475 216617 -85376 45243
23488 43965 -31932 -110341 -11670 79481 -9690 -123033 -457972 -180327 122129 -101414 33746
23476 -316054 -98011 -129206 -7169 11968 -243697 17755 178533 211568 -175536 -30169 -446663
23465 -446663 52772 242148 -153424 -68470 324886 266510 -214495 -270857 56587 -122653
23454 -90780 194792 -69457 8733 161376 -806268 -171938 59066 -43031 248030 215999 40364
23442 282896 64797 -285796 96215 -60653 70197 -264050 96818 9680 411715 -13071 -183232
23431 -183232 162408 -125191 -353071 301377 -198833 -85573 85022 -164541 73604 142876
23421 142876 -379971 -370957 -107620 -277263 -55779 74724 -5193 -293626 -46269 13849 -94936
23409 76895 468384 86171 -141605 -113637 32934 -47473 -19389 62110 -563496 -99775 -238523
23398 -238523 -153249 -70856 134476 142614 -31532 -402 41019 -139953 93834 -202131 95670
23386 274631 -26524 -327290 122350 -22278 -171006 -101303 134325 91603 119901 130280 -219383
23374 -145520 -61398 27973 100031 20803 285262 -110116 -39004 146183 -46496 99301 -139611
23362 -61898 43666 -4545 -95569 -138341 -78472 -321720 79561 27042 -217027 -123030 283893
23350 -83807 -173965 71172 72651 136463 -129031 245091 53982 270003 77756 66447 201782
23339 201782 -54971 -11175 -163900 -160910 87153 29221 -111174 43326 -60041 -55921 143009
23327 -123082 404336 79346 -300738 -219224 -152383 -129277 222015 78988 -25985 -264849 171979
23315 -153868 52404 1723 -149132 62201 -15800 -122766 53330 255592 -23313 28221 -366376
23303 18584 -43732 33050 362122 -186640 107186 162115 152454 240890 -220640 -122230 -85831
23292 -85831 -102632 -330241 -129716 -77168 -73696 -231134 -126833 -93536 -165149 -11158 -146233
23281 -146233 246574 272510 155169 -117728 140003 15138 -46580 63018 -426187 42740
23270 -158203 -106681 -344621 -11478 182579 -144151 201090 -117970 -237013 109522 94570
23260 94570 -386236 121576 6657 306816 -77449 -139524 -316906 -207623 -327244 -295003 200847
23248 212396 132909 -298286 -56940 -426071 25363 -289404 -139188 -125916 170731 -180244
23237 104920 -136963 -40042 53217 -64765 -161947 -182469 120638 173303 -17886 -4020 129939
23225 -445162 82666 -142747 72664 -212471 -88810 -15587 -62604 72529 -10382 -24396 186976
23213 242614 183728 73930 41613 -98261 -122926 -79599 -106532 215995 47702 13063 255504
23202 255504 -188466 -118557 95978 84911 -24925 37685 -130141 -42748 -278915 311327 -177563
23190 -58479 -4735 -113797 100242 -451862 21157 27957 -394648 262443 -199922 -114889 208876
23178 -44361 -129126 108322 115655 -34846 -88428 307635 9047 -66346 -2997 -240116 7646 101502
23166 101502 -229444 102391 210411 -166601 -310775 -122305 -238984 193758 53932 -148846
23155 78991 269649 -173502 -320672 -140044 -178986 -118003 10583 -238649 95198 1070 375351
23144 375351 -63152 -101376 -153402 62475 442713 282430 285347 84578 -105840 -46645 56390
23132 65277 -75298 -80643 -244084 -82850 -217504 153998 -177380 139289 119736 561 132748
23121 132748 226093 259545 -630083 305047 -72993 115985 138083 -41472 112604 45509 -131342
23109 -403959 -200201 -73892 -175937 -162221 -29721 -122128 325351 -82581 18458 -219394 -162192
23098 -162192 -192856 -45694 119532 -211326 -333639 109111 -70849 -214728 -25875 -59020
23088 -59020 33847 -103139 -62881 86927 -243409 106877 54874 -309212 -161670 -237874 -56270
23076 -112071 -13054 -65037 -130844 -149287 -125335 106240 -173977 -209115 -75356 35004 -115217
23064 -2500 -172504 185941 -131425 -104766 141366 144874 165967 -15085 54135 91674 -376808
23052 -57783 142955 403615 166043 -355261 -227235 -228576 445743 49043 -61447 -81904 194069
23040 -42015 -241248 -181425 167324 -112876 -21584 75207 181579 -107559 8332 -195682 -100975
23029 -100975 78450 60418 118873 112273 -243606 313491 -63464 140344 -114564 -165175 87019
23017 -143744 55970 105330 -206786 -314426 -119914 -106865 291229 -12503 -102321 -17542 -203495
23006 -203495 -195986 -49540 361808 -74064 129716 153213 -63488 -253488 -64629 -265723 -303780
22995 -303780 166253 95332 -7418 -236193 -44883 125300 60729 10404 130065 198272 32861
22983 -256609 -9437 -139416 14325 137162 -80814 144364 385956 84282 -172249 -283179
22973 -283179 232782 -58850 -126007 -129251 -384588 115663 203947 -110507 42825 22947 288358
22962 288358 -135005 -30437 -41032 -173003 81994 -63140 -102865 -161290 -290172 28660 -305053
22950 34410 -66406 -117032 127669 132618 -22555 -31389 9402 285099 103848 53156 -280965
22938 -22760 -147909 -118606 149904 -4715 259224 -223727 114949 -245828 -275260 -18324 -263189
22927 -263189 107621 -225025 -99119 -266894 48309 37964 64468 -334527 -406691 -34443 117695
22915 51182 171319 -151030 917 303951 -75481 -57767 59175 -229940 -71745 205430 -142217
22903 279566 -12223 -104804 -169080 -172109 111551 143727 -130950 271760 -153629 -70721 -377809
22892 -377809 155787 277365 -41450 -194015 -144649 -195578 -149845 -94333 42172 -417 68702
22880 -119725 -299403 -72792 305105 102927 -81235 -186604 390540 129956 54767 -4635
22869 -390033 -293803 -99250 63864 34043 -161032 32345 -45245 -154579 119694 19843 101630
22858 101630 -66239 -242426 -131174 76766 -239295 123865 149947 272484 -74012 -23377
22847 9647 -170225 -28972 -105711 272605 41704 -121810 209868 -211630 -16152 33592 14000
22835 -276834 38766 -164830 -50128 278726 -155963 -61324 -456574 -194845 -287910 -160203
22825 -160203 -187577 337222 8820 100416 60132 -69190 -116219 104768 -325558 123032 153985
22814 153985 -141573 -162619 101891 112068 -68747 -180254 -44841 188711 58621 101291 87632
22803 87632 44624 -212467 -37075 276625 22479 -146970 -83295 -65978 -67800 -48398 134951
22791 43590 -69303 -370491 137051 -152620 -173851 -191954 -207526 21207 -64170 40825 -209365
22779 -179058 -48113 -151113 183061 309416 96733 200741 214668 -154822 12112 192824
22769 192824 266477 -180671 255750 -407569 -2871 -224846 219853 508709 36804 -41382
22758 104998 -15158 -24365 27557 -206314 -90640 -419663 42323 -78823 -71307 -188129 5852
22746 -88282 -94759 -174047 -250814 -380659 245158 19129 -128712 -33701 -176716 -30652 -102558
22735 -102558 169977 -34123 421604 -104001 -214005 75866 76512 -52216 -165186 70549 7461
22723 -108678 65198 -246225 -11332 25730 310158 -328518 186171 -21845 -44700 -328632
22713 -328632 30955 -29138 -156112 -116827 -185776 108294 164598 -316940 91863 -154223 -249521
22702 -249521 23796 7234 -92887 129158 79281 150021 -18861 135132 -49202 49471 -199942
22690 -257459 -134900 79246 -16224 -263857 -334235 -132095 144717 -44681 19246 -79618 234412
22678 -89988 -40516 -205098 -179627 42695 195481 71562 58742 -13874 -5828 -36679 -183025
22667 -183025 118239 94877 38400 -265276 162721 -468842 35506 -513969 162772 -297070
22656 -183772 -63470 10560 -249094 276737 48916 119557 21767 -30985 -452655 -243235 106495
22644 -35648 106521 32314 -227940 172391 -41338 74570 65150 -377451 215791 -145878 -207818
22633 -207818 109377 87872 -69615 -151522 -44220 50561 -148419 -235294 109434 -50734 82473
22621 -147439 -160663 200027 -122765 -149032 -76034 192975 -319610 334689 -139873 -77459
22611 -77459 292036 -45771 -7706 -107062 -24270 -241907 99563 4822 -52681 40784 74222 -55148
22598 -234294 -22900 -185136 -267526 -31823 -268688 6016 -157905 -8898 32433 -1932 108783
22586 -86840 -176132 -122116 -46519 108166 120904 -3037 442077 -186378 33454 -289681 103057
22574 -91569 -59214 -276198 -341906 105215 -62833 -6553 -86654 2009 -10503 128295 130539 153422
22562 153422 -426766 -105298 -135939 518145 -80265 -171203 166650 -32558 67506 21015 101298
22551 101298 198072 -55060 -187133 26492 30306 134811 1964 164930 -138794 -644 -9300 41108
22538 -69240 -56765 -312544 135176 144763 -233631 120203 -158808 -453999 62812 -220443
22527 -109960 139960 -257237 -18159 -43141 -217588 144891 -114556 -400018 -71718 159398
22516 -299765 -144264 447927 127195 81740 159425 -93407 93792 -384179 142594 1156 430173
22505 430173 -89618 -467463 65700 -47463 -15283 -13509 -123590 244174 30370 -377447 -87336
22493 -23238 67826 28292 -253014 -104188 -27712 -169437 140964 -105315 -225319 41771
22482 -145811 -433102 267158 -285025 73216 -146448 330330 170611 34755 -60629 18572
22471 104527 -130905 -97907 -248164 -453172 -150264 -148080 46124 122200 80786 240411 70572
22459 -80317 -45982 -99469 102404 108913 -88245 36760 -137391 65952 -106539 154566 25549
22447 329449 -211505 -146762 -61103 322805 76349 -127228 -236510 181816 -35922 253580
22436 2622 118038 8752 -16071 -32060 -265440 -76558 -185054 132445 37710 62645 34276
22425 34276 -286411 -44221 -343632 -193979 277527 69052 -246941 -117347 -146676 -233970
22415 -233970 227256 -32300 -326600 196036 19155 -261703 -156273 227626 302210 -168488
22404 -113656 33954 -37504 195476 -258337 -98242 -15760 -410906 61624 -284863 -33906 -464971
22393 -464971 -138557 -563024 142851 123372 -460416 -111359 -104878 132769 -33352 -160070
22383 -160070 4217 -162492 -49153 -216402 -125013 -25619 24960 -124463 -256703 -193702 -101032
22372 -101032 -36335 -11937 -25991 66174 136436 124376 -76163 132491 13272 -29744 -20793
22361 -20793 -473552 -42225 -24363 -83323 262623 245865 -164384 -17753 209815 68270 118816
22350 118816 -263328 -108545 -106991 239495 306000 51565 187061 131370 -147655 -334679
22340 -334679 -153633 -51558 -210231 50616 331993 58265 -80143 57296 -100172 -22539 -110633
22329 -110633 156498 -31344 174934 -211188 100181 181585 215389 110209 -320746 113332
22318 -68595 -104934 -296521 -156389 -115173 157055 -2173 -329530 -145921 -188334 -196889 -145160
22307 -145160 70576 -50541 -388319 -56453 269972 12403 -216093 120717 -273746 140010
22296 -104883 -160529 85597 37901 46144 22824 -151867 119218 -125438 62185 123264 -69770
22284 -190337 -138782 137054 -296113 172436 -443146 123633 132305 3766 -36007 -191678 -142034
22273 -142034 -91174 51236 249755 -163038 -34580 65789 -173260 170684 -85386 -296347
22263 -296347 3414 -114176 47111 127106 -4810 1837 132394 -52635 -363920 -12046 -68484
22252 -68484 167683 -318550 -3110 -104484 94355 34627 -533667 -9324 -10590 -169250 195663
22240 -275279 -411389 -41714 -76852 51805 180265 70979 204837 104177 -255576 -48850
22229 29790 182803 -155347 169356 79396 -5222 62122 -119311 -141408 -225862 -81636 -59098
22218 -59098 213790 -199998 276706 -4631 238481 -332040 167222 82451 -581160 310526
22207 -92815 269276 336874 -31663 -63328 -60084 -153973 237690 -379283 23633 -85329 -329933
22196 -329933 108693 220864 214794 -65018 17453 48510 16254 -265875 -126335 -129999 -39387
22184 133763 -301160 -159276 -432511 152651 -205847 -147440 -126776 241997 -179457 -143596
22174 -143596 -258189 238002 15043 -45336 -93720 -24186 206106 -7005 226329 -167150 -144888
22163 -144888 144641 -394809 307470 -57206 360115 -216799 -189942 90206 -175062 -192917
22153 -192917 8915 133889 -324979 96089 -159887 71475 150946 138809 -26118 14755 -21269
22141 160944 -39673 149690 -138091 -107599 -191592 -77650 217232 285720 224059 -392695 133562
22129 -206467 -192771 -227125 159654 -102888 -178586 -24327 -3208 -209307 -265651 50821 57737
22118 57737 -137551 -13284 -81773 -275293 -20655 351722 -245679 -205745 -180362 186570 -141364
22106 -95462 -89596 -42203 -155933 -126350 -232604 -22831 268579 -104594 -67934 59094 -128849
22094 83477 -29265 121793 153684 51071 -83526 -226316 177287 284834 62198 121650 162030
22083 162030 -42168 -64912 -199749 117030 55238 -107928 198012 -211908 -184779 194412
22072 -171912 206977 -22427 -171137 -113763 114590 -568180 -5196 137308 104174 -261143
22061 -145823 -123464 303121 25720 67596 54025 -159896 -76558 -105086 187968 -5145 256041
22049 101213 299860 -215932 41778 -72954 151836 99581 -118780 -193972 -92068 155985
22038 92306 320303 30042 -362726 -44493 193019 156646 -52829 32876 150042 -528930 -191754
22026 -111359 17602 223877 170108 -126082 -158003 159474 50681 184482 -104900 207444
22015 -134884 -291774 -19695 68141 55465 -125660 -317684 54163 50869 78240 216445 -329433
22003 123832 175476 -261689 -59871 -21602 30186 -280431 -270789 -293357 -54799 -178832 -24642
21991 -130638 -26377 63255 50083 51936 17235 68829 -258854 -61362 -106645 -86120 80197
21979 119266 -139141 -203387 -97509 96361 -41846 -44520 120376 -280314 -159182 -452879 69616
21967 -50452 60174 156807 -229538 145996 27427 182989 -412156 -1124 -1 -169692 -179863 63423
21954 -37059 92037 -64277 -451870 -224664 -213875 -209996 112241 67165 -207088 132670 149689
21943 149689 -211168 -69055 -88218 -75714 252404 126746 -89243 -114898 241405 236461 -49510
21931 131183 50909 -76051 -51783 -69839 102719 -119747 -304453 -252414 -50271 -191586 -93494
21919 55351 1326 -156459 -188522 -335232 -289292 61845 -63055 -102088 -62992 -237 51807 -109966
21906 36302 124533 35985 327475 146376 -65346 -213820 95994 -236886 -72954 122373 -175368
21894 194863 55010 568030 130307 -113741 -239318 40643 -126666 -64449 93628 39099
21883 105743 -173992 279666 -79935 -457912 19278 -26156 -178881 -437492 35689 -160253
21872 -10077 -193205 -316352 -136893 -209197 -41372 -189201 -45645 -8141 93337 -8671 85198
21860 -122469 -201776 156749 -41712 17080 128881 -216602 -19452 17417 -117857 -42864 -30835
21849 -30835 88155 -47825 -89132 -208681 -162011 44368 170126 -13373 -71714 -3134 107050
21837 -228814 -197248 -71524 -112740 -166711 58834 -110991 -72628 -183481 -140944 -72567 28524
21825 255822 181208 205047 -68469 -281095 -181294 -199933 9426 -69966 -30890 -24812 -201278
21814 -201278 70367 -10011 133596 52540 97815 27029 48636 67802 34067 93225 -522933
21802 20951 -103822 -97463 81564 130568 -30137 9671 -12815 40 214065 -197262 -236401 124328
21789 110469 -178474 92639 -235159 -204915 -45567 -243173 44593 -171956 175713 315330
21779 315330 175016 -26142 183264 -12687 11015 467668 -79563 -72554 3460 -136292 -254772
21768 -254772 60741 177373 101082 -66734 -169495 307030 63537 145299 -493726 -53431 45752
21756 -352721 -17443 163622 -141210 1990 -193322 -168039 105800 -119785 219143 3714 -15938
21744 147068 -235826 635299 97178 -71309 147522 -203437 39599 278613 253449 -69050
21733 -98548 145785 137670 241466 27674 82239 -131819 -46800 -31307 186478 -200705 -355029
21722 -355029 -40725 -64066 14898 -129075 16623 94849 7288 176456 193929 -314849 -80611
21710 5596 -353021 127728 26901 98565 34316 -16902 310282 -274989 -96845 -188149 99066
21698 -192652 77358 119569 -265342 244525 15735 282430 10119 -162822 -59857 -25746 23342
21686 295282 -106497 258446 -19825 -152293 50926 202207 1974 -59323 110285 28001 -17168
21674 -135275 -197938 -496239 -105329 -409512 -131459 -116497 58885 -67136 -173463 38784
21663 42496 -154488 -235873 -13985 -196130 134962 -158895 -175542 188293 -263044 326675
21652 134505 293093 -17206 45810 175561 -258189 -253142 -97462 -212423 -162520 -290002 -267747
21641 -267747 -108460 137542 71821 -218930 -123769 55203 -123895 -141576 -183235 -173498 -63747
21629 -331059 -97224 -187373 47193 150761 172941 63897 388611 -175706 -205210 312118 56877
21617 -90740 -247364 16654 -35727 -50012 -223547 -108865 -39701 -367604 -223442 -103288
21606 -202018 53948 111686 -272415 -283399 -12027 -22774 -138510 190699 70339 -332753 40979
21594 52485 -96143 377527 203242 127964 48583 -91957 148848 74334 51050 -271564 136499
21582 -319919 -69258 135193 -498935 -233342 -238344 -31443 -325233 -224528 198445 -71348
21571 -265435 -31308 28231 -152612 75387 162357 -134822 145808 -42652 -41884 -61585 19479
21559 -9537 -396609 -222694 -368806 -43885 -292064 -104316 -99632 -197911 -97772 -376250 -150167
21547 26680 -72689 150471 74810 -205453 -398401 177364 334009 -24692 -133053 -14662
21536 -297142 118077 -231245 -17966 124914 -239951 -534 46261 11437 -242122 -171484 188024
21524 34369 178080 145700 -243937 -103391 158684 -229793 161056 -32148 -48519 -268365
21514 -268365 31006 -176873 73683 -186694 -496327 -65553 115533 -223665 34799 -83155
21503 107096 -71494 -333165 152029 66764 -37423 -153839 3935 -434579 -9051 -218428 -11524
21491 130189 93765 -42301 24261 381894 -195376 119036 137213 -178497 -112653 -357293
21481 -357293 -252218 -158266 -180546 -26223 221498 -125597 25112 202225 -308064 -140585
21470 -203807 -36292 243862 262883 -16883 -230033 93453 41282 -128628 60858 51576 -286669
21458 -137176 -104894 -207815 195350 3731 11876 -202506 127758 -189029 -73925 177811 11225
21446 15857 254563 -157958 -8771 252419 -78920 -135155 67261 -12222 155240 286010 222270
21435 222270 182934 581535 364049 356147 167537 194671 -119132 120021 -136299 111478
21424 -232751 -74234 102239 84948 -130624 -101438 -311691 -280874 11082 -193838 68664 268883
21413 268883 -22569 49666 52369 -141540 114970 -161354 165550 46065 -167241 413 -43762
21401 75095 -34358 -358263 -50806 185752 -66433 -121060 131383 -241080 -15718 44969 138126
21390 138126 212272 69640 -365068 211037 -106997 -28604 90139 67164 -38539 -58902 20056
21378 319393 -64645 -55034 -95585 89708 -13380 -65924 20468 102279 -256432 -226868 -82222
21366 -205804 -71019 -49878 -117326 -207069 -231897 -122903 -358493 -125725 -52678 -73772 -192202
21355 -192202 -398786 239384 94847 -102799 33721 77489 43368 234873 -446116 141230
21344 -126155 172627 -130941 -51725 -264404 -170956 111735 200460 100694 23652 109853 -89249
21332 131426 71063 158685 -132856 89736 -409576 42428 -219241 29945 331951 -175585
21321 -311579 -374804 -88353 -105388 -250450 2339 187200 140324 -344831 -210261 -159883 -24747
21309 91651 22700 18617 138773 180723 -195862 -256224 191852 77378 -131097 -105765 -141807
21298 -141807 -143338 -358499 121467 19160 1630 466507 -183907 -344014 -7898 34111 -115655
21286 -90542 -116122 -4687 -387187 -187128 71614 22534 -96804 253116 121423 -152725 -108778
21275 -108778 -111306 12290 -142106 147133 -45195 -291117 68232 143954 -143280 156315 -132198
21263 -127445 -157662 -138930 -390689 -134717 274738 -48420 -289597 27793 -147538 -155473 28947
21251 -160495 -104271 107905 158339 261452 -40654 2295 7129 114617 37834 182044 -67229
21239 -117939 79486 63236 264982 -255220 -482678 200368 366657 -340830 -201612 -162090
21229 -162090 67494 -162705 -35128 -228589 -164102 121914 -7841 -372967 -65977 -136791 -192683
21218 -192683 -129192 -210173 -78383 -81560 -22831 -181410 -58660 -271015 -98065 -29115 -227865
21207 -227865 -378165 -236256 -288779 -190424 -146392 -228734 78554 -100253 -195321 157450 -90999
21195 -374437 -49896 69349 -157638 -66254 -240715 194802 -301764 -68549 -175434 -182630 296997
21183 175088 125383 -179683 -63013 -290613 257468 23148 -303301 -101398 -163006 -125870
21173 -125870 108112 -119416 228241 -329747 -151678 394919 -33459 -245439 140790 -213706
21162 134094 160048 -49817 -2065 -48840 -55217 -291982 -170117 293005 130928 132901 248388
21151 248388 -34543 -265019 -199641 386120 -107282 -170990 -179197 -160574 70613 -299557 49178
21139 95921 143867 -154492 116749 -147084 133446 -239471 -137980 -86138 -187972 220502
21128 -36352 -253067 191901 28647 -326874 70965 153274 3688 -11156 -13149 -148605 2467
21116 -155775 -156893 -84522 61614 283918 -89282 100011 3693 -222647 166468 -52110 374748
21104 -244759 17882 -70758 188017 25263 73869 -154428 -326634 87971 2559 -251696 52345
21092 -129795 -135859 155241 24646 -198484 -75445 -445811 -58141 -56687 297781 -23925 227065
21080 -447090 -179373 -87737 -133574 -124707 -27375 121786 82616 27866 -90789 -29194 -131288
21069 -131288 -380211 -137831 -277091 -457002 -214717 -185249 158383 -282973 68163 -44722
21058 -1642 -84879 79472 -8712 -204053 -78044 -241441 -160990 -299219 -42773 44192 137059
21047 137059 -215574 -82896 -178640 141003 53199 -162769 -113342 -61687 135377 185955 162504
21036 162504 51915 63329 -165915 84131 -18829 50286 -81801 -129484 -107661 -121351 146702
21024 61967 -29100 -91650 -132689 -36863 30052 76521 129002 -189662 416102 -159798 -142684
21013 -142684 -293401 47294 81209 90392 77489 -93241 21553 51890 -69589 614 238792 219160
21001 219160 -184477 97684 -189434 -215157 166737 -12616 175524 -926 105551 134023 -102026
20989 45895 128652 313067 -111466 -168291 -62317 76435 -237848 -27032 -60228 17119 -7709
20977 154336 -267058 -156505 151789 143068 -174816 -328393 -194110 -361626 -213480 220570
20966 -215571 -126535 -334693 -31969 15825 77472 70871 37311 -149807 88969 -138156 149243
20954 -220852 178196 -18995 -220130 -26705 53613 -56943 -241739 -113192 -15695 -474939
20944 -474939 -534 245823 -234971 -95301 -495413 11024 37458 88425 -390915 -202117 -18221
20932 -233738 -81326 -26092 -190993 272683 -277048 -119102 106486 14249 -49942 -122602
20922 -122602 -402246 -144127 -51529 -204184 50524 -194846 265298 108888 267189 -382795
20911 48505 36828 303777 109689 -159756 258696 220318 -61382 186468 -82083 142150
20900 14249 -177597 33953 -268071 -32452 -120724 -11501 -134270 79832 168465 -130286 119527
20888 46571 64499 -457246 -137242 261233 289918 -87096 -207337 -197242 104695 -165157
20877 21357 -227093 35184 -73359 -307528 25173 48029 -181434 -445110 162410 248559 -304088
20865 -58472 -37631 162000 246402 -263820 -158413 119440 191290 -184853 -5660 -50379 -99025
20854 -99025 -113983 -392465 162347 277249 -53194 102618 44825 -64657 -268424 284605
20843 218199 -407 72619 179894 -505677 -43437 -247007 -495740 163213 -78164 -184486 309523
20831 245559 224847 -336479 -304300 -81128 -75169 -74557 -211235 -263111 21690 -439652 109053
20819 -217615 261128 101097 -286078 -59855 -611761 -134255 -256257 -184547 59717 91920
20809 91920 -269521 -254805 -20645 7361 -84221 -176487 -28488 -46433 113227 103717 -86475 -139123
20797 -139123 195369 64009 -71712 -185719 49567 -82270 -93092 -277900 -281500 -115177 -20862
20785 -215703 107052 -155029 -216529 -303755 -75457 -331560 -192851 -163428 85391 22535 -269912
20773 -81756 720 129042 -246049 187397 -142415 -91286 -33900 -193462 -100174 -138204 -217361
20762 -217361 244539 -108630 68352 -173060 -73547 -56755 -71808 33258 -83032 -386964 -178552
20750 74134 438500 22510 166478 175414 210397 -244779 -121073 -70253 -331074 -122161 306425
20738 -135691 -36066 -104719 251837 35341 -228683 156902 7418 339115 -106398 47971 -199827
20726 -194316 102790 -84002 -123453 -106753 -75153 -87462 105405 -225632 -152375 -231824 -173029
20715 -173029 145593 -96834 -257600 -170245 6960 263164 -30924 -56769 -159309 129024 145871
20704 145871 6928 -321987 -147554 88347 -81910 76418 -54551 -283051 -95224 -194326 216721
20692 -139614 -84891 -380325 156470 108330 45852 -245009 105314 -48107 -188130 -225719
20682 -225719 35489 -149864 -225827 50228 188882 -303704 61188 -63803 37480 186822 -203996
20670 -286227 -101058 -314797 -22387 2911 1911 189524 -403638 -185810 -300080 58731 -58698
20658 -17203 250951 -196638 155551 -203361 -261573 -201741 46557 172457 -175641 -194579
20648 -194579 -287132 191053 196675 -159509 154 -71100 -156198 -211434 -298493 882 190187 319586
20636 319586 238603 -128398 -117370 -2595 -167354 -50559 -37691 -93898 254102 172646 36398
20624 -84398 23610 -37150 -43257 -106289 -59912 175058 75633 -318807 -333575 96756 -133544
20612 -36720 -181734 35320 -247397 -200129 -259900 -291788 -315708 -162849 14072 29574 -120491
20600 -285375 -119834 85428 158652 -234998 -161956 -347157 166684 -95775 -136534 138728
20589 -85597 -21563 -364861 -445103 -343854 4089 155719 -298451 13976 -89654 123676 244281
20578 244281 -85442 215283 38259 -115294 -49718 28780 -66624 -179787 -28732 163220 33300
20566 224748 -291974 -106481 204557 270726 -288708 341703 -58792 -298411 -47553 -343663
20556 -343663 -16727 47777 61097 -291261 -123197 174165 -44154 118040 88216 -607781
20545 -370739 85788 -151824 -13732 -209355 -380726 152939 232864 -55041 -190965 74930
20534 -115336 370543 20312 -257031 -261051 -36902 -86934 -172427 24278 -118194 -158663 305072
20522 -58093 74061 -141803 -133210 -205314 68147 -228326 -129074 -106112 -105158 -59809 -52537 -117562
20510 -117562 165217 -31212 118176 61643 189761 82 -227620 -454857 135063 -73309 150668
20498 -136693 77673 2802 -31746 -240719 355265 -229321 -266941 127030 66415 -290129 -197634
20487 -197634 8132 -176443 44143 -39159 -223218 -136337 -264615 55110 -7856 37096 -248476
20475 -332710 181769 -300320 215748 11395 -124174 -52063 217216 11546 119744 -132744
20464 80837 126895 120506 -3932 315671 145772 23409 78469 67250 -83519 282022 -272183
20452 252966 42269 108113 210640 21596 20800 -120833 301032 18850 143159 4201 -263328
20440 -132671 -188726 386929 230883 -54468 -173567 195265 -31823 -132456 -129027 287657
20429 -69103 -177399 -123211 -204316 -151501 -16554 206157 32762 -276887 237046 -573237 -377107
20418 -377107 137275 4966 71931 -160159 -107926 -127923 -81814 142013 -32236 -18566 -181560
20407 -181560 163887 1690 -159380 42875 -97966 -33312 -90578 91569 -22675 261154 -216955
20395 12050 -176078 -29620 57668 181286 -72095 -123940 -348129 152437 -238889 -274960 -49604
20383 -220365 -152355 131352 -132529 -159520 -178750 -85274 122186 138707 -240143 219348
20372 41645 -114908 -32452 -134491 -221575 -71867 -105373 -180233 -288902 -180425 53491 -396283
20360 48729 -649627 -70432 -284485 46443 -83377 -326515 -159634 -47627 -282460 -132820
20349 -233013 -57235 -281419 48001 23495 414892 -198662 14407 -107950 -175964 73477 371743
20338 371743 -44096 -54585 -186368 295306 307459 -285819 -138676 -311156 -138403 35649
20327 -102429 -72842 97219 336298 -170450 -64747 -181482 -134013 -178792 -28012 -42845 137501
20315 159115 -165319 -155089 -96695 -334688 93309 -130198 -139559 401482 -223331 80493 -277633
20303 91383 -476786 -174937 -6244 733 -139659 54251 -130002 360646 -95518 193657 35028
20291 -275774 -325044 81163 -202918 -220458 -375657 59650 -213583 -224947 -160751 247320 12489
20279 83407 -151264 123587 -233222 -64077 -197928 -159634 74706 45931 -154791 41457 -298976
20267 296476 8282 -102742 -10222 -453853 -90803 -314066 -450855 -46291 -75783 242361 -326580
20255 -69553 -138083 -257860 -39093 -15464 -230205 -31008 -62192 -268227 -30347 -171409 -14042
20243 -274327 135840 -163336 315627 -262888 -293298 -327049 -181852 -320088 28379 -145994
20232 157887 185593 146364 257803 175211 26585 -18366 213182 -117083 -259714 -104553
20221 -308513 80670 -174881 -276672 -148589 -45076 124458 -1863 -35567 -128335 237845 352112
20210 352112 -137805 -37113 -38927 -418479 -119766 136723 -51414 27008 -159935 -7924 -68348
20199 -68348 240959 -32538 180358 -140872 -56946 -386108 76857 133088 18647 58450 -155092
20187 217274 -116876 312761 135214 521501 -108926 104394 -6115 -67641 -107471 94195
20176 -110714 -200259 294328 54921 -12357 -39834 -191838 18014 184859 -11067 237149 -198898
20164 261992 323302 137360 -312974 -81314 73691 106660 259615 -511 15488 75454 -264377
20152 -76010 -74835 34474 21128 -6728 196689 -127898 183244 -196319 32779 316165 253877
20141 253877 -126360 -17934 -116193 329255 34426 -305843 178107 130113 -317954 143396
20130 23223 90692 -53148 97326 -170335 103894 -274235 -10907 -337237 458 100099 193779
20119 193779 86432 -87793 -46786 -302248 243697 269032 -92517 163934 -123045 -258770
20109 -258770 -42858 204845 -115713 -17618 -225688 -49659 -12300 -177366 -97501 -312821
20099 -312821 130942 115941 60022 168166 -220814 226174 -414668 213936 -291673 -304720
20089 -304720 -167514 -488327 31664 -69262 -168015 71117 -5111 -454521 -111923 320732 -65433
20077 -412963 96603 56433 79131 404389 -302258 -38191 84781 -98375 -467337 -143157 -43085
20065 -206190 -108489 -373491 -38540 201236 -240337 -87127 -6304 -59005 152284 -8884 -80480
20054 -80480 93735 -189126 29165 107664 -126396 166771 104231 -156843 -163631 -99832 6211
20042 -131008 -378074 -1555 107685 -137697 -92721 147126 -32862 -106628 46384 203962 127171
20031 127171 51301 304299 9916 -379214 150693 -166429 -318371 -200565 -204254 -201543 -4212
20019 164364 36478 36813 225979 385619 -57173 217545 38859 170006 -170025 -155626 -113520
20008 -113520 -174527 179576 -94557 302566 10246 173704 -185065 -324454 -69327 -56031
19998 -56031 -88007 -29080 -180855 -407430 -234415 103903 80013 53672 -107139 -169818 40289
19986 -131314 68117 206693 -140201 -61798 88979 -159477 -238391 78113 -210174 205725
19975 -108752 -275788 -109895 40006 -22716 -127770 264451 -360944 -116485 -130514 -20128
19964 -153786 25724 -256418 9394 -151656 175697 -131623 -116056 -313046 -145025 87912
19953 -31324 -204937 -13907 109214 -133062 122748 -116512 -113057 -95945 89825 -235957 -21902
19941 -267178 158752 -247872 11444 -397869 116529 -220396 11631 333474 -215849 -22652
19930 191570 -146148 8704 -45196 3610 -220669 -54644 68228 -207437 99987 -238697 -386863
19919 -386863 -238251 -12799 -186042 -385978 -213013 111170 30382 -195706 -223131 326931
19908 -271040 -90542 -41142 -317344 -148836 -240528 6345 158900 -142120 125033 -117129
19897 205534 -342695 -283292 -159702 -379619 -12621 -206588 270170 -182279 -161552 -57980
19886 76065 -102883 -123008 -31509 233025 156519 74261 53481 -75380 124309 151817 20179
19874 -61948 123408 109658 -230526 45485 441627 202310 55144 -232928 186225 -128304
19863 -50348 -34867 83071 -141758 63722 87401 73426 -37558 84766 -58917 -74102 -211260
19852 -211260 -25048 138115 -337762 -59285 -74423 378912 -5812 -285137 97070 -4892 -298148
19841 -298148 211799 95609 -108785 9682 147257 -284278 46393 -200824 -348402 79301
19830 -64261 38109 66844 151571 127270 -161421 60630 268825 69493 -174214 -104536 131016
19818 43979 -91070 -29971 1725 255094 -136090 -346002 -91974 5749 -382373 -375806 162795
19806 134027 246740 57031 -41740 -30505 127978 -16083 -117093 53894 -12669 -152067 218137
19794 505 -99582 -78498 183481 -172812 -31914 -116219 -134480 -15273 316232 162373 -195408
19782 -248996 -2900 148993 -115456 -103256 -86959 -56211 34874 -229501 -110141 185419 -93096
19770 -218260 -388243 130031 357548 -193729 -311629 -226633 243134 346513 53215 245906
19760 245906 79366 153345 -357941 62930 105490 -31959 -7997 -48397 -21810 -175866 -168722
19749 -168722 -18534 -235081 80756 -26831 -87656 13286 -5228 -114456 68087 29397 -139636
19737 -133643 -1755 104357 -102444 143258 -38393 123892 194399 -281118 87903 -55892 -260701
19726 -260701 82139 -160474 -51188 32094 182134 53980 -84428 102582 -54135 -113081 -133934
19715 -133934 8539 98892 -421753 -29415 -92572 223991 95070 -35438 -153952 -179320 36253
19703 87542 212009 64846 -95645 -235367 -452230 -221805 96962 146841 -300112 -338454 -150445
19691 -334203 -81978 82761 180571 169878 -99802 -119684 -133199 -48773 177158 -249402 -155633
19680 -155633 -8307 90604 -84339 19435 -170282 113730 -250507 -103637 58135 178076 51757
19668 248699 183167 -134273 8674 126617 5918 -282461 -159220 -110073 141672 -475408 87178
19656 -52291 -170176 350457 -38397 -73303 77828 -107529 -20533 -344318 -118718 116500
19645 -5872 240063 -311347 234129 66607 8546 -100357 -103290 -198890 -246036 -309615 -73309
19633 -273964 113832 -301946 -37063 -52984 176634 125458 239488 -303513 188038 -365647
19622 -165511 -294414 38026 157789 -88045 -65684 140209 -148965 -173470 149870 -8659 172915
19610 -72832 -35339 -63773 -75519 -275779 -189783 186524 -299030 -256545 -118300 -220324 -11400
19598 -154516 -70848 53097 -60338 -152376 -164899 83139 -54138 -173996 -36365 65756 191112
19587 191112 -65074 136701 167581 -37677 118507 -11658 -68150 -94942 -179130 -29806 -3925
19575 -207310 -157776 -124059 189070 118966 -416297 13285 -215663 -262914 224171 -72125 -235835
19564 -235835 -336611 284779 -79391 43336 -95880 -201631 -123998 -264075 -131377 25887
19553 232888 104045 -115977 29560 -463207 -127989 38579 -13628 -283738 -499244 -174137
19542 221374 20833 -109917 -24298 -242006 -372473 -138845 251455 67175 243505 -120651
19531 -81516 127967 -3791 -229896 -17796 125008 -176037 -192060 -482426 -2397 -184900 -101038
19520 -101038 268938 -298980 -235084 -85373 304132 -56973 -194363 175765 -371871 -344391
19510 -344391 -305161 54398 -27262 -186527 -69337 136754 -23874 -285765 358037 331325 -86058
19498 -384583 -178124 11179 8860 -383022 219601 -38052 -24963 -174482 169527 227864 -190217
19486 -263376 612697 -349151 40837 -94688 71827 -26824 -285941 -4085 -182709 -114046 -116433
19475 -116433 108782 -259074 -163661 88305 -53249 258681 -205281 -69331 -342633 -223454
19465 -223454 80517 -45405 -150065 30896 -48638 -195422 -43858 335427 -134611 -314237
19455 -314237 -122013 -353270 -77044 -110271 -140570 -91653 321558 350887 -22118 148328 243359
19444 243359 75659 -33377 46656 -203513 -165069 -55096 76595 -169610 -175198 -17513 -90739
19433 -90739 80875 -64499 176529 -22933 -202085 91176 -115513 -19994 10706 -20765 -218513
19422 -218513 33137 -224587 147760 -121842 -92540 -12820 -138746 -96333 295539 -79710
19411 191743 -243333 -250921 212082 4078 212597 -160728 87300 -81249 -12687 -24630 160835
19399 13141 203718 67019 117310 161009 11449 -431997 -266565 -172247 -379146 -112039 -220387
19388 -220387 100061 -48547 74053 109711 -19559 -40302 -35348 18328 120062 -232070 240478
19376 -124723 -44004 -509772 -279230 63195 -189542 146439 -295716 -165830 29356 106627
19366 106627 70994 113500 -83940 -143770 -17373 42215 329537 -34938 -21685 -238660 -206312
19355 -206312 49890 -55042 -213403 -159495 -24776 -230287 -150792 -212053 2030 186856 -27068
19343 -229448 -23081 -212178 224169 -224967 -53924 -7754 -145571 -128206 -187973 -103128 144185
19331 -280496 -292145 -11594 -244430 172531 -374432 -340238 65167 47942 -258623 -134577
19321 -134577 355567 -147570 -226142 -150935 207956 122430 -4326 130882 -143692 41574 -185381
19309 -80113 252472 -280350 -151720 -38872 -252482 100820 104956 -327683 290277 106096
19298 47181 -59814 -50837 26594 -318227 -276805 -41825 84122 -228494 -117519 153450 -261464
19286 33572 -203764 29353 11971 -108593 -314388 -147334 -43421 -19644 -3598 -263961 437480
19274 63155 48704 -14025 46418 -161759 -55595 -116299 10662 -121737 -79205 -212357 69000
19262 -128033 -136497 127651 -30088 -54814 -177474 -137752 35633 -74672 -412849 152506 -222196
19250 174497 35165 33509 -129887 -206669 -178254 238573 -68851 -296999 90792 116725 -184437
19238 -219892 231561 -32674 279265 228540 65476 14932 26692 -83788 201257 -272300 15048
19226 -340400 -162340 -13671 54737 -164556 -255190 -215712 -327981 -74134 -25944 -241929 45106
19214 38507 151291 -80349 12583 -165306 239751 49936 -63407 92739 -91505 111143 41680
19202 -217805 -204182 47506 -13162 -211018 65526 -134675 105854 -216762 -410225 136672
19191 -188934 -18336 -134844 -324214 -95773 -363224 133919 63929 6395 -37901 -140320 -123998
19180 -123998 -307184 -192681 -221737 -6108 -285674 -129770 -272052 -78644 -254124 -185657
19170 -185657 -239877 -28315 -121131 -215270 -227210 -104116 199253 244055 21101 -188860 -94018
19158 -692046 291250 -124292 -89736 -150623 -187189 -252324 22737 42909 188821 151479 -115492
19146 -207770 -157956 -129292 -86721 -236500 -19732 -309084 218413 189923 290398 -79654 127522
19134 -197207 54460 -313742 -143771 -145112 -96313 25924 133037 169737 -76960 22649 48418
19123 48418 119035 -281495 -191913 -86096 -167765 -163585 244200 -101804 123287 -71057 -183071
19112 -183071 -191255 -211054 -160454 -282852 -196301 872 291082 -297761 30456 182854 250575
19101 250575 -45447 150203 -184357 191471 -215769 -29608 -181457 25535 -54672 -233254
19091 -233254 283070 -140667 -150072 19081 -28760 -252587 -71751 -277570 152975 29666 -112131
19079 -260572 -166285 169022 -212070 -572658 -129866 65959 185294 195632 60045 -235567
19068 -435080 44781 -17606 -167906 -71584 -222813 305183 180371 -349402 21986 -167550
19057 -78808 -134960 -301606 16131 43782 58099 -114883 -286203 -179456 94145 34869 -51135
19045 45352 186485 133693 -6371 -125240 -228051 -123691 234998 -51108 -37843 -324349 140965
19033 20666 160411 -198312 62597 -31518 116369 108766 -72675 -270769 19344 -12952 179787
19021 -111809 -304518 10819 74378 27518 -270300 -262932 -25053 60853 317861 92901 -15025
19009 -151810 -67451 160571 -41230 35528 249175 -119039 12581 -306181 -387405 110030
18998 -239672 -25567 15645 -142569 -152225 128062 -40136 308062 -233104 102541 54272 63320
18987 63320 123017 335784 28873 -336132 -140435 2706 -259153 -93215 176094 -149256 344364
18975 -63002 231017 -171850 -5588 335670 48356 51134 362877 8221 154740 75263 -237437
18963 107314 -155111 115909 -237248 -64779 -67983 -133097 -290290 -522149 13884 -51460 -299767
18952 -299767 -124184 -23327 38256 -430662 5469 -6410 -170106 -43932 -189160 184345 -196798
18940 5445 110283 -497584 24593 -38232 261803 43837 133913 -11470 -85832 -233713 -227730
18929 -227730 142650 -247838 43889 103068 184513 302331 130043 -89025 -233526 -106123
18918 -54852 -227571 -18757 -78030 -410227 289056 -144188 -382395 -69223 -42968 257896
18907 -221627 -57507 -21260 -62300 -296070 -63089 -126911 -132444 158044 -130524 -504223 -16506
18895 -193355 -161401 81894 371372 284339 32441 -109266 7477 119002 120485 95618 -64679
18883 -42476 -440842 37213 -156692 -174999 88771 -185099 -97784 -154453 73776 -82962 77711
18871 -225344 99563 -249297 -218723 -134105 11415 -161274 327790 77858 -255880 -60620 250080
18859 -82755 40658 -84266 202839 -112852 -98895 -39494 164922 -172163 -268346 62008 -69968
18847 254958 -288210 -312918 56586 -338563 -404882 -99461 3546 -348940 33544 -150542 -64841
18835 40094 99898 -160543 -40022 -226155 -86859 -86722 40040 -258134 -117926 -330379 -58239
18823 100244 -50391 16190 73775 106500 155559 -405135 -40868 -75514 278234 22917 -168151
18811 -203455 111667 542 58225 2918 374418 -120949 34485 -142025 -271103 -136587 -405595
18800 -405595 -265547 13829 43218 25296 137273 -126651 70104 -186467 -122467 -372526
18790 -372526 -76180 -39399 -47272 147833 -278478 -32470 18428 -180553 78208 22438 -216079
18778 -108783 -202912 224286 90507 75612 79675 -231489 -40209 -76917 244302 -106873 11174
18766 -252809 -207859 389408 -68383 -307413 -69791 222049 -2105 102175 -107334 73636 195085
18755 195085 342482 -46092 -169031 -120373 -25157 -297036 -37937 198185 -86858 -68903 -115968
18744 -115968 152998 193540 -169276 -155875 -106093 -38154 4571 1972 -143872 232391 -495208
18732 -81651 -253775 42271 -391675 -45711 214729 -158743 164825 -18211 -364879 108755
18721 20264 -117402 -62546 -61052 198967 -82950 -428035 -27764 50266 302012 -26412 67722
18709 -101627 -337153 23923 -113802 11468 -73537 175645 -18022 -400884 -175751 31266
18698 236178 -31302 64436 -123323 -196316 35275 27665 86889 -9131 -61091 -174043 -105244
18687 -105244 -476418 -237084 -150596 -245097 99989 -188431 37093 11073 -467004 118498
18676 -73364 64360 -146332 21579 -87283 144899 -160366 -141651 -148576 132966 -225897 -40635
18664 -105460 -195606 130990 -246211 -384488 48180 -118728 178838 -16365 -41984 -34908 -219189
18653 -219189 -279437 -136468 2746 -199686 -143148 -124284 76977 -64300 -30786 101039 -262694
18641 -216081 8863 -17495 23911 -195617 -101768 -40022 42007 -310060 -21961 -58115 2811
18629 -160825 47369 -73375 -158289 -225983 60194 -77584 -245323 -91362 2268 51896 -49404
18617 -41746 39766 -29186 -143546 49588 -209097 46658 -187562 -225822 60106 -80613 300411
18605 17024 -135271 -16875 -73256 80374 241487 -43655 71507 83118 -227719 105234 231866
18594 231866 233659 -140713 -253361 154464 -269659 -293489 -76141 -4462 -251657 157461 75104
18582 98184 46864 -113686 -39989 -312578 -11285 119238 -291163 -80348 67687 42163 -119658
18570 -161024 -122891 -137028 2257 107806 -131429 -223639 -275998 -318638 101146 -76696 -75182
18559 -75182 -118702 154072 164347 -234856 -185866 -122587 -120951 -169912 -55070 -13820 -147999
18548 -147999 -344076 -175397 73152 38723 -66764 258109 -136205 161781 -50632 112182
18537 -420098 140968 -150846 53089 22758 -185735 -65643 -241829 42087 -56839 49875 304967
18526 304967 -328900 -143461 73910 -210751 -85940 -147663 97101 -109890 40153 -320617
18515 -150685 109550 51679 22835 -117834 -153383 96408 -52547 -115801 23569 -314281 31568
18503 -13328 103293 -457916 258052 -77649 34027 -80845 -26298 301663 21799 -47741 308177
18491 -100134 4401 -209120 -177887 -41534 357433 -26136 111515 50790 240542 -204627 170210
18479 -503140 187025 -213566 -147231 67997 -237671 -97074 -184631 67133 -161807 -289423
18469 -289423 50196 -292546 -48323 -384231 -234145 173323 23705 -219919 -232721 64990
18458 -227032 34799 -211520 -544193 -147787 -68095 200113 -300649 153118 -281518 -33186
18447 8776 35068 -136739 -239374 -401979 -114671 176982 225483 -157858 -292541 392683
18436 -47246 -10377 -150988 -232948 -148626 -222033 -151783 -98964 -123722 145613 387538 130578
18424 -210072 -199052 133760 -103881 45689 126316 -329906 -328094 46044 -256475 127231 287646
18413 287646 108214 -13405 -22894 16446 130696 114267 82521 -169592 -154916 -213440 -62119
18401 102712 -236717 -16835 259162 -2080 391766 -185392 -211953 278560 3299 57280 154177
18390 154177 144207 -360305 97328 -41272 -155261 -207441 80534 -233716 -347746 -278736 36421
18378 89384 -278430 38880 -90384 9365 112557 -78401 -26751 79329 135526 -93528 -105115
18367 -105115 -229782 3675 -15108 -11696 -140257 -162249 93160 -66987 169914 -27681 122221
18355 -35788 59104 111169 83672 8239 17024 -149773 118998 -24840 -317621 -113489 416904
18343 -72925 -3760 125636 -110377 -402945 24425 244476 802 42404 -164861 -33718 79252
18331 -164588 143986 -56950 138453 -353654 -175586 53958 -195957 -18590 -20000 -279245
18321 -279245 -207069 192313 -21513 -218790 73698 98593 -182430 -43807 -253738 25138 39054
18310 39054 23689 387830 249070 -7754 304849 -40094 38048 118669 -141406 26627 -52434
18298 -139109 -405443 72209 -42767 -33414 276866 -135520 88328 -60397 -105744 238340 -280833
18286 -364859 -204000 -26249 257331 -276562 5163 -48754 16586 78146 163805 44851 -273949
18274 -38796 -319537 -51642 53486 -42083 255768 -100336 403939 48430 196515 -87298 -80584
18263 -80584 208977 -359423 -192728 -26780 -77717 -131525 211217 41992 -164127 48445 58873
18252 58873 -5796 -135038 134769 58921 166379 -121002 164613 87135 22835 -103120 14604
18240 -120556 66061 6566 -63264 -222333 162451 -114651 -118928 -378638 -101913 101314 -243552
18228 191138 -222460 181373 18133 -38107 -65287 227878 70456 -65501 -136131 184106 -131203
18216 -291712 -64448 -152165 -138537 -287951 -43888 -75971 -166060 -149463 174355 97839 33837
18204 -73686 -139553 -158227 -163840 196179 -52525 -184735 -178146 213116 127651 -136957 429069
18192 -485395 -73340 15102 -82847 -140121 -240207 -210460 57440 34591 -93857 118947 -244603
18180 -242494 242391 -85157 32176 -96256 111368 -406949 159080 308800 105266 -119475
18169 30876 127628 -132903 209129 -2644 -65033 -240791 -77707 -142451 -142130 -65286 86681 -140359
18156 61652 -149607 -87948 -151490 375360 339850 30670 -116 -216455 -310653 54028 -444348
18144 -332781 -77815 164081 -130271 -38417 18121 -206864 -16378 18791 11561 -2280 -161898
18133 -161898 -247724 86533 -133780 59471 -96404 -48782 208783 70582 35916 -31289 205917
18121 -53297 91196 -264438 325502 -379218 -226125 188247 -91046 -236141 -289902 208036
18110 47826 -123517 89461 -144600 -155460 -301864 -248404 -8306 518665 123830 22105 -89992
18098 -135359 -313211 138163 -120055 -144261 146497 -226329 -405400 -352026 236716 -91313
18087 -21115 102655 131427 6282 57910 31750 -24149 10913 225679 28305 -321908 74630
18075 -45822 -313856 56382 -73498 158702 -133590 -452344 -235561 -191872 -13331 -230296
18065 -230296 183990 -336994 -337962 -42179 -89376 -157841 -168127 44779 -181549 -197364 86221
18053 -128590 -226732 -48121 170365 67115 -102952 32551 -101005 522088 57736 31230 -120115
18041 -203675 -375813 -271519 103834 -11171 332423 -90398 151326 147982 308971 -257742
18030 133131 163872 -56520 23168 -208650 -21738 106225 -165135 -101768 -20327 105347 94810
18019 94810 -266918 -130828 134997 49546 174306 -104401 75263 -5226 -321138 125470
18008 -62303 302322 223243 -124712 141328 100863 -40288 244911 -77405 -422298 -40344 -241333
17997 -241333 -26814 113673 -30254 187411 -23394 145370 -161855 -46026 192345 359812
17987 359812 89783 84153 -41408 99913 15221 197981 249863 87291 -402972 -337815 -205954
17976 -205954 -3995 22563 -547101 -107394 -93332 189382 15569 -63531 111302 -145304 166477
17964 -121480 218427 -71112 33413 -161076 31127 126889 -19848 80662 221746 154723 -6314
17952 -38788 62215 97485 14918 50084 39184 -268189 78407 -40708 -189223 143874 235624
17941 235624 -19820 7772 31304 -285576 -59575 -78544 -38865 -162590 -12118 -139885 -26697
17929 76917 82372 -40757 -179848 20164 260697 -293324 -125061 -246957 -20660 -46699 -71857
17918 -71857 27158 -177711 24256 -220412 -165485 162237 -94591 -22903 172489 55298 -229442
17906 16341 -312639 58763 4385 16173 -465504 -35475 190659 -192488 303063 -25934 -162847
17895 -162847 15302 -344693 255850 41111 234347 -150671 -17396 11892 85844 332690
17885 332690 -131112 50012 -49312 19719 49109 107748 -184193 -231386 -323674 106405 -113755
17873 86636 82896 249223 333211 -227066 -159521 -102644 -296095 -251679 -18766 -57811 546907
17861 -242784 302763 144354 135969 -81222 -64271 60125 -22317 -106063 137577 74426 8851
17849 -141621 225922 206663 -111149 110354 -172775 -4805 42490 -56940 -83320 48312 -145193
17837 -328930 -110394 184674 -109544 -70544 -139105 221880 518639 115363 -43077 -92158
17827 -92158 -282401 82801 2080 73990 25982 214536 -13330 -337586 29615 27030 -125275
17815 -283910 -178885 -84773 -168272 -165711 139486 -85204 55946 91810 -392835 -45194 -137189
17804 -137189 71403 135240 117333 -52597 153779 -139479 -307613 -154175 -69795 12635 216637
17793 216637 -165518 -23901 -210301 -105636 233746 111766 332083 55631 121454 -21336
17782 72865 301219 -162380 -29703 326243 -33939 -175927 77484 -351768 2614 -98176 -282332
17771 -282332 -257596 -137246 -10437 -239585 34991 17232 -275468 -4397 -114405 -128748 -229356
17760 -229356 -71862 247291 -246928 -49533 -73382 -85330 -192829 -153389 185988 258864 -83549
17748 -3883 83525 112109 243746 -81590 89772 -118770 79303 -46657 -268571 -93287 -81519
17737 -81519 -153055 161111 -113103 217394 16002 410290 -240541 -72501 161983 -69940
17726 147879 334895 -101355 157555 -281461 50698 -146152 138583 117530 -43974 302801
17715 117177 370905 -10813 403880 5737 61309 105063 84883 -8245 39043 -255642 -110217
17703 212362 195948 51253 -593894 -5898 145498 130308 -245869 109948 30340 13798 -102513
17691 162892 -88840 354286 214293 -117354 -413492 -47198 194919 -9035 208604 57805
17680 -154651 -26188 214268 -123992 -209796 371121 -344503 49546 123362 -327597 -124268
17669 76016 39754 65308 298916 -177672 177767 -173672 -7499 310552 -29968 -80681 -277979
17658 -277979 -24642 -8795 182817 249646 351388 -303560 -171362 -159944 -227857 98759 45156
17646 27175 41903 -20018 68276 60117 131567 -231133 86858 -40416 71412 -54801 316623
17634 26242 177181 -27568 549484 -305445 87661 -36402 -251556 46322 67686 118307 123666
17623 123666 -133303 25987 155055 -106181 -84240 -92497 -184296 -164860 -321855 -189482 1928
17611 -300687 70087 39507 -327271 257710 -62441 45980 66040 15672 368109 -14928 141941
17599 111975 -57279 -19533 94058 85 -52759 74693 100614 75484 -49270 -101814 222791 -36092
17586 66066 220768 -28032 -57134 -91104 424767 97372 -362175 -243320 -44022 191657 175881
17575 175881 189246 -252266 38371 292438 -146309 297808 178847 262694 385163 -114985
17564 58193 178477 117955 239199 124177 213795 178393 -46054 85856 240316 329366 192678
17553 192678 76007 -86325 4884 276816 -24065 95276 12592 -122993 29938 -545606 168122
17541 -1180 -5564 -207675 -140959 231144 126752 191729 118150 336657 148158 59691 212608
17530 212608 111742 -19945 -50689 35154 193713 165868 65138 180838 193374 -27082 103223
17518 121718 463840 21926 315612 192686 182517 77250 20207 -109660 172285 -180741
17507 136308 -80482 285226 -196348 58861 -190975 249051 266899 -72836 -28592 -119019 8141
17495 -129154 68000 -27854 575420 325534 376491 -174982 161746 305385 110609 417647
17485 417647 235999 -175091 102645 -3535 47923 32660 29274 -164458 220871 79045 80602
17474 80602 -9973 283859 44913 183269 53250 106266 -17886 36504 74224 294347 92640
17462 143225 100674 312450 598059 31131 -99070 -52269 297390 -109968 317266 192422
17452 192422 285353 195645 452925 560184 118796 141645 87933 -167171 443555 -12703
17441 -61192 -86550 134280 110281 -81202 218375 615124 80156 293644 -124957 193193
17430 294308 -94488 367123 149716 453815 221855 316231 257233 156341 293020 277709
17420 277709 5973 64064 -164735 451648 147217 164390 561441 181460 150161 -110360
17409 -239122 231409 35663 -33761 -100680 -60332 -45454 21896 148488 232439 144474 294286
17398 294286 -22083 -403665 24631 -61820 198920 -143097 162110 -129412 146133 51616
17387 46392 36526 58976 65430 19029 384333 382331 285522 266372 288807 214525 -19400 -165059
17375 -165059 20839 299281 224951 216151 37436 -92214 71098 -147842 399075 92391 474249
17364 474249 16712 296955 50387 252645 -77173 427169 -168917 185625 372454 199040
17354 199040 -17503 72785 368910 103516 107581 415932 263937 148202 -35947 63945 544961
17343 544961 203633 225377 109931 116628 42011 22085 263777 279448 36551 41058 149738
17332 149738 27066 303577 35498 193718 -25860 144879 110880 158815 327651 25968 164615
17321 164615 436272 71618 -27205 309893 436219 -8751 263957 -53125 234110 128490
17311 128490 -124766 155860 -83088 464027 135225 360972 62362 457991 162542 261648
17301 261648 131823 239858 522947 53625 -257987 267621 476829 77581 153583 518713
17291 518713 189894 69253 -139649 181945 -15018 208974 -278689 515286 143160 326834
17281 326834 -119859 356216 183716 41843 57297 -190834 -87515 93493 56984 245742
17271 245742 278194 -108622 -97346 276143 194150 -159119 418453 159893 233396 16956
17260 231826 317681 134282 93992 65604 131748 284267 364002 58402 304384 88570 269229
17249 269229 378418 163243 261989 110353 275291 40892 240246 -126032 -57511 455401
17238 247638 59970 13355 456790 359898 569330 488546 29539 -5984 214921 -87009 184480
17226 200578 66283 327585 16194 283225 380068 652052 12678 262479 24756 -84916 318666
17214 505836 576112 214321 105844 386906 212461 456438 216831 164613 387294 326801
17204 326801 -1140 343074 261896 182162 250575 -231384 374961 139930 288929 389661
17194 389661 460540 295942 306281 249357 307061 75786 262295 195792 87363 106447 79346
17183 79346 -162192 165617 518205 114848 -143804 369344 335009 55000 356410 104775
17172 302903 248292 226300 294533 514660 662079 413418 415752 267398 452039 260847
17162 260847 8419 290156 486116 213508 146752 229772 514638 147002 470411 174346
17151 492356 100934 84526 567535 19044 479556 43025 586949 249289 214852 227532
17141 227532 413079 165385 483072 327594 177589 256154 -1197 301641 153310 201760
17131 201760 205535 141841 77934 408633 353471 367280 153755 446891 416287 19594 483494
17120 483494 -20992 243063 309240 376262 543906 430936 564044 437339 493799 361753
17110 361753 230129 278178 358291 443060 267368 540672 378923 449049 322659 519357
17100 519357 -128769 590889 602796 324731 480726 528089 668747 247678 741720 334403
17089 404711 189024 453628 343367 370303 527294 420047 388568 285570 283150 540216
17079 540216 617339 488501 421661 555530 557111 639522 465549 846886 873256 336486 490167
17068 490167 1118757 483606 440361 447809 495938 511481 645760 421591 671285 791009
17058 791009 468700 745729 325989 564674 441004 457740 782030 426246 829321 494501
17048 494501 614418 866967 554459 613691 541711 309236 408803 519102 413033 433508
17038 433508 666978 442284 761543 446792 800943 724296 344181 881197 735637 718192
17028 718192 561999 529029 881896 997454 559908 385511 550810 435446 738303 374468
17018 374468 546673 624034 884083 609818 581521 672317 837732 651074 501913 968644
17008 968644 431288 455999 628915 789441 698614 845837 661589 560974 802772 792656
16998 792656 620665 516943 223376 842216 659228 943205 579199 920330 755382 780575
16988 780575 871781 761632 833558 1061070 731215 1070530 651509 855599 708167 809872
16978 809872 834428 638657 662143 695883 669978 905105 1126147 830618 1056502 1250243
16968 1250243 923628 1183029 1099512 922350 1028420 1001505 728542 934519 852289 1031091
16958 1031091 1076553 874101 696190 852384 1180907 1278220 815474 1281076 1396746 1020150
16948 1020150 953890 1180909 1153978 1335984 1062636 1509245 1297471 1379947 890054 1568818
16938 1568818 1148287 1136776 1154015 1165301 1247699 1358897 1278685 1317808 1399856 1458752 1491939
16927 1491939 1524552 1468878 1129355 1380579 1876414 1454506 1523909 1276445 1725193 1575677
16917 1575677 1491018 1529587 1593152 1239704 1632736 1360667 1793028 1560675 1831622 1717997
16907 1717997 1747351 1517569 1720834 1673983 1536385 1864711 1467952 1844282 1708066 1638601
16897 1638601 2032900 1995721 1891569 1871599 2141596 1890744 2063974 2111149 2115095 2141361
16887 2141361 1714349 1848182 2385727 2195110 2138695 2313903 2361350 2404970 2141731 2398927
16877 2398927 2495346 2156255 2734137 2739337 2398286 2466677 2616304 2238621 2295932 2793047
16867 2793047 2782626 2791780 2803869 2799942 2913888 2776156 3116340 2967464 2857105 3092627
16857 3092627 2763113 2904399 3221096 3067263 3190380 3293147 3505113 3190728 3067381
16848 3067381 3483221 3329346 3424754 3460085 3289219 3702789 3615408 3945879 3623320 4016997
16838 4016997 3895185 3508964 3991452 3858509 4438601 4435639 4281372 4440300 4471562 4264353
16828 4264353 4739513 4729183 4973502 4696078 4959537 4907630 5250291 5714412 5364942 5725285
16818 5725285 5564010 5807855 5852151 5804655 5780662 6024119 6250377 6562172 6472369 6604279
16808 6604279 6478526 7023946 6984815 7550570 7537365 8020808 7467823 7710071 8210934 8304594
16798 8304594 8480599 8647964 8773562 9109235 9171934 9584961 9630254 9802167 10300776 10380173
16788 10380173 10795382 11055906 11527367 11418761 11920593 12551167 12531109 12811858 13396379
16779 13396379 13594885 13780460 14239523 15084385 15413379 15871012 16384005 17120979 17659103
16770 17659103 18159690 18954955 19565965 20359100 20627555 21447534 22117986 22845027 24202766
16761 24202766 24796736 25790462 26888327 27845849 29200077 30230215 31300746 32971543
16753 32971543 34426007 35959076 37319177 38995897 40739607 42966391 44564426 46811792
16745 46811792 49466314 51898055 54218278 57171924 60179637 63204646 66796905 70047425
16737 70047425 74034914 78508106 82791964 87449953 92549192 97983549 103377365 109406650
16729 109406650 115711833 121765617 128395016 135366441 141870190 149065230 155798891 162729705
16721 162729705 168852966 174388271 179725781 184038503 187496091 189807106 191029815 191563760
16713 191563760 190304413 188658592 185266095 180904710 175863661 170182924 164222341 157735543
16705 157735543 150839777 143195535 136376213 129596695 122592268 116009752 109699278 103440986
16697 103440986 97769132 92718207 86975917 82555283 77709887 73731676 69473141 65759654
16689 65759654 62598501 59209917 55776080 53183890 50392717 48033040 45514383 43153553
16681 43153553 41588685 39381445 37572813 35802955 34536532 32870767 31378011 30319860
16673 30319860 29054552 27659667 26714782 25757452 24889754 23830357 22910875 21705331 21153359
16664 21153359 20440220 19526629 19087637 18262455 17753314 16983405 16665665 16179994 16027079
16655 16027079 15171922 14489005 14280521 13385007 13342930 12921764 12307011 12380378 11734338 11571097
16645 11571097 11010084 10901967 10808450 10385139 9907488 9794249 9283844 9364006 9028083 8988711
16635 8988711 8551358 8291573 8076350 7779442 7892711 7456188 7769564 7515041 6856682
16626 6856682 7320225 6532634 6772968 6479404 6613772 6639863 5971944 6061940 6091185 5715989
16616 5715989 5352839 5483800 5668170 5248236 5185298 5300066 5064271 4921078 4772520 4797943
16606 4797943 4263948 4480099 4548116 3837924 4290800 4023848 4323383 4070637 3964078 4031901
16596 4031901 4004330 3712382 3791583 3318543 3367126 3604846 3460335 3252910 3524643 3411390
16586 3411390 3020817 3190955 3418519 3305085 2806540 2990334 2735084 2774315 2911213 2763156
16576 2763156 2659901 2619693 2534703 2307451 2321978 3173593 2272496 2359013 2543080 2261990
16566 2261990 2373659 2330386 2314630 2201159 2090376 2357400 2278405 2303917 2180984 2071946
16556 2071946 2185072 2295917 1853856 2041540 1898108 1815621 1949586 1899834 2007195 2147001
16546 2147001 2092562 1978773 1753333 1647571 1970768 1899523 1710885 1598644 1720016 1742248
16536 1742248 1659948 1860470 1595833 1344488 1573108 1744118 1336238 1438461 1412172 1867234
16526 1867234 1202677 988637 1309028 1238045 1585442 1524994 1522677 1201624 1724580 1257860
16516 1257860 1263448 1175197 1298563 970857 1170226 1243561 962866 1189490 1337870 1094417
16506 1094417 945124 1405865 870552 1095761 1140661 943057 1245176 929963 1139246 1132233
16496 1132233 878955 1366026 1067557 941212 716901 583047 1265287 988315 925477 738257
16486 738257 1141738 913079 875797 534058 789067 1118164 1055865 936520 808435 1193109
16476 1193109 1002142 685110 1078408 1029649 942723 858585 701606 740654 674906 1013469
16466 1013469 992289 550915 511051 841891 833624 876123 890803 646852 775888 583999
16456 583999 670195 874496 555670 758366 704320 487844 704997 577513 749877 882561
16446 882561 470678 741485 405731 805904 449948 884492 947968 397035 475062 686063
16436 686063 612228 646219 760941 746167 683909 643667 723590 622034 728980 559756 416049
16425 416049 476783 813291 629641 634918 410113 450457 502293 495963 742461 330273 571274
16414 571274 624570 921268 557496 785879 527922 293048 474395 336641 334184 383693
16404 383693 176975 342992 643602 609881 493459 675172 350282 343267 383031 478288
16394 478288 344896 285410 491316 527602 612019 300018 526770 376517 216686 438388
16384 438388 475699 595946 320067 260157 552868 340933 197273 311987 546673 461424
16374 461424 289880 183526 369070 317255 219591 445703 245408 248224 425673 486080
16364 486080 72474 413529 246242 435576 591786 392999 291518 267691 325363 162764
16354 162764 344131 479421 368140 601896 307121 217782 332356 513972 -77373 416448
16343 137132 347367 364515 130844 393733 -20666 592668 -70620 549889 81927 428122
16333 428122 255165 195691 478877 306948 200998 352574 589949 232064 464710 304610
16323 304610 125393 487006 277626 237980 144521 256418 274096 479413 555922 309345
16313 309345 497019 186075 106608 228706 264774 328283 167881 238893 -64177 162157
16302 598671 145319 323011 172557 605961 -57391 405850 -498535 -3730 -59783 194811
16291 171181 92277 179713 138540 151612 58837 291068 471953 84382 216057 265314 95041
16279 231367 258744 -150386 262317 201375 246887 563374 -114680 366843 76378 445724
16269 445724 -93054 25289 97976 184565 -26870 -137201 -3627 -138597 36256 184186 369152
16258 369152 26165 -12768 -1773 8512 266949 378163 -142100 268902 436406 100820 -108020
16246 180682 216513 210920 67284 246953 317728 48203 528871 296755 164604 223604 -62876
16234 112439 -162764 49361 248284 467449 197497 413632 71729 70715 141100 -28304 -54114
16223 -54114 114480 164036 98097 190877 190819 305587 -25015 -12520 -162022 1435 219622 355790
16211 355790 161688 -219454 74735 57981 177137 139445 -203320 -20795 -158831 -401274
16201 -401274 -112199 501372 160349 -393742 -112256 -204847 104893 101951 235560 452577
16191 452577 243104 343275 243641 -92527 237825 -4085 263222 193303 108502 -88674 117396
16179 272747 187699 33426 -4003 245282 -199916 403746 127751 260381 -92443 -43597 67440
16167 418593 -197235 -157920 203922 -207246 276339 -252542 31142 23125 -114872 107775
16156 41804 -225818 17057 73787 17425 18060 275163 36254 29579 97209 -147983 300302
16144 223765 117620 209820 266770 229644 295443 268830 -108121 24883 -82057 310624 149086
16132 22050 -17236 -64751 35474 -153936 253708 337245 -115583 -321215 290885 -63525 -128414
16121 -128414 102197 -206909 -75502 -31369 228872 -211567 132530 205883 58084 -1498 -121023
16110 -121023 -97572 94171 -182616 -178369 -169502 -150776 33011 48159 -182246 -68596 329521
16098 1868 303312 144598 264686 220749 -45025 -130148 -134607 57481 154427 -145062 232688
16086 -427285 175176 177086 -64298 -155370 122382 -148671 247599 -215828 -84512 -217647
16076 -217647 224227 -125383 146608 101405 385821 93700 166685 255868 40640 -90380 145688
16064 178773 163075 67366 219770 126460 -49771 -24418 29427 -32400 -294626 387409 -319
16052 -41373 258479 67179 324245 124040 -78782 244549 134163 253169 30466 114717
16042 114717 57647 101056 164096 -230747 -36709 -268015 -1985 -289076 -145457 63369 -170388
16030 114035 221185 -35763 140064 -175018 62939 93742 67065 -6018 -382023 45540 73157
16019 73157 31173 -145675 77776 -388467 35803 188395 -204280 2335 -114947 352069 161474
16007 103272 2931 -106232 -65698 143545 52651 -240051 -293685 136687 58943 67285 210253
15996 210253 -163065 -73258 41452 -184855 24921 251952 -84128 -51203 88876 -48252 -109455
15985 -109455 186851 86486 -48408 257839 292005 242212 386829 -5950 -104895 261157 400683
15974 400683 175529 19 161999 304314 -2839 -28269 -82773 267025 -317884 403977 -215269
15962 194618 75074 13854 84420 26349 31365 -30989 -210107 156337 -469613 -74734 -65775
15951 -65775 299214 -68801 -9930 -94596 19389 7624 -130983 -3777 123727 103986 121700 272824
15939 272824 -245343 -75187 309495 -360871 -160082 84938 -110181 -186493 -107535 5696 -280876
15927 103854 -61896 -72134 -138352 49202 -20888 109717 141879 -55984 173563 -276830 -61113
15915 -294432 -159908 -221287 114003 -156376 -1998 -7117 168104 -59864 -102553 86781 91665
15904 91665 -96365 252005 -89640 -114166 -29186 -151539 -39689 -74610 -63839 141947 -193341
15892 87770 59964 111172 -183337 109494 77055 -204464 -40020 488537 61344 -44931 -204817
15881 -204817 -8753 -36078 30031 102041 -431410 258085 163087 -59845 25800 -84514 -338414
15870 -338414 -58819 -120544 72353 -220009 -321203 -293498 111692 356828 273380 -271554
15859 -162993 68103 -124924 -179818 -161011 131841 -186970 11440 47152 218158 -270352
15848 -141767 156939 55739 -136053 405296 94638 -70450 337909 -257724 8263 19687 257367
15837 257367 -173529 51796 34624 266700 116145 172473 -311074 87641 -160676 66044
15826 -49473 269 -50493 68850 -168888 -182301 -7706 -194707 -280222 -291197 -268344 -374840 -49707
15813 -225279 -263284 97641 456543 -106551 306223 -30564 -176998 -104673 -106624 -158581 -29861
15801 197202 -105093 -247842 -100671 -52651 -115510 87469 -186709 15769 55925 -121078
15790 138275 -30169 45716 209202 -231478 65065 239511 -70832 -84262 60091 -215047 -321416
15779 -321416 -202731 156011 -25136 -325927 1729 160593 -288848 -234171 34214 -157953
15768 -48539 39295 50789 4415 -231255 -130382 75160 315595 -61326 211145 -479279 -1790
15756 214488 16446 -302751 -276776 -23470 59089 81270 180565 71154 272255 6296 -113316
15744 138589 159950 119319 -346019 -74171 -172485 118642 -150117 -126591 -181916 152926 -196512
15732 -61884 -10953 -213662 -48063 -59009 -66616 -213840 295440 278723 -16408 49664 87245
15721 87245 -116429 -204430 81051 60367 161793 -4960 183411 28169 242534 -76791 279257
15709 265616 -27687 -147392 -197847 -252285 -251996 4755 3449 50048 -47028 -165250 -71095 -324587
15697 -324587 -13608 -149494 377402 99215 -59727 -86891 -101491 410915 22882 -253961 52648
15685 156334 -118612 262884 -252967 -303625 34275 -48477 -97520 87817 -75804 -247280 103380
15673 218169 109527 -287620 46944 173374 -171812 72446 -160028 -157345 36076 -276587
15662 -107531 -91834 -181472 -172935 301566 143918 116833 -263543 -107458 232476 -315281
15651 54407 284945 74324 35108 -398651 -46435 60860 28490 -36491 143395 -53289 334817
15639 -396779 -155564 -88167 -61832 -28518 -220337 13799 53198 -11239 -327383 -50783 -53576
15628 -53576 -209259 -134383 -266765 109520 198544 57455 -88400 142527 -47188 426524 -14707
15616 -42787 -163537 67622 31930 -253629 130235 23685 81592 -196159 -281901 228117 19452
15604 -153824 60305 1071 -185637 120944 -51818 -133715 -40058 215500 -661 125394 242689
15593 242689 -105558 337800 -76898 -98716 -297829 -179589 -339318 355928 -28255 93220
15582 -12723 14011 -36387 53671 -196138 219616 -127045 -85221 29202 167941 -210059 -250363
15571 -250363 -121052 -232341 143236 -37295 -349316 -38093 -316258 169436 11622 -271912
15560 -64306 119375 156305 158101 -140575 -50640 -102923 -65050 11592 211155 62267 242214
15549 242214 122439 -1479 -1054 -61371 99753 129163 64478 189405 -164218 104349 -161510
15537 -97024 270266 -267666 141433 132993 -126428 -40080 -37387 466831 154389 58254 -12869
15525 -61474 68279 -7157 -124112 156046 113289 -373573 -3532 120519 202481 126797 -4698
15513 -186420 -135759 96851 -103203 -156246 -2374 -79466 70130 71066 -339274 -131869 -209409
15502 -209409 -60895 45269 17696 110032 -118195 -390139 -188317 -38696 -133635 -139950 -136423
15491 -136423 -226782 9004 -372869 -82148 -345548 129957 108780 28335 165897 -33927 174363
15479 346015 91648 -43771 355489 7843 -155512 122205 -63331 291226 -150080 59943 -224483
15467 -249261 210230 59570 -179442 -116969 44632 -10123 -292613 247866 206632 -215197
15456 -16624 91429 225831 15864 125371 112156 94425 -3595 76831 197060 243424 -13273
15444 1957 237292 47867 -61946 -21966 -15688 -23841 154730 -66146 -145343 85045 -357605 -192386
15432 -192386 -210266 -200720 67619 66831 -44263 -155238 148084 182951 -117235 -229502 150279
15420 -36628 -92946 6141 -2188 -194510 59402 -168019 -223008 -368006 34552 -190085 218447
15408 75553 74327 112112 -115649 33313 106364 -116466 -267177 66513 -107309 119342 334823
15397 334823 116702 -117583 19097 -143626 270739 152619 -116296 -78262 -2789 -138239
15387 -138239 -281736 -64346 148885 -282804 240648 -12996 54149 133663 24840 99494 -351850
15375 64598 -86475 181623 19422 69113 -109944 188913 192693 101844 -158409 -68630 -190213
15364 -190213 -235433 -155150 154183 80468 156385 -20546 -59277 6758 -118532 32857 24905
15353 24905 -45605 151405 268783 -51127 266867 30641 441023 96071 155511 -51970 25399
15341 -156193 132001 -111879 -8393 125087 128717 -3630 -393481 46509 155236 312025 174266
15330 174266 -206312 134569 201855 116900 77603 228513 41651 -14927 -69380 -222762 -73758
15318 -35135 58842 -55921 219397 -50479 243251 123935 -13115 128931 187950 -107124 -134728
15307 -134728 150067 119040 -125386 200849 82464 -112121 118136 -169735 94865 358254
15297 358254 -25897 101810 32940 209520 74125 269798 8912 -78805 220476 41977 92190
15286 92190 245624 -332658 215856 -103037 189377 152700 -108911 -16278 40248 -353770
15275 -27305 9001 -68322 253458 -107732 -64988 73526 -246254 -31038 -65918 196982 -61531
15263 27865 64316 11479 153384 210863 -474 -88970 -82610 -80326 -122140 43603 48877 57664 92214
15250 92214 386531 101434 175345 942501 2430325 1737650 2269645 1983879 581201 449515
15240 449515 218316 157226 141757 114914 42525 -95766 5688 -42574 79058 370307 213992
15229 213992 42734 189770 247039 81900 159333 104611 416698 89940 -21280 -127074 -203704
15218 -203704 -357615 277188 -152567 127863 175905 -310858 -24984 16086 -44297 217317
15207 243484 186325 -96379 97510 306304 -56465 119789 296735 74984 21671 122625 221645
15196 221645 871 -172877 -92743 100942 272606 55902 198186 87116 107869 -58152 78904
15184 156062 -133904 -212470 104547 214541 106990 -7240 49025 28721 213791 -247566
15173 218027 164386 43161 104825 283183 -104674 189484 -11588 172845 47385 132169 -50498
15161 23274 125806 149868 127453 156885 131431 146616 299786 355939 29228 -71866 418538
15149 200363 -72585 50313 260675 202782 21255 331879 441172 151161 182411 253724 131985
15138 131985 -6667 -77083 78183 207113 -25421 -5120 234567 209773 35783 288927 54110
15126 201053 23143 272588 65917 280191 97779 395626 146414 125397 196330 12834 538494
15115 538494 142821 104739 273993 264218 136316 -389953 200311 54881 391674 -23200
15104 242158 205487 -97572 156548 191018 24678 431912 -24233 23378 69573 216491 -59341
15092 335019 498083 -93149 118570 115961 339145 83609 195277 50546 66426 1111 267478
15081 267478 4332 47950 -234571 112713 94551 247671 15951 24682 180056 73074 226382
15070 226382 108738 439586 95887 57540 415204 79437 111357 454370 -101263 57632
15059 165396 180481 173930 399089 221449 25535 -129401 174628 248904 90562 552613 226285
15047 329129 -95715 157476 425276 5267 560763 146650 241048 73785 404203 191727
15036 297351 190628 237081 109865 124698 295297 252230 201309 324890 103148 -89258
15025 281143 -66829 271084 35328 196711 -82441 256269 442105 334218 83644 243199
15015 243199 187606 177414 66912 252490 92727 302251 -156594 573847 225279 324422
15005 324422 29229 208623 220771 562886 -203081 395869 250385 336835 229472 108306
14994 166289 319126 73162 450446 434244 104006 278405 438524 200252 107507 141180
14984 141180 -29031 328617 23039 63641 243244 102935 428486 151905 284832 333150
14974 333150 190227 95743 36967 431078 88573 308792 1053 374620 424522 84941 -53694
14962 143534 46018 456952 421532 412578 383492 119471 427297 4641 74367 178239 764840
14951 764840 162370 -132524 116342 281409 160198 -96776 693216 180580 26107 320776
14941 320776 160090 531467 437678 234101 299921 660592 564076 99752 545507 189676
14930 324057 114498 455523 389244 423408 -41685 363440 341459 227464 374608 -8931 103248
14918 355425 558964 109446 578637 412819 290190 195264 347850 318383 416998 195240
14907 530842 239694 200756 574317 164105 380166 363930 90741 406535 76027 324007
14897 324007 219797 353454 371498 22766 323342 477487 260233 102730 347759 566936
14887 566936 417225 10156 521299 519514 392428 374104 446978 303958 148535 256445
14877 256445 141363 402701 424378 82417 236056 25573 217904 428757 352756 253443
14867 253443 574486 117195 288141 193323 184719 281264 252360 744843 224516 483978
14857 483978 266271 416504 382810 385894 248439 150049 342432 448011 522949 507456 447325
14846 447325 174654 442082 372112 277045 277496 434188 431211 627899 163279 330770 457217
14835 457217 537883 319477 800170 427138 719452 541098 473549 178897 317834 703809
14825 703809 593015 644510 247363 710102 492323 671002 475596 502207 365870 526566
14815 526566 647424 208378 496980 555991 530420 605394 898358 443908 472259 497813
14805 497813 385330 817541 462786 526930 606747 556374 608816 476190 893072 684962
14795 684962 591870 564650 599891 615903 452886 514618 521374 676916 523378 877950 514884
14784 514884 901949 791678 781375 435082 600095 612620 829726 861774 568788 630181
14774 630181 609515 465950 777719 751068 591801 520670 443224 739477 192170 269137
14764 269137 722789 844420 489336 910846 507496 893417 950687 674711 679949 431654
14754 431654 723726 587513 650878 875039 197927 548394 652805 946520 1034398 793311
14744 793311 944381 686497 971170 479179 745192 613191 872065 1069129 816534 1061599
14734 1061599 568051 741232 643497 999367 643702 542912 1008671 377572 772364 1035474
14724 1035474 685151 665880 1008039 783679 981734 572472 925820 658573 536420 828190
14714 828190 705469 842416 952329 864069 888403 705475 772182 989234 914092 903650
14704 903650 1007048 974500 973087 907757 1059189 1073690 1032829 695112 869470 709584 943888
14693 943888 992994 738037 921781 1016358 1006158 662231 1099716 1000005 1181227 1311256
14683 1311256 1266487 1186537 965714 1009631 1039858 828316 939043 1073819 1241705 945457
14673 945457 1441268 755430 1133936 1121095 1073312 1067308 1141783 994327 853248 955341
14663 955341 1199248 1205465 1050371 1102808 1069617 973736 1369479 1105883 1382192 1236015
14653 1236015 1412455 1193098 1481313 974901 1222223 1270228 1222338 1029142 1462957 1175570
14643 1175570 1073324 1105577 1188762 1389160 1610001 1626942 1335355 1010239 1352549 1127786
14633 1127786 1254948 1593048 1191660 1502736 1242174 1561096 1501695 1377510 1393289 1500049
14623 1500049 1400265 1254286 1210755 1356607 1474752 1379204 1706780 1571142 1549841 1160471
14613 1160471 1401526 1434086 1738438 1332062 1188367 1426985 1483396 1889432 1647972 1648626
14603 1648626 1965172 1640588 1408211 1717070 1768209 1792043 1730276 1614424 1596476 1798768
14593 1798768 2115128 2013537 1747345 1913700 2182685 1685877 2062058 1602807 1860750
14584 1860750 1958445 2029866 1869561 1939100 2028638 1869173 2156179 1816105 1898210 2250642
14574 2250642 2201807 2366406 1967484 2128849 2233820 2693994 2655926 2310160 2751175 2341010
14564 2341010 2397320 2648023 2495377 2671922 2875777 3033618 2955980 3055051 2713426 3360535
14554 3360535 3345075 3669161 3888107 4637399 5793992 7592580 11069186 18732962 38773431
14545 38773431 48727246 22598902 11204275 9323766 4829384 2797441 2297740 2286752
14537 2286752 2038723 1925329 2641319 1933666 2089965 2081391 2094062 2313664 2332019 2462095
14527 2462095 2276273 2280642 2633792 2445380 2565813 2232405 2718606 2693097 2563754 2380709
14517 2380709 2724511 2600036 2842197 2671325 2622117 3014087 2930958 2948597 3066569 3017094
14507 3017094 3219576 3142819 3134004 2954848 3017320 3065632 3247523 3104594 3483781 3614003
14497 3614003 3683260 3547871 3499245 3356053 3477833 3700713 3726728 3817560 3808669 3557382
14487 3557382 3511245 3760724 3812832 3525446 3738495 4387660 4054191 3632882 4560672 3862003
14477 3862003 4016785 4463028 4210217 4307845 4063725 4544993 4425581 4538062 4725989 4539447
14467 4539447 4591131 4585653 4658231 4498483 5115717 5042098 5092937 5125298 4645136 4952297 5389283
14456 5389283 5297349 5071876 5149597 5699493 5270289 5570215 5645682 5876301 5949279 5995486
14446 5995486 5856642 5851380 6152677 6265568 6090948 6229464 6291432 6215588 6185048 6326982
14436 6326982 6454378 6469151 6852050 6674649 7065971 7339616 7059848 7114828 7666478 7601373
14426 7601373 7824640 7423691 7426590 7716964 8310600 7995565 8567532 8455415 8255964 8728882
14416 8728882 8813948 9143820 8745338 9145772 9322123 9255445 9695306 9820221 9996339 9953614
14406 9953614 10018448 10052394 10372689 10566799 10516961 10844249 11012256 10944563 11925684 11316835
14396 11316835 11550256 11781527 12253742 12338353 12622979 12778387 12725381 13251990 13471079 13735043
14386 13735043 13548080 14106500 14041575 14355647 14869751 15294044 15262468 15321365 15873086 16488409
14376 16488409 16557105 16769603 17023951 17471868 17812003 17917208 17974120 18831984 18931911 19346032
14366 19346032 19790622 20406748 20892311 21149493 21772439 22085094 22665965 23038129 23633985
14357 23633985 24164237 24736605 25380604 26020787 26802689 27146953 27832513 28251255 29039032
14348 29039032 29497986 30864926 31531855 31976974 33069580 34141773 34891262 35585174 36670176
14339 36670176 37378202 38442945 39445373 40662350 42007239 43067823 44412443 45731593
14331 45731593 47315523 48635288 50315222 51694030 53352178 55331118 57236607 58806855
14323 58806855 61062056 63004436 65381903 67768687 70044019 72646799 75048668 78043594
14315 78043594 81213126 84285854 87610825 90994671 94678064 98593667 102669556 107029906
14307 107029906 111940419 116578516 121241038 126970381 132797719 138635270 145087273 152083285
14299 152083285 159096350 166832175 175134693 183422945 192302464 201536874 211592161 222734839
14291 222734839 233630483 245488620 257425397 270729314 284263789 298190300 312427086
14284 312427086 327088508 342227679 357587010 372950017 388238791 403383748 417539874
14277 417539874 431302115 444085994 455410665 464832236 471647355 474989397 476543957
14270 476543957 476917159 476189825 474198439 468937702 462454485 454464636 445198314 433382777
14262 433382777 420508322 406428758 390867737 374895574 358847850 342645390 326657130
14255 326657130 310943546 295647572 282304008 269314480 255827425 243129373 230992559
14248 230992559 219398295 208594251 198275451 188842247 180252228 171757628 163306463
14241 163306463 155657297 148402554 141677203 135980997 130384881 124009563 118990788 113730410
14233 113730410 108952334 104601683 100884266 96812123 92837138 89309058 86078081 82574075
14225 82574075 79468253 76462232 73919070 71212209 68547464 66566829 64478052 62044259
14217 62044259 60208131 57700111 56648935 54660955 53414390 51588089 49758324 47935666
14209 47935666 46842369 45681549 45117019 43789962 42391223 41048892 39825595 38584522
14201 38584522 37863805 37356721 35874113 34801062 33782093 33093860 32238249 31428208 30924745
14192 30924745 29796828 29133234 28762579 27517117 27159958 26206986 25773762 25353925 24807081
14183 24807081 24179344 23509090 23206576 22393923 22111269 21635468 21310681 20721597 20498407
14174 20498407 19885307 19896983 19464512 18980908 18711668 18323797 17708757 17392682 17085059
14165 17085059 16730823 16594274 16273049 15757931 15753048 15388688 15282501 14862798 14541329 14374288
14155 14374288 13903867 13975133 13922119 13101677 13139348 12900976 12694786 12338684 12025159 12002857
14145 12002857 11890670 11828582 11736238 11078172 10794452 10682828 10893998 10662662 10743624 10294699
14135 10294699 10300086 9736131 9782161 9729363 9426637 9262737 9103074 9038057 8784679 8910601
14125 8910601 8807533 8424889 8661441 8128752 8663554 8166435 8200491 8181294 7778374 7862049
14115 7862049 7610046 7890522 7776697 7517844 7170258 7170986 7084789 6842008 7093583 6869335
14105 6869335 6657054 6817769 6938863 6484885 6196538 6313810 6228247 6338970 6028321 6318502
14095 6318502 6165910 5786506 5964839 6107303 5799272 5719873 5706976 5550872 5602810 5526710
14085 5526710 5211362 4959707 5510457 5606028 5273240 5093151 4950471 4842168 5122731 4766289
14075 4766289 4822855 4620592 4587650 4580514 4597204 4308905 4496092 4510393 4788946 4345481
14065 4345481 4128042 3952944 4617449 4397209 4006556 4031423 4295575 3949678 4383051 4213617
14055 4213617 3687360 3849163 3857991 3538354 4101575 4042059 3491209 3396280 3295563 3822521
14045 3822521 3522937 3221718 3829963 3451283 3723824 3217792 3175763 3183012 3415527 3045192
14035 3045192 3253697 3274134 3543995 3176220 3198311 3551525 3220436 3159572 3135015 3162773
14025 3162773 3051076 3147575 2367066 2639525 2681423 2902914 2885636 3097145 3107001 2349681
14015 2349681 2617027 2646284 2452332 2778446 2743626 2580853 2316884 2190305 2687490 2433713
14005 2433713 2146876 2340445 2408077 2426773 2219004 1941349 2318291 2711320 2297183 2232948
13995 2232948 2351644 2038804 2296568 2616229 2362482 3025742 3601495 5998471 11548527
13986 11548527 30363949 50369353 29268087 14782887 9374627 6989862 5219623
13979 5219623 4280742 4107813 4028209 3556299 3114430 2995544 2840855 2902642 2846354 2679015
13969 2679015 2489645 2340619 2449400 2625084 2359067 2475120 2502316 2584558 2015710 2088730
13959 2088730 2149214 2104062 2173094 2076283 2044080 2125901 2403779 2385898 2011139 2116909 2114255
13948 2114255 1718741 2006417 2354537 1965847 2151792 1786351 2221528 1674484 1700725 1596992
13938 1596992 1946874 1574606 2143993 1746949 1726418 1847409 1831567 1864554 1925112 1560101
13928 1560101 1888274 1703376 1393412 1943236 1969146 1894279 1981311 1797628 1754561 1781070
13918 1781070 1896005 1645067 1879095 1806126 1318678 1465467 1656851 1702642 1278800 1387079
13908 1387079 1333141 1311845 1657622 1359953 1209454 1404728 1157029 1561919 1754811 1428290
13898 1428290 1305869 1272199 1478716 1189850 1639473 1458758 1502455 1663842 1344539 1469933
13888 1469933 1239984 1536023 1359739 1380149 1622310 1211342 1370379 1074503 1361827 1425367
13878 1425367 1213416 1452320 1296963 1220815 1240291 1185689 1078013 1165067 1206103 1216772
13868 1216772 1257329 1425836 943687 823686 1127527 1252159 1122726 1122374 1119002 1359215
13858 1359215 998381 854994 1006234 1051268 901724 829627 1090943 766514 964779 1463302
13848 1463302 1349001 1214749 949941 1220964 854088 915068 1295152 1351188 1040782 1118603
13838 1118603 1017182 684789 1156348 1045406 880652 1120152 1095084 890024 803832 646517
13828 646517 931741 1232875 1196287 899218 1040753 652978 1019661 900016 1008262 853621
13818 853621 928423 689733 813693 908956 970193 895491 1028564 740987 1091055 969740
13808 969740 589061 712649 762566 957651 907677 911874 906142 701208 736260 951662 986400
13797 986400 930667 810106 616269 955363 835297 816137 679334 756072 639754 448287
13787 448287 675590 581711 820198 671290 896027 629057 1214396 702901 933254 767774
13777 767774 836247 601160 790882 654652 530795 702841 610000 458775 997202 1097775
13767 1097775 815429 790229 803088 499717 633118 719640 678812 406757 767280 875693
13757 875693 644667 745369 568787 486510 477695 620928 639571 707318 728737 860697 835456
13746 835456 635378 466462 756039 809611 864267 653585 822565 798417 791383 758131 498434
13735 498434 695169 514559 520825 716290 596787 356565 343131 585875 720702 569750
13725 569750 725933 646600 438711 876099 866112 600579 603860 810506 939346 619207
13715 619207 702415 536205 719446 725408 647412 832099 386701 669828 580020 391413
13705 391413 472613 566668 391188 647984 230218 681919 601833 204523 346622 830215
13695 830215 353270 749139 663404 637317 550822 354542 629479 345272 853802 297212
13684 640880 333716 523751 492632 476866 484173 507078 398901 295476 566199 655898 842377
13673 842377 505489 615006 772540 306702 562198 634395 424740 318720 327633 736312
13663 736312 389775 599342 727898 69759 463872 342342 488067 42740 478965 296161
13653 296161 579125 470323 567749 756117 408184 530041 458759 346562 565939 368930
13643 368930 826071 594145 444818 357412 564620 402594 191069 273145 612803 591829
13633 591829 683192 362702 436066 203934 134502 696192 305713 610543 531689 318175
13623 318175 487887 -33257 757228 467710 363674 367863 515459 261810 649303 384871
13613 384871 459189 553406 99840 668963 93336 666002 670850 360997 333893 188990 415726
13602 415726 289165 137987 348388 -2197 569086 596142 557991 302175 486491 190072
13591 129861 444925 464828 532869 512348 95405 129619 137425 345751 355387 260245 531774
13580 531774 416222 294799 238150 388251 392617 764949 699584 470236 467854 -7147 393466
13568 37495 337514 274793 418296 293880 284794 196242 235342 366943 387009 107140 423903
13557 423903 377869 183490 488050 370356 291144 109507 179596 113661 568615 361414
13547 361414 48378 194816 324257 326491 266182 241520 280403 -25589 186010 321806 506632
13536 506632 565103 735098 254184 25406 154451 141974 377441 76767 446097 -85943
13525 111618 260991 615807 159586 466668 680615 202109 254892 286876 424784 335194
13515 335194 362514 -128222 87073 31557 361068 126305 202293 224112 199310 -38502 255327
13503 242130 172625 287955 61796 268902 185094 242827 100305 278243 150050 191246
13493 191246 145250 -48312 388005 321658 -29301 439205 231219 232938 45802 56631 273210
13482 273210 188663 -25846 263597 426249 477999 183535 98145 634494 467561 601609
13472 601609 17800 441308 398980 228164 533507 364129 -134090 163589 246211 342368
13462 342368 324311 383515 497768 69463 354681 341642 517107 406424 227102 354269
13452 354269 114190 165306 356060 146940 195565 131246 210734 79644 297787 219444 395678
13441 395678 308702 334155 375004 281741 218596 372427 263321 217760 -152077 550999 174368
13429 2024 -219851 313145 579812 340762 312739 394879 41158 -29484 317431 179879 196485
13418 196485 121030 -70939 427570 240750 691934 264701 189876 70131 -142433 206832
13407 413888 264373 115961 148330 22614 177011 194279 234742 385512 391047 96724 177301
13396 177301 329194 66762 174086 192065 391542 141809 116580 220547 355705 -18898
13385 363258 -77801 284670 254852 -222567 -37097 485050 119848 82053 148976 599466
13375 599466 153123 254121 581112 391661 157610 13737 223280 129816 221781 274709
13365 274709 218711 286298 266923 416380 194282 251358 -23588 339372 -45679 328051 252114
13354 252114 -43119 379863 19616 -21172 301342 262490 456001 155196 327206 105019
13343 166534 84699 40882 551175 332065 256006 96970 308293 -194990 -33376 546582
13332 103394 228013 96211 -26183 509786 136010 406124 363717 399573 184457 87572
13321 344739 248847 182280 349321 287194 107804 286424 21024 259466 -71024 178179
13310 347260 240736 -88135 190618 215407 -228520 306238 179389 98023 -77927 104384
13299 329872 379205 31227 -183709 -139301 -71262 393736 456110 132255 165626 389354 240888
13288 240888 195851 223033 133110 328164 346919 376128 -19562 112628 335581 102191 102274
13277 102274 195588 111450 144588 294545 174327 306474 246765 51799 185404 -130037
13266 -80819 73231 8370 106656 167663 142325 278031 -81062 224445 160947 -213967 -25850
13254 344952 172467 30869 25671 289925 457469 65111 -154438 -111178 221597 203872 -52852
13242 -230624 71454 136711 246836 32376 -75784 385295 27243 -42148 211230 -140525 -73424
13231 -73424 -355373 89249 179070 112638 289706 46759 59325 -123603 -179423 228924 405433
13220 405433 200837 -25593 51816 190800 198499 150068 366970 -49567 -73783 11624 171242
13209 171242 168971 338377 267635 189142 -36670 345773 -41681 -555 10318 125821 70969
13198 70969 195612 54117 -93958 254830 65088 186338 320252 -39361 64844 368535 11979
13186 140097 248810 -14162 459493 107130 322452 77827 -75987 265561 -36704 128679
13175 205909 111959 -45367 -104696 186015 -125648 -364978 266594 147256 84323 436505
13165 436505 127978 -347996 61225 117960 -17510 227278 -48138 265738 -143851 235213
13154 -93238 -23004 254446 24455 -159389 -74538 90072 73057 -54034 172819 -98207 228495
13142 138242 270350 52720 344273 130821 -7917 245190 -1946 273124 20753 226042 -76146
13130 -54642 112584 245232 221718 113967 128835 163111 57340 318169 291699 386770 185792
13118 -70676 134880 -24367 -9827 85147 119783 -198038 79113 -1986 130525 320654 141865
13106 -26499 189704 241282 -342723 282738 -76731 122225 -51022 -273096 189201 -51348
13095 149229 315088 140119 194093 116932 281779 23922 346363 120560 73228 244101
13085 244101 241378 17083 30435 -152545 149138 -48024 -56559 -319217 66596 289251 423019
13074 423019 39901 -150272 111074 847 240656 296893 8982 -104311 71143 126873 162491
13063 162491 15198 198852 73386 133863 299033 -96383 -69313 227186 260757 296439 208131
13052 208131 72718 109372 -53109 -19963 -886 114408 110989 455813 -98428 -244362 293148
13040 248454 -19995 643108 122122 165339 262645 107169 305246 104492 212223 -156541
13029 156859 157857 223652 1030 342015 12948 222435 60861 100152 23075 217719 108843
13017 282923 224181 -96465 88423 221728 -132160 246433 -20728 144815 -23653 -85608 -164586
13006 -164586 211421 -269018 12031 298989 159611 173088 -221972 37734 -45506 -18450
12995 -18629 261686 -137882 -175943 -160607 269803 -13379 180922 133673 29845 -140974 15017
12983 -206781 110059 17609 -208573 -24705 -136973 258032 3529 334918 272461 59723 -138900
12971 52099 169070 -96257 -5946 199611 294383 213854 -78647 -49227 -200912 -29189 43804
12959 -190455 379687 -161904 86398 24043 -67845 242061 230388 -30275 24126 -159034 -370814
12948 -370814 -20327 186021 -211765 126592 -19657 -47893 1635 139409 76045 231114 177029
12937 177029 70962 116686 -225620 280454 -75208 138111 -33474 190195 -76296 242897
12926 23068 76698 -250481 -315576 -11910 181177 -150931 -131054 44707 -22335 -45502 143421
12914 -116124 209070 98776 -295766 -33367 47420 -96360 -220371 -224642 206495 81628 -305366
12902 370373 7742 -180598 -127530 29069 142731 64746 388044 -73797 322883 214498 -85926
12890 -109597 -84625 112547 -304492 331601 291470 299805 -220223 -45792 -85562 222006 -274853
12878 -197832 16842 275344 -424279 -154391 -237441 150994 124619 327406 48459 -170124
12867 -240618 -1467 282073 83260 236428 176821 -110871 301925 6020 -92938 -71663 -69635
12856 -69635 3601 260046 155908 -43306 104829 1896 181860 21194 164780 -81237 160257
12844 -126782 268181 200775 139257 294604 -9244 -13537 -42542 39540 127334 20526 140997
12833 140997 -321105 -87580 -295124 91976 -105847 -109353 -262049 -221473 55302 237667 121639
12822 121639 -105710 -6227 -49618 196937 -80171 -104807 -290524 102107 145505 -25460 58016
12810 277505 260553 156771 -39298 71587 16358 62818 52164 54943 -38049 -31143 -150475
12799 -150475 106549 -6238 -33734 233922 58669 -73199 -175176 17631 56196 -16281 136546
12787 -57690 -90798 -1396 32983 281022 175083 106592 -1448 66184 -29687 83777 -775 256872
12774 4805 21545 127782 -214355 -162394 -207052 148194 79120 71180 -125417 271215 -157061
12762 -236404 95643 -139248 162839 12534 150603 -129170 -284323 263991 16232 -56166
12751 -446455 144710 104187 -48111 -10568 87333 10157 -40536 1463 185806 -47105 -33824
12740 -33824 -165297 -83259 251362 40477 294911 196429 161618 456752 98788 260234 -34494
12728 -177356 228871 -111993 -28550 96072 -193861 96718 -27489 -89713 317283 -256289
12717 -600674 119894 190915 141473 -201190 146409 209854 101385 -58064 67541 258206
12707 258206 -138178 286540 45044 119769 12717 336705 -64028 221681 324405 -121352
12696 -286381 92599 95004 -4065 222339 -82454 186428 -10055 102980 150508 66453 -143411
12684 49953 -170105 332535 64799 170963 76283 194266 45246 42633 46243 256143 -44073
12672 -68498 -189218 -347154 -50789 174209 101631 386341 -137616 368462 -88467 26525
12661 296956 146107 21228 -391892 38958 -284118 108589 -109883 -128362 345980 -162632
12650 337928 359202 68762 43054 193598 -27876 3550 136066 410785 11631 -213794 217475
12638 10202 171831 -167056 274042 128869 341328 -45205 208878 404180 27513 780829
12628 780829 22543 385780 -16319 263409 314376 -122865 90710 11957 100954 -106359 -108842
12617 -108842 318092 -87836 375383 -105721 112763 92935 220584 -153310 235724 103543
12606 -126770 -174323 310868 93630 -87598 168780 194901 508641 3256 348004 -49776 -6810
12594 153967 -17363 -250880 108531 84235 230859 40949 184984 250559 -137914 235130
12583 3000 147194 -14308 164711 20846 29694 -69495 108624 -113724 -35183 169049 -91041
12571 -377765 -137270 132294 -86849 315649 -62698 -219751 -54668 -93250 208581 -67067
12560 121437 323999 34599 502043 296182 -186757 -32307 167338 -12081 181686 -57545
12549 -190334 127788 40981 -43764 22825 90210 81469 -38017 -136389 59839 19792 -208143
12537 5275 -165683 -65630 -160101 -15726 24064 -20035 212792 81017 -81947 -9482 69328 97692
12525 97692 311757 11312 90030 213086 -171301 56130 -41507 -68635 553 -82267 168758
12513 162263 58647 -147528 -122028 -149777 -227294 -293029 46625 -1395 37307 -148178 113007
12501 -150905 -353498 240232 501961 228252 232053 309973 -58869 595896 184169 -115834
12490 95453 160775 -110390 -66935 -246642 296627 -19425 -66277 -12075 136984 11292 -135351
12478 -223523 -221476 108886 -123561 -237947 29748 -128694 377089 201202 72504 -148242
12467 -16162 110396 -842122 -126043 -140236 220989 9864 -55084 -121092 -61681 -106045 39682
12455 134860 -129670 -433311 -64610 -129718 327435 342151 400200 180352 44916 -58724 20457
12443 -177564 24036 84212 -110585 -289084 90714 -12210 -225889 -95072 82621 120381 130020
12432 130020 -269954 -20673 303973 -35274 131304 195002 71862 -304840 264306 -154958
12421 94452 201364 288078 -132130 209012 154398 -494370 151189 146362 -56452 167748 175967
12410 175967 -7707 158717 36323 207705 -58142 -149415 -54264 66413 82966 -49393 -194031
12399 -194031 -104819 -250275 232339 52767 102996 244179 158743 -128579 244220 -22008
12388 -35187 188761 -214570 92233 -185934 -205836 147740 216797 -1833 -206057 -403075 33911
12376 237333 97646 161711 103559 132034 331454 -353351 269538 70161 -52701 -208053 -176838
12365 -176838 -4628 44693 20840 108108 237235 48819 104554 141590 146255 264335 63638
12353 12136 5846 -34980 -190059 -277554 -107401 195539 223116 -125312 251652 -310329 -52574
12341 -115359 -51360 -96682 18219 -316887 337558 -171812 -22248 -62872 44783 118575 -3606
12329 284978 48686 206637 35296 -5833 285243 -341181 -193248 11286 -101022 125588
12318 3259 -118210 88362 173203 -121702 331735 -30597 3626 -214370 125194 343666 -103678
12306 53502 95903 -34069 190057 -258432 93549 95266 -28285 -105194 150630 -204458 55785
12294 61459 251904 -39306 -26974 -73427 154955 -153647 -255199 71950 -254450 378556
12283 38309 8141 42463 -124827 -112437 248471 72829 -120021 -45317 207533 372651 83997
12271 154206 101903 29869 21356 -354295 249922 207586 9627 121489 169168 19032 23504
12260 23504 77803 179496 156094 156050 231939 156712 217251 166665 254484 -140431 124818 -83927
12247 54082 -121211 -17344 127588 90614 137845 134506 -111864 134164 -512 325907 23079
12235 305094 136690 67478 232328 -91668 431340 -68622 489446 299017 57141 68581
12225 68581 291012 79139 442321 113029 227819 330240 222434 81228 226068 138320
12215 138320 62032 -3564 -164576 160698 184361 -64989 -10571 273450 329995 -38465 -6424
12203 -1667 -24988 -62440 136594 -104674 142090 99347 247427 28264 -260201 -107222 137537
12191 214251 172753 -123907 284327 171770 313302 279522 -37774 350725 -104847 153657
12180 117256 -55874 228151 50736 327036 119217 236622 112655 -62293 607857 543736
12170 543736 276988 295441 -83991 42082 46807 -27317 47904 -97272 24120 164895 -132364
12158 64021 118592 153712 -37714 257874 -81796 -51221 -40985 34683 -133295 261672 1765
12146 406592 331948 215358 -160793 -148034 185652 -98671 -56185 -95685 255309 147079
12136 147079 -87476 127255 113616 -148594 60703 79150 29211 235860 102603 359065
12126 359065 -121393 177565 264170 131969 -35257 241739 -23713 -19640 113321 -133783
12115 -256169 -86054 -124235 -212647 109328 82843 168412 12961 -89793 143963 -290905 -213858
12104 -213858 -23111 36698 214786 150828 141015 132203 204686 62252 262910 111427 237194
12093 237194 242303 36784 263810 -188450 -78320 -23257 56191 100825 -248711 56590 -237476
12081 -229806 -45427 -143091 82985 -96863 104016 53805 -196834 66738 -56506 24716 378922
12070 378922 186421 246443 591119 1985618 953162 486068 73917 45952 78221 -70916
12059 -340912 58380 -122593 -185601 -244813 159763 -261923 -179983 -18473 -44458 204475 -171855
12047 83092 -210280 103409 356271 -38484 -21335 -4989 -120968 62675 -287137 -104716 -325994
12036 -325994 -119231 -134150 -162416 -73171 1873 146925 -234711 -14174 49791 -24626 244852
12024 -159308 -113214 238641 -199084 -23308 -612243 3336 -5171 151587 66176 223946 -195619
12012 179287 192213 -277405 27598 -205503 -296730 185184 110054 309087 5781 77796 -104806
12000 114619 -296122 -159111 -264698 64629 -172104 -171080 173036 -85848 -302456 204667
11989 -34182 90951 47202 97957 214729 28437 -372009 317278 -275893 -73138 -65858 45636
11977 -14350 274227 -79238 -124979 -26203 -211880 -180456 173725 -184794 156385 572444
11967 572444 -22976 -64866 332053 229681 -57076 -31320 -59380 104413 27801 5901 213190
11956 213190 -20812 -64462 73274 -210742 293669 -112873 -36194 -159819 -6442 -9840 101766
11944 -70649 -39681 10215 -107865 -80145 -73007 -309054 -149673 -53174 94842 106290 274880
11933 274880 89591 126233 68838 -209211 129952 -249248 239667 -55394 -347485 -12888
11922 -4997 -115000 -278562 -230157 1239 31896 111821 172085 165490 7949 -176962 -44671 -149684
11910 -149684 -8634 8378 -67668 130815 -48461 350165 -96766 -93335 24369 162775 36637
11898 -383554 -110261 -53391 -557 156641 -197827 -334948 214674 -383409 314629 8367 4330
11887 4330 -26456 -164910 -108199 -69172 237823 206565 235600 -254415 376492 16427 -77413
11875 98107 -198433 60416 -73964 -94566 -21459 -2378 -44159 -22754 -203593 -311622 -58892
11863 -29010 -317069 -38766 -250197 -222383 -275394 -294598 -139044 -146005 285008 -828 -193580
11852 -193580 43823 -158027 -41086 -367963 -273969 74559 30857 128988 -510361 110080 -245006
11840 -273163 71014 -103989 -55574 -197011 -356335 -119775 335582 -76823 -75438 22123 325190
11829 325190 -75726 130317 65793 1120 -170032 -217875 -162967 -133869 -407152 -20542 25845
11817 -66176 11643 -132951 -215963 -16396 -71811 80420 77083 127045 -174981 345913 -10856
11805 103942 105697 19321 19639 -29287 -46337 150571 -139529 30824 -150913 115873 238160
11794 238160 51683 -77991 -242085 47419 73983 -241570 -192534 -20043 44834 -11945 242645
11782 -45646 81445 -121688 80440 -142835 -254490 258271 360287 -326994 -4393 -185958
11772 -185958 313282 73443 15009 86523 5845 69736 -145161 -145314 -68053 123397 -116028
11760 -15393 181848 -50118 -24667 -61257 -175494 62791 -166291 340809 73051 113971 65692
11749 65692 -165269 -277211 449645 -318154 166772 -63745 -112430 110234 -3307 24010 -102151
11737 76268 119239 -57767 -114267 -316966 -300350 92861 -40654 136434 136191 99061 -385184
11725 -119780 89908 51811 -7915 -107949 10591 157994 170463 100781 -143918 142400 -33592
11713 -278302 24044 16699 -61453 -65987 -30033 -87129 -78603 175147 -46426 265212 -208968
11701 80823 303425 -283751 423140 -34022 -161462 179613 48981 -139482 143028 -80154
11690 -140051 145309 81917 35568 104670 73950 -140865 125025 76860 150302 -420092 172990
11678 -175656 -191414 141558 -388020 -219292 26780 105958 -223639 59438 193033 -11299
11667 -119245 -235166 -3263 -316829 -22676 -295088 294248 153237 70259 -111640 87342
11656 -75455 -152810 -22544 -123241 249467 -3997 -190900 217146 203690 168963 267323 129588
11644 119226 -14902 -74937 -45174 187210 -283648 -13148 -49224 134391 -230832 84595 -75833
11632 -146949 7241 -196140 140492 -136759 -41982 75341 -80958 -72098 -129516 435862 -17653
11620 18587 80611 -141120 -115841 -53475 -25650 122001 -84351 -71859 45027 -101950 -49467
11608 -52925 -285626 234242 -133493 284770 -449182 -59066 -89979 511614 130227 -173042
11597 -338968 63838 -216133 3952 -104134 133839 11644 -83308 -213173 304225 159686
11587 159686 39827 -200145 -67643 233819 28369 43133 13109 100470 111656 -104289 11395
11575 -329762 158583 92112 291968 -228891 442492 188222 320293 44561 688 -133794
11564 184201 -127540 32164 228146 521012 -141238 233054 -90258 -83033 -112876 527340
11553 -221208 -77065 -29039 299 116743 192221 -212099 409057 -76358 199470 -299393 153891
11541 -214047 133907 -16468 -233685 112818 174329 -258337 -189596 105127 -89838 -235222
11531 -235222 261325 201979 210518 -76768 280922 -270209 -32756 -99612 -43746 55906 -80672
11519 152968 259952 265682 162265 -81549 61503 229607 123413 136797 -124310 -286603
11509 -286603 -18741 27998 56669 -98063 290848 163066 203044 150565 301049 464323 79426
11497 128803 199775 -57610 200387 98779 379599 -115534 -17636 171243 136866 6258 -161794
11485 162661 265890 -59562 -145332 22308 95365 266117 413144 332413 -182142 234189
11474 535847 -294662 99955 298542 28991 -110236 185972 -150550 280392 -5869 186896
11463 18647 -97596 82407 159009 -219081 23163 53905 108270 -177473 398892 106005 47659
11451 276750 143680 218697 4183 138804 271083 547063 214057 -25362 68942 263788
11441 263788 -28079 203427 70562 199044 350543 150848 107569 171658 57835 -127336
11430 -48689 417897 -250870 -44145 -65807 -100764 92105 -19769 173653 31881 -201007 73380
11418 34924 96075 -11360 191171 -45734 -12079 -145249 -217261 152799 -148208 -3627 -15705
11407 -15705 -94555 -262395 160261 -185871 -142765 -300930 49469 -46663 196673 -26547 246299
11395 -183433 -437488 116059 21295 59704 43984 -45360 -134661 -47580 -55507 -82278 -87160
11384 -87160 28473 -107306 -82239 39705 -103316 -2788 65620 51823 -70471 5874 -19032 -31361
11372 -31361 -254127 -273619 142349 138534 -93564 31994 -44482 166068 186371 -452716 -268246
11361 -268246 -40163 199818 -268037 -332201 -10050 -53943 12338 -301444 -127544 11945 20867
11350 20867 7052 1101 -185334 117383 23335 -127347 99393 13530 189492 150125 -39024
11338 -135450 -265667 26467 7387 -81288 327531 -5241 -162154 32691 -382436 -311919 9902
11326 -87743 -80284 -371859 17774 -178155 128921 28298 -190795 486535 73223 60030 -150187
11314 -13701 -71636 -114607 45647 -84056 252291 -184844 -462102 -230933 27089 -108025 -179345
11303 -179345 87491 16832 -241196 -439854 -171831 -253757 -260044 -63947 54773 82935 231890
11292 231890 -89189 -554800 -86802 163596 78466 59985 32184 -83031 -122379 -45878 -12498
11280 92328 -79217 404016 -203733 -48328 62459 -37106 -186522 -263361 9379 -13460 142834
11268 -111146 202646 -37780 -16412 -64154 -115126 61771 29555 65156 218256 36574 -159997
11256 -6079 -31530 62804 -74025 -87215 -272258 69234 19984 19576 -15714 -143532 -134733 107254
11243 -54595 -236706 278625 -114747 -46880 -52728 -73047 -137199 -56218 177447 173182 137824
11232 137824 100838 -177422 7628 -181558 -284164 -181166 -12595 49522 295783 -20725 33041
11220 61180 97446 -135062 -41480 50758 -79019 -160791 -225855 56712 158308 -36484 -310380
11209 -310380 -143179 170960 -409265 91126 -320721 -237282 -114234 -299844 67776 -175979
11198 -396648 -290472 -58 -52259 67744 109810 -320991 -41783 -2266 -109982 38526 12705 183211
11186 183211 -63928 -59272 211902 -40691 -215782 -139918 -392660 947 -25186 -8678 -50394 47645
11173 276284 -32561 320489 75425 -80814 98188 -90050 -4075 56852 -294514 -243153 -205060
11162 -205060 90700 -156997 265151 46221 -105728 33959 -297098 67050 -15363 278307
11151 -33144 75823 -4865 50243 66757 -382789 -68141 -62437 -60294 -159467 354079 -172724 32988
11138 252641 -160777 -22175 -18756 181894 267364 48954 369864 293865 -27881 -143664 -2388
11126 117059 -87091 99787 291349 -225578 -114057 -17585 97628 196591 52182 -68558 9337
11114 142268 234470 67375 27356 -97387 -246808 -190294 -290303 -69611 227930 -4350 155791
11102 384076 255914 -38664 -77516 187788 135850 290609 125697 -73184 65001 290034
11092 290034 205539 168491 117351 198417 492798 15960 61259 146033 58834 148331 336511
11081 336511 281685 368128 148268 187843 -128456 279742 403354 101823 254590 150668
11071 150668 -68533 -29683 468329 312657 -70308 288502 372010 280322 477751 492232 646336
11060 646336 379418 703857 449491 404646 691404 471812 536664 551231 442672 667432
11050 667432 650091 693892 613478 314273 836877 623857 602277 570838 339532 662933
11040 662933 519280 824780 529996 550664 632102 634058 699093 388905 843187 636334
11030 636334 228724 746699 585035 733993 699422 491650 581960 695117 725005 828252
11020 828252 632658 433774 748793 245985 613483 413363 665347 626935 148681 522511
11010 522511 505298 510839 417923 255393 375207 660231 686345 578677 842482 506199
11000 506199 736221 691580 838065 535156 839501 726793 239572 422403 728781 767948
10990 767948 691828 1079794 714885 616744 666292 1022619 730706 694673 712773 1172510
10980 1172510 749697 1169266 1139972 1533913 1413577 1990829 2182923 2506106 2079726 2567665
10970 2567665 2366205 2341293 2172028 2096612 1993931 1435939 1192763 1380057 1406901 1612405
10960 1612405 1441232 1071098 1183293 1635397 1328918 1223276 1343106 921470 825113 593171
10950 593171 947531 761868 589548 476137 271451 -195386 261104 139223 98670 114571
10940 114571 379143 161557 303634 65949 290366 -280653 204474 56625 335247 30981
10929 98721 211764 -21453 167814 49763 -503378 271374 49868 273627 25242 -60433 142345
10917 117952 -169760 -7661 222925 -163477 375221 169793 176959 27147 -168452 529822
10906 113146 56121 -221 -69402 -208763 144692 -91658 18243 -466172 -55390 -115984 -44649
10894 -134354 185982 211387 -124732 319901 265288 -38762 -169606 -188269 78770 -178087
10883 -244119 109247 70689 -234124 68430 213213 -200767 238416 91306 -92589 162917
10872 -306413 106225 -219196 -47253 -244992 -45096 413759 288930 -94078 186598 43533
10861 -147992 31914 -167378 260774 42979 14262 -166004 -93048 -342362 286081 -162855
10850 174406 -196744 -263317 53322 63557 -8473 19518 133504 63448 -145690 -265525 -32056
10838 -239650 145412 -170451 -196849 -380186 -18230 -64074 -35672 -312923 117814 222564
10828 222564 203671 213887 -96110 157140 -174710 -42783 322466 37598 -227798 -255834 -9304
10816 175961 -175313 55487 -305362 -111952 20622 -272465 24714 40155 305631 -286494
10805 -210703 221003 -110307 35260 -301237 -343342 -291376 -157703 -93366 68470 -58871 -125519
10794 -125519 -202866 -106898 145752 240226 18398 -236947 -17078 63399 -104105 -203118 34820
10782 -154818 137020 -222498 19869 79157 79583 20504 -126778 41133 -77823 -417755 -73679
10770 88459 -152015 -18930 -202989 69505 8396 -181218 144693 -193899 20685 -7353 166450
10758 -57122 -230156 117660 155080 -138337 118030 -152372 -265789 -149616 -289645 316651
10747 -9141 -99323 -220109 186360 261385 -340823 -82369 -90997 362 312996 -285078 360966
10735 112153 310723 -50111 -106519 -169892 -109233 26626 -336338 -152180 -255517 -174311 -67187
10723 -1768 8623 -324502 -214492 110344 207761 -191020 -260075 282926 96165 -170334 -51563
10711 -82035 -50616 -231623 -62016 32676 -39293 -189395 38865 -235765 -27556 -148054 -171921
10700 -171921 95372 -275310 104930 -299684 -9908 64021 139830 -37374 260328 -393112 131697
10688 226161 159160 45852 82040 86380 -8278 192216 -69868 -50137 152432 -279619 -85782
10676 -32447 -87215 144074 -125842 11853 102296 -347049 -125413 -222640 -81064 -128550 -65804
10665 -65804 89192 11987 -186491 -164214 84621 -205026 -189069 235100 118166 98906 286351
10654 286351 333763 -269073 -90563 -136473 -194699 299602 170957 -293328 -85306 87690 -404956
10642 -62430 -194767 94354 -17463 -239732 -160245 16367 -180151 -73900 -58644 -37623 -280330
10631 -280330 -83581 -149963 -72021 -189714 131223 91849 272574 178545 -202520 -536213
10621 -536213 1832 -148166 188985 -269688 42852 -442711 -276796 -288895 138944 -12698
10610 -45826 -35677 -215190 -80549 48722 165056 31199 47668 -135951 -134923 -110158 -103329
10599 -103329 314049 -229495 372328 110796 -139170 -155132 -182332 -82360 -131079 419609
10588 6453 -281672 -69072 -301591 -48530 -38813 12250 200009 158380 -126678 263240 208711
10577 208711 414664 -150153 -44809 -331796 -338846 -139814 -343540 -315390 -419190 -263758
10567 -263758 80297 -50888 35713 44136 61789 45674 -239843 -195778 -339002 70826 330309
10556 330309 74039 -41644 -161637 -119244 -104822 -226284 -15538 13238 -40720 -51515 51224
10544 -81633 28456 -213382 -85088 160273 265008 329042 85197 -90415 294844 139542 106009
10533 106009 98516 21374 386477 224771 94230 4829 -405856 -12149 -77617 13289 -35690
10521 40603 -276093 -157230 -274859 -38747 226804 -24779 -83147 -308502 42638 -138183
10510 31167 -177056 -111778 1902 -83807 -329956 44552 -56443 144068 79279 -48034 226590
10498 194143 -14782 243075 90419 -201609 -85943 29873 -54393 -189311 87127 -119597 -7896
10486 -119315 -81916 -94382 164965 388641 -105374 125193 300494 164849 227766 98865
10475 28676 -132526 -116378 -156709 -56687 148154 11894 166193 -202577 -169379 200027 -63688
10463 277603 -153175 -271384 -194980 230355 104399 -130440 97621 231455 4159 -112883
10452 -137499 -411289 -177808 2273 255586 -122644 142189 -29826 113819 23426 -88903
10441 -187496 -208255 390089 -178821 -177497 -85258 -38799 -141266 -25095 265211 137159 -78970
10429 -47948 -27340 -2634 -34949 188335 -128906 132520 2802 38528 -51416 6871 52799 146106
10417 146106 372317 -10731 -40297 28966 143911 -314205 -231072 214374 -122829 93089
10406 32138 -117527 -149377 -104985 -139752 -160659 59147 143729 -16911 324524 225237 -99162
10394 -255222 7873 55276 237919 292466 -119880 59765 -170807 40567 -414 -369 171910 -104770
10381 -105639 377106 -62604 299630 262067 -185847 224192 314762 39575 102775 -70121 45236
10369 280650 169347 109863 68914 -71080 301331 170909 247267 -24173 -83093 359718 344587
10358 344587 33808 -48543 560085 -110854 425955 154077 417186 380660 522211 506679
10348 506679 371222 291550 262335 312886 306748 57810 410322 366333 155786 79802 247122
10337 247122 137143 -66335 -40881 -179695 247318 -21144 163437 320837 -50839 -70126
10327 -70126 214038 -91992 197213 122742 35637 382963 -162260 158178 20334 115954 506715
10316 506715 39291 259891 68120 431543 161066 202881 -66552 68816 -348710 -37673 -200845
10305 -200845 -40670 287356 26016 -142168 288282 -187587 -165344 -49354 -139001 236265
10294 482370 -134803 188039 88283 79887 -48199 -3994 22028 -157148 -113115 136736 122159
10283 122159 75491 -270383 33405 -27622 98218 -273769 -37946 43170 341288 -91556 257049
10271 -298918 93615 10732 104655 56439 -90629 -151763 101018 -41233 32406 -21379 73196
10259 -114192 -233368 148036 173490 182368 -193508 95989 -48622 258816 -59431 -68577 -174295
10248 -174295 210389 -17887 -295585 10273 -322728 182180 946 -181193 -18537 -65686 -159210
10237 -159210 295005 32930 159834 -33866 23622 -74816 28795 63697 -36448 -50031 -223794
10226 -223794 170498 -140850 -151312 89279 -130980 43229 319670 -56102 -187501 -144468
10216 -144468 107200 106772 -146862 152612 -55632 20752 -69909 -55960 72754 84718 270413
10205 270413 -419064 -39280 157752 -33980 -129632 40815 -5395 -158274 64215 -45040 -158127
10194 -158127 30245 -247307 330026 -208491 -327476 -255317 -184936 75327 -254471 -185264
10184 -185264 -56189 282565 87381 -173888 221413 -131494 -334563 94287 107825 -15135
10173 -241703 69534 -21179 -254589 -161108 54791 -148785 6908 185571 -98637 -547638 -113194
10161 -256818 -150914 -188437 -261017 274580 -111507 -485620 -244633 132322 -131588 -92630
10151 -92630 -84204 -230589 116030 144451 141749 27200 -320601 402270 175498 95210 -237315
10139 173094 68970 -315192 56507 -23981 125558 18639 82021 -205175 148953 -61778 -90580
10128 -90580 -239908 81858 -39390 -159832 -142478 171565 209291 -922 -77089 -115498 -102510
10117 -102510 112504 -175712 39731 73620 -295256 -182926 161125 -65184 64618 -251916
10106 278794 -269058 -6322 -335751 68360 69629 -202169 242598 212111 -297544 96693 -132817
10094 -19895 -22454 346194 -327270 -58837 9794 -109380 -148090 -22371 135654 -25554 25426
10082 5732 -200702 -191954 31645 -223037 1265 -114470 3642 -195034 -104959 -162358 -43235 -341958
10070 -341958 158826 18120 -57438 -110842 -163631 -280129 -19226 -100867 -224127 -101371 146064
10058 -170603 391988 39344 291562 -253864 -102524 106532 -456555 123513 133888 85380
10048 85380 -218286 150682 162687 -182745 -500697 -154836 159550 -272611 -172194 -128682
10038 -128682 -148598 98490 -186530 342303 -396540 138088 -301389 -76009 -153711 -59081
10027 -40907 -70972 117616 -205041 -682260 -186819 8125 -122569 -4226 376020 2774 -154560
10015 81227 -69184 -200470 7077 -79315 -134690 1464 230605 -235207 -224152 -110868 -451579
10004 -451579 -108659 115323 -26884 240641 -182395 87401 21832 -183214 -83989 65450
9993 98624 135962 1720 -192650 346743 -62466 207693 -354230 -324091 -225558 -6650 210862
9981 -280168 -59642 44995 35273 -79059 -74412 229002 -85645 36114 -176108 -76215 -65145 -82109
9969 -82109 -203405 141987 -443255 89957 -371201 3745 -294545 -81008 -128601 83159 -174296
9957 150163 -127328 93949 -283661 -115562 142212 21071 -50900 -119098 -486917 139763
9946 82280 -119802 -127757 -116282 -140591 -328 -73239 -246127 118724 -179035 84526 250265
9935 250265 271160 -5517 157068 -18935 -55823 17071 -152466 -158040 -260760 -100103 -334855
9924 -334855 176693 -23190 -374979 -299256 16412 166568 -58311 -178908 57251 -234138 -292692
9913 -292692 -90534 -406014 55597 -246452 -114678 -265384 -26954 42048 -232154 299467
9902 -51128 316103 -29683 -221345 -77376 22497 -135649 101373 174949 -234944 -295412 -133632
9890 122245 -59126 -201779 192963 178235 48595 -211374 74665 -315758 -2757 -268379 10563
9878 -142049 -268049 -97171 55022 -75814 50993 -124059 365614 -491851 207669 41692 -78364
9866 -89470 -241287 -92882 362135 -53768 28888 -61032 -176569 -103621 274466 -142395 -298808
9855 -298808 36586 -381121 204390 -129339 -131032 -19791 -203365 60431 -181846 178582 127530
9844 127530 -170240 -207511 156017 18928 -129171 -48563 120467 95426 169180 17606 44109
9833 44109 62160 -28011 -91145 -208248 -35501 -251021 90413 41201 230395 -245964 -12892
9821 187547 -204308 91965 -5626 -39547 20926 139402 -195186 -146679 -171527 14025 125957
9810 125957 -18137 -293880 -136075 -328512 -143078 -142355 -43413 199018 -240732 -148777 -260947
9799 -260947 -61006 -158782 -274442 -23934 -94424 -255202 -247061 50412 11002 56246 174737
9788 174737 -109522 129112 -18871 87408 -48423 -102127 -145171 248571 -34641 -96217 -171930
9777 -171930 -153185 -365228 -182202 2438 75047 254872 -222721 -221441 -212729 -83208 -131213
9766 -131213 -66366 -8325 62939 160717 -99923 -85814 -36598 -90590 -104335 81570 -82325 -225869
9754 -225869 104083 -167496 -185241 -47437 -22984 -313711 24114 59569 -100599 -215926 -242270
9743 -242270 -186499 41471 139798 334548 -150942 -51947 -63031 -115278 -127066 128358 -245334
9731 147733 47443 3253 -335542 -36840 58592 -188375 -149458 -24440 -140986 266771 -199282
9719 -155379 -165727 -129789 -27574 -34021 -398733 -105155 187952 -106196 -90555 -295325 -19794
9707 -124150 -79794 -385490 -554725 70410 -59721 127374 337896 88254 -281643 -122730
9696 -66463 -68649 -301502 149625 -109752 126894 201616 479278 15174 103003 -7777 -90804
9685 -90804 -135179 -932 48124 -348989 107789 -5339 -242731 -143497 -199433 107865 43648 -278787
9672 -32180 -27556 -11915 -346382 21444 -188375 -68218 -285282 -208666 21903 -96653 -280128
9661 -280128 -103768 -66479 -191230 -37766 -229468 -155636 183424 -256295 -16826 -61555 -162274
9650 -162274 -89884 -187690 -143623 -143758 115887 -156073 -35823 -156207 -301018 -100735 -355509
9639 -355509 -200510 -183786 227077 31677 19568 -124090 19783 -350854 -116561 173297
9628 -237889 -368676 -84263 -53400 -94285 -239528 -274860 -80641 -327011 -67043 -24810 -5880
9616 -385764 -127884 -44713 -82041 -38897 -225001 239711 -118590 111784 39247 -243190
9605 5319 98876 63746 -114693 -65599 -8584 -215495 -367985 -101281 -252405 -96760 -389010
9594 -389010 -173513 31357 -72228 66429 -280481 53460 -66853 162363 -257322 137392 -551130
9582 -164068 -49 -134923 -15547 -199448 -4044 143893 189076 -115260 28602 311892 -48822
9570 -294362 -191639 -5266 -19979 -274869 -54162 227834 -202440 135968 -81575 152004 144529
9559 144529 150050 -307776 -38807 -424962 -417581 79920 -18237 -77948 108272 26163 -20282
9547 -26790 -50099 333973 -136058 -43166 93616 -109061 63519 -126141 -26684 -37361 79456
9535 -283021 -318531 117111 35877 -84843 4344 309089 150811 185361 165285 -22583 -244778
9524 -244778 19097 -43307 -276787 -202924 -323887 145148 5471 8131 210845 145969 182143
9513 182143 -383015 -165544 -83952 -44642 -26042 2918 98406 43494 -176298 -239960 -55617
9501 -129079 -152435 5862 66491 -224660 -100568 93247 69355 164087 -58643 -205691 3952
9489 -249072 3868 102281 -235587 65240 -302446 -280128 68021 261962 307062 -86050 -156250
9478 -156250 165288 -93851 48881 -308959 -38209 237742 126894 -42842 -61187 22859 164873
9467 164873 -225098 188046 78250 383011 -215925 -331228 -221971 -444849 11438 17563
9457 17563 48410 140190 -3031 40749 -69122 -53965 -101444 188284 373374 -26928 -262095
9446 -262095 -85374 -110184 -134456 -278648 83879 30669 345207 -55877 12145 -426172 237731
9434 -152179 -171209 40536 -9606 -173158 -197824 -171194 54375 -34701 -162822 154552 -374720
9422 121963 148921 -41254 57478 -446926 82165 -118566 -264715 102522 141786 150568 -127462
9410 -253548 -2369 115344 101731 512853 10798 242938 -521 -7712 -249677 -453596 -207313
9398 -286807 24609 175356 -160874 195369 -247966 2446 -80067 -196609 -6287 -80120 -250858
9387 -250858 143991 -363095 50512 -183185 -398602 -467486 288082 40807 -115963 -169059
9377 -169059 84994 -137161 30855 -106190 -103733 136678 -54809 -116824 -307282 -253168 230632
9365 -137546 51596 188804 -84499 -114611 409243 152605 -32174 -26049 -84744 153957 299129
9354 299129 -165110 -161148 5452 71473 -234956 62924 154723 -24854 28233 -93681 -131786 330686
9341 59293 -450209 124032 -4245 106088 -337505 171394 21406 50673 157856 -272216 -41707
9329 26422 -122360 -485316 -212497 97442 81583 -514596 -367181 79230 11400 -96510 -281632
9318 -281632 -229073 -184360 -189904 -283881 -64076 -321682 86829 -247143 -9455 -120154 -100289
9307 -100289 -16939 192946 153628 -191648 -117518 -234571 -19218 136560 -37599 -101608 56043
9295 34669 -55931 -30362 -124146 51307 -122849 300445 366969 -23055 -255015 68500 23780
9283 -146663 -76050 -60572 -35268 -144781 -52967 13852 -157758 76837 -65827 -145264 64270
9271 -402528 -182239 -17437 75341 271383 -111282 -206727 -27536 -228333 -33077 -116535 -293626
9260 -293626 -380199 -214620 -263259 -165111 -89869 109971 -145385 25535 -88898 211348 90637
9248 60248 -26705 -159514 -163288 -125503 -83343 146264 144242 72601 -174728 150950 119667
9237 119667 -111202 -305597 -155155 37256 -117627 -329040 253205 -132724 -38048 -137068
9227 -137068 186875 103576 7631 -173326 -80485 -319803 -72655 184691 42054 273544 -52553
9215 -65733 32326 -60834 -23916 -9725 41849 -221294 -496805 -241214 -49404 -379303 73636
9203 178576 -64405 40065 -6753 -73226 -236854 34247 144705 -43808 -174798 23235 158438
9192 158438 -130194 -22377 14285 -367315 -139887 -79836 -122807 -197293 -19040 -32476 -137758
9181 -137758 102776 -275234 158027 -148430 100586 -121691 -79576 -283248 -11522 -180032
9171 -180032 -153274 296189 105480 -115584 -51379 39199 23403 -433329 162265 -32998 -46510
9160 -46510 33876 197084 -55856 -97026 4067 -25232 -170153 38713 427944 -52114 -202219
9149 -202219 270431 93201 215351 330171 74002 31060 34603 30575 -196494 -377515 -39813
9137 154891 -204157 -402983 26147 -148504 -16965 -30963 -181980 -133033 259285 -118196
9126 -61580 -221235 73982 -9758 -145878 -96619 -94525 -342344 401529 437626 135277 -3124
9114 -204331 -101669 -116891 51396 -288217 158075 -387609 -84092 -274444 -93978 -76493 -367110
9103 -367110 75979 240190 59723 -66714 -99555 -374103 -89141 35527 73313 -30125 96034
9091 -123913 259135 48257 -23340 -86703 -151520 104742 -146644 31784 189136 -54673 256419
9079 -111509 -184236 -315170 -118007 -26168 32045 -128153 364897 109914 143800 -67110 -175762
9068 -175762 63789 -252810 60214 -111733 -87373 243647 330433 112158 -66508 -81768 -25265
9056 -284494 -7323 -306813 186234 -194289 -348420 -209202 -46886 83958 -112699 33217 73909
9045 73909 203702 299473 -339581 -118080 -35365 -106881 -73847 -36418 -137622 12941 -296580
9033 29012 -410908 -28619 -14312 85080 29338 -177459 -8336 -337440 -141500 -166208 24161
9021 -262133 69375 6381 -210501 -59092 -223730 42905 166328 -96502 137583 -225288 115824
9009 58891 -126352 -171391 91644 -184145 -29577 11463 -186312 -300 304851 -225931 -197072
8998 -197072 224408 -403939 -62206 -109560 -125867 -196673 60329 48075 118737 101173 -255119
8986 -241400 197992 -367517 -369996 -443074 -334778 -207200 224324 99885 -170888 -315192
8976 -315192 56305 -25937 -9161 -103786 -323315 -26565 -240420 -62237 130211 -1568 22429
8964 106841 -195162 -20838 -83586 164702 160219 -139810 -151137 -201776 -89892 6231 22018
8953 22018 -77220 -403082 -56317 -262421 -281703 -636699 -140696 9881 262586 -138907 -165905
8942 -165905 -359544 138179 -222346 -33546 103982 39383 87144 64534 585453 21301 -143704
8930 233894 -281109 177130 -371918 -293159 339007 795535 1122238 2699287 9691140 21516071
8920 21516071 5884363 1867792 799122 349259 280510 106091 156576 209279 -127680 -105694
8910 -105694 -280671 215712 316623 209838 159433 -64947 -139496 272259 129378 147235
8900 147235 2781 13890 -97784 152296 -8749 -503871 -132271 -277606 -120656 -261327 -230292
8889 -230292 -51358 -228328 -64031 -433071 -120507 64766 -82274 300443 -121991 -265774
8879 -265774 -18368 -304155 -85515 138059 -40410 103051 -204992 -112356 199727 -49642 410940
8867 -116775 50949 180225 -76148 -39669 -45656 -76167 -59531 304995 -160979 -124558 -235237
8856 -235237 -194605 -216246 118986 67791 196189 282666 -143940 -159263 -64988 -124078 212314
8844 -23256 -138283 -240796 -99916 215119 -19012 -205801 -156169 -198898 178897 -128478 147084
8832 130875 3880 -102382 118537 -226618 -201059 -127055 -211111 267372 -350634 -45890 -301150
8821 -301150 -95449 -180327 -297671 -140862 -39063 -240104 -126566 72452 -323166 144846
8810 119705 -188258 -263059 49851 -17159 -78896 171263 -390261 38995 32589 538804 -167099
8798 -60588 -7347 357607 -66429 130361 -298496 -87238 -91066 1719 83185 -85986 58958 -43151
8785 20031 -249037 233626 15302 -169148 264713 3875 389813 -244088 70291 235237 -37867
8773 11033 109433 157001 -63882 64292 -245565 -1946 -178749 187576 16106 61422 -7667 -205810
8761 -205810 -16500 83097 18579 179080 -284581 -197157 135019 -48367 53283 -196316 -16761
8749 -256806 97107 -440908 -92566 -66647 25760 -180981 -226644 -159673 -36463 -107493 -115317
8738 -115317 -320489 -75345 -349650 64349 -40947 -273026 -137693 -73912 107953 -245129
8727 150480 121093 -162613 -18278 -11799 -476113 -349711 -211823 142086 -107459 -38367 -91519
8716 -91519 -4530 -41072 49863 73028 -113674 163831 -116088 -57636 -218223 34873 -213523
8704 280296 -277443 67419 -156832 62115 -156925 -58559 289063 -21018 16195 -65658 328525
8692 252860 192605 -302428 -146789 -149829 133514 -353558 136992 59709 -189333 -300996
8682 -300996 34520 131887 304436 -173834 -86487 -96856 -94722 -201193 -43682 -44399 -343335
8671 -343335 -257506 195674 -16640 -64143 -412609 -21538 -315035 -15273 30069 15810 -424986
8659 -103238 -18352 -200133 220507 -79694 -27746 109531 -151279 -106033 -128486 -296338 -36869
8647 -160912 52480 -236212 4492 162670 -108830 191013 99710 4496 12664 164931 104448
8636 104448 -60347 -19220 265371 -216064 -317766 238168 -306457 7215 164932 121695 115778
8625 115778 135919 293350 -300641 -62168 110134 -80786 -6201 -204123 161132 -228896 -252235
8614 -252235 -41983 -136123 -161980 -258625 200780 -175136 -277221 -12991 40305 141707 23952
8602 300410 -75231 -55451 -304923 33948 -239135 -210714 468436 -132641 -339919 -195985
8592 -195985 -73470 13680 -176877 229418 365486 35370 -67136 -399460 -47488 216344 -213981
8580 124018 38928 -83459 -375419 -202500 55446 -93702 -196618 196479 -53798 -31731 -183332
8569 -183332 46523 -308517 -367170 -3455 -321963 -287017 -196292 -253115 -79041 215933 -51767
8557 96441 251454 -36544 151141 -64328 -162104 137330 -145041 196637 146024 328595 62362
8545 148496 -25885 -240448 -48277 -265010 -357598 71769 126297 232787 -19773 46370 127189
8534 127189 -548959 146393 -91685 172092 -55310 -47886 -256852 -154950 -55375 172430 -155101
8522 83531 90550 35222 -18039 -877810 75406 20980 312025 -63696 209962 -29919 9062 309998
8510 309998 6442 -69486 -177464 -33667 -205137 49701 -155294 -85165 -496654 168678 -20525
8498 -31128 -73499 -171162 227587 30010 -118007 229933 64838 -83451 61219 -159488 -188039
8487 -188039 -62660 28408 70688 76775 -176934 252526 184720 -99075 137847 -265122 37799
8475 -327119 101366 26909 -288299 1783 -144560 119066 -450408 -44470 -35347 42019 -89856
8463 -136818 -113511 87071 -36622 143231 -110051 624 -284749 -27999 50571 22452 -267142
8451 -304822 13060 141053 63308 150167 -49214 273904 -355012 -77384 254583 45759 -147477
8439 149224 -23827 293549 -207759 -86616 173674 -18267 94639 140156 -114552 -123710 -199401
8428 -199401 -207479 -288311 65381 103649 -312925 -45752 -206157 -105394 112538 102478 -90975
8416 64357 38272 -285228 40090 49131 153199 -105852 -98337 -64931 -401653 -354760 -159475
8404 -104098 51881 -280854 -133438 -93775 -240231 -57022 124673 -60237 20905 148167 -21233
8392 -175152 191212 -126126 -43422 56047 223554 -159873 -73584 32747 97281 -91499 80733
8380 -169177 204715 -71886 -225497 -22804 -76783 14188 24651 366813 42958 137704 -205124
8368 -146595 6771 29477 -7782 -216471 175967 310423 -170403 -400908 -222534 -30661 -219410
8357 -219410 -246905 -249550 -139679 -287440 -75031 64029 80472 -293707 18715 12651 -16843
8345 20112 27586 -33077 27004 -324296 -136667 -80200 -24601 -278928 87718 353255 -51497
8333 160243 -19372 -99592 130237 -192101 38174 32433 248572 83831 -202529 123237 187849
8322 187849 -570875 -394737 50043 -290802 -189726 -81732 -290514 67558 -331837 -29485
8311 -111686 -160337 -13149 335235 -157173 43273 -94793 -240533 -50525 -162958 -38685 -116857
8300 -116857 91076 88542 45800 -104278 -260686 -167667 80158 38630 -172350 -138067 -88841
8289 -88841 84866 -320221 -149801 -207352 -183817 -6208 -79263 -125577 -176528 125389 49229
8277 -46274 171629 -135411 -10764 -285922 -135801 -146347 -269863 17684 -398841 181106
8266 113919 -253571 -83289 -218421 189907 106719 4239 185467 -196375 -83581 -36024 -246252
8255 -246252 128400 -51594 -142264 43519 34398 166597 -93346 -8561 431269 -97854 -86139
8244 -86139 15281 34777 32603 -10957 200088 183469 -77237 -67320 -59384 194947 -214140 -399972
8232 -399972 -124438 -106235 95316 262102 73760 65868 -97119 -688389 97228 319876 -224539
8220 -169208 8006 30299 35882 -195971 104886 -12434 -213330 208810 136944 13280 179091
8209 179091 262241 -173204 -30228 159847 -62815 -32524 -8315 -284149 -37641 166034 -104202
8197 -29551 27263 -51874 -218482 65968 -103841 159025 -113049 -44414 -96639 -113214 200533
8185 273650 -275043 -24738 74149 -155234 194238 -243605 -15929 32943 234447 -98882 -403340
8174 -403340 -294064 -14028 -155830 63592 58954 -93603 -7127 116610 151290 98977 -134454
8162 9469 -7617 -111368 -164362 245588 -276980 195329 190056 4183 314378 -233405 70497
8150 -163201 -194013 -90116 133270 13482 -117367 -192922 -71990 -112699 274465 67584 -176437
8138 138710 -119826 -40670 -8602 -149993 147727 -248809 -100433 114099 -158981 75487
8127 -34997 115683 -143333 69153 -153945 -193274 -26144 -140906 -43370 -33307 16951 220127
8116 220127 -142916 217686 -144410 230099 -219576 42166 -269602 -35749 -35495 -81358 42284
8104 -385487 593772 211192 -51519 -144426 -171156 -38467 -33851 201520 -248909 -95843 55626
8092 -90967 148595 34925 33268 -128165 192501 -284036 -181144 -10466 41502 -86872 33689
8080 71501 -285392 166589 -318699 30695 -39252 -101416 -350043 -71109 -496566 -103376 702
8068 189558 -181733 36909 -122195 -235141 -135394 -32612 218566 11368 -339082 -141470
8057 -214035 -149675 -68948 -94454 -130957 67133 -17368 80937 51253 184172 106495 -1967 -411403
8045 -411403 -427128 -27076 -262171 -92690 -241050 43546 301666 99367 -184485 101574 43366
8033 -10720 -113951 93340 -233019 77348 -116466 -72216 -211868 -25065 40950 250126 -104539
8021 -221651 -388085 -252786 -83305 130764 122300 183243 82506 -63413 39827 -175298 114805
8009 -76951 263352 -73182 -333539 -20363 -12129 30832 -244119 -220604 -35900 44903 -44965
7997 -305715 -346698 21259 57877 -308392 -155050 -389004 -27123 -516128 -316951 124032
7986 -33871 -176261 358499 -36696 -107480 -150891 -221275 -85873 -192509 -137038 4000 20069
7975 20069 109665 125017 -10511 -254707 19232 256166 -7059 100743 -224260 206992 130766
7964 130766 -381674 344510 -311251 155369 -18949 26830 -316511 113662 330771 79473
7953 -292054 -232952 257174 -70859 144877 -43992 56727 -60025 -6515 25852 -124173 -145960
7942 -145960 113267 237004 -286284 318852 -324402 64998 174996 -165974 231454 79891
7931 432365 400311 -77327 -344432 -202470 274996 -166500 90866 -22715 65534 227165 100575
7919 -179647 240512 -127196 135015 53495 48412 -110585 -34911 327394 -69922 -307763 4686
7907 181451 106657 32279 114074 121779 322952 -67581 -157020 340637 -215784 1209 -267836
7895 -8272 116812 82210 -98093 70391 -104404 -25100 -70658 202244 -168265 41726 -105991
7883 61599 -215745 124857 -144171 149256 -350287 -31516 86722 -32011 140934 220908 -553928
7871 5456 123388 113220 133403 551640 43379 9155 23374 -179140 -223038 -115939 -57874
7859 124059 -140440 71668 -167277 5010 -124315 -102253 -32964 53529 39894 -298325 -151302
7848 -151302 -334339 203545 51363 162193 121535 170479 -204853 -218988 -324208 -416177 275771
7836 123875 69559 11605 -15283 -222874 -17090 -97621 35746 -181578 -142085 112316 11241
7824 66722 229275 -250863 -165020 -145048 -115263 -301931 212144 -146911 -85599 41417 95854
7813 95854 146608 56895 -459012 -104795 36807 -65385 -159731 7905 133028 119269 -48346
7801 303649 -275935 -231320 -29037 99609 416610 194599 -320636 -99842 -53154 -112447 -124418
7790 -124418 -32700 13310 4794 67816 -92808 -374392 -26513 -158621 -64982 17786 63994
7779 63994 -180829 -103788 -174125 -138715 -220673 -53785 78979 -51828 104188 -280401 130747
7767 -175657 -323279 -100154 -352120 107956 -82338 60614 -170165 -206446 -119 -215067 -20055
7755 -35312 -50439 106035 -195712 -187768 255959 -194073 99553 -419275 120952 250316 -26734
7743 -16352 82474 115400 81627 -16642 -64628 150973 -41076 -159729 -165218 -249772 -111371
7731 -84340 -462419 -95099 101982 192186 -85270 -147842 19608 20077 -84148 -97370 73538 261216
7719 261216 320661 20170 -8687 -22145 139543 -238335 129818 -412394 -237151 -5400 208934
7707 247817 -6398 -12826 158795 -211088 -121131 16215 313484 136343 -259793 -134515 47084
7695 -63958 -2976 168078 129609 -83181 -150637 13987 -238195 -180135 21274 -244785 -220369
7684 -220369 -77222 190816 -90667 -272040 46363 73376 -245154 -195190 92611 181176 42829
7672 111893 -262977 24556 105780 -9864 -198548 -133960 -215465 -248708 -129 414826 -67097 -140150
7660 -140150 -313811 -45324 -352350 -74535 121805 19399 152845 108847 -148666 33795 -553687
7648 91032 -315800 133603 -89469 -259680 122448 -186279 -258607 40493 61837 278262 -81466
7636 -238538 142732 -112471 -211551 -33184 -83647 -103635 -222859 -184250 -455387 42983 182747
7625 182747 -266044 -53669 57094 158978 -281078 3447 -198222 71842 31663 -243072 22371
7613 77868 -222212 58617 -164051 -263436 -407300 -207656 60836 -51131 -170885 -22239 -41463
7602 -41463 66299 -152386 -84087 194228 -153902 120241 -155182 -308869 119283 216807
7592 216807 64116 -22631 370090 -12403 -164730 154002 -75331 -96674 -92463 249175 -190348
7580 89432 39392 -373779 -147954 -125119 -353131 21997 244876 -26854 -1046 -172026 -133061
7569 -133061 -149995 -15242 84375 -53500 200409 -140467 55861 -14250 -385898 -90899 23575
7557 79520 -176075 23484 -321701 47884 336565 -88476 -43101 357245 -6037 113943 161122
7546 161122 -35166 -65406 124870 239505 155292 -100230 -128336 60516 226589 -125990 -213863
7535 -213863 194370 4369 -242909 -220511 95322 -407573 91057 -76853 227715 6129 -38404
7523 -420166 -122386 -106226 122051 16552 -14081 162060 -80706 -289635 -78603 11289 122952
7512 122952 85450 -129292 -276949 -174934 39308 -275685 33011 -7934 140985 97986 -34793
7500 140379 20098 -237005 170972 147178 13068 76615 81135 -37955 253075 145938 19353
7488 -176003 21163 4006 96031 47847 -54545 8218 -182146 -170584 -212615 -105668 -227444
7477 -227444 162353 -195758 -248398 -242069 -55848 155369 116894 9980 -142143 278383 51780
7465 30076 -11836 -82979 -269084 187607 243708 -189807 145500 218494 -186378 50424 -399325
7453 -10507 -76208 -11852 -117251 192033 -247773 395227 -186887 17092 141483 -51845 -86860
7442 -86860 -14952 -161433 -150145 89529 -28133 230599 199234 37103 9457 -201278 -153259
7431 -153259 69797 -42624 -284029 -61125 379515 -49444 -62093 363635 -30832 81033 -187161
7419 145671 -2207 -298890 -107393 -10075 74236 113796 397464 -307956 -433999 -23120 -120369
7408 -120369 92905 109606 -29750 -226738 129668 -29828 1827 -118172 -487444 -82223 -128538
7397 -128538 102454 98997 -117238 74862 -531390 -110744 132014 -297705 -240156 -146826 110571
7385 -265045 164678 96961 -196693 -304445 -81652 -215515 75589 -191946 29065 -223132
7374 120238 238685 10573 128636 -85696 239619 168300 -14601 -183810 -237379 -6305 -169064
7363 -169064 44294 -254208 -299438 -291769 107675 -100816 -72665 166020 -68109 -68486 248722
7351 -106233 -133965 -52280 -122150 -111904 310260 -25489 -44724 -73950 140528 -291894 -60167
7339 -56183 18624 -282641 -129883 -315041 -50764 -34413 -1268 -55779 39749 4630 -156359
7327 317145 -96239 -110316 -313970 -64840 -113407 -77770 81847 -106493 -353645 522853 -179852
7315 13797 327368 -6314 -284516 -116234 137739 88180 -24683 138870 -57695 -92748 38577
7303 86866 -291981 -126909 4399 430018 -68007 99593 -92310 -62167 -244766 288619 -214557
7291 84356 -184817 254073 196056 -6598 228844 -236431 -3818 20870 -172671 50388 61703
7280 61703 72209 230899 -104169 -391860 -111971 -78083 -282971 323831 179607 84189
7269 -210871 -41564 -94248 185020 -226762 143142 -1723 -14077 -7624 136788 98169 36678
7257 -128750 -190315 50381 -318690 170093 -37236 143419 -85775 -289821 368124 -148219
7246 26163 -104537 -90206 135866 -140804 212874 261645 210919 58088 48203 -125421 -11890
7234 -275487 109247 -174759 145211 -184470 -209702 -101019 -147564 59451 223813 104166
7223 76531 56457 -163828 315990 117225 108620 161378 -245054 69444 -111384 -271894 206610
7211 -16532 -101673 -332227 -15396 167291 -49055 -146110 264569 10002 45702 132434 270094
7200 270094 -185351 8034 1125 142414 132265 -49101 -97890 -313607 130755 -88331 406415
7188 17095 161669 -122735 -111962 47095 118039 200476 -48792 -150920 -178686 -142842 -146628
7177 -146628 33144 449337 120931 29349 70589 -17293 233835 34920 11228 149998 135562
7166 135562 -80551 253861 341858 -6410 256316 94538 174078 76369 -205950 -85419 -154798
7155 -154798 -69185 -41083 57313 15394 -235861 -271700 -40706 -261566 -200379 117011 86803
7144 86803 -235218 -373013 -29083 -199129 -4132 -117931 167499 34587 49475 -34504 128588
7132 50194 -169099 -240714 -150639 -296567 -137837 -187279 269316 -113036 26780 -99129 409569
7120 -109245 -16543 441342 -41930 228320 69958 404979 -152579 -172461 -132102 137846 210445
7109 210445 -131533 209317 144660 284789 -46619 19387 -80681 -50196 -199366 -204193 -189497
7098 -189497 54174 -52139 -259053 -264804 -116795 -56764 -407232 12975 58724 -111422 -59825
7087 -59825 307559 -174309 -138100 175757 45222 -185052 9802 -361571 43067 299454 88537
7075 -34922 -108976 200576 14638 35553 -239170 -78530 48016 -598495 80913 -48311 -414970
7064 -414970 -183276 251655 59428 -334280 498335 -216237 224430 -136721 -237892 -308009
7054 -308009 83617 -83686 121453 1160 228300 -61310 28127 -44441 137868 -135102 -265835
7043 -265835 -104763 18632 -171254 -50482 209627 -58244 34039 -131867 -138100 5797 187070
7032 187070 54960 -455432 258089 207112 114138 -184449 -204112 108989 -314498 -138597
7021 -234042 -428854 2346 20193 -144935 15074 17066 246671 88411 -290057 -75595 -73808
7010 -73808 86258 161870 -365320 -199776 67232 177172 62194 22113 -103137 203605 191666
6999 191666 -208927 54629 124095 -81890 -64297 -154108 299654 -361608 -13379 32054 -135640
6987 224566 62762 -200002 -480401 -161451 -11818 322456 -339291 -7954 137888 -35268 73656
6975 -47098 -175986 2792 -129583 46386 24700 -22929 -17273 365220 -208626 288031 145014
6964 145014 -62503 55151 -171468 201174 -242833 40742 -260531 -244905 -83582 -193968 259425
6952 -33325 240079 -281084 -147120 -79096 11868 177389 -302683 206043 157242 -146762
6941 293611 -90235 -119062 188000 -60451 184873 222578 -13262 -384550 151998 295207 -178251
6929 -400322 46011 -60803 -27620 119106 2064 -52148 -96372 -116877 -234967 278205 397575
6918 397575 172746 -134663 180580 175981 -313269 -313765 -266194 -28697 191476 -23848 139574
6906 -127963 348366 -63222 14768 21909 21845 -125366 -8113 58380 136401 -272395 -220713 130019
6893 243180 -131998 153569 -243925 -66540 5924 -370738 -14317 109531 -246704 -95567 -78177
6882 -78177 149214 -218539 -304239 -254412 151637 -78081 191057 -114150 -281527 33449 -90832
6870 298952 -129891 -242208 130384 -123234 155209 -165395 50053 122458 250084 222094
6860 222094 311611 -290965 -281931 -57968 -67471 -59860 -276200 16574 -88624 2368 -248053 -72003
6847 30239 68037 -77702 -8382 -68626 452353 -158704 -219866 233051 -37047 85105 16370
6835 149774 176825 -58658 295934 -66759 242494 211664 -17423 -266203 222105 -16320 150622
6823 -17056 32993 -87904 214647 -150587 -244738 66945 27338 -402081 207307 -33391 -290103
6812 -290103 433776 158966 13776 -114218 -81471 317177 49596 192417 -121324 49440
6801 -62251 13308 -65467 -204958 -123519 -119781 182543 92404 -220520 2704 339286 42168
6789 -222718 163199 -64503 -463212 233234 217570 76289 23230 25642 -304965 107064 186137
6778 186137 -154132 -176078 -27532 -85645 -58693 215533 -164493 106374 -228416 -43664 50859
6766 -6435 158497 -105744 170898 189023 12483 39444 -221835 107151 122845 232013 -89231
6754 10738 -274795 50316 177939 35538 316158 273259 8457 53646 146118 -181475 -106698
6743 -106698 224770 -81858 -260202 -19194 -23261 91553 131090 -116193 60658 -767 -292673
6732 -292673 -324061 -48121 152999 -152833 -147537 -80556 529631 -30897 -79402 -134546 -59524
6720 113847 48845 -293252 -172080 11436 -38661 259373 -309190 349478 -1988 366655 343232
6709 343232 15202 92691 -69193 -365980 107938 -145317 136447 63009 -288596 84885 52436
6698 52436 -96646 -238558 125050 -420899 -373384 372005 -121260 124858 -41607 7263 158722
6687 158722 84359 304617 75201 -175951 198539 15087 48500 35446 3358 180602 394938
6676 394938 -409871 79482 -26734 168371 -218323 60314 10779 -302828 -308815 -105004 -305929
6665 -305929 -111390 -137703 -67858 102949 -78913 -180359 161674 -6437 -107434 226384 -113733
6653 -93401 91478 -199946 -101424 -11168 24905 132870 -22317 -154239 -46378 -67950 52009
6641 260954 68629 -231992 -115636 -27522 38795 -330440 60773 -246861 97802 142248 66627
6629 17301 -97759 229831 7292 85742 -255550 154474 -77035 -148976 -22264 -67056 125246
6617 204614 37324 38969 -156565 35495 85421 154535 20584 21708 254667 -35065 -282730
6606 -282730 387806 -55371 -15665 -170197 -9565 215668 -76475 7302 -42980 -385325 203790
6594 67575 -371228 -275486 -120425 178014 -36689 105676 232440 -18295 110357 -42040 63499
6582 -46595 -40408 149877 -381426 117643 -279008 15911 320299 198868 -263255 8439 329158
6571 329158 -213756 146783 -132367 31455 -28590 -425362 136577 103393 13161 -381368
6560 138612 417939 171986 -174363 -462725 -291827 47941 95554 -56524 249929 -172112
6549 152801 -36826 277398 -324997 510490 -397557 22860 -18812 228059 -322841 -311856
6539 -311856 -10679 349370 26559 123919 13898 118643 18185 -170029 -508495 -117368 139170
6527 -101769 -216334 52055 -339285 154879 -125837 276506 -184327 -109775 177715 285534
6517 285534 164304 388931 -234203 -156902 -206066 35708 178854 -161538 -272066 215517
6506 -19639 137596 -20695 145025 -171889 157008 172042 161059 -247682 95611 68048 -5729
6494 102818 -155553 -209232 17911 -88450 537 -114807 -38351 -55655 -24059 233915 -234713
6482 215209 59012 50187 170625 -223769 -255897 -220340 151330 -359724 -104451 -383428 323024
6470 -20806 74067 -231389 -11244 -273935 100847 88514 59022 -12125 -104298 -212168 -320115
6459 -320115 102015 -591657 53437 59954 92720 42945 98029 -348439 -219637 -11704 -108900
6448 -108900 -21850 -22074 396312 186779 -133626 52557 -210421 -134299 128824 -71760 -212675
6437 -212675 430247 141152 -389726 -11626 -291025 115442 -55771 -208503 25590 211977
6427 211977 -132583 -85629 -120450 -87537 -108658 197920 -111877 175193 -88055 -34425 43868
6415 -117229 -2949 76752 -90089 -104849 -96444 -87974 -252593 239351 390587 -136271 -159447
6404 -159447 -112527 290102 -113054 379432 -204107 -259158 158123 -26341 211913 237432
6394 237432 228845 -128170 -42313 428879 -147712 -194597 -34415 170029 -103524 14044 -66853
6382 -428140 69758 -109271 4845 62320 -33323 -93470 -98199 49115 -126719 149230 67173
6370 -393236 -67708 -49653 102018 111707 9595 243608 135299 -222803 18479 355942 -32265
6358 -45265 -109679 -179912 -254968 -241471 -64340 -228315 -30603 9197 -11327 -283007 -54968 106596
6345 -298314 -260574 -15019 94907 235417 -228624 145856 -261706 -253383 362986 258371 -142985
6333 -35003 78034 458684 148703 28807 4511 147567 145081 30461 38178 7280 122194 59188
6320 84372 -164059 -2652 -336987 -132871 -340976 375685 -192877 -97067 -11809 227682 -209625
6308 3195 -256205 13473 -46326 164587 -36853 82219 389684 -112149 -235343 6902 -174124
6296 -71131 -315447 -8784 56908 -135341 -137203 -16742 25299 63708 170382 -411288 -252212
6285 -252212 227221 -130599 14466 121576 -48336 71594 -86746 -142842 -64283 74408 -397112
6273 -187308 277535 176213 -24812 -123078 -66643 82056 108388 -245014 -75930 -197772 -119764
6262 -119764 -47430 55841 -93442 -20528 -61656 43360 94040 -64893 276599 -138056 -24188
6250 -209666 6374 -319492 62203 -81959 -365879 25441 -162955 127276 -200058 230368 266565
6239 266565 -33363 401245 66591 114336 -5316 228384 61020 303594 -129564 -179345 -18725
6227 138186 -150191 60121 -258157 94689 222655 -54088 96341 165645 138414 -80087 -335721
6216 -335721 -63535 206732 -150240 -158023 48182 25442 132054 168657 -124374 -80922 -358608
6205 -358608 220696 73928 1024 -37572 190890 -79871 -245153 -90283 -12273 41922 -323720
6193 -17220 -56583 -43808 223643 241208 65779 104970 -59673 -105090 -23941 139557 32987
6181 -28832 165874 209086 -10856 -108912 114783 -417045 -48452 -28215 85610 14787 -74505
6169 -214646 267222 -173181 10184 -243699 206278 -32244 129155 -261263 -186403 111000
6158 -231298 -149012 22824 -89893 -127 545465 7551 245191 76700 32261 32239 16183 -102296
6145 79307 160221 -39534 67205 250036 154183 124749 -2880 -21497 -544389 30953 -15716 31660
6132 -29991 211619 -238412 -277179 28505 96113 -265337 60633 -128011 359579 -263480 50547
6120 3918 -63467 335811 80241 140619 34310 -48759 -275277 -35110 -15652 -157078 30800
6108 -247920 144512 120601 54184 -55571 -220733 -9944 340672 -141144 12684 -128079 77331
6096 -105308 -67694 178183 -107992 13226 -346617 107570 -10811 -61838 -122684 207882 -92641
6084 189050 -108431 167652 -92825 -55381 341034 131070 -49824 21507 -172005 227044
6073 -93243 -209275 -282559 -42948 25649 89748 -130164 212613 142970 293332 216046 -92492
6061 49506 111153 199672 267733 -143438 231017 93518 -352943 210012 -54368 -72313 -108818
6050 -108818 -88569 64317 318389 -376631 131986 -260472 -212399 44533 -30733 -275214 12971
6038 126301 -116730 265108 62285 -5366 146007 86697 85350 -86323 -277698 195900 243066
6027 243066 105052 34206 13544 131879 -330436 -316893 -151515 44901 -62591 -106162 238421
6015 53349 60127 -80048 -64327 -80299 47834 38131 -49083 201764 -163404 -56198 27548 -272637
6002 227273 294871 107938 17226 -231486 -122296 191205 -49170 41913 -307885 193270
5991 237597 -52885 -210248 -209677 -84699 51027 -175809 156282 -356103 320534 -57333 161573
5979 123225 -232107 55903 29010 133787 45177 37816 2139 234258 62058 185335 133005
5968 133005 -73802 -112547 70844 1429 -325367 137953 305235 22243 24216 -229029 -27407
5956 -260383 157149 -232984 179079 83707 -8760 15203 -147115 25256 114440 159320 106099
5945 106099 -50947 300398 -210212 125011 454613 -35007 -43719 -169534 22289 338775 -104673
5933 -71014 165354 -1861 152075 -175338 -10221 159213 152409 -175453 -350206 70 51146 -168040
5920 8809 15293 -211413 -38723 78842 -135707 135663 48844 -491596 177694 196099 155404
5909 155404 -142133 -330478 146403 -277791 76418 -54795 172371 -333904 202431 -22722
5898 -244133 232785 -8676 268414 13529 -59171 464610 163073 74232 -58338 182924 -528483
5886 -267625 -60768 -356910 -1113 -162754 53136 -1446 -178092 -218598 -137292 -182051 -176339 152736
5873 -43657 55734 95821 -277397 -207858 168157 -390060 162668 -110691 61917 199933 298823
5862 298823 7286 27494 -150635 5082 -38013 195282 42680 325815 -14445 260733 -75509
5850 -256909 249759 76576 -121923 125251 -295353 -85045 -75089 -157585 -28288 164863 -50621
5838 -6897 134080 -225375 -77182 196306 271317 -326198 446094 105596 83440 18624 289195
5827 289195 -217062 115596 317582 171028 -290293 50620 -377730 -91436 15062 41490
5817 41490 -143366 -365130 78737 123546 -75386 138100 -211353 -75737 -212678 140521 44215
5805 62993 -293827 132754 -55659 -185148 -81409 6302 108435 -113684 -157278 192165 221926
5794 221926 75051 -207534 53923 -233993 106806 -30639 -68134 -114170 162770 153848 -148156
5782 -103188 282053 106454 -21058 79644 151967 -17349 126077 -157230 125946 163495 251355
5771 251355 39524 161148 -231159 105092 -93918 -181009 173759 282972 631246 115779
5760 130047 288877 -97358 -14196 -208462 504326 -32991 -109092 126985 -382611 44263 -28005
5748 -159596 -296156 94655 83597 93577 87537 103462 -163229 -201730 -285032 29597 -287500
5736 40458 -381947 -63027 271559 -146352 119242 -7155 -44590 144983 -78374 -154395 239836
5724 17080 175229 -100644 220835 65210 90291 -260650 -13548 203300 -257734 28572 134349
5713 134349 70271 -36481 -170501 -135200 -75486 -76678 -192655 253205 55648 64653 -284115
5701 1273 -173365 -155095 186296 214179 -274494 -298523 156301 -67930 -267327 -76577 -169806
5690 -169806 -173914 156523 -202365 -120193 -174867 133889 -84244 -28036 143672 -319924 167621
5678 200957 -33462 -19862 401641 191018 -13303 251155 132625 -78869 76573 -135692 51358
5666 -76991 170822 154655 143628 -204239 -106408 128760 64334 -41208 190962 41126 -502924
5654 -55208 13497 -51678 73869 -440759 161655 -95767 205625 172388 339673 -67214 284462
5642 94303 -111037 -29416 81978 -198145 4103 -100134 -171232 428817 49040 -150209 -110910
5631 -110910 -69308 -13075 -104023 -14426 -184665 84993 -56310 -145793 -49503 71172 260775
5620 260775 -70002 -59575 -15943 277956 33489 17897 49883 74936 -324951 13866 172982
5609 172982 86843 -58420 238123 -95777 296653 -124907 63731 25643 -104672 -312904 64684
5597 54131 -347394 129818 141195 -80928 -14073 123485 -144164 -372795 46646 244730 33453
5585 -173372 -37258 125183 -43407 -53489 237165 -253964 -324342 -118976 113654 -130088
5574 -228291 -33065 78750 39705 -111730 186848 -424785 81177 -342230 -4446 -174592 76395
5562 116049 -221042 238532 199167 393002 937 -25668 142538 -50058 200910 -119811 54750
5550 -102591 -223339 27892 253523 80003 -9972 154414 -44959 325020 27600 -136064 99446
5538 -23337 -259189 -126368 -325613 -75301 433147 357355 -171097 33769 59123 114839 -151922
5526 -134971 -6599 -158292 79994 -109468 16292 -74715 108754 258103 -259463 -146032 -526253
5515 -526253 -36023 29869 113921 14559 9471 -201701 -159347 126667 17146 -146422 -18981
5503 28935 59341 -2601 -171813 -6729 20239 -208046 -147297 -48557 20924 -284869 -85808 -5804
5490 23329 -49882 -82287 27875 204062 -161814 -210409 -225511 -53743 -101263 230702 14111
5478 27363 -300863 -26632 23571 20614 -112629 19012 229788 -104988 -103908 207920 -358026
5466 211685 25543 327391 22520 273348 -76132 -6294 -129559 -276999 137740 -376221 115089
5454 442736 -23410 79324 -113455 110440 13692 -98492 49470 -26225 265213 -44749 260255
5442 42800 -68603 58968 -132301 92853 7210 112005 283919 -45376 153511 -65932 -146451
5431 -146451 -35602 -105709 81334 -53947 1970 -108405 -349747 148395 23741 -92941 83145
5419 -48300 -12761 45724 45912 24978 -223418 -63197 -42398 -33189 169428 44312 161188 -60899
5406 347518 128805 -145263 29848 -135447 97451 -160816 -45812 -253618 464826 -6196 -48641
5395 -48641 215840 -147333 105920 -132049 -235764 -89999 248884 139661 30761 391719
5385 391719 168413 -529683 85126 -157252 -65609 -262132 123223 -70680 -80458 101231 106422
5374 106422 -229794 169695 89424 210544 -286155 -157233 350446 -185605 -42452 -57937
5364 -57937 270522 36793 296771 -10180 143500 -62757 65214 -124171 22716 -277069 113529
5352 46170 -223660 -1307 273357 289786 -240339 287901 125133 59597 -130573 -9631 102043
5340 242037 -89982 -107384 -107016 17864 -50872 -220872 -14738 -112300 -28860 -145225 -352321
5329 -352321 99696 43119 158832 -258656 163112 117842 272492 13408 -332847 276738
5318 108602 -210426 53742 -84561 -238998 -171602 136037 8174 -59569 222445 148392 -270512
5306 37457 -226727 49229 136885 -125144 -81386 171799 -135376 48890 -281284 149562 -132314
5294 -105563 -281932 -7857 -138509 -194554 523484 -218530 175116 100477 242015 86640 295806
5283 295806 -219306 -292527 -599566 -25898 -318280 -212448 204701 -13228 -133887 -52631
5272 -169631 257001 104333 -373656 -68933 204551 -179804 -51596 63823 -102127 285332
5261 -104332 134036 -112331 -144008 18232 -128086 -65390 -61035 -57058 64615 -177488 9817
5249 34238 94726 -354231 104358 -181174 -28322 -195609 206449 -67822 155704 62671 -81075
5237 135455 91330 -106097 -153213 125334 -31255 -118607 -112538 29522 19626 361549 98188
5225 65754 71734 90096 252023 300269 -56630 -33626 -113870 140435 -206699 59697 -92022
5213 236270 -36041 210037 183354 110885 -148436 -257682 224801 29494 92207 -104018 -60543
5202 -60543 -16293 -121916 143687 -64831 151233 -102902 167872 -22024 212811 85838 224329
5191 224329 279313 38718 24904 63202 -314789 226452 53635 182709 -52310 9586 276497
5180 276497 97316 -266197 241036 -94058 7145 -342256 -301614 -46037 -73259 225218 -48148
5168 12165 -141121 -46285 -37446 -118204 -216150 359467 -17862 35209 130722 -352027 98706
5156 90327 232990 273267 430539 -90435 -120353 -80077 38396 -185609 25939 231718 282287
5145 282287 -423443 -292002 295601 -234343 -126252 -179490 -125583 105295 -33103 -43655
5135 -43655 79953 230900 369750 223322 -120927 -21285 -163068 -273970 159427 -44954
5124 215303 -131478 294834 -55303 -241918 59395 -23622 -112883 -117418 -142574 102203 -96212
5112 -270070 -266023 76023 375674 -121064 -153403 -29678 -10344 -49559 -12540 82831 -59576
5100 -108029 -63056 -356408 58907 183737 230441 212106 -45112 -8333 172824 -28667 -139699
5089 -139699 97252 -107550 49392 -19116 153725 43123 -255524 139927 285145 138895
5078 -107900 -10947 -7988 41201 -35159 7475 -118348 304322 146627 301669 200903 105795
5067 105795 -165390 339074 -167797 227020 304891 -270257 -129632 -341866 -393133 -52303
5056 51893 -5708 -36982 276700 -188622 -85448 -158424 68799 62636 -317328 194979 -206498
5044 234092 161098 -24847 -34265 94502 -177629 -110437 171144 88655 26230 -52076 34027
5032 50845 -15561 -331201 -174685 37970 155001 -150418 106226 21523 97776 23262 -24543
5020 -153072 192264 -54747 -220538 40898 -190522 103677 161731 -340824 -122627 420289
5009 -163922 -108874 -106259 285214 -156627 186096 108799 1154 -91054 -53255 16252 124899
4998 124899 264351 42353 294653 -15638 16844 -73809 10276 -398528 -35564 168002 -50605
4986 317850 -143825 -188167 54693 135400 -30677 -130438 -231596 -131345 -154459 -46310 -35718
4975 -35718 -394810 164632 111567 -25821 -68164 -101522 -69326 -3766 260043 732 -205729 -147502
4963 -147502 -17706 -73009 -97786 -212177 185109 101733 43801 -388414 -88807 -47994 20328
4951 4752 -305446 109840 308832 10041 15217 -68306 263348 -173323 -183979 -265664 200214
4939 224561 371563 -184930 26605 -139692 62129 -120991 376545 -207803 -110787 324188
4928 70301 318290 62394 35532 -174477 -144929 -291446 79176 105121 -264983 71254 -21419
4916 55811 -97182 -41206 251262 433995 15971 -167483 44994 -405924 122343 -117286 191088
4904 -9154 254883 -120308 75529 93344 338715 -116617 -156027 112507 66986 208809 -28155
4892 -256965 21752 -11074 36206 170204 115137 62030 -89358 79145 83411 -168274 -37295
4880 228017 -29621 202302 231387 87313 441400 10600 232810 38674 337251 -219055 -208612
4869 -208612 -114627 -83199 -40994 234449 100110 3371 -128607 -204933 260596 -87377 189108
4857 -189969 -78595 97767 278528 -505892 -178501 -156967 264940 -280741 59024 -375348
4846 -13756 -246618 217410 170322 -332023 391498 -141435 465966 -314747 25474 -239106
4835 -46540 -76182 -230888 -162871 -78740 200306 10152 -48516 140378 -87462 93717 154542
4824 154542 -183588 122248 -168713 130772 -139767 -135212 111596 29312 92207 -109586
4813 -32971 185374 408838 -257423 78426 -134095 374477 58256 258322 12607 97612 -274039
4801 17376 -10499 -32492 173660 171879 307530 -36806 -36375 -173266 -255706 -56244 -10668 -438145
4789 -438145 -30267 -66903 71502 192845 286607 -13322 184171 -135928 97506 -155303 53657
4777 -296274 211214 347961 -9546 -211900 97888 91695 188479 -130634 198161 42495 139075
4766 139075 11392 101178 -215820 311213 -39574 -275001 -17868 -11194 -208846 -107228 70312
4754 183451 33766 293407 142397 228228 34043 -105173 -83603 -161742 -23766 -212983 168738
4742 -61634 -20458 -89654 -58407 -77729 2838 -117311 104448 167218 93971 -78973 46505 -158987
4729 -105285 -319636 44289 93859 -100266 -128118 -428472 149359 245817 -253 -84829 317345
4717 19131 -71074 65430 -183247 -203467 -142555 -302010 -135914 -232457 257962 -155626 217391
4705 -18282 -39948 -75070 -102084 64929 -192970 896 -31945 -56975 153515 -197076 -55452 -53972
4693 -53972 271711 -235503 -68089 -392637 -192242 37095 32406 56718 -150043 119091 436211
4682 436211 -201035 38308 123924 -118914 -45331 -237217 130427 -76141 -174677 37380 -166481
4670 -352626 -11606 -169537 207771 87199 -117129 -8918 52441 -67552 -45950 -123336 21696
4658 -26562 -147121 -235758 -216697 304199 -31517 -184607 -39170 211008 5445 28324 -101675
4646 -173538 -27130 12481 -240501 54217 58650 200370 11968 180828 162884 160610 -190695
4634 -177789 -83363 145917 -39481 130171 385516 1354 468825 -226964 -77390 98733 91936
4623 91936 -25222 174753 -172756 66570 220289 110751 145148 213423 -21005 -186656 -39859
4611 50531 -227679 107546 230883 -139795 183327 10106 54422 397000 162866 67134
4600 -153146 181792 -162682 -128743 106170 35001 56965 109410 -74026 -76545 -198452 -189744
4589 -189744 307006 -91077 48361 37249 -185668 -174212 33359 347781 44227 267312 -64872
4577 -128459 63565 121175 -27126 136315 85380 -424879 149204 -75061 115955 143581 146726
4566 146726 115127 239305 215473 -22526 247569 -103748 51852 35594 95510 -127249 80895
4554 80112 155806 -122616 -130950 -166939 -29706 -34222 -109388 21295 -40305 -257802 -171432 99822
4541 -156076 206852 -265246 167489 267034 55681 407259 56143 -286088 -204721 113447
$$ [...]
##END NTUPLES=NMR SPECTRUM
##END=
