
##TITLE=UV1218_M5_1296-1170_50_7229502_twBE4QybZ5
##JCAMPDX= 6.0         $$ Bruker NMR JCAMP-DX V2.0
##DATA TYPE= NMR SPECTRUM
##DATA CLASS= NTUPLES
##ORIGIN= BRUKER
##OWNER= Administrator
$$ 1.72 TOPSPIN		Version 2.1
$$ 2013-01-23 21:05:41.674 -0500  Administrator@X
$$ Compression mode = diff/dup
##.OBSERVE FREQUENCY= 400.02188249412
##.OBSERVE NUCLEUS= ^1H
##.ACQUISITION MODE= SIMULTANEOUS (DQD)
##.ACQUISITION SCHEME= undefined
##.AVERAGES= 64
##.DIGITISER RES= 22
##SPECTROMETER/DATA SYSTEM= spect
##.PULSE SEQUENCE= noesygpps1d.comp
##.SOLVENT NAME= COFFEE_meoh
##.SHIFT REFERENCE= INTERNAL, COFFEE_meoh, 1, 14.96104
##AUDIT TRAIL= $$ (NUMBER, WHEN, WHO, WHERE, PROCESS, VERSION, WHAT)
$$ ##TITLE= Audit trail, TOPSPIN		Version 2.1
$$ ##JCAMPDX= 5.01
$$ ##ORIGIN= Bruker BioSpin GmbH
$$ ##OWNER= Administrator
$$ $$ E:\/data/COFFEE/nmr/UV1218_M5_1296-1170_50_7229502_twBE4QybZ5/32/pdata/1/auditp.txt
$$ ##AUDIT TRAIL=  $$ (NUMBER, WHEN, WHO, WHERE, PROCESS, VERSION, WHAT)
(   1,<2013-01-23 21:05:35.908 -0500>,<Administrator>,<X>,<go>,<TOPSPIN 2.1>,
      <created by zg
	started at 2013-01-23 20:54:06.065 -0500,
	POWCHK enabled, PULCHK disabled,
       configuration hash MD5:
       86 BA 57 50 F2 9D 5C 9B 26 00 A9 28 5F 66 2E 89
       data hash MD5: 64K
       DE 9D 2F 88 B6 46 05 5D C9 81 84 81 38 B1 B0 4A>)
(   2,<2013-01-23 21:05:38.971 -0500>,<Administrator>,<X>,<proc1d>,<TOPSPIN 2.1>,
      <Start of raw data processing
       efp LB = 0.3 FT_mod = 6 PKNL = 1 PHC0 = 0 PHC1 = 0 SI = 128K 
       data hash MD5: 128K
       69 79 A1 71 BC 85 D6 39 CF 33 D2 90 EC B0 94 ED>)
(   3,<2013-01-23 21:05:40.002 -0500>,<Administrator>,<X>,<proc1d>,<TOPSPIN 2.1>,
      <pk PHC0 = -78.14026 PHC1 = 0 
       data hash MD5: 128K
       B8 30 1B D2 BE 1A 4A 30 CD 22 A0 89 2B D3 A3 8C>)
(   4,<2013-01-23 21:05:40.674 -0500>,<Administrator>,<X>,<proc1d>,<TOPSPIN 2.1>,
      <abs ABSG = 1 
       data hash MD5: 128K
       EB CB 8E 43 5B CC 16 C2 2A EF 48 D4 4C 2E F8 CE>)
(   5,<2013-01-23 21:05:40.830 -0500>,<Administrator>,<X>,<proc1d>,<TOPSPIN 2.1>,
      <abs ABSG = 2 
       data hash MD5: 128K
       ED 73 D2 54 04 A4 EB 2E CC FF AE 48 E5 AC 9A E2>)
(   6,<2013-01-23 21:05:41.002 -0500>,<Administrator>,<X>,<proc1d>,<TOPSPIN 2.1>,
      <abs ABSG = 3 
       data hash MD5: 128K
       CF C4 5A 0B F4 99 32 7E 30 5B AC AA 06 F5 5B 73>)
(   7,<2013-01-23 21:05:41.174 -0500>,<Administrator>,<X>,<proc1d>,<TOPSPIN 2.1>,
      <abs ABSG = 4 
       data hash MD5: 128K
       7B 6A BC DA 83 1A 14 10 27 16 30 60 14 47 35 AF>)
(   8,<2013-01-23 21:05:41.361 -0500>,<Administrator>,<X>,<proc1d>,<TOPSPIN 2.1>,
      <abs ABSG = 5 
       data hash MD5: 128K
       26 BC 75 E9 42 F7 26 E2 3E 13 FF F6 2D A6 FA 52>)
$$ ##END=
$$ 
$$ $$ hash MD5
$$ $$ 48 6A 00 D9 CF A0 95 37 DA 0A 15 8B 36 58 DC 44
##$RELAX= 
##$RELAX= 
##$RELAX= 
##$RELAX= 
##$RELAX= 
##$RELAX= 
##$RELAX= 
##$RELAX= 
$$ Bruker specific parameters
$$ --------------------------
##$DU= <E:\>
##$EXPNO= 32
$$ [...]
##$TP07= 0
##$TPNAME0= <>
##$TPNAME1= <>
##$TPNAME2= <>
##$TPNAME3= <>
##$TPNAME4= <>
##$TPNAME5= <>
##$TPNAME6= <>
##$TPNAME7= <>
##$TPOAL= (0..7)
0.5 0.5 0.5 0.5 0.5 0.5 0.5 0.5
##$TPOFFS= (0..7)
0 0 0 0 0 0 0 0
##$TUNHIN= 0
##$TUNHOUT= 0
##$TUNXOUT= 0
##$USERA1= <user>
##$USERA2= <user>
##$USERA3= <user>
##$USERA4= <user>
##$USERA5= <user>
##$V9= 5
##$VALIST= <valist>
##$VCLIST= <CCCCCCCCCCCCCCC>
##$VD= 0
##$VDLIST= <DDDDDDDDDDDDDDD>
##$VPLIST= <PPPPPPPPPPPPPPP>
##$VTLIST= <TTTTTTTTTTTTTTT>
##$WBST= 1024
##$WBSW= 4
##$XGAIN= (0..3)
0 0 0 0
##$XL= 0
##$YL= 0
##$YMAX_a= 6454240
##$YMIN_a= -12991832
##$ZGOPTNS= <>
##$ZL1= 120
##$ZL2= 120
##$ZL3= 120
##$ZL4= 120
##$ABSF1= 14.96104
##$ABSF2= -5.597142
##$ABSG= 5
##$ABSL= 3
##$ALPHA= 0
##$AQORDER= 0
##$ASSFAC= 0
##$ASSFACI= 0
##$ASSFACX= 0
##$ASSWID= 0
##$AUNMP= <proc_prof1d_extract.lims>
##$AXLEFT= 0
##$AXNAME= <>
##$AXNUC= <1H>
##$AXRIGHT= 0
##$AXTYPE= 0
##$AXUNIT= <>
##$AZFE= 0.1
##$AZFW= 0.1
##$BCFW= 0
##$BC_mod= 0
##$BYTORDP= 0
##$COROFFS= 0
##$CY= 15
##$DATMOD= 1
##$DC= 0
##$DFILT= <>
##$DTYPP= 0
##$F1P= 0
##$F2P= 0
##$FCOR= 0.5
##$FTSIZE= 131072
##$FT_mod= 6
##$GAMMA= 0
##$GB= 0
##$INTBC= 1
##$INTSCL= 1
##$ISEN= 128
##$LB= 0.3
##$LEV0= 0
##$LPBIN= 0
##$MAXI= 10000
##$MC2= 0
##$MEAN= 0
##$ME_mod= 0
##$MI= 0
##$NCOEF= 0
##$NC_proc= -2
##$NLEV= 6
##$NOISF1= 0
##$NOISF2= 0
##$NSP= 0
##$NTH_PI= 0
##$NZP= 0
##$OFFSET= 14.96104
##$PC= 1
##$PHC0= -78.14026
##$PHC1= 0
##$PH_mod= 1
##$PKNL= yes
##$PPARMOD= 0
##$PPDIAG= 0
##$PPIPTYP= 0
##$PPMPNUM= 2147483647
##$PPRESOL= 1
##$PSCAL= 4
##$PSIGN= 0
##$PYNMP= <proc.py>
##$REVERSE= no
##$SF= 400.020009620558
##$SI= 131072
##$SIGF1= 0
##$SIGF2= 0
##$SINO= 400
##$SIOLD= 131072
##$SPECTYP= <>
##$SREGLST= <1H.CDCl3>
##$SSB= 0
##$STSI= 131072
##$STSR= 0
##$SW_p= 8223.68421052631
##$SYMM= 0
##$S_DEV= 0
##$TDeff= 65536
##$TDoff= 0
##$TI= <>
##$TILT= no
##$TM1= 0
##$TM2= 0
##$TOPLEV= 0
##$USERP1= <user>
##$USERP2= <user>
##$USERP3= <user>
##$USERP4= <user>
##$USERP5= <user>
##$WDW= 1
##$XDIM= 131072
##$YMAX_p= 452533494
##$YMIN_p= -11713
##$CURPLOT= <Network HP LaserJet P1505>
##$CURPRIN= <$Network HP LaserJet P1505>
##$DFORMAT= <normdp>
##$LAYOUT= <+/1D_H.xwp>
##$LFORMAT= <normlp>
##$PFORMAT= <normpl>
##$SURQMSG= 1
$$ End of Bruker specific parameters
$$ ---------------------------------
##NTUPLES= NMR SPECTRUM
##VAR_NAME=  FREQUENCY,     SPECTRUM/REAL,   SPECTRUM/IMAG
##SYMBOL=    X,             R,               I
##VAR_TYPE=  INDEPENDENT,   DEPENDENT,       DEPENDENT
##VAR_FORM=  AFFN,          ASDF,            ASDF
##VAR_DIM=   131072,        131072,          131072
##UNITS=     HZ,            ARBITRARY UNITS, ARBITRARY UNITS
##FACTOR=    0.0627417313425164, 1,          1
##FIRST=     8223.62146879497, -1628,        -57109
##LAST=      0,             -709,            -57920
##MIN=       0,             -11713,          0
##MAX=       8223.62146879497, 452533494,    0
$$ Real data points
##PAGE= N=1
##DATA TABLE= (X++(R..R)), XYDATA
$$ [...]
61608D57962k143l430n216o553p106p107o830o459o101n675n120m674m528m359
61594C82661l814l307l510m099l990k961k034j943k170j964j485j336j593j879
61580C46576k006k059k109k208k420k647k641k275j570o23J60J30p91j635j503
61565C22379q26o02p69m87J61K19l62m59L30R89Q89Q11J404J894J423N02J37L18
61547C27951N16Q36J507J949J559Q65P32Q79M18n07q33k44M98Q89J292K053K871
61530C43231L344L418L135K472J584P01k22j305k222k466k101j745j698j651j334
61515C43141r38p68q17q64p06k68K53M07q8r10j395j259q09m93m51n25n30n09
61497C32471o90j102j270o67M78J264J190P08L91J00n73j415j712j117N5J207
$$ y = [457962, 455819, 452389, 447173, 440620, 433514, 426407, 419577, 413118, 407017, 401342, 396222, 391548, 387020, 382661, 378847, 375540, 372030, 367931, 363941, 360980, 358946, 357003, 354833, 352869, 351384, 350048, 348455, 346576, 344570, 342511, 340402, 338194, 335774, 333127, 330486, 328211, 326641, 326018, 326178, 326308, 325517, 323882, 322379, 321553, 320951, 320182, 319695, 319856, 320075, 319713, 319254, 319584, 320573, 321462, 322273, 323677, 325571, 326994, 327496, 327633, 327951, 328467, 329303, 330810, 332759, 334318, 335183, 335915, 336794, 337212, 336705, 335872, 335628, 336126, 337015, 338307, 340360, 343231, 346575, 349993, 353128, 355600, 357184, 357885, 357663, 356358, 354136, 351670, 349569, 347824, 346126, 344475, 343141, 342203, 341435, 340618, 339754, 339048, 338780, 339033, 339440, 339352, 338442, 337047, 335788, 334979, 334486, 334035, 333510, 332980, 332471, 331781, 330679, 329409, 328742, 329220, 330484, 331674, 332382, 332773, 332873, 332300, 330885, 329173, 328056, 328111, 329318]
61481C29318J802J601R82P40J190J666J395N41q0o9L32Q61J380J526Q96k64j106
61464C42711j080m29K44N90N63K91l1k62m23n10l03M05J423K293K698K601K093
61447C52874J339N82l6n50q88p14K17J665L073L990M176L685L062L109L977M769
61431C84330M480L197J910J342J385J633J860J957J832J551J354J393J583J696
61417D11503J564J238J046J278J805K178K195K022J698R65k16j414k191k441k171
61402D19059j465q89j182k179k765k380j766j661j615j009l78n50j064q03J38
61387C99491O24L78L21R25J571J830K109K576K613J920J249J331J811J836J116
61372D21701Mq72p04R16L092M023K991J232L50M75P48Q25J042J521K041K532K942
$$ y = [329318, 331120, 332721, 333703, 334443, 335633, 337299, 338694, 339235, 339155, 339086, 339418, 340279, 341659, 343185, 344081, 343817, 342711, 341631, 341202, 341446, 342036, 342599, 342890, 342859, 342597, 342174, 341664, 341361, 341766, 343189, 345482, 348180, 350781, 352874, 354213, 354795, 354759, 354209, 353321, 352607, 352824, 354489, 357562, 361552, 365728, 369413, 372475, 375584, 379561, 384330, 388810, 392007, 393917, 395259, 396644, 398277, 400137, 402094, 403926, 405477, 406831, 408224, 409807, 411503, 413067, 414305, 415351, 416629, 418434, 420612, 422807, 424829, 426527, 427492, 427276, 425862, 423671, 421230, 419059, 417594, 416705, 415523, 413344, 410579, 408199, 406433, 404772, 403157, 402148, 401770, 401220, 400156, 399353, 399491, 400115, 400493, 400814, 401739, 403310, 405140, 407249, 409825, 412438, 414358, 415607, 416938, 418749, 420585, 421701, 421705, 420833, 420129, 421045, 424137, 428160, 431151, 432383, 432733, 433208, 433956, 434781, 435823, 437344, 439385, 441917, 444859]
61355D44859K947K493K408L557N544P032P403P411Q081R566J1195J2125J1895
61342E36516J0801R764R407R272Q458O858N207L938K763J489M19l76j371k711
61328F00434l657l635l322l897n386o527o294m909l297k089j401j025n90K21J293
61313E55919K090K269K075K031K403L124M021M973N986P218Q816J0605J2164J3274
61299F36968J4075J4604J4442J3065J0365O640K338j912n309p383q401q971r356
61286F71165r456r258q837q123p070n997n240m581l544k193j056k51O33J658K282
61271F10132K349K627L797N380O286O148N547N110M935M830M654M405M325M921
61257F75446O532Q885J1326J3477J5316J6582J6466J4282J0354N970K214j003
$$ y = [444859, 447806, 450299, 452707, 456264, 461808, 468840, 476243, 483654, 491735, 501301, 512496, 524621, 536516, 547317, 557081, 566488, 575760, 584218, 591076, 596283, 600221, 602984, 604473, 604892, 604516, 603145, 600434, 596777, 593142, 589820, 585923, 580537, 574010, 567716, 562807, 559510, 557421, 556020, 554995, 554405, 554626, 555919, 558009, 560278, 562353, 564384, 566787, 569911, 573932, 578905, 584891, 592109, 600925, 611530, 623694, 636968, 651043, 665647, 680089, 693154, 703519, 710159, 712497, 710585, 705276, 697893, 689492, 680521, 671165, 661709, 652451, 643614, 635491, 628421, 622424, 617184, 612603, 609059, 606866, 605810, 605559, 606192, 607850, 610132, 612481, 615108, 618905, 624285, 630571, 636719, 642266, 647376, 652311, 657141, 661795, 666200, 670525, 675446, 681978, 690863, 702189, 715666, 730982, 747564, 764030, 778312, 788666, 794636, 796850, 795847]
61245G95847m439q081j0704j1241j0239r347r462j0031j0214r879r187p898n823
61232F79302l560k082j627j481r09P8R78J506J897K531L458M405N248O170P155
61217G03069P566O757M964L200K238K133K652L614M671N302N328N037M718M410
61203G65659M101L722K969J771R26J397K866L949M237N060P614J1186J4203J6366
61189H46026J8691K1628K4144K4777K2951J9207J4609J0074O029K635J80j057
61177A009894j368j557k123k937l828m906o181p479q925j0812j2778j3990j4376
61164I18634j4790j5551j5900j5504j5349j6290j7694j8413j8251j7486j5922
61153G37484j3523j1193r669q345o371m182k683j557J83K449M274N322N732M950
$$ y = [795847, 791408, 783327, 772623, 761382, 751143, 741796, 732334, 722303, 712089, 702210, 693023, 685125, 679302, 675742, 673660, 672033, 670552, 669643, 669721, 670699, 672205, 674102, 676633, 680091, 684496, 689744, 695914, 703069, 710635, 717392, 722356, 725556, 727794, 729927, 732579, 736193, 740864, 746166, 751494, 756531, 761249, 765659, 769760, 773482, 776451, 778222, 779148, 780545, 783411, 787360, 791597, 796657, 804271, 815457, 829660, 846026, 864717, 886345, 910489, 935266, 958217, 977424, 992033, 1002107, 1008136, 1010771, 1010951, 1009894, 1008526, 1006969, 1004846, 1001909, 998081, 993175, 986994, 979515, 970590, 959778, 947000, 933010, 918634, 903844, 888293, 872393, 856889, 841540, 825250, 807556, 789143, 770892, 753406, 737484, 723961, 712768, 703099, 694754, 688383, 684201, 681518, 679961, 680144, 682593, 686867, 692189, 697921, 702871]
61139G02871K267j623n099p458q977r468q479o700n449m694l201p84J315K492
61125F47013L540N057O726Q535J1028J3913J6092J7601J9761K2778K5089K5899
61113H23032K6495K7847K8798K8098K6705K6171K6074K4927K2767K0865J9446
61102A101225J7541J4941J2599J0990R424P160M052M7m904j0264j5122j9120k2462
61089A106107k5071k6522k6897k6889k6898k6681k6012k5127k4299k3427k2235
61078H26049k0560j8484j6363j4631j3273j1720r626p477n961n048m266l609l392
61065F91639l333k567p83J329K937L845M149L841L238L273M697P038R059J0189
61051G38551J0967J1942J2852J3313J3790J5110J7213J9183K0531K1720K3303
$$ y = [702871, 705138, 703515, 698416, 690958, 681981, 672513, 664034, 657334, 651885, 647191, 643990, 643206, 644521, 647013, 650553, 655610, 662336, 670871, 681899, 695812, 711904, 729505, 749266, 772044, 797133, 823032, 849527, 877374, 906172, 934270, 960975, 987146, 1013220, 1038147, 1060914, 1081779, 1101225, 1118766, 1133707, 1146306, 1157296, 1166720, 1173880, 1177932, 1177979, 1173075, 1162811, 1147689, 1128569, 1106107, 1081036, 1054514, 1027617, 1000728, 973830, 947149, 921137, 896010, 871711, 848284, 826049, 805489, 787005, 770642, 756011, 742738, 731018, 721392, 713915, 707954, 702906, 698640, 695031, 691639, 688306, 685739, 684956, 686285, 689222, 693067, 697216, 701057, 704295, 707568, 712265, 719303, 728362, 738551, 749518, 761460, 774312, 787625, 801415, 816525, 833738, 852921, 873452, 895172, 918475]
61040I18475K5191K7037K8676K9904L0512L0867L1716L3077L4083L4355L4613
61029A258506L5372L6090L6443L7339L9544M2331M4751M7324N0987N5185N8596
61018A742468O1010O2800O3426O2626O2626O6689P5541Q7372J01139J17233J34748
61007B637678J51091J65463J80496J99689K25482K60645L08821L72070M49814
60998D951249N41482O48644P74761R26590J117613J367281J695360K116294K626139
60989A6765413L166588L584696L654091L197609K240389J049749j62o31866p67807
60980C2258700m87370N5436O51685J031202R35682K71902p93752j916224k773960
60971B9233301l222515l297997l120527k807360k442970k081194j750347j459640
$$ y = [918475, 943666, 970703, 999379, 1029283, 1059795, 1090662, 1122378, 1155455, 1189538, 1223893, 1258506, 1293878, 1329968, 1366411, 1403750, 1443294, 1485625, 1530376, 1577700, 1628687, 1683872, 1742468, 1803478, 1866278, 1929704, 1992330, 2054956, 2121645, 2197186, 2284558, 2385697, 2502930, 2637678, 2788769, 2954232, 3134728, 3334417, 3559899, 3820544, 4129365, 4501435, 4951249, 5492731, 6141375, 6916136, 7842726, 8960339, 10327620, 12022980, 14139274, 16765413, 19932001, 23516697, 27170788, 30368397, 32608786, 33658535, 33658373, 33026507, 32258700, 31771330, 31826766, 32478451, 33509653, 34445335, 34717237, 33923485, 32007261, 29233301, 26010786, 22712789, 19592262, 16784902, 14341932, 12260738, 10510391, 9050751]
60963I050751j209770r99671q25772o81586n61847m64710l88446l28770k81153
60954C309026k43360k13958j90388j70203j52596j37221j22858j08513r4607q1971
60944A793351p0748o1240n4578n1473n1156n2296n3981n5193n4641n2098m8859
60933A187088m5968m2962l9192l5305l2305l0008k7499k4633k2067k0199j8868
60922H48082j7790j6670j5198j3467j2084j1481j1396j1290j0912j0248r439q857
60910F99250q681q338p033m991l351k651k264j591q99n96m80k86j90l23m26m01
60894F56749n78j066j471j583j647j699j342n63N6K53M99J152J967K764L730M699
60878F61920N054M850N041O048P057P357P437P929Q481Q584Q777R885J1645J3115
$$ y = [9050751, 7840981, 6841310, 6015538, 5333952, 4772105, 4307395, 3918949, 3590179, 3309026, 3065666, 2851708, 2661320, 2491117, 2338521, 2201300, 2078442, 1969929, 1875322, 1793351, 1722603, 1661363, 1606785, 1555312, 1504156, 1451860, 1397879, 1342686, 1288045, 1235947, 1187088, 1141120, 1098158, 1058966, 1023661, 991356, 961348, 933849, 909216, 887149, 866950, 848082, 830292, 813622, 798424, 784957, 772873, 761392, 749996, 738706, 727794, 717546, 708107, 699250, 690569, 682231, 675198, 670207, 666856, 664205, 661941, 660350, 659451, 658855, 658375, 658089, 657899, 657576, 657150, 656749, 656171, 655105, 653634, 652051, 650404, 648705, 647363, 646800, 646856, 647109, 647608, 648760, 650727, 653491, 657221, 661920, 666974, 671824, 676865, 682913, 689970, 697327, 704764, 712693, 721174, 729758, 738535, 748420, 760065, 773180]
60864G73180J4047J4905J5883J6862J8051J9715K1390K2244K2247K2229K2786
60853I83539K3646K4203K4122K3359K1963J9979J7437J4532J1806R774Q196O084
60841A188640K704j823o956j2275j7277k1332k4304k6746k9083l1035l2244l2798
60829I55471l2742l1664k9482k7070k5392k4347k3134k1450j9621j7904j6382
60818F86283j5320j4809j4209j2674j0388q571q032q192p758o217m378l441l636
60805E68658l972l448k233j239p69l37K30M20K6l44k46j09m41r78j356j885k904
60788E49073l851l875k991j866q29N5K73o91k283l204l019k657l141m448n784
60773E10762o402o011m972m323m994o673p874p469n882m419l745l380k637j624
$$ y = [773180, 787227, 802132, 818015, 834877, 852928, 872643, 894033, 916277, 938524, 960753, 983539, 1007185, 1031388, 1055510, 1078869, 1100832, 1120811, 1138248, 1152780, 1164586, 1174360, 1182556, 1188640, 1191344, 1189521, 1182565, 1170290, 1153013, 1131681, 1107377, 1080631, 1051548, 1020513, 988269, 955471, 922729, 891065, 861583, 834513, 809121, 784774, 761640, 740190, 720569, 702665, 686283, 670963, 656154, 641945, 629271, 618883, 610312, 602280, 594088, 586330, 580113, 575735, 572294, 568658, 564686, 561238, 559005, 557766, 556997, 556660, 556890, 557310, 557336, 556992, 556746, 556637, 556196, 555218, 553862, 551977, 549073, 545222, 541347, 538356, 536490, 535661, 535716, 535989, 535298, 533015, 529811, 526792, 524135, 520994, 516546, 510762, 504360, 498349, 493377, 489054, 484060, 477387, 469513, 462044, 456162, 451743, 447998, 444618, 441981, 440357]
60759D40357j084j437k181k423j840r34l65l43o53j000j087o24M31J726K763L324
60743D34630L605M000M624N002M351K471K27j205j519j301j055p25k13K43L78
60728D53513J54l87j081j512j460j495k410l995n146n385n402n736n879n265m362
60713D04152m024m309m641m695m489m004l321k821k667k465j887j251j003j008
60699C61567r18p24n41k80o3l41r85r85J90J508J683J049R98J847K487K171J442
60682C70105J125J296J642K089K655L235L867M776N955O984P463P381P008O636
60668D32217O404O141N496M392L228K376J823J505J579J954K039J538J042J181
60654D72915J612J616J394J730K480K464J087p24j575j109j83O6p98k233l349
$$ y = [440357, 439273, 437836, 435655, 433232, 431392, 430458, 430093, 429750, 429097, 428097, 427010, 426386, 426817, 428543, 431306, 434630, 438235, 442235, 446859, 451861, 456212, 458683, 458910, 457705, 456186, 454885, 453830, 453105, 452892, 453135, 453513, 453667, 453280, 452199, 450687, 449227, 447732, 445322, 441327, 436181, 430796, 425394, 419658, 413779, 408514, 404152, 400128, 395819, 391178, 386483, 381994, 377990, 374669, 371848, 369181, 366716, 364829, 363578, 362575, 361567, 360649, 359925, 359384, 359104, 359041, 358700, 357715, 356730, 356920, 358428, 360111, 361160, 362158, 364005, 366492, 368663, 370105, 371230, 372526, 374168, 376257, 378912, 382147, 386014, 390790, 396745, 403729, 411192, 418573, 425581, 432217, 438621, 444762, 450258, 454650, 457878, 460254, 462077, 463582, 465161, 467115, 469154, 470692, 471734, 472915, 474527, 476143, 477537, 479267, 481747, 484211, 485298, 484574, 482999, 481890, 481707, 481773, 480975, 478742, 475393]
60639D75393l962m759o161p503p888p416o766o012m832l667l416l926l913k773
60625D02399j393o84k92N22J462J581P52j27k88Q2L16J82J21N76J264J354N50
60608D08377l70m69J78P79J078J507K143K408K010J416J026O11j6l95r5N40R65
60591D21693J367K326L692M579M455L741L099K656K104J382Q39P76J005J070Q39
60576D55623P04J058J765K398K874L582M871O648Q571J0356J1864J3101J4326
60563E37741J6014J8514K1661K4656K6346K5859K3200J9131J4307Q728K292m402
60551G34047j0184j4228j6394j6776j5380j2453q710n009j884O43L038O017R950
60538F52677J4414J8600K2217K5712K9549L3580L7195L9706M0386L8497L3651
$$ y = [475393, 471431, 466672, 460511, 453008, 445120, 437704, 430938, 424926, 420094, 416427, 413011, 409085, 405172, 402399, 401006, 400322, 400030, 400552, 402014, 403595, 404347, 404220, 403932, 404014, 404330, 404512, 404633, 405209, 406473, 407827, 408377, 408007, 407538, 407716, 408495, 409573, 411080, 413223, 415631, 417641, 419057, 420083, 420694, 420678, 420283, 420188, 420728, 421693, 423060, 425386, 429078, 433657, 438112, 441853, 444952, 447608, 449712, 451094, 451933, 452709, 453714, 454784, 455623, 456327, 457385, 459150, 461548, 464422, 468004, 472875, 479523, 488094, 498450, 510314, 523415, 537741, 553755, 572269, 593930, 618586, 644932, 670791, 693991, 713122, 727429, 736157, 738449, 734047, 723863, 709635, 693241, 676465, 661085, 648632, 639922, 634913, 633029, 633672, 636710, 642727, 652677, 667091, 685691, 707908, 733620, 763169, 796749, 833944, 873650, 914036, 952533, 986184]
60527I86184K6122J6749O683k776j0450j5789j8991k0509k0515j9166j7159j5615
60515H94768j5137j5157j4508j2608r900p192m884k932j184O41L010O035Q962
60502H29914J0832J1878J3714J7829K4195L1633L9167M6640N4313O2351P0742
60491A213208P9275Q7426R4188R8143R7946R3228Q4944P4451O2211M7778L1040
60480B063838J2753o237k5550m4708o2677p8395r1190j00283j04671j04188j00139
60469A358553r4191q7007p8566o9365o0468n2637m6030m0485l5514l0394k5040
60458G38856k0453j7604j6154j4931j3450j2153j1357j0829j0326r813r149q182
60446E84455p167o564o465o574o572o127m969l449k514k482k422j480k18L38L36
$$ y = [986184, 1012306, 1029055, 1035738, 1032962, 1022512, 1006723, 987732, 967223, 946708, 927542, 910383, 894768, 879631, 864474, 849966, 837358, 827458, 820266, 815382, 812450, 811266, 811907, 814917, 820952, 829914, 840746, 852624, 866338, 884167, 908362, 939995, 979162, 1025802, 1080115, 1142466, 1213208, 1292483, 1379909, 1474097, 1572240, 1670186, 1763414, 1848358, 1922809, 1985020, 2032798, 2063838, 2076591, 2070354, 2044804, 2000096, 1937419, 1859024, 1767834, 1667551, 1562880, 1458692, 1358553, 1264362, 1177355, 1098789, 1029424, 968956, 916319, 870289, 829804, 794290, 763896, 738856, 718403, 700799, 684645, 669714, 656264, 644111, 632754, 621925, 611599, 601786, 592637, 584455, 577288, 570724, 564259, 557685, 551113, 544986, 540017, 536568, 534054, 531572, 529150, 527670, 527452, 527790, 528126]
60431E28126N80R42O20k65p59p24r75j769k435k711l064l493l282k317j347p49
60415E06378k01P8p41k333k876j364R03K011J686R38M23J51J98O59J290J870K458
60398E11528K901K658J614M74j81m85n60l9J112K150K621L040L781M198L689K841
60382E41342K545K629K450K180K449L071L243K749K086J632J497J930K996M078
60368E76877M502M480M656N019M977M326L385K365J375P66P91J086J221J470K296
60353F19592L451M449N613P604J0162J2421J4459J7342K1350K5223K7469K7657
60341G96792K6045K2771J7927J1878N005k435r879j6276k0673k2759k2745k1144
60329G64507j8780j6490j4541j2644j0676q995p901p158o310n206l998k937k230
$$ y = [528126, 528706, 529648, 530268, 530003, 529244, 528520, 527545, 525776, 523341, 520630, 517566, 514073, 510791, 508474, 507127, 506378, 506177, 506255, 505514, 503181, 500305, 498941, 499844, 501855, 503541, 504479, 504902, 505053, 505251, 505910, 507200, 509070, 511528, 514429, 517087, 518701, 519175, 518994, 518509, 517949, 517910, 519022, 521172, 523793, 526833, 530614, 534812, 538501, 541342, 543887, 546516, 548966, 551146, 553595, 556666, 559909, 562658, 564744, 566376, 567873, 569803, 572799, 576877, 581379, 585859, 590515, 595534, 600511, 604837, 608222, 610587, 611962, 612728, 613519, 614605, 615826, 617296, 619592, 623043, 627492, 633105, 640709, 650871, 663292, 677751, 695093, 716443, 741666, 769135, 796792, 822837, 845608, 863535, 875413, 880418, 877983, 868104, 851828, 831155, 808396, 785651, 764507, 745727, 729237, 714696, 702052, 691376, 682381, 674480, 667322, 661012, 655806, 651808, 648871, 646641]
60316F46641j918j749j441j107j054j124o60P80K937N262P495R676J1979J4775
60302F90492J8595K3736K9961L6729M3349M8760N1373M9747M3480L3295K0196
60291A089713M958j1385k6918l9228m6740m9484m8574m5241m0480l5193l0048
60280G21380k5219k0673j6728j3887j2181j1114j0287r587q781p573o242n509
60268E73599n449n174m108k873k346k375k197j640j141q86p20p57j236j824j851
60253E39022j252o27l11m5L42O26P23Q49R74P52K89K51Q47J320R23mn50m80l61
60234E43288n81q77p65J9J522L518N350O227N922M998M143L506K825J923Q14m35
60218E81397j544j908j108M31J735K381K828L481L998L963L736L969M551M740
$$ y = [646641, 644723, 642974, 641533, 640426, 639372, 638248, 637588, 638368, 641305, 646567, 654062, 663738, 675717, 690492, 709087, 732823, 762784, 799513, 842862, 891622, 942995, 992742, 1036222, 1069517, 1089713, 1094671, 1083286, 1056368, 1017140, 970400, 920916, 872342, 827101, 786621, 751428, 721380, 696161, 675488, 658760, 644873, 632692, 621578, 611291, 601704, 592923, 585350, 579108, 573599, 568150, 562976, 558868, 555995, 553649, 551274, 549077, 547437, 546296, 545410, 544690, 543933, 542697, 540873, 539022, 537770, 537143, 536832, 536787, 537129, 537755, 538478, 539327, 540301, 541053, 541342, 541593, 542440, 543760, 544683, 544679, 544129, 543649, 543288, 542707, 541830, 541065, 541084, 542606, 546124, 551474, 557701, 563623, 568621, 572764, 576270, 579095, 581018, 581832, 581397, 579853, 577945, 576837, 577268, 579003, 581384, 584212, 587693, 591691, 595654, 599390, 603359, 607910, 612650]
60204F12650M321L851L723L708L595L640L984M193L813L042K361J873J335O59
60190F56748J7m84q58j143j384j594j665j504j354j639k378l024l115k672j892
60175F32059q52J94P30N58K16M06J299K580L836M584M341L126J664O72J18m85
60159F55046j325k239l150m061m756m894m462l751k987k135j048L13J745K857
60145F25153L464L899M625N505N962N903N929O389O911P185P558Q324R049R191
60131G15047Q954Q734Q171O525L819Q89j590l522m924n692n836n459m519l011
60117G17586j370k05L42O14Q72J079J230J484J928K445K833K955K868K916L338
60102G40915L676L024J186q28j914k135k345k930l507l723l696l625l460l035
$$ y = [612650, 616971, 620822, 624545, 628253, 631848, 635488, 639472, 643665, 647478, 650520, 652881, 654754, 656089, 656748, 656765, 656281, 655423, 654280, 652896, 651302, 649637, 648133, 646779, 645140, 642762, 639738, 636623, 633951, 632059, 631207, 631401, 632131, 632689, 632905, 633311, 634610, 637190, 641026, 645610, 649951, 653077, 654741, 655413, 655531, 655046, 653721, 651482, 648332, 644271, 639515, 634621, 630159, 626408, 623421, 621286, 620238, 620551, 622296, 625153, 628617, 632516, 637141, 642646, 648608, 654511, 660440, 666829, 673740, 680925, 688483, 696807, 705856, 715047, 724001, 732735, 740906, 747431, 751250, 752139, 750549, 747027, 742103, 736411, 730575, 725116, 720597, 717586, 716216, 716011, 716353, 716967, 717839, 718918, 720148, 721632, 723560, 726005, 728838, 731793, 734661, 737577, 740915, 744591, 747615, 748801, 747973, 746059, 743924, 741579, 738649, 735142, 731419, 727723, 724098, 720638, 717603]
60088G17603k329j528r37o54k99N93J825K618K551J973J312O04o1l71m78j179
60072G21243k820m688n998o842p606q164q382q669r170r159q142o873o320o222
60058F22188n856n524n977o772o714n745m988m925m887m410l891l624l376l022
60044E52477k593j591N49L156M669M569L898L550L237K574K043K098K260J791
60030E82687O98n29j631k533l111l346l402l395l538m298n725o799o497n410n042
60015E28129n479n238l821k739l103l689k714m01J600K589L137L530L505L344
60001E18650L837M884N287M401L052K386K437K385J761Q39j0p50j404j733j575
59986E44447j245j242j472j228j67J075J627J420J001N86o8r63j640j730j272
$$ y = [717603, 715274, 713746, 712809, 712155, 711856, 712449, 714274, 716892, 719443, 721416, 722728, 723332, 723271, 722900, 722422, 721243, 718423, 713735, 707737, 700895, 693289, 685125, 676743, 668074, 658904, 649745, 641603, 634730, 628410, 622188, 616332, 610808, 604831, 598059, 591345, 585600, 580612, 575687, 570800, 566390, 562499, 558875, 555499, 552477, 549884, 548293, 548842, 551998, 556667, 561236, 565134, 568684, 571921, 574495, 576538, 578636, 580896, 582687, 583385, 582856, 581225, 578692, 575581, 572235, 568833, 565438, 561900, 557602, 551877, 545078, 538581, 533171, 528129, 522650, 517412, 513591, 510852, 507749, 504060, 501346, 500945, 502545, 505134, 508271, 511801, 515306, 518650, 522487, 527371, 532658, 537059, 540111, 542497, 544934, 547319, 549080, 549919, 549909, 549159, 547755, 546022, 544447, 543202, 541960, 540488, 539260, 539093, 540168, 541795, 543215, 544216, 544802, 544734, 543771, 542131, 540401, 539129]
59971E39129n61j1n0o14r64n20L24Q60J210K043L338M388M995N697O732P675Q209
59954E81880Q371P944O547M517K758J542L46r43j742j859j804j776j435j094j811
59939F01441l737n558o232o200o103n595m399l437l637m403m448l528k291j022
59925E40851K88J129R64K59%L20O29Q03J323K289L264M052M908N886O671P099
59909E80735P350P688Q356R520J0825J1288J0110P466M197J076j292k438k527
59896F52354k477k988l722l945l522k761j836r64n67o04k56R51K228K575K198
59881F36664J992K128K228K532L608N090N867N604M973M373L391J766o8j644k952
59866F75552m024m719n036n075m687l749k789k573l029l322l029k519k095j575
$$ y = [539129, 538568, 538557, 538507, 537893, 536929, 536409, 536733, 537593, 538803, 540846, 544184, 548572, 553567, 559264, 565996, 573671, 581880, 590251, 598195, 604742, 609259, 612017, 613559, 613905, 612962, 611220, 609361, 607557, 605781, 604346, 603252, 601441, 597704, 592146, 585914, 579714, 573611, 568016, 563617, 560180, 556543, 552140, 547692, 544164, 541873, 540851, 541139, 542268, 543232, 543491, 543491, 543811, 544440, 545243, 546566, 548855, 552119, 556171, 561079, 566965, 573636, 580735, 588085, 595773, 604129, 613649, 624474, 635762, 645872, 653338, 657535, 658611, 657319, 654881, 652354, 649877, 646889, 643167, 639222, 635700, 632939, 631103, 630139, 629572, 628968, 628712, 629663, 631891, 634466, 636664, 638656, 640784, 643012, 645544, 649152, 654242, 660109, 665713, 670686, 675059, 678450, 680216, 680148, 678504, 675552, 671528, 666809, 661773, 656698, 652011, 648262, 645473, 642900, 639871, 636549, 633520, 631001, 628906, 627331]
59852F27331q89l16J71J049K436L730M386M562M789N502P062R638J2771J5470
59838F97692J6940J6847J4829J0596M875l90l444m008k901q61J663L801M148J724
59824G61511l036q427j2625j4860j5601j5738j5752j5555j4797j3185j0810q316
59812F12809o454n232l902k109n63r5m81q45q27o43l02K82O09m0j444k584l038
59795E85141l367l908m128l640l019k945l188l136k918l221m130m866m722l859
59781E34094k998k594k470k155j514r06p07q53j065j325j756k144j996j157k0
59766E10434R53J561J713J320N58j07l16l0O52J602K516L032L237L637M440N144
59750E40346N164M636M264M454M934N249N352N486N651N423M457L044J897J409
$$ y = [627331, 626442, 626126, 626297, 627346, 629782, 633512, 637898, 642460, 647249, 652751, 659813, 669451, 682222, 697692, 714632, 731479, 746308, 756904, 761779, 761389, 757945, 753937, 751036, 750175, 751838, 755639, 759787, 761511, 758475, 750048, 737423, 722563, 706962, 691224, 675472, 659917, 645120, 631935, 621125, 612809, 606355, 601123, 597221, 595112, 594549, 594454, 593973, 593128, 592301, 591658, 591356, 591638, 592247, 592207, 590763, 588179, 585141, 581774, 577866, 573738, 570098, 567079, 564134, 560946, 557810, 554892, 551671, 547541, 542675, 537953, 534094, 531096, 528502, 526032, 523877, 522363, 521457, 520750, 519897, 518832, 517507, 515751, 513607, 511611, 510454, 510434, 511387, 512948, 514661, 515981, 516539, 516432, 516116, 516086, 516738, 518340, 520856, 523888, 527125, 530762, 535202, 540346, 545510, 550146, 554410, 558864, 563798, 569047, 574399, 579885, 585536, 590959, 595416, 598460, 600357, 601766]
59736F01766J335J258J078Q43M43j74p20q84p86q00j001j162j187j185j122q30
59720E96872m09k90o78j176j175n65J38L46Q0j18M0J04m48j263j440q18k40k34
59702E88726j87O51J925K718K848K821K851K794K889L605M640M965M033K378Q63
59687F28520o1k92L0L30J9o88r33m72r6m78j281j868k252k724l087k996k825l296
59669F05550m377n217n297n016m905m836m382l524k616j792r47j71K45L71P67
59654E63853J836L267M376M828M684M037K977J843J065O67K21o49j919l312m476
59639E83298n052m931m425l877l203k229j301r87j152j077n42n5J15L16O46N74
59623E56118j15q22j101j301j662j665j018n61j170k371l112l385l934m654m540
$$ y = [601766, 603101, 604359, 605437, 606280, 606723, 606549, 605829, 604945, 604159, 603359, 602358, 601196, 600009, 598824, 597702, 596872, 596463, 596173, 595495, 594319, 593144, 592579, 592717, 593063, 593143, 593025, 593065, 593169, 592721, 591458, 590018, 589200, 588960, 588726, 588539, 589190, 591115, 593833, 596681, 599502, 602353, 605147, 608036, 611641, 616281, 621246, 625279, 627657, 628520, 628459, 628167, 628197, 628527, 628546, 627858, 626925, 626453, 626357, 625879, 624598, 622730, 620478, 617754, 614667, 611671, 608846, 605550, 601173, 595956, 590659, 585643, 580738, 575902, 571520, 567996, 565380, 563588, 562641, 562470, 562715, 563086, 563853, 565689, 568956, 573332, 578160, 582844, 586881, 589858, 591701, 592766, 593433, 593654, 593005, 591086, 587774, 583298, 578246, 573315, 568890, 565013, 561810, 559581, 558280, 557293, 556141, 555064, 554522, 554467, 554582, 554898, 555544, 556118, 556003, 555181, 554080, 552779, 551117, 549452, 548434, 547873, 546703, 544332, 541220, 537835, 533901, 529247, 524707]
59608E24707l248j649o07j3P05J709K605K800K007O31n01j072j532k087k163j490
59592E20802r40j281j716r54O59J469Q86R2J34O40P20J35q86k060k876k835k176
59575E09813j732j753j675j208q77j130j650j899j697j055j22N08K01p05j101
59560D93918o03m5j13l67j62K59L37K54O58J646K586K862K386J583J115J429K394
59543E10137L570M754N936O880P395Q004R697J2965J7515K2624K6767K7090K1028
59530F84362R385l199j1796j4807j3777j0799p169l818j467l7J246K874M452N131
59516F40581M390K477K48j591l198n238p677r421r516q388p375p290p804q138
59502E72060p877p143o250n468n022n056n379n311m229k399q82k91k16j78m51
$$ y = [524707, 521459, 519810, 519203, 519190, 519895, 521604, 524209, 527009, 529016, 529647, 529146, 528074, 526542, 524455, 522292, 520802, 519862, 518581, 516865, 515911, 516570, 518039, 518925, 519017, 519151, 519791, 520511, 520646, 519760, 517700, 514824, 511989, 509813, 508081, 506328, 504653, 503445, 502568, 501438, 499788, 497889, 496192, 495137, 495015, 495523, 495724, 495019, 493918, 493315, 493270, 493157, 492790, 492628, 492887, 493224, 493478, 494136, 495782, 498368, 501230, 503616, 505199, 506314, 507743, 510137, 513707, 518461, 524397, 531277, 538672, 546676, 556373, 569338, 586853, 609477, 636244, 663334, 684362, 693747, 690548, 678752, 663945, 650168, 639369, 632200, 628382, 626915, 626878, 628124, 630998, 635450, 640581, 644971, 647448, 647696, 646105, 642907, 637669, 629992, 620571, 611055, 602667, 595292, 588002, 580198, 572060, 564183, 557040, 550790, 545322, 540300, 535244, 529865, 524554, 520325, 517926, 517044, 516753, 516537, 516359, 515908]
59487E15908j205j568p24N64Q26J50J08J396K857L363L264L342L457L105K488
59472E37331K194K383K858L494M048M090L591L041K673K164J434J082J577K696
59458E74656M031N360O270O322O005O525Q141R614J0012R998J0496J1052J0647
59445F79129R350P979O513M091M53l609p180r830j1333j1538j0662r272p927p002
59431F29162o689o801o806o200m733k332P18L568N464O715Q183R875J1003J1602
59417F52729J2797J5034J7304J8863K0420K2864K5991K9299L2396L3361K8421
59406I09479J5724j187j5728k4012k6730k6001k2637j6715q741N00R567J5226
59394H08745J3455L233j1341k3863l0443l1361k8953k5113k0775j6594j3256j1075
$$ y = [515908, 514703, 513135, 512411, 512975, 513801, 513951, 514059, 515455, 518312, 521675, 524939, 528281, 531738, 534843, 537331, 539525, 541908, 544766, 548260, 552308, 556398, 559989, 563030, 565703, 567867, 569301, 570383, 571960, 574656, 578687, 584047, 590317, 596639, 602644, 609169, 617310, 626924, 636936, 646934, 657430, 668482, 679129, 688479, 696458, 702971, 707062, 707515, 703906, 696726, 686896, 675563, 664025, 653363, 644091, 636164, 629162, 622473, 615672, 608866, 602666, 597933, 595601, 596319, 599887, 605351, 612066, 620249, 630124, 641127, 652729, 665526, 680560, 697864, 716727, 737147, 760011, 786002, 815301, 847697, 881058, 909479, 925203, 924016, 908288, 884276, 857546, 831545, 808908, 792193, 783452, 783952, 793519, 808745, 822200, 825433, 814092, 790229, 759786, 728425, 699472, 674359, 653584, 636990, 623734, 612659]
59382F12659r639q137o203m278l041k530j988o16J566L554M227L607L051L812
59368E96044N591P103P833Q339Q847Q761P929P267P392P616P151O455O426P003
59354F99757P569Q170R271J0730J2063J3359J4943J6430J7148J7260J7541J8173
59342H62414J8544J8171J7058J5396J3557J2063J0769Q524M499m55m738p920j0724
59329I57158j3447j5499j6518j6846j6824j6552j6334j6515j6792j6413j5127
59318G80291j3326j1380r514q019o895n632m122l292l769m437l634j592j75j98
59304G04306n11L9J181K217L212M453N728O801P896R211J0597J2093J4219J7361
59290G98803K1342K5505K8391K7443K0419P895o375j8131k5333k8276k8173k6229
$$ y = [612659, 603020, 594883, 588680, 584402, 581361, 578831, 576843, 576227, 577793, 581347, 585574, 589181, 592232, 596044, 601635, 608738, 616571, 624910, 633757, 642518, 650447, 657714, 665106, 672722, 679873, 686328, 692754, 699757, 707326, 715496, 724767, 735497, 747560, 760919, 775862, 792292, 809440, 826700, 844241, 862414, 880958, 899129, 916187, 931583, 945140, 957203, 967972, 976496, 980995, 980540, 975802, 967882, 957158, 943711, 928212, 911694, 894848, 878024, 861472, 845138, 828623, 811831, 795418, 780291, 766965, 755585, 746071, 738052, 731157, 725525, 721403, 718111, 714342, 709905, 706271, 704679, 704504, 704306, 703795, 703834, 705015, 707232, 710444, 714897, 720625, 727426, 735322, 744533, 755130, 767223, 781442, 798803, 820145, 845650, 874041, 901484, 921903, 929798, 923423, 905292, 879959, 851683, 823510, 797281]
59278G97281k3316j9695j5305j0528o171k522Q33L993O382P826R133J0881J2355
59265G71147J2480J1307R833Q608P254N237K466q02m141p070r327j1045j2401
59252G83546j3213j3219j2696j2321j2314j2004j0576q141n722m132l183k278
59240F73747j313n03L61J690L217M187M530M913N410N248M323L753M094M180K890
59225G20727R75k74j314l557o689q651q406p072o080n570n127m778m577m082k903
59210F52622j293J04P61M75k96m76N99K259L267L287K865K301J569J102J394J932
59194F72472J750J057J036J889K482K178J775K117K853L138K656J621N88M00J388
59179F99400K506K383J296P91J274J501Q27K93P37J421J542J755L062N163P025
$$ y = [797281, 773965, 754270, 738965, 728437, 722266, 719744, 720577, 724570, 730952, 738778, 747911, 758792, 771147, 783627, 794934, 804767, 813375, 820629, 825866, 828332, 827530, 823389, 816319, 806992, 795947, 783546, 770333, 757114, 744418, 732097, 719783, 707779, 697203, 689062, 683340, 679208, 676025, 673747, 672434, 671931, 672292, 673982, 677199, 681386, 685916, 690829, 696239, 701487, 705810, 709563, 713657, 717837, 720727, 721702, 721428, 720114, 716557, 709868, 701217, 692811, 685739, 679659, 674089, 668962, 664184, 659607, 655525, 652622, 651329, 651433, 652194, 652669, 652373, 651897, 652496, 654755, 658022, 661309, 664174, 666475, 668044, 669146, 670540, 672472, 674222, 675279, 676315, 678204, 680686, 682864, 684639, 686756, 689609, 692747, 695403, 697024, 697612, 698012, 699400, 701906, 704289, 705585, 706376, 707650, 709151, 709978, 710271, 711008, 712429, 713971, 715726, 718788, 723951, 730976]
59164G30976Q293R113R398R140Q774Q367P264N338L725L289L120J680j090l889
59150H03498n870p332q752j0018j0565r851p931n805m705m739m894m720m987o169
59136G07160p264p090n956m985m435l787l043k791l153l531l378k582j288R8J004
59121F54979J400K059L643N866P966R571J0593J0900J0731J0868J1637J2193J1588
59108G63994J0117Q789P928P113O174N337M552L581K624K074J673O79j090l072
59094H20473m781o249p428p808o989n378l963l325l018k134o53J85p26k891m838
59079G60477o012p102q439r276r086q557q518q724q507p949p543p227o524n373
59065F51640m120l036k379k496l252l754l334k459k038k178k237j868j335r46
$$ y = [730976, 739269, 748382, 757780, 766920, 775694, 784061, 791325, 796663, 800388, 803677, 806797, 808477, 807387, 803498, 797628, 790296, 781544, 771526, 760961, 751110, 743179, 737374, 732669, 727930, 723036, 718316, 713329, 707160, 699896, 692806, 686850, 681865, 677430, 673643, 670600, 667809, 664656, 661125, 657747, 655165, 653877, 653975, 654979, 656379, 658438, 662081, 667947, 675913, 685484, 696077, 706977, 717708, 728576, 740213, 752406, 763994, 774111, 782900, 790828, 797941, 804115, 809452, 814004, 817585, 820209, 822283, 823956, 824635, 823545, 820473, 815692, 809443, 802015, 794207, 787218, 781840, 777877, 774552, 771534, 769400, 768747, 768932, 768206, 765315, 760477, 754465, 747363, 738924, 729648, 720562, 712005, 703487, 694763, 686256, 678307, 670764, 663537, 657013, 651640, 647520, 644484, 642105, 639609, 636357, 632603, 629269, 626810, 624772, 622594, 620357, 618489, 617154, 616208]
59051F16208p49p43r20j140j226j110p73k26L71Q35J160J288Q76q7p13j75R79
59034F13855J418R70P12J065J267J011J160K200L436M466O004Q295J0166J0776
59020F66801J1033J2004J3140J3402J2982J2403J0951P796L796N17j926m289o169
59007G52441o431n354m399l932k948j125O15J840L240N119O630P101O985O892
58993G66674O651N756M119K043O8j118j365j545k615m277n485o089o856p836p975
58978G40150o655m604k842j582n42M44J559L157N334P714R797J1225J1759J1566
58964G86480J1397J1853J2578J2786J2458J2247J2241J1697J0054P460M255O11
58952I06117l167o640r698j2526j5050j6941j8058j8394j7718j5985j3914j2423
$$ y = [616208, 615459, 614716, 613796, 612656, 611430, 610320, 609547, 609321, 609692, 610527, 611687, 612975, 613851, 613764, 613051, 612876, 613855, 615273, 616243, 616955, 618020, 619287, 620298, 621458, 623658, 627094, 631560, 637564, 645859, 656025, 666801, 677834, 689838, 702978, 716380, 729362, 741765, 752716, 760512, 764308, 764825, 762899, 758610, 752441, 746010, 740656, 736257, 732325, 729377, 728252, 728867, 730707, 733947, 739066, 745696, 752797, 759782, 766674, 773325, 779081, 783200, 785243, 785311, 784193, 782828, 781283, 778668, 774391, 768906, 762817, 755961, 748125, 740150, 733495, 728891, 726049, 724467, 723925, 724369, 725928, 729085, 734419, 742133, 751930, 763155, 774914, 786480, 797877, 809730, 822308, 835094, 847552, 859799, 872040, 883737, 893791, 901251, 905506, 906117, 902950, 896310, 886612, 874086, 859036, 842095, 824037, 805643, 787925, 771940, 758026, 745603]
58940G45603j1494j0308q426o161l902j853n24n58j895l634m887n352n111m436
58926F77062l764l316k818k076j594j979k936l542l403k906k445k044j693j347
58912F41199q10o9M33M81O38J499K806M037N377P125Q701R429R876J1194J3233
58897G15149J4657J4845J4433J3948J3278J2659J2854J4018J5441J6817J8658
58886H76757K1068K3194K4395K5006K5336K4721K2273J8038J2947P964L570l35
58874A084934m198q174j1763j4479j6605j8586j9971j9852j8249j6092j3912j1621
58862I11432r587q634q750q936q807r237j0841j2808j3896j3880j3382j2860j2388
58849G67426j1900j1238j0211r011q139p709p274o575n991n999o599p468q245
$$ y = [745603, 734109, 723801, 715375, 709214, 705312, 703459, 702935, 702377, 700482, 696848, 691961, 686609, 681498, 677062, 673298, 669982, 667164, 665088, 663494, 661515, 658579, 655037, 651634, 648728, 646283, 644239, 642546, 641199, 640389, 640320, 640753, 641234, 641872, 643371, 646177, 650214, 655591, 662716, 671417, 680846, 690722, 701916, 715149, 729806, 744651, 759084, 773032, 786310, 798969, 811823, 825841, 841282, 858099, 876757, 897825, 921019, 945414, 970420, 995756, 1020477, 1042750, 1060788, 1073735, 1081699, 1085269, 1084934, 1080736, 1072562, 1060799, 1046320, 1029715, 1011129, 991158, 971306, 953057, 936965, 923053, 911432, 901845, 893211, 884461, 875525, 866718, 857481, 846640, 833832, 819936, 806056, 792674, 779814, 767426, 755526, 744288, 734077, 725066, 716927, 709218, 701944, 695369, 689378, 683379, 676780, 669312, 661067]
58836F61067q584q322p723p190o703n980n074m384m073l947l756l238k141p32
58822E89220J21J6k30L20J398K179K720L589M432M336L526L279M010M752M725
58807F28393M231L673K948K123J586J150Q2j565k747k976l051l642m211l964l115
58792F18915k601k984m116n292n539m399k582j191l06Q76K464L615L980M295N056
58777F10191N682N560N067M896M994M706L476J174j733m187n395n733o159o779
58763F15760o901o420n983n647m656k904j397p07m0J415L141L989L621K658J874
58748E97803J698K051K412K463K640L486M640N361N838O907Q467R417R304Q897
58734F71384Q898R190R564J0020J0166R475Q377P902Q056P805O851O069N850N569
$$ y = [661067, 652483, 644161, 636438, 629248, 622545, 616565, 611491, 607107, 603034, 599087, 595331, 592093, 589952, 589220, 589341, 589357, 589127, 589447, 590845, 593024, 595744, 599333, 603765, 608101, 611627, 614906, 618916, 623668, 628393, 632624, 636297, 639245, 641368, 642954, 644104, 644186, 642621, 639874, 636898, 633847, 630205, 625994, 622030, 618915, 616314, 613330, 609214, 603922, 598383, 593984, 591402, 590211, 589905, 590781, 593245, 596860, 600840, 605135, 610191, 615873, 621433, 626500, 631396, 636390, 641096, 644572, 645746, 644013, 639826, 634431, 628698, 622539, 615760, 608859, 602439, 596456, 590809, 586153, 583249, 581852, 581145, 581105, 582520, 585661, 589650, 593271, 595929, 597803, 599501, 601552, 603964, 606427, 609067, 612553, 617193, 622554, 628392, 635299, 643766, 653183, 662487, 671384, 680282, 689472, 699036, 709056, 719222, 728697, 737074, 744976, 753032, 760837, 767688, 773757, 779607, 785176]
58720G85176N103N255O151O699O449O519P741R278R963R830R365Q393O626M324
58706H86872J633j742n462q380j0211j2156j4989j7781j9520k0698k2121k3229
58694G32216k2998k1716k0510j9668j8538j6618j3902j0667p712o129o119o573
58682E61066o533o245o150n840m855l732l246l252l052k391j358N8J686L107M296
58667E23559N707P274Q350Q952J0011J1823J3355J3687J2955J1229P963L443n56
58654F37752k763l931n292o620p060o862o899p193p181o846o499n962n005m057
58640E55582l677l806m148m575m569l243o79J699K863L331L811L869K976J802
58626E51236J343J518J659J666J796K006K338L145M331N174N448N738O179O187
$$ y = [785176, 790279, 795534, 801685, 808384, 814833, 821352, 829093, 838371, 848334, 858164, 867529, 875922, 882548, 886872, 888505, 886763, 881301, 872921, 862710, 850554, 835565, 817784, 798264, 777566, 755445, 732216, 709218, 687502, 666992, 647324, 628786, 612168, 598266, 587599, 579887, 573758, 567639, 561066, 554533, 548288, 542138, 536298, 531443, 527711, 524465, 521213, 518161, 515770, 514412, 514470, 516156, 519263, 523559, 529266, 536540, 544890, 553842, 563853, 575676, 589031, 602718, 615673, 626902, 634865, 638308, 637752, 634989, 631058, 625766, 619146, 612086, 605224, 598325, 591132, 583951, 577105, 570606, 564644, 559639, 555582, 551905, 548099, 543951, 539376, 534807, 531564, 530885, 532584, 535447, 538778, 542589, 546458, 549434, 551236, 552579, 554097, 555756, 557422, 559218, 561224, 563562, 566707, 571038, 576212, 581660, 587398, 593577, 599764]
58612E99764N922O474P789Q136O609M565L378K475R16o56j270j421j965k529k537
58597F35650k610l305l707k959k078k447l538l794k865j310R07L914O779Q635
58583F27272J0142J2215J4131J4547J3572J2292J0962R225P352N792M336L047
58571G44885K961M469O132O758P370R448J2455J5025J7389K0472K3657K5621K6532
58558I23174K7277K7309K5439K2068J8502J4730R947M665K03l291o351q476q982
58545A046214q836r511j0682j1190j1415j2442j3666j3837j3805j5530j8641k0633
58533H86026k0467j9447j8522j7179j5233j3386j1710r541p088n314m097k370
58521G41672j10J623K488L023L247K801K251K362K541J785P43P16J149L34j767
$$ y = [599764, 605686, 612160, 619949, 628085, 634694, 639259, 642637, 645112, 646028, 645372, 644102, 642681, 640716, 638187, 635650, 633040, 629735, 626028, 623069, 620991, 618544, 615006, 611212, 608347, 607037, 607944, 611858, 618637, 627272, 637414, 649629, 663760, 678307, 691879, 704171, 715133, 724358, 731710, 737502, 741838, 744885, 747846, 752315, 758447, 765205, 772575, 782023, 794478, 809503, 826892, 847364, 871021, 896642, 923174, 950451, 977760, 1003199, 1025267, 1043769, 1058499, 1068446, 1073111, 1073314, 1070023, 1063672, 1055196, 1046214, 1037378, 1027867, 1017185, 1005995, 994580, 982138, 968472, 954635, 940830, 925300, 906659, 886026, 865559, 846112, 827590, 810411, 795178, 781792, 770082, 760541, 753453, 748139, 744042, 741672, 741562, 743185, 745673, 748696, 751943, 754744, 756995, 759357, 761898, 763683, 764426, 765142, 766291, 766625, 764858]
58506G64858l580m520n233n608m883l604l138l356l016k218k188k846k970k614
58492G15084k924l688l488k296j449j106j70J299K117K460L748N929P524Q442
58478G31482J0122J2585J4081J4104J4153J4901J5004J3416J0620P071K613k154
58466H57998o002q843j1389j3014j2350r915p727o179l932r21J302K477M037O256
58452G91798P766Q362R423J0957J1035Q880N821K640j321n707q653r543r741r825
58438H11892q752o407m301k950j293O86J515J175J569L209M315M085M052N256
58424H14051O906Q674J1392J4382J5218J3334J1023R734Q263N822L708K474M85
58411I25466l063o412q130r136j0362j1023j0675j0404j0510r586p279n278m242
$$ y = [764858, 761278, 756758, 751525, 745917, 741034, 737430, 734292, 730936, 727920, 725702, 723514, 720668, 717698, 715084, 712160, 708472, 704984, 702688, 701239, 700133, 699963, 701262, 703379, 705839, 709587, 715516, 723040, 731482, 741604, 754189, 768270, 782374, 796527, 811428, 826432, 839848, 850468, 857539, 860152, 857998, 851996, 843153, 831764, 818750, 806400, 796485, 788758, 782579, 778647, 777726, 779028, 781505, 785542, 791798, 799564, 807926, 817349, 828306, 839341, 848221, 854042, 856682, 855361, 849654, 841001, 831458, 821717, 811892, 803140, 796733, 792432, 789482, 788189, 788875, 790390, 791565, 793134, 796343, 800658, 804743, 808795, 814051, 820957, 829631, 841023, 855405, 870623, 883957, 894980, 904714, 912977, 918799, 922507, 924981, 925466, 922403, 915991, 907861, 898725, 888363, 877340, 866665, 856261, 845751, 836165, 828886, 823608, 819366]
58398H19366k573L16K453K626K400L067L428K485J626K129K897K629J874J367
58384H46090N88l87j13J588K666K073J495K370L785M755N940P555Q343Q137Q693
58369I03578J0395J1082R763Q507Q840R414R086R215J0757J2048J1740J1176J1737
58356A037338J2421J2115J1571J1195R638O542L938L072K669J967K393M374N768
58343A125001N487N378O583P411O986P415R945J2509J3469J4313J6152J7185J6305
58330A264139J5652J6783J7774J6823J5275J4296J2323Q656N875N575N484L859
58318A402514K886M359N946N389M596N822P430P360P234R097J1431J2349J3326
58305A499739J5841J7746J7048J6026J7410J9663K0086J9469J9705J9940J8985
$$ y = [819366, 816793, 817109, 819562, 822188, 824588, 827655, 831083, 833568, 835194, 837323, 840220, 842849, 844723, 846090, 846678, 846291, 846178, 847766, 850432, 852505, 854000, 856370, 860155, 864910, 870850, 878405, 886748, 894885, 903578, 913973, 925055, 934818, 943325, 952165, 961579, 970665, 979880, 990637, 1002685, 1014425, 1025601, 1037338, 1049759, 1061874, 1073445, 1084640, 1094278, 1100820, 1104758, 1107830, 1110499, 1112466, 1114859, 1119233, 1125001, 1130488, 1135866, 1142449, 1149860, 1156846, 1164261, 1174206, 1186715, 1200184, 1214497, 1230649, 1247834, 1264139, 1279791, 1296574, 1314348, 1331171, 1346446, 1360742, 1373065, 1381721, 1387596, 1393171, 1398655, 1402514, 1405400, 1409759, 1415705, 1421094, 1425690, 1431512, 1438942, 1446302, 1453536, 1462633, 1474064, 1486413, 1499739, 1515580, 1533326, 1550374, 1566400, 1583810, 1603473, 1623559, 1643028, 1662733, 1682673, 1701658]
58294A701658J8431J9569K0465J9731J9697K2075K4336K4182K3746K5388K7305
58283A946583K7498K7811K9877L1310L0382K9977L2374L4791L4759L5076L8319
58272B298757M1487M1552M1369M4307M7925M9004M9921N3791N8038N9288O0022
58261B845461O3808O8511P0726P2320P5960P8947P8205P6619P7666P8951P7771
58250C664945P7657Q2093Q7488Q9876R2653R9784J07544J11473J15243J23759
58240D652515J33715J40172J46119J55936J66076J72279J79238J92498K07668
58231F146216K18722K29932K47902K68851K86019L02653L25059L50085L72462
58222H747901L97008M30038M66542M99919N35915N82206O33392O82108P35427
$$ y = [1701658, 1720089, 1739658, 1760123, 1779854, 1799551, 1821626, 1845962, 1870144, 1893890, 1919278, 1946583, 1974081, 2001892, 2031769, 2063079, 2093461, 2123438, 2155812, 2190603, 2225362, 2260438, 2298757, 2340244, 2381796, 2423165, 2467472, 2515397, 2564401, 2614322, 2668113, 2726151, 2785439, 2845461, 2909269, 2977780, 3048506, 3120826, 3196786, 3275733, 3353938, 3430557, 3508223, 3587174, 3664945, 3742602, 3824695, 3912183, 4002059, 4094712, 4194496, 4302040, 4413513, 4528756, 4652515, 4786230, 4926402, 5072521, 5228457, 5394533, 5566812, 5746050, 5938548, 6146216, 6364938, 6594870, 6842772, 7111623, 7397642, 7700295, 8025354, 8375439, 8747901, 9144909, 9574947, 10041489, 10541408, 11077323, 11659529, 12292921, 12975029, 13710456]
58213A3710456Q03465Q81968R64129J058689J176935J313507J461195J632832
58205B3003176J846297K101183K394611K746212L181786L708901M337779N108288
58197D8428233O063399P214639Q569180J0172677J2096767J4424147J7295998
58190A24265040K0934457K5549912L1215661L7736381M4295844M8928337M8606421
58183C81532053M0704370K5134026N163045j4181290k8846736l7335428m0299091
58176C31870949l9241054l5620586l0596604k5051304j9722565j5357108j2619079
58169A53662649j1695090j2044843j2710950j2937835j2496451j1534691j0291425
58162F9951364q965040p697259o560471n564775m704833l984708l396004k908820
$$ y = [13710456, 14513921, 15395889, 16360018, 17418707, 18595642, 19909149, 21370344, 23003176, 24849473, 26950656, 29345267, 32091479, 35273265, 38982166, 43319945, 48428233, 54491632, 61706271, 70275451, 80448128, 92544895, 106969042, 124265040, 145199497, 170749409, 201965070, 239701451, 283997295, 332925632, 381532053, 422236423, 447370449, 452533494, 438352204, 409505468, 372170040, 331870949, 292629895, 257009309, 226412705, 201361401, 181638836, 166281728, 153662649, 141967559, 129922716, 117211766, 104273931, 91777480, 80242789, 69951364, 60986324, 53289065, 46728594, 41163819, 36458986, 32474278, 29078274, 26169454]
58154B6169454k498843k159055j878601j636502j423256j245533j103487r83909
58146A3240268q79466p94357p27453o68608o14552n70573n34287m94929m50817
58137G505226m10939l77667l43844l08328k78449k55268k31865k08231j92994
58128D897641j87986j84961j79839j76745j75771j70175j58641j48031j41070
58119C374422j32734j21344j11993j06332r9663r0705q4084q0849p6406p0005
58109B400307o6520o6598o4661n9067n4956n4543n3642n0311m8277m9055m8861
58098A783816m6070m3951m3611m1776l7933l6166l7465l7449l4090l0820k9655
58087A364830k8020k4678k2224k1494j9872j7237j7232k0499k2870k2363k1875
$$ y = [26169454, 23670611, 21511556, 19632955, 17996453, 16573197, 15327664, 14224177, 13240268, 12360802, 11566445, 10838992, 10170384, 9555832, 8985259, 8450972, 7956043, 7505226, 7094287, 6716620, 6372776, 6064448, 5785999, 5530731, 5298866, 5090635, 4897641, 4709655, 4524694, 4344855, 4168110, 3992339, 3822164, 3663523, 3515492, 3374422, 3241688, 3120344, 3008351, 2902019, 2802356, 2711651, 2627567, 2546718, 2470312, 2400307, 2333787, 2267189, 2202528, 2143461, 2088505, 2033962, 1980320, 1930009, 1881732, 1832677, 1783816, 1737746, 1693795, 1650184, 1608408, 1570475, 1534309, 1496844, 1459395, 1425305, 1394485, 1364830, 1336810, 1312132, 1289908, 1268414, 1248542, 1231305, 1214073, 1193574, 1170704, 1148341, 1126466]
58076A126466k2982k3210k1642k1144k2622k2798k0204j7897j7816j7682j5925
58065I02544j4575j4894j4866j3260j1803j1312j0086p822o780p511p842p377
58053G74416q337j0734j1531j0088r389j0439j0403q134o420o837p187o182n890
58040F62845p312q097o946o005o632p016o111n774o805p047n721n478p768j0067
58026E66066j0156r416r491r399q349p845q523q341o282m598m998n836n381m701
58012D62750m908m725l165j790j915k225j412n08n91o95QN17K49M15J423J640
57996D45068M41k45Q01J976J705Q21L97j04q88q05K21M11o31q41N81J388k5k115
57978D48156l265m323o044o962o041m751m393l928k562j737k360k752j637n62
$$ y = [1126466, 1103484, 1080274, 1058632, 1037488, 1014866, 992068, 971864, 953967, 936151, 918469, 902544, 887969, 873075, 858209, 844949, 833146, 821834, 811748, 803926, 797146, 789635, 781793, 774416, 766079, 755345, 743814, 733726, 724337, 713898, 703495, 695361, 688941, 682104, 674917, 668735, 662845, 655533, 647436, 640490, 634485, 627853, 620837, 614726, 608952, 602147, 595100, 589379, 583901, 576133, 566066, 555910, 546494, 537003, 527604, 519255, 511410, 502887, 494546, 488264, 483666, 478668, 472832, 467451, 462750, 457842, 453117, 449952, 448162, 446247, 444022, 442610, 442102, 441511, 440816, 440824, 441341, 441590, 442005, 443428, 445068, 445509, 445264, 446065, 448041, 449746, 450567, 450964, 450860, 449972, 449167, 449388, 449799, 449168, 448327, 448908, 450296, 450271, 448156, 444891, 440568, 434524, 427562, 421521, 416770, 412377, 408449, 405887, 404150, 401790, 399038, 397401, 396839]
57964C96839j007j592o58P58R98O51R10J156N78J98R36J525O17q06j267j169j338
57947C97329j029M23J859K251K654M160N759O216O300P102P999Q245Q704R986
57933D67958J0835J0379R982J0745J1237J0024Q335P739P077M577J252o56j312
57920E58172k587m880p209r417j1811j3505j3515j2758j2770j3276j2996j1895
57908D31553j0678r044o583m412l857m316m368m096m350m698m154l104k609k475
57894C62809j864j010n84j42J022K342K980L467M578N562N315M463M396N017N251
57879D03602M981M734M079K230m01k794m894p076q772r219q932q898q993q481
57865C51166p437o385n354m482m488n329n518m124k233j077j39J382K709K986
$$ y = [396839, 395832, 394240, 393582, 394340, 395338, 395989, 396899, 398055, 398633, 398831, 399767, 401292, 401909, 401103, 399836, 398667, 397329, 396300, 396723, 398582, 400833, 403487, 407647, 413406, 419622, 425922, 433024, 441023, 449268, 457972, 467958, 478793, 489172, 499154, 509899, 521136, 531160, 539495, 547234, 554311, 558888, 560140, 559484, 558172, 555585, 550705, 543496, 534079, 522268, 508763, 495248, 482490, 469720, 456444, 443448, 431553, 420875, 411831, 405248, 400836, 396979, 392663, 388295, 384199, 379849, 375151, 370997, 367893, 365284, 362809, 360945, 359935, 359351, 359209, 360231, 362573, 365553, 369020, 373598, 379160, 384475, 388938, 393334, 398351, 403602, 408583, 413317, 417396, 419626, 419225, 416431, 411537, 404461, 395689, 386470, 377538, 368640, 359647, 351166, 343729, 337344, 331990, 327508, 323020, 317691, 312173, 308049, 305816, 304739, 304600, 305982, 308691, 311677]
57851C11677L180M464N989O302N827N838O007N264M071L613L511K578J123K60
57837C69704l85j966l967m731m124l502l338k956k318k067j948j163j67j64r59
57822C35949j083K4J603L166M840O220O573O095N558M876L531K029J441J705J775
57807C84302J280N69l75j716k883l374l958n526p279p725o971o389o356o113n513
57792C21973n211n219m885m193l652l166k340j611j616j874j482o43m6O39K102
57777B88776L860N003N875P232Q404Q250P369P331Q096Q235P442O728O287N303
57763C84191L801K706J965O23j263k644l475m690o154o573n751n014n099n334
57749C47289n181m863m290l023j594j173j643j692j037q74j811l034l838m346
$$ y = [311677, 314857, 319321, 325310, 331612, 337439, 343277, 349284, 354548, 358619, 362232, 365743, 368321, 369444, 369704, 369319, 367353, 363386, 358655, 354531, 351029, 347691, 344735, 342417, 340350, 338402, 337239, 337072, 336908, 335949, 334866, 334890, 336493, 339659, 344499, 350719, 357292, 363387, 368945, 373821, 377352, 379381, 380822, 382527, 384302, 385582, 386151, 385776, 384060, 381177, 377803, 373845, 368319, 361040, 353315, 346344, 339955, 333599, 327486, 321973, 316762, 311543, 306658, 302465, 298813, 295647, 293307, 291696, 290080, 288206, 286724, 286081, 286035, 286674, 288776, 292636, 297639, 303514, 310746, 319150, 327400, 334769, 342100, 350196, 358431, 365873, 372601, 378888, 384191, 387992, 390698, 392663, 393286, 392023, 389379, 385904, 381214, 375060, 368487, 362736, 357722, 352623, 347289, 342108, 337245, 332955, 329932, 328338, 327165, 325522, 323830, 322793, 321919, 320108, 317074, 313236, 308890]
57735C08890m375l322j572m63l61k43L73N83k85j591k441k671k435j883j455j458
57719B85291j339n28K64p3j120j528j240j360j953j988j559j983l366m180l813
57704B59525l491l982m312l645k650k026j331k59M08J56k63j27J91K52M15Q29
57688B39690P74j17j011j098o36r8O87J880L062M051N346P212R231J1239J3783
57673B93995J7134K0873K4990L0364L7794M7425N9445P3940Q9071J00095J00971
57662H96097Q7172N7991J8027k3445n6665p6626q4341q3518p7346o8299n8616
57651E30431m9599m1385l4116k8435k4296k0555j6415j2389r272p139n795n182
57639B75853m854m116l085k659l019l246k752j971j312o23L9K70K46N49Q45J26
$$ y = [308890, 304515, 301193, 299621, 299158, 298797, 298554, 298927, 299510, 299225, 297634, 295193, 292522, 290087, 288204, 286749, 285291, 283952, 283424, 283688, 283615, 282495, 280967, 279727, 278367, 276414, 274426, 272867, 270884, 267518, 263338, 259525, 256034, 252052, 247740, 244095, 241445, 239419, 238088, 237829, 238237, 238393, 238130, 238003, 238194, 238446, 238861, 239690, 240464, 240347, 239336, 238238, 237602, 237504, 238191, 240071, 243133, 247184, 252530, 259742, 268973, 280212, 293995, 311129, 332002, 356992, 387356, 425150, 472575, 532020, 605960, 695031, 795126, 896097, 983269, 1041260, 1059287, 1035842, 979177, 902551, 818210, 734692, 657346, 589047, 530431, 480832, 439447, 405331, 376896, 352600, 332045, 315630, 303241, 293969, 286830, 281035, 275853, 270999, 266883, 263798, 261139, 258120, 254874, 252122, 250151, 248839, 248216, 248255, 248525, 248771, 249320, 250165, 250291]
57623B50291j498k696k948l096l480l218j946o39l6K06J97o35j919k070o70O31
57607B26474O26K82O99J117M93l95k01O50O22o03j957k609k558k089j636j736
57591B17179k299k499j985j425j339j365j297j672k599l201l019k761k843k571
57577A86304j670j187j605j687n90K60p70k786l590k871k208k412k722k475j932
57562A58059j415q69l64l8L46R43J245P86L2k33J4L75Q59J554K003J860J638J841
57544A68636J976J372M20n0j21m47r82j137q09l28L13J176J669J079l23j490j753
57527A69201j214l44K53R3n19o22R6P37N64R7J15L84L30K59Q15J717K082J740
57509A75784J397J676K567L465L437K056K37n80l75n45j567k171j573r21j341
$$ y = [250291, 248793, 246097, 243149, 240053, 236573, 233355, 231409, 230770, 230734, 230940, 231137, 230502, 228583, 226513, 225843, 226474, 227100, 227382, 228081, 229198, 229691, 229296, 229095, 229745, 230367, 229764, 227807, 225198, 222640, 220551, 218915, 217179, 214880, 212381, 210396, 208971, 207632, 206267, 204970, 203298, 200699, 197498, 194479, 191718, 188875, 186304, 184634, 183447, 181842, 180155, 179565, 179825, 179055, 176269, 172679, 169808, 167600, 165188, 162466, 159991, 158059, 156644, 155775, 155411, 155373, 155719, 156662, 157907, 158693, 158725, 158492, 158506, 158881, 159740, 161294, 163297, 165157, 166795, 168636, 170612, 171984, 172404, 172354, 172233, 171786, 170804, 169667, 168858, 168530, 168843, 170019, 171688, 172767, 172444, 170954, 169201, 167987, 167643, 167896, 167989, 167470, 166848, 166944, 167681, 168245, 168342, 168457, 168841, 169171, 169430, 170245, 171962, 174044, 175784, 177181, 178857, 181424, 184889, 188326, 190382, 190619, 190039, 189664, 189119, 187552, 185381, 183808, 182887, 181546]
57494A81546k043j894j444j733k214j827j175j597k673k735j540m93k99k34J24
57479A59769K27j64n25o28p87r25n81k6o8o42p76k25Q9m59j337j791j743j370
57461A48038o69K45R69J261J207R42N72L15K34K3m77q28n77J3L73M20M01L91M18
57442A53271O29Q12M52k46k39P65J571J333R76J527K113J328j94n12N82J226L75
57425A65769p59o02P46J997K243J514M34k98n03o38j074j473j376r45o02l42m0
57408A64051J24J63N16J091R31k40j075l54J112J678J181O35L33k04q04q08l47
57391A67983n8J79Q68J618J684J396J597K078K025J675J886K470K540K251K417
57376A92609K754K313J404J135J217L88r66r48P20J957J381N5o05p37r08q03j28
$$ y = [181546, 179503, 177609, 176165, 174432, 172218, 170391, 169216, 167619, 164946, 162211, 160671, 160178, 159879, 159645, 159769, 159996, 159832, 159307, 158679, 157892, 156967, 156386, 156360, 156292, 155650, 154874, 154649, 154738, 154279, 152942, 151151, 149408, 148038, 147369, 147614, 148583, 149844, 151051, 151993, 152565, 152880, 153114, 153137, 152660, 151832, 151255, 151268, 151641, 152061, 152462, 152853, 153271, 153900, 154712, 155164, 154918, 154679, 155444, 157015, 158348, 159324, 160851, 162964, 164292, 164098, 163586, 164168, 165394, 165769, 165010, 164408, 165154, 167151, 169394, 170908, 171342, 171044, 170541, 169903, 168829, 167356, 165980, 165035, 164433, 164091, 164051, 164175, 164338, 164854, 165945, 166876, 166636, 165561, 165207, 166319, 167997, 169178, 169813, 170146, 169942, 169138, 168330, 167983, 167925, 168104, 168972, 170590, 172274, 173670, 175267, 177345, 179370, 181045, 182931, 185401, 187941, 190192, 192609, 195363, 197676, 199080, 200215, 201432, 201820, 200854, 199906, 200626, 202583, 203964, 204019, 203414, 202677, 201769, 200966, 200838]
57359B00838N39P75J019J501J674J368J236J449J268N97N28J513K375K121J473
57344B20274J546K097K251J960J660J232M13l11k65M48J183J655J948K072K079
57329B40242K170K319K161J588R93P50R28J512K343K874K680K213K229K643K823
57314B70468K864L349M050M173L922M347N473O099N787N533N969O405O320O381
57300C41140P165Q124Q558Q598Q541Q265P952Q304R453J0634J1433J2230J2952
57287D63349J2798J1724J0836J0621J0206R192Q665R369J0297J0274R674R359
57275E86364R079Q394P984Q594R497R521Q925Q835R426J0084J0922J2637J4959
57262G15221J6572J6695J5849J4994J4614J4623J4650J4325J3638J2860J2103
$$ y = [200838, 201377, 202152, 203171, 204672, 206346, 207714, 208950, 210399, 211667, 212264, 212792, 214305, 216680, 218801, 220274, 221820, 223917, 226168, 228128, 229788, 231020, 231433, 231122, 230857, 231305, 232488, 234143, 236091, 238163, 240242, 242412, 244731, 246892, 248480, 249473, 250223, 251151, 252663, 255006, 257880, 260560, 262773, 265002, 267645, 270468, 273332, 276681, 280731, 284904, 288826, 293173, 298646, 304745, 310532, 316065, 322034, 328439, 334759, 341140, 348305, 356429, 364987, 373585, 382126, 390391, 398343, 406647, 416100, 426734, 438167, 450397, 463349, 476147, 487871, 498707, 509328, 519534, 528726, 537391, 546760, 557057, 567331, 577005, 586364, 595443, 603837, 611821, 620415, 629912, 639433, 648358, 657193, 666619, 676703, 687625, 700262, 715221, 731793, 748488, 764337, 779331, 793945, 808568, 823218, 837543, 851181, 864041, 876144]
57251H76144J1368J1029J1470J2156J1999J0935J0128J0270J0851J1512J2729
57240A000591J4485J5631J5564J5337J5977J6841J6818J6206J6043J6380J6554
57229A176427J6437J6274J5920J5420J5674J7235J9089J9864J9677J9611J9902
57218A371530K0027K0109K0766K1820K2536K2880K3377K3868K3646K2833K2428
57207A615820K2935K3932K4956K5887K6473K6501K6439K7007K8025K8544K8239
57196A904758K7854K8091K8701K8895K8214K6905K5689K5193K5347K5499K5336
57185B200482K5254K5624K6185K6492K6420K5896K4841K3758K3607K4508K5373
57174B478440K5399K5092K5139K5246K4975K4807K5258K5841K5988K6181K6886
$$ y = [876144, 887512, 898541, 910011, 922167, 934166, 945101, 955229, 965499, 976350, 987862, 1000591, 1015076, 1030707, 1046271, 1061608, 1077585, 1094426, 1111244, 1127450, 1143493, 1159873, 1176427, 1192864, 1209138, 1225058, 1240478, 1256152, 1273387, 1292476, 1312340, 1332017, 1351628, 1371530, 1391557, 1411666, 1432432, 1454252, 1476788, 1499668, 1523045, 1546913, 1570559, 1593392, 1615820, 1638755, 1662687, 1687643, 1713530, 1740003, 1766504, 1792943, 1819950, 1847975, 1876519, 1904758, 1932612, 1960703, 1989404, 2018299, 2046513, 2073418, 2099107, 2124300, 2149647, 2175146, 2200482, 2225736, 2251360, 2277545, 2304037, 2330457, 2356353, 2381194, 2404952, 2428559, 2453067, 2478440, 2503839, 2528931, 2554070, 2579316, 2604291, 2629098, 2654356, 2680197, 2706185, 2732366, 2759252]
57163B759252K7179K5923K3722K2138K1445K0702J9773J9513J9989K0264K0161
57152C000061K0644K2011K3113K2978K2056K1187K0337J9142J7933J7409J7682
57141C224553J8221J8573J8735J8977J9494K0060K0132J9383J7977J6110J3655
57130C425870J0683P959O368O186P410J0321J5008K0670K6303L1803L7560M3147
57118C649288M7452N0118N2060N4514N8303O4109P2524Q3555R6542J10823J26086
57107D465374J42281J59792J79758K03591K32263K66692L08902L62070M29309
57098F750032N12937O15156P38689Q86275J059682J259325J483973J729987J990846
57089A7026902K257880K521517K771049K992682L168453L278243L303222L227311
$$ y = [2759252, 2786431, 2812354, 2836076, 2858214, 2879659, 2900361, 2920134, 2939647, 2959636, 2979900, 3000061, 3020705, 3042716, 3065829, 3088807, 3110863, 3132050, 3152387, 3171529, 3189462, 3206871, 3224553, 3242774, 3261347, 3280082, 3299059, 3318553, 3338613, 3358745, 3378128, 3396105, 3412215, 3425870, 3436553, 3444512, 3450880, 3457066, 3464476, 3474797, 3489805, 3510475, 3536778, 3568581, 3606141, 3649288, 3696740, 3746858, 3798918, 3853432, 3911735, 3975844, 4048368, 4131923, 4228465, 4339288, 4465374, 4607655, 4767447, 4947205, 5150796, 5383059, 5649751, 5958653, 6320723, 6750032, 7262969, 7878125, 8616814, 9503089, 10562771, 11822096, 13306069, 15036056, 17026902, 19284782, 21806299, 24577348, 27570030, 30738483, 34016726, 37319948, 40547259]
57081D0547259L037036K724074K291293J756033J145847M91359j75888q21920
57073E0995093j413248j925121k346042k673442k907108l048036l100772l073731
57065C0507593k977752k826100k634575k418843k191333j961584j738269j528834
57057A2230303j337565j165888j014292q82502p68560o69875n85204n14092m54761
57048D837564m04420l61440l25375k94904k67681k42508k19868j99907j81443
57039B340018j63548j46643j31477j17988j05697r4322q3707p3905o5375n8287
57029A299069n1736m4544l6636k8715k0839j2378k993P599K0640L7977O1006R0468
57017A318918J24954J56613J69621J48328R0502J1752o4368j20475j51234j60230
$$ y = [40547259, 43584295, 46308369, 48599662, 50355695, 51501542, 51992901, 51817013, 50995093, 49581845, 47656724, 45310682, 42637240, 39730132, 36682096, 33581324, 30507593, 27529841, 24703741, 22069166, 19650323, 17458990, 15497406, 13759137, 12230303, 10892738, 9726850, 8712558, 7830056, 7061496, 6391621, 5806417, 5292325, 4837564, 4433144, 4071704, 3746329, 3451425, 3183744, 2941236, 2721368, 2521461, 2340018, 2176470, 2029827, 1898350, 1780362, 1674665, 1580343, 1496636, 1422731, 1357356, 1299069, 1247333, 1202789, 1166153, 1137438, 1116599, 1104221, 1101228, 1108827, 1129467, 1167444, 1228450, 1318918, 1443872, 1600485, 1770106, 1918434, 2008936, 2020688, 1956320, 1835845, 1684611, 1524381]
57007A524381j54600j41464j25797j09839r4316p9905o7287n6694m8105m1420
56997F04954l6081l1187k6409k2209j8819j5776j2839j0467q927p669o061m043
56985D04467j635J443N084Q291R742Q645M945o63o786j2034j5836j8130j8626
56972C68907j7263j5060j3277j1791r624o927m908l657j760J284M085N649P187
56959C02845J0431J5295K0297K4245K6196K4636J8371Q221l151j3027j9861k3269
56947C91229k3802k2563k0491j7914j4977j2039r372o880m424j972P16L993P680
56934B69184J1236J4854J9626K6066L2856L7409L7240L0875J8563K811j2415k3846
56922D64459l0390l2672l1930k9565k6849k4264k1417j7941j4208j0956q661p439
$$ y = [1524381, 1369781, 1228317, 1102520, 992681, 898365, 818460, 751173, 694479, 646374, 604954, 568873, 537686, 511277, 489068, 470249, 454473, 441634, 431167, 422240, 414571, 408510, 404467, 402832, 404275, 409359, 417650, 427392, 436037, 440982, 440319, 433533, 421499, 405663, 387533, 368907, 351644, 336584, 323307, 311516, 301892, 294965, 290057, 286400, 284640, 285924, 290009, 295658, 302845, 313276, 328571, 348868, 373113, 399309, 423945, 442316, 450537, 447386, 434359, 414498, 391229, 367427, 344864, 324373, 306459, 291482, 279443, 270071, 263191, 258767, 256795, 257511, 261504, 269184, 280420, 295274, 314900, 340966, 373822, 411231, 448471, 479346, 497909, 500720, 488305, 464459, 434069, 401397, 369467, 339902, 313053, 288789, 267372, 249431, 235223, 224267, 215606, 208167]
56910B08167p063o915o361n304m060k763j480n96l64k53M15J343J775J999L071
56895A81611N000O530P046P532R073J1497J4024J6416J8843K1312K3570K4950
56883C47404K4130J9925J2560L576n444j3201j8163j9307j7624j5406j3610j1186
56871B93654p322k894R64M350P871J1626J5691K0537K6336L2823M0378M9894O0678
56858E54586O9313P1464O4287M7372K3089l220k5209l9278m6027m7713m5621m0436
56846E82607l3434k5840j7963j0036k867L344R722J7324K6042L5844M7753O2349
56834F94845P8381R3817J06596J12802J06073Q1900M2919j605m1615p0929q7796
56823A115388r3532r1280q4388p5051o4513n3931m4094l4717k5155j5541o298
$$ y = [208167, 201104, 194189, 187828, 182524, 178464, 175701, 174221, 173625, 173261, 173008, 173423, 174766, 176541, 178540, 181611, 186611, 193141, 200187, 207719, 216792, 228289, 242313, 258729, 277572, 298884, 322454, 347404, 371534, 391459, 404019, 407595, 402151, 388950, 370787, 351480, 333856, 318450, 304840, 293654, 286332, 283438, 284402, 288752, 296623, 308249, 323940, 344477, 370813, 403636, 444014, 493908, 554586, 623899, 695363, 759650, 807022, 830111, 826891, 801682, 762404, 716377, 668664, 623043, 582607, 549173, 523333, 505370, 495334, 492467, 495811, 505533, 522857, 548899, 584743, 632496, 694845, 773226, 867043, 973639, 1086441, 1192514, 1274414, 1317333, 1315728, 1274113, 1203184, 1115388, 1021856, 930576, 846188, 771137, 706624, 652693, 608599, 573882, 548727, 533186, 526888]
56812E26888L078J3595K5361L7638N0163O3064P5044Q2322P9926O4480L6769K396
56800A060724l0583n5806p1068p7370p6785p1619o4219n6125m7573l8496k9567
56789D41513k1657j4934r103l986Q53O307J2888K0264K7995L5611M1276M1660
56777E78687L4513K0817L653j4060k9818m1059m6358m6725m4411m0752l6130l1264
56765C07093k7030k3457k0107j7170j4999j3098j0765q398o973o471n983n091
56753A47551m134l307k489j794j440j335j411j841k392k291j455r66j400j727
56739A19569j015j87o24j863k308j665j001q35o70k72J8J08J75K8n16r69q60n69
56721A06544m97j08J016J967J750R85R69J643K015J918J771J219j88j468j262
$$ y = [526888, 529966, 543561, 568922, 606560, 656723, 719787, 794831, 877153, 957079, 1021559, 1058328, 1060724, 1030141, 974335, 903267, 825897, 749112, 677493, 613274, 557149, 509576, 471080, 441513, 419856, 404922, 395819, 391833, 392686, 398993, 411881, 432145, 460140, 495751, 537027, 578687, 613200, 634017, 637670, 623610, 593792, 552733, 506375, 459650, 415239, 374487, 338357, 307093, 280063, 256606, 236499, 219329, 204330, 191232, 180467, 172069, 165096, 158625, 152642, 147551, 143417, 140110, 137621, 135827, 134387, 133052, 131641, 129800, 127408, 125117, 123662, 122696, 121296, 119569, 118554, 118367, 117743, 115880, 113572, 111907, 110906, 110071, 109401, 109129, 109147, 109255, 109430, 109458, 108942, 107973, 107113, 106544, 106047, 105939, 106955, 108922, 110672, 111657, 112626, 114269, 116284, 118202, 119973, 121192, 121004, 119536, 118274]
56706A18274k8O07L73L83R17J136R25R90J128L08j269k053j420m33J9J88L53L02
56688A20700K35O73J245J045L84M88J274J265N7r02o56r2k04o30p41q10j086j028
56670A21217l23L15K66n4LL52O85J066J499J690J668J795J942J510O34K83Q30
56653A35378J546J870K125K571K776K506K236K248K113J546R91Q68J002J208J647
56638A62631K269K587K383J947J488R66N40M60M18o3p06p73l12o4k05k48j65m79
56620A72674j208j877k530l506m266l818k425j400j106o89L9J22o69j112m64L81
56604A48146M07j26m86n38k74N13J431J431L23p26q36m60k78j69m7m48j391j707
56586A44765n18J356K399K114J090M9m94k22N92J174J150Q74O59L70J5o0K14N65
$$ y = [118274, 118246, 118853, 119226, 119609, 120526, 121662, 122587, 123577, 124705, 125013, 123744, 121691, 120271, 119838, 119857, 120045, 120398, 120700, 120935, 121608, 122853, 123898, 124282, 124770, 126044, 127309, 127366, 126464, 125808, 125716, 125512, 124882, 124141, 123331, 122245, 121217, 120894, 121209, 121475, 121421, 121424, 121776, 122461, 123527, 125026, 126716, 128384, 130179, 132121, 133631, 134265, 134548, 135378, 136924, 138794, 140919, 143490, 146266, 148772, 151008, 153256, 155369, 156915, 157906, 158774, 159776, 160984, 162631, 164900, 167487, 169870, 171817, 173305, 174271, 174811, 175271, 175689, 175626, 174920, 174147, 173835, 173771, 173566, 173318, 173153, 172674, 171466, 169589, 167059, 163553, 159287, 155469, 153044, 151644, 150538, 149849, 149888, 150010, 149341, 148229, 147765, 148146, 148553, 148427, 147941, 147403, 147129, 147642, 149073, 150504, 150827, 150101, 149265, 148805, 148527, 148358, 148311, 147863, 146472, 144765, 144247, 145603, 148002, 150116, 151206, 151255, 150761, 150539, 151131, 152305, 153455, 154329, 154988, 155358, 155373, 155313, 155527, 156092]
56568A56092J092K047K918K800J935J664K548L757M651N610O832P697P946Q151
56554B15740Q363P522N195K695J559J811K535L222L645L351K252J100N52L81J28
56539B60051j32k10k64l49k52k26r84k488l602l571k994k852l337m128m921n221
56523B24520m516l168k270k206k260j917j536j361j064p89j358k763l652l099
56509A92561j864j106q81o71m89n55o55n85o72j154j669j793j454o52M54J094
56493A79909N87m34o46K0L91J21J28O21N72k85p06r8L60k34r02n37K77N00L74
56474A80018N94Q52N55M1j44k84o66o61K70J434J909J851J860J857J561J260J135
56457A93442P01k59r93q31j44M11P49P98K57m88l87O09J174O50K9R0Q3o05j040
$$ y = [156092, 157184, 159231, 162149, 164949, 166884, 168548, 171096, 174853, 179504, 185114, 191946, 199643, 207589, 215740, 224103, 231625, 236820, 239515, 241074, 242885, 245420, 248642, 252287, 255638, 257890, 258990, 259542, 259923, 260051, 259919, 259709, 259445, 259096, 258844, 258618, 257634, 255146, 251544, 247973, 244979, 242127, 238790, 234662, 229741, 224520, 220004, 216836, 214566, 212360, 210100, 208183, 206647, 205286, 204222, 203433, 202075, 199312, 195660, 192561, 190697, 189591, 188710, 188039, 187550, 186995, 186340, 185755, 185083, 183929, 182260, 180467, 179013, 178361, 178815, 179909, 180496, 180062, 179416, 179436, 179827, 179948, 180076, 180697, 181269, 180984, 180278, 180180, 180540, 180306, 179404, 178867, 179144, 179644, 180018, 180612, 181464, 182019, 182060, 181916, 181632, 180966, 180305, 180575, 182009, 183918, 185769, 187629, 189486, 191047, 192307, 193442, 194143, 193884, 192891, 192060, 191916, 192327, 193076, 193874, 194131, 193643, 193256, 193865, 195039, 195689, 195718, 195808, 195891, 195286, 194246]
56438A94246k85J008J906K678L609L670K035j34j056o84j29K98R93J694J772J385
56422B13006J077P71K21j64K6M27O73J041J511J195j79j363j282n56k34k26j59
56405B15785n54j699k480j922r14r01j740k319k398k342j853n07J098K072K483
56390B01809K721K506J781J577K639L992M295L802L620L915M152M295M375L792
56376B49271K365J215J269J776J602J022Q73R42O42L44N39O69J89j89K42P04K11
56359B63686o44p42k45O1K62P14R67P17O74J170J180J92n00M2N25m00j623j416
56341B64620k98J92K78J046J935J656P12O10J249J410J075J083J205P73M70J341
56325B79357K804L635M005M530M451L108J945K529L691L288J779J202J591J431
$$ y = [194246, 193961, 194969, 196875, 199553, 203162, 206832, 208867, 208733, 207677, 206993, 206864, 207162, 208155, 209849, 211621, 213006, 214083, 214854, 215075, 214911, 214937, 215364, 216037, 217078, 218589, 219784, 219605, 218242, 216960, 216404, 216170, 215944, 215785, 215231, 213532, 211052, 209130, 208216, 207315, 205575, 203256, 200858, 198516, 196663, 196156, 197254, 199326, 201809, 204530, 207036, 208817, 210394, 213033, 217025, 221320, 225122, 228742, 232657, 236809, 241104, 245479, 249271, 251636, 252851, 254120, 255896, 257498, 258520, 259393, 260335, 260977, 261321, 261860, 262529, 262718, 262529, 262771, 263475, 263686, 263042, 262300, 262055, 262116, 262378, 263092, 264059, 264776, 265450, 266620, 267800, 267992, 267492, 267534, 268059, 267659, 266036, 264620, 264322, 264514, 264792, 265838, 267773, 269429, 270141, 270751, 272000, 273410, 274485, 275568, 276773, 277546, 278016, 279357, 282161, 285796, 289801, 294331, 298782, 301890, 303835, 306364, 310055, 313343, 315122, 316324, 317915, 319346]
56311C19346Q66J264K122J602k4o16K81J012R08R76J464J500J274J908L111L471
56295C40465L018L034L426K943J854J744K678L218L146L498M072L718K990L514
56281C83318M780M672L311L095M620N798N597N436O103O383N756N609O692P949
56267D59119Q763R847J1095J1197J0269J0279J1865J3377J4008J5254J8057K1059
56255F14189K3088K5128K8334L2119L5568L9088M3430M8567N4409O1116O8017
56244A073053P3811P8382Q2772Q7113R0325R2057R2808R1862Q7536P9857P0687
56233B000263O0626M8197L2842J6387O77j4163k8259m0902n1759o1247o8951p3519
56221A820192p4885p4735p4309p3416p1944p0313o8142o4502n9829n5654n2256
$$ y = [319346, 320212, 321476, 323598, 325200, 325176, 324560, 324841, 325853, 326761, 327737, 329201, 330701, 331975, 333883, 336994, 340465, 343483, 346517, 349943, 352886, 354740, 356484, 359162, 362380, 365526, 369024, 373096, 376814, 379804, 383318, 388098, 392770, 396081, 399176, 403796, 409594, 415191, 420627, 426730, 433113, 438869, 444478, 451170, 459119, 467882, 477729, 488824, 500021, 510290, 520569, 532434, 545811, 559819, 575073, 593130, 614189, 637277, 662405, 690739, 722858, 758426, 797514, 840944, 889511, 943920, 1005036, 1073053, 1146864, 1225246, 1308018, 1395131, 1485456, 1577513, 1670321, 1762183, 1849719, 1929576, 2000263, 2060889, 2109086, 2141928, 2158315, 2158992, 2144829, 2116570, 2075668, 2023909, 1962662, 1893711, 1820192, 1745307, 1670572, 1596263, 1522847, 1450903, 1380590, 1312448, 1247946, 1188117, 1132463, 1080207]
56210A080207m8631m4787m1776l9388l6256l2409k9265k7014k4468k1554j9328
56199G15331j7558j5033j2322j1140j1026r800p491o346o656o170m327l314l968
56186F00180m217k804j203n51O4J023J057N0j81Q14J111m6q34k54K28j98p0J375
56168E95544K618K724K827L428L268K250K369M348O325P175Q011R180R201Q025
56154F67293P826R145R790R076R404J1828J3944J4243J4807J7357K0332K2333
56142H27378K4976K9648L4710L8669M3161N0168N9138O9222Q1521R6584J12236
56131A467411J25948J36608J42182J39079J26420J08187Q9212P1942N8557N1952
56121B517498N1574N1749M7182L7462K4299Q238q967k2500k8724k9201k8141k8775
$$ y = [1080207, 1031576, 986789, 945013, 905625, 869369, 836960, 807695, 780681, 756213, 734659, 715331, 697773, 682740, 670418, 659278, 648252, 638452, 630961, 624615, 617959, 611789, 607462, 604148, 600180, 595963, 593159, 591956, 591405, 591469, 592492, 593549, 593599, 593418, 594232, 595343, 595297, 594463, 594209, 594437, 594239, 594169, 595544, 598162, 600886, 603713, 607141, 610409, 612659, 615028, 619376, 625701, 632876, 640887, 650067, 659268, 667293, 675119, 684264, 694054, 703130, 712534, 724362, 738306, 752549, 767356, 784713, 805045, 827378, 852354, 882002, 916712, 955381, 998542, 1048710, 1107848, 1177070, 1258591, 1355175, 1467411, 1593359, 1729967, 1872149, 2011228, 2137648, 2245835, 2335047, 2406989, 2465546, 2517498, 2569072, 2620821, 2668003, 2705465, 2729764, 2738002, 2729035, 2706535, 2677811, 2648610, 2620469, 2591694]
56109B591694l4136m7394o7925q9909j07673j19883j26694j26729j19811j09152
56099A642388r7657q5062p1156n8318m8136l9104l0362k3963k0666j7544j2737
56088A137683q541o678m829j266J430J070Q5J139K603K404K348M403O574O719
56074A145144O654Q363R977R714R783J2095J4166J3808J3694J6521J9765K0165
56062A299849J9474K0586K1948K1049J9696K0464K1403J9700J7131J6720J7364
56051A515384J6852J6575J8146J9166J7598J6458J8729K1655K1620K0600K2029
56040A724812K4332K4612K4662K7159K9823K9632K8881L0922L3854L4679L5437
56029B048805L8827M2137M2223M1995M5134M8921M9454M9321N2621N7009N8388
$$ y = [2591694, 2557558, 2510164, 2442239, 2352330, 2244657, 2124774, 1998080, 1871351, 1751540, 1642388, 1544731, 1459669, 1388513, 1330195, 1282059, 1242955, 1212593, 1188630, 1167964, 1150420, 1137683, 1129142, 1122464, 1117635, 1116369, 1117799, 1118869, 1118954, 1120093, 1122696, 1125100, 1127448, 1131851, 1138425, 1145144, 1151798, 1160161, 1170138, 1179852, 1189635, 1201730, 1215896, 1229704, 1243398, 1259919, 1279684, 1299849, 1319323, 1339909, 1361857, 1382906, 1402602, 1423066, 1444469, 1464169, 1481300, 1498020, 1515384, 1532236, 1548811, 1566957, 1586123, 1603721, 1620179, 1638908, 1660563, 1682183, 1702783, 1724812, 1749144, 1773756, 1798418, 1825577, 1855400, 1885032, 1913913, 1944835, 1978689, 2013368, 2048805, 2087632, 2129769, 2171992, 2213987, 2259121, 2308042, 2357496, 2406817, 2459438, 2516447, 2574835]
56018B574835N8944O2627O7242O9042P0474P5223Q0418Q2120Q3534Q9051R5278
56007C408788R7208R7934J02802J09204J12152J14595J21873J31114J36793J41482
55997D573945J50229J59922J65495J71074J83095J98137K09740K21250K39036
55988F271923K59144K74264K87874L07504L30343L50028L71085M01280M36398
55979I289843M68623N02867N47841N98566O45819O95325P58518Q32415R08894
55970A5248711R95343J104375J232084J369904J528783J727073J964882K237594
55962B7408749K563764K970717L465374M052315M767163N655447O732497Q004394
55954F5620420R514757J1334187J3535107J6235547J9639988K3965116K9320383
$$ y = [2574835, 2633779, 2696406, 2763648, 2832690, 2903164, 2978387, 3058805, 3140925, 3224459, 3313510, 3408788, 3505996, 3603930, 3706732, 3815936, 3928088, 4042683, 4164556, 4295670, 4432463, 4573945, 4724174, 4884096, 5049591, 5220665, 5403760, 5601897, 5811637, 6032887, 6271923, 6531067, 6805331, 7093205, 7400709, 7731052, 8081080, 8452165, 8853445, 9289843, 9758466, 10261333, 10809174, 11407740, 12053559, 12748884, 13507402, 14339817, 15248711, 16244054, 17348429, 18580513, 19950417, 21479200, 23206273, 25171155, 27408749, 29972513, 32943230, 36408604, 40460919, 45228082, 50883529, 57616026, 65620420, 75135177, 86469364, 100004471, 116240018, 135880006, 159845122, 189165505]
55947A89165505L5608933M2237610M7553618M8684204M2696562K8747946R365437
55940D44059815j0626946k6770699l6961627m1472861m1739675l9304405l5424445
55933B11759157l1008598k6611132k2514025j8868904j5756152j3163239j1009714
55926G2827393r223555p761703o571075n584753m760490m083238l528943l060730
55918B8252906k659594k325779k049331j807966j593378j412414j262170j128222
55910A4014052j006755r05225q21401p43198o68880o07216n57960n11107m65000
55901G727310m26978l96448l64730l31542l05134k86024k66215k44485k27455
55892D878299k15413k01539j85314j72909j64059j51939j36265j23696j14907
$$ y = [189165505, 224774438, 267012048, 314565666, 363249870, 405946432, 434694378, 444059815, 433432869, 406662170, 369700543, 328227682, 286488007, 247183602, 211759157, 180750559, 154139427, 131625402, 112756498, 97000346, 83837107, 72827393, 63603838, 55842135, 49271060, 43686307, 38925817, 34842579, 31313636, 28252906, 25593312, 23267533, 21218202, 19410236, 17816858, 16404444, 15142274, 14014052, 13007297, 12102072, 11280671, 10537473, 9868593, 9261377, 8703417, 8192310, 7727310, 7300332, 6903884, 6539154, 6207612, 5902478, 5616454, 5350239, 5105754, 4878299, 4662886, 4461347, 4276033, 4103124, 3939065, 3787126, 3650861, 3527165, 3412258]
55883C412258j03759q9580p8089o9518n7582m1102k5500j2120K830J7650K4019
55872B979507J7935K589j9803m9156q0061j03307j16368j23896j27539j24311
55862B255590j15311j06427r9280r0284p9597p2053o8138o2894n5200m9603m7339
55851A409464m4038l8270l4303l4114l4113l2082l0378l0130k8987k6611k6031
55840A050407k7583k7660k5186k3338k3279k2258j9435j7620j7600j6572j3826
55829H16050j2297j2809j2423j0133q791r694j0504j0179j0744j2599j3152j1737
55817F80988j1068j2166j2610j1296j0236j0251r427p291n975n953n074l030k178
55804E74433k812k161P03L442N047P236J0144J1263R968Q582P755N355J137k236
$$ y = [3412258, 3308499, 3218919, 3140830, 3071312, 3013730, 2972628, 2947128, 2935008, 2937838, 2955488, 2979507, 2997442, 3000031, 2980228, 2931072, 2851011, 2747704, 2631336, 2507440, 2379901, 2255590, 2140279, 2033852, 1934572, 1844288, 1764691, 1692638, 1624500, 1561606, 1506406, 1456803, 1409464, 1365426, 1327156, 1292853, 1258739, 1224626, 1192544, 1162166, 1132036, 1103049, 1076438, 1050407, 1022824, 995164, 969978, 946640, 923361, 901103, 881668, 864048, 846448, 829876, 816050, 803753, 790944, 778521, 768388, 759597, 749903, 739399, 729220, 718476, 705877, 692725, 680988, 669920, 657754, 645144, 633848, 623612, 613361, 603934, 596643, 590668, 584715, 579641, 576611, 574433, 571621, 569460, 570163, 573605, 578652, 585888, 596032, 607295, 617263, 625845, 633600, 638955, 640092, 637856]
55790F37856m160p163j1623j4281j3807j2903j2892j1231o914l688m890q942j2625
55777E12737j5202j6799j6324j3770j1414j0356q742n405k097j30J857M574N760
55764D24689L710K79j986l147m239m953m968n275o209o443n510m893n239n159
55750C70657m270m523o775q783q590p317o795o819o691o992p949q143o761n111
55736B75138m378l871k915k323k545k421j270k08j38l85m63j111k487l495l823
55721B43305m401n101m558l029k556l326k984q35O10j05p99O15K853L956M453
55706B28098N397N861M873L652L397K855N22k564m543n525o456o834n931m830
55692B17972m953n690n501m325l155k279j462q67m40M24J598J972J495J726L211
$$ y = [637856, 633696, 626533, 614910, 600629, 586822, 573919, 561027, 549796, 542882, 539194, 534304, 525362, 512737, 497535, 480736, 464412, 450642, 439228, 428872, 420130, 414725, 412628, 412498, 414355, 418929, 424689, 428399, 428678, 426692, 423545, 419306, 414353, 409385, 404110, 397901, 391458, 385948, 381055, 375816, 370657, 366387, 361864, 355089, 346306, 337716, 330399, 323604, 316785, 310094, 303102, 295153, 287010, 280249, 275138, 270760, 266889, 263974, 261651, 259106, 256685, 255415, 255207, 255069, 254684, 254221, 253110, 250623, 247128, 243305, 238904, 233803, 229245, 226216, 223660, 220334, 217350, 216515, 217125, 217020, 216221, 216836, 219689, 223645, 228098, 233495, 239356, 244229, 247881, 251278, 254133, 254655, 252091, 247548, 242023, 235567, 228733, 222802, 217972, 213019, 207329, 201828, 197503, 194348, 192069, 190607, 189740, 189300, 189724, 191322, 193294, 194789, 196515, 199726]
55677A99726M295L812K927K792K409O49j503k623l103l865m306l524k225j620
55663A93841j578j404j180r03K43K255L453K850J935K442L858M737M977N090M673
55648B25289L406K262J959J487j12j880k585k921m173n839o536o282o090o152
55634A91833o057o005o279o328n647m689l816k604j311j394l081m070k553p5O48
55619A38572n00j535j590j419j459j423j467j946k382k079j346q44m17K34N47
55604A20946O7n01m66l93q93j256p64k16n69j174r97o18j191k261k425j529n46
55587A05214P7M80M36j34l94K41R08O97K94P08J295P79m31q18m6R76J807K624
55569A14713L080K613J593Q37M52K78P08J732K089R00o41q63j39j23j144k128
$$ y = [199726, 204021, 207833, 210760, 213552, 215961, 216610, 215107, 212484, 209381, 205516, 201210, 197686, 195461, 193841, 192263, 190859, 189679, 188776, 189019, 191274, 194727, 197577, 199512, 201954, 205812, 210549, 215526, 220616, 225289, 228695, 230957, 232916, 234403, 234291, 232411, 229826, 226905, 222732, 216893, 210357, 204075, 197985, 191833, 185776, 179771, 173492, 167164, 161517, 156828, 153012, 150408, 149097, 147703, 144622, 140552, 137999, 137924, 138572, 138072, 136537, 134947, 133528, 132069, 130646, 129179, 127233, 124851, 122772, 121426, 120582, 120165, 120399, 120946, 121013, 120512, 120046, 119653, 118760, 117504, 116740, 116524, 115955, 114781, 113784, 113166, 111975, 109714, 107289, 105760, 105214, 105291, 105771, 106207, 106073, 105679, 105920, 106828, 107525, 107819, 108527, 109822, 110601, 110170, 109352, 109306, 110282, 112089, 114713, 117793, 120406, 121999, 122836, 123288, 123566, 124274, 126006, 128095, 128995, 128354, 127491, 127352, 127229, 126085, 123957]
55553A23957k521k617k392j694j225j658k265j912r49n85q62r25p12o98m65O67
55537A03144J958K050J184Q13J208J320Q54O35Q30N67m76j583k247k521k189j050
55521A04497K0j61j195j451m13P29R63N25q5p69j259j105n50l71o84q36m79J69
55503I7545J045K189L080L047K213J149o0j360j827o48J273K108J422L31m52j254
55487A09801k154k588k445k283k209j720q07j53j05l84p96j287j419q80k94m24
55471H9853q38o28q6k20q60r09m43p03j805k220j084N09J270J316J294J111M56
55454H6013l09o61p39r28j121q87q7R73J750J744R49l1o36q80r04n16K12N49Q1
55435H4572m84m30k49o05q32R1J553J942J077K88K54L53K60M43Q40O85L8l7P00
$$ y = [123957, 121436, 118819, 116427, 114733, 113508, 111850, 109585, 107673, 106724, 106139, 105277, 104352, 103640, 102942, 102477, 103144, 105102, 107152, 108336, 109149, 110357, 111677, 112531, 113166, 113996, 114563, 114087, 112504, 110257, 107736, 105547, 104497, 104517, 104356, 103161, 101710, 101297, 102026, 102989, 103514, 103429, 102660, 101401, 100296, 99746, 99375, 98691, 97855, 97376, 97545, 98590, 100779, 103859, 106906, 109119, 110268, 110208, 108848, 107021, 106373, 107646, 109754, 111176, 111507, 111055, 109801, 107647, 105059, 102614, 100331, 98122, 96402, 95595, 95442, 95337, 94953, 94157, 92870, 91451, 90571, 90277, 89853, 89015, 88387, 88301, 88081, 87221, 86312, 85869, 85166, 83361, 81141, 80057, 80566, 81836, 83152, 84446, 85557, 86013, 85704, 85043, 84304, 83376, 82255, 81368, 81281, 82254, 84004, 85748, 86697, 86666, 86030, 85150, 84246, 83730, 83942, 84491, 84572, 84088, 83658, 83409, 82804, 81972, 82063, 83616, 85558, 86635, 86923, 87177, 87530, 87790, 88233, 89073, 89758, 89796, 89759, 90459]
55416I0459J116N52r1J10P52R90Q14O77O86P13O74L19n55j447j541r47o11q17
55398I1853p88p2P71J135J059N85m10j387j288r7P56K27j030j777j750j425r91
55381H5371l83K39O44Q04O71J68l10l2R98J749J376K18p35r59o39k88l32p16q00
55362H7044j44O77O61k26r83r22k96M24J044J307R65M25M30Q66P89r4q66p41j76
55343I0184l9l94o97o51l49K3K25J7n29r92j009n05L08R07O92k10p52k07P01P69
55323H7492O0l88l05m17q80q75o0P11O61J47oM40J130J524J133Qr55q79j03K56
55303H8694q7l39pM95P07O38L02k50m69P8O33J1j415j891p70N59P12K4m54m60
55283H6711k63J54Q03J300J357J145Q15L51N8L09O69K80p50j406j358j219j056
$$ y = [90459, 91575, 92127, 92036, 92146, 92898, 93888, 94702, 95379, 96065, 96778, 97452, 97771, 97216, 95769, 94228, 93281, 92670, 91853, 91065, 90993, 91764, 92899, 93958, 94543, 94133, 92746, 91458, 91361, 92117, 92344, 91314, 89537, 87787, 86362, 85371, 84988, 85227, 85871, 86675, 87346, 87514, 87204, 87172, 88170, 89919, 91295, 91513, 90778, 89819, 89180, 88892, 88560, 87844, 87044, 86900, 87577, 88238, 88012, 87029, 86107, 85811, 86235, 87279, 88586, 89551, 89976, 90406, 91272, 92061, 91967, 91101, 90360, 90184, 90145, 89751, 89054, 88403, 88054, 88077, 88302, 88319, 87790, 86798, 85789, 85284, 85592, 86499, 87191, 86981, 86229, 86022, 86723, 87492, 87552, 87164, 86859, 86442, 85562, 84687, 84627, 85338, 85999, 86146, 86140, 86580, 87710, 89234, 90367, 90375, 89420, 88541, 88438, 88694, 88607, 88268, 88261, 88756, 89463, 90101, 90403, 90153, 89684, 89762, 90395, 90406, 88991, 87100, 86330, 86889, 87601, 87625, 87171, 86711, 86448, 86602, 87405, 88705, 90062, 91207, 92022, 92373, 92431, 92740, 93409, 93689, 92939, 91533, 90175, 88956, 87900]
55266H7900j40J373K114J516O81M77K92l92p61j98L32j77j003r01j12L08L53P11
55248I2373J196J033L16j39j11j9N1K42J61o22j578j740j089m35j44J09M21N04
55230I0529L31K03J06k36p07q66o36l99l74l71j18N13J373J951J701P48j46n14
55212I3088o00o20l11L38O97L60k19n23o97r18p98j02O15P92O85O71M79j23n97
55193I2217m54j48k12j76N58J433J458P47J70j72q48j736k018j482p50j86L79
55176H8780Q46P87K92J6J84L43J43k55o26q04m95L51J076R92M50M16J063J679
55158I5238J894K011K076J608N57m20r57j437k028k117j301k49N2m11q50p90m61
55141I2415j85J6J83K13J16J58N13R15R58O99O46R59J078N09l38o32k99m1k08
$$ y = [87900, 87760, 89133, 91247, 92763, 93444, 93921, 94213, 93821, 93060, 92862, 93194, 93017, 92014, 91113, 91001, 91309, 91662, 92373, 93569, 94602, 94918, 94779, 94668, 94649, 94700, 94942, 95103, 94481, 92903, 91163, 90074, 89639, 89495, 89604, 90025, 90529, 90860, 91063, 91169, 90933, 90226, 89360, 88724, 88325, 87951, 87580, 87462, 87975, 89348, 91299, 93000, 93748, 93602, 93088, 92488, 91868, 91557, 91895, 92592, 92952, 92733, 92210, 91513, 90595, 89797, 89695, 90310, 91102, 91787, 92458, 92937, 92814, 92217, 91763, 91615, 91403, 91227, 91785, 93218, 94676, 95423, 95593, 95421, 94573, 92837, 90819, 89337, 88587, 88401, 88780, 89626, 90413, 90705, 90721, 90905, 91248, 91391, 91136, 90510, 89706, 89211, 89562, 90638, 91630, 92080, 92496, 93559, 95238, 97132, 99143, 101219, 102827, 103384, 102964, 102007, 100570, 98542, 96425, 95124, 94875, 94927, 94516, 93666, 92876, 92415, 92230, 92246, 92429, 92642, 92758, 92916, 93429, 94344, 95302, 96001, 96647, 97606, 98684, 99193, 98855, 98223, 97924, 97883, 97675]
55122I7675m07l62l80o11o51k91qj40j92L56J059J052K56n61p73l19N44J398J739
55103I9384J398P51J80l47q42r09k18R01J849K334K251J449K13o09n79l38o26
55086A06242j082q59n7M01J81j14p1j18p17j494j552m94J048J888J429L88L5O73
55068A05727J377J345Q30L76n7o00q01k83M37N46R5k46k40k13l23m31n09o14o73
55049A05743p11r56j252r31J47J025Q61J43j09J21J39j54k56q9N2K22O11Q73O50
55030A06129M41Q22J167M28j035j793j516j287j654j762r41J92Q48J154J452J478
55014A04123R98M32K06Q9j69j84M63J464K170K328K031J345M68j64l25k44r2K56
54996A15195O89O53o3p74p12n3M16M40N12J016J624J698R87j69j270k056k433
$$ y = [97675, 97268, 96906, 96526, 95915, 95264, 94973, 94965, 94825, 94633, 94989, 96048, 97100, 97356, 96795, 96022, 95703, 96247, 97645, 99384, 100782, 101533, 101713, 101366, 100524, 99615, 99397, 100298, 102147, 104481, 106732, 108181, 108394, 107785, 107206, 106868, 106242, 105160, 104301, 104244, 104645, 104826, 104712, 104641, 104523, 103806, 102312, 100760, 100266, 101314, 103202, 104631, 105019, 105054, 105727, 107104, 108449, 109279, 109655, 109598, 108998, 108197, 107914, 108351, 108897, 108992, 108746, 108506, 108293, 107970, 107539, 107030, 106416, 105743, 105032, 104076, 102824, 101893, 102040, 103065, 103926, 104069, 103960, 104081, 104220, 104066, 103810, 103721, 103773, 103995, 104606, 105479, 106129, 106570, 107392, 108559, 108987, 107952, 106159, 104643, 103356, 101702, 99940, 98999, 99191, 100039, 101193, 102645, 104123, 105121, 105553, 105759, 105848, 105679, 105495, 105958, 107422, 109592, 111920, 113951, 115296, 115764, 115600, 115275, 115031, 114939, 115195, 115884, 116537, 116474, 115700, 114988, 114935, 115351, 115791, 116303, 117319, 118943, 120641, 121628, 121459, 120189, 118133, 115700]
54979A15700k160r82P38J936J881J072O40R23J227R20J53o08j195j566j461o37
54963A16581O22J608J840J548J462J957K504K216J021j73o27o13p46r81q31k65
54947A27123K87N81O44L92k09p26o08O4O83Q23M94j55p91q55j28P67J028P56P46
54928A30916J318J977K182J950J665J829K822M548O358P772Q982J0152J0711J0025
54914B03207Q375O486M354J491j854m673o342p046p147o926o791o956o981o381
54900A62816n458m783m175l195k269k101k264j753p96o07j278j483n93M24P00
54885A33185O28P44Q13P51J265K653M066M812N462O751Q286R237R557R598R175
54870B06983P871N743L045j70l495n957p116p737q577r180q721p453o331n614
$$ y = [115700, 113540, 112558, 113296, 115232, 117113, 118185, 118825, 119748, 120975, 121895, 122048, 121440, 120245, 118679, 117218, 116581, 117203, 118811, 120651, 122199, 123661, 125618, 128122, 130338, 131359, 131186, 130559, 129946, 129200, 128219, 127388, 127123, 127410, 127991, 128635, 129027, 128818, 128092, 127484, 127548, 128231, 129054, 129548, 129393, 128602, 127747, 127619, 128386, 129414, 130170, 130916, 132234, 134211, 136393, 138343, 140008, 141837, 144659, 149207, 155565, 163337, 172319, 182471, 193182, 203207, 211582, 218068, 222422, 223913, 222059, 217386, 211044, 203998, 196851, 189925, 183134, 176178, 169197, 162816, 157358, 152575, 148400, 145205, 142936, 140835, 138571, 136818, 136022, 135415, 134137, 132654, 132061, 132485, 133185, 133813, 134557, 135370, 136121, 137386, 140039, 144105, 148917, 154379, 161130, 169416, 178653, 188210, 197808, 206983, 214854, 220597, 223642, 223472, 219977, 214020, 206904, 199167, 190590, 181410, 172689, 165236, 158905, 153291]
54856A53291m803l666k504j605j139j407k389l317l336k512j653j275j256j275
54842A21154j091o16j63l45j270k116k033j146k13M17R16J338J463J218P96M04
54826A18713J74J47J62l0l33m19l91p77j560j902j321m92k44k71K81J345J912
54809A14994J347P5j038j379p74M07J340J399Q12L80N97J260J804J808J250N28
54793A24810O7j17k36k10K41Q79J024N70J98K94M25K89L66R16J208O28m3M54K027
54774A33790L364L700L485L262K880K090J285J262K488M657O840Q170Q623Q895
54760A94791R312R252P980N595K662n25l733o278p567p879p895p673o794n387
54746A75861m236l799l820l816l528k854j930j176q60p39n26m29o47p20j54O79
$$ y = [153291, 148488, 144822, 142318, 140713, 139574, 138167, 135778, 132461, 129125, 126613, 124960, 123685, 122429, 121154, 120063, 119447, 119284, 118939, 117669, 115553, 113520, 112374, 112161, 112578, 113494, 114832, 116295, 117513, 118309, 118713, 118887, 119034, 119196, 119166, 118833, 118414, 118023, 117246, 115686, 113784, 112463, 111971, 111727, 111456, 111737, 113082, 114994, 116341, 116416, 115378, 113999, 113225, 113632, 114972, 116371, 117183, 117563, 118160, 119420, 121224, 123032, 124282, 124810, 124877, 124760, 124524, 124314, 124555, 125434, 126458, 127028, 127226, 127520, 127945, 128234, 128600, 129516, 130724, 131352, 131309, 131763, 133790, 137154, 140854, 144339, 147601, 150481, 152571, 153856, 155118, 157606, 162263, 169103, 177273, 185896, 194791, 204103, 213355, 221335, 226930, 229592, 229067, 225334, 219056, 211489, 203610, 195715, 188042, 181248, 175861, 171625, 167826, 164006, 160190, 156662, 153808, 151878, 150702, 149842, 149103, 148577, 148148, 147501, 146781, 146627, 147306]
54730A47306J041J047J417K142K429K169K364L693N491O731P336P932Q715R111
54716B08924Q436O470L569M63k197m275o060p649q696q873q320p542o914o411
54702A60925n725m622l327k418k195k280k043j327n41j48k98q38j326j211l43
54687A32283O93J090O27k14q74j182j279j338j340j004r3J025J433O21p88j668
54671A27992j547q32j33K21J26k85n60k97L00N66J40o16j017p29q7K53K3k87n6
54652A23175N63Q52O22M79P75J057R39P82Q97Q16J57m48k74J58j81j056j160p7
54634A28076J087J290P48J90j72m70o30n32l20k05k19k93k95J4O76J232J168N81
54616A31926j00q72j886k521j777J53J628J412Q1r09r38l93K99J022J570J652
$$ y = [147306, 148347, 149394, 150811, 152953, 155382, 157551, 159915, 163608, 169099, 175830, 183166, 191098, 199813, 208924, 217360, 223830, 227399, 227862, 225665, 221390, 215330, 207681, 198985, 190112, 181792, 174250, 167336, 160925, 155200, 150578, 147251, 144833, 142638, 140358, 138315, 136988, 136447, 136299, 136001, 135163, 133837, 132626, 132283, 132976, 134066, 134693, 134479, 133605, 132423, 131144, 129806, 128466, 127462, 127369, 128394, 129827, 130448, 129660, 127992, 126445, 125613, 125480, 125701, 125827, 125542, 124982, 124685, 124985, 125551, 125691, 125075, 124058, 123329, 123242, 123495, 123518, 123231, 123175, 123738, 124590, 125212, 125691, 126466, 127523, 128462, 129244, 130141, 130957, 131114, 130666, 130392, 130550, 130369, 129313, 128153, 128076, 129163, 130453, 131201, 131391, 131219, 130749, 130119, 129587, 129267, 129062, 128843, 128550, 128255, 128269, 128945, 130177, 131345, 131926, 131826, 130954, 129068, 126547, 124770, 124923, 126551, 127963, 128044, 127135, 126197, 125804, 126103, 127125, 128695, 130347]
54600A30347J330J019R44R17P59O17P37J007R57L03n64r11n26ON2l16n63m31o5
54581A35619L44O65O91L04l30j029j826k559k622j659k72N93P92Q64J030J066
54565A31671J081J458J926J627M48n20l72M52Q74N69P4j08pJ32J59R8M4N7O3L9
54545A39765J03K69K42j75n92m41K46Q86J166J291J419J375J010M21j84m97j45
54528A46159P12J055J15j312j585l87Q13Q07J10j05K49L59j49q35j160r64m09
54511A43473J88N31O34P34Q09N71N2k90k46j38j99k08l1J9k87o18n50r3N34J139
54491A46024J378R09N4l53j13M2k60l13L95J061O65l85q39m18N6J17J15K46K21
54472A48602J10N06J547K519K804K545K087J424O67L81Q10J209O13r05k286k739
$$ y = [130347, 131677, 132696, 133640, 134557, 135316, 135933, 136670, 137677, 138634, 138937, 138373, 137462, 136936, 136942, 136994, 136678, 136115, 135684, 135619, 135963, 136628, 137319, 137623, 137293, 136264, 134438, 131879, 129257, 127598, 127326, 127919, 128711, 129575, 130605, 131671, 132752, 134210, 136136, 137763, 138211, 137691, 137319, 137771, 138645, 139214, 139288, 139180, 139173, 139305, 139464, 139562, 139606, 139663, 139726, 139765, 139868, 140137, 140379, 140204, 139612, 139171, 139417, 140303, 141469, 142760, 144179, 145554, 146564, 146985, 146801, 146304, 146159, 146871, 147926, 148041, 146729, 145144, 144757, 145570, 146377, 146487, 146382, 146631, 146990, 146841, 146006, 144846, 143882, 143473, 143661, 144192, 144826, 145560, 146369, 146940, 146992, 146702, 146456, 146318, 146119, 145911, 145880, 145899, 145612, 144994, 144444, 144351, 144885, 146024, 147402, 148311, 148365, 148012, 147899, 147941, 147681, 147368, 147763, 148824, 149489, 149104, 148265, 147847, 147903, 148020, 148135, 148381, 148602, 148712, 149218, 150765, 153284, 156088, 158633, 160720, 162144, 162811, 163192, 164002, 165211, 165824, 164919, 162633, 159894]
54456A59894k368j599n68O12J415J288L97m10n38j92J05J72O0l07r29j339j062
54439A54631m36l62j123j975k189j874j461q83J24J307K040K112J857J535J034
54424A54337K85m41p61n90k00Q2K00L61O58P90L84m34j083j174q17k23N77J394
54406A53345J763J448Q29M45L49K30n0k94k46J78Q11J256J168O70K55J94L07L88
54388A63046M91O48O78N08L17J77o6l62l91j95k70p37r67n66j02k26n87m17J63
54369A61142L65N2o5M31J108J434J383J133P70M72N54R91J305J119N43p0m25l27
54351A71915J81N88K91o67j536j735j415r99n52O7P43J194J423J723K174K405
54335A75800J990J016O3m00m76n76p87q71q12r83j538j994j772r53j66J20j20
$$ y = [159894, 157526, 155927, 155359, 155971, 157386, 158674, 159071, 158661, 158123, 157931, 158036, 158208, 158268, 157961, 157032, 155693, 154631, 154195, 153833, 152710, 150735, 148546, 146672, 145211, 144328, 144452, 145759, 147799, 149911, 151768, 153303, 154337, 154622, 154181, 153420, 152830, 152630, 152712, 152912, 153273, 153931, 154721, 155105, 154671, 153588, 152414, 151597, 151374, 151951, 153345, 155108, 156556, 157385, 157830, 158179, 158409, 158359, 158065, 157819, 157997, 158808, 160064, 161232, 161902, 162157, 162351, 162658, 163046, 163537, 164185, 164863, 165371, 165688, 165865, 165799, 165437, 165046, 164851, 164581, 163844, 162877, 162311, 162209, 161983, 161396, 160979, 161142, 161507, 161559, 161494, 161925, 163033, 164467, 165850, 166983, 167753, 168225, 168779, 169770, 171075, 172194, 172737, 172667, 172242, 171915, 172096, 172684, 172975, 172308, 170772, 169037, 167622, 166623, 166071, 166138, 166881, 168075, 169498, 171221, 173395, 175800, 177790, 178806, 178869, 178469, 177993, 177417, 176630, 175759, 174947, 173964, 172426, 170432, 168660, 167707, 167541, 167661, 167541]
54318A67541p02j373j815j830j558j275j073r69j122j548j782j262j36Q06R66
54303A52868M62k60q67j152r78m35J97P17J052J041N26k64p69p03l37qK95O64
54285A52049Q76O55J78q4K2K15L19N35R28J017L54o08p84J84J321J462P01J52
54267A59492M41J012J011K86o86j412j628j297o75j22L18Q39J328J344Q38L83
54251A61472L64M22J80p2Q7L77K43j97l73k63m26j054j661j798j562j259j082
54234A53398j078j068o41K52Q42L40q12j282n61M20O51K51r4j52k2M40J326K092
54216A54302K020J168K61k92o74r84r09l20L79P35P88P07L33n01j338j407o41
54199A53627J18J42l12m81j04M41P85Q71P54N73O35J065J364Q55l55j404j749
$$ y = [167541, 166839, 165466, 163651, 161821, 160263, 158988, 157915, 156946, 155824, 154276, 152494, 151232, 151096, 151902, 152868, 153330, 153070, 152203, 151051, 150073, 149638, 149835, 150552, 151604, 152645, 153171, 152907, 152138, 151435, 151098, 151090, 151385, 152049, 152925, 153580, 153758, 153674, 153696, 153911, 154230, 154765, 155693, 156710, 157064, 156456, 155672, 155856, 157177, 158639, 159340, 159492, 159933, 160945, 161956, 162242, 161556, 160144, 158516, 157219, 156544, 156422, 156740, 157579, 158907, 160251, 161089, 161472, 161836, 162258, 162438, 162366, 162453, 162830, 163073, 162876, 162503, 162240, 161814, 160760, 159099, 157301, 155739, 154480, 153398, 152320, 151252, 150611, 150863, 151705, 152045, 151233, 149951, 149390, 149810, 150461, 150712, 150618, 150466, 150444, 150884, 152210, 154302, 156322, 157490, 157751, 157459, 156785, 155801, 154892, 154572, 154951, 155686, 156474, 157181, 157514, 157013, 155675, 154268, 153627, 153745, 153887, 153575, 153094, 152990, 153431, 154216, 155087, 155841, 156414, 157049, 158114, 159478, 160333, 159978, 158574, 156825]
54182A56825j618j286o60N8J78m33p73j4J150J395O87K62P56J364J083j9j074
54165A57881j407r76k97j29p80j565j440l42O19N30k83q22o27l1M32M72J09l46
54147A50998n11l10l9O4J00K65N44Q24J093J374J577J542J154M08m55q89n03L63
54129A57599Q70O09M4j89j56m10j108j680j452m28O66J068O86J55J37O48J147
54112A58206J216J011R86J299J563J282M80k26l10L3J83l0k50k96m39p44p37j69
54094A63058M32M89K68M01Q34R74O95M53M07J39n16j046q88j98L40K25m23r68
54076A64676q43j06O70J124J363J445J111M62K12O92J170R50N69R58J807J989
54060A78249J375R89J289J584J379J185J554K252K826L145L121K714K494L269
$$ y = [156825, 155207, 153921, 153261, 153319, 153497, 153064, 152291, 152277, 153427, 154822, 155509, 155771, 156527, 157891, 158974, 158955, 157881, 156474, 155498, 155201, 155072, 154292, 152727, 151287, 150945, 151564, 152094, 151811, 150989, 150362, 150331, 150763, 151235, 151344, 150998, 150487, 150177, 150138, 150202, 150302, 150567, 151111, 151935, 153028, 154402, 155979, 157521, 158675, 159083, 158628, 157739, 157236, 157599, 158469, 159078, 159122, 158933, 158777, 158367, 157259, 155579, 154127, 153699, 154365, 155433, 156119, 156274, 156411, 157059, 158206, 159422, 160433, 161419, 162718, 164281, 165563, 166043, 165817, 165507, 165540, 165723, 165693, 165443, 165147, 164708, 163964, 163227, 163058, 163490, 163979, 164247, 164648, 165482, 166456, 167151, 167604, 168011, 168150, 167634, 166588, 165700, 165502, 165842, 166067, 165644, 164676, 163833, 163727, 164397, 165521, 166884, 168329, 169440, 169902, 170114, 170806, 171976, 172926, 173495, 174453, 176260, 178249, 179624, 180613, 181902, 183486, 184865, 186050, 187604, 189856, 192682, 195827, 198948, 201662, 204156, 207425]
54046B07425M933O526P726R185J1061J2403J2504J1691J0152P286L099r11l353
54033B99727m456m941m455k517j94Q07L26l36l76j0O22J601K332J945P85J96N58
54016B91614P50Oq76q12j5M04j31j262k375l091l371l456l631l892m041m057m098
53999B57666m141l981l611l201k765k194j643j462j682j940j940j708j406j221
53985B24771j284j520j662j718k031k571k619j770p92p01j318j615j262q67p38
53970B02303n14j73k77r32j369j011j88N55J111J437J299Q68Q09J343J833J760
53954B08854J429J230R82N77N45J217J917J872J365J186J338J345J500K675M764
53939B32796O435O792O497O778P842Q898R340R296R074Q536P341N615M023L019
$$ y = [207425, 212358, 218884, 226610, 235795, 246856, 259259, 271763, 283454, 293606, 300892, 303991, 303080, 299727, 295271, 290330, 285875, 283358, 283164, 283971, 284297, 283961, 283585, 283575, 284197, 285798, 288130, 290075, 290860, 291056, 291614, 292364, 292370, 291494, 290682, 290667, 291071, 290940, 289678, 287303, 284212, 280841, 277385, 273754, 269862, 265821, 261764, 257666, 253525, 249544, 245933, 242732, 239967, 237773, 236130, 234668, 232986, 231046, 229106, 227398, 225992, 224771, 223487, 221967, 220305, 218587, 216556, 213985, 211366, 209596, 208804, 208103, 206785, 205170, 203908, 203041, 202303, 201789, 201616, 201339, 200407, 199038, 198027, 197839, 198394, 199505, 200942, 202241, 203109, 203918, 205261, 207094, 208854, 210283, 211513, 212495, 213072, 213617, 214834, 216751, 218623, 219988, 221174, 222512, 223857, 225357, 228032, 232796, 239231, 246023, 252520, 259298, 267140, 276038, 285378, 294674, 303748, 312284, 319625, 325240, 329263, 332282]
53925C32282K248J025o52j972k298j882j319p29J32J239K248K967L501L975M485
53910C45250N201O178P046P293O913O409O077N606M563L017J527N41Q3l9R9N25
53894D06289J106J542J742K000K596L423M342N690P787R913J0462Q402M098j491
53880D67901p667j3554j7654j8919j8009j6593j5449j4112j2276j0582r636r142
53868C04308q450p441o425n588m971m584m243l661k999k826l178l233k411j362
53854B42936j105j532j664j186q36j162j707j770j357r22o66n19n01o91j015j353
53838B24950j663j816j533q09o6L48N45O26K48p93j873k078j376n97k24J15P67
53821B14771J328J250P34M93Q57J474J826J757J518J501J788J967J575Q46N02
$$ y = [332282, 334530, 335555, 334903, 332931, 330633, 328751, 327432, 326703, 326835, 328074, 330322, 333289, 336790, 340765, 345250, 350451, 356629, 363675, 370968, 377881, 384290, 390367, 395973, 400536, 403553, 405080, 405621, 405704, 405665, 405764, 406289, 407395, 408937, 410679, 412679, 415275, 418698, 423040, 428730, 436517, 446430, 456892, 465294, 469392, 467901, 460234, 446680, 429026, 410107, 392098, 375505, 360056, 345944, 333668, 323086, 313450, 304308, 295858, 288417, 281992, 276404, 271433, 266849, 262606, 258945, 255946, 253120, 249942, 246709, 244298, 242936, 241831, 240299, 238635, 237449, 236613, 235451, 233744, 231974, 230617, 229695, 229029, 228510, 228009, 227318, 226303, 224950, 223287, 221471, 219938, 219129, 219063, 219411, 219956, 220582, 220830, 220037, 218164, 216086, 214710, 214113, 213889, 214004, 214771, 216099, 217349, 218083, 218576, 219433, 220907, 222733, 224490, 226008, 227509, 229297, 231264, 232839, 233685, 234187]
53806B34187P52R63P32P15J690L213M032L771L321L430L692L403K741K554L234
53791B72430M300N005M997M470L904L573L214K352J068P5j54Ln4l01l89n14j264
53774C02715k598l674l915l720l782m189m569m792m983n005m517l549k608k126
53760B48688k128k432k847l064k783k165j806j966k136j754j078q22j060j133
53746B21514p50n17j026j846j985j173j63K04j62p66j126j051n77Q8O94J143J557
53729B14058K010K279K008J161J47m91n79l71j36K02Q75J742K200J821R80N63
53713B28469J014J860K245J862J207R82J328J689J429O03jK94J255J982K026J984
53697B50228K661L855M397L599K229J640K119K613K163J111N00O50Q07K19r09
$$ y = [234187, 234939, 235902, 236634, 237349, 239039, 242252, 246284, 250055, 253376, 256806, 260498, 263901, 266642, 269196, 272430, 276730, 281735, 286732, 291202, 295106, 298679, 301893, 304245, 305313, 305388, 305234, 305237, 305183, 304882, 304493, 303979, 302715, 300117, 296443, 292528, 288808, 285026, 280837, 276268, 271476, 266493, 261488, 256971, 253422, 250814, 248688, 246560, 244128, 241281, 238217, 235434, 233269, 231463, 229497, 227361, 225607, 224529, 223707, 222647, 221514, 220764, 220247, 219221, 217375, 215390, 214217, 214054, 214258, 214096, 213330, 212204, 211153, 210576, 210664, 211358, 212501, 214058, 216068, 218347, 220355, 221516, 221663, 221172, 220593, 220222, 220086, 220288, 221163, 222905, 225105, 226926, 227906, 228469, 229483, 231343, 233588, 235450, 236657, 237639, 238967, 240656, 242085, 242688, 242687, 242981, 244236, 246218, 248244, 250228, 252889, 256744, 261141, 264740, 266969, 268609, 270728, 273341, 275504, 276615, 277115, 277765, 278572, 278791, 277882]
53682B77882j705j612r06l29l70q10j009o04O3L64J40j43k4M31P92P73N25M41
53664B73899P31J127J103M15o19j490k000k240k268k109j824j350m72O11J067
53649B64581M00o03p11L4L88k32r49q52k07L82R79J731K067J560J011J462K536
53632B73577K882K153J420J504J979K105J868J703J790J968J952J493P06K35O06
53617B97941J445J921J917K029K520L030L433M019M619M523L673L073L398L945
53603C41486L732K928K432K475K508K255K022J974J800J231M15l38q81j213j336
53588C61490j253r93o49m19m36n25l43J39N40N45L20L19Q47J815K689K740J738
53571C68564L58n33r55j612k634l243k881j962j195q05p75j138j617j611j062
$$ y = [277882, 276177, 274565, 273659, 273330, 272960, 272150, 271141, 270537, 270600, 270964, 271104, 270961, 270937, 271368, 272160, 272933, 273458, 273899, 274630, 275757, 276860, 277275, 276656, 275166, 273166, 270926, 268658, 266549, 264725, 263375, 262903, 263514, 264581, 264981, 264378, 263667, 263701, 264089, 263857, 262908, 262056, 261849, 262231, 263210, 264941, 267008, 268568, 269579, 271041, 273577, 276459, 278612, 280032, 281536, 283515, 285620, 287488, 289191, 290981, 292949, 294901, 296394, 297100, 297335, 297941, 299386, 301307, 303224, 305253, 307773, 310803, 314236, 318255, 322874, 327397, 331070, 334143, 337541, 341486, 345218, 348146, 350578, 353053, 355561, 357816, 359838, 361812, 363612, 364843, 365258, 364920, 364039, 362826, 361490, 360237, 359244, 358595, 358176, 357740, 357215, 356872, 357011, 357551, 358096, 358416, 358735, 359582, 361397, 364086, 366826, 368564, 368922, 368389, 367434, 365822, 363188, 359945, 357064, 355102, 353907, 353102, 352327, 351189, 349572, 347961, 346899]
53556C46899o84q46q97k59O42J201J661K369K720K008Q57N43J144J589J425J292
53540C61664J550J769J805K279L450M623N153N272N428N583N685O094O972P856
53526D25183Q414R069J0237J1451J1975J1913J2053J2761J3670J4370J4830J5175
53514E71101J5492J5989J6989J8540K0215K1377K1732K1620K1750K2477K3462
53503G90744K4092K4155K3795K3065K1994K0975K0512K0420J9929J8769J7666
53492A026116J7434J8031J8762J9049J8721J8011J7485J7591J7993J7860J7007
53481A224060J6175J5846J5540J4795J4056J3797J3444J2169J0347R026Q211O833
53469A374299M443J759o80l246o158q747j0456j1736j3180j4455j4968j5070j5586
$$ y = [346899, 346215, 345369, 344472, 344213, 344855, 346056, 347717, 350086, 352806, 354814, 355671, 356214, 357358, 358947, 360372, 361664, 363214, 364983, 366788, 369067, 372517, 377140, 382293, 387565, 392993, 398576, 404261, 410355, 417327, 425183, 433597, 442666, 452903, 464354, 476329, 488242, 500295, 513056, 526726, 541096, 555926, 571101, 586593, 602582, 619571, 638111, 658326, 679703, 701435, 723055, 744805, 767282, 790744, 814836, 838991, 862786, 885851, 907845, 928820, 949332, 969752, 989681, 1008450, 1026116, 1043550, 1061581, 1080343, 1099392, 1118113, 1136124, 1153609, 1171200, 1189193, 1207053, 1224060, 1240235, 1256081, 1271621, 1286416, 1300472, 1314269, 1327713, 1339882, 1350229, 1359255, 1367466, 1374299, 1378742, 1380501, 1379821, 1376575, 1370417, 1361670, 1351214, 1339478, 1326298, 1311843, 1296875, 1281805, 1266219]
53456A266219j6460j6875j6737j7010j8357k0201k1535k2020k1939k1475k0594
53445A053016j9411j8232j7298j6726j6486j6290j5613j4178j2220j0104p899
53434H88559n621l632k334j596r19j37N72J354K710M685O536P569P918Q200Q782
53419I22646R789J1409J3684J6127J8063J9347K0374K1464K2625K3876K5395K7232
53407A152031K9158L0890L2327L3528L4623L5666L6583L7407L8613M0800M3805
53396A545431M6596M8475M9918N1616N3203N3794N3542N3546N4180N4506N3672
53385B118479N1995N0249M8658M7064M5399M3433M0770L7516L4429L1775K8721
53374B578488K4490J9576J5033J1071P241L523J96l277q164j5053k3168l1187
$$ y = [1266219, 1249759, 1232884, 1216147, 1199137, 1180780, 1160579, 1139044, 1117024, 1095085, 1073610, 1053016, 1033605, 1015373, 998075, 981349, 964863, 948573, 932960, 918782, 906562, 896458, 888559, 882938, 879306, 876972, 875376, 874457, 874320, 874892, 876246, 878956, 883641, 890177, 897746, 905664, 913864, 922646, 932435, 943844, 957528, 973655, 991718, 1011065, 1031439, 1052903, 1075528, 1099404, 1124799, 1152031, 1181189, 1212079, 1244406, 1277934, 1312557, 1348223, 1384806, 1422213, 1460826, 1501626, 1545431, 1592027, 1640502, 1690420, 1742036, 1795239, 1849033, 1902575, 1956121, 2010301, 2064807, 2118479, 2170474, 2220723, 2269381, 2316445, 2361844, 2405277, 2446047, 2483563, 2517992, 2549767, 2578488, 2602978, 2622554, 2637587, 2648658, 2655899, 2659422, 2659618, 2656341, 2648177, 2633124, 2609956, 2578769]
53362B578769l8179m3725m7803n0780n3019n4496n5121n5323n5632n5796n5023
53351B013872n3176n1007m9036m6992m4667m2562m1274m0776m0691m0783m0781
53340A522127m0245l9094l7865l6930l5745l3480l0151k6705k4106k2659k1923
53329A173224k0971j8953j5941j3027j1249j0585j0425j0581j1173j1755j1445
53318A027119j0088q561p616p022o176n017l838k555q54J107K695L601M176M868
53304I91839N750O787Q187J0031J1838J3015J3764J5037J7317J9887K1638K2404
53292A157494K3012K4111K5425K6309K6585K6571K6544K6406K5851K4634K2783
53281A435725K0648J8619J6711J4561J1951R184O750M752K778K85k976o734j0206
$$ y = [2578769, 2540590, 2496865, 2449062, 2398282, 2345263, 2290767, 2235646, 2180323, 2124691, 2068895, 2013872, 1960696, 1909689, 1860653, 1813661, 1768994, 1726432, 1685158, 1644382, 1603691, 1562908, 1522127, 1481882, 1442788, 1404923, 1367993, 1332248, 1298768, 1268617, 1241912, 1217806, 1195147, 1173224, 1152253, 1133300, 1117359, 1104332, 1093083, 1082498, 1072073, 1061492, 1050319, 1038564, 1027119, 1017031, 1008470, 1000854, 993832, 987656, 982639, 978801, 976246, 975392, 976499, 979194, 982795, 986971, 991839, 997589, 1004376, 1012563, 1022594, 1034432, 1047447, 1061211, 1076248, 1093565, 1113452, 1135090, 1157494, 1180506, 1204617, 1230042, 1256351, 1282936, 1309507, 1336051, 1362457, 1388308, 1412942, 1435725, 1456373, 1474992, 1491703, 1506264, 1518215, 1527399, 1534149, 1538901, 1541679, 1541964, 1538988, 1532254, 1522048]
53268A522048j2602j3895j4979j6745j9086k1111k2337k3259k4601k6336k7795
53257A299302k8562k8953k9546l0484l1327l1497l0746k9247k7364k5512k4126
53246I81938k3546k3757k4242k4314k3711k2811k2181k1923k1593k0847j9954
53235G33059j9420j9233j8824j7852j6601j5386j3991j2176j0424r513r383r091
53223E61165q101o983o589p055q003r187j0456j1399j1659j1432j1188j1008j0625
53210D37480r966r186q337p493p031p182p388o833n594m619m380m343m081m073
53196C46974m836n897o365o162n901n739n176m033k911k433k550k784k816k553
53182B86818k039j509j321j497j628j441j261j541k120k351j945j303q81o46l77
$$ y = [1522048, 1509446, 1495551, 1480572, 1463827, 1444741, 1423630, 1401293, 1378034, 1353433, 1327097, 1299302, 1270740, 1241787, 1212241, 1181757, 1150430, 1118933, 1088187, 1058940, 1031576, 1006064, 981938, 958392, 934635, 910393, 886079, 862368, 839557, 817376, 795453, 773860, 753013, 733059, 713639, 694406, 675582, 657730, 641129, 625743, 611752, 599576, 589152, 579639, 570256, 561165, 553064, 546081, 539492, 532437, 524434, 515247, 504791, 493392, 481733, 470301, 459113, 448105, 437480, 427514, 418328, 409991, 402498, 395467, 388285, 380897, 374064, 368470, 363851, 359471, 355128, 351047, 346974, 342138, 336241, 329876, 323714, 317813, 312074, 306898, 302865, 299954, 297521, 294971, 292187, 289371, 286818, 284779, 283270, 281949, 280452, 278824, 277383, 276122, 274581, 272461, 270110, 268165, 266862, 265981, 265335, 264958]
53167B64958k68p63j808k590k295j018K40N79M4n30n10p7J18k75j057j888k531
53150B50329k712k111q86J04R3o87j253j120p81q31j119j092o22p9K27K99K23
53133B37982Q5N3K55N32N78K70k70q23j057o37L30J155J230P93N50P21R11Q50
53115B43508P06O64O90Q58J284J610J148j26j297j608j385j415j821k115j993
53100B38708j586j071n83l56m37l61L43J364J798J264L33k49m19o32j098j490
53084B35528j417j003q31j238j741j532n55K87K19m59q52n94q5K24K72J79P8J73
53066B26653N43Q91P86K18l72o23m73J2O19Q41K81p35j380j332j089j139j266
53049B22435r76k87K58K06l53p91m21P79J853J728M68p07r30p29j158k291l098
$$ y = [264958, 264690, 263927, 262119, 259529, 257234, 256216, 256456, 257035, 257079, 256549, 256039, 255962, 256080, 255805, 254748, 252860, 250329, 247617, 245506, 244620, 244724, 244817, 244130, 242877, 241757, 240976, 240145, 239026, 237934, 237312, 237233, 237460, 237759, 237982, 238067, 238120, 238375, 238907, 239485, 239755, 239485, 238662, 237605, 236968, 237298, 238453, 239683, 240476, 241026, 241747, 242658, 243508, 244214, 244878, 245568, 246426, 247710, 249320, 250468, 250342, 249045, 247437, 246052, 244637, 242816, 240701, 238708, 237122, 236051, 235468, 235112, 234675, 234314, 234657, 236021, 237819, 239083, 239416, 239167, 238748, 238116, 237018, 235528, 234111, 233108, 232277, 231039, 229298, 227766, 227211, 227498, 227717, 227258, 226406, 225812, 225727, 225951, 226223, 226402, 226480, 226653, 227196, 228087, 228873, 229091, 228719, 228096, 227623, 227635, 228254, 229095, 229376, 228641, 227261, 225929, 224840, 223701, 222435, 221459, 221172, 221430, 221636, 221283, 220492, 220071, 220850, 222703, 224431, 224899, 224192, 223262, 222533, 221375, 219084, 215986]
53032B15986k684j172N52J576J472N32m36p75n20j41J58N70J150J558J491J128
53016B20445Q76Q68Q66O64L13n9m06o64o25j68M04N43J33k64o1N70Q85N04j39
52997B24685m45m83q65j804k549k062l28J309J510N34o2N67J498J436N30P8O20
52980B24169J334J304O11j52o68q47m86M75J612K328K335J759J022O66R15J283
52964B37660J074L41j47rL10M53P06J236J422O45p46j867k302k152j531o58j03
52947B34332k33o73q70q63q86o86m2M18j08j228j662r35J16O06M81P3m04o94o36
52928B26106o49j254j991j748m56N17K01o84r27n01k18l37m31k62RL30P35R74
52910B19414Q17N19M44L93o9p49r71n76j17om5MJ2j40j91M8K32j26r08j360q66
$$ y = [215986, 213302, 212130, 212682, 214258, 215730, 216262, 215826, 215051, 214531, 214390, 214548, 215118, 216268, 217826, 219317, 220445, 221321, 222189, 223055, 223719, 224032, 223973, 223567, 222903, 222278, 222110, 222514, 223057, 223190, 222926, 222865, 223435, 224320, 224824, 224685, 224240, 223757, 222892, 221088, 218539, 216477, 216149, 217458, 218968, 219502, 219440, 220007, 221505, 222941, 223471, 223549, 224169, 225503, 226807, 227418, 227266, 226598, 225751, 225265, 225740, 227352, 229680, 232015, 233774, 234796, 235462, 236377, 237660, 238734, 239075, 238928, 238919, 239229, 239682, 240388, 241624, 243046, 243691, 242945, 241078, 238776, 236624, 235093, 234435, 234332, 234099, 233426, 232556, 231693, 230807, 230121, 230079, 230497, 230389, 229161, 227499, 226564, 226680, 227286, 227767, 227840, 227436, 226742, 226106, 225457, 224203, 222212, 220464, 220008, 220525, 220726, 220042, 219115, 218614, 218396, 218059, 217628, 217366, 217375, 217705, 218440, 219414, 220231, 220750, 221194, 221587, 221518, 220769, 219798, 219222, 219105, 219099, 219054, 219058, 219070, 218930, 218739, 218787, 219019, 218893, 217985, 216625, 215759]
52889B15759L89J564J900J367N79J77K35L17N8m20o78m72kL89O08P70Q02M40k29
52870B23553n76j17Q16J457J521J277R90Q02J100K163L424L760K895J811J414
52855B46290J444J151M47k82j025k050l194l939m133m030l809l505l240l037k565
52840B14523j656q28o99j043j103p25m34m64m64k77j69j76O8O09R75R94J068J321
52822B11520J239O07R1K35N36K04n65r39p26m52l14J02R47J708J959J973K255
52805B20380K807L125K691J382m02j875k442k233j892j852j996k124k293k550
52791B10726k669k451k051j742j533j262r60p52n43j06M91R05J027J134J437J744
52775B03395J801J708J670J567J176O68M57N30M60K19L89J188J753J078n71j817
$$ y = [215759, 216148, 217712, 219612, 220979, 221558, 221735, 221970, 222287, 222345, 221925, 221247, 220775, 220773, 221162, 221770, 222540, 223342, 223782, 223553, 222977, 222860, 223676, 225133, 226654, 227931, 228921, 229723, 230823, 232986, 236410, 240170, 243065, 244876, 246290, 247734, 248885, 249332, 249050, 248025, 245975, 242781, 238842, 234709, 230679, 226870, 223365, 220125, 217088, 214523, 212867, 212039, 211340, 210297, 209194, 208469, 208035, 207571, 207107, 206830, 206661, 206485, 206553, 207162, 208137, 209131, 210199, 211520, 212759, 213366, 213457, 213692, 214228, 214432, 213867, 212928, 212202, 211750, 211436, 211538, 212485, 214193, 216152, 218125, 220380, 223187, 226312, 229003, 230385, 229983, 228108, 225666, 223433, 221541, 219689, 217693, 215569, 213276, 210726, 208057, 205606, 203555, 201813, 200280, 199018, 198058, 197306, 196763, 196657, 197148, 198053, 199080, 200214, 201651, 203395, 205196, 206904, 208574, 210141, 211317, 211985, 212442, 212972, 213432, 213651, 214040, 215228, 216981, 218059, 217488, 215671]
52759B15671j776q69QM96O44L95k09o35l10N26R35L75o33j095o18K77P97P12N73
52740B15264J020J969K613K362J548R78R38J009P88L82P8p3j16J21Q10J657K043
52723B33391J658Q04km95o66n49k35m1l27j041j674j797j542j310j178q93m55
52706B23648k66n42r27r89q38p72o19K4Q70J012J71p28p32j48rm93o80J00J343
52687B19425K135K194J818J212M55j82l82j67K05O28J042J127N94k28o41n16m26
52670B28293o98q95n60K7K71Q8k33o64j318j840j528k82J145J957K077J899J733
52653B29472J680J831K239K819L404L768L558K479O91j198k728l916m778m911
52639B34410l916k099l82N44O90M44J44J1J57M49N97N46P05J539K944M111M152
$$ y = [215671, 213895, 213026, 213034, 213530, 214174, 214569, 214360, 213725, 213415, 213941, 214876, 215251, 214618, 213523, 212905, 213182, 213979, 214691, 215264, 216284, 218253, 220866, 223228, 224776, 225754, 226692, 227701, 228489, 228871, 228949, 228876, 228760, 228881, 229691, 231348, 233391, 235049, 235853, 235851, 235356, 234690, 234141, 233906, 233865, 233538, 232497, 230823, 229026, 227484, 226174, 224996, 224103, 223648, 223382, 222840, 221913, 220924, 220086, 219314, 218695, 218719, 219589, 220601, 220772, 220044, 219312, 219164, 219155, 218662, 217982, 218082, 219425, 221560, 223754, 225572, 226784, 227239, 227057, 226675, 226508, 226713, 227341, 228383, 229510, 230104, 229876, 229235, 228719, 228293, 227595, 226700, 226140, 226167, 226438, 226526, 226293, 225629, 224311, 222471, 220943, 220661, 221806, 223763, 225840, 227739, 229472, 231152, 232983, 235222, 238041, 241445, 245213, 248771, 251250, 251941, 250743, 248015, 244099, 239321, 234410, 230494, 228395, 228013, 228557, 229247, 229691, 229835, 229846, 230003, 230452, 231049, 231595, 232300, 233839, 236783, 240894, 245046]
52622B45046K880R73p00j839k703l437l767l453k714j888q91M47J681J974J210
52607B32819L14J34M40M64J35J39Q14J603J780J319O81J10n11j187j570j321m93
52590B35670M39R21O71q1o70n05L84J367J867J858J644J350R08M58L27M97M36
52573B47541k21j064j305o99J80O47N13Jo51j293j827k162k194j790r91j76K49
52556B34758L84O71J126J180N50k20n04n05p50j045o76L74J187J081L70k77o35
52539B37069q26r20j040j339j509q42P10K005J910P01l65o58n74n06k80K17O16
52522B34369O02L70K51K78L45M26M59M37P38J821L360M268L961L089K557K360
52506B59691J982J474J294J337R52K1q52j302j630k013k062j614j338j806k386
$$ y = [245046, 247926, 248899, 248199, 246360, 243657, 240220, 236453, 233000, 230286, 228398, 227507, 227954, 229635, 231609, 232819, 233133, 233267, 233707, 234171, 234306, 234445, 235259, 236862, 238642, 239961, 240642, 240752, 240241, 239054, 237484, 236163, 235670, 236109, 237030, 237701, 237620, 236950, 236445, 236829, 238196, 240063, 241921, 243565, 244915, 245823, 246281, 246608, 247105, 247541, 247320, 246256, 244951, 244252, 244432, 245079, 245592, 245593, 244942, 243649, 241822, 239660, 237466, 235676, 234685, 234509, 234758, 235142, 235813, 236939, 238119, 238669, 238449, 237945, 237440, 236690, 235645, 234969, 235343, 236530, 237611, 237981, 237704, 237069, 236243, 235323, 234283, 232944, 231435, 230593, 231303, 233308, 235218, 235919, 235554, 234896, 234322, 233816, 233536, 233753, 234369, 234971, 235341, 235592, 235870, 236215, 236641, 237100, 237537, 238275, 240096, 243456, 247724, 251685, 254774, 257331, 259691, 261673, 263147, 264441, 265778, 266730, 266751, 265899, 264597, 262967, 260954, 258892, 257278, 255940, 254134, 251748]
52491B51748j961o41J74l40j263j177n4R27J150J250J845K475K405J844J535J462
52475B61379R17j45p26j79Q36J298J114Q48O68K88k42m47j00N95J423K274K815
52458B72616K700K069J354N86n30j784k458k394k313k721l101k789k054j663j697
52443B55821j563j054o40o61q11o96m12l67o96j144j326j019k92N15R71Q35K21
52426B47682m77q03n54O0N63O46L32j95p12q74m33L21O81M42L43J139K458L215
52408B53834L032K684L094M386O013P356Q023Q130Q360R235R995Q862M929n57
52394C37376n279p897q610q197p287o363n598m619l009j227l08n09q84n47K88
52379B77330Q81J034R97P88L32l7J24O58J114J576K475L513L807L266K959L539
$$ y = [251748, 249787, 249146, 249320, 248980, 247717, 246540, 246486, 247413, 248563, 249813, 251658, 254133, 256538, 258382, 259917, 261379, 262296, 262151, 261425, 261246, 262082, 263380, 264494, 265342, 266010, 266298, 266056, 265609, 265509, 266104, 267527, 269801, 272616, 275316, 277385, 278739, 279325, 278795, 277011, 274553, 272159, 269846, 267125, 264024, 261235, 259181, 257518, 255821, 254258, 253204, 252564, 251903, 251092, 250396, 249984, 249617, 248921, 247777, 246451, 245432, 245140, 245655, 246626, 247461, 247682, 247205, 246402, 245848, 245908, 246471, 247117, 247449, 247254, 246542, 245668, 245235, 245556, 246237, 246679, 247022, 248161, 250619, 253834, 256866, 259550, 262644, 267030, 273043, 280399, 288422, 296552, 304912, 314147, 324142, 333004, 337933, 337376, 332097, 324200, 315590, 307393, 300106, 293743, 288145, 283526, 280517, 279290, 278982, 278473, 277589, 277042, 277330, 278211, 279245, 280242, 281030, 281362, 281325, 281449, 282107, 283221, 284797, 287272, 290785, 294592, 297858, 300817, 304356]
52363C04356M048L158J068p29j349j280j251j289j173j045j061q99j71R04J765
52348C05052K183K307K159J542N48k61m09k8L16L04K01N56J592K957M049M534
52332C27602M508M280M158M441N316O621P861Q605Q865R022R447J0211J1017J1385
52318D33339J1060J0260R448Q820Q337Q142Q547R344R693R129Q338Q431R564J0881
52304E63333J1658J2022J2453J3144J4038J5016J5745J5727J4806J3416J2108
52293G13466J0949R598P832N823M024K792J996J084j93j215j178l43N0n78j353
52278G52754j270o86o52j222j412p91q9Nk45k56l6J62N60J625L257M744N499N522
52260G67469N199M931M947N243N749O585P998R866J1525J2350J2369J2082J1790
$$ y = [304356, 308404, 311562, 312630, 311901, 310552, 309272, 308021, 306732, 305559, 304514, 303453, 302554, 302383, 303287, 305052, 307235, 309542, 311701, 313243, 313791, 313530, 313121, 313093, 313409, 313713, 313914, 314470, 316062, 319019, 323068, 327602, 332110, 336390, 340548, 344989, 350305, 356926, 364787, 373392, 382257, 391279, 400726, 410937, 421954, 433339, 444399, 454659, 464107, 472927, 481264, 489406, 497953, 507297, 516990, 526119, 534457, 542888, 552452, 563333, 574991, 587013, 599466, 612610, 626648, 641664, 657409, 673136, 687942, 701358, 713466, 724415, 734013, 741845, 747668, 751692, 754484, 756480, 757564, 757371, 756156, 754978, 754635, 754685, 754107, 752754, 751484, 750798, 750146, 748924, 747512, 746721, 746632, 746637, 746392, 746136, 746100, 746262, 746822, 748447, 751704, 756448, 761947, 767469, 772668, 777599, 782546, 787789, 793538, 800123, 808121, 817987, 829512, 841862, 854231, 866313, 878103]
52247H78103J1407J0771R861Q726P503O411N523M574L275J834Q46O14P63P00K41
52232I51152k84m53j84K22L43q4j148k784m588n696n400m058k939k796l023k696
52216I15584k007j931k602k983k282r65K4M66Q84J731L023M428N405N448M548
52201I28771L272K260J792J980K920M351N569O066O042O020O201O479O729O747
52187I95199O236N279M479M155L695K287M2k205m004n507o766p491p607p390o975
52172I73427o368n937o128o559o171m707l293k965l232k777j228N34J644K078
52158I28318K131J719O69o14j188n00R08J790J502O56L25P32J211J353J579K340
52142I42931L278L616L039J788J86j440k607k989k867k887l241l435k866j502
$$ y = [878103, 889510, 900281, 910142, 918868, 926371, 932782, 938305, 942879, 946154, 947988, 948834, 949448, 950211, 950911, 951152, 950868, 950415, 950231, 950453, 950796, 950712, 949564, 946780, 942192, 936496, 931096, 927038, 924099, 921303, 918280, 915584, 913577, 911646, 909044, 906061, 903779, 902814, 902838, 903304, 904188, 905919, 908942, 913370, 918775, 924223, 928771, 932043, 934303, 936095, 938075, 940995, 945346, 950915, 956981, 963023, 969043, 975244, 981723, 988452, 995199, 1001435, 1006714, 1011193, 1015348, 1019043, 1021330, 1021372, 1019167, 1015163, 1009656, 1002890, 995399, 987792, 980402, 973427, 967059, 961122, 954994, 948435, 942264, 937557, 934264, 931299, 928067, 925290, 924062, 924596, 926240, 928318, 930449, 932168, 932837, 932223, 931035, 930535, 931443, 933233, 934735, 935391, 935716, 936448, 937659, 939012, 940591, 942931, 946209, 949825, 952864, 954652, 954838, 953398, 950791, 947802, 944935, 942048, 938807, 935372, 932506, 931004]
52128I31004J91J764L241N051P418R881J1649J2504J3057J3917J4961J5697J5958
52115A056293J5883J5479J4708J3845J3204J2593J1553J0065Q618P575O996O982
52103A193794P688Q872J0018J1010J2143J3320J3878J3533J2892J2533J2059J0655
52091A332395Q203N199J839k036o070r209j0672j0706j0153r634r368r358r416
52078A261014r135q228o888n659m991m990n394n635n088l552j491L61J620K369
52064A204313K811L078L345L815M469N029N312N531O035O869P703Q099P848P056
52050A281313O034N080M241L337K159O63j006k547l667m327m857n558o245o433
52036A268187o064n695n802o229o540o583o404o033n709n991p059q187q576q524
$$ y = [931004, 931195, 932959, 936200, 941251, 948669, 958550, 970199, 982703, 995760, 1009677, 1024638, 1040335, 1056293, 1072176, 1087655, 1102363, 1116208, 1129412, 1142005, 1153558, 1163623, 1172241, 1179816, 1186812, 1193794, 1201482, 1210354, 1220372, 1231382, 1243525, 1256845, 1270723, 1284256, 1297148, 1309681, 1321740, 1332395, 1340598, 1345797, 1347636, 1345600, 1339530, 1330321, 1319649, 1308943, 1298790, 1289156, 1279788, 1270430, 1261014, 1251879, 1243651, 1236763, 1231104, 1226113, 1221123, 1215729, 1210094, 1205006, 1201454, 1199963, 1200324, 1201944, 1204313, 1207124, 1210202, 1213547, 1217362, 1221831, 1226860, 1232172, 1237703, 1243738, 1250607, 1258310, 1266409, 1274257, 1281313, 1287347, 1292427, 1296668, 1300005, 1302164, 1302827, 1301821, 1299274, 1295607, 1291280, 1286423, 1280865, 1274620, 1268187, 1262123, 1256428, 1250626, 1244397, 1237857, 1231274, 1224870, 1218837, 1213128, 1207137, 1200078, 1191891, 1183315, 1174791]
52022A174791q984j0010j0573j0154r542r570r808r380q443p938q041p915p023
52009A057410n955n570n951o638p442q581j0149j1968j3899j5907j7784j9093
51997I28473j9631j9669j9492j8808j7160j4841j2947j2191j2136j1936j1483
51986G58179j1274j1445j1664j1821j2159j2583j2600j2142j1821j2086j2685
51975F25899j3183j3473j3428j2702j1269r606p886n602k551M19K333L317M216
51962E46484N430O720P869Q721Q908Q194O853N094K519r69m219n807n837n683
51948E84277o031o243n734m789l738k337l95J828M221O996R930J2164J3250J3627
51934F17026J3735J3409J2569J1612J0548Q541N022O86l286o474r107j1331j3221
$$ y = [1174791, 1165807, 1155797, 1145224, 1135070, 1125528, 1115958, 1106150, 1096770, 1088327, 1080389, 1072348, 1064433, 1057410, 1051455, 1045885, 1039934, 1033296, 1025854, 1017273, 1007124, 995156, 981257, 965350, 947566, 928473, 908842, 889173, 869681, 850873, 833713, 818872, 805925, 793734, 781598, 769662, 758179, 746905, 735460, 723796, 711975, 699816, 687233, 674633, 662491, 650670, 638584, 625899, 612716, 599243, 585815, 573113, 561844, 552238, 544352, 538750, 536199, 536618, 538951, 542268, 546484, 551914, 558634, 566503, 575224, 584132, 592326, 599179, 604273, 606792, 605823, 601604, 595797, 589960, 584277, 578246, 572003, 566269, 561480, 557742, 555405, 555010, 556838, 561059, 568055, 577985, 590149, 603399, 617026, 630761, 644170, 656739, 668351, 678899, 687440, 692462, 693148, 689862, 683388, 674281, 662950, 649729]
51921F49729j5029j6695j7592j7408j6760j6217j5315j3422j1051r288q234p050
51909D85668n439l958k846j526M40K751M994P156R250J1049J2472J3712J4710
51896E48433J5065J4665J3984J3491J3267J3269J3369J2750R918L985m181j2440
51884F55575j8833k2406k3111k1571j8839j5834j2833r625o135k654M94L170N276
51871E12674O622P122O906O102M531J929j534n105p905r473r796r117p943o942
51857D88071o407n855m636k912j560r64n44K74J100J045k06k195m279n925o712
51842D48295o546n824n027m311l697l400l548l774l487k466r48O39J809K235K129
51827D12079K077K186J969J345J027J291J193n6j624k191k001k240k720j912M65
$$ y = [649729, 634700, 618005, 600413, 583005, 566245, 550028, 534713, 521291, 510240, 500952, 492718, 485668, 480229, 476271, 473425, 471899, 472339, 475090, 480084, 487240, 496490, 507539, 520011, 533723, 548433, 563498, 578163, 592147, 605638, 618905, 632174, 645543, 658293, 668211, 672196, 668015, 655575, 636742, 614336, 591225, 569654, 550815, 534981, 522148, 512523, 506388, 503734, 504228, 507398, 512674, 519296, 526418, 533324, 539426, 543957, 545886, 544352, 539247, 531342, 521869, 512073, 502956, 495013, 488071, 481664, 475809, 471173, 468261, 466701, 465737, 465193, 465467, 466567, 467612, 467406, 465211, 460932, 455007, 448295, 441749, 435925, 430898, 426587, 422890, 419490, 415942, 412168, 408681, 406215, 405267, 405906, 407715, 409950, 412079, 414156, 416342, 418311, 419656, 420683, 421974, 423167, 423111, 421487, 419296, 417295, 415055, 412335, 410423, 410888]
51812D10888K616L029K301J801J788J740J515J101O0j712l265l652l261l150l440
51797D08359l375k598j524n30K66N67J3j156k176k537k246j518o20O0L13K92Q4
51780C91674n58j591k337k308j927j696j268j97Q57R93P80J753M103O307P293
51765D01878P702Q419R028Q586P141N559M308L160J724k33k676n094o745p388
51751D35369p475p390p121o786o694o467n106k590n15j16m33L73K384M036M598
51736C96067N036O156P385Q019Q465R242R589Q198N072J709n51j610j976j731
51722D59070n75J386L328M249L646J717r82l814o037o843n874l662j356J17M50
51707D44820k98j853l484m068k884k99K481M344M796L880J932n42k898m404m445
$$ y = [410888, 413504, 416533, 418834, 420635, 422423, 424163, 425678, 426779, 426839, 425127, 421862, 418210, 414949, 411799, 408359, 404984, 402386, 400862, 400332, 400598, 401165, 401178, 400022, 397846, 395309, 393063, 391545, 390925, 390985, 391298, 391590, 391674, 391116, 389525, 387188, 384880, 382953, 381257, 379989, 379792, 380649, 381642, 382422, 384175, 388278, 394585, 401878, 409580, 417999, 427027, 435613, 442754, 448313, 452621, 455781, 457505, 457272, 454596, 449502, 442757, 435369, 427894, 420504, 413383, 406597, 399903, 393436, 388330, 385740, 385225, 385109, 384676, 385049, 387433, 391469, 396067, 401103, 407259, 414644, 422663, 431128, 440370, 449959, 458157, 463229, 464938, 464387, 462777, 460801, 459070, 458495, 459881, 463209, 467458, 471104, 472821, 471839, 468025, 461988, 455145, 449271, 445609, 444253, 444370, 444820, 444522, 442669, 439185, 435117, 432233, 431934, 434415, 438759, 443555, 447435, 449367, 448825, 445927, 441523, 437078]
51692D37078k895m57J642K586K484J900J010m64k642n114p238q542q799p969o234
51677C96346l942j448R11K741L717L834L373K592J649Q78P64J407K308L023L866
51662D22019N447P495Q696P964N571K638j71k903n387o803o568n122l369j500
51648D28007R77M139P205R246R807Q620N408N60m416p916r630j0384j0763j0554
51634D20306r556q136o632m910l003j607j289j519j229q0J407K790L991M652M122
51619C99307K368L02j264k429l616m701n252n249m920m204l043k002j763k021
51605C61513j734o25L71N33M12Q62J681K103K239L068M970P214R102J0876J2968
51590D15553J4960J5820J4815J1811P093J525l349o118o616n874m891l832k383
$$ y = [437078, 434183, 433726, 435368, 437954, 440438, 442338, 443348, 442884, 440242, 435128, 427890, 419348, 410549, 402580, 396346, 392404, 390956, 391867, 394608, 398325, 402159, 405532, 408124, 409773, 410651, 411415, 412822, 415130, 418153, 422019, 427466, 434961, 443657, 451621, 457192, 459830, 459659, 456756, 451369, 444566, 437998, 432876, 429507, 428007, 428984, 433123, 440328, 449574, 459381, 468001, 473409, 473969, 469553, 461637, 452007, 441623, 430860, 420306, 410750, 402614, 395982, 391072, 388069, 386462, 385173, 383654, 382425, 382345, 383752, 386542, 390533, 395185, 399307, 401675, 401977, 400713, 398284, 394668, 389967, 384715, 379466, 374546, 370342, 367299, 365297, 363534, 361513, 359779, 359154, 359525, 360058, 360470, 361332, 363013, 365116, 367355, 370423, 375393, 382607, 391709, 402585, 415553, 430513, 446333, 461148, 472959, 480052, 481577, 478228, 472110, 465494, 459620, 454729, 450897, 448514]
51577D48514m14J935M534P348J0345J3338J5809J7031J6807J6082J6310J7934
51565E85573J9780K0190J8589J5877J3704J3554J6076K0805K6683L3042L9728
51554H23601M6000M9855M9189M3499L4071K2706J0895j84r885j8567k7044l5184
51542I88952m1615m5212m6376m6393m5956m4771m2286l8347l3291k7894k3058
51531E53753j9171j5880j2794j0237q817q376p888o619m892l583l086l133l355
51518D45922l734m343m900m863m039k902k142j983k153k410k766l125l157k792
51504D00613k462k519k687k497k009j647j386p25M88J698K345K618L124M040M903
51489D03897N178M804M058L101J868L91j023k070k858l718m661n263n233m768
$$ y = [448514, 448100, 450035, 454569, 461917, 472262, 485600, 501409, 518440, 535247, 551329, 567639, 585573, 605353, 625543, 644132, 660009, 673713, 687267, 703343, 724148, 750831, 783873, 823601, 869601, 919456, 968645, 1012144, 1046215, 1068921, 1079816, 1079632, 1069747, 1051180, 1024136, 988952, 947337, 902125, 855749, 809356, 763400, 718629, 676343, 637996, 604705, 576811, 553753, 534582, 518702, 505908, 495671, 486854, 478478, 470590, 463971, 459079, 455496, 452410, 449277, 445922, 442188, 437845, 432945, 428082, 424043, 421141, 418999, 417016, 414863, 412453, 409687, 406562, 403405, 400613, 398151, 395632, 392945, 390448, 388439, 386792, 385406, 384681, 385169, 386867, 389212, 391830, 394954, 398994, 403897, 409075, 413879, 417937, 421038, 422906, 423297, 422274, 420204, 417346, 413628, 408967, 403704, 398471, 393703]
51475C93703m232l764l395l273l406l412k920k138j697j933k634l371l801l715
51461C50012l093k169j283o93o61j263j921j586l3J462J562P40P17K069L557M160
51445C51577M498N617P383R124J1036J3667J6269J7080J5303J1883Q135M642J888
51432D78102Q88K235M822O348N196J499l450q352j2343j4788j5238j3865j1680
51419D19374r894q873p921o357m452k982k113j352n06K1Q8L12J223K388K951K747
51403C84654K380K310K504K842L342L803L895L758L972M682N220N161N205O330
51389D40058Q360J0167J1271J2267J3572J4675J5239J6138J8549K2469K7018L1863
51377F41646L7384M3464M9193N4009N8108O1281O2156N9283N2475M2533L0183
$$ y = [393703, 389471, 385707, 382312, 379039, 375633, 372221, 369301, 367163, 365466, 363533, 360899, 357528, 353727, 350012, 346919, 344750, 343467, 342774, 342113, 340850, 338929, 337343, 337310, 338772, 340334, 341074, 341791, 343860, 347417, 351577, 356075, 361692, 369075, 378199, 389235, 402902, 419171, 436251, 451554, 463437, 471572, 476214, 478102, 478990, 481225, 486047, 492395, 497591, 499090, 495640, 487288, 474945, 460157, 444919, 431054, 419374, 409480, 400607, 392686, 386329, 381877, 378895, 376782, 375430, 374924, 374945, 375033, 375345, 376568, 378956, 381907, 384654, 387034, 389344, 391848, 394690, 398032, 401835, 405730, 409488, 413460, 418142, 423362, 428523, 433728, 440058, 448418, 458585, 469856, 482123, 495695, 510370, 525609, 541747, 560296, 582765, 609783, 641646, 679030, 722494, 771687, 825696, 883804, 945085, 1007241, 1066524, 1118999, 1161532, 1191715]
51366A191715J6080J406j2408k4538l4891m3492n0312n5464n8900o0080n8647
51355H10469n5369n1613m7795m3153l7319l1222k6010k1741j7815j4236j1614
51344D52582j0095r042p877o743o085n906n711n082m112l256k852k843k922k811
51330C77245k342j511n98j40m45j237j944k336k553k679k586k230j712j119o21
51315C53192o38j381k210k095r15K74N72K61K15P31J398J686J268K55n84l12Q92
51298C52609J545O45q31j114j2R52P60J81N25J943L434M025L465K067L89j026
51282C69557j867k034j580p14K69J278K395L225K785P32j624k548k009j592k102
51267C64171k500j713k68P14J303K273L414L609K572J320O60J76q11k043k662
$$ y = [1191715, 1207795, 1209201, 1196793, 1172255, 1137364, 1093872, 1043560, 988096, 929196, 869116, 810469, 755100, 703487, 655692, 612539, 575220, 543998, 517988, 496247, 478432, 464196, 452582, 442487, 433445, 425568, 418825, 412740, 406834, 401123, 396041, 391929, 388673, 385821, 382978, 380056, 377245, 374903, 373392, 372794, 372654, 372209, 370972, 369028, 366692, 364139, 361460, 358874, 356644, 354932, 353813, 353192, 352554, 351173, 348963, 346868, 345953, 346227, 346799, 347060, 347275, 348006, 349404, 351090, 352358, 352613, 352029, 351717, 352609, 354154, 354799, 353968, 352854, 352842, 353794, 354554, 354735, 355260, 357203, 360637, 364662, 368127, 370194, 370583, 369557, 367690, 365656, 364076, 363362, 363631, 364909, 367304, 370529, 373314, 374046, 372422, 369874, 367865, 366273, 364171, 361671, 359958, 359690, 360404, 361707, 363980, 367394, 371003, 373575, 374895, 375555, 375731, 374920, 372877, 370215]
51252C70215k341j557q85n67o52j109j619j596q22P1J66n14q30NJ194J269J11
51235C60539q79p55k06k34n72l24M66R30Q33Q20J165J301Q68L94M60Q11P45O3
51217C66425q01j304j180n55R3K75l2l76l92k7O70J623K477K754K465K215K454
51200C76784K980L331L289K826K004J174Q58J151J604J881K073K113J604O39Q0
51185D04391L80O81k7j311j913j578j192j175r84m49l95j323k433k770k605k836
51169C84461l469l677l147k457k033j497m25Q51J580J599J557K045K726K604J310
51154C82028j82m48P39K163K655K243J572Q26j16r14j096r69j329k154k443j676
51138C80899o95n96j275j701j273l23N20R24Q82O06M25N00O47O97P81J028J130
$$ y = [370215, 367874, 366317, 365432, 364865, 364213, 363104, 361485, 359889, 359067, 359138, 359304, 358790, 357960, 357965, 359159, 360428, 360539, 359660, 358905, 358699, 358465, 357893, 357569, 358035, 358965, 359798, 360618, 361783, 363084, 363952, 364346, 364806, 365617, 366362, 366425, 365624, 364320, 363140, 362585, 362678, 362953, 362921, 362545, 362153, 362126, 362796, 364419, 366896, 369650, 372115, 374330, 376784, 379764, 383095, 386384, 389210, 391214, 392388, 393246, 394397, 396001, 397882, 399955, 402068, 403672, 404311, 404391, 404771, 405452, 405425, 404114, 402201, 400623, 399431, 398256, 397272, 396823, 396428, 395105, 392672, 389902, 387297, 384461, 380992, 377315, 374168, 371711, 369678, 368181, 367756, 368607, 370187, 371786, 373343, 375388, 378114, 380718, 382028, 381846, 381398, 382137, 384300, 386955, 389198, 390770, 391596, 391480, 390566, 389470, 388501, 387172, 385018, 382575, 380899, 380204, 379608, 378333, 376632, 375359, 375036, 375556, 376480, 377362, 377968, 378393, 378893, 379540, 380237, 381018, 382046, 383176]
51121C83176P15Kl98k73J25P10J705K964L785L714L070K409J925J630J638J790
51105D08687J518O01k63k32N77J380J861K315K722K525J591P12P59J690K624K701
51089D31768J722L32m39j97K08l75j823k779k496j754j513j531j049j68N36J167
51073D21609K144K918K373O41p07p03o9K05L73J178K449L445M040M642N297N933
51057D55768P168R590J2180J2688J0105N967K713J514K346N140R640J4388J7211
51044E66418J7265J5904J4970J4678J3648J0790O513K113j502m128n681n947n137
51031F39904m340m961p545j1305j4846j7158j7879j6980j4627j1399q213n766
51019E04885m090k749j354J57J651K992M115N069N980O844P350P090O098N063
$$ y = [383176, 383891, 383893, 383495, 383222, 383347, 384057, 385762, 388726, 392511, 396225, 399295, 401704, 403629, 405259, 406897, 408687, 410205, 410806, 410543, 410311, 410888, 412268, 414129, 416444, 419166, 421691, 423282, 423994, 424753, 426443, 429067, 431768, 433490, 433822, 433383, 433186, 433394, 433019, 431196, 428417, 425921, 424167, 422654, 421123, 420074, 419906, 420442, 421609, 423753, 426671, 429044, 429685, 428978, 428275, 428206, 428411, 428784, 429962, 432411, 435856, 439896, 444538, 449835, 455768, 462936, 472526, 484706, 497394, 507499, 513466, 516179, 517693, 520039, 525179, 534819, 549207, 566418, 583683, 599587, 614557, 629235, 642883, 653673, 660186, 662299, 660797, 656669, 650988, 645041, 639904, 635564, 630603, 623058, 611753, 596907, 579749, 561870, 544890, 530263, 518864, 510651, 504885, 500795, 498046, 496692, 496849, 498500, 501492, 505607, 510676, 516656, 523500, 530850, 537940, 544038, 549101]
51005E49101M837N666P058Q359R320J0043J0592J0884J0949J0957J0961J0726
50993F59453J0012Q942P965P449P355P393P408P493P633P421O421M951M116M723
50979G58735O298P558P843P550P138O337M830L174K417K965M491O850J0337J4846
50965H51369J9484K3454K6869L0283L3735L6807L9320M1414M2983M3643M3402
50954A232763M2800M2144M0927L8435L4730L0681K6989K3554J9992J6523J3955
50943A563493J2819J2919J3936J6062J9450K3066K4760K2907J7703J0741L695
50932A741551k320o750r701j1961j4390j7203k0209k3496k7322l1476l5407l9001
50920A502315m2527m5767m7959m8844m8935m8441m6742m3547l9830l6784l4300
$$ y = [549101, 553938, 559604, 566662, 575021, 584341, 594384, 604976, 615860, 626809, 637766, 648727, 659453, 669465, 678407, 686372, 693821, 701176, 708569, 715977, 723470, 731103, 738524, 744945, 749896, 754012, 758735, 765033, 772591, 780434, 787984, 795122, 801459, 806289, 809463, 811880, 814845, 819336, 826186, 836523, 851369, 870853, 894307, 921176, 951459, 985194, 1022001, 1061321, 1102735, 1145718, 1189361, 1232763, 1275563, 1317707, 1358634, 1397069, 1431799, 1462480, 1489469, 1513023, 1533015, 1549538, 1563493, 1576312, 1589231, 1603167, 1619229, 1638679, 1661745, 1686505, 1709412, 1727115, 1737856, 1741551, 1739231, 1732481, 1722780, 1710819, 1696429, 1679226, 1659017, 1635521, 1608199, 1576723, 1541316, 1502315, 1459788, 1414021, 1366062, 1317218, 1268283, 1219842, 1173100, 1129553, 1089723, 1052939, 1018639]
50909A018639l1408k7970k4916k2866k1358j9706j7839j6085j4688j3759j3228
50898G94816j2654j1541j0061q913q287p525o091m401l225k734k577k529k506
50885G11772k155j039P41K502L627M019L914L558L106K747K772L517M980O583
50871G50644P628Q089Q560R314R902R966R997J0701J2103J3794J5706J7946K0169
50858I04519K1976K3848K6697L0450L4009L6974M0407M5316N1102N6416O1057
50847A332771O6078P2110P8451Q4040Q8676R2897R6949J00321J02180J02047R9944
50836B316464R5967Q9929Q1594P1217N9619M7699L6057K5145J5492P523J355l043
50824B845018n508n658l112K239R846J8251K5557L0475L2765L2496K9163K1908
$$ y = [1018639, 987231, 959261, 934345, 911479, 890121, 870415, 852576, 836491, 821803, 808044, 794816, 782162, 770621, 760560, 751647, 743360, 735835, 729744, 725343, 722118, 719384, 716807, 714278, 711772, 709617, 708578, 709319, 711821, 715448, 719467, 723381, 726939, 730045, 732792, 735564, 739081, 744061, 750644, 758272, 766361, 774921, 784235, 794137, 804103, 814100, 824801, 836904, 850698, 866404, 884350, 904519, 926495, 950343, 977040, 1007490, 1041499, 1078473, 1118880, 1164196, 1215298, 1271714, 1332771, 1398849, 1470959, 1549410, 1633450, 1722126, 1815023, 1911972, 2012293, 2114473, 2216520, 2316464, 2412431, 2502360, 2583954, 2655171, 2714790, 2762489, 2798546, 2823691, 2839183, 2846706, 2848061, 2845018, 2839510, 2833852, 2830740, 2832979, 2842825, 2861076, 2886633, 2917108, 2949873, 2982369, 3011532, 3033440]
50812C033440J0558l853j9479l4568m8293o1088p3902q6771r8287j06760j11666
50801B399331j13509j12654j08996j02821r5150q6966p8491o9531o0242n1247
50791A519724m3155l6063k9506k2958j6520j0908o528k918M13K937L702K862J703
50778A362785J017L53q21k133l110m202o163q857j1464j3644j5778j8167k0640
50765A259176k2941k4955k6548k7601k8187k8407k8118k7148k5653k3883k1751
50754I73984j9044j5959j3011j0433q037n584l014l73K105M066N504P046R336
50741I26586J2286J5274J7892K0163K2293K4770K8377L3350L8723M3256M6928
50730A229898N0682N4727N7985N9480N9406N8532N7303N5887N4372N2440M9415
$$ y = [3033440, 3043998, 3040145, 3020666, 2986098, 2937805, 2876717, 2802815, 2716044, 2617757, 2510997, 2399331, 2285822, 2173168, 2064172, 1961351, 1866201, 1779235, 1700744, 1631213, 1570971, 1519724, 1476569, 1440506, 1411000, 1388042, 1371522, 1360614, 1354086, 1351168, 1351581, 1354518, 1358220, 1361082, 1362785, 1363802, 1364155, 1363334, 1361201, 1358091, 1353889, 1347726, 1338869, 1327405, 1313761, 1297983, 1279816, 1259176, 1236235, 1211280, 1184732, 1157131, 1128944, 1100537, 1072419, 1045271, 1019618, 995735, 973984, 954940, 938981, 925970, 915537, 907500, 901916, 898902, 898529, 900634, 904700, 910204, 917250, 926586, 938872, 954146, 972038, 992201, 1014494, 1039264, 1067641, 1100991, 1139714, 1182970, 1229898, 1280580, 1335307, 1393292, 1452772, 1512178, 1570710, 1628013, 1683900, 1738272, 1790712, 1840127]
50719A840127M5095L9971L4294K7559J9368J0244J114p362j4547j9556k1944k2136
50707A932227k0585j7067j1479m748J945Q282J4298J9274K2261K3404K3478K2228
50695B013518J8345J1225J716r032k0277l1043l9969m6402n0711n3038n2700m9549
50683A692083m4978m0608l6646l2377k7709k3129j8662j3899q910m043J101P351
50671A449574J4527K1386K7193L2420L7312M0800M1601L9848L6834L3530L0101
50660A805126K6615K3381K0519J7945J5908J4885J4672J4122J2310R682P556O523
50648A989244N839M578L041K697M718Q781J3543J8153K3014K8868L5428M1384
50636B179288M5749M8688N0692N1410M9903M5971M0656L5230L0137K5293K1113
$$ y = [1840127, 1885222, 1925193, 1959487, 1987046, 2006414, 2016658, 2017772, 2010410, 1995863, 1976307, 1954363, 1932227, 1911642, 1894575, 1883096, 1878348, 1880293, 1888575, 1902873, 1922147, 1944408, 1967812, 1991290, 2013518, 2031863, 2043088, 2044804, 2035772, 2015495, 1984452, 1944483, 1898081, 1847370, 1794332, 1741632, 1692083, 1647105, 1606497, 1569851, 1537474, 1509765, 1486636, 1467974, 1454075, 1445165, 1441122, 1442223, 1449574, 1464101, 1485487, 1512680, 1545100, 1582412, 1623212, 1664813, 1704661, 1741495, 1775025, 1805126, 1831741, 1855122, 1875641, 1893586, 1909494, 1924379, 1939051, 1953173, 1965483, 1975165, 1982721, 1989244, 1995083, 1999661, 2002702, 2005399, 2010117, 2018898, 2032441, 2050594, 2073608, 2102476, 2137904, 2179288, 2225037, 2273725, 2324417, 2375827, 2425730, 2471701, 2512357, 2547587, 2577724, 2603017, 2624130]
50625B624130J8785J9270K1924K3757K0189P435j4444m0369o2644p5496p7884
50614B464653p2423o2315m9696l6165k3480j2861m133L529R972J3738J3569R700
50602B254088L322m805j4665k6121l8292m9856n9644o6913p1497p3812p4425p3466
50590A703914p0731o6353o1069n5612n0176m4646l9092l3742k8701k3962j9514
50579A210316j5316j1409q161o098n163m519l440k066r14J02J491L288M905N991
50565A169007O815P662Q386Q780R060R676J0889J2705J5053J7876K1191K5114
50553A322214K9673L4538L9159M3090M5953M7258M6662M4485M1496L8138L4455
50542A767121L0884K8546K8295K9982L2980L6968M1741M6631N0940N4855N9273
$$ y = [2624130, 2642915, 2662185, 2684109, 2707866, 2728055, 2735490, 2721046, 2680677, 2618033, 2542537, 2464653, 2392230, 2329915, 2280219, 2244054, 2220574, 2207713, 2203580, 2207109, 2217081, 2230819, 2244388, 2254088, 2257410, 2252605, 2237940, 2211819, 2173527, 2123671, 2064027, 1997114, 1925617, 1851805, 1777380, 1703914, 1633183, 1566830, 1505761, 1450149, 1399973, 1355327, 1316235, 1282493, 1253792, 1229830, 1210316, 1195000, 1183591, 1175430, 1169332, 1164169, 1159650, 1156210, 1154144, 1153230, 1153332, 1154823, 1158111, 1163016, 1169007, 1175822, 1183484, 1191870, 1200650, 1209710, 1219386, 1230275, 1242980, 1258033, 1275909, 1297100, 1322214, 1351887, 1386425, 1425584, 1468674, 1514627, 1561885, 1608547, 1653032, 1694528, 1732666, 1767121, 1798005, 1826551, 1854846, 1884828, 1917808, 1954776, 1996517, 2043148, 2094088, 2148943, 2208216]
50531B208216O4681P0684P6781Q3069R0008R7810J06365J15392J24348J32348
50521C169702J38501J42350J43806J42685J38472J30638J19025J03850Q5384O3836
50511D378249L9634J3732j2655l8580o3459q6555j06715j22907j34734j42076
50501C723934j44390j40931j31759j17976j00833q1009n9104l6289j3889P467
50491B905221K7560M5474N9266O6965O7405O0118M5108K3312l034l1122n8456
50480C207817q2968j02829j17019j25995j31054j32935j31663j27673j22187j16078
50470B017416j09146j01051r2379q4050p6152o8159o0154n2981m7174m2382l7937
50459A245851l3458k8872k4335k0289j7095j4430j1517q123m875k432p90L98J308
$$ y = [2208216, 2272897, 2343581, 2420362, 2503431, 2593439, 2691249, 2797614, 2913006, 3037354, 3169702, 3308203, 3450553, 3594359, 3737044, 3875516, 4006154, 4125179, 4229029, 4314413, 4378249, 4417883, 4431615, 4418960, 4380380, 4316921, 4230366, 4123651, 4000744, 3866010, 3723934, 3579544, 3438613, 3306854, 3188878, 3088045, 3007036, 2947932, 2911643, 2897754, 2905221, 2932781, 2978255, 3037521, 3104486, 3171891, 3232009, 3277117, 3300429, 3297395, 3266273, 3207817, 3124849, 3022020, 2905001, 2779006, 2647952, 2515017, 2383354, 2255681, 2133494, 2017416, 1908270, 1807219, 1714840, 1630790, 1554638, 1486479, 1426325, 1373344, 1326170, 1283788, 1245851, 1212393, 1183521, 1159186, 1138897, 1121802, 1107372, 1095855, 1087732, 1082857, 1080425, 1079635, 1080033, 1081341]
50446A081341K079L046M466O207Q120J0314J2746J4731J5364J4340J2103R338
50434A194195O641M566L482L314L692M436N686P526R747J2064J4292J6272J7808
50421A303721J8957K0215K2217K5147K8613L2185L5932M0157M4755M9216N3430
50410A674545N8056O3585O9270P3594P5785P6352P5992P4680P2134O8584O4520
50399B447097N9894N4105M6668L7448K6320J3065k260j9067l6326n2770o7117
50388B507057p8470q6535r1300r2596r0203q4414p6125o6298n5434m3697l1406
50377A710579j9215p820K434J1537J9358K5257K8302K7822K3688J6186N918o161
50365A837885j8907l1256m2184n0622n5954n8710o0144o0817o0089n7373n3306
$$ y = [1081341, 1083420, 1086466, 1090932, 1097139, 1105259, 1115573, 1128319, 1143050, 1158414, 1172754, 1184857, 1194195, 1200836, 1205402, 1208884, 1212198, 1215890, 1220326, 1226012, 1233538, 1243285, 1255349, 1269641, 1285913, 1303721, 1322678, 1342893, 1365110, 1390257, 1418870, 1451055, 1486987, 1527144, 1571899, 1621115, 1674545, 1732601, 1796186, 1865456, 1939050, 2014835, 2091187, 2167179, 2241859, 2313993, 2382577, 2447097, 2506991, 2561096, 2607764, 2645212, 2671532, 2684597, 2682337, 2663270, 2626944, 2574174, 2507057, 2428587, 2342052, 2250752, 2158156, 2067953, 1983539, 1907414, 1841116, 1785682, 1741985, 1710579, 1691364, 1683544, 1685978, 1697515, 1716873, 1742130, 1770432, 1798254, 1821942, 1838128, 1844046, 1837885, 1818978, 1787722, 1745538, 1694916, 1638962, 1580252, 1520108, 1459291, 1399202, 1341829, 1288523]
50354A288523m9129m5395m1988l9083l7095l5758l4120l1640k8715k5870k3121
50343H96609k0337j7693j5312j2984j0588q460o878n600m303l177k564k190j351
50330G85172J46J685K639L120L801N216P403J0026J2664J5065J7225J9145K0400
50317I03707K0051J7204J1806M931j713o649r172r408q009n786l413j255N68K053
50303I14915L223M099M651M722M202L310K638K694L399M112M235L766L209K939
50289I66114K781K312J460O07K35Q73L302P957J3549J6798J4696P249k396j0569
50275A024968j5294j6357j4440j0852p158m171j579J015L271M796N962P093P419
50262I84673N985L448J751J807K522K488J741J233J264J202M79p66k023k937l563
$$ y = [1288523, 1239394, 1193999, 1152011, 1112928, 1075833, 1040075, 1005955, 974315, 945600, 919730, 896609, 876272, 858579, 843267, 830283, 819695, 811235, 804357, 798757, 794454, 791277, 788713, 786523, 785172, 785318, 787003, 789642, 792762, 796563, 801779, 809182, 819208, 831872, 846937, 864162, 883307, 903707, 923758, 940962, 952768, 957699, 955986, 949337, 940165, 930757, 922748, 916962, 913549, 912294, 912862, 914915, 918138, 922237, 926888, 931610, 935812, 939122, 941760, 944454, 947853, 951965, 956200, 959966, 963175, 966114, 968895, 971207, 972667, 973274, 973509, 974382, 977684, 985641, 999190, 1015988, 1030684, 1037933, 1035537, 1024968, 1009674, 993317, 978877, 968025, 960867, 956696, 955117, 956132, 959403, 964199, 970161, 977254, 984673, 990658, 994106, 995857, 997664, 1000186, 1002674, 1004415, 1005648, 1006912, 1008114, 1008593, 1007827, 1005804, 1002867, 999304]
50247I99304m264n263o222o406n439l753k092o96Q90L245O377R574J2054J3843
50233A011152J5914J9139K3278K7192K9959L1351L1444L0354K8427K6166K3788
50222A298164K1237J8762J6954J6025J5450J4529J2876J0159N859k83p867j6115
50210A405750k4291l1576l7052m0222m1375m0968l8962l5115k9740k3785j8215
50199A044449j3644j0386q580q324r857j3318j8063k2497k5131k5672k4828k3234
50187H40915k1109j8695j6391j4295j2145r900q014o947o614o545o359n919n248
50174G02734m488l817l256k604j667n27M37Q18M98j88o06l07N86J516K063K276
50158F93468K461K725K867K694K414K637L944O348R155J1242J1634J0051P166
$$ y = [999304, 995040, 989777, 983555, 977149, 971710, 967957, 965865, 965169, 966059, 969304, 975681, 985255, 997309, 1011152, 1027066, 1046205, 1069483, 1096675, 1126634, 1157985, 1189429, 1219783, 1248210, 1274376, 1298164, 1319401, 1338163, 1355117, 1371142, 1386592, 1401121, 1413997, 1424156, 1430015, 1429732, 1421865, 1405750, 1381459, 1349883, 1312831, 1272609, 1231234, 1190266, 1151304, 1116189, 1086449, 1062664, 1044449, 1030805, 1020419, 1011839, 1003515, 993658, 980340, 962277, 939780, 914649, 888977, 864149, 840915, 819806, 801111, 784720, 770425, 758280, 748380, 740366, 733419, 726805, 720260, 713901, 707982, 702734, 698246, 694429, 691173, 688569, 686902, 686375, 686812, 687630, 688128, 687940, 687334, 687027, 687613, 689129, 691192, 693468, 695929, 698654, 701521, 704215, 706629, 709266, 713210, 719558, 728713, 739955, 751589, 761640, 768806]
50145G68806M259K301J288N49l75j331k027k538l055l387k971j478P59K961M577
50130G68338N713O887Q362R809J0707J0885J0646J0516J1046J2605J5025J7654
50118H98193K0125K2923K6845L1990L7728M3548M9227N4182N7394N8291N7171
50107A357617N4581N0941M7097M4394M3541M3833M4068M3694M2433L9226L2645
50096A844070K2338R354m925j9459l3136m4642n3233n9220o3273o5533o5677o3612
50084A403052n9751n4686m8868m2632l6401l0746k6115k2468j9417j6798j4891
50073A030279j3841j3132j1979j0134q027o161m713l608k659j645o13q1n56j793
50059I51337k835l025k716k838l867n406o634p092o988o865p014p241p090o216
$$ y = [768806, 773065, 775366, 776654, 777203, 776828, 775497, 773470, 770932, 767877, 764490, 761519, 760041, 760800, 763761, 768338, 774051, 780938, 789300, 799109, 809816, 820701, 831347, 841863, 852909, 865514, 880539, 898193, 918318, 941241, 968086, 1000076, 1037804, 1081352, 1130579, 1184761, 1242155, 1300446, 1357617, 1412198, 1463139, 1510236, 1554630, 1598171, 1642004, 1686072, 1729766, 1772199, 1811425, 1844070, 1866408, 1875762, 1870837, 1851378, 1818242, 1773600, 1720367, 1661147, 1597874, 1532341, 1466664, 1403052, 1343301, 1288615, 1239747, 1197115, 1160714, 1129968, 1103853, 1081385, 1061968, 1045170, 1030279, 1016438, 1003306, 991327, 981193, 973166, 967005, 962292, 958684, 956025, 954380, 953767, 953686, 953130, 951337, 948502, 945477, 942761, 939923, 936056, 930650, 924016, 916924, 909936, 903071, 896057, 888816, 881726, 875510]
50045H75510m698l175k503k810l000j789O80K870L808M222N266O823P959Q548
50031H97711R418J0912J2330J2954J2859J2410J1576J0093P983N569L321J590
50019A008726L52q51k287l497l906l898m621o592q983j0466j0350q833o665m767
50005I33362l651l019k262j345n87M42L063Q038J4606K1296K7210L2101L5789
49992A065043L8090L9123L9082L7893L5438L1897K7617K2805J7732J3046R550
49981A377316P583O734N998M289J056l606r649j7459k6933l6432m3710m8054n0444
49968A166689n1392n0007m5963m0958l6945l3733k9820k5054k0833j7869j5325
49957G98790j2395r334o519l681o55K064M229O407Q925J0929J1251R842P638N305
$$ y = [875510, 870812, 867637, 865134, 862324, 859324, 857535, 858215, 861085, 864893, 869115, 874381, 881204, 889163, 897711, 907129, 918041, 930371, 943325, 956184, 968594, 980170, 990263, 998246, 1003815, 1007136, 1008726, 1009078, 1008227, 1005940, 1002443, 998537, 994639, 990018, 983426, 974443, 963977, 953627, 944794, 938129, 933362, 929711, 926692, 924430, 923085, 922498, 922940, 926003, 934041, 948647, 969943, 997153, 1029254, 1065043, 1103133, 1142256, 1181338, 1219231, 1254669, 1286566, 1314183, 1336988, 1354720, 1367766, 1377316, 1384899, 1391633, 1397631, 1401920, 1402976, 1399370, 1389721, 1372262, 1345329, 1308897, 1265187, 1217133, 1166689, 1115297, 1065290, 1019327, 978369, 941424, 907691, 877871, 852817, 831984, 814115, 798790, 786395, 777061, 770542, 766861, 766206, 768270, 772499, 778906, 787831, 798760, 810011, 819853, 827491, 832796]
49943H32796K864M38j337j882j438j103k093m750q186j1119j3102j4675j6312
49930G60101j7687j8199j7781j6782j5402j3652j1684r787q101o632n425m475
49918F14494l620k652j501j24J535L287M583M962M481L667L190L621N118P073
49904F48114Q459Q915R195J0143J1591J2744J3387J3994J4710J4886J3815J1504
49892G91457Q561N713L489J879J04k828o992j1304j4555j6435j7275j7244j6270
49879G08300j4631j3065j2239j2239j2631j2809j2313j1019r164p175n446m159
49867E81410l180k133q08M80J191J364J828L316N560P611Q993J0207J1990J4379
49853F42208J6628J7915J7962J6991J5331J3220J0917Q732O808N005L185J460
$$ y = [832796, 835660, 836098, 834761, 832879, 831441, 830338, 828245, 823495, 815309, 804190, 791088, 776413, 760101, 742414, 724215, 706434, 689652, 674250, 660598, 648914, 639127, 631026, 624394, 618969, 614494, 610874, 608222, 606721, 606597, 608132, 611419, 616002, 620964, 625445, 629112, 632302, 635923, 641041, 648114, 656573, 665488, 674683, 684826, 696417, 709161, 722548, 736542, 751252, 766138, 779953, 791457, 800018, 805731, 809220, 811099, 811203, 808375, 801383, 790079, 775524, 759089, 741814, 724570, 708300, 693669, 680604, 668365, 656126, 643495, 630686, 618373, 607354, 598190, 591015, 585569, 581410, 578230, 576097, 575289, 575769, 576960, 578324, 580152, 583468, 589028, 596639, 605632, 615839, 627829, 642208, 658836, 676751, 694713, 711704, 727035, 740255, 751172, 759904, 766712, 771717, 774902, 776362]
49841G76362j57k146n025q452j1363j3124j4050j4475j4015j2329j0093q357p222
49828F55554n929m239k831k185j892j331l84Q41K416M318O178P785R387J1146
49814F78834J2641J3324J3154J2409J1212R655Q121P011O295N648M803L440J151
$$ y = [776362, 776205, 774059, 769034, 760582, 749219, 736095, 722045, 707570, 693555, 681226, 671133, 662776, 655554, 649625, 645386, 642555, 640370, 638478, 637147, 636763, 637604, 640020, 644338, 650516, 658301, 667688, 678834, 691475, 704799, 717953, 730362, 741574, 751229, 759350, 766361, 772656, 778304, 783107, 786547, 787698]
$$ [...]
##END NTUPLES=NMR SPECTRUM
##END=
