
##TITLE=UV1220_M5_1296-1170_90_7229556_2qQ6gD5V1T
##JCAMPDX= 6.0         $$ Bruker NMR JCAMP-DX V2.0
##DATA TYPE= NMR SPECTRUM
##DATA CLASS= NTUPLES
##ORIGIN= BRUKER
##OWNER= Administrator
$$ 1.72 TOPSPIN		Version 2.1
$$ 2013-01-24 04:50:32.895 -0500  Administrator@X
$$ Compression mode = diff/dup
##.OBSERVE FREQUENCY= 400.02188249412
##.OBSERVE NUCLEUS= ^1H
##.ACQUISITION MODE= SIMULTANEOUS (DQD)
##.ACQUISITION SCHEME= undefined
##.AVERAGES= 8
##.DIGITISER RES= 22
##SPECTROMETER/DATA SYSTEM= spect
##.PULSE SEQUENCE= zg30
##.SOLVENT NAME= COFFEE_meoh
##.SHIFT REFERENCE= INTERNAL, COFFEE_meoh, 1, 14.98509
##AUDIT TRAIL= $$ (NUMBER, WHEN, WHO, WHERE, PROCESS, VERSION, WHAT)
$$ ##TITLE= Audit trail, TOPSPIN		Version 2.1
$$ ##JCAMPDX= 5.01
$$ ##ORIGIN= Bruker BioSpin GmbH
$$ ##OWNER= Administrator
$$ $$ E:\/data/COFFEE/nmr/UV1220_M5_1296-1170_90_7229556_2qQ6gD5V1T/30/pdata/1/auditp.txt
$$ ##AUDIT TRAIL=  $$ (NUMBER, WHEN, WHO, WHERE, PROCESS, VERSION, WHAT)
(   1,<2013-01-24 04:50:24.817 -0500>,<Administrator>,<X>,<go>,<TOPSPIN 2.1>,
      <created by zg
	started at 2013-01-24 04:49:18.489 -0500,
	POWCHK enabled, PULCHK disabled,
       configuration hash MD5:
       86 BA 57 50 F2 9D 5C 9B 26 00 A9 28 5F 66 2E 89
       data hash MD5: 64K
       3B 84 0E 09 9D 71 30 B8 56 9B AE 03 E2 C7 E7 E5>)
(   2,<2013-01-24 04:50:27.848 -0500>,<Administrator>,<X>,<proc1d>,<TOPSPIN 2.1>,
      <Start of raw data processing
       efp LB = 0 FT_mod = 6 PKNL = 1 PHC0 = 0 PHC1 = 0 SI = 32K 
       data hash MD5: 32K
       AD CD 36 2E 2E 01 A2 E6 46 81 55 4E 2C AA 1E 92>)
(   3,<2013-01-24 04:50:28.317 -0500>,<Administrator>,<X>,<proc1d>,<TOPSPIN 2.1>,
      <pk PHC0 = 99.35486 PHC1 = 0 
       data hash MD5: 32K
       03 CD 78 DB C6 9F 94 43 0D A1 E5 EA 48 D7 05 5E>)
(   4,<2013-01-24 04:50:28.551 -0500>,<Administrator>,<X>,<proc1d>,<TOPSPIN 2.1>,
      <abs ABSG = 1 
       data hash MD5: 32K
       A5 4C 74 A6 68 5A AB 4B FC 8E EF 35 17 16 56 D7>)
(   5,<2013-01-24 04:50:28.692 -0500>,<Administrator>,<X>,<proc1d>,<TOPSPIN 2.1>,
      <abs ABSG = 2 
       data hash MD5: 32K
       46 F1 B3 43 11 60 58 60 A1 66 AD D4 64 22 13 BD>)
(   6,<2013-01-24 04:50:28.848 -0500>,<Administrator>,<X>,<proc1d>,<TOPSPIN 2.1>,
      <abs ABSG = 3 
       data hash MD5: 32K
       12 F7 F2 A7 4D D6 43 3F BA FE 55 F3 7E 42 10 FF>)
(   7,<2013-01-24 04:50:28.989 -0500>,<Administrator>,<X>,<proc1d>,<TOPSPIN 2.1>,
      <abs ABSG = 4 
       data hash MD5: 32K
       D9 41 09 99 BC C6 02 7E 17 A4 19 D1 B4 C3 F7 30>)
(   8,<2013-01-24 04:50:29.129 -0500>,<Administrator>,<X>,<proc1d>,<TOPSPIN 2.1>,
      <abs ABSG = 5 
       data hash MD5: 32K
       5B 42 51 49 37 41 21 B6 1E 25 2E BE BD 1A F6 63>)
$$ ##END=
$$ 
$$ $$ hash MD5
$$ $$ 6D 2E 2D 99 99 4A DD 23 19 08 B2 29 99 68 CB EF
##$RELAX= 
##$RELAX= 
##$RELAX= 
##$RELAX= 
##$RELAX= 
##$RELAX= 
##$RELAX= 
$$ Bruker specific parameters
$$ --------------------------
##$DU= <E:\>
##$EXPNO= 30
$$ [...]
##$TP= (0..7)
150 150 150 150 150 150 150 150
##$TP07= 0
##$TPNAME0= <>
##$TPNAME1= <>
##$TPNAME2= <>
##$TPNAME3= <>
##$TPNAME4= <>
##$TPNAME5= <>
##$TPNAME6= <>
##$TPNAME7= <>
##$TPOAL= (0..7)
0.5 0.5 0.5 0.5 0.5 0.5 0.5 0.5
##$TPOFFS= (0..7)
0 0 0 0 0 0 0 0
##$TUNHIN= 0
##$TUNHOUT= 0
##$TUNXOUT= 0
##$USERA1= <user>
##$USERA2= <user>
##$USERA3= <user>
##$USERA4= <user>
##$USERA5= <user>
##$V9= 5
##$VALIST= <valist>
##$VCLIST= <CCCCCCCCCCCCCCC>
##$VD= 0
##$VDLIST= <DDDDDDDDDDDDDDD>
##$VPLIST= <PPPPPPPPPPPPPPP>
##$VTLIST= <TTTTTTTTTTTTTTT>
##$WBST= 1024
##$WBSW= 4
##$XGAIN= (0..3)
0 0 0 0
##$XL= 0
##$YL= 0
##$YMAX_a= 677716
##$YMIN_a= -578238
##$ZGOPTNS= <>
##$ZL1= 120
##$ZL2= 120
##$ZL3= 120
##$ZL4= 120
##$ABSF1= 14.98509
##$ABSF2= -5.573092
##$ABSG= 5
##$ABSL= 3
##$ALPHA= 0
##$AQORDER= 0
##$ASSFAC= 0
##$ASSFACI= 0
##$ASSFACX= 0
##$ASSWID= 0
##$AUNMP= <proc_prof1d_extract_pilot.lims>
##$AXLEFT= 0
##$AXNAME= <>
##$AXNUC= <1H>
##$AXRIGHT= 0
##$AXTYPE= 0
##$AXUNIT= <>
##$AZFE= 0.1
##$AZFW= 0.1
##$BCFW= 0
##$BC_mod= 0
##$BYTORDP= 0
##$COROFFS= 0
##$CY= 15
##$DATMOD= 1
##$DC= 0
##$DFILT= <>
##$DTYPP= 0
##$F1P= 0
##$F2P= 0
##$FCOR= 0.5
##$FTSIZE= 32768
##$FT_mod= 6
##$GAMMA= 0
##$GB= 0
##$INTBC= 1
##$INTSCL= 1
##$ISEN= 128
##$LB= 0
##$LEV0= 0
##$LPBIN= 0
##$MAXI= 10000
##$MC2= 0
##$MEAN= 0
##$ME_mod= 0
##$MI= 0
##$NCOEF= 0
##$NC_proc= -8
##$NLEV= 6
##$NOISF1= 0
##$NOISF2= 0
##$NSP= 0
##$NTH_PI= 0
##$NZP= 0
##$OFFSET= 14.98509
##$PC= 1
##$PHC0= 99.35486
##$PHC1= 0
##$PH_mod= 1
##$PKNL= yes
##$PPARMOD= 0
##$PPDIAG= 0
##$PPIPTYP= 0
##$PPMPNUM= 2147483647
##$PPRESOL= 1
##$PSCAL= 4
##$PSIGN= 0
##$PYNMP= <proc.py>
##$REVERSE= no
##$SF= 400.02
##$SI= 32768
##$SIGF1= 0
##$SIGF2= 0
##$SINO= 400
##$SIOLD= 32768
##$SPECTYP= <>
##$SREGLST= <1H.CDCl3>
##$SSB= 0
##$STSI= 32768
##$STSR= 0
##$SW_p= 8223.68421052631
##$SYMM= 0
##$S_DEV= 0
##$TDeff= 65536
##$TDoff= 0
##$TI= <>
##$TILT= no
##$TM1= 0
##$TM2= 0
##$TOPLEV= 0
##$USERP1= <user>
##$USERP2= <user>
##$USERP3= <user>
##$USERP4= <user>
##$USERP5= <user>
##$WDW= 1
##$XDIM= 32768
##$YMAX_p= 474889663
##$YMIN_p= -768713
##$CURPLOT= <Network HP LaserJet P1505>
##$CURPRIN= <$Network HP LaserJet P1505>
##$DFORMAT= <normdp>
##$LAYOUT= <+/1D_H.xwp>
##$LFORMAT= <normlp>
##$PFORMAT= <normpl>
##$SURQMSG= 1
$$ End of Bruker specific parameters
$$ ---------------------------------
##NTUPLES= NMR SPECTRUM
##VAR_NAME=  FREQUENCY,     SPECTRUM/REAL,   SPECTRUM/IMAG
##SYMBOL=    X,             R,               I
##VAR_TYPE=  INDEPENDENT,   DEPENDENT,       DEPENDENT
##VAR_FORM=  AFFN,          ASDF,            ASDF
##VAR_DIM=   32768,         32768,           32768
##UNITS=     HZ,            ARBITRARY UNITS, ARBITRARY UNITS
##FACTOR=    0.250966925370066, 1,           1
##FIRST=     8223.43324360094, 30911,        65382
##LAST=      0,             -127666,         168231
##MIN=       0,             -768713,         0
##MAX=       8223.43324360094, 474889663,    0
$$ Real data points
##PAGE= N=1
##DATA TABLE= (X++(R..R)), XYDATA
$$ [...]
23837 265423 259854 -110851 227922 47950 165793 -323885 -112321 22559 -183764 115456
23826 123223 -126628 -166839 -4931 -25367 -34219 69352 171064 -139354 196947 284411 -186691
23814 -15010 -242625 191776 -45738 166088 -69913 -228812 -350297 38087 -85280 -253086
23804 -253086 -269958 -55750 -100006 387890 -66221 55805 400501 -225146 -106836 -2220 -14099
23793 -14099 -118143 41039 -37887 -20662 -129060 47463 50972 -250159 46203 -54778 -160173
23782 -160173 194645 367877 -312140 87002 -184915 3972 -164006 25095 198380 62579
23771 -173843 -227383 157988 150996 261536 -146879 -375263 389192 15544 -345040 -180197
23761 -180197 252865 35383 278370 -2328 -285385 -72841 130869 -1594 -197142 -262392 -67114
23749 329318 251420 -92365 -404559 147231 83935 -56221 -55394 8687 -80939 -34969 592028
23737 -159074 -139137 157879 20451 -65073 -49585 -19618 -200273 187987 -28306 67985 -115718
23725 246392 91042 -310029 -192156 -155358 -47898 -27956 -146458 291355 -33680 35243 82836
23714 82836 -149963 48728 -75771 -72698 87455 47969 -8329 -44315 32378 101627 119376 -161327
23701 570358 -508672 236604 -190986 451583 -213998 4048 -39323 -6797 13170 18379 151743
23690 151743 -94632 -63358 -178736 -303005 356887 178502 160550 -132491 -44603 -334534
23680 -334534 -20147 -64949 -59590 -40322 177217 216469 -190568 270973 -126766 -427747 -271182
23669 -271182 -259498 -171887 -73331 98706 -12885 34393 65544 -71803 -156010 49043 -191710
23657 26726 -21002 98550 -12726 158320 -216825 -46247 -205709 -38329 -61575 -206826 -126911
23646 -126911 79378 288416 253140 61031 338060 -49549 -126851 -163934 213594 -107423 -439050
23635 -439050 -231687 -3655 -246875 -119386 83510 -211316 154167 326301 89900 -2606 33331
23623 -277571 -82678 -66091 112157 -185201 108721 193477 325331 -152655 -92230 52146
23612 65381 -86230 -109987 90087 -287729 14090 129939 -154007 -99730 33870 10252 -176192
23600 -123267 76032 -73329 -208508 -55876 171071 48551 -196900 80401 -186683 -109458 -120059
23589 -120059 195062 -58965 127766 29565 73717 94623 188388 -99625 -31780 27302 121393
23578 121393 -283269 -27598 -20170 110221 -265183 -208497 -203896 -56024 47615 -134373 -147372
23567 -147372 -76946 -81235 -10090 417376 -68704 8682 7106 -254405 205512 -12543 -141004
23556 -141004 -140239 -108239 104928 13164 268101 18284 -45952 -57902 -94819 -186049 -264662
23545 -264662 129223 88185 -51435 -81507 -46852 -249157 -50543 -8623 -420726 -17902 -228105
23534 -228105 74470 -163611 44990 195258 73254 -15567 22036 197247 188358 249999 -2363
23522 178353 -28168 -161783 124733 56261 -210478 -75259 267082 -281977 -288115 -102117
23511 -180989 -129611 86323 -83691 107114 12860 -52029 -154649 -43782 115011 111282 -38734
23499 -279325 -52270 111176 228613 -182630 95393 206207 -39201 145307 -46932 -47897 -28684
23488 -28684 352 18386 10558 313193 -1816 -160112 -111084 43594 -126341 119797 177838 -3242
23475 -37070 -182792 -228038 355570 -155584 225574 -219599 -24066 -263183 405256 226309
23465 226309 -213235 -294376 -178091 -13885 136010 138009 89664 -71234 67488 -160027 125049
23453 -193192 -265442 -91555 -76463 -135229 -201352 -335382 11098 -253110 -91138 -182519 149918
23441 79188 -260363 268262 -492523 -109267 -106827 -259708 -76908 32198 117458 143319 -96930
23429 -104787 77753 117723 112766 22648 9884 25498 108217 -230378 173113 60211 198441
23418 198441 -258 111294 -260601 -16927 122570 36340 91471 148502 55233 90460 -181568
23406 -239234 -194292 163888 65211 -108170 17883 -7638 107697 -162388 347186 -294534
23395 -112795 -87599 -132786 283108 -138266 -141248 -59257 -101743 111960 245858 -322630 -137087
23383 318003 -221666 498718 87535 302074 -67540 472528 -20256 27009 194559 -188588
23372 -205290 -175418 213906 87224 311623 -24214 -37364 -11652 -7879 40154 -42645 237721
23360 -201115 24197 -459624 -117367 74377 59120 38152 -291523 -90751 -412295 -445051 -28437
23348 186945 -160962 -171675 -345841 -19178 124269 -259985 35999 -339446 -134198 204531
23337 28228 -710 101829 -102356 129052 42911 81995 -68030 -407120 49639 2676 32389
23326 32389 -197682 58858 -138725 66564 35634 161259 -151273 135516 112137 -77856 -356108
23315 -356108 99142 241436 202953 -61897 -175543 48249 -165156 285792 287042 -139926 -10657
23303 31033 -119787 96133 -470984 317096 -94009 -119885 -92650 -147042 -276277 237393 -166313
23291 28371 132209 -94386 264923 307396 165467 -30104 76330 -1111 -304894 292139 40929
23279 -138188 -255585 38737 175983 -141324 189366 121456 54829 152201 -139117 -101376
23269 -101376 49988 -38369 127784 -164576 11374 -156552 33710 206523 -83327 111597
23258 -418423 -37885 158965 51929 -71892 -327019 193851 20259 81589 -239506 -54990 65339
23246 -230872 -30570 5304 -212513 26824 -72761 -296016 175463 -133108 -133252 192886 13347
23234 -166485 -167865 -62450 84076 -85696 -15591 -273819 -286922 -159781 -142683 253600 138290
23223 138290 114247 -48418 -271392 -247001 199478 81190 -35930 -308526 -72946 -192886 -109403
23212 -109403 -228990 197461 114801 117569 -174737 43693 21209 -221406 61434 -102727 -90867
23201 -90867 -196405 374572 -61445 1555 -77836 -94421 -146265 32273 111175 97002 -283127
23189 -92289 -67152 189815 -213184 -122397 -42600 -59874 194211 -149636 -489544 -200346
23178 42656 -12238 72068 -25644 143762 173810 -113683 -139112 -244458 -500724 -224328 9235
23166 47080 157227 -298948 -58436 -16391 79788 -196757 -201728 -376871 -107222 -37820 -9259
23154 -339491 285482 -11442 -236006 -162392 -1017 182315 -10349 112841 -85416 -150538 -26252
23142 -339502 -99307 134102 60610 170781 -119992 -8176 40191 -188909 -170731 310466 -177977
23130 232898 296977 -276073 89226 130891 -70771 118876 -105139 -50618 -109845 -266552 58335
23118 73522 -22996 -13289 -349421 -158902 138847 53292 125173 -125934 -22300 -209152 -228855
23107 -228855 -36792 -82015 73829 -46374 -211873 245207 116960 -44239 -88020 340202 181528
23096 181528 -6111 -328898 288893 -204060 -174611 -49724 -45249 307738 -15982 -139702 143880
23084 -236474 103839 68859 124309 -65709 -32138 87891 335261 233484 -77516 91109 392552
23073 392552 44710 -40265 -208470 257980 -172615 -73734 54493 255069 174367 -120065
23062 60382 -234752 -216728 -54091 44499 -131980 51117 -510256 365683 -268254 -187414 182841
23050 -25892 148353 -61200 326650 -28266 12827 36999 67305 212836 -264081 -20490 -53440
23039 -53440 85863 34313 -71700 153362 -229848 -234608 81923 -292947 -83218 -33984 -10449
23027 30386 230831 131369 188807 46814 -17510 46199 -299803 111625 -182006 193898 354953
23016 354953 -349833 -67970 436842 132072 -109464 62069 41876 154659 157353 203220 154275
23005 154275 99986 -71107 -66711 89085 -19014 -83250 43041 -262229 -189514 17398 -22149
22993 165204 54999 -65172 -310440 -143249 -188082 -367163 163067 184328 105585 145516 205620
22982 205620 215568 309190 -131015 231102 -41049 365776 199415 -53475 -81262 123626 69056
22971 69056 -83132 26332 -250138 379946 124014 -148629 49351 -7159 -117032 43212 -176928
22959 10841 -452533 -312920 270528 -201811 145234 296835 -183503 -84747 -150022 -269147
22949 -269147 212031 51518 -467 -154841 106642 -158152 -66926 157113 -149551 -49260 103863
22937 -57511 -138646 368647 -260951 40250 -46916 42572 -27380 -149306 -101843 -54241 -238598
22926 -238598 -158435 -174711 -169007 -271552 -431488 -152401 -60453 293102 -84078 -2811 -10833
22915 -10833 -9211 -318348 72285 11625 -66036 -115482 55670 -86774 64094 -451566 -323904
22904 -323904 362372 140086 -96902 -36177 -116314 -212183 -112445 206228 -156800 229360
22893 264707 -62545 150308 245939 -271929 21291 306067 -152797 -4208 260273 -32790 48513
22881 106946 -317278 263450 240933 -146847 11336 -456289 65931 -159862 188148 154065
22871 154065 16864 -289451 259635 -86110 73707 50640 -320690 -387900 -427254 -59309 -267608
22860 -267608 53553 48703 -48977 94579 113006 -221476 -236335 37054 85420 137485 113152
22849 113152 -6707 66977 20458 -28480 52350 -454714 188271 1565 -73628 -95929 -306212
22838 -306212 -126560 101930 238335 109618 20060 21587 -97414 -68088 259670 -309467
22827 184667 -146002 -445605 108469 155775 252056 125718 -100790 333024 -131166 -247783
22817 -247783 -195603 27257 50186 220466 -84225 -79243 -168336 -75124 207370 -106256 80453
22805 -131995 -68472 78397 5771 -46096 160015 -77120 -408559 342271 239601 81508 211684
22794 211684 -96937 313205 -67965 10783 -182150 -24993 78492 -76434 -121489 -175906 222101
22782 -153399 33462 -124691 -308021 129259 239147 179669 -70742 241767 62605 159981
22772 159981 -164195 -85441 58238 115966 -245681 322338 -87698 -339280 46160 -414271
22761 166765 116132 -343043 -277190 188528 218221 -406965 -345149 6780 -158858 -94013 75777
22749 -222968 -11408 24106 -209145 199204 495681 -273982 -89809 213861 38442 55471
22739 55471 200245 -251581 225014 219301 -123903 -76232 -369178 185765 109237 57525 -9148
22727 41787 88260 -243247 -342963 24556 -12758 -225772 78950 3537 -28326 -112509 -87209
22716 -87209 124300 -38825 335178 172885 -186869 -143730 126351 112551 -286845 320965
22705 -220015 160070 107362 -88757 -304264 221044 16399 -4748 -505442 256819 158611 188111
22694 188111 151606 285508 153977 -381097 -133454 39261 -54758 38457 -351763 -92357
22683 -81944 -66913 -28652 202231 -77098 -14719 -276774 97711 223674 -126133 -233498 -134750
22672 -134750 115427 -22229 -351933 -279749 252613 -373955 -108408 -251217 -326520 -64014
22661 134492 -8404 214508 107223 106344 145820 146769 -103706 68792 206832 46663 -349448
22649 63983 -209029 54442 -173995 -147002 -226505 4035 -493251 68915 139393 -4714 194894
22637 -4356 158099 -136099 -44105 -100736 62690 -220273 62774 7538 254083 -262677 89126
22625 80196 -180383 326049 -207279 -41257 -370120 -211368 47183 -46635 -119739 191572
22614 65927 -416282 -187145 5923 -91343 24876 12064 -419223 50069 40554 -93780 103334
22602 430872 234742 -49437 -130013 82842 -77006 153558 -93302 257019 -98494 3727 -70457
22590 -159469 -155755 128774 -200175 -203126 -19710 153370 -205151 -176329 -301288 104976 -73659
22578 -250514 95096 42519 63196 44939 74911 121588 8104 -46039 -23952 -220894 -39924
22566 -2233 -168390 17510 -293752 140795 -64647 -304106 256966 113972 -34159 -150340
22556 -150340 -303797 -175937 23230 272647 -229646 -292778 115662 -10500 181608 -363957
22545 19182 -178060 1022 45026 1525 39538 256485 -88272 -167741 -66129 -128581 95470 85544
22533 85544 6046 184792 -29753 -227475 227191 116917 104051 -204157 258238 67268 213701
22522 213701 -143966 -131493 -263270 -88513 -128110 -115996 -35281 80007 -130646 53271 -188251
22510 -91781 166513 -289868 19332 132005 -321448 38322 22579 -25797 281755 82024 4202
22498 -93733 65847 -60688 -20451 264981 -96648 329798 -204573 54002 -339856 199426 143632
22487 143632 19580 158502 -341307 110247 6800 37193 -66273 198865 305864 -261951
22476 42864 -225626 210039 -150790 -261533 11409 -76165 1120 -91204 267904 -291947 45492
22464 -312021 -47001 -188094 115901 -39616 -188866 -166781 -357314 -467478 596064 67083
22453 65049 -233533 184346 116325 81984 388524 -68781 -63460 48881 50165 217074 -182874
22441 -89881 -54206 -39167 -80312 -41781 -149360 -217122 90186 -60362 295981 24742 -204711
22429 -112655 -136373 -71741 -82572 -129033 -152078 -45060 -44401 -167641 271966 -69941 -88305
22418 -88305 -201927 -322313 -220296 -45200 -87302 102106 -16497 -299364 160684 260160
22408 260160 -146464 -229540 -299115 -81643 120086 -88502 -227326 -185758 18530 -241050 -390217
22397 -390217 -133157 -67489 -241822 -34006 204898 -82702 27194 186162 -28413 13284 -57484
22385 -160228 -159771 113547 -40642 -189306 -117161 -193314 -259006 -22187 -3099 127350 -5306 -104360
22373 -104360 126527 -137375 -60524 -89662 -317387 59354 -218402 -297743 111520 25467
22362 -110575 -12771 22959 -181728 -101199 -66139 8500 2721 -356705 -275539 119382 -207839
22350 237710 -23 153335 151101 155544 -214234 148900 152386 -293112 -75299 121259 247651
22339 247651 49969 -70037 -26450 -357251 -136045 206965 -222480 87406 119755 -273079
22328 140584 375828 79145 -315157 -6048 197282 59693 -176630 -40544 -252915 40086 -93977
22316 -22735 -254403 -260341 -247560 172769 47023 -91295 69320 -216361 -222006 -95452 -421786
22305 -421786 -25089 -73160 211576 181389 -101171 -16394 -235157 -159771 250406 -300676
22294 96061 124291 -77130 23166 -240214 98434 213460 151651 230414 -216734 22995 -40808
22282 -96226 32070 112642 262219 63786 175021 -106216 252957 46321 -298417 -189955
22272 -189955 -20957 -238412 -164516 25878 -110877 -124981 -157208 289408 -97164 -51736 -71796
22261 -71796 -352867 -169841 -189598 -18802 -148239 -237321 -255297 -165644 208742 297317 30095
22249 22618 -77559 -176237 -190652 22915 33584 41652 -132003 75985 85571 -141333 288646
22237 57193 -41103 -166687 65754 49817 -29520 48825 100409 114376 47356 410696 -350491
22225 125164 -66250 36521 -112133 -128378 -220406 -229507 -88075 165393 118366 -34861 -128803
22214 -128803 -223761 -111132 25530 191530 -112220 152829 -286591 -241452 -38863 -38690 -302231
22203 -302231 -75559 221492 -339438 -2388 -73032 110206 62854 -124459 10120 -76760 -184702
22192 -184702 19649 23149 359190 25974 27246 -167736 129584 15448 97211 45548 122697
22181 122697 -78348 140191 54226 23245 -108701 -70255 -175403 -59627 143883 130847 -204858
22169 -51789 67120 -254973 -72370 -149479 -94931 80126 75364 -135822 238289 -13936 7710
22157 -68075 -106733 -101426 166902 269255 78803 -138031 -6711 -321329 -148751 -25479 -42916
22146 -42916 101658 -44558 209583 -75106 -236859 115729 509839 -160230 326442 343332
22136 343332 186805 -93364 251989 -128639 102628 -82235 -221729 33511 -181028 -131369
22126 -131369 -198388 58709 -176357 -142060 77706 -74424 28121 12336 -109646 80472 -275017
22114 -235180 68542 -5484 3516 43171 -182397 -178398 -452209 -43330 -3672 154591 190860 -177277
22101 2304 -146901 257888 157294 108905 -7678 33251 90902 196524 17327 100207 -184634
22089 225375 213942 132567 -58198 76362 244978 50961 -276067 202680 -56999 151697 -203148
22077 33646 -122415 -136969 -221140 -271298 -215229 -120792 -26121 114650 -29488 -133146 69312
22065 -215566 120513 -44251 -174176 -121226 -364955 225565 -54373 -158336 -309636 189436
22054 322872 -104561 -67218 -196694 -68950 207251 98497 -407119 3881 55559 27243 -171550
22042 -178066 -168360 -383570 -284530 -135288 -464352 -172111 57870 -338100 -379411 -85937 -238541
22031 -238541 -485850 134171 33767 -261069 -310396 30031 154060 264490 -137773 55653
22020 -86183 -230342 8662 -64245 -78427 -336266 51043 -12434 -174601 -132438 -46372 -119876
22009 -119876 -75284 12110 -156451 41456 -157635 146377 -3675 -162486 17489 184667 -17098
21997 61283 137932 -15143 141443 88455 -323265 -2175 50845 124826 -181460 -23902 225954
21985 6438 -15190 -252368 -85977 51043 115590 281350 47591 -88226 120145 329610 -315846
21973 -265412 -161668 -21770 -108018 82759 2461 10558 -97772 -359013 125851 176216 75350
21961 -1268 -1961 -301448 -79180 -278575 -965 125991 -245502 108954 -18316 87740 -317867
21949 -102250 7268 230510 537109 9948 -219482 263469 -75280 -40264 -202428 -250004 -375157
21938 -375157 -2072 -134799 -191230 -256236 -14379 78772 -39021 -289522 33774 56578 -225823
21926 17749 -62944 206062 56349 62584 -204896 -71750 -43710 -179229 -163185 -41642 134009
21914 -182435 153613 230886 104085 -162275 -248823 -241933 -185752 41579 -226681 17432 -109733
21902 181895 44072 -58077 35291 62189 72325 187115 -62523 -230014 -43164 -99730 -38510
21890 437132 -50198 -130941 -43357 96619 187118 30478 -189053 -338886 -104171 45242 67870
21879 67870 -332502 -336795 93769 135791 321079 99280 -428578 113419 83489 147256 -233348
21867 466276 92493 15632 -304241 279714 169548 354123 -105807 71713 -209533 -166675
21857 -166675 214172 -103383 -294341 141975 128354 -77794 -450437 -314772 -209657 -98936
21846 -190579 57766 -65362 -294557 101992 -25734 -247773 -6511 30824 -288138 5678 -45682
21834 -92114 -75790 -329897 277019 -150934 -65878 -211139 174708 -205202 -85086 467193
21823 22556 -19759 -20270 123339 -34982 212129 -96745 -51033 -37644 -149576 -93058 191997
21811 -127181 -167629 -142025 -158098 -82051 -231707 92275 -175666 -48452 -46788 79496 -83953
21799 -5434 -33812 -62302 -347886 77632 -103296 164128 -44057 -41237 -322900 -82111 -205967
21788 -205967 60420 68939 353234 -261939 -240538 -149899 357351 -137583 20831 -92246 -293411
21777 -293411 -103261 264053 -92775 382767 21083 188769 -117967 50946 8565 15956 -302823
21765 89005 38309 103358 266312 -10121 82295 -54853 1735 337862 -172714 -133586 132875
21753 -215557 27862 124402 89749 82962 26303 -111419 -176450 59118 -191725 -39980 269234
21741 -251892 213480 99646 107533 -13848 -240729 132641 46227 14606 -115666 -111478 -39071
21729 -263337 24522 -147884 -136190 -166619 95918 -210152 -272921 76554 310210 -142884 333442
21717 198688 123849 38676 -133419 -248159 -88958 53807 -411408 -339865 10029 -259870 61108
21705 -426439 -23366 76209 -55441 -360024 -79957 -64947 -172634 -220894 -58497 -7030 18598
21693 -229197 -98727 -62957 -234316 -117114 150093 11204 -146645 -303195 399826 15338
21682 -262497 -196665 -20087 14579 -47562 -2484 -137142 -149743 6107 -212734 204156 106686
21671 106686 25497 -190000 -332116 -322368 -37224 -15759 -200788 94988 -212131 201331 75426
21659 70109 21716 -23187 164099 168492 239583 -210143 -83573 -80682 -201751 -57993 -231091
21648 -231091 351685 117314 113289 276596 -75163 -180154 -84829 -140987 -322832 -140250
21637 -27297 -47650 -63518 -123611 169877 -84409 137694 -101370 -92080 172315 -121098 -186322
21626 -186322 109979 107803 -290870 -123142 -88720 37969 75072 -9011 -123825 32060 -51590
21614 -232852 -11646 15586 -142545 4308 -123677 -217908 -31384 -168767 -32223 -146237 -217192
21603 -217192 184103 -63888 -223893 -111948 176148 21128 95426 89625 173675 -71407 99831
21591 -352002 -166060 319774 294 57237 -135417 289102 -170076 -170530 89085 87228 -74260
21579 -117521 317096 242994 -74672 -111355 82422 -268171 -365224 -66798 -196634 -411987 -112473
21567 159771 -387016 8483 -485346 -38886 196360 25021 85012 53936 2929 -55418 -353380
21556 -353380 -387067 -34422 -163808 11699 -368490 -249214 -274789 -14630 -194231 -20334 -41497
21545 -41497 -146376 8885 -81457 64799 -227575 -118244 -468483 -89109 131237 -8616 -242284
21534 -242284 -166619 -42081 100331 -111690 -327401 -19486 -40559 104139 -188575 -224743
21524 -224743 -318640 -295883 -202242 -97462 141719 -130849 56431 -13024 -3999 145827 -152654
21512 142369 248753 -41649 209330 -290185 208073 -11796 735005 161287 126254 131259
21502 131259 168237 60948 -42479 51344 112353 -172116 -167999 18717 91813 -11716 -295452
21491 -295452 71286 -207698 -170665 -287439 39966 161466 -25490 -293185 293808 267695
21481 267695 -23069 -110599 -22923 25640 -207962 -235489 -302001 -80463 -146082 218185 -245084
21469 212994 -48372 -121184 -79464 -209995 -32396 -126113 -198006 -61946 132080 99814 -339253
21457 -106608 -79869 -292047 151428 178677 6130 -323301 231181 35316 3577 308557 139624
21445 -176160 -188780 -87518 -3460 23567 9174 299023 -127120 -24327 -62744 135349 582438
21434 582438 459440 621725 432778 134768 417627 51760 102306 -1850 -250810 68007
21423 -195349 -149376 -82924 2553 -66588 -137680 -129527 15814 48042 143861 -4058 83833 194074
21411 194074 142614 -276628 101702 -264837 -81120 240872 -160591 -24258 -350549 -6925
21400 -130646 8960 -15099 -18791 171214 59956 -284258 -30835 -78012 -26340 -26909 3864 166015
21388 166015 140322 146575 170266 -102017 275248 119413 -334063 45306 -271157 94342 -290205
21376 -263415 -229779 -28021 2938 -489612 -287383 78478 -316654 64121 79332 -2811 193639
21364 34337 241216 -138473 91248 143938 188755 14627 105374 -74768 -117071 -395945 -155452
21352 -40151 -321981 61838 -229481 211928 -229468 -414615 91903 -443525 -124450 -33018
21341 -263763 -241320 163617 -154456 -51089 10496 57272 -208173 117064 -107107 -315015
21331 -315015 122279 -169599 -178760 -51228 34574 33773 -104713 69468 185854 -334589 -116321
21319 63633 -95077 -468165 -65650 53811 -274823 -107672 91420 -168221 -73730 119334 132725
21308 132725 -146281 350099 125082 -32493 137946 -37325 -158889 -275702 -57992 358137
21297 -90625 219484 -208469 64238 -192432 -301531 222355 61842 8878 5052 -421441 -131788
21285 198290 170491 145353 76698 -319786 386914 -53936 -407819 -288526 32171 73994 195166
21274 195166 60153 329003 70140 59177 -205810 109098 28531 18534 243951 277288 -130126
21262 -360234 -123608 -9680 -45418 185309 -146934 -245358 -114278 -143410 -49701 -28270 -35869
21251 -35869 207892 -241631 22339 -215708 -185551 4459 -370865 -21289 -22867 -240151 -45820
21239 104876 403934 -23786 145822 -47555 -231183 42490 8394 -10426 -82596 -81602 13967
21227 -21305 456959 210542 -20231 -245385 -214853 96579 89245 -85261 114635 -76654 -153371
21216 -153371 -83624 153515 271850 -3890 138412 -129135 49477 78861 -129419 -50073 3064
21204 -107159 172267 -235571 -332003 -210288 -76477 -496938 -233016 12344 -219575 115661
21193 -122669 -258926 73620 47249 250207 89323 -152526 -162093 -58199 -176471 -409009 1025
21181 -448510 -155775 181774 -289427 -268025 23984 75425 124642 -141181 -149223 -155477 -58258
21169 -359825 216447 3519 -129405 -137233 -108892 -213020 -77127 -129184 -37674 -319920 9273
21157 37217 15761 -260903 -49186 106549 -402029 -114225 75237 -93734 390254 -100405
21146 -145980 -257499 50807 -19639 169610 -138628 -243535 120154 11686 -222678 -58869
21135 -293288 91881 -155251 62614 11714 160381 -198658 15874 -33758 -249931 256615
21124 20606 -302133 72788 41195 -126968 -12130 -126730 -247940 110832 -183034 -195008
21114 -195008 -78143 -87832 -221483 -215748 120608 -109895 -129621 -63641 -24664 395346 159891
21102 230108 306 7612 -310143 -46058 -82927 294972 -376273 -262483 -90128 -299346 -138908
21090 219599 -241408 -255823 -91600 -34406 -93738 -204198 -112387 -272453 -258881 -191972 127179
21078 -66051 133052 -66877 -60495 33761 -254589 28826 40282 -111840 3843 -35585 189333
21066 -138472 -132344 85594 -114953 -495832 120233 -56135 28131 189197 14863 68626 118804
21055 118804 -170444 11335 -86805 25201 -219611 121079 -77912 153517 -4485 -237574 -270552
21044 -270552 154401 -355685 -93929 -210042 -181517 -65825 -208493 -17702 -4872 -241412 219896
21032 362039 -57172 70961 215006 -108294 217480 346700 -208789 299163 -85494 -254793
21022 -254793 -90764 -200350 -199001 -326414 13696 -148182 -112601 106161 -319190 6968 142516
21011 142516 -99916 -135245 215817 -21831 76063 -452138 203134 13836 -141883 -10241 -28997
21000 -28997 -53793 58345 244948 67111 144735 -274957 157190 4584 -331433 -32959 -99327
20989 -99327 -135772 -55216 80152 -159882 97619 -274533 -84214 -52444 -282482 286548 -111620
20977 -220087 353188 -12972 57623 -251565 7328 -117023 123070 -297040 -195185 -81808
20966 -220494 124272 -169163 -70594 -97861 101778 66913 182199 135978 -54412 405540
20955 53132 -15588 97152 -244874 -167689 38533 332119 -241249 -83733 257657 126690 183524
20944 183524 -254773 825 -313908 -186149 169736 -415766 -206341 16095 32857 78927 -122783
20932 169706 -213008 7996 -288569 -386827 24711 -200258 85003 156711 157430 -238685 -32050
20920 2359 281928 31310 -40381 -130879 64845 185321 232796 144268 89240 235442 98009
20908 22555 -153908 244279 21826 -68261 -137477 -219784 116291 231736 -175117 11972 -202334
20896 -372715 247958 -186231 23977 151345 225050 328235 -70933 -369204 -188065 12524
20885 44152 -120941 214029 -192814 -99371 -158806 -2230 29476 -211199 -187555 189176 -440949
20873 -86206 26780 -319228 219482 -167501 -100209 -108709 -203796 -172512 23271 -64474 -37237
20862 -37237 82889 167119 71587 -78574 -288350 129786 -193432 -303985 -346608 -207725 -99083
20850 -1639 -105904 299723 17501 -121071 -124424 172920 -158482 -60166 -66047 4575 -124205
20838 -12939 80330 155215 -1593 91010 -93406 -178479 -84801 -118741 -84455 173337 24887 -124790
20825 -515002 -353196 94819 173718 -185305 -17667 111033 12955 111490 90138 -92012 -247714
20814 -247714 -291779 -22053 -235233 -206959 157471 -430469 -129332 91820 -235266 179577
20803 -121391 -284821 355352 -76030 -199132 81375 -48921 -169949 -68694 -70308 -262831 -15634
20791 257531 -3260 -434567 -18884 -239562 -14670 -356718 -171349 165300 57299 -5795 104087
20779 37391 252311 247990 -289131 235711 70246 -287525 37071 -240134 -37566 -188922 42835
20767 -215461 -541950 -21368 -130866 -126727 -6005 178608 -154273 116251 -126802 -81105 -40383
20755 150090 -331699 -281389 -61985 120615 40301 58287 -44339 -9503 11300 -173303 43182
20743 -85597 -107702 -86500 -211840 -4186 -289845 -204882 156 474536 255643 -149654 -256912
20732 -256912 -41027 111243 -349321 154863 4736 -294473 49189 -27005 86315 87105 -325656
20720 -73697 -66870 9028 -26525 -76965 -247034 -43475 -239319 -169356 -5574 58196 -265977 -64089
20707 21476 -85318 169846 -230495 -121343 2529 -192918 -313742 -250477 128479 -73976 98066
20695 188297 -486352 96705 -132277 -60009 -55092 283810 -149262 113064 -45422 -290626
20685 -290626 -241533 -236735 -117079 225172 -40821 243000 121771 -47122 294308 -411951
20674 -47199 -50952 135330 103205 25255 14577 -225302 -171056 242028 -33697 -300787 239173
20662 -17617 91140 108471 -26660 -169461 5524 -3460 66344 478197 402410 -72455 -121408 -141883
20650 -141883 22989 181657 -8538 -76700 -76264 -517831 -187466 65448 78116 -129319 -64297
20638 -463603 -338931 109189 -224227 212573 -131078 -13253 129586 175259 -33507 106809
20627 -1582 -62686 -12640 119087 -1297 -85162 162284 9986 -90880 173694 -16652 -307981
20616 -307981 190654 -95894 -253683 80866 8332 91649 -434631 86810 -135590 -213210 -285302
20605 -285302 -294258 -124751 -47860 53730 -191159 53644 337328 -327292 -159540 -276887
20595 -276887 -92217 -116741 -193556 68932 -21410 -264528 -25636 260487 -146122 12593 -14139
20583 -25956 -323958 -20321 27138 111149 -112660 -337154 -365422 158281 180024 -289020 -60463
20571 -232758 -172579 385744 -215719 -114185 71857 153036 -195530 -168764 208934 -202240
20560 191302 -92768 -46600 -45937 -35377 -209035 50860 777 -483252 -78788 188928 -136165
20548 -135282 -305985 -334030 -458147 123800 240689 60840 -110036 129244 -2188 -120268
20538 -120268 -247459 -54635 56404 221654 -141756 65795 -195565 372339 123351 142381
20528 142381 -70138 -215550 -83582 -169597 -203423 17165 68847 -266200 76897 153485 251078
20517 251078 196779 -56419 -148368 -13758 -180232 -126401 229453 -158615 -42686 54612 32660
20506 32660 -129911 36724 -16892 62257 143555 -180706 103879 -32640 -150726 55576 13235
20494 2761 -10650 348225 249336 65188 64700 143673 -100206 -178067 -235197 59018 -654 75774
20481 206519 225732 -367219 414725 -126030 -24282 387419 138986 -160520 284853 -149401
20470 97649 -103184 148033 -40918 47519 17303 -13780 334999 28232 370937 -344057 -115342
20458 98292 125542 -453956 -232222 -52585 -125999 -21096 227288 38273 -208166 192748 61424
20446 -127472 -36687 -17014 36910 -91932 -164168 -278501 175609 1913 -72327 248721 109204
20434 245455 -156464 153617 -72866 104129 143821 18857 -152883 147339 -10883 -240836
20424 -240836 13456 -530689 -106515 -182553 -225039 -450134 -218277 -139318 -362758 -274155
20414 -274155 191770 -361452 45958 -87760 -70653 -74093 302972 -238902 -196261 -216155 -414291
20403 -414291 -142923 -437333 -43345 -133508 -63879 322701 44811 -211582 192140 -177570
20392 74881 126255 -45066 -335791 19109 171756 160076 -114148 -54874 -109858 141446 -206446
20380 121836 -37967 -224602 24628 -27130 -79167 -213846 -44780 -149993 -412486 12648 34457
20369 34457 -188333 -335955 265523 225958 -296584 -38517 -94950 47903 64770 70060 -268021
20357 197752 -231040 -347078 -37200 -258476 -58072 59691 131007 -2856 194105 -172024 165207
20345 -80444 64879 -369871 191662 -169505 -134160 103011 276338 177869 -26648 -179666
20335 -179666 -53998 -55320 378974 186442 -1372 -175095 81172 -16361 -209786 -32171 -241854
20324 -241854 -216776 -24583 92664 -282873 -193766 275607 -11485 -294936 103159 -237653
20313 223377 176501 10127 -288646 -167972 -185431 193844 111177 70758 -203633 -380349
20303 -380349 143042 220552 85300 -121953 19185 37705 -69624 -233370 138475 77493 -271580
20291 -205161 -223392 80186 50202 46824 -62634 283 -343703 -88083 -165562 -29186 183492 -88103
20278 -15971 -168374 15784 -447434 -68865 -323801 71286 -23627 -117460 341926 -178768 -331051
20267 -331051 95999 118615 -65241 -315631 -378194 -176052 36370 -56858 -161589 -158630 -252857
20256 -252857 -189510 319370 96303 -220802 -48492 -190291 62386 -16219 102411 -196292
20245 -294991 -12735 51333 144590 -177790 18878 259485 125068 -53955 -655574 -48766 291278
20233 914 -40652 -86267 -2888 -7928 -226449 -99870 -284413 -176315 7411 -103948 -232539 -40781
20220 55253 143559 -263353 -219682 -67913 215497 -44471 104606 -71154 -66791 -157630 183192
20208 104966 -211336 -2421 12233 224225 127374 77134 -120677 -112573 -163468 -443 -216389
20197 -216389 320266 -60142 -74172 114099 119667 -54605 31015 13402 -33423 -352867 -49227
20185 -171324 -120256 -38682 -62085 10208 135035 49512 -296937 37321 -208881 -20735 83275
20173 -268978 -137168 113890 3088 129489 271638 -165431 14412 -15903 -127147 -67217
20163 -67217 333098 178989 361457 142122 203705 -9983 148335 -80504 -264608 -185297 253797
20151 80690 -56881 -105393 413652 13787 14718 -107651 -87048 -478693 -217257 -38745 -55201
20140 -55201 51386 101034 -261897 201894 -161224 -16346 -246098 -287244 -920 19332 15370
20129 15370 30531 15477 -94935 8644 -476462 230570 -309831 -175308 -337094 -46182 92879
20117 92220 -6792 -143310 -116121 82481 -204915 -193797 39362 -46490 -134914 -176512 -24562
20105 -68321 44923 -59707 -24166 160039 173102 -137552 -109602 165476 107751 -192339 33410
20093 -116687 35777 -66566 -301596 -598911 115362 -88451 -200973 -229257 179439 269496
20083 269496 173338 -102943 115230 -48289 -129183 -186439 -129887 -281666 -35125 -332599 -19901
20071 6243 -156516 -105743 63486 375238 -105617 60557 -204154 53282 -86329 173792 -230871
20059 -25866 269987 -66039 -192364 -264557 3839 -221594 -68728 117501 30615 -98855 155224
20047 103958 74112 -135381 -136299 -5366 -105491 106481 157823 -171381 31620 -112230 18542
20035 93764 -370617 210701 103008 65396 -184897 125101 -49400 -289980 80321 -254301
20024 -3578 19844 -196094 163049 -120146 -194941 -25465 299886 47580 93864 113434 22530
20012 -3459 -27240 -308839 -36882 -61705 68644 52088 61204 -54091 -184907 111660 188421
20001 188421 -65436 -101322 93041 -156560 -258813 -194856 -23112 99356 -20218 -125645 -322759
19990 -322759 -104981 -197254 -135635 -128393 189995 -281100 48197 112607 213150 -111983 363821
19978 49342 -245896 -82167 -3069 49459 128441 41082 291636 89548 -57373 -119987 121253
19966 40657 -176787 -177241 -123855 -50781 104495 121771 297815 29295 16488 -7894 -30698 -196047
19954 -196047 -44893 -337875 -162041 -10205 -28597 -237245 44195 -113890 265505 -10052
19943 214885 -302323 99058 124412 -190377 -18816 -120300 -208516 -193777 -33870 137527 -204648
19931 195824 145764 -136366 -128428 -113583 -111679 -81492 -25545 -137844 -391217 -40158 -81440
19920 -81440 -115937 -148979 -199630 -67688 -306181 25270 96272 7901 -197400 -128645 352858
19908 -159685 -194712 89160 -189361 -161644 -118140 11671 -297015 -101361 -23937 -132469 75372
19896 -93571 -306707 32513 -140809 -46120 26806 -230640 43001 149204 16148 -459241 234570
19884 231865 165896 101426 128309 -205678 -71945 68548 -42922 -124093 11800 171529 -302004
19872 -64838 126390 19418 -271285 108049 15168 -64782 43709 -239360 -100226 -357705
19862 -357705 -158032 -15865 323248 101851 -155309 -156142 -261099 236361 -214222 -156985
19852 -156985 66790 -54081 -297525 -41295 56438 -64709 73905 244505 27697 -99837 -100013
19841 -100013 136763 -217194 -514817 -25584 -286295 194904 -221179 166151 13740 120106
19831 120106 -14487 -286661 -176955 261082 -273785 241253 -106487 -221183 117686 -61671
19820 -85242 -219671 -213200 -116964 308636 121660 -74764 89902 -11637 -79189 165219 -290836
19808 24367 -5800 -1267 -154473 129042 199492 60226 -220199 -25486 -409836 -311933 140080
19796 -119726 89190 23163 182191 -50760 -22587 141942 128193 198665 200695 135785 5852
19784 -278897 218601 -236931 208309 -133701 -313381 -311610 -204817 -172606 -113005 29344
19773 163784 56326 -484055 93288 -148681 -97823 -362941 -29633 36649 59342 -7976 -8786
19762 -8786 -232709 -164122 -137380 -303885 121514 -10750 -134889 -116020 -18341 -139211 209328
19750 131730 -367518 31709 84222 -143045 -72356 37302 -2471 -483888 120861 -218667 -390356
19739 -390356 101932 -28360 80011 4341 145168 132773 -447715 -98634 -38024 -255514 -86448
19727 141471 125348 107837 -115569 -167764 198204 211640 187199 -69301 -56255 9167 -113792
19715 -63618 -368212 -2800 87706 179680 174058 112415 -387073 -121062 -118677 35318 -113409
19703 52398 53812 325216 34259 93366 -89434 -138504 1270 -160752 160829 -16850 244646
19691 -131685 14126 -158816 272301 119156 -101632 298967 -95333 -37715 -28221 332189
19680 -54593 -62248 -133773 81883 73630 3761 -34219 207306 74062 -48978 -167484 -213816 -186429
19668 -186429 -18175 224049 94273 315230 -58695 -4762 -38818 -317037 -103626 55327 -25122
19656 -41187 -368662 -195012 -17532 -81008 398089 163719 -329075 136137 -160498 114817
19645 21004 -138100 366 -257342 -29641 -85811 160746 47581 -257221 76795 -40271 335453
19633 -523826 -270960 -216824 211007 -163453 87324 195172 -262070 255568 -88003 -59092
19623 -59092 39073 -92356 -273241 -143664 -228939 -261147 53167 -127656 -11356 121209 25989
19611 14470 -336941 -50609 -230239 -315846 241945 195438 79213 -236669 -169787 -220737 127378
19599 -133157 67854 -18725 75691 237949 -128046 -375401 22852 -18209 -78001 -66555 -122868
19588 -122868 182291 -11538 86177 -21433 88331 -251281 295899 144192 -7022 -56500 -24780
19576 -148092 -40364 -128779 -359529 39564 84749 9831 -417379 124817 -199172 193117 83234
19564 -7939 -21865 311230 33760 138479 -5344 97642 109904 -87810 46335 142680 39013 -51605
19551 -40189 -340856 -73172 88581 -144859 -166649 -41718 -15486 -64136 -419444 -33172 -52987
19540 -52987 174885 -117856 -149513 -105948 -272838 90543 -223607 81717 -96511 -22657 -407664
19529 -407664 29184 55023 294290 51915 439087 10039 36436 -233044 -87011 -110376 439608
19517 -92436 -182959 -118398 178411 38764 94488 225807 -141040 -248324 -73648 -243439 38859
19505 -65962 -14844 29960 14345 -53528 137921 -95629 -240843 -243125 -108971 -253774 23815
19493 -115631 -225688 -219779 -230444 114779 -352308 55882 -73224 -579994 251986 -310067
19482 -346336 -90659 205882 -20676 -427741 -37218 -23644 -240245 207946 -234222 -356006
19472 -356006 -400992 -324184 -234147 -166864 120272 -137076 -246610 18899 3581 12 -137040
19460 -215749 36136 -121686 8264 -232739 -390147 -6773 -207143 84052 188833 -1455 -36463
19449 -36463 -17405 250398 214910 -200999 181472 205070 -2722 -14560 104008 -143054 -299620
19438 -299620 -73888 41080 -250462 -296063 -12312 38634 -89232 -204594 49792 -337776 53300
19426 -479187 -45285 -45871 196097 -42962 -332750 -99479 -109792 95523 149694 -46705 -10867
19414 -224501 -39168 14959 -263104 -141634 -386072 -127240 -125933 -42886 14271 -26887 183141
19402 -352202 -2111 -69683 -66802 -34756 -180029 -352654 113341 -163799 -150695 -291874 281027
19390 -54340 -20175 -6951 -173244 -144933 -17929 31062 -91924 117975 120973 210095 253193 -70622
19377 190391 -254466 -108735 -231705 156986 -21115 -243653 -383257 -244196 183643 -362356
19366 311663 36349 -10042 -80042 -85106 -206153 200889 229923 -144560 -338908 -256181 -102806
19354 59712 -207460 54456 -112825 -338632 -95860 -34237 151961 112489 38111 -234352 80373
19342 -84060 -292462 -39151 124204 -117845 -213666 121563 63605 184250 133826 -431736
19331 326581 35590 -195589 -92047 -88313 50380 -111106 -111995 28381 -39717 -338044 146273
19319 21387 -366249 -153511 -6814 -204672 129642 -141356 -73802 -181407 328431 76165
19308 383537 -298117 -127348 -138709 -323871 206691 -483066 18119 -187879 180931 -46916
19297 -433247 -197394 153887 -129492 -368276 228063 248103 -14364 -243451 -98227 -71400
19287 -71400 69759 -437955 -126701 -144940 -115950 -65813 39926 -348734 -630554 -261458 -33750
19275 -88638 1411 -60494 344433 -101617 -75758 170977 -210279 -135194 -240767 -68598 -134497
19264 -134497 251525 295029 -287584 130307 -344448 -281613 81063 38727 -507255 -95927
19253 258732 -108387 126976 -13335 228006 140452 18434 71017 -114437 -225836 -186931
19243 -186931 114126 26722 -152896 -8900 -6606 -381529 -70012 -527400 89652 132924 -86619
19231 -331092 -128669 132131 -174473 106162 190719 134300 -283067 313760 8002 38593
19221 38593 159838 -231129 290661 -114818 2292 -102028 361676 -240706 -88467 -159479
19211 -159479 -60269 45079 43914 183759 -356690 60608 -232286 20315 317390 -114872 -92266
19200 -92266 -66828 -333543 4199 129316 -77105 -32616 75778 -168019 -55765 -33168 -30354
19189 -30354 5326 16233 -260978 191672 285572 -195993 -12085 -301462 -54524 14039 -175476
19177 -167171 -3167 -254353 -143951 -147079 63211 -99565 93250 -166421 -99037 -25389 -96926
19166 -96926 -8571 202539 -330244 -195393 77468 -226767 -10242 326629 -50074 -110693 -80646
19155 -80646 -164730 -1689 81952 -280080 -68286 29794 83906 -134777 -275082 344855 -250170
19143 -37166 48536 159320 123466 -251019 -269140 -292230 -82964 -109875 -89652 -30068 35741
19131 -105844 -297657 -245994 -334748 70287 -19291 -547027 -423981 37759 -190223 -114450 -242564
19120 -242564 -17237 229773 -85928 -115357 -62767 -166877 -226517 102725 176200 -102448 -158213
19109 -158213 -4220 -46903 1335 -88772 -524659 -33208 164777 282801 -272957 53490 -185948
19097 -245748 -89132 -164523 422350 11520 29229 -77015 -40793 129729 -154710 130460 8214
19085 -108588 -26358 1617 191465 -139651 -157157 97783 388819 -170826 -377248 -32741 -93730
19074 -93730 39208 -47953 -25403 48162 49911 2738 73404 236746 -56668 96854 -106667 -203881
19062 -203881 6001 -147657 -165552 -21462 -268871 289632 -57080 -298031 206897 178685 221412
19051 221412 280679 238712 51922 -206353 -437872 -177509 141468 61071 36781 -74272 127393
19039 104294 -24435 59786 -223905 67207 -135140 -143918 -107424 -174585 42620 -135268 14438
19027 -39267 27677 -99833 -41805 -36660 426237 -154208 -81823 22709 -27961 111768 54851
19015 -71998 -46625 -75964 196140 119677 -101263 -101056 -157113 231483 333431 -113256 202377
19003 225615 -258054 -146123 -95904 -459133 342082 -80997 -101373 -18006 4324 46275 -125446
18991 -106965 -136425 -174823 -173736 29891 183387 -14992 156320 -25056 294389 -104294 -61439
18980 -61439 134968 7419 -167543 281461 -6211 1484 -122565 -404463 -9349 -222469 50960
18968 -305159 -138745 17902 -62597 -23156 -34315 -80568 -256431 71906 53900 -40416 -169898
18957 -169898 18144 76219 -66700 -331059 -85713 94446 2109 -193174 -191833 -263357 -208815
18946 -208815 77548 33047 -28671 127109 171202 -149086 256929 418360 -435288 52227
18935 -119687 3729 -60764 96877 124412 65833 61442 -378193 -111806 144075 -189903 -147054
18924 -147054 -152972 -39603 -285110 -80178 -442443 10621 51596 81100 -26556 35654 -248322
18912 -310583 121419 -300438 -95637 -210335 61675 33166 -330270 -266371 -221527 -76014 172569
18900 -209646 154823 69927 -217109 -128841 -185548 130444 329217 -1334 160975 -50632 -85153
18889 -85153 -48129 153903 282301 -118514 -298879 -220837 13230 -110503 19645 -7859 -677586
18878 -677586 -15460 -169414 -155101 167504 -191650 -48287 -65083 89885 -95290 -107278 -88546
18867 -88546 190007 6768 239081 258872 -138465 210748 22534 -303972 15437 -296298 303575
18855 -232883 -209672 -259405 214886 -318472 76215 -57962 299206 123866 15216 -349939
18844 254368 44259 79681 -146918 41640 14847 -56237 -291972 -41550 260660 -40028 229246
18832 -46283 -28368 -171689 -276879 174359 -41113 -171293 -121447 -152420 83921 23880 73687
18821 73687 277945 84588 -181830 63212 -228356 -10582 94506 97892 80644 -178410 -1967
18809 -147186 116188 -33546 -52934 5693 -56852 313304 -97891 -415331 159152 125819 -245221
18797 -187603 -68618 -231562 -192291 -256754 125644 -156886 40959 85210 -380006 -47553 -114540
18786 -114540 -444688 -77439 18338 213221 107527 -188758 33045 -127673 -131595 163298
18775 63924 -77738 184408 -61771 19825 23391 -259258 -459228 102830 91660 178327 140915
18764 140915 -291868 182312 -150807 -33388 -17611 -126537 -87334 371514 590193 -255067
18753 198045 2452 -6642 257859 -10440 -149002 17896 29803 -167861 -297378 -112088 39768
18741 91502 -62415 -46137 -66483 82671 -8326 -324878 -83247 348568 181856 94829 1457
18729 -112410 314476 297523 -346969 -8464 61756 165773 -26308 164344 202101 -187837 75157
18717 -81870 82878 -149535 20799 -256120 -259071 -172125 -291905 -67137 -45982 31627 -216320
18705 106251 121973 46853 -269781 273147 230458 282361 -39231 70963 -92314 16654 -121392
18693 -260022 -42062 -257529 -249663 -230501 -229438 -5249 436486 97862 39664 -436525 -96767
18681 -200279 297952 -215480 137613 -47718 -57119 100057 237191 -452810 -161064 -100082
18671 -100082 -143121 -354136 682 -25619 -26934 -192157 -222032 -34330 -344850 131861 -121097
18659 -251312 169763 -124879 343867 71657 -285323 -71002 40394 -67654 56312 3252 -11378
18647 -75684 -62780 -272046 39351 59507 -119032 -273206 -231759 -212351 16125 175915 367347
18636 367347 -258457 135817 -163051 -322638 302210 58997 -14615 -256114 -301876 -294165
18626 -294165 -160197 4953 202341 -94065 -221240 169598 -1118 104525 -142754 -127739 -131959
18615 -131959 -89738 -88996 -80965 -117608 -252948 -22751 100811 -169122 91656 2475 -48435 2867
18602 -219684 239684 -57340 -307664 143718 -69749 31637 -89766 44759 -113363 -40055 55631
18590 285841 179900 -178353 92067 198562 -283758 157756 -103208 3131 157053 80272
18580 80272 -103345 325881 -164576 -177507 132268 -10452 -151930 -171685 8847 35862 99336
18569 99336 119344 90018 -19524 -269923 -18276 -155463 -991 -203166 108574 -342038 81057
18557 256182 46564 -276998 -274034 -267505 -360804 -299299 -456476 -25694 -467401 6071 -80290
18545 55898 189070 -76265 -76516 325820 -521292 -202385 46075 35237 92498 58604 149561
18534 149561 -225276 -3978 -103263 -117966 -150696 199041 -114862 48268 -318410 63913 -237649
18522 3994 -220932 -284501 -38215 -286024 -220818 -28852 -208913 -135537 11242 -200162 -231367
18511 -231367 -297480 2070 156184 229354 -362467 -155079 111663 -148511 166415 -13815
18500 131570 72963 -226013 -78137 -217485 16601 23209 153045 -249783 -25189 -384933 253828
18488 -224846 -128104 -308095 -41460 -86267 80938 76528 -233168 -77840 -290459 -58916 157195
18476 516679 64170 -316886 184981 -38835 -297624 79069 -56072 -62115 366647 -99291 166794
18464 390926 -237376 -79765 2692 254007 146170 -188460 -86996 102260 -115669 71671
18453 76046 12254 -218878 -56988 -139652 -87681 -14715 -207775 -138609 -38912 -66158 103522
18441 -145690 -94205 -129827 176142 -46901 -189440 -161138 -127953 -1130 155522 22932 -235894
18429 -123305 234101 -330099 293303 65561 -185563 193235 -191571 -86500 -128009 -60031
18418 -118600 19518 53556 110628 232169 25412 -122467 -423079 -482079 -231146 178397
18407 -58938 204907 -105782 -228796 -45081 -328462 -119602 87748 66628 -12712 -206028
18397 -206028 -148800 -67604 -253190 -94043 -135979 -104419 71985 131035 -189432 32706 -326060
18385 -141561 -16989 52990 -98166 -52778 -205895 -376876 443073 -236862 -282272 -67861 -161095
18374 -161095 -13327 -252093 184780 245020 194755 -415060 -202757 128996 267252 25592
18363 229145 -111530 -86596 222444 40562 40975 92227 -117016 10827 -132566 39884 123229
18352 123229 57902 234040 -15534 -250789 -94858 -186836 25575 -221416 -8804 41323 224723
18341 224723 89143 -71173 83131 123003 65575 66036 -183022 248815 -134917 150816 122889
18330 122889 -29502 -205856 -210180 -184489 305170 73317 294404 -35863 -98866 19567 165370
18319 165370 -91175 -50620 -96961 134246 19422 -28734 116141 235042 2434 -70822 78294
18307 -183960 226812 168968 -221452 -251035 156387 -60082 170789 209383 -273122 -86646
18296 382821 -18939 -126374 -129670 -322064 92229 -495816 -102526 -50150 -210453 -141977 -212173
18285 -212173 -93610 -66461 -135680 46468 -81071 -32014 -117968 46953 -77674 -33969 -35588 55424
18272 12494 109765 -128214 -286369 -130299 -103301 73085 149287 -122399 7218 31035 102442
18261 102442 -40024 -387263 -115062 -257482 107237 -50975 198926 228710 189771 241087
18251 241087 -333773 -114995 -112119 113274 56910 85535 -53766 123541 -37652 -109919 -27284
18239 -16270 309756 -222313 26655 -34096 -8160 228473 216163 126310 166857 -84626 235897
18227 -259881 10318 -351223 -206687 207432 -303971 207872 230245 4893 -353110 218892
18216 -254540 30920 145652 -38995 -4263 64524 -46849 90764 -261120 -81675 -109836 16471
18204 122872 23648 205046 63368 -169276 106322 132718 -46410 73577 267130 -54410 115720
18192 -68658 3208 -107868 -20793 -301900 196438 -72462 -219289 203705 99644 -169359 -97860
18181 -97860 -41389 -166502 -111345 -131698 268549 108713 -93432 140849 23769 30207 -48207
18169 219090 108651 168349 -81632 -171603 -310960 -150241 30982 -105521 168317 -282387
18158 280353 187846 138195 -247341 -1599 -297471 89365 79516 107395 -14133 -63001 -7377 -419687
18146 -419687 -57632 -85575 -375941 11605 -194085 -130871 379541 198939 170999 221976 -32946
18134 -159089 -239838 -169079 -189109 -309695 35186 88796 -379653 -101254 43716 85318 19446
18122 -22409 79986 4291 221789 -54924 -90093 117455 -91536 -52672 -116939 -111315 142774
18110 319856 -107598 -40954 37221 118362 -46359 -99923 16007 -315569 5521 -149489 8799
18098 84100 153452 -85723 -212156 -59048 -137199 72698 76362 43284 -115516 81398 41286
18087 41286 180581 52106 -154418 172025 74636 -35696 208920 89040 -274258 -276285 158476
18075 -282986 80193 -16465 -261379 -72564 127531 -15019 -16687 -40338 -2196 153012 240741
18064 240741 -160471 -31410 -74157 191907 -202960 -34978 23538 112440 -188492 -462655
18054 -462655 -273945 118019 77031 -49825 9131 203885 -262669 -275361 -67657 -15212 48870
18042 81199 -164618 -282496 -188304 -190582 -44486 150933 -200397 -16934 -320746 143451 -82774
18030 45267 131398 136294 -26624 239103 39843 51524 91858 256337 -221726 -80032 -67525
18019 -67525 -124973 -211002 150492 277403 190797 31182 91732 -332886 265163 145012 84029
18008 84029 8149 95937 164328 133526 15176 66837 -256686 48739 -274703 114849 -77731
17996 -300199 -609525 253280 116089 -85738 -76132 -2063 -270729 41654 -10397 280062 -409225
17984 66229 -202704 131141 286803 -89409 240777 -133652 -7608 329841 -53307 37141 -90553
17972 83637 -244373 -135417 -35408 205999 -136462 -43750 -109465 -11174 -168845 249766
17961 -24590 -460741 -26479 450260 46597 -328120 17174 -164180 90306 84414 -145856 -165462
17950 -165462 -176108 -64246 223018 -29322 47164 11366 40113 -139006 23819 69512 169387
17939 169387 113659 38926 8533 -105391 576179 -59396 11703 282890 -140070 -83075 157442
17927 72909 -40541 76171 -160823 -58065 -78289 -248727 226297 124394 -310825 -253503 66527
17915 -139744 57058 160487 -45296 -63867 -201434 -162046 -21237 -245672 175354 26949 -309266
17903 7766 21193 -133317 143691 -120643 9258 132643 106310 72005 125317 156264 -225587
17891 19062 -99117 501482 -225811 -219362 -10216 161012 84638 27494 -83515 -470199 78464
17879 -160387 -74220 -159690 -11526 240242 -246235 7059 -200652 196743 -40610 -84231 20439
17867 190333 -34440 52939 -253301 -292372 190985 -289103 123559 -157586 145864 302199
17857 302199 -308831 -93899 70231 9918 61532 55591 -114186 -172043 -228339 13643 226074
17846 226074 -49240 12523 375058 -52616 -129054 197769 -36434 77641 -71497 141777 -52471
17834 57037 -79640 278234 107546 223647 224269 -147621 -12378 362650 91812 161699 -164453
17822 -223138 -218042 -37356 -88109 -85867 195352 -68541 -200227 148198 -19623 174445 166993
17811 166993 -137465 -219845 304163 222680 -336729 -427703 -48241 -32541 -240339 -347188
17801 -347188 69016 275584 293917 335646 -162912 111996 -74563 301349 100362 117205
17791 117205 -54011 -126041 80890 -138536 -28360 80689 338161 -49718 5394 184289 -223960
17779 209572 -275042 77503 -31783 -57426 -24687 -248286 -98972 44353 -205125 -11792 -62499
17768 -62499 78587 49329 -91941 131749 145293 -68613 176475 332199 36391 -71013 -21415
17756 -93601 -155119 17439 -143956 79007 105593 137943 -319514 -134953 -24064 2142 -144891
17744 77068 305173 349863 22509 109830 -54926 -15888 182063 144376 -54267 212295 279202
17733 279202 354256 -74978 -75013 -330341 275977 -156748 64136 -75037 -172266 -74494 219737
17721 -38239 -46186 -39881 -260543 -142377 -234296 -294774 -28068 -178395 -194519 105822 159953
17710 159953 -128076 191256 -47966 -105069 168111 324023 -204758 -93166 95514 165640
17700 165640 58996 -77450 79422 -226793 -156786 18219 125538 -346831 346226 -59555 -69243
17689 -69243 271747 -17010 -216820 185384 83925 50618 -211452 124236 -294625 117064
17678 224626 124557 -34538 188469 -248266 -46437 -117061 -24185 -125960 425025 324927
17668 324927 116576 226808 -14958 -153053 304860 99930 -87950 150933 157653 -370679
17657 99428 -3461 136025 -38018 -17321 16288 -202523 -24668 -102702 -53009 235253 -111846
17645 -156567 142335 -265248 -2061 196165 278818 117042 -250836 56356 -119927 182806
17634 -46299 -171016 48703 -144216 22395 -56718 -127920 18375 27388 408234 205422 -70788
17622 76849 341448 -278499 80912 266114 124407 -197240 -50040 -70448 245268 228052
17612 228052 -34604 197676 -208202 -51314 -212516 -107126 353221 378911 56241 -26005
17601 -286623 56865 -203432 208134 70965 48232 -32770 -12742 -220984 -128276 302136 99970
17589 -8473 267178 -5164 111261 -117711 -54680 34458 -279589 179220 -140175 -156917 44691
17577 250514 366205 468755 -107666 -137710 611367 60050 5061 35072 139403 49565 -67935
17565 83577 -92863 359679 -59946 -73166 -93624 86608 216903 111757 -75638 39161 -1169
17553 -66305 287295 155539 -77423 112152 -180069 -173308 283263 -4378 82891 -180106 -16875
17541 33264 294667 72989 -20516 25160 -235083 235369 -99319 213812 -74514 -47625 55283
17529 206472 192076 438215 204358 80075 184514 -96297 -230072 210255 328834 284861
17519 284861 160856 385360 -48252 431649 -79452 111978 -132070 92126 -68432 -2671 282526
17507 164402 418568 154010 -485006 197597 -97009 -91813 88249 222232 235373 231375 52294
17495 180467 -73025 -155175 110969 246921 1021 38633 -51626 215151 218830 176392 125519
17484 125519 328276 -182603 168580 -54647 177427 214738 400512 343864 63241 -188183
17473 197287 199370 132098 194018 303574 284513 333383 159504 425148 192709 299185 -133919
17461 79284 -93848 33703 -101045 33456 154596 145295 130564 -29266 233763 164624 252766
17450 252766 51077 224807 77055 -70844 -84820 28776 219146 207581 19357 -1626 428136
17438 248191 89819 297502 342229 541907 384767 198300 597033 128148 31174 164107
17428 164107 243207 338540 109443 -83817 26897 110570 30834 467663 298147 234635 232028
17417 232028 221037 147870 -154799 309241 214855 -52131 -39464 -162131 96261 121049 290470
17406 290470 109406 -22592 123499 -121664 10349 149580 186944 214054 357860 223192
17396 223192 138289 97495 359606 64378 264694 304613 341754 65151 446077 -138113 -32053
17384 -118954 200142 79313 142556 238300 327387 -142899 288648 -146138 -63064 -113076 -120022
17373 -120022 124129 344469 444716 435953 121537 263074 311803 491135 180383 159272
17363 159272 324356 -8495 -230633 196328 199216 -204803 95429 346544 70132 212994 -6295
17351 412027 194288 -233184 -101256 144401 124489 114539 117994 41071 231816 -56589 205205
17339 84124 140424 76990 113824 163121 283476 243144 60944 184751 116664 58455 135166
17328 135166 303175 206855 188937 108135 76527 11371 375155 331135 345579 -102185 249710
17316 304553 61107 386739 111720 -214910 53217 208028 -31385 -35258 216300 282631 136300
17304 305605 206095 390297 267311 69139 378409 98600 224728 96961 290955 82708
17293 7324 181201 328155 192519 194688 366040 -89636 26720 200991 102520 219375 -21728
17281 -75201 200066 421832 -61855 52786 -65299 48884 656811 345071 -69513 72913 330947
17270 330947 250536 95654 253679 143112 226706 149557 571779 373650 162248 111082
17260 111082 23038 67287 253488 193933 23175 239009 40786 520679 346554 62455 398658
17249 398658 201065 294169 262898 -57746 164129 57526 303615 310979 -102201 299794 566211
17238 566211 275757 -67793 13344 399288 250356 -8514 62741 151599 272025 122638 12632
17226 442728 51969 -31008 110431 351639 97982 280508 272916 171211 260874 282350 337705
17215 337705 247174 97856 -21380 339461 153915 371460 188918 438882 308400 -74611
17204 351193 168125 149351 138930 481839 113712 196134 193094 192055 438516 153105 244893
17193 244893 530538 159997 158409 207125 293504 238851 324030 565085 388538 383374 238172
17182 238172 388652 90115 409730 148886 324335 78683 205249 548772 265746 127336
17171 339759 111414 443799 11067 -2226 405511 400770 610859 110109 124488 53248 99975
17160 99975 25412 171648 182855 494575 115468 411704 353976 214760 17175 636956
17150 636956 189258 421270 174582 97924 473592 94656 577752 164526 216147 711726
17140 711726 154639 481732 54538 353475 328905 407755 285013 691830 401204 539863
17130 539863 162389 450879 446659 319407 396144 386171 209978 306092 151915 -4507 364562
17118 721911 266991 413053 656843 435357 403902 228987 358122 118334 538414 491363
17108 491363 426990 574979 416885 593836 382406 335881 288491 396492 305930 183676
17098 183676 673577 639444 631705 438844 120685 177890 606778 548900 275102 268336 472029
17087 472029 803397 522085 356166 480243 699509 399561 29108 381263 637218 745380
17077 745380 342371 699418 540733 405078 497040 216757 749613 139670 311028 855168
17067 855168 523428 630663 88207 535370 507320 351186 827286 225335 474469 714343
17057 714343 489998 548736 802029 443743 554783 865206 560764 758379 392737 914644
17047 914644 561461 596188 535943 771488 354888 345883 1052222 645958 670342 850737
17037 850737 692467 221738 551470 472588 809553 412613 527837 349839 925846 570277
17027 570277 429411 512419 668182 635136 738755 661827 497428 794596 660209 664135
17017 664135 254447 767690 504918 812247 535176 709132 691357 596045 776776 769961
17007 769961 465438 480349 759160 509587 765304 844396 989341 513971 503484 794620
16997 794620 626676 684835 785570 839734 1207397 878211 519593 689505 951271 886474
16987 886474 632395 864257 893651 865686 1027252 719651 409773 1102849 753994 1146776
16977 1146776 1088898 690719 795490 997813 1220318 1015546 931314 1059790 932022 898813
16967 898813 642958 936063 901629 1171668 932891 901179 988631 834929 939309 1099128
16957 1099128 1253526 971184 715936 889442 1183601 1143000 919756 1043217 1104296 1117375
16947 1117375 1171498 1023847 1096073 1241790 1055108 1263581 1184705 1437924 1274946 1313167
16937 1313167 1085120 1110961 1337748 1253549 1188585 1558081 1300521 1195597 1477597 1262158
16927 1262158 1573025 1428121 1352316 1323668 1134442 1545208 1511689 1213129 1664711 1388263
16917 1388263 1755731 1623945 1349605 1341034 1787285 1750139 1721257 1664115 1891224 1657534
16907 1657534 1647685 2046903 1922098 1951061 1958659 1839794 1790566 1869892 1987823 1691752 1810924
16896 1810924 1894199 2089015 2026050 1968084 1700137 2194902 2157252 2020798 2071335 2241312
16886 2241312 2236943 2157619 2281911 2403808 2551957 2596730 2174459 2263012 2036314 2052711
16876 2052711 2347747 2378518 2563270 2654262 2647621 2447420 2283811 2603476 2587077 2891509
16866 2891509 2770648 3142141 2875860 2953552 2771294 2842431 2806770 3177240 3038948 3364062
16856 3364062 3280885 2819438 3148259 3428639 3179813 3286070 3199984 3353147 3303422 3510529
16846 3510529 3746475 3419898 3679191 3716978 3992519 3830537 3857070 4295384 4169359 4039185
16836 4039185 4394034 4436992 4419818 4428903 4763422 4782076 4770491 4695986 4763578 5099519 5372763
16825 5372763 5019996 5080520 5318519 5618392 5718517 5505464 5630088 5836360 6328207 6209832
16815 6209832 6139338 6265790 6437565 6764127 6919057 6842132 7391683 6980767 7496876 7732272
16805 7732272 7587747 7629126 7749676 8260928 8306619 8235310 8647780 9124233 9002954 9227507
16795 9227507 9467212 9763005 10508421 10055129 10657293 11010975 11309646 11725975 11611505
16786 11611505 11990396 12322682 12824903 13681372 13660480 13965849 14726216 14851265 15412444
16777 15412444 15975400 15888951 17011945 17460621 17933295 18633857 19337948 20006583 20404665
16768 20404665 20955216 22092247 22828257 23693427 24928350 25629907 26703324 27543494 28896647
16759 28896647 30015376 30962142 32605714 33857357 35096881 37213425 38307001 40648173
16751 40648173 42299140 44534084 46612775 49214106 51488047 54334234 57051564 60123115
16743 60123115 63163658 66581236 70444918 73899803 78322392 82508772 87201760 92509994
16735 92509994 97567966 103233407 108954038 115562689 122063245 128481220 135458145 142536282
16727 142536282 149598678 156711311 163271661 169716525 176172309 181265554 185942967 189148166
16719 189148166 191720049 193262406 193425505 192273198 190255323 186984386 182343626 177662735
16711 177662735 171347852 165061905 158406358 151452643 144508488 136825961 130075908 123358848
16703 123358848 116422962 109868813 103749641 98304917 92704025 87270131 82627284 77998156
16695 77998156 73939289 69373458 66136399 62524991 59204661 55933822 52927443 50286691
16687 50286691 48073480 45621367 43620754 41437975 39277427 37692496 35949197 34466311
16679 34466311 32937111 31016070 30319600 29028421 27758580 26772991 25718114 24601516
16671 24601516 23641593 22985619 21966390 21376090 20450726 19425965 18949889 18218670 17687891
16662 17687891 17137190 16348308 15868431 15523418 15263439 14377051 14150438 13816437 13118809
16653 13118809 12746572 12511962 12357238 11864152 11695124 11222221 10677120 10587471 10692818
16644 10692818 10418234 9585301 9255835 8862078 9255142 8832693 8840625 8391475 8165616 8040605
16634 8040605 7375719 7849036 7789641 7501188 7462949 7021320 6690089 6615506 6650050 6470406
16624 6470406 6266082 6364381 6206040 5826459 5630940 5328798 5635882 5158369 4720116 5166573
16614 5166573 5008749 4954014 4955893 4792581 4832726 4308214 4356047 4315834 4181640 4107765 4181891
16603 4181891 4528701 3944205 3866249 3978885 4246875 3393282 3915236 3554584 3880722 3700593
16593 3700593 3671116 3482616 3344922 3457064 3324765 3336586 3039207 3241620 3291393 3157161
16583 3157161 2911746 2879037 2607360 2939429 3034835 2579213 2484484 2375539 2742936 2503767
16573 2503767 2334011 2369135 2861046 2520975 2344182 2430531 2039888 2401920 2142073 2286677
16563 2286677 2507807 2403514 2046602 2119890 2053561 2574981 2057521 2119104 2172121 2003950
16553 2003950 1806722 1476807 1744891 2055014 2038484 1900187 1836721 1980233 1766286 1256906
16543 1256906 1651083 1428649 1987034 2008666 1703622 2111776 1693192 1452340 1503402 1751277
16533 1751277 1612290 1648138 1293819 1603067 1379366 1266773 1283646 1530470 1580403 1538288
16523 1538288 1377793 1591106 1297774 1381862 1307627 1330259 1208990 1271876 1197450 1436203
16513 1436203 1088135 1125098 1012472 1030098 1192735 1145110 1403190 1307256 1606772 1045249
16503 1045249 1239503 783951 965141 1182791 1024136 1072095 1162890 956630 1007599 1374682
16493 1374682 920795 879158 1203925 1059393 1026462 1181892 825602 918002 710840 1042460
16483 1042460 819742 1136783 653736 1114474 1349267 807813 1123394 861586 700972
16474 700972 862099 839840 1069206 584590 838716 868324 676655 673803 613730 642415 859820
16463 859820 596709 874136 734743 748500 1020408 788233 1010251 280057 847287 585422
16453 585422 851189 655965 623028 102740 717945 346702 729788 786562 881529 788472
16443 788472 867902 1043514 619530 751357 722345 558262 795414 609310 555617 698358
16433 698358 863040 702159 987779 486890 451935 751721 462951 798779 612862 535718
16423 535718 490228 729920 260694 568741 849863 640808 391537 364167 734478 725044
16413 725044 327645 647018 656013 592612 546751 606477 872284 85208 52306 195382 304871
16402 304871 614620 136828 637786 624469 294499 549502 455461 679212 875285 451181
16392 451181 386789 515181 906299 253185 759548 422312 798957 867836 383929 235551
16382 235551 236644 283782 486788 533008 148186 308425 323108 544632 555372 224645 173459
16371 173459 603832 457805 393611 553848 64000 758709 377051 509901 525542 484575
16361 484575 429104 623409 436442 585064 336678 108092 211084 231149 113643 414202
16351 414202 235331 581231 222048 136742 821533 465427 193930 364420 368783 278827
16341 278827 279900 470510 540930 438268 434985 307830 505183 483982 220300 667486 169495
16329 187116 157350 226155 512203 143754 303735 711620 637433 583641 80872 87020 560650
16318 560650 25861 388401 311250 601058 240364 215761 317376 310117 212409 91664 333407
16307 333407 225592 23268 294768 168479 532734 377790 421427 153679 -496 643908
16296 118785 -171743 129069 114158 121748 178811 294937 442438 281197 503810 355143
16286 355143 77420 35512 524954 478451 251710 267423 389725 358856 299525 275011 11610
16274 191967 -5459 340923 6367 328879 213419 73825 230676 259466 -32736 184556 219492
16263 219492 200177 171292 229240 310455 26502 375727 87183 254708 238101 109590 -149108
16251 166870 353831 -203688 62963 186075 -23306 202423 236141 -87003 276959 7319 291821
16240 291821 3757 -21756 -368023 209481 219984 -444435 178274 -285560 244547 -70218
16229 74809 219821 321061 300822 237976 297790 80039 505976 81794 92417 -294928 33280
16217 16103 -40884 150246 165195 -139314 71197 193860 156274 167193 110766 -302 229131
16205 296187 180437 159645 381470 176349 -151471 542 388330 -79608 139416 281833
16195 281833 132333 254777 271378 21336 394770 215142 351584 382958 29630 -92721
16184 243041 -4375 29574 42466 527962 47860 67622 -334714 499173 142334 47255 62651
16173 62651 356832 197766 8590 -99951 -38757 -10743 106907 112558 -68190 40620 -42278
16161 -149629 -57995 83754 -6260 -29606 128475 358698 529849 18799 -117726 152018 360202
16150 360202 -128670 -32804 -206209 255233 53560 57803 237582 15182 58478 334840 -24144
16138 496309 -3696 82892 481152 755690 -87510 101619 -83489 -197945 59891 155829 18424
16126 -105679 116282 151546 -431746 152446 85727 97004 21802 -20735 -35790 242831 98845
16114 162816 -15926 5830 -44151 230450 125873 -35420 79808 238325 176382 -602941 -64078
16102 -7506 -35897 161738 344918 66189 266698 224815 -13420 3142 30583 -76091 -306065
16091 -306065 -149370 -51017 -208905 68227 -45114 251715 135661 -146130 -233866 124930
16080 136000 2508 163517 128494 -78790 -15461 -135198 271240 -98988 414020 96489 -33928
16068 -228081 35526 86668 55763 -95633 -290783 25731 -25158 761440 -271660 -211744 -115357
16057 -115357 17137 230710 282702 64270 16575 316144 -122192 83334 -122421 89633 -132803
16045 239555 -233837 53139 -30585 274495 -33538 -237845 90145 30211 106087 166429 61851
16033 -90567 -332947 -314356 60811 165041 -34983 -277393 -15932 -86999 209032 -54898 118570
16021 242214 -122376 236847 20313 -89153 -178002 -187677 -38150 -219781 -75324 36811 -15218
16009 -84931 -316957 -276108 -30369 -91372 -175285 -105124 -34055 153890 -214162 178105 -111781
15997 -14196 -118872 150623 -29161 -84290 -51626 142701 -50697 -226442 20707 -119510 -170171
15986 -170171 -144489 109538 147924 251654 323944 494362 324198 649452 221184 -330539
15975 243166 391112 96634 81755 -18487 148726 -65142 -214040 136902 -12360 99110 -53028
15963 -179068 190219 67203 104016 5946 140998 302595 -123103 -19269 -65255 37193 1672
15951 -129460 -178225 88269 139441 265752 219311 97805 -201755 270423 134944 140297 -166083
15939 -246717 -42491 -122145 -211604 48778 -451319 -184016 68964 -231878 382014 232496
15929 232496 -343029 -64285 -488755 234243 33086 -240813 -223967 -162703 200612 266121
15919 266121 152329 -71477 5766 -112130 -100469 -129094 -280905 206202 -56963 66660 -92076
15907 -137091 -40088 -166857 -212035 20651 -32816 -119135 79761 -374230 35921 -198667 176672
15895 19867 312526 -115025 254945 -263663 71185 -384798 109157 -19708 -102990 73824
15884 -152083 102577 -190309 19335 -115045 244972 -154147 -32158 -36895 160480 73185
15873 69754 -143043 -61993 27673 -49185 -139123 128427 -133376 -56028 184980 239336 -426471
15861 42382 -70208 340402 84358 -179481 412298 81443 198222 -61163 242742 206712 152039
15850 152039 482888 -306607 -79410 -61758 -208302 -135511 16468 22087 199199 161752 43348
15838 196030 171068 -25447 -101066 -348825 -21992 14391 -146601 185934 43827 122310 -179160
15826 431081 101393 144919 215093 -256302 -159996 36268 -316425 -217220 -39194 -350899 -268798
15815 -268798 328580 -85965 -58789 -129006 115118 130169 33609 -271408 124067 184195 -354730
15803 -324444 -212784 249330 -101942 43556 -332875 -20118 158450 -284195 -141795 -100479
15793 -100479 -342865 -29804 44564 -238358 145548 269464 115371 39950 9006 54257 244712
15782 244712 131868 29432 -120116 -148761 -141946 -97306 -145284 9355 239766 160210 -198296
15770 -30172 -180135 -44857 -2079 62881 177235 59467 -337539 48222 -164485 24645 -318792
15758 286302 -291664 172386 -29056 -106206 256868 -263387 132259 -223316 -290236 -62767
15747 19265 9374 59138 43653 199701 -71209 28901 -465103 -394905 -84432 250452 59716
15735 -50157 56081 -51173 -282387 -189251 122065 -314279 -26218 -11131 -15647 5154 100144
15724 100144 -203328 145645 -138589 -85338 -169134 -241417 -134112 -265516 -198948 -525414
15714 -525414 316764 260841 -36491 -373118 -340110 -209836 -381048 -139369 4406 -127002
15703 216186 23127 -71476 88022 -13225 -232004 57741 4479 -427208 -78218 51212 155375
15692 155375 14159 -87468 214266 -158067 95641 -333310 -401984 27428 -78673 100950 -49863
15680 119281 67892 -30131 -175909 267734 85143 52149 7425 254680 65410 93127 -338259
15668 157901 -31457 -111715 129022 -116477 2632 -136427 -147475 -55746 -202266 -59593 -297501
15657 -297501 100638 -137923 -9715 66943 105106 -131442 308899 24673 75191 -71187 -338191
15646 -338191 99399 50460 126852 14814 -257050 -188220 -159102 -183946 113404 -115040 49317
15634 25239 -147543 -16118 -120620 -216483 -182180 -77455 425880 322698 97771 225712 -245366
15622 -304999 195740 -20561 161879 -215719 256691 108125 38945 -92192 -190916 177589
15611 67005 71232 326365 219728 206772 67020 -179637 73981 -36328 409400 -199639 -37648
15599 77813 -93992 122175 -84257 -65072 -96251 -253068 -197981 79681 -40686 37208 160159
15588 160159 44277 -361343 -15817 85867 187655 28751 -165758 -394122 -32634 -62397 16088
15576 -125862 -184284 -123269 -194936 -14889 -125174 -307375 116752 -10933 174161 -71080 184197
15564 -90001 -118776 -308598 297549 36579 239617 13050 -91866 263150 113403 -112892
15553 -64387 82602 -284779 -63076 -117057 -80631 281750 -229306 45225 -95517 -34513 27351
15541 -23066 -147278 -18388 16784 -128302 -39632 121154 41374 -66849 21205 192620 77572
15529 -434540 -63987 223310 136800 107600 -227447 -169806 62251 -291751 8650 7150 -54139
15517 -114534 210260 -125879 214186 58395 62090 146691 372484 322849 90113 -255266 -84402
15505 49115 -151533 164864 -134849 89472 -12604 -23910 -61921 -235615 327325 -190537
15494 78317 349161 189557 123407 266881 -99264 -9342 -261492 -59488 126491 -145818 -72565
15482 81627 -153985 123858 -131676 66788 63419 105017 146610 104028 24877 -92327 -41673
15470 85093 85394 187994 41598 81967 163621 -218171 -192116 -90232 -191157 66378 173610
15459 173610 -117443 -22835 -42193 183229 51695 293920 -260710 -48874 300043 -215121
15448 -61281 54007 -75882 108512 39336 210407 -125193 -225154 -236283 -420148 112402 52028
15436 32151 -124996 -287447 363397 -46543 -79096 -81366 44011 255728 -39673 207439 503887
15425 503887 -86225 -204493 -30942 -117266 -305732 -190055 99752 -106592 -72085 -54378 -207843
15414 -207843 -80575 33829 -28949 322239 -37211 -135729 26665 -244551 -112069 20256 -83612
15402 30677 -38131 -95078 -111503 23630 -346679 -98341 71388 -63675 264770 122601 66257
15391 66257 50439 106599 57822 -138089 -35759 -132912 -236046 -124728 -231498 111533 1880
15379 -66877 -100520 131911 -141696 -422 54966 -89684 -96853 66481 -75438 -84425 -68090 13477
15366 -174527 14876 -106491 -330376 -343295 331267 -195415 -211695 365553 227926 63988
15355 138677 32684 114023 94890 -8223 -138528 -21925 -140103 155640 291461 223270 -66581
15343 46554 -122672 -169186 264458 -34720 31491 253949 -49768 -104294 130132 2698 12427
15332 12427 -77897 29088 178131 122508 -213666 207221 105236 -87804 119776 48156 156619
15321 156619 92490 202548 200915 -220242 -76114 171118 -48699 16894 97653 311227 212712
15310 212712 -74026 35907 158993 82717 62705 -43588 474488 -146956 202257 -20550 146881
15298 217783 -97102 -165298 -6292 188914 -199835 103079 -76680 81513 -168772 122747 -69371
15286 -113954 38067 144250 -103901 -15797 -443327 181040 57236 53560 229724 -206552
15275 86096 373402 205716 156638 -257832 212252 111576 119755 -89221 22965 180305 63412
15263 -103510 172377 -90993 46495 160539 -5881 12827 358086 56105 131421 -98042 256728
15251 435942 -150183 445 228420 521743 658640 846869 2987234 2267211 2006467 2647100
15241 2647100 1278074 708667 304634 155426 -57741 164357 94196 216944 25581 -38339
15230 199158 -295186 264095 195873 -382487 64811 102739 40464 -22587 -113360 -155048 -29613
15218 -48788 12065 275733 152132 158508 -159606 4914 400917 176228 183315 160868 201122
15207 201122 52892 96822 -19100 27457 264750 -80244 -112574 117257 91485 242952 -86246
15195 58398 -151524 -58084 -46422 -14302 -14447 -55527 -121699 261891 122066 -41369 -12062
15183 63810 16497 -175236 150750 126958 -91292 408483 74731 233372 934 -49305 21000
15171 308407 9532 144162 -134680 30296 -36393 334736 151758 175542 108525 13697 125843
15160 125843 -89897 251866 235353 3211 330493 11371 -100107 173781 57809 121302 46736
15148 -174283 38589 221385 107350 -114010 353278 177916 236011 136648 147738 62973
15137 -4893 80715 123038 284686 -213262 87429 -55819 131944 -79345 357847 180293 143914
15126 143914 321748 -164622 106818 220225 253350 195578 183126 128661 187605 143192 13402
15114 -34364 498187 -128505 147102 321552 253171 441861 -2735 -7892 -322659 358663 125218
15102 -55106 352548 -8759 132901 27628 149855 41069 -81689 -102714 -110220 -89349 271453
15090 245354 240257 -163724 102063 89183 239666 161638 391533 313735 304413 287463 304328
15079 304328 -28852 1069 346647 106733 302422 148081 -24450 -207303 463743 365420
15069 365420 361519 -50616 544318 284385 41120 -214327 66794 242069 356566 193857
15059 193857 55251 92188 101643 68540 222354 25164 115500 271455 -34172 286690 318841
15048 318841 128859 -100827 83906 582 -72369 162334 -71485 38259 -56182 35180 356610
15037 356610 -84294 284356 45486 249409 253767 96235 120291 167537 206243 109358 -19579
15025 270340 173201 -80575 280219 283828 -9140 243784 142428 266641 117238 259613 -391788
15013 -254261 70383 293738 -21512 429077 44375 63865 586458 150455 -32672 143027
15002 634805 -4880 65433 430521 465688 293868 383697 -50091 223078 536852 113192 11103
14990 633106 100738 149352 331891 182025 86318 297818 47810 219610 96206 181133
14980 181133 372590 -46710 154360 33868 453288 58511 397177 510607 161174 -14424
14969 101847 -35941 149377 173488 309279 529584 517616 416283 248050 354754 283844
14959 283844 251833 35325 500083 18452 374033 140903 570126 108384 51888 326605
14949 326605 468967 136885 400102 328599 494903 151544 204487 407301 310019 -18928
14938 472087 62867 168444 393829 228556 329962 -172963 246888 63717 97059 461239
14928 461239 159671 318397 246386 511477 452371 448621 238124 443195 478825 514221 194834
14916 390432 54749 492970 333952 336293 595297 317828 466770 381605 21908 267562
14906 267562 542822 271112 82724 466571 466516 447637 240073 445255 503899 618827 377913
14895 377913 231406 335530 192732 321726 794680 447989 390042 556093 123065 319932
14885 319932 352297 443580 289095 496794 655716 238474 -62658 628489 409818 621087
14875 621087 431790 393512 130975 216371 662192 623619 461603 272203 570262 375696
14865 375696 283797 309045 588751 73089 700217 274077 353243 673935 807653 564737
14855 564737 644508 485341 459166 367712 772937 666200 219156 350541 417420 59046
14844 558403 269076 74333 392313 560957 610979 643337 176614 742870 464540 674453
14834 674453 602343 606779 637001 763336 482821 614963 486633 596218 201760 851230
14824 851230 394062 619713 701160 411999 582202 265921 272523 458245 542666 435681
14814 435681 470221 247189 588521 444637 303607 486707 529573 270615 792241 629697
14804 629697 497769 934283 463468 395929 775798 460123 570032 567765 725849 623507
14794 623507 623355 518403 982474 1058679 424962 467026 461068 698091 471917 586063 731850
14783 731850 196129 788032 646612 987396 385279 216319 222594 390729 367233 537316
14773 537316 707308 695012 661955 403399 755774 868932 589246 581668 646755 558787 890086
14762 890086 313745 714625 522188 562037 1033455 599465 536049 647395 896529 643726
14752 643726 738406 816553 765000 646209 786766 1023629 739277 899992 896338 974193 968162
14741 968162 706465 986977 838323 502576 420003 938771 910400 1048151 716114 788940
14731 788940 678980 564975 564152 951485 664942 652900 1070084 705013 1025911 628194
14721 628194 874132 413469 1018501 1115015 928515 848328 1143367 835483 733686 846694
14711 846694 833650 923127 895467 941006 952178 951879 838175 1176639 751309 721012 676438
14700 676438 681203 958290 1033630 902939 969150 1067204 842800 1016630 508814 731561
14690 731561 928914 1046921 819074 830323 1086102 1036395 1044363 722338 879482 902262
14680 902262 1101505 1244964 998001 1513305 990348 1342081 1301578 1296099 1157879 840416
14670 840416 1024064 1128661 975899 593712 1484341 1170442 1298687 1144426 1192130 1076598
14660 1076598 1176999 1393129 1124948 1045426 1269615 1135762 1130666 1216432 1063820 1445687
14650 1445687 1291495 1418868 1258500 963925 1001801 1346082 1095945 1238716 1350913 1685638
14640 1685638 1223998 1514199 1575856 1770125 1018536 1449746 1221868 1415387 1237288 1773010
14630 1773010 1010687 1267292 1725816 1621594 1159571 1326235 1687162 1777369 1272025 1378706
14620 1378706 1581996 1579646 1680834 1406302 1537755 1718031 1603458 1665042 1427037 1607834
14610 1607834 1308839 1626627 1403951 1715053 1512971 1389395 1613599 1734056 1664648 1729685
14600 1729685 1917161 1992781 2087934 1259503 2118494 1632926 1771828 1764666 1900839 1767598
14590 1767598 1830685 2181798 2118479 1895395 2069507 1830906 2142514 1880928 2231365 2432819
14580 2432819 2339472 2448039 2304961 1470324 1945632 2212894 2196935 2179762 2280152 2333850
14570 2333850 2207312 2333337 2517711 2627501 2736837 2557578 2465117 2429041 2416766 2614012
14560 2614012 2505212 2963366 3050517 3385845 3071059 3418944 3844325 3827351 4278537 4859564
14550 4859564 5933316 7568005 10953611 19270092 36385608 49148014 22854026 9879230
14541 6634052 7104808 8183854 3819017 2759699 2383017 2520294 2541891 2311193 2362809
14532 2362809 2542079 2248773 2176748 2405646 2636979 2582204 2244749 2461084 2591774 2404341
14522 2404341 2206062 2401081 2483172 2608140 2885165 2899896 3124131 2782940 2873315 2835720
14512 2835720 3052278 2952311 3070738 2768591 3131090 2975757 3436112 3280235 3272787 3158706
14502 3158706 3094463 3538069 3229047 3162020 3321444 3211965 3259737 3071619 3818297 3503274
14492 3503274 3628152 3517713 3449085 3745603 3784993 3806878 3874168 4221122 3931489 4374211
14482 4374211 3941001 4257211 3917613 4276563 4209142 4267130 4374454 4470287 4272142 4688944
14472 4688944 4208327 4390235 4525072 4686587 4761296 4640578 5088824 4715749 4703815 4893729
14462 4893729 5060048 5443677 5119780 5015759 5310976 5363025 5459977 5289614 5490849 5601286
14452 5601286 5353322 5872588 5825349 5815812 6094860 5900963 5945147 6196082 5997548 6214251
14442 6214251 6681255 6613931 6079889 6877184 6856199 6911828 6642053 7007176 7204698 7142376
14432 7142376 7309918 6973766 7250202 7733431 7630895 7576095 7960772 7856640 8045354 7766008
14422 7766008 8126378 8064464 8171632 8451996 8766949 8776281 8713250 9083399 9328687 9104380
14412 9104380 9547012 9847165 9760889 9621516 10207012 10117423 10068672 10443910 10687879 10946740
14402 10946740 10809217 11056880 11134266 11502954 11268067 11492884 11738436 12234593 12188496 12372625
14392 12372625 12590720 12992965 12866985 13332139 13578314 13579708 14239524 13965806 14590209 15053691
14382 15053691 14906855 15263860 15761956 16110092 16072436 16345338 16849008 17101451 17734279
14373 17734279 17765714 18240755 18185031 18731206 19197436 19549869 20001978 20664714 20743244 21200146
14363 21200146 21682467 22213348 22690905 23359086 24003507 24231278 24509016 25214322 25817674
14354 25817674 26429446 26826746 27392486 28492648 29053632 29673997 30384125 31159081 31979620
14345 31979620 32624353 33538915 34388317 35281875 36147044 37302240 38367688 39919500 40349962
14336 40349962 41367337 42830395 44110698 45339658 46816539 48312834 49592982 50905198
14328 50905198 52547747 54473939 56065162 58134137 60169221 61843051 63742439 66006746
14320 66006746 68606606 70593612 73404194 76020906 79188287 82106712 85314244 88374136
14312 88374136 92039208 95624657 99469027 103233862 108077106 112364019 117240129 122700745
14304 122700745 127508421 133419529 139637459 145677446 152512346 159945246 167367193 175683041
14296 175683041 183896281 193113844 202685354 212311041 223205721 234255329 245836782
14289 245836782 257930714 270721987 283991288 297856076 312008325 326358316 341543975
14282 341543975 356322808 371437851 386412321 400791685 415065034 428383199 440838467
14275 440838467 452044974 461581056 469108285 473952249 474889663 474745585 474772352 471791886
14267 471791886 467776824 460952987 452928487 443519005 432154046 419393828 405169921
14260 405169921 390349798 374837356 359055157 343348409 327990163 312571778 297753698
14253 297753698 282998576 269056158 257862971 245734275 233662485 222028578 211007795
14246 211007795 201046469 191276816 182550444 173999253 165629260 158361074 150832398 144104882
14238 144104882 137710458 131787557 126223474 120834397 115702327 110612795 106458012 102545855
14230 102545855 98324525 94369491 90741403 87083393 84002016 80776035 77765543 75004407
14222 75004407 72423792 69890344 67609751 65318054 63156764 61229125 58985583 56703351
14214 56703351 55591048 54416812 52427174 50568850 49033994 47371115 46521713 45309974
14206 45309974 44290164 42944049 41519977 40637552 39096173 38595990 37713909 36412360
14198 36412360 35484917 34507257 33265905 32867773 31855786 31272349 30433964 29706324 29045023
14189 29045023 28200629 27567820 26747541 26084248 25591197 25056304 24552271 23939570 23528611
14180 23528611 22725188 22695275 21920572 21702026 21437764 20635236 20151386 20002460 19261244
14171 19261244 18890431 18894139 18504658 18031459 17466302 17539747 16821633 16769455 16390459 15908767
14161 15908767 15814696 15598305 15593834 15141414 14434873 14372651 14176587 14042586 13659676 13713049
14151 13713049 12874731 13159391 13177239 12716492 12730712 12268778 11759174 11910520 11613807 11468793
14141 11468793 11432382 11117662 11071713 10981482 10752451 10696254 10416136 10100378 10119033 9725758
14131 9725758 9878508 9607539 9360305 9266306 9155299 9390618 8850879 9292783 9028042 8604711
14121 8604711 8449154 8294239 8225114 8347321 8058947 7949824 7834352 7634845 7927464 7699016
14111 7699016 7237128 7625546 7337352 7050914 7208916 7136746 6905052 6647117 6627241 6859789
14101 6859789 6547667 6568925 6171553 6237123 6259195 6073537 6072708 6009811 6225856 6030870 5984387
14090 5984387 5744981 5936643 5796892 5699075 5491466 5602549 5412346 5566260 5469574 5152060
14080 5152060 5273259 5194622 4878122 4885714 4859699 4824554 4433764 4795292 4979332 4570691
14070 4570691 4506161 4973934 4431887 4923612 4404352 4316877 4401796 4717683 4342193 4254066
14060 4254066 4465293 4064992 4457433 3933309 4358278 4035123 3893043 3722814 3761124 4031330
14050 4031330 4016942 3674646 3941607 3864895 3436885 4060089 3592232 3504075 3657500 3690803
14040 3690803 3393252 3478879 3567642 3457290 3456607 3357005 3251209 3357880 3276000 3464916 3364299
14029 3364299 3404522 2996781 3085808 3032943 3260215 2810017 2960367 2992082 2886207 2998803
14019 2998803 2891257 2887018 2565708 2794326 3123023 2876523 2710549 2507109 2704345 2827254
14009 2827254 2636690 2450246 2378051 2445736 2213172 2198301 2413160 2625438 1890582 2263282
13999 2263282 2412179 2231561 2076685 2019171 2244620 2230156 2529771 2250268 2550420 2668081
13989 2668081 3725098 5597898 12473181 28692816 50293372 29280805 15008757 9441602
13981 9441602 6603016 5527657 4689569 3969622 3753442 3683810 3191782 3173672 3207773 3129549
13971 3129549 2650776 3103613 2819153 2598903 2643949 2177571 2450218 2562880 2286811 2558864
13961 2558864 2439119 2209251 2285860 2255424 2150518 2198887 1939449 2287831 1905432 2215791
13951 2215791 2089764 2034244 2130166 1937921 1837660 2036871 2008605 2488260 2073147 1954038
13941 1954038 1920982 2277660 1634751 1572807 2009001 1559410 1914052 1571978 2036832 2079919
13931 2079919 1916564 1633771 1638743 1625255 1668808 1692834 1841713 1701447 1663675 1615137 1638553
13920 1638553 1596803 1654797 1909477 1459102 1627202 1362393 1445312 1533678 1721331 1863499
13910 1863499 1597388 1582798 1531112 1685378 1597982 1560206 1781387 1093634 1652745 1892402
13900 1892402 1404119 1171471 1312226 1558952 1635892 1588000 1460496 1267850 1708174 1110508
13890 1110508 1424263 1459814 1238288 1383388 1436337 1445043 1113056 1356924 1032687 1168781
13880 1168781 1267986 1385567 1053832 1429698 1361263 1227342 1531480 1202283 1172915 1077441
13870 1077441 1140099 1451756 929650 1340950 1295067 1346679 927893 1090014 1219892 698611
13860 698611 931199 1173149 990918 1200677 876677 992058 907246 1380610 1391191 1406355
13850 1406355 1290021 945353 728641 1134247 1335570 1208845 1223429 939162 956992 1123666
13840 1123666 1140900 1267575 1034403 1302403 972970 1333829 1104541 1284174 1136222 882941
13830 882941 1446506 1109162 921076 907655 631758 680719 1054851 961884 967153 613173
13820 613173 1101093 1057623 1031414 1091828 450842 723678 1354303 917440 758880 520242
13810 520242 612344 973742 842953 1058153 890871 1249818 799618 1096572 980860 820239
13800 820239 626300 654484 732354 820109 1091906 967382 810392 813821 365534 659756
13790 659756 683617 694229 1107825 921105 626001 885067 694317 914020 859192 813277
13780 813277 854104 696883 799989 611756 531376 481762 526662 915957 661249 572489
13770 572489 831946 703792 838008 921950 990172 676049 719337 511440 631654 854413
13760 854413 703200 745881 720063 401788 924365 758751 769486 739497 750011 798189 704572
13749 704572 636902 795963 469580 812026 746184 871099 669184 628748 282632 413376
13739 413376 712432 705391 642777 831289 677945 779481 307808 805432 692926 855774
13729 855774 941514 466633 447525 769976 664616 530348 734005 852514 777951 653655
13719 653655 402186 838657 688771 568266 485172 526962 302463 490921 741363 456137
13709 456137 669765 381164 410841 476172 550262 809899 374291 432646 470972 810039
13699 810039 650799 471132 735151 793982 630952 480563 345804 506787 479835 473480
13689 473480 399227 436346 627191 381365 499986 574784 248466 793434 554204 773658
13679 773658 462688 906338 506385 502121 483894 251826 499573 594309 248844 686164
13669 686164 649595 583116 420958 556813 362416 276523 699435 422096 45612 678006
13659 678006 815215 452663 571051 308347 672776 641975 532255 352681 111547 756693
13649 756693 537377 716201 363807 519234 103442 302918 374073 645596 673819 392208
13639 392208 169451 145040 46503 542990 219464 559313 469249 470626 694162 500241
13629 500241 590126 457891 538907 270055 619175 523492 922352 280349 287145 572968
13619 572968 242492 640901 222843 367315 432821 250078 743000 636909 598505 518037
13609 518037 667107 304645 375027 363595 448417 461405 510440 443377 256149 28332 409078
13598 409078 512368 500603 80673 539543 680381 106824 719813 221341 499819 292154
13588 292154 455833 153632 352255 293247 337432 519349 204504 -3316 365990 451915
13578 451915 370490 339872 346990 208709 681 442856 281102 360027 348495 313895 494274
13567 494274 374719 469222 419417 389074 252328 453715 41002 226043 462026 215436
13556 -2742 329838 118000 127076 575647 375006 141160 620336 353903 360132 245525 275548
13545 275548 129526 371805 228796 173543 205025 446692 269652 187674 398679 72387
13534 291487 683141 206533 164929 53036 536125 118581 488739 108542 111305 428855
13524 428855 389550 345353 191218 380631 541979 506416 147497 268296 144923 289921
13514 289921 78256 270803 91863 98747 160099 460096 286847 -93259 73917 76196 549743
13503 549743 60544 355317 13285 219098 181353 631616 76199 314562 356383 212032
13493 212032 39450 200347 280726 497436 361421 190026 102473 273057 215070 185997
13483 185997 -90306 189929 187582 275731 403343 299029 383308 108770 -109234 -10987 293857
13471 230581 286736 74603 111096 432257 534885 328061 132759 110846 423597 445731
13461 445731 217365 265027 46931 133671 71394 -24535 16860 249846 422866 135387 194702
13450 194702 284845 225484 93209 288649 294697 -12966 486504 394864 200674 200618 -18521 -91581
13438 -91581 247721 50426 404776 225738 321794 -139989 517384 401097 213221 33554
13427 228526 511181 294765 301828 313289 242803 226962 217735 123562 214387 48012 260875
13416 260875 254935 407915 112437 272891 327655 80456 129971 452759 -6309 242285 251682
13405 251682 370760 248608 59668 343268 279440 -83747 72031 100179 359618 149871
13394 66696 39057 -204187 386321 318711 278805 586988 -14220 27851 205571 441308 390261
13383 390261 442842 339392 103411 -14642 433816 347173 459298 343222 41643 318762
13373 318762 83679 366007 313252 399925 269202 179717 193435 579071 383725 280668
13363 280668 182524 124843 474335 44653 79618 502689 215304 150851 65334 1035 212478
13352 212478 162406 378297 256232 -128464 152249 43356 457425 8545 265240 394788
13342 394788 43976 451869 136708 235479 143823 211664 174650 191303 170725 95441 -65099
13330 -101617 205521 57139 308080 332583 178634 126247 180080 355168 297241 135781
13319 124722 220829 95385 162242 -46040 652167 -10978 365274 151939 165704 275821 192949
13308 192949 50852 140117 89295 532 -46318 180399 89047 469488 261383 -34229 -152073
13297 -152073 202779 362331 58852 157359 512394 100145 27732 534584 7592 230219
13287 230219 -89302 421498 -281918 -145672 81283 93598 -52893 437547 7941 302935 158117
13276 158117 -184590 127197 171894 146986 -103095 -63734 209398 -147095 202283 180379
13266 180379 -103889 242548 273330 202562 409706 -125515 -113628 -127989 84840 117889 -132902
13254 23823 294284 321902 533410 180849 247175 213478 328066 171286 147693 242133 -205947
13242 -231875 197454 113541 144075 400722 18954 96731 124304 -140878 148292 273531
13232 273531 -78991 201979 277256 209751 119699 43344 358423 -162662 195870 65424 157413
13221 157413 204951 2356 -19368 53476 42352 87490 -35589 342065 144854 57587 15095
13209 711911 51964 44349 317785 -116083 -143032 -186628 282686 199400 104326 382524 84219
13197 90191 14369 -76153 131911 -77070 -69630 171416 320455 199842 475946 -28858 336322
13185 13859 62807 297060 148521 80739 47651 11050 103654 -101704 97747 2378 7115
13174 7115 -40318 -79285 224108 216448 -17447 264896 20379 85943 -66078 -47873 99131 -278653
13161 215050 -176361 180344 114578 -208623 -100579 204192 -17568 -20504 105472 73088
13151 73088 46118 -57825 -133271 -25507 96658 143298 277722 176987 -4805 139114 412087
13140 412087 112022 241775 -95410 346048 243156 67276 178053 175868 -151120 3764 -291412
13128 140978 336229 -17218 54780 204836 126339 -41517 -21256 131946 56905 -31263 320589
13116 -387431 144669 198375 -55490 173503 272081 -30667 -196713 -11547 144059 -106931
13105 289433 142686 536639 5796 -120981 -327155 -59703 61323 321107 39450 -371813
13094 92844 47045 -83869 219232 -79926 -93372 -163936 262428 104544 -44407 391738 222781
13083 222781 223165 201214 147864 113173 143838 -67563 246649 -149160 182654 192831 -52835
13071 215278 119903 449622 19899 -77071 23528 238535 211329 29204 56237 8367 250793
13060 250793 66967 114391 -156377 381082 380094 -24263 51171 49677 -74166 102571 395021
13049 395021 -174581 -12339 233523 92128 221819 -884 -17617 -29660 170728 168078 -19287
13037 609763 280321 188103 223608 149871 -9106 115368 64462 -238965 71858 71295 250834
13026 250834 -55381 145976 69688 233200 11986 199188 -48820 56797 23995 -210383 -124557
13015 -124557 49037 81873 177944 -258362 483819 -188313 -225158 72969 76262 27215 70211
13004 70211 364608 -32062 182831 180109 42934 294459 -8566 -287689 -72715 -17476 -347998
12993 -347998 11041 299623 -175324 78569 54648 185837 252782 -165773 -141931 278420
12982 20939 168921 -42318 280886 -106312 -180040 201063 189088 330855 -220506 233771
12971 -136324 14973 -123875 250963 -94810 150794 134321 119600 166033 -44327 98801 248981
12960 248981 -176480 411668 -54459 -7325 84597 77851 82905 245808 698514 24548 30396
12949 30396 133260 236020 232629 -46433 -63044 57730 146967 -171894 -16617 -267423 75884
12937 -197377 173874 195677 118934 227843 -28958 153562 -112110 -193276 163339 161811 109923
12926 109923 126077 226408 -81266 -76435 -269676 -90831 296968 -145563 176218 177635 -282155
12914 -267419 10521 173355 5891 159989 -136560 34222 -206290 206168 367605 -103717
12903 -163540 147182 -6241 303270 236900 -381957 -234833 -95944 -101570 48313 -5474 -183231
12892 -183231 148063 57233 -46456 2882 -76905 133893 80041 234369 47651 -15074 183944
12880 -245299 448635 149428 140927 13056 -221820 303526 270272 66980 136490 283754 -133878
12868 -47207 34517 216843 80084 53011 -88932 -61981 127815 73386 -6087 -176690 230019
12856 -81155 -5545 -34289 165145 -129603 -118040 -168860 -235501 123821 63682 233960 146892
12845 146892 298337 333522 -237860 -222210 39406 145081 -132776 244186 -82049 175079
12834 -368631 -152214 260278 -141186 -40430 -199227 143998 222854 85651 -227421 223053
12823 114353 -22692 15457 136641 -69899 128176 347550 -106655 -317369 139461 89278
12813 89278 249299 133286 -42717 132887 348161 -241717 223314 224935 -246483 -8958 85943
12801 -82632 55866 36812 -64260 262417 -22464 -17034 258336 -46714 -182486 82785 -57605
12789 258538 -38615 69286 -1653 -112882 15039 -40029 327350 173542 266503 20232 -949
12777 -31710 81108 -16797 183082 -65885 93924 -43027 -263314 -66114 -158258 -334924 3102
12765 -98673 -90145 14834 -61980 -43509 -16000 -349599 -248724 156052 87601 -20010 116966
12753 16363 65933 10157 55662 -274977 -167420 -397646 -77384 217333 -244053 -4908 225121
12741 114213 209538 159801 128794 -332399 -11150 118454 14506 29825 275642 -56159 235924
12729 273133 -48201 -9116 -283696 181198 -148565 61749 -304513 -278856 21648 8309 -490338
12717 108151 58788 173936 -29668 232786 108019 -133816 -355511 477443 -155406 -210980
12707 -210980 -296380 -60704 32043 265289 2004 63624 -218788 42642 -221830 94844 218703
12696 218703 -94540 266390 99577 -75039 208274 144243 -225039 167301 180882 -237487
12685 -232178 -176750 16165 49595 295537 276280 -1199 249294 -22007 44228 404535 136917
12673 -175875 19330 290422 39099 -62388 -74994 -45235 49485 -204496 243496 382873 134136
12661 23214 106910 199723 25040 121814 -327835 122746 166147 178899 87225 -15001 255575
12649 259345 -56116 395026 75428 156158 102710 11323 -176110 78802 49554 -25035 9828
12637 -26964 246997 135202 35895 241617 244543 348391 110550 197714 434632 201458
12626 192041 328301 322748 252162 255586 326307 401060 285266 -95328 -10062 129182 120234
12615 120234 262985 179050 -51784 286126 526551 422571 269226 193641 -23511 -210977
12605 -210977 240602 -13841 -254549 74661 132559 183451 16225 140150 39110 192017 24858
12593 36549 -398000 -164581 -109225 -117525 294429 -246618 -113437 -87938 -77880 -187235 76893
12581 -27885 -96171 25407 71763 120451 376346 240042 -49979 90882 -80850 -267765 -251375
12570 -251375 -57099 135987 -80082 279077 438388 32924 -351405 305200 101508 117465
12560 117465 235545 192401 -69619 -96851 -39210 -179883 -183598 338220 42040 17597 280595
12549 280595 -313619 51266 71335 -176919 -241726 -209672 38139 168701 -18882 -14927 17396
12537 28049 50689 -231749 203419 90584 -21319 13877 -108781 142767 18285 91095 264053
12526 264053 -23359 185834 33294 176522 -44634 186127 65181 -15669 -234689 231818
12515 730 387929 -91633 -188374 211811 33980 74641 59991 43209 56704 -147739 150621
12503 -303564 -209275 -124717 122414 -181234 -204175 -153450 131997 -28017 -300061 -260749 -167226
12492 -167226 -265342 20639 24794 45116 499194 -96775 -90018 -85278 -73405 80230 -59489 181726
12479 107820 178463 93023 -121117 177922 110164 271500 -550090 89154 -274329 233691
12468 175415 -47170 85161 -197773 180916 -36520 172286 -359166 216373 -199436 174492
12457 -226999 98962 371364 180526 -48008 359718 97967 125680 291162 121461 -114153
12446 166566 -146851 -80171 -255244 16685 33622 152567 83565 146179 -35700 52148 -111879
12434 -32627 -141736 86217 -299437 -75602 117600 -205177 80301 81443 66960 117866 -226137
12422 -67460 71071 -119964 -41531 -42404 55326 116411 68139 -117371 35539 119871 134783 81503
12410 81503 -6409 50057 -96953 -66832 -113505 -395839 190978 -232566 -250090 -162331 -76506
12398 -62539 56515 -156012 127409 -30687 142471 -78394 -134346 236991 180342 103506 12234
12386 -106108 40458 -90638 162382 81259 413714 -251140 250280 450044 128125 -30023
12375 35540 130048 44898 -153956 -139152 -72534 176151 -41391 100019 -78171 101031 230367
12364 230367 -388824 -47948 -3072 -86928 -36506 221661 123073 60918 187190 -148059 -289495
12353 -289495 8422 41352 271696 349082 -357698 1025 85396 283891 -106687 245736 138921
12342 138921 -138038 -3347 1013 201643 161508 -5817 -292329 452737 -72733 28386 -251618
12330 1147 -222538 -46926 15568 -18082 -38921 178987 306186 -5768 -56102 232857 255157
12319 255157 -39453 -39656 321637 -61487 -159181 210842 -160802 -227642 -68762 -63926 181769
12307 72144 -302140 209766 277854 46315 5975 -126339 48277 -67011 103973 -214366 87318
12295 204152 76307 116422 41450 80690 116005 -87499 -143015 -112803 150326 -74536 -47818
12284 -47818 -144988 4260 185576 206573 -14311 -82755 261534 212214 7768 18747 -190126
12272 -4964 38508 -14468 -172487 268332 404702 301426 -281643 131245 -78654 105934
12261 333169 -148586 217376 23360 69104 463757 96717 64772 44376 -27645 -121001 -53879
12249 -178818 196230 6117 -187466 177221 388810 -77975 428752 215243 22118 124846
12239 124846 311868 10847 -97306 124436 -64221 72731 261767 89584 298347 62583 202318
12228 202318 -70274 139529 130250 199160 125796 -129728 164603 28090 337751 324848 148383
12216 -15150 346037 -70987 391464 -226795 283308 113338 37067 27099 56305 121045 -156050
12204 -152547 131849 54676 41451 156526 234036 -92451 133902 115990 188956 -172843 94494
12192 284767 351434 203885 62199 80779 -232662 62972 359053 104743 -7610 347013 239497
12181 239497 267147 183891 181233 356424 -117991 301202 -222263 296437 -87325 -53411 -57342
12170 -57342 381585 -194183 53508 -210871 307769 563660 -3722 147302 301900 369207
12160 369207 48917 171967 -122565 276671 -77469 94110 66928 94990 42640 114738 190402
12149 190402 -267487 -109126 37081 205185 51629 -157290 -353703 206373 214457 -175180
12138 111526 303338 107242 62770 19979 393358 -36136 -100309 179448 78140 -48297 -340851
12127 -340851 17669 369059 201362 190329 251513 103307 39301 -128580 160659 -49789
12116 -29811 154437 -190928 165245 -192569 -79503 -53041 188959 62879 -79022 -144019 160544
12104 184212 148180 -231783 -351869 31203 168475 -186294 182058 98048 -48643 -37025
12094 -37025 119331 -189688 205841 243993 47546 83755 88328 -2059 -3846 175042 -111317
12082 23331 13410 49452 -80823 -119842 215128 19393 292 -235956 176885 -92326 -101528 -319858
12070 -319858 2926 42883 179471 162893 85646 118257 -111298 103619 88866 35899 -177819
12058 -151217 123081 1109674 1079292 413428 -29027 377984 8838 -291608 -80776 54737 -109799
12046 225635 -20493 191745 -159744 127235 -29059 -223029 -11646 -331624 -37788 162955
12035 217214 -328986 -39255 195070 -229483 90652 -170299 -52372 65821 -235513 43674
12024 -53533 -16992 107602 85463 -33989 -63142 -114556 -178950 -63799 -180818 189825 -246921
12012 25351 181828 -15505 -78928 115893 73995 -13957 -3324 61338 -159058 -234160 -130923
12001 -130923 199629 311231 -243966 7051 11712 372884 28956 -198416 154273 174258 146171
11990 146171 29622 51276 31365 -90834 -64049 119499 148087 7450 -13545 -99182 -89390 7140
11977 101597 229223 -64951 69573 -214001 53324 103513 -97310 -9757 -164777 -34988 24924
11965 -216915 -240783 58773 -117174 -245189 -73337 3734 -121065 -125447 -166091 -97423 -258885
11954 -258885 -93565 -118721 68272 31006 72783 -78330 268991 59489 180594 -119152 -335700
11943 -335700 -197526 -172492 -124022 -211175 -173211 -154676 -183065 -268455 -157206 -97635 198451
11931 -591027 300017 -39244 -155866 -105638 93510 226180 -65869 -189974 -185793 142464 164407
11920 164407 71046 -82658 108970 -47838 -155315 228541 20494 149364 -89128 -150234 -180284
11909 -180284 268573 -10973 189472 148747 152297 -107735 -38503 -354338 63700 -38025 -30611
11898 -30611 -76253 389926 251478 -83665 45728 -156339 141129 369057 -321003 391962
11887 105768 107897 -27722 -19310 -331129 -201853 -102480 -74606 156988 -76468 -184866 86715
11875 22500 -110774 -244138 -37394 -152448 7325 27087 95104 163257 15538 -174961 482794
11863 206636 -8604 158897 -10862 -46790 153400 181256 -42563 32380 216977 -76956 228280
11851 82246 -272647 -87059 -150236 -69532 -53823 55755 2808 -101476 83114 -64205 370264
11839 -51719 -31931 -331144 -83492 -206831 -1925 121439 46524 -328371 -72182 -205341 190514
11827 121305 -394178 -210621 -17954 59428 147156 -140187 44689 130913 187223 188103 -35311
11815 -229626 -173218 -20520 -100381 -206047 -347277 418740 96087 -22205 -239550 -97776 -218222
11804 -218222 221110 189943 -243389 102452 138778 143870 -12666 144917 -65873 -188543 61727
11792 33227 -93592 43036 -140674 263126 -397909 55994 290190 123302 204831 -269271
11781 128951 -537029 -204227 -62826 -66439 -136450 -542874 82904 -171383 -276380 142801
11770 140374 -104909 63212 273497 113254 -26860 -185801 24378 -105453 -94911 94622
11759 -186431 35717 18757 -469892 -35575 99733 -38859 -25291 -21824 159256 71857 -74111
11747 275383 165029 117576 -203107 -21578 -228299 -23002 71696 -77086 -81604 413832 -30320
11735 -339636 -64062 41785 -122305 -271646 19756 119228 94303 102717 191533 -45068 52489
11723 177068 6334 -145116 -195794 -312102 -517 -281110 -211453 -196503 -28610 289990 -72550
11711 105629 -195795 -56397 -241692 -201668 69748 65137 -103858 -163884 243516 183595 28586
11699 -42505 74243 -195510 206096 -78914 -144451 -288477 115285 -96323 125442 -116065
11688 227635 -48811 -73466 118834 -300198 293937 150727 22478 216872 -129576 -250484
11678 -250484 -124652 76867 -8291 -709 295248 -173223 116052 -51594 117981 41060 -16386
11666 -155720 202916 84425 -155276 91680 -220209 74448 448 44789 97485 -31778 94252
11654 28053 -223171 110003 -43759 -372070 141319 -38880 167790 -177689 208255 -56847
11643 -264238 -156358 -380816 94878 379861 -127348 -100085 123764 54993 -227240 -311913
11633 -311913 60021 -78675 -46314 32034 -249279 288584 338842 480360 -153181 350563
11622 -136654 -119100 -213648 312773 32475 146124 -121832 -249768 59749 -134899 103220
11611 -298057 -274463 23747 -392373 -31802 271283 295173 -18213 -309551 222226 -75320 -192238
11600 -192238 153037 -172415 278251 -26620 59188 -354021 -253012 -40622 -98391 243959
11589 77599 -91734 139192 -3821 137502 -32328 -163094 -20636 -231079 222958 155207 -351106
11577 165359 262727 149548 -201125 350759 274180 332355 -127858 -137229 97811 211246 242938
11566 242938 79718 -168235 -329384 -122058 65187 -166850 -80982 -221940 -56689 167422
11555 129064 70963 91827 -183823 -22515 -227426 -432657 -29669 -130221 -69681 -56259 141160
11543 -75401 326032 205631 118746 27478 135200 27162 102770 102410 -143343 98537 -216313
11531 13548 54467 -2351 -232758 153871 12055 -109059 209936 259423 5434 24222 -115687
11519 13938 219057 -213754 20738 177176 297809 138778 111133 125973 67918 282170
11509 282170 2892 35682 49147 -92325 189431 -18746 -10850 104557 143696 -164811 349602
11497 -7959 300541 -43260 -147029 -4044 177427 162711 342166 41144 620801 74982 33643
11485 6979 49850 -316145 101795 24308 361864 -20312 13932 -190373 -292905 -51048 -65119
11474 -65119 109317 225689 24527 -125796 373883 257220 200529 -178040 -58277 401318
11463 22589 239934 227628 37778 115373 -126970 113498 110969 35053 133058 502658 93339
11451 73880 35291 63061 54655 -75076 245015 301277 112775 49390 196995 135654 136647 -69396
11438 362574 117496 -1417 168904 91526 -52183 1428 107526 -126037 -296953 -10700 -62174
11427 -62174 65992 190694 144171 -134301 126228 59330 -267274 -85828 -83795 172390 198088
11416 198088 25856 104507 28705 263334 35814 82621 -83232 208140 -186972 115169 71874
11405 71874 22084 -12855 54723 70352 273926 -28392 -16865 -222681 -108904 73231 13837
11393 -200034 -85633 -137892 68815 -391914 -312355 -47876 165206 -18394 -304876 -311914 -189078
11382 -189078 158438 121273 -192470 -236686 229472 -308434 214556 -75763 79900 -34416
11371 -70865 -66925 -64943 42952 -143007 -120645 303835 64331 -157558 -18456 -482833 -142342
11359 -96659 200767 -76325 490225 -147055 -133891 18092 -101715 307094 -277120 -3181 -161586
11348 -161586 87990 -294542 -188434 144453 145654 -70052 -276927 132501 89629 -54004 -208043
11337 -208043 239407 57602 133745 -401878 -216678 32649 -106978 374649 -227863 135032
11326 53466 -57849 -311259 -103578 106559 216373 -89236 -40733 194804 -94719 136331
11315 -54768 345345 -102045 124699 -56247 89814 -8050 5317 -306346 67850 -21723 -60223
11304 -60223 -87888 144259 53646 -206035 46071 289808 76261 76939 -34092 -119837 89377
11292 1737 -197428 111496 132229 -370500 -95903 -48237 -12793 57256 -99981 181664 -118108
11280 193015 -105303 -200879 -43752 215276 149706 43273 144401 74399 -169109 328058
11269 101790 67287 -222032 295529 -66005 -183290 61268 140526 -528623 -324321 -296134
11259 -296134 -121204 130241 -46231 -147218 -64207 97165 -37351 -72876 -33200 20990 -187662
11247 202736 392512 -227891 54175 12949 236444 -132608 41302 17972 -69745 23004 -162454
11235 -346635 76882 -420466 136507 -144913 -169657 109700 -51121 210681 153003 -4126 -305341
11224 -305341 292030 22010 -222078 22997 -367393 -103902 45332 230557 -121156 16931
11213 110126 -183309 -116649 -189204 -45255 -58232 156550 80927 472718 143039 141158 -71514
11201 -226516 -55320 -44790 -3430 -11814 -106920 9850 -273893 159072 171345 189190 112565 -36443
11188 211725 -88856 -256635 -205510 233112 -263461 -107166 -166623 -70584 -157057 11203 -177244
11176 39107 -14509 91885 95330 -125108 179519 -212577 -179075 -29046 297055 16269 158954
11165 158954 -194730 -156102 -160301 -93847 373514 -81206 -138533 -289649 -253981 -180815 -337162
11154 -337162 33900 -128709 179577 76783 -45338 -125401 -181024 -124033 -370705 177483 -152679
11142 16128 -4293 27645 229595 144940 162962 -198174 327339 -97159 212064 31964 154567
11131 154567 218025 180384 -236045 -82998 -63003 -170974 -123026 416583 -139209 121730
11120 148110 31969 -135480 -224120 139698 67885 -73566 101665 -138062 -10069 114681
11109 246789 -85971 206820 -100199 -61426 125985 90293 -102317 107784 -118802 64776
11098 138865 265185 6718 -179706 -84231 253573 -154729 -214225 -69943 169688 -155009
11087 -56622 31660 7232 -55341 218000 141066 453845 -68552 157658 32835 375114 253255
11076 253255 366733 -115035 383929 509944 373181 -84624 96419 336885 217461 325406
11066 325406 317568 174119 252968 498391 454965 373158 505044 436499 627266 536400 244212
11054 -169491 106962 439149 559252 610244 541314 585440 642501 149044 466045 770294
11044 770294 381650 653866 652189 510020 633090 645142 828990 826729 873441 670283 199411
11032 729273 213219 490921 336604 895076 777898 411919 650067 506889 556331 625897
11022 625897 522101 508330 122266 379527 434316 596103 629163 574813 291934 753994
11012 753994 465180 570813 607290 886460 461914 500366 489578 239559 603897 148442
11001 399259 414121 812635 616184 291143 308447 466741 586123 581971 215618 846355
10991 846355 898490 550247 660506 810213 606740 634330 663520 805973 729810 830854
10981 830854 802843 1097838 783376 1432445 1583032 1426963 1539260 1956649 2073199 2047092
10971 2047092 2612953 2439951 1961074 2207140 1987257 1447634 1574578 1144274 1044053
10962 1044053 1510239 995086 954593 1013756 905089 831984 867462 1154274 1123547 878219
10952 878219 769359 779243 316135 11049 377404 253215 606766 308005 140368 -23896
10941 538332 360328 321708 126846 278150 157129 260544 -392686 -14376 108459 12756
10930 234527 307409 126232 -3115 -143811 -131568 -211269 474369 -37649 21703 -262727 176301
10918 -81474 -145664 156198 231857 63768 -502 150736 64329 -59718 -44687 114027 -312473
10906 -202456 -199819 -255243 231327 78939 -101059 24217 199975 14525 -724 -207734 32727
10894 -117608 -123452 103449 -222315 -181571 -228505 -120912 161293 -43947 -6898 264601 -47985
10882 -152174 148481 125704 247155 253198 -88505 -45242 4351 75783 125385 -366324 -131853
10870 148894 -42371 132911 -79821 73964 72815 139770 -76667 53551 -50386 -80939 228360
10858 -207120 92254 -214518 72724 245227 155761 11627 121476 -95478 -125838 -38358 -3254
10846 50728 -173006 -206837 -338639 214819 -178105 167232 -150879 252720 -163955 -252274
10836 -252274 89143 42564 -138767 -394321 45146 109480 -127929 248134 -7569 200270 68627
10824 -487429 -110691 -95566 -107859 -126369 -79103 400178 -108055 220267 231443 -139205
10813 134386 89743 196052 86087 -87306 40062 -11452 -246547 430742 46986 -65180 275586
10801 -332605 37611 234860 22558 119586 337786 -82373 -29176 62237 268461 -160021 -16407
10789 91350 305476 -183086 11669 -582771 -67508 102459 -188042 -55741 44030 75061 -86616
10777 48478 -188195 55159 245057 -96094 -62512 -62335 -289415 42666 104564 23923 -64100
10765 -105717 39745 -271512 135521 99 -73906 -114406 -75154 40796 -171647 282456 64829
10753 -306679 -248822 138866 -521966 -146831 1797 105647 109538 191966 -116018 52647 93016
10742 93016 -126615 -105869 -10080 -139187 223394 -116402 141857 180387 22610 227726
10732 227726 -346987 -11689 31232 -188184 182501 -65630 -444788 -128183 164988 98707
10722 98707 -235484 -262732 -193155 92392 -258102 -183457 -199119 -346063 327827 55402 40791
10711 40791 -333901 -39483 241107 -47749 -91551 76962 -100572 -463063 -68431 -167809 -4141
10699 -137002 -303464 -152925 58198 -233992 155982 -38648 -60420 -174146 -129543 52021
10688 -362580 -188780 -312969 -71547 -281090 -129333 83571 63036 -63140 -15078 -203631
10678 -203631 19829 268823 -114141 57862 -312965 -41965 36373 318733 158190 -101137
10667 -233574 -51308 -179196 185709 70275 -416624 -237005 -45956 -70328 -159293 40873 202751
10656 202751 72976 3847 -44479 166833 -174803 61733 116664 -449582 -25579 63750 135435
10645 135435 165337 -142037 -156983 -217801 -84195 -214833 -233094 318317 -164004 -332837
10635 -332837 294379 177150 -235884 -130178 133943 -20880 9202 131651 24533 224340
10625 224340 -75145 -196611 36608 -196743 1325 -156516 -168733 -24351 -148396 -101573 -208919
10614 -208919 307364 -160978 -162763 -9443 -96431 -132518 -144467 -20876 -40568 -176533 48252
10602 375230 80007 -35641 -120154 89138 28616 -182934 194799 168588 340808 -283513 -407161
10591 -407161 194970 -108343 110754 187681 -11156 -96809 291466 -60366 -179803 -344608
10581 -344608 14012 -28707 -220206 -156171 -169544 -185884 -123088 96435 -222169 242574 22540
10569 -196063 144396 -31270 -28810 -218514 142415 -295468 -143750 182 -408470 -211991 -16702
10557 85204 -226801 -617 -100722 90430 184327 -275656 -61803 293975 65595 -207991 -117900
10546 -117900 -104528 -55370 -101888 -218529 36383 -29348 -48925 -90854 101282 75450 -221543
10534 -111766 -346505 -301496 -306488 35476 -179292 9139 -4951 -155152 328417 354762 19323
10522 -90345 161742 -83279 -191169 16748 -268561 -27304 -311380 -13238 -105637 33 93342
10511 93342 131802 25775 86779 62582 239755 -295017 11123 -61389 -106263 -204157 135538
10499 -46249 -3147 -148544 -68286 -125615 200149 191961 -161386 -60980 78295 -72173 99846
10487 -92932 194378 -193796 36846 71436 -154018 -95631 155277 -167727 -15993 67694 338364
10476 338364 -87269 36494 -340862 -19206 -9815 300833 -106867 -157781 -321562 45692 -267903
10464 -214080 12356 140338 212541 -253886 482222 29641 -10503 29222 -155188 -360006
10454 -360006 -276998 6398 -91334 -44770 102429 62845 -181681 369334 -292126 -141277 -205700
10443 -205700 46271 -69064 -155912 89116 172446 50903 -90005 -67322 -28382 129021 162951
10432 162951 43905 -28922 -425645 -198903 156250 -248502 16263 -58744 -82005 185172
10421 -347261 -93622 -27818 508669 17117 -92147 -131320 158209 -65759 17712 30810 -68637
10409 -184160 -42705 106485 25306 -51775 -241425 453207 -38012 56548 161069 7205 339865
10398 339865 -117121 -337959 -197574 122163 -155814 317524 148888 139627 372719 158535
10387 31204 129869 187659 49491 115218 -42532 131118 103139 -13671 205442 243364 364858
10376 364858 -269488 172346 190836 290960 300608 296868 150093 161487 345430 -113064 460125
10364 459751 370511 135298 294832 373619 66237 -13220 61199 -98285 354415 187934 70194
10352 574205 363952 795402 149677 92804 149041 208489 352611 193818 314522 221449
10342 221449 338016 107602 -101889 120922 21622 -217276 57590 532920 -35653 187851
10331 170133 -387543 88807 -40616 245418 -124186 -52720 91422 -169170 -188778 316662
10320 271811 -90948 49672 17887 189691 -140041 -252353 18269 -57300 146055 -606782
10309 -309616 -74765 -329128 -11401 6599 -79250 3668 -44360 536 15535 -107518 -221218 -279528
10297 -279528 397659 -221371 167844 36765 -10730 46875 80053 -29943 -88149 99588 144180
10286 144180 48447 -122779 108853 95781 -65985 -69874 13681 48234 -33277 -121664 -210964
10275 -210964 -252113 76030 -269836 49810 137706 -258401 -89378 546194 11432 58152 -110270
10263 -68510 -209743 141180 -382246 -9894 263267 -252904 325122 324147 -38546 108821 197084
10252 197084 137855 211953 -73536 -250279 -280465 85130 -59188 158398 30959 -367752 159565
10240 -367790 -113292 98566 -75942 120435 -106457 227130 -85763 51725 247572 -15070
10229 -124739 177442 80447 -16942 -184774 30218 206203 -301027 250931 -456443 148024
10218 -206237 -16796 -184459 -303237 -14887 -167097 305975 39470 -123168 -18503 253858
10207 -68440 -855 -304854 -6432 -44088 -121123 -3097 -126525 90369 -348751 222729 -131953
10195 -395200 -281544 -80187 5668 86169 -338031 215315 41383 220003 -48851 196049 -184702
10183 205677 8319 -38819 435101 -115880 18632 -106398 155210 -281468 -42036 -18590 156839
10171 214902 -318435 -214537 121232 65143 -141319 -270289 -141273 40821 -237757 22369
10160 -162106 87440 100554 149862 202835 13587 22838 254120 -213519 -84099 281492 -3900
10148 -31944 -190573 -280164 -299544 1328 -188340 -11017 -193912 -235550 -166023 8962 147072
10137 147072 -57834 -486971 186083 297500 -218416 142397 -340324 -122852 -165799 -158223
10127 -158223 15172 127137 -245116 -87103 288836 17590 -204571 -190265 122289 97919
10117 97919 18139 204437 131746 -266084 -87200 -258033 -207250 -307521 -19202 -154546 -198474
10106 -198474 -64853 113604 -267803 -107583 2490 -193791 245779 -387801 -162925 -299973
10096 -299973 322052 164937 -129294 -130597 50496 -37730 -95291 -10878 101044 -163003 -16744
10084 -393464 113584 -50158 -196379 105151 -101767 -197125 -5771 -3760 141787 -98054 -30593
10072 -75355 -34552 360887 101624 -1126 159505 -32879 -23253 -117090 -63993 158983 151280
10061 151280 71301 1398 -163060 120221 -339607 -334973 -192793 -337584 7739 55864 -67558
10049 -462118 -182645 -199825 110399 -59172 -120091 97351 -261902 129285 29977 125585 5437
10037 -12606 -249846 -48566 -151464 -96366 6509 -291289 -110981 -15674 -219394 -89316 -293537
10026 -293537 243929 -212059 -8894 84652 -212899 107091 -69404 -39596 -768713 -36052 -469240
10015 -469240 103079 110068 196316 -342460 -99463 -282020 -40429 -13442 147022 -102008 -243909
10004 -243909 -131955 -10850 -47003 48826 -49723 304145 -60111 11282 -99840 -135680 2058
9992 12930 265534 -168775 24392 -168180 -71426 99786 -49766 -298752 -90473 19545 58035
9981 58035 -323426 134112 -171670 92952 -40970 -289320 134776 166585 -425736 -174132
9970 -264592 -75229 -240519 -8030 -101912 -249351 -135287 306495 -152003 -119211 44142 -127336
9958 19754 162683 -297601 -24732 84397 197643 -215372 -237802 -385891 -58804 -257890 88437
9946 167462 -196423 128181 17258 -1125 -196378 -186870 -39901 -23011 -92859 -312311 -421037
9935 -421037 -96261 -156003 -70809 -284662 113247 7215 -120483 -126311 246762 20659 247595
9924 247595 -3387 -247202 -239050 114363 -271140 -346956 105523 -212264 -332989 -15616 -106275
9913 -106275 -75801 -169672 -124648 -91346 -41867 -121319 -275932 -364628 56338 -28712 -60625
9902 -60625 135210 -83375 -397086 -152109 -33557 -127685 195842 93259 -331338 166556 -34808
9890 68734 -213852 -407519 -53355 -148990 -27326 55288 50691 -181090 127958 57157 -167095
9878 -221570 109757 -107268 -104760 -171027 -234908 91508 -325316 -330658 -21128 86466 -233779
9866 81916 345954 -230537 -8101 -122577 -197343 -226503 149946 248437 -134736 -412692 226544
9854 -185999 -132353 -170719 23521 177036 -18135 -40369 -274848 -22840 -61988 -88951 -199784
9843 -199784 -157736 109985 40081 -176788 -89507 -36470 -162418 121144 -74869 -152167 -73308
9831 -55590 52625 -143390 -75590 -87447 -276489 -32735 151887 -116710 -36826 -316667 -40513
9819 15217 17703 56163 -29624 20402 -141261 -25786 45681 113514 32649 285596 -34033 -346191
9807 -346191 95876 -167547 -15289 119304 56331 57800 -204807 -351322 -93081 -117315 -116654
9796 -116654 32202 -174513 -83242 351500 -40349 272024 46824 -133951 -211785 144771 242254
9785 242254 -211546 -3417 -174590 -228831 -160067 12866 -175999 -63259 -291082 188344 -253384
9773 173013 -65797 -273614 26346 50798 247222 -28469 -155126 -170739 135492 -102936 17455
9761 -228085 -82827 180412 282233 185565 107027 25524 18518 -257862 -24735 122186 -165678
9749 12685 247409 347027 55777 55948 503712 -163869 -185605 -117063 -105409 19054 -22247 -5909
9736 -230311 -15110 238762 -46664 -166213 -121736 -205674 -201954 -23842 -266924 118136 180139
9725 180139 -284064 -179102 -238381 76876 75439 292240 -45131 -76679 -167098 -7757 53502
9713 16580 -66990 55027 111312 -365631 30778 -269184 -222324 -311221 -13816 -275117 -25379
9701 51545 276982 115668 -279664 -160415 355115 11674 -163128 -70454 -396279 -147946
9690 244930 13411 -184941 -165987 -332223 -7455 35543 185846 -30937 8137 51232 -711 -236183
9678 -236183 -93183 -64161 123269 81312 -27370 -134963 48497 -299911 -103599 379515 -317399
9666 -74287 -69821 -302710 58484 -347618 -95210 -191128 29362 141550 -290136 -50960 -13098
9654 -104984 -141244 -117903 -164913 213714 58208 -389652 -17167 -38849 -349585 234845 -284293
9642 57411 -153911 -57621 -79872 -166546 166561 130801 -4411 227711 -12177 -55262 237040
9630 -4218 103667 -195215 -11225 -118709 -125843 -86796 -358652 -99453 -150053 -23098 -163250
9619 -163250 -22341 -193805 -325145 -212824 -4518 -227447 -259162 44443 222147 -95640 -85145
9608 -85145 -236260 -378889 -16096 -237199 -42702 -151272 -70560 -237303 -24245 125837 61844
9596 4678 -34171 414919 -277843 -127027 -226257 -10701 128796 -210134 -237589 -66773 -181421
9585 -181421 -254870 -181884 -121617 -139778 -132056 -190964 -358131 -339760 -29207 -157911 -259868
9574 -259868 -191764 -195903 118503 40257 144516 11422 63837 -67764 -167479 -212440 62228
9562 -309205 -57737 -403308 -189029 172435 -191359 -112754 165840 -198953 93552 160720
9552 160720 88016 -101650 301964 -285596 -204762 -259588 -82841 -320673 -129868 -12975 -11120
9541 -11120 -76571 -143409 -98103 143642 -23802 -462958 -65352 27765 250644 81715 203020
9530 203020 340176 -119577 -59804 120114 -59122 -55722 -285866 -233629 116595 -265332 -244670
9519 -244670 -208362 208988 -456722 -286729 354144 -142996 91364 -166284 236604 68765
9508 -162293 -221939 130787 -39086 -200353 -91374 -147775 150186 -36561 -159929 -221362 -393498
9497 -393498 -138368 -169899 188049 -61525 51707 -69953 5835 -28863 -106335 -194897 -168662
9486 -168662 -195742 381661 46313 -252771 -13319 19624 -185851 -71049 -76130 207983 96370
9474 -196848 46200 -10478 -448726 39807 -51663 188735 68912 207128 -301593 127409 115186
9463 115186 377244 97015 252077 -124926 72034 -82960 40611 372559 -198714 -62610 194087
9451 129470 -164704 -302197 -190550 -230962 -160023 -101454 189850 -192513 48420 -64408 166975
9439 32899 41496 -93218 -313405 -308417 199206 50219 -261001 -220275 82980 -106617 57748
9427 -480356 139592 117345 -199694 -22358 -13299 118006 37489 -278524 231031 68537 -360646
9415 -280120 -69335 176845 28599 -48618 33077 -159452 -539844 131880 -147331 -154072 149168
9403 77100 -232667 199474 -121994 81670 -234034 63264 326608 -69454 86572 -107090 -166064
9392 -166064 -227383 167735 -145363 -246187 59158 -43564 -265876 98606 43288 204027 42448
9380 257942 -190280 43841 -406228 -221521 19833 -145130 -225786 -142846 -169623 64285 -81357
9368 21989 93197 58123 -128045 -62798 72152 76962 -72787 -67900 -251690 -8160 -254300 -153149
9356 -153149 30322 -39920 24956 -342383 -43792 34538 -167672 -65823 1264 -235427 -62046
9344 -259379 -95845 219180 312941 -1243 -255524 -319135 -196665 -94545 172240 -171341 -195360
9333 -195360 177572 -290129 255062 -33657 -26392 -41037 -17545 298688 65724 -17402 -76406
9322 -76406 -167076 29320 -208824 -78412 -190856 206776 126609 93500 -339576 -11603 -160428
9311 -160428 -33448 -77511 -12148 -64062 56468 -7448 -139819 138671 -109087 -76156 -284621
9300 -284621 162090 -107146 -242248 -117275 -26847 -60952 -56829 6410 -19536 319196 -69289
9288 33965 -42295 -210186 -38618 -258680 -237632 30302 -68938 156649 13592 45237 -164408
9276 -91165 137717 -211117 70192 31763 173405 -106883 -197955 -289319 132392 64451 -111580
9264 19466 -373487 -231516 -207117 -26040 -70101 -157375 -53293 -257330 -1217 149846 -176131
9252 90424 -19936 169976 195941 -92467 46701 -109763 95202 -485174 -64702 -362583 -281293
9241 -281293 -467328 151490 -462239 -347602 -356918 8630 -74306 171732 -207295 -350540 -64128
9229 -6985 -132615 -269157 212621 -208710 -101758 -10487 -283923 150915 -173432 54146
9218 -137209 63505 -151403 -473022 -97770 92278 180306 -156448 237953 8487 -2927 68266
9206 -164960 140566 -124986 -111800 -302998 186796 -102426 -118281 -252710 178357 -40292
9195 -140950 202828 189622 -104456 69921 -123122 -275014 -42948 178899 149424 27159 -49778
9183 -117608 80663 -14380 72754 96541 -226713 82790 -215000 -16774 -115859 -271240 -530490
9172 -530490 -435848 55285 -61900 80967 -6446 205496 -290523 -17283 -176399 -40028 75480
9160 -175994 95082 -82968 -163221 109760 -364961 100435 -118892 -6759 195725 -197964 90732
9148 -85303 -362024 -136824 69410 156974 -422927 -138629 3753 -39579 -201866 -28609 -44811
9137 -44811 -240958 -268777 -47703 -270058 -213144 -33689 -517074 196822 -325004 21899 202484
9126 202484 -92925 44874 64380 -202665 -4974 43872 52321 -368980 19950 112881 -252387
9114 -74525 -59321 157 -222319 -362687 -51709 99411 82374 -119191 -294998 150132 99071
9103 99071 -400047 -222658 145512 25656 -151263 -129223 -28491 13566 -35778 -84085 7876
9091 -40360 -11083 -8335 -238662 -89385 139657 108126 133344 -13050 -1255 -180127 -29284 211080
9078 59213 -367486 -237552 -118971 -278932 -191243 262717 15310 22476 -221008 98262 157459
9067 157459 -236644 -246890 57360 78697 79653 -93818 -17352 135659 -79565 -49 -91848 72608
9054 45737 -89554 -43247 -123347 -183757 -157174 -83934 1063 -74364 -12394 29784 -259425 27206
9041 -22956 105749 -244639 -196514 -93500 -140181 56202 -450033 -153945 -104801 169443 -328768
9029 -56438 -242923 109011 -231740 35459 31462 -266970 256429 -314940 112213 -239610
9018 252208 -322 -133823 85939 21631 87409 -165857 -50265 -158506 -60180 -95999 250232
9006 -39596 -184869 -164287 -191763 -110219 106662 79304 -427253 -279521 63606 -46178 -127395
8995 -127395 94317 -120084 66357 46368 -185304 -109965 -12507 -460744 335454 143094 -167482
8983 330810 -159813 188515 -519500 -40201 75719 -182744 -166818 -2462 -117662 -173373 251638
8971 -317606 -268767 6334 86731 255703 -99029 124772 -147950 -256161 -99837 -107976 154680
8959 -386762 71225 -84220 -191221 -140826 346415 36049 25330 -85310 -113468 -29631 147995
8947 -187094 30972 -263418 -133100 -276898 204996 -443637 -260281 -197389 92614 -25921
8936 -11920 34739 377677 628862 273883 -119717 -172416 103392 412790 239836 -433484
8925 8848 105055 205905 1791494 6275226 22418736 6357926 1826022 895125 639828
8916 639828 557498 519250 96576 61816 -406204 -58541 202173 227061 706281 492152 291417
8905 291417 -126996 -132392 112961 -632 -224756 -232228 66762 -147050 -6036 -144327 -245643
8894 -245643 122769 -6050 -27264 88157 90416 -156277 -176081 9197 -129928 27051 189644
8883 189644 120638 -195672 -211639 -146374 164675 53147 117702 -159512 266114 -30367 69001
8871 -479723 -86164 -38848 92056 9054 -128138 35854 112977 77861 -116579 197022 32819
8859 -220715 -306205 -104488 246648 167744 -330274 -141945 118581 -321643 273690 101831
8848 -181272 -334252 78011 -211651 -192167 39174 150140 -192851 -105724 -212726 -11424 125434
8836 13915 113805 -338000 -54839 153261 -262676 -164572 284059 -88673 -109211 -318122 133625
8824 -44085 254783 -276444 -158813 117931 -64547 -73456 -304728 217947 -8948 -189573 -247328
8813 -247328 155413 -138500 -58636 -55924 -48000 195860 73904 -58393 -56139 303845 -38744
8801 -49060 -61545 164992 90447 -5455 -98578 81879 -2649 -47266 -270112 99097 -274574 167222
8788 -27895 -37890 -94955 -24634 -142705 46893 -201918 -175512 105681 -488773 -327847 88153
8776 210161 80776 64327 -135056 110871 243629 -274909 194006 223669 109701 440390
8766 440390 127568 -112067 217899 6795 -284049 133580 12106 -301020 -44502 -77769 -290262
8755 -290262 50967 61931 49303 -281936 80737 -82782 13699 52707 -73523 -374747 -191555
8744 -191555 9925 -93254 69227 -24901 150457 -20213 3323 89873 298590 -228280 -178904
8733 -178904 -26124 -53314 -272069 -123569 -110512 10466 -125410 -138913 196542 204961 48264
8721 265556 -100177 329166 -34699 -152366 -7232 -31752 -160216 -38216 -45241 -132743 -424446
8710 -424446 239690 53764 -136100 -244568 -417023 -14197 -6881 -158979 24683 -196224 -216153
8699 -216153 -86281 171061 -371694 125116 168218 241352 183365 -94202 104422 -118592 115918
8687 -341794 90243 49725 -148171 -15576 115715 2846 -149509 -76083 -102174 -101877 220886
8675 104430 -97551 140100 140549 -234192 -450594 -395467 -211221 276866 -103978 -149348 -408143
8664 -408143 188882 87680 85253 17564 -126405 96565 231968 -166155 -163484 -72267 26323
8652 114424 261080 -1830 106555 -454366 -73002 -246572 82410 -442917 -165514 203427
8641 149140 108697 -92258 -107543 -184591 -68613 281553 27901 -14290 -118303 126525 -187590
8629 -330377 252654 53322 39906 49976 -191648 185182 325501 254756 -269538 -88125 -72207
8618 -72207 -298892 -26554 -185797 -224006 -129486 52424 -216152 184344 102585 -151194 -24157
8606 -85728 -307642 8787 -72416 70141 -337750 -65618 203734 -75024 -53065 -215719 -376473
8595 -376473 -157329 -228075 235699 149958 219959 52128 117308 -181834 -176933 127214 274737
8584 274737 212659 -204117 248478 -168076 46290 -317865 174866 -109060 67240 92849
8574 92849 -166707 -381954 -44293 -172407 -149365 242379 105513 208469 -27573 -15644 3682
8562 -138359 99264 -116541 -6669 51573 74899 -58763 51423 -307847 53556 -166017 -186026
8551 -186026 -21782 -212065 72099 -117117 258143 -66920 8624 -191955 216719 -12108 101371
8539 -241750 -100883 -351643 120975 106740 -179686 12407 -266510 50848 39903 28650 -202840
8527 -67242 209760 -143023 -79846 42374 -172542 -102081 24881 -7499 -396818 -311122 -204222
8516 -204222 -64186 91033 -88230 -31495 268549 21345 -58321 -144922 -85983 -149249 12175
8504 -23932 -65533 -311894 -364916 135028 -79180 -94415 262358 -152844 -66446 43031 16794
8492 277518 -29775 -42959 -24145 -75984 59807 -63379 234668 -220415 -117671 284668 167964
8481 167964 -57329 -67445 -20375 -17604 -38056 -24485 233836 -61738 190902 -62815 235676
8469 1830 -36792 88571 287072 288166 98360 -30373 145459 -84588 -36737 -328507 302032
8457 -242152 139187 26666 -144101 28076 -432857 380512 5660 -87330 -62884 -368661 1083
8445 45041 -101742 70648 -81591 165444 -298898 135463 -141325 -7959 181682 216417 -85485
8433 -159415 52887 -583451 -119895 -106154 -277703 -118460 91832 139578 -427483 -31005 -108628
8422 -108628 -424519 -89870 109013 206501 -263220 -177914 135928 -43143 -9439 -101727 22812
8410 -1346 -334672 -180254 261177 59802 78530 153121 -291497 -78644 26069 -161147 80554
8398 95963 184728 -199809 -86914 -58586 -3544 -163393 128584 -164318 -184520 -162 -516784
8387 -516784 -63197 3654 129409 -232532 33663 -108082 -97882 -135575 102477 -193319 -328798
8376 -328798 71432 211190 -54147 -134496 -85610 -53648 -187164 -239201 66725 -115403 137241
8364 76776 -203640 -178246 -187262 159200 -157890 -204135 -236363 -277511 -50329 33834 -369329
8352 60230 -55256 305001 3666 93225 -38924 194986 -203139 -192415 -189260 -170590 -240384 -39766
8339 47074 -8139 229277 -140667 134442 182101 102169 -150332 46298 -3106 65750 260133
8328 260133 -70246 56580 58641 36762 -106213 -52740 -323291 29819 150006 246872 228152
8317 228152 -207804 -184587 -74183 -163554 -240924 -177449 169747 -185607 127810 117429 -3505
8305 -218234 -35816 -147913 -105481 -166667 -217652 125685 -211961 218791 -242430 156286
8294 89931 -185157 72132 15472 -284920 -26335 -14043 -307061 -1723 -216209 -369009 127663
8282 -196523 5859 -366224 -37470 38647 -400683 -64186 344626 -113905 101916 59334 176007
8271 176007 -334907 -124198 -104824 -194986 -82889 -87876 105171 -131447 -71030 -24276 -78321
8260 -78321 205078 -208265 -170877 -175100 -180312 82624 193371 288178 42824 301569 52911
8248 -229798 23839 235334 -15066 -256945 151921 117233 143819 -89617 1882 -146369 -32872
8236 186325 -131934 -455491 237284 -457391 37228 -273545 -87792 127997 -148169 -233523
8226 -233523 -219567 160008 -67786 -76148 184037 292685 -87385 368454 -60434 -11622 -41738
8215 -41738 -183350 -137855 -27984 -158476 326140 -34483 -164187 -456854 -210039 -443624
8205 -443624 61325 -69253 -228774 176033 -8684 -225898 -64357 296731 -286511 -152758 336072
8193 -44168 -80348 -336514 -212628 -99015 237455 -77504 -175221 205789 122567 -33524 62541
8181 -2934 -157694 -141900 280759 -141866 -154424 -243169 5622 -197924 140493 102613 -330842
8169 -105819 1929 133176 22630 -50494 -184229 -17596 -523389 -197104 136149 227517 -127995
8157 -191430 110573 58769 -234128 -122622 -376673 159305 -267944 3121 126221 -93781
8146 -10275 -351399 -13452 -186054 -62411 -127153 210542 53589 15857 172825 -180164 241264
8134 47361 -164452 142813 349650 -145946 -21015 15531 -502499 137292 65651 232073
8124 232073 -71585 -307005 -188231 -41180 18929 -6275 402469 19016 -230358 85330 52909
8113 52909 935 2978 -227212 154993 -348988 -313079 -167266 -63469 -84799 170455 15348
8101 159534 10429 -60806 -231338 191563 -124757 -33559 103473 76610 -48223 83451 227660
8090 227660 -76529 18581 -48243 -102829 -403403 -148762 -275724 -35605 261908 71062 75043
8079 75043 37162 31848 -8012 116040 -45404 -523408 264380 -165457 181303 -201255 -114051
8068 -114051 -151686 29783 52201 -76152 218946 -237322 237333 160819 -85650 -173592 -297026
8057 -297026 93312 -134600 83944 91557 43515 64251 130889 246587 -4358 159203 -83228
8045 -55991 -155073 -204678 179506 -232671 -81416 -32365 -439765 -4143 -48813 -158110 152913
8033 126872 -109022 52222 137585 -7293 -20008 -235123 -162660 17433 -225326 -57220 60993
8021 -48771 -71163 42225 155673 -165350 -334849 -13847 -26426 -256864 -191353 -183802 -156280
8010 -156280 -321163 179817 134468 56196 -173543 15509 -208047 59982 -182298 73633 330020
7999 330020 129718 18849 213105 135471 -279189 -135150 -166851 15030 -119743 233911
7988 356198 -47160 38824 -147865 21075 199798 -123144 -158207 201178 56169 23329 -130526
7976 106041 -15989 -519095 -35196 -93964 89346 -89152 79866 276593 95476 193456 -66961
7964 26730 25319 36332 -219743 -128501 295505 -174717 -120294 97513 -350777 -117157 -67567
7953 -67567 -326349 171494 128143 -174828 121334 243951 11406 299457 14364 -266243
7942 -18420 128151 -157905 99201 -54871 139783 -161537 -1620 -230650 -293600 10577 -131139
7930 336358 82861 -170095 -179049 -143566 -95047 -105563 -59876 -184362 143340 312275 -633794
7918 -13472 -275208 90532 5789 103955 -37080 -101898 128334 274147 60934 -26163 -87715
7907 -87715 -54441 -136449 -99115 -48553 -154124 -83684 -114591 -367697 -204715 33351 -254938
7895 19766 150910 -239052 -107633 -408165 -65799 139483 -10409 36395 -290580 177839
7884 56543 8261 -277676 -271307 -197328 79561 385152 -303300 -167994 -433015 -93568 161841
7872 227247 -119613 -295916 39621 50195 -297988 -82430 152666 83735 -72887 -8842 -202853
7861 -202853 -309862 66171 -73900 30622 -130250 -82172 -275920 167942 -120636 -365241
7851 -365241 -94811 92786 -159106 -588 47374 8350 320552 -87607 49391 41713 -179869 36807
7838 32864 302019 -309249 210296 -74812 243074 -42227 -267634 -233930 42105 -93230 57096
7826 156751 -18224 66538 9091 388588 -122555 -10881 -193735 30053 -83857 -112494 -298262
7815 -298262 -285168 -76056 174468 114747 -201449 -193056 195608 42289 87070 2091 -322465
7803 245216 195412 363660 -191639 76310 16393 -37854 365957 -272397 -14119 -21798 -286994
7792 -286994 -101810 -2465 -44825 2308 54740 -184385 -183771 26125 -144736 35503 -76109 34309
7779 190914 -345227 141764 26856 238401 69198 6834 -26692 -183920 151778 164616 -148652
7767 -249245 -19605 -386520 -105211 218229 113486 149179 -107427 -136502 247727 4747 -276454
7755 142159 7537 -115233 151365 252098 -43421 -37534 -186828 -57090 -282235 -91744 -331861
7744 -331861 99543 257339 -58223 -90050 -264915 -184087 181054 103499 162640 57653 -93625
7732 -40404 51654 90451 -209700 -158995 290910 -15451 -95932 -192865 -9909 -76119 -247241
7721 -247241 -155432 -44842 -186516 -260161 -74550 -159457 340462 142078 -24335 -90178 105027
7709 191681 17704 43975 -45999 -7381 -300967 134599 -386028 -307551 -27574 -183929 238067
7697 -198685 -170607 -238077 -33451 -202705 -65230 30229 249456 14869 151813 6300 6655 170105
7685 170105 -114830 215913 123084 204831 243148 68742 213698 -48942 -186467 -103353 73486
7673 41510 -345432 34355 -336368 86494 -63774 -158469 -141815 179260 84219 45756 -6939
7661 -32738 37160 64448 -43062 -2176 -55066 8223 96328 143723 -234702 -191507 -129927 -89448
7649 -89448 -348554 -152834 408322 -110642 386596 248632 -366998 -82563 -29084 208114
7638 -365801 -311276 72955 25056 46813 -120372 154752 -381045 -169124 -157532 287487 86659
7626 209823 -130497 -236357 184579 -312706 -160529 -20989 216898 -299801 63738 -219552
7615 -229280 -216752 15407 391549 -116859 -300479 -134884 -48199 -211185 229342 -281467
7604 -148942 -110514 -323177 134486 11962 -178142 66312 7689 59537 -379480 -195055 -84387
7592 205909 -138899 20 9133 -34177 -59511 -102138 -50337 82850 -389968 -340308 -289749 -5776
7579 -180840 20752 -80558 36421 -250090 65166 188369 -158654 140886 176038 -118322 -54749
7567 95550 -198240 40004 36392 34590 -349608 14743 187489 -101376 22515 -134466 140196
7555 -104351 -107741 107368 -247983 55119 -134656 38315 -77191 -189250 211965 25352 4420
7543 -213350 -127057 8864 148316 60914 183164 -30805 -214658 -12546 254479 -96145 -66213
7532 -66213 -62527 83474 -81146 16053 -88038 -24784 -90868 -86613 -290530 -243061 131043 31195
7519 132058 6793 -67406 -437070 344808 -139437 -57023 -91362 -145645 14272 -8034 -24077
7508 -24077 3272 -22398 153853 -1126 -40496 232407 156550 91502 313326 59722 61295 -91569
7495 -377595 -199928 97063 -14087 113954 198044 186272 -157480 24491 267028 -200856 -226736
7484 -226736 -20923 -173990 294178 24080 -266895 113403 60305 -418225 -249378 294676
7473 203001 -3563 263759 -70243 129058 -3478 114808 -68050 -46899 54531 44997 45066 27572
7461 27572 42991 -71303 -179884 -100034 6832 37954 154935 -205639 -371548 -171922 167190
7449 241681 26050 73347 20728 3816 78739 -98097 -68806 321648 191146 41628 243106
7438 243106 10352 290042 -405903 -117550 39891 67537 89345 206170 48679 -63797 13519
7426 -55445 -156157 94448 11838 14606 197250 -264265 -239266 -247441 241617 59771 -134764
7414 182836 198629 39140 46089 -113938 123724 -38296 -59402 -146633 -111929 240172 -385362
7402 93442 -8852 -115611 15658 -222383 35473 201316 130453 -139522 -141537 -54290 -287244
7391 -287244 -75078 -68619 -228207 -192462 -185337 375559 21695 81279 -221300 1951 -183599
7379 218583 -481181 241605 -32981 -120483 -151513 263188 6562 -250005 5511 -19263 -19794 -570513
7367 -570513 -9904 -6684 -89719 -266455 44815 133209 388641 -29842 -41065 159516 -31279
7355 -27083 -21847 -127769 158066 -65448 -74832 -52664 242264 -126083 -98462 -30322 46343
7343 -68882 -20212 82679 -175894 -218673 -341461 -84031 -58957 4415 -209045 -263634 -114092
7331 243400 184660 -524509 -150527 -45137 209697 -15741 -41866 131818 21557 -128148 -300985
7320 -300985 -16778 -113588 37424 -399866 9524 -129326 -17928 57123 118011 -80633 -85615 65291
7307 83267 -285441 -238808 68033 -43206 -37858 -92016 498623 91554 -287782 -218869 148339
7295 -117451 -157302 66976 -857 148308 288743 -348838 165351 231110 179168 131440 -377963
7283 -213819 -1501 160280 259572 91432 -118477 -39252 241917 -139825 325278 15591 151957
7272 151957 -135905 -5282 -229127 15105 59123 -101126 139428 -42732 -401743 -52734 -207346
7261 -207346 10730 -167143 -75281 23889 -128377 127962 -177818 -193823 -21357 -324989 -99939
7249 -252868 199906 -158360 89685 118959 76992 165470 83238 46196 -40607 -74263 35414
7237 250786 -257080 210134 83934 -335591 -176589 185011 -140362 41319 124609 403149
7227 403149 -92203 -72470 -24695 20303 -313004 28034 -1125 177183 65416 214085 -123977
7215 -254933 142958 -61333 353888 -132192 -180027 234953 -130484 -165749 -226207 3168 198350
7204 198350 165097 21006 221592 -288224 -19407 -25539 -34287 -84146 29800 49921 -73677 -69255
7192 -69255 170003 -74771 -49650 2450 -248710 152312 -20547 -31051 -57132 8669 501085
7181 501085 111438 403164 -211808 161041 -300729 50075 211986 153341 -197605 -76530
7170 266710 -148595 -127821 -18166 62322 -111622 -14920 -31899 -111882 -15161 -93457 200638
7158 -193285 164138 -177863 -52494 -109761 -383908 -14633 -49858 -331953 177511 -223664
7147 -298297 103814 50349 -322145 -157269 -161912 -162128 21884 -272383 91379 65885 -156352
7135 -230219 -14725 103202 -371034 244289 381227 45414 202136 83910 -42621 -234240
7125 -234240 302797 -200324 -123239 -96264 83148 -33382 -72021 -143774 -45501 -228415 -187553
7114 -187553 -47785 347051 -58344 133895 84529 176366 31282 -272235 157207 188705 126755
7103 126755 72081 -15213 -284358 -240901 -186143 230246 38100 -200152 288880 -119730 -271943
7092 -271943 126540 -154134 -248535 150259 -466956 39332 -37611 324235 20977 18252 211265
7081 211265 -234129 131895 -249344 15712 -171599 -296745 -226030 -97688 -120501 40214 -155671
7069 -93168 -162430 -12508 165299 253697 -213397 -171257 -335410 29750 -131634 63971 247353
7058 247353 -59314 -7163 8068 66723 -88703 -61018 -65112 330365 -8545 -18507 32937 181349
7046 181349 -71900 -58828 121493 109931 311587 -107586 -39192 -325113 -184743 -412406
7036 -412406 304640 224643 163842 -238655 133330 80174 665 200574 217786 -176077 -257817
7025 -257817 316929 -191079 -60483 -209778 62907 418222 -129050 5869 231259 -147727
7014 284662 60401 -10890 420149 -156976 220375 -353290 -32698 228563 -356167 124125
7003 -301715 306278 -144180 -312572 2572 -12904 54938 20105 -34282 253287 10263 -122013
6991 71188 140213 124047 -194602 -146203 -138386 68113 -125231 -51411 -42916 -84168 -205361 135218
6978 -155007 -42881 -54312 105031 27133 -210310 -154924 193853 -27112 -207005 -69628 82712
6966 -70079 -168131 -97729 -112583 -16471 -105508 -39019 28300 157170 -221088 -61925 -39203
6955 -39203 -8142 -44531 -124597 -47971 -88006 76744 -28782 69334 -124782 -380282 148789
6943 -165070 -238943 -198450 -64701 -28120 93535 8247 -169800 -96574 180420 41656 -172218
6931 35309 -284010 -158088 -6626 34859 -165301 196493 -27496 -61144 -88761 -48580 -42682
6920 -42682 -26464 -94456 145059 -313468 280873 -216837 137095 -13130 -35332 131108 -25773
6908 -99008 57338 -170849 158316 350256 136657 144864 -132978 -51976 -82205 313712 72144
6896 -29604 123042 -104364 436138 -73659 226751 -145733 -147555 -231859 54471 201975 -178522
6884 -235999 -190761 -346140 8598 -4930 108238 -345976 -51525 -95755 -335139 -35752 -102372
6873 -102372 88510 -5225 30526 290215 -514589 -106798 189847 12304 205983 -73759 698
6861 -30769 -105291 259175 134769 132639 268383 -88268 -43421 -213766 29272 -46290 117092
6849 -198596 -55446 77049 -169349 -120406 -86618 -77508 139306 -75828 93779 29435 -85684
6837 191800 -161980 -72366 391640 -101143 19882 -12472 317946 -57149 249962 -21326 -84048
6826 -84048 197759 -271039 16045 -69876 25599 50833 -90480 -34390 80647 46705 114668
6815 114668 147588 81123 -32913 49712 -162676 67501 -127011 -76236 94446 -257585 -234516
6804 -234516 -177222 245133 -54454 -141203 -164198 -189743 -24019 -113077 226687 131776 138846
6793 138846 -56140 112310 -44 -252627 209751 128285 -249941 424730 -135308 -38296 -178583
6782 -178583 60396 183241 -91857 219710 -174803 -8694 -406656 123964 73607 57642 -6282
6770 125647 -930 179824 -128285 -681 263468 455792 261151 -161464 -59517 -200847 -20283
6758 200870 55950 -75598 -8657 -179601 -132093 9 2445 211037 -29113 173220 -136758 -275222
6746 -275222 -45697 180385 -382470 -33313 42980 -82367 75897 205092 -28791 211865 -89348
6734 209258 209129 393201 -89898 399037 140054 47476 -102092 13913 377413 200852 194233
6723 194233 242938 141933 33752 152127 -214997 -14097 -112878 109441 284237 199132 -78627
6711 273895 -241062 62284 60773 250087 81080 -188911 -44670 -155057 282654 266823 -195378
6699 -40483 -28811 105825 -70539 205549 135299 24804 -223620 -94518 133050 -65825 -23831
6687 88133 -181395 -16057 180529 69400 -63826 321122 163279 -322744 -150826 204928
6676 -114925 63124 29526 -57949 -311358 69180 -143486 65888 196643 61699 83246 -70454
6664 -37210 -300039 -246677 189396 -406346 -110579 75674 92852 125920 12867 232319 39747
6652 -85374 -33258 52290 180439 -116726 176662 -91037 88588 -51617 -5535 91249 94783 -82510
6639 -202777 -74610 -134598 -157956 -83702 -180040 -275335 -39347 102568 190265 -208369 281508
6627 -207499 25683 -74477 -68334 -135396 239859 -319457 -194481 254470 112307 -174599 -334535
6616 -334535 -88992 -73540 69752 -223492 317353 -228818 207650 127550 -419006 -62123 -75501
6605 -75501 199288 -59174 -247124 -86140 -398635 -252029 102203 -323440 7172 -368477 120178
6593 -145341 -55831 -123864 18559 -31898 90643 73326 -107505 94519 180877 -266662 -199347
6582 -199347 22262 34994 -34986 71983 98481 -200519 57782 86991 302287 -5467 314653
6570 226405 14602 60996 -140346 -286138 95241 -135428 71240 88984 151911 549970 -262567
6558 57168 106781 109236 3392 -249958 -40878 -89564 -141240 -45695 -23575 -93549 176467 42383
6545 -60567 -29516 14728 -160077 12378 -17815 165880 77188 50187 -122611 63913 408668
6534 408668 178938 -10138 -36037 -161202 169248 -338640 -255080 -285328 -466138 -138670
6523 -71922 -76567 -264669 92464 -209723 89969 -176138 387436 -256228 84335 -95335 -132962
6512 -132962 152450 119078 97254 19485 -61127 -41094 46742 189194 -6833 58023 60754 25671
6499 -192999 -47627 257463 1304 32293 130843 -95717 68888 -41739 -73753 75043 213001
6488 213001 -25199 -422740 -85407 -79523 42715 -239852 -217986 251408 -268358 -280871 -407555
6477 -407555 9097 313635 54781 -128126 -242838 114825 77244 4032 147707 46301 -177471
6465 115309 108883 66285 -4102 95867 67072 46539 -69467 -99119 -17835 15314 163449 -152256
6452 21645 -51238 -129629 -16557 -212615 68836 355807 -47757 -20298 73210 68444 -165816
6440 -284680 303427 -48723 -11000 -128419 -189201 -66564 -157987 -347461 53994 372801 -40684
6428 85454 81776 50322 79741 267594 -39767 115297 -102227 -8325 -21696 178343 70914
6416 99889 -28010 -147424 -87121 -326027 81038 10752 318540 -17494 27961 286698 38146
6404 -103521 -266832 -139992 -101768 288361 -214984 -144441 254727 -94022 -6432 78557 108314
6393 108314 -189910 -145256 278507 22540 261146 31640 -296654 -258680 33532 1551 6552
6382 6552 -114392 -81525 338104 188345 93466 -216290 -228490 -503666 300375 -340903 -480998
6371 -480998 198861 -64467 37392 93782 -92973 -222738 83678 112483 23563 -21345 -492700
6360 -492700 27551 167172 -82422 -185004 -113098 342020 136610 -31523 -214109 -157869 -26374
6348 17807 94850 21162 202939 353173 -34571 -350772 53739 -328470 -132267 33591 -173533
6336 -155110 -15804 -21781 209251 -4894 -55837 -215190 -137441 129360 39249 -162006 81244
6324 2588 -53291 75665 -69561 -9451 150523 414926 11097 64600 63538 -106747 -116050 13869
6311 178672 178596 189870 -222307 215438 237456 -189242 -150953 81067 182302 -252223 131818
6299 -125592 114603 148741 -174706 282260 -202945 -225347 213929 -373800 -38441 206276
6288 229746 -291383 78387 -308062 -222824 212579 -56441 101451 -260230 90673 -257049
6277 -155152 2578 -151064 -36258 455608 -28830 -178418 -39439 115750 -311039 14941 -25922
6265 42316 -160574 17452 -304000 -902 38876 -135217 133644 18689 64622 232204 116383
6254 116383 148643 338992 302439 -43705 -179621 361146 -201278 -52026 127663 -37357 8175
6242 138847 -194269 68804 47634 -226456 -151465 13352 139650 39296 -137627 -66679 130996
6230 11019 149689 -7585 172773 -26827 193272 -21760 -167133 11261 312687 142269 207306
6219 207306 -18334 -134877 -312777 40846 3817 -395255 193628 -36357 48180 -152073 -19819
6207 -156733 225488 91140 -214423 -44833 279154 -38184 -7759 -29414 -256996 247444 -197557
6195 -161670 -115714 -122899 -25101 160365 61891 -102693 -145575 35822 -159211 -28533 88229
6183 -67529 133772 351146 -376115 509768 128089 -187741 -13330 -10302 268443 64666 -175167
6171 65366 29141 193137 136515 69782 -116668 262593 56219 -37887 -35871 156012 -148883
6159 275010 27178 191343 -165789 102081 -470 -22977 -99677 -93070 -246174 34530 -173926
6147 54733 -37847 -111635 126671 -190579 -545553 511351 -15761 237412 -4637 175275 280081
6136 280081 -133581 282024 -102416 -323756 27260 -20001 53375 -187594 282841 -139596
6125 81816 -108254 69640 -256110 -315428 -175949 -174360 -278591 14311 -6016 -66641 -47972
6114 -47972 26119 325084 96839 -128249 -115500 141805 -19885 -72208 114581 237291 140232
6103 140232 -84955 -78337 -161501 123802 307089 -193592 -61441 -11149 137359 -4446 -42307
6092 -42307 75849 33711 -211172 -57397 -90598 -198604 116489 -61308 -22592 220401 216654
6081 216654 177116 -143191 -89540 -297776 3991 -155301 -122082 -78764 297471 234413 389661
6070 389661 -126041 -108637 -139630 -106952 -31735 8073 227394 30780 -87048 -2194 -95940 -88624
6058 -88624 56739 157029 34647 5346 -44736 194015 257207 -147452 -50311 6516 119158
6047 119158 -116409 -38788 217773 -319199 115561 33332 -22052 -231548 -244145 -6517 -124398
6036 -124398 273225 118607 87871 -167516 -120024 -181022 41155 -179067 -252828 -141590 32480
6024 123881 231290 -138772 -24457 -43077 -79249 19190 -116997 252164 -91060 -177152 -221932
6013 -221932 -85647 187667 89990 -145476 -279373 -98790 -35920 319083 117939 161503 -168652
6001 2789 465786 149529 -126443 -293997 -256105 52542 -79979 -72681 -134684 -90420 -26633
5989 36581 151591 -301737 -166752 6106 247879 173234 -37363 -122628 -113094 -53114 -249654
5978 -249654 -97680 135304 65351 -107708 -99762 78708 204082 -168252 -151334 -314258 -12036
5966 -19944 348413 47566 -397075 -102588 112534 38363 -145646 119622 -256821 249245
5955 -169201 -235922 92737 287252 -247537 70712 -41708 131858 86935 17143 -220129 -304816
5944 -304816 -21023 -114989 -145571 -193903 268934 -198228 466580 -104252 -135644 -368827 75634
5932 -12953 153844 23164 -77166 -91326 -2924 8947 239430 -22705 117631 158232 235340 -20865
5919 181092 32563 -62262 287169 -291703 242224 -151631 194356 223786 30049 -91550 -339878
5908 -339878 36624 -116578 -176533 -249840 -87181 -85058 24814 -95903 202405 458535 -204355
5896 -28938 -134649 133528 -647060 90885 -308012 138750 276528 372889 242164 -131794
5885 -207702 -31470 9325 105512 -11177 251749 -184113 281647 -174118 -360781 -277571 326456
5873 7533 104616 -136193 -184372 -34825 34032 193773 98775 54204 154240 -126033 -49009
5861 -55947 -271612 79485 139003 14443 -192781 -379712 -378226 -22510 -100908 -96399 -105253 67263
5848 -339712 -196198 -35452 213078 -54660 132333 172386 -23380 -388579 77820 -40741 -58823
5837 -58823 239999 -119727 -198811 -102695 -65533 -218810 109846 181970 -255596 -8930 144987
5825 116975 40909 -287604 1452 134725 -306296 191812 -111535 241059 -59344 128332
5814 5957 -20844 -116291 100220 34161 -98119 -89885 -13362 83676 85715 185681 -260565 53099
5801 118551 -76932 -185608 153422 -6759 351059 46211 -223856 114190 -224981 213852
5790 126303 59417 32920 57853 134572 10009 -132689 -174031 2819 -40472 111718 -23409
5778 -121441 391800 75383 99173 -33684 -153533 -210714 110833 145210 10000 -215882 21507
5766 -138690 120793 -294078 -13666 18963 38687 2153 83509 -4291 106643 202577 -56765
5754 15869 219003 149297 177502 -75963 -162689 -96699 41189 -64036 72199 -428454 -76221
5742 -161102 144319 337251 23092 120626 -15121 -18547 148087 -163541 -293285 -31351 260630
5730 -32927 234642 -131583 -85800 -189352 -70338 232185 288443 71048 132408 -8523 -107162
5719 -107162 -246286 -146754 142990 66041 -179907 -68115 24592 -159115 -72582 -53243 143778
5707 -165737 -221949 -331338 260401 78956 -198231 -36298 80420 9545 41137 -114762 -77039
5696 -77039 167641 -262389 231270 -249252 61425 -68161 -3618 128459 259336 32315 -113707
5684 66134 219560 95109 -51964 -54108 50833 -58112 500526 -75039 265240 -233108 125648
5672 -145881 120220 -36549 -44233 -92929 95788 20303 203759 -87710 -167034 191486 -144079
5660 -130453 -207043 -92886 105114 230437 205629 -281794 -46449 507862 -56371 -163517 -218931
5649 -218931 124877 84808 -227481 -20069 -134050 102974 -163652 -202204 -106541 -81058 -189388
5638 -189388 21163 154270 54267 -65110 -180456 -129793 -175622 -336580 -184669 150059 5671
5626 -55902 35129 -291325 -177352 113013 -293425 9609 178555 166215 443338 -109594 72193
5614 -152617 -351744 94828 -138897 355200 -17749 -218416 -123825 152819 121608 64339 -240534
5602 17933 -258437 -254089 243958 121918 -210606 -123088 139101 181955 165411 -34135 -263659
5591 -263659 -148602 -23270 310954 315552 13655 -10226 109524 -122427 -161268 -70617 -410241
5580 -410241 146280 106888 -144080 115287 321981 -89369 -104674 122906 -175101 -105386
5570 -105386 207386 248624 213656 -3590 -73379 2726 246566 -43705 -87223 20240 297297
5559 297297 2239 -307261 -126584 -55632 -151446 41219 -1459 76334 46198 78031 -112713
5547 -81891 -277643 -443668 -187457 276884 -440055 -120869 52960 20818 -231133 -240393 248498
5535 477607 191901 201426 -80774 -22810 -189071 -164005 158132 -206375 -126766 127263 -140031
5523 -24515 -7776 -63731 -6493 -270363 -23159 82267 -212828 -19508 -146166 84044 -176067
5511 -78983 303562 279609 119378 171582 168865 323662 -290191 -12541 -106683 238770 -174679
5499 -30596 188989 98819 -53834 201819 -25321 2047 -28064 159640 66024 -112905 221660
5487 209173 1629 31880 -12860 -17108 35410 -237896 223716 194512 125318 -12199 91017 181314
5475 181314 70585 70412 -197315 -128570 235569 -127292 -15624 111269 -115246 -49116 -236981
5464 -236981 14469 -51285 -86215 -33738 -266216 210147 84420 -260776 4602 -143814 192049
5452 -195973 -112423 254085 -244185 113900 -110493 -190976 -244292 -10357 357897 -382623
5441 -103987 181036 74561 -4429 154539 -29202 124823 67550 188279 -266871 25337 -207186
5429 -86666 -401355 123356 -98264 25090 29417 -143217 -39212 -314522 32739 -144413 -124794
5418 -124794 208579 -14239 -311715 -93943 -41837 122179 -15606 -156290 143426 34994 212020
5407 212020 -150498 240463 -86635 -21351 -122595 -131004 -227049 -76200 221234 39525 -142254
5395 70306 56636 167609 164534 129272 -91188 91880 160149 -211766 305381 192252 -80892
5383 -220390 98810 22464 104794 12949 42316 222008 -12128 10389 -248114 -38431 -67113
5372 -67113 -175069 -134167 278884 90146 -61262 43925 -202195 123835 67925 147090 -290398
5360 26091 70983 -141406 -291807 87596 -177959 -101519 63248 127974 -24573 182660 244102
5349 244102 -189751 159403 74051 222160 -79554 -200050 128073 -68537 159635 67070
5338 -132986 -98341 80396 84435 -222591 -145401 -125845 94919 -57823 -484502 -43812 -36304 84400
5325 -278884 -103221 -36000 16948 -127284 33626 112237 -13049 -112834 -40196 -171038 -78619
5313 -214320 -17120 163450 -173332 191718 358441 -4826 -283614 123731 -9 79254 -158075
5301 211072 153748 9217 240265 254604 -108499 -128179 -48085 -154551 -1173 -96528 -159267
5290 -159267 218022 264247 344395 223178 -133896 55382 194807 216990 -43883 -314384 194900
5278 -167925 100174 66682 -221677 4457 -91478 -34147 -142933 -162149 -118238 336179 -376882
5266 -93918 -84911 -63794 68592 -49941 73231 -288637 -131961 -143972 -93710 -66523 235269
5254 -60827 101095 133474 -80907 7022 -367291 -220218 -7284 -29294 -228406 56923 77436
5243 77436 104075 342659 -34992 440959 -51127 -320970 51123 -106796 -243819 51253 -92549
5231 -152058 -443324 66013 170303 136794 -267674 -329444 313843 -275696 71558 -101838
5220 145198 -83166 146033 -102796 -285999 83731 -95093 -232268 150321 282828 -86048
5209 130301 91866 250312 103183 -107636 -181861 -104346 -106858 39538 -108134 5658 -59977
5197 90257 297835 -13021 -141350 52535 -77756 -29281 -131065 147146 428277 66982 -39270
5185 332493 -248272 140250 234512 34399 79555 -31916 56129 -117374 5259 154586 -167459
5173 -120515 156309 336268 -79273 121108 22247 -156257 -127485 102922 128184 337475
5163 337475 285057 253571 366976 -125394 113890 -50620 230255 184727 43968 934 -29265
5151 -313959 -8472 -53776 88896 -111903 73112 74103 255677 293682 209061 55450 -92537 55142
5138 -158399 -86815 -113515 -117178 -90816 155211 96752 -44631 -304538 -11238 -268535 -107729
5126 31923 -116289 -80828 17732 322869 1861 -225640 -380382 17877 443069 -239464 -88056
5114 -49389 -153093 -278492 -109487 186816 -210810 148842 117438 48086 97659 80918 453430
5103 453430 -150878 19225 83535 -125965 172696 64287 -245038 -154813 180742 194468 -340782
5091 -147631 256184 -264329 166114 -168541 -163385 -141290 427705 32005 -109401 -260071
5081 -260071 -98930 125130 -70898 -361330 117040 -297918 54936 264845 14065 28666 359167
5070 359167 232764 -88404 255179 -1276 35494 111489 -272648 -475827 389503 -76939 -172806
5059 -172806 244351 -178489 158614 276253 -83973 210281 24252 -344150 -48088 32660
5048 134183 61140 -178181 47812 -27468 78016 220114 -67577 -168805 130286 -391639 81794
5036 109757 33110 -163607 -139261 8611 -20685 -67095 -13409 48066 -142437 55146 306108
5025 306108 -4840 134819 85865 -149237 66487 -19444 -190676 87286 -50106 4709 521890
5014 521890 323827 125962 -65810 -43832 356882 -65342 -149258 -154907 -147545 -117200 -159594
5003 -159594 105268 -65241 -18864 198020 7457 49019 80265 -43603 -204015 -204150 51594 170136
4991 170136 236476 195984 -5990 -136400 227974 -315060 143364 -349182 120546 54006 -20340
4979 -165501 -96685 68784 -51626 21984 77563 -168585 -261175 -90919 -94226 26522 -22178 106680
4966 128532 -2681 153068 -151315 286860 -121334 -209189 144465 -215676 -24318 42130 -51084
4954 -306705 460586 -99996 -178401 -328460 -159567 62570 205610 245111 -222781 35613 26661
4943 26661 121643 132982 146760 -206805 -198314 -5146 36993 119651 -82580 5958 53231 130637
4931 130637 -214769 156704 181570 110348 -30400 144538 -49896 47446 262792 -106560 231732
4919 215777 343375 203082 17663 105487 93856 -204209 164729 105921 116900 -1374 -196137
4908 -196137 2824 12312 -29020 24050 23699 167528 260125 -80717 -380150 -192907 170576 -314320
4895 21298 -74413 -207557 153962 -77509 223817 -80748 160068 -11393 51974 -47264 187940
4883 184849 -70086 -302799 -53939 18070 -77608 200793 -12939 54377 231614 60475 175503
4872 175503 92585 -77194 169574 16682 -27453 232391 4292 68134 -269121 13674 92735
4861 92735 -325526 -182026 -39316 91685 73601 198657 336046 655 111383 188407 -117499
4849 222860 289384 -83631 -173159 -19955 -85510 100281 -196554 -91169 32693 -267949 -32740
4837 60830 112801 -15642 46128 188003 30035 17224 7182 241429 72826 37600 158875
4826 158875 198905 289384 67152 102979 -365679 122128 10489 -4070 116201 139053 336736
4815 336736 101730 -91450 -128384 88729 92899 -106379 -71279 73516 136415 -223071 -26426
4803 228544 -246242 83262 14873 -233066 -26627 155341 59511 -265896 298246 21560 252195
4792 252195 -64327 -118468 -106857 -22241 195710 530967 10294 -42858 -208701 -126768 -220650
4781 -220650 -86575 -225273 16967 132797 64241 -221231 113019 57182 46642 14255 92928
4770 92928 -69808 155737 -171210 45173 58106 69787 217608 -119448 -147136 -74853 -241740
4759 -241740 -217394 297033 104745 22185 -38435 -147130 -163303 -36913 311532 116580 49827
4747 -27343 -64516 79778 -73876 64312 -161861 -58915 -377525 -54656 150603 -265789 -6499
4735 -178075 47230 -47090 18146 -120525 200786 219987 -369204 -241267 -75470 87153 20909
4723 115875 -34898 317364 -144420 153725 141343 -135497 -30815 4176 -13248 53895 433930
4712 433930 432927 129598 92362 -98392 -217142 367520 -223150 -313538 185024 -209439 71096
4700 106450 59662 -289929 82520 -14813 -35722 142602 164362 270465 175051 -35658 -29777
4689 -29777 124852 -262123 119823 279293 280332 180749 194404 -79309 -187675 44459 -3764
4677 -6226 -167473 -45176 114566 -364245 -130314 128467 344256 -155778 -32773 223923
4666 141559 -292216 268165 284612 -187979 -252277 -180267 -89306 125093 169093 167036 -122502
4654 -5313 -166489 -198190 -376396 251453 138406 -180744 71861 -116369 -175235 -123947 -131049
4643 -131049 3169 -143668 284524 -89792 -150925 -211021 407332 -115378 254420 -45263 179601
4631 216833 176382 105422 39306 -2857 -107941 81854 215567 -24751 -245744 16728 -102963
4619 144818 88731 407352 195321 69809 -6803 34870 333080 -70094 502836 79749 206363
4608 206363 166694 -111480 104355 -293658 42701 -205484 102137 1725 -8603 41956 352195
4597 352195 472547 152479 88804 79556 175612 -21298 -64861 -166864 26500 132834 126807
4586 126807 41143 -156005 514 307279 -120969 -199392 30631 98769 -231864 134427 -52011
4574 -27087 -18731 -110798 33893 199324 -34197 -67629 168767 236466 -203654 101011 138882
4563 138882 -103679 -98578 58213 -182192 21679 -250390 -438670 -92770 -66160 323354 215230
4552 215230 190205 -175480 76439 -100943 -42275 58839 49503 -34274 19596 225436 -14690
4540 -322015 -93137 25494 -74539 174683 -5313 77403 240478 -98380 -93664 29269 -44620 52718
4527 81891 69222 -30037 -305790 134616 100008 31002 202557 60557 -200778 -282118 -116640
$$ [...]
##END NTUPLES=NMR SPECTRUM
##END=
