
##TITLE=UV1220_M5_1296-1170_90_7229556_2qQ6gD5V1T
##JCAMPDX= 6.0         $$ Bruker NMR JCAMP-DX V2.0
##DATA TYPE= NMR SPECTRUM
##DATA CLASS= NTUPLES
##ORIGIN= BRUKER
##OWNER= Administrator
$$ 1.72 TOPSPIN		Version 2.1
$$ 2013-01-24 05:03:36.457 -0500  Administrator@X
$$ Compression mode = diff/dup
##.OBSERVE FREQUENCY= 400.02188249412
##.OBSERVE NUCLEUS= ^1H
##.ACQUISITION MODE= SIMULTANEOUS (DQD)
##.ACQUISITION SCHEME= undefined
##.AVERAGES= 64
##.DIGITISER RES= 22
##SPECTROMETER/DATA SYSTEM= spect
##.PULSE SEQUENCE= noesygpps1d.comp
##.SOLVENT NAME= COFFEE_meoh
##.SHIFT REFERENCE= INTERNAL, COFFEE_meoh, 1, 14.96117
##AUDIT TRAIL= $$ (NUMBER, WHEN, WHO, WHERE, PROCESS, VERSION, WHAT)
$$ ##TITLE= Audit trail, TOPSPIN		Version 2.1
$$ ##JCAMPDX= 5.01
$$ ##ORIGIN= Bruker BioSpin GmbH
$$ ##OWNER= Administrator
$$ $$ E:\/data/COFFEE/nmr/UV1220_M5_1296-1170_90_7229556_2qQ6gD5V1T/32/pdata/1/auditp.txt
$$ ##AUDIT TRAIL=  $$ (NUMBER, WHEN, WHO, WHERE, PROCESS, VERSION, WHAT)
(   1,<2013-01-24 05:03:30.723 -0500>,<Administrator>,<X>,<go>,<TOPSPIN 2.1>,
      <created by zg
	started at 2013-01-24 04:51:59.395 -0500,
	POWCHK enabled, PULCHK disabled,
       configuration hash MD5:
       86 BA 57 50 F2 9D 5C 9B 26 00 A9 28 5F 66 2E 89
       data hash MD5: 64K
       F4 9A 84 D2 CE 07 64 8E 98 46 A7 8F 6D FF C7 FB>)
(   2,<2013-01-24 05:03:33.754 -0500>,<Administrator>,<X>,<proc1d>,<TOPSPIN 2.1>,
      <Start of raw data processing
       efp LB = 0.3 FT_mod = 6 PKNL = 1 PHC0 = 0 PHC1 = 0 SI = 128K 
       data hash MD5: 128K
       F1 86 88 F7 13 04 08 00 FE 0F F1 0B D8 F1 D0 BE>)
(   3,<2013-01-24 05:03:34.785 -0500>,<Administrator>,<X>,<proc1d>,<TOPSPIN 2.1>,
      <pk PHC0 = -77.96448 PHC1 = 0 
       data hash MD5: 128K
       84 11 58 E3 1A BB 18 CA 6A F2 B4 91 A1 59 6D D5>)
(   4,<2013-01-24 05:03:35.457 -0500>,<Administrator>,<X>,<proc1d>,<TOPSPIN 2.1>,
      <abs ABSG = 1 
       data hash MD5: 128K
       97 83 C6 75 1B 5B 48 4C 70 AC 23 69 AD FB 7C 6C>)
(   5,<2013-01-24 05:03:35.629 -0500>,<Administrator>,<X>,<proc1d>,<TOPSPIN 2.1>,
      <abs ABSG = 2 
       data hash MD5: 128K
       8F 84 67 01 47 6F BB 90 A5 A6 55 9E FE CF 7F 9E>)
(   6,<2013-01-24 05:03:35.785 -0500>,<Administrator>,<X>,<proc1d>,<TOPSPIN 2.1>,
      <abs ABSG = 3 
       data hash MD5: 128K
       C3 B7 77 0F 3F D4 E2 C4 89 74 69 2D 0D 27 E8 4A>)
(   7,<2013-01-24 05:03:35.942 -0500>,<Administrator>,<X>,<proc1d>,<TOPSPIN 2.1>,
      <abs ABSG = 4 
       data hash MD5: 128K
       F2 8E 82 D8 9A 24 2D 47 58 4B 6D 40 9C 41 63 60>)
(   8,<2013-01-24 05:03:36.129 -0500>,<Administrator>,<X>,<proc1d>,<TOPSPIN 2.1>,
      <abs ABSG = 5 
       data hash MD5: 128K
       7E 8F 1E CA C4 9B D6 16 88 F4 D9 86 0B 53 89 1B>)
$$ ##END=
$$ 
$$ $$ hash MD5
$$ $$ 24 FC 84 AA 4C 77 AF 0C 16 76 CB EA 0E 16 DF BE
##$RELAX= 
##$RELAX= 
##$RELAX= 
##$RELAX= 
##$RELAX= 
##$RELAX= 
##$RELAX= 
##$RELAX= 
$$ Bruker specific parameters
$$ --------------------------
##$DU= <E:\>
##$EXPNO= 32
$$ [...]
##$TP07= 0
##$TPNAME0= <>
##$TPNAME1= <>
##$TPNAME2= <>
##$TPNAME3= <>
##$TPNAME4= <>
##$TPNAME5= <>
##$TPNAME6= <>
##$TPNAME7= <>
##$TPOAL= (0..7)
0.5 0.5 0.5 0.5 0.5 0.5 0.5 0.5
##$TPOFFS= (0..7)
0 0 0 0 0 0 0 0
##$TUNHIN= 0
##$TUNHOUT= 0
##$TUNXOUT= 0
##$USERA1= <user>
##$USERA2= <user>
##$USERA3= <user>
##$USERA4= <user>
##$USERA5= <user>
##$V9= 5
##$VALIST= <valist>
##$VCLIST= <CCCCCCCCCCCCCCC>
##$VD= 0
##$VDLIST= <DDDDDDDDDDDDDDD>
##$VPLIST= <PPPPPPPPPPPPPPP>
##$VTLIST= <TTTTTTTTTTTTTTT>
##$WBST= 1024
##$WBSW= 4
##$XGAIN= (0..3)
0 0 0 0
##$XL= 0
##$YL= 0
##$YMAX_a= 6010700
##$YMIN_a= -11947784
##$ZGOPTNS= <>
##$ZL1= 120
##$ZL2= 120
##$ZL3= 120
##$ZL4= 120
##$ABSF1= 14.96117
##$ABSF2= -5.597012
##$ABSG= 5
##$ABSL= 3
##$ALPHA= 0
##$AQORDER= 0
##$ASSFAC= 0
##$ASSFACI= 0
##$ASSFACX= 0
##$ASSWID= 0
##$AUNMP= <proc_prof1d_extract.lims>
##$AXLEFT= 0
##$AXNAME= <>
##$AXNUC= <1H>
##$AXRIGHT= 0
##$AXTYPE= 0
##$AXUNIT= <>
##$AZFE= 0.1
##$AZFW= 0.1
##$BCFW= 0
##$BC_mod= 0
##$BYTORDP= 0
##$COROFFS= 0
##$CY= 15
##$DATMOD= 1
##$DC= 0
##$DFILT= <>
##$DTYPP= 0
##$F1P= 0
##$F2P= 0
##$FCOR= 0.5
##$FTSIZE= 131072
##$FT_mod= 6
##$GAMMA= 0
##$GB= 0
##$INTBC= 1
##$INTSCL= 1
##$ISEN= 128
##$LB= 0.3
##$LEV0= 0
##$LPBIN= 0
##$MAXI= 10000
##$MC2= 0
##$MEAN= 0
##$ME_mod= 0
##$MI= 0
##$NCOEF= 0
##$NC_proc= -2
##$NLEV= 6
##$NOISF1= 0
##$NOISF2= 0
##$NSP= 0
##$NTH_PI= 0
##$NZP= 0
##$OFFSET= 14.96117
##$PC= 1
##$PHC0= -77.96448
##$PHC1= 0
##$PH_mod= 1
##$PKNL= yes
##$PPARMOD= 0
##$PPDIAG= 0
##$PPIPTYP= 0
##$PPMPNUM= 2147483647
##$PPRESOL= 1
##$PSCAL= 4
##$PSIGN= 0
##$PYNMP= <proc.py>
##$REVERSE= no
##$SF= 400.020009570561
##$SI= 131072
##$SIGF1= 0
##$SIGF2= 0
##$SINO= 400
##$SIOLD= 131072
##$SPECTYP= <>
##$SREGLST= <1H.CDCl3>
##$SSB= 0
##$STSI= 131072
##$STSR= 0
##$SW_p= 8223.68421052631
##$SYMM= 0
##$S_DEV= 0
##$TDeff= 65536
##$TDoff= 0
##$TI= <>
##$TILT= no
##$TM1= 0
##$TM2= 0
##$TOPLEV= 0
##$USERP1= <user>
##$USERP2= <user>
##$USERP3= <user>
##$USERP4= <user>
##$USERP5= <user>
##$WDW= 1
##$XDIM= 131072
##$YMAX_p= 430173336
##$YMIN_p= -12936
##$CURPLOT= <Network HP LaserJet P1505>
##$CURPRIN= <$Network HP LaserJet P1505>
##$DFORMAT= <normdp>
##$LAYOUT= <+/1D_H.xwp>
##$LFORMAT= <normlp>
##$PFORMAT= <normpl>
##$SURQMSG= 1
$$ End of Bruker specific parameters
$$ ---------------------------------
##NTUPLES= NMR SPECTRUM
##VAR_NAME=  FREQUENCY,     SPECTRUM/REAL,   SPECTRUM/IMAG
##SYMBOL=    X,             R,               I
##VAR_TYPE=  INDEPENDENT,   DEPENDENT,       DEPENDENT
##VAR_FORM=  AFFN,          ASDF,            ASDF
##VAR_DIM=   131072,        131072,          131072
##UNITS=     HZ,            ARBITRARY UNITS, ARBITRARY UNITS
##FACTOR=    0.0627417313425164, 1,          1
##FIRST=     8223.62146879497, -6278,        -47470
##LAST=      0,             -4584,           -49135
##MIN=       0,             -12936,          0
##MAX=       8223.62146879497, 430173336,    0
$$ Real data points
##PAGE= N=1
##DATA TABLE= (X++(R..R)), XYDATA
$$ [...]
63875D57120p388o198n358n325n276m228k529j136p3J252K781M025N155O700Q473
$$ 457120 449732 443534 438176 432851 427575 423347 420818 419682 419609 420861 423642 427667 432822 439522 447995
63860D47995R894J1127J2877J5137J7198J8858K0680K2902K5035K6727K8267K9890
$$ 447995 457889 469016 481893 497030 514228 533086 553766 576668 601703 628430 656697 686587
63848F86587L1269L2091L2687L3581L4633L5012L4123L2252L0141K8014K5365
$$ 686587 717856 749947 782634 816215 850848 885860 919983 952235 982376 1010390 1035755
63837A035755K1760J7478J3080Q610L754j445o591j1523j6282k0649k4293k7363
$$ 1035755 1057515 1074993 1088073 1096683 1100437 1098992 1092401 1080878 1064596 1043947 1019654 992291
63825I92291l0163l2366l3303l3049l2441l1976l1542l1262l1579l2273l2413
$$ 992291 962128 929762 896459 863410 830969 798993 767451 736189 704610 672337 639924
63814F39924l1624l0506k9432k7926k5644k3037k0506j7887j5282j3528j3008
$$ 639924 608300 577794 548362 520436 494792 471755 451249 433362 418080 404552 391544
63803C91544j2856j2015j0467q813p297o036n462n772o346o433o016n530n214
$$ 391544 378688 366673 356206 347393 340096 334060 328598 322826 316480 310047 304031 298501 293287
63790B93287n135n385n720n572m822m007l473k926k183j611j416j302j207j492
$$ 293287 288152 282767 277047 271475 266653 262646 259173 256247 254064 252453 251037 249735 248528 247036
63776B47036j988j871j063p04j444k347k328j765j622j796j510p00M9N13Q17Q29
$$ 247036 245048 243177 242114 241410 239966 237619 235291 233526 231904 230108 228598 227898 227947 228460 229277 230106
63760B30106M69J59K28K84p0m62l99j17l4L3L39N21K61l6m0j88p47r50j74Q03
$$ 230106 230575 230734 230962 231246 231176 230714 230315 230198 230164 230197 230536 231057 231318 231282 231242 231054 230307 229357 229183 229986
63740B29986R54O69J013J833K075J639J431J718J791J299Q11Q89J522K458L284
$$ 229986 230940 231609 232622 234455 236530 238169 239600 241318 243109 244408 245219 246108 247630 250088 253372
63725B53372L412K788K412L184M553N306N372N660O307O376N413M091L111K396
$$ 253372 256784 259572 261984 265168 269721 275027 280399 286059 292366 298742 304155 308246 311357 313753
63711C13753J636P74k53j502k615l143l245l399l443k765j477m86k95m93o19o96
$$ 313753 315389 316163 315910 314408 311793 308650 305405 302006 298563 295798 294321 293835 293540 293047 292428 291732
63695B91732p62n65m5M59P22R52J468K326L240L648L062J679L55m03r61j656j945
$$ 291732 290970 290405 290360 290819 291541 292493 293961 296287 299527 303175 306237 307916 308271 307868 306907 305251 303306
63678C03306j243m8O65Q52J270K176L077L629L949M053L799L371L150L182L292
$$ 303306 302063 302015 302680 303532 304802 306978 310055 313684 317633 321686 325485 328856 332006 335188 338480
63663C38480L503L692L282K004N89j38m44j144k259l191l880m615n081m808m389
$$ 338480 341983 345675 348957 350961 351550 351412 350968 349824 347565 344374 340494 335879 330798 325990 321601
63648C21601m842n798n661l934k068j552k108k321j348M35J962K393J935J736
$$ 321601 316759 310961 305300 301366 299298 297746 295638 293317 291969 292404 294366 296759 298694 300430
63634C00430K548L689M038L691L748M661N838O791P579Q069P929P519P702Q574
$$ 300430 302978 306667 310705 314396 318144 322805 328643 335434 343013 351082 359011 366530 374232 382806
63620C82806R360R769J0412J1600J2843J3981J5736J8525K1604K4025K5839K7690
$$ 382806 392166 401935 412347 423947 436790 450771 466507 485032 506636 530661 556500 584190
63608E84190K9757L1757L3588L5442L7364L8992L9572L8187L4268K7949J9875
$$ 584190 613947 645704 679292 714734 752098 791090 830662 868849 903117 931066 950941
63597I50941J0891K196m782r249j1663j2907j3329j3138j3183j4303j6266j8346
$$ 950941 961832 964028 959246 949997 938334 925427 912098 898960 885777 871474 855208 836862
63585H36862k0585k3320k5832k6812k6188k5164k4397k3366k1672j9623j7338
$$ 836862 816277 792957 767125 740313 714125 688961 664564 641198 619526 599903 582565
63574E82565j4528j1509r166p573n789l417j178M61J969L570M635M878M997N449
$$ 582565 568037 556528 547362 539789 534000 530583 529405 529866 531835 535405 540040 544918 549915 555364
63560E55364N720N568N853P171Q628R046Q684Q826J0235J2825J6309K0286K4192
$$ 555364 561084 566652 572505 579676 588304 597350 606034 614860 625095 637920 654229 674515 698707
63547F98707K7879L1843L6332M0793M4831M8874N2815N4427N0378L9136K2575
$$ 698707 726586 758429 794761 835554 880385 929259 982074 1036501 1086879 1126015 1148590
63536A148590M870r924j9680k4544k5850k4704k1789j8216j5570j4733j5264j6453
$$ 1148590 1153460 1143536 1123856 1099312 1073462 1048758 1026969 1008753 993183 978450 963186 946733
63524I46733j8384k1428k5284k9109l2268l4411l5259l4791l3356l1214k8284
$$ 946733 928349 906921 881637 852528 820260 785849 750590 715799 682443 651229 622945
63513F22945k4810k1698j9664j8333j6820j4965j3380j2450j1779j0715r097p382
$$ 622945 598135 576437 556773 538440 521620 506655 493275 480825 469046 458331 449234 441852
63501D41852o163n620n424n253n191n390n583n352m705l929l043k020j333j485
$$ 441852 435689 430069 424645 419392 414201 408811 403228 397876 393171 389242 386199 384179 382846 381361
63487C81361k005j873r57j51J01M81J569K859L543L572L384L222L182L400L720
$$ 381361 379356 377483 376526 376375 376476 376957 378526 381385 384928 388500 391884 395106 398288 401688 405408
63472D05408L630K882J795P00l86j332j853k180k985m299n209n092m450m041l851
$$ 405408 409038 411920 413715 414415 414029 412697 410844 408664 405679 401380 396171 391079 386629 382588 378737
63457C78737l498k971k413j689q40l80n71q13l42P98K005K912L545M033M711O010
$$ 378737 375239 372268 369855 368166 367326 366946 366375 365562 365220 366018 368023 370935 374480 378513 383224 389234
63441C89234P893R671J0861J1717J2607J3448J4283J5909J9211K4187L0098L6189
$$ 389234 397127 406798 417659 429376 441983 455431 469714 485623 504834 529021 559119 595308
63429E95308M1573M4680M3663L7790K8321J8021R685M744K954L426N758R950J5607
$$ 595308 636881 681561 725224 763014 791335 809356 819041 823785 826739 830165 835923 845873 861480
63416H61480K1942K8481L4960M0540M4001M4830M3360L9590L2908K3344J2346
$$ 861480 883422 911903 946863 987403 1031404 1076234 1119594 1159184 1192092 1215436 1227782
63405A227782J795p137j3907j8275k0534k1416k1389k0697k0214k1293k4252k7893
$$ 1227782 1229577 1222440 1208533 1190258 1169724 1148308 1126919 1106222 1086008 1064715 1040463 1012570
63393A012570l1051l3720l6154l7861l8225l7365l5629l2969k9475k5887k2834
$$ 1012570 981519 947799 911645 873784 835559 798194 762565 729596 700121 674234 651400
63382F51400k0215j7834j5881j4143j1746q432n263l175j684K2J631K497L168
$$ 651400 631185 613351 597470 583327 571581 563149 557886 554711 553027 553049 554680 557177 560345
63369E60345M729P124R364J1126J2953J5049J7001J8664K0413K2507K4890K7552
$$ 560345 565074 572198 581562 592688 605641 620690 637691 656355 676768 699275 724165 751717
63357G51717L0448L3213L5603L7920M0444M2698M3878M3607M1661L7451L0605
$$ 751717 782165 815378 850981 888901 929345 972043 1015921 1059528 1101189 1138640 1169245
63346A169245K1716J1895K071o669j2899j6174j7936j9892k1866k2567k2093k2203
$$ 1169245 1190961 1202856 1204927 1198258 1185359 1169185 1151249 1131357 1109491 1086924 1064831 1042628
63334A042628k3998k6771k9426l1744l3800l5200l5608l5209l4212l2430k9881
$$ 1042628 1018630 991859 962433 930689 896889 861689 826081 790872 756660 724230 694349
63323F94349k7087k4317k1028j6704j1862p515l712N02N160P889N485k546j2591
$$ 694349 667262 642945 621917 605213 593351 585836 582124 582626 587786 595675 601160 598614 586023
63310E86023j9932k2826k2887k1927k0079j7210j4378j2688j1741j0522r045q003
$$ 586023 566091 543265 520378 498451 478372 461162 446784 434096 422355 411833 402788 394785
63298C94785p353o516n536m945m711m396m149m443m987m870l884k779k252k371
$$ 394785 387432 380916 375380 370435 365724 361328 357179 352736 347749 342879 338995 336216 333964 331593
63284C31593k906l469l524k953k413k404k337j441j57M20K68L40Q39Q82P9p80
$$ 331593 328687 325218 321694 318741 316328 313924 311587 310146 309989 310409 310677 311017 311856 312738 312817 312037
63268C12037r52o45l24l1J56j33q40j241r10l56k00k57O1P67J240R90J84n29o29
$$ 312037 311085 310440 310116 310085 310241 310108 309268 308027 307117 306761 306561 306304 306365 307132 308372 309362 309546 309017 308388
63249C08388k43K7q2j28L09Q97J058Q83Q75J049J049J066J666K669L063K417J580
$$ 308388 308145 308172 308090 307962 308271 309168 310226 311109 311984 313033 314082 315148 316814 319483 322546 324963 326543
63232C26543J593K416L239L608L690L686L560L363L462M065M763M835M170L521
$$ 326543 328136 330552 333791 337399 341089 344775 348335 351698 355160 359225 363988 368823 372993 376514
63218C76514L502L700L405K979L540N169O497O502N737N193M880M340L738L406
$$ 376514 380016 383716 387121 390100 393640 398809 405306 411808 417545 422738 427618 431958 435696 439102
63204D39102K954J946R18O44P87M26l52n99j30J62k71r07j024m45P24K341M004
$$ 439102 442056 444002 444920 445564 446351 446777 446425 445826 445696 445858 445587 444680 443656 443211 443935 446276 450280
63187D50280N278O239P346Q777J0376J2017J3463J4187J4052J3814J4227J4902
$$ 450280 455558 461797 469143 477920 488296 500313 513776 527963 542015 555829 570056 584958
63175E84958J4919J4190J3321J2461J1389J0483J0412J0869J0841J0025Q963P755
$$ 584958 599877 614067 627388 639849 651238 661721 672133 683002 693843 703868 712831 720586
63163G20586N921L633J728K53j847n062q487j1140j3163j5190j7297j9144k0465
$$ 720586 726507 730140 731868 732121 730274 725212 716725 705585 692422 677232 659935 640791 620326
63150F20326k0966k0387j9013j7557j6274j4773j2863j0952r394q136p115o337
$$ 620326 599360 578973 559960 542403 526129 511356 498493 487541 478147 470011 462896 456559
63138D56559n457m120k761k190k243j858p02L24N36M08N92R81J330J929K973M031
$$ 456559 451102 446982 444221 442031 439788 437930 437228 437552 438088 438496 439088 440069 441399 443328 446301 450332
63122D50332M730N366O209O878O933O628O487O610O765O720O229N279M524M775
$$ 450332 455062 460428 466637 473515 480448 487076 493563 500173 506938 513658 519887 525166 529690 534465
63108E34465N690N933N013M100M321N077M972L712K317J730K075K997L982M551
$$ 534465 540155 546088 551101 555201 559522 564599 569571 573283 575600 577330 579405 582402 586384 590935
63094E90935M569M347M125L868L814M605O332P956Q382P760P109O829O301M850
$$ 590935 595504 599851 603976 607844 611658 616263 622595 630551 638933 646693 653802 660631 666932 671782
63080F71782K586J59j904l551n026o427p483p915p904p942q221q554q786q855
$$ 671782 674368 674527 672623 669072 664046 657619 650136 642221 634317 626375 618154 609600 600814 591959
63066E91959q483p436o145n405n208m579k842n50J255K130K360K437K827L812
$$ 591959 583476 576040 569895 564490 559282 554703 551861 551311 552566 554696 557056 559493 562320 566132
63052E66132N231O652P895R020R802R936R802J0257J1352J2094J1899J1493J1793
$$ 566132 571363 578015 585910 594930 604732 614668 624470 634727 646079 658173 670072 681565 693358
63039F93358J2632J3170J3012J2236J0897R299Q303Q536R549J0365J0592J0324
$$ 693358 705990 719160 732172 744408 755305 764604 772907 781443 790992 801357 811949 822273
63027H22273R332P243M450J982K65j308l354n700p835r678j1402j2754j3118j2321
$$ 822273 831605 838848 843298 845280 845545 844237 840883 835183 827348 817670 806268 793514 780396 768075
63013G68075j1021j0060r589r063p975o248l927j056J987M570O674R160J2572
$$ 768075 757054 746994 737405 728342 720367 714119 710192 709136 711123 715693 722367 731527 744099
63000G44099J6061J8276J9115J9770K1089K2694K3834K4246K4008K3218K2207
$$ 744099 760160 778436 797551 817321 838410 861104 884938 909184 933192 956410 978617
62989I78617K1478K1183K0998K0686K0267J9582J8239J6257J4160J2257J0225
$$ 978617 1000095 1021278 1042276 1062962 1083229 1102811 1121050 1137307 1151467 1163724 1173949
62978A173949P625M355L85m382r808j5420k0754k5492k9303l2031l3968l5361
$$ 1173949 1181574 1185929 1186314 1181932 1172124 1156704 1135950 1110458 1081155 1049124 1015156 979795
62966I79795l5742l4499l2133l0086k9072k8356k6959k4797k2371k0078j8295
$$ 979795 944053 909554 877421 847335 818263 789907 762948 738151 715780 695702 677407
62955F77407j7400j7209j6853j5788j4530j3976j4297j4817j4733j3754j2314
$$ 677407 660007 642798 625945 610157 595627 581651 567354 552537 537804 524050 511736
62944E11736j1241j0940j0919j0451r554q770q192p450o528n857n487n030m438
$$ 511736 500495 489555 478636 468185 458631 449861 441669 434219 427691 421834 416347 411317 406879
62931D06879m054l888l598l238l118k968k282j509j701k818l573l254k501j923
$$ 406879 402825 398937 395339 392101 388983 386015 383733 382224 380523 377705 374132 370878 368377 366454
62917C66454j288n85n67j462k272k164j570j117n28N01J309J244Q15R09J405J581
$$ 366454 365166 364581 364014 362552 360280 358116 356546 355429 354901 355402 356711 357955 358770 359679 361084 362665
62901C62665J331J130J240J703K688M068N160N527N620O025O588O892O965P017
$$ 362665 363996 365126 366366 368069 370757 374825 379985 385512 391132 397157 403745 410637 417602 424619
62887D24619O997O911O966O956O273M993M027L616K727O82j564k784l154l602
$$ 424619 431616 438527 445493 452449 458722 463715 467742 471358 474085 474767 473203 470419 467265 463663
62873D63663m290m827n284n894o320o305o374o938p356o954o309o297o551o093
$$ 463663 459373 454546 449262 443368 437048 430743 424369 417431 410075 403121 396812 390515 383964 377871
62859C77871n065m423m301l933l017j992j153n85o46j401j873j138J11L62n04
$$ 377871 372806 368383 364082 360149 357132 355140 353987 353402 352756 351355 349482 348344 348455 348817 348313
62844C48313j194j076q73j065j063m02L74O38N93P09R34R53P18L62kk16j58RL5
$$ 348313 347119 346043 345170 344105 343042 342640 343014 343652 344245 344954 345888 346841 347559 347921 347919 347703 347545 347554 347589
62825C47589NJ62M30O01P82J177J524J405R37O15N55N01M16M60M93K97J30M16
$$ 347589 347594 347756 348186 348787 349569 350746 352270 353675 354612 355227 355782 356283 356699 357159 357652 357949 358079 358495
62807C58495R53J116P90M42K75Lm69p37m22M22J465K362K827K781K362J680P59
$$ 358495 359448 360564 361354 361796 362071 362074 361605 360868 360446 360868 362333 364695 367522 370303 372665 374345 375104
62790C75104j09m10p2L79O43J042J758K408K921L993N908P687Q380Q488R055J0046
$$ 375104 374995 374585 374513 374892 375535 376577 378335 380743 383664 387657 393565 401252 409632 418120 427175 437221
62774D37221J0803J1503J2690J3704J3212J1359R914R960J0582J0356R048P359
$$ 437221 448024 459527 472217 485921 499133 510492 520406 530366 540948 551304 560352 567711
62762E67711N772M186K221m26l536o244p812q511r173j0018j0634j0990j1594
$$ 567711 573483 577669 579890 579464 575928 569684 561872 553361 544188 534170 523536 512546 500952
62749E00952j2477j2891j2323j1226j0398j0083r891r311q159o767n728n298n127
$$ 500952 488475 475584 463261 452035 441637 431554 421663 412352 404193 397426 391698 386400 381273
62736C81273m785m181l348k235j166q56j496k244k285j840j554j439j146p20k47
$$ 381273 376488 372307 368959 366724 365558 364702 363206 360962 358677 356837 355283 353844 352698 351978 351731
62721C51731O45K074L195L216K628K406K533K456K496L508N360P074Q306R494
$$ 351731 352376 354450 357645 360861 363489 365895 368428 370884 373380 376888 382248 389322 397628 407122
62707D07122J0676J1386J1739J2422J3651J5138J6943J9215K1373K2770K4024
$$ 407122 417798 429184 440923 453345 466996 482134 499077 518292 539665 562435 586459
62696E86459K6237K9097L1272L2730L4861L8128M1262M3296M4703M5780M5463
$$ 586459 612696 641793 673065 705795 740656 778784 820046 863342 908045 953825 999288
62685I99288M2778L8262L3014K7258K0796J3881O760r07r221j7320k4270l0119
$$ 999288 1042066 1080328 1113342 1140600 1161396 1175277 1182037 1181130 1171909 1154589 1130319 1100200
62673A100200l5388l9993m3388m5262m5579m4458m2472m0574l9066l7197l4323
$$ 1100200 1064812 1024819 981431 936169 890590 846132 803660 763086 724020 686823 652500
62662F52500l0966k8142k6026k3939k1407j8697j6354j4633j3282j1833j0158
$$ 652500 621534 593392 567366 543427 522020 503323 486969 472336 459054 447221 437063
62651D37063q710p938p604p169o686o648o976o914o083m956m057l354k704k273
$$ 437063 428353 420415 412811 405642 398956 392308 385332 378418 372335 367379 363322 359968 357264 354991
62637C54991k187k184j936j390o93j12Rl71p59p45p03j254k234k864k840k490
$$ 354991 352804 350620 348684 347294 346601 346489 346498 346127 345368 344623 343920 342666 340432 337568 334728 332238
62621C32238k048j544j266j405j403o75J51j37j361j935j040L50J001Q63M88J07
$$ 332238 330190 328646 327380 325975 324572 323897 324048 323911 322550 320615 319575 319925 320926 321789 322277 322384
62605C22384j13J74Q10R96L63m47p51o30l23L81J584K770L462L825M241M771N366
$$ 322384 322271 322445 323255 324251 324614 324167 323416 322786 322463 322844 324428 327198 330660 334485 338726 343497 348863
62588C48863O069O685O846O651O601O700O305N109L538J965L82r56j508j508k013
$$ 348863 354932 361617 368463 375114 381715 388415 394720 399829 403367 405332 405714 404758 403250 401742 399729
62573C99729l400m667m864m444m481n226o092o521o336n641m910m686m865m765
$$ 399729 396329 391662 386798 382354 377873 372647 366555 360034 353698 348057 343147 338461 333596 328831
62559C28831m106l287k500j415j01P06P30P05J132J343N79o69j299j061o28m65
$$ 328831 324725 321438 318938 317523 317422 318128 318858 319563 320695 322038 322617 321948 320649 319588 318960 318495
62543C18495l16K61J294K329K730K312J673J532J789J806J487J366J546J481R95
$$ 318495 318179 318440 319734 322063 324793 327105 328778 330310 332099 333905 335392 336758 338304 339785 340780
62528C40780O50Q19J293K029L346M982N980O076O216P185Q465R176R359R723J0724
$$ 340780 341430 342249 343542 345571 348917 353899 359879 365955 372171 379356 387821 396997 406356 416079 426803
62513D26803J2505J5050J7891K0215K1769K3102K4550K5676K6125K6240K6345
$$ 426803 439308 454358 472249 492464 514233 537335 561885 587561 613686 639926 666271
62502F66271K6133K5264K3812K1678J8412J4121R747N866K021k076n524p244p381
$$ 666271 692404 717668 741480 763158 781570 795691 805438 811304 813325 811249 805725 798481 791100
62489G91100o889o233n219l680j674P12L284N745Q072J0506J3034J5421J7663
$$ 791100 784211 777978 772759 769079 767405 768117 771401 777146 785218 795724 808758 824179 841842
62476H41842J9627K0216J8016J3119P293K072k374o407j0321j4794k0494k6470
$$ 841842 861469 881685 899701 912820 920113 922185 919811 913404 903083 888289 867795 841325
62464H41325l0510l1874l2308l3481l4805l4906l3833l2372l0344k7156k3333
$$ 841325 810815 778941 746633 713152 678347 643441 609608 577236 546892 519736 496403
62453D96403j9975j7305j4934j2995j1757j0657q901o671m737l326k325j965k288
$$ 496403 476428 459123 444189 431194 419437 408780 399879 393208 388471 385145 382820 380855 378567
62440C78567k450j646k97O07R13J119J327J297J096Q39K72o11j132q96n17o36
$$ 378567 376117 374471 374174 374781 375694 376813 378140 379437 380533 381372 381644 381033 379901 379005 378488 377852
62424C77852r51j075j420k259k810k452j895k004k294j929j354j397j535p50M37
$$ 377852 376901 375826 374406 372147 369337 366885 364990 362986 360692 358763 357409 356012 354477 353727 354164
62409C54164N57n07j405j418j041n69K83J193J201K11o38m46N13J549K344K799
$$ 354164 354721 354214 352809 351391 350350 349781 350064 351257 352458 352669 352031 351585 352098 353647 355991 358790
62393C58790K909K943L176L472L654M027M842N628N804N583N520N584N546N820
$$ 358790 361699 364642 367818 371290 374944 378971 383813 389441 395245 400828 406348 411932 417478 423298
62379D23298O925Q416R337R519R539R727R994J0336J0716J0848J0801J1271J2454
$$ 423298 430223 438639 447976 457495 467034 476761 486755 497091 507807 518655 529456 540727 553181
62366E53181J3481J3873J4695J7066K0437K3669K7021L1436L6615M1504M6186
$$ 553181 566662 580535 595230 612296 632733 656402 683423 714859 751474 792978 839164
62355H39164N1537N7306O2296O6182O9370P1136O9775O4679N6745M6730L4878
$$ 839164 890701 948007 1010303 1076485 1145855 1216991 1286766 1351445 1408190 1454920 1489798
62344A489798K2264J0661P55q102j6136k2750k8076l3304l8898m3853m7188m8976
$$ 1489798 1512062 1522723 1523478 1515376 1499240 1476490 1448414 1415110 1376212 1332359 1285171 1236195
62332A236195m9482m8583m6443m3730m0814l7740l5013l3215l1843k9763k6983
$$ 1236195 1186713 1138130 1091687 1047957 1007143 969403 934390 901175 869332 839569 812586
62321H12586k4651k3281k2384k1855k2035k2308k1423j9544j8225j7886j7189
$$ 812586 787935 764654 742270 720415 698380 676072 654649 635105 616880 598994 581805
62310E81805j5459j3814j2995j2035j0208q555q089p969o981n507m513l634k002
$$ 581805 566346 552532 539537 527502 517294 508739 500650 492681 485700 480193 475680 472046 470044
62297D70044j24O95L78O9L62Q63J329K040K987L662L772L518L249L240L621M044
$$ 470044 469920 470615 470993 471062 471424 472287 473616 475656 478643 482305 486077 489595 492844 496084 499705 503749
62281E03749L734K444J084P85J559K436K705K539K474K749L234L778M514N770
$$ 503749 507483 509927 511011 511796 513355 515791 518496 521035 523509 526258 529492 533270 537784 543554
62267E43554P602R645J1664J3981J6849J9787K2226K4611K8007L2699L8088M3923
$$ 543554 551156 560801 572465 586446 603295 623082 645308 669919 697926 730625 768713 812636
62255H12636N0501N7496O3737O8477P1922P4022P3704O9929O2787N3037M1236
$$ 812636 863137 920633 984370 1052847 1124769 1198791 1272495 1342424 1405211 1458248 1499484
62244A499484K7945J4205J267r900j8815k5824l2276l9433m6939n3182n7337o0008
$$ 1499484 1527429 1541634 1542901 1533001 1514186 1488362 1456086 1416653 1369714 1316532 1259195 1199187
62232A199187o1588o1320n8770n5041n1519m8131m3980l9025l4106k9696k5678
$$ 1199187 1137599 1076279 1017509 962468 910949 862818 818838 779813 745707 716011 690333
62221F90333k2183j9642j7935j6246j3964j1309r000p605p181p264p190o605n699
$$ 690333 668150 648508 630573 614327 600363 589054 580054 572449 565268 558004 550814 544209 538510
62208E38510m876m340l993l626l189k940l118l334k689q59J262K547K878K814
$$ 538510 533634 529294 525301 521675 518486 515546 512428 509094 506405 505546 506808 509355 512233 515047
62194E15047K514J883J469K067L525M926O016P389R091J0232J0312R976J0006
$$ 515047 517561 519444 520913 522980 526505 531431 537447 544836 553927 564159 574471 584447 594453
62181E94453J0309J0405J0189R811R350Q884Q441P761O698N820O002P428R751
$$ 594453 604762 615167 625356 635167 644517 653401 661842 669603 676301 682121 688123 695551 705302
62168G05302J3020J7478K2631K7614L2618L8620M5427N1263N4662N5694N4845
$$ 705302 718322 735800 758431 786045 818663 857283 902710 953973 1008635 1064329 1119174
62157A119174N1872M6408L8715K9310J8709Q063r99p789j3152j8163k3120k8076
$$ 1119174 1171046 1217454 1256169 1285479 1304188 1312251 1311252 1303463 1290311 1272148 1249028 1220952
62145A220952l3238l8214m1860m3585m3926m3313m1259l7544l3194k9393k6162
$$ 1220952 1187714 1149500 1107640 1064055 1020129 976816 935557 898013 864819 835426 809264
62134H09264k2839j9214j5488j1788q367n670l662j822j45P39R58J729L534N079
$$ 809264 786425 767211 751723 739935 731568 725898 722236 720414 720269 721008 721966 723695 727229 732308
62120G32308N110M290M130M814N362N386N425N752O018O051O157O536P048P616
$$ 732308 737418 741708 745838 750652 756014 761400 766825 772577 778595 784646 790803 797339 804387 812003
62106H12003Q441R753J1468J2891J2781J0213N593L87m091p071p737n480j110
$$ 812003 820444 830197 841665 854556 867337 877550 883143 883530 879439 872368 864631 859151 858041
62093H58041L245N802N949L442j723p987j2342j2932j0786q109n787l400o25K474
$$ 858041 861286 867088 873037 876479 874756 866769 854427 841495 830709 822600 816813 813413 812788 815262
62079H15262N942R637J2923J5436J7622J9847K1727K2977K4116K5540K6741K7341
$$ 815262 821204 830841 843764 859200 876822 896669 918396 941373 965489 991029 1017770 1045111
62067A045111K8022K9510L1347L2719L3823L5461L7742M0001M1419M1017L7905
$$ 1045111 1073133 1102643 1133990 1166709 1200532 1235993 1273735 1313736 1355155 1396172 1434077
62056A434077L2359K5835J9114J1453K548n865j1839j5734j9398k3570k7688l1648
$$ 1434077 1466436 1492271 1511385 1522838 1525386 1519521 1507682 1491948 1472550 1448980 1421292 1389644
62044A389644l5938m0181m3248m4848m5546m5320m3519m0455l7610l5853l4481
$$ 1389644 1353706 1313525 1270277 1225429 1179883 1134563 1091044 1050589 1012979 977126 942645
62033I42645l2489k9832k7062k4462k1987j9579j7241j5122j3474j2283j1118
$$ 942645 910156 880324 853262 828800 806813 787234 769993 754871 741397 729114 717996
62022G17996r661q156o973o107n488n283n466n668n867o517p452p618o687n872
$$ 717996 708335 700179 693206 687099 681611 676328 670862 665194 659327 652810 645358 637740 631053 625181
62008F25181o085o235m785k254n84l75l39O06K168L635M619M733L782K468J854
$$ 625181 619096 612861 608076 605822 605238 604863 604524 605130 607298 610933 615552 620285 624067 626535 628389
61993F28389J958J767P60o72k271m198o108p092p014o947p790r174j0196j0570
$$ 628389 630347 632114 632874 632202 629931 625733 619625 612533 605519 598572 590782 581608 571412 560842
61979E60842j0591j0450j0041r204p980o758o036n776n267m060k715k074k098
$$ 560842 550251 539801 529760 520556 512576 505818 499782 494006 488739 484679 481964 479890 477792
61966D77792k127j968j933j949j606j020q18j104j201o45K39R19J293J567J942
$$ 477792 475665 473697 471764 469815 468209 467189 466371 465267 464066 463421 463660 464579 465872 467439 469381
61951D69381K560L411M258M946N680O699P843Q854R944J1524J3552J5536J7144
$$ 469381 471941 475352 479610 484556 490236 496935 504778 513632 523576 535100 548652 564188 581332
61938E81332J8479J9884K1660K3702K5190K5196K3951K2904K2970K3272K2277
$$ 581332 599811 619695 641355 665057 690247 715443 739394 762298 785268 808540 830817
61927H30817J9713J6651J4027J1815R402O197K152j946n058p204r544j2623j5292
$$ 830817 850530 867181 881208 893023 902425 908622 910774 908828 903770 896566 887022 874399 859107
61914H59107j6107j5049j3031j0390o963l025R69N240J0089J4809J8244K0216
$$ 859107 843000 827951 814920 804530 797567 794542 795511 800751 810840 825649 843893 864109
61902H64109K1316K1428J9660J5695J0333M572r72n866r898j3391j6757j9779
$$ 864109 885425 906853 926513 942208 952541 957113 956141 950275 940377 926986 910229 890450
61890H90450k1856k2830k2974k2465k1448k0292j9178j7838j6277j5157j4784
$$ 890450 868594 845764 822790 800325 778877 758585 739407 721569 705292 690135 675351
61879F75351j4377j3240j2035j1832j2498j3068j3186j2994j2156j0269p904n946
$$ 675351 660974 647734 635699 623867 611369 598301 585115 572121 559965 549696 541792 535846
61867E35846m236k075K89J987L108M501O192P350P839Q453R686J1459J4015J7714
$$ 535846 531610 529535 529824 531811 534919 539420 545612 552962 560801 569254 578940 590399 604414 622128
61853F22128K1877K5126K7069K8578L0383L2545L5272L8781M2232M4063M3741
$$ 622128 644005 669131 696200 724778 755161 787706 822978 861759 903991 948054 991795
61842I91795M2046L9554L5967L1190K5719J9566J2047L100o070j4012j9845k2970
$$ 991795 1033841 1073395 1109362 1140552 1166271 1185837 1197884 1200984 1194914 1180902 1161057 1138087
61830A138087k3064k0763j7376j3523q758k751L905J0169J5181J8403J9935K0481
$$ 1138087 1115023 1094260 1076884 1063361 1054603 1051852 1055757 1065926 1081107 1099510 1119445 1139926
61818A139926K0238J8131J3134O022j490q919j6867k4904l1431l5832l9033m1524
$$ 1139926 1160164 1178295 1191429 1197451 1195961 1187042 1170175 1145271 1113840 1078008 1038975 997451
61806I97451m2462m1362l9168l6847l4249l1125k8059k5553k3189k0542j8072
$$ 997451 954989 913627 874459 837612 803363 772238 744179 718626 695437 674895 656823
61795F56823j6299j4924j3385j1737j0308r118q056p099o091m888l962l999m739
$$ 656823 640524 625600 612215 600478 590170 581052 572996 565897 559806 554918 550956 546957 542218
61782E42218n099m668m239m478n003n109m601l602k312j328j305k065k666k574
$$ 542218 537119 532451 528212 523734 518731 513622 509021 505419 503107 501779 500474 498409 495743 493169
61768D93169j976j029K71J389J638J392J771K858L521L322L322M316N494N645
$$ 493169 491193 490164 490435 491824 493462 494854 496625 499483 503004 506326 509648 513964 519458 525103
61754E25103M799L925L678M086M812N223M753L545K294J356O36J95R8k00j231
$$ 525103 529902 533827 537505 541591 546403 551626 556379 559924 562218 563574 564210 564405 564503 564303 563072
61739E63072k258j944l99P69P49N07J034J904K187J768J114O30P11J532K550L051
$$ 563072 560814 558870 558471 559240 559989 560496 561530 563434 565621 567389 568503 569133 569844 571376 573926 576977
61723E76977L267L911M607M262L118K808L921N125N258M724M136L200J839Q72
$$ 576977 580244 584155 588762 593024 596142 598950 602871 607996 613254 617978 622114 625314 627153 628025
61709F28025N97M6j338k597k870k749k990l150k717k389k918l711l835l572l716
$$ 628025 628622 628668 627330 624733 621863 619114 616124 612974 610257 607868 604950 601239 597404 593832 590116
61694E90116m151m339m419m640m452l354k055j619j982k341k419k383k112j557
$$ 590116 585965 581626 577207 572567 568115 564761 562706 561087 559105 556764 554345 551962 549850 548293
61680E48293j354k028l017l355k978k560k491k686k933k829j950o32Nn24j353
$$ 548293 546939 544911 541894 538539 535561 533001 530510 527824 524891 522062 520112 519480 519485 518961 517608
61665E17608j511j095o04q5L81K86k99k71R68K377K717K301K261K789L266L517
$$ 517608 516097 515002 514398 514313 514694 514980 514681 514410 515378 517755 520472 522773 525034 527823 531089 534606
61649E34606L770L778L195K561K854M154N498N988N487M522L861L864L970L282
$$ 534606 538376 542154 545349 547910 550764 554918 560416 566404 571891 576413 580274 584138 588108 591390
61635E91390J875P36K47l18j436k620l475m291m984m761l707l284m254n327n051
$$ 591390 593265 594001 594248 593930 592494 589874 586399 582108 577124 572363 568656 565372 561118 555791 550740
61620E50740l926l325l342l142k576k018j315k30N61K08j038k305l359m428n406
$$ 550740 546814 543489 540147 537005 534429 532411 531096 530866 531427 531635 530597 528292 524933 520505 515099
61605E15099o258p419q833r364q283o530n335m479l198j913j543j860k014k109
$$ 515099 508841 501422 492589 483225 474942 468412 463077 458598 455400 453487 451944 450084 448070 445961
61591D45961k751l530l556l066l043l486l563l155k913k915k659k220k090k126
$$ 445961 443210 439680 436124 433058 430015 426529 422966 419811 416898 413983 411324 409104 407014 404888
61577D04888j874j705k306l254l465k910k546k645k582k254k349k988l378l114
$$ 404888 403014 401309 399003 395749 392284 389374 386828 384183 381601 379347 376998 374010 370632 367518
61563C67518k706k520k151j192Q5J010J064J56j083j546q06K85P57P89J058J432
$$ 367518 364812 362292 360141 358949 359034 360044 361108 361264 360181 358635 357829 358114 358871 359660 360718 362150
61547C62150J283O59J17k43n86n92J5N77K82m70n96NM63M35N15J158K183L175
$$ 362150 363433 364092 364209 363966 363380 362788 362803 363380 363662 363192 362596 362601 363064 363499 364014 365172 367355 370530
61529C70530L620K883J045n87p31K60R59O81j13q63j334j388j289j760k832l239
$$ 370530 374150 377033 378078 377491 376760 377020 377979 378660 378547 377684 376350 374962 373673 371913 369081 365842
61513C65842k107n69l24j184j512p55J22M81O34O58J59o28q57m12q4k55n38p32
$$ 365842 363735 363166 362842 361658 360146 359391 359513 359994 360628 361286 361445 360817 359960 359548 359464 359209 358671 357939
61495C57939j011j168p99k71l21p92q60m68l08n13n64m85p72j196j028m30k59
$$ 357939 356928 355760 354961 354690 354369 353577 352717 352249 351941 351428 350864 350379 349607 348411 347383 346953 346694
61478C46694n04l33K35K95j23J38J351K246J983J298J040Q60K35m06n16m55p40
$$ 346694 346190 345857 346092 346387 346264 346402 347753 349999 351982 353280 354320 355180 355415 355009 354493 354038 353298
61461C53298r87n32L66P43J29r31j474j011kN64K63k63k58R2J47n9M6N46J054
$$ 353298 352311 351779 352145 352888 353017 352086 350612 349601 349599 350163 350426 350163 349905 349997 350144 350085 350131 350677 351731
61442C51731J487K036K491K516K346K376K386K023J672J815J994J599J243J908
$$ 351731 353218 355254 357745 360261 362607 364983 367369 369392 371064 372879 374873 376472 377715 379623
61428C79623L068L274K462J999K408K720K420K303K842L243K850K215K069K279
$$ 379623 382691 385965 388427 390426 392834 395554 397974 400277 403119 406362 409212 411427 413496 415775
61414D15775K477K716K899K479J312%j041j994k865l213l054l016l214k987k225
$$ 415775 418252 420968 423867 426346 427658 427658 426617 424623 421758 418545 415491 412475 409261 406274 404049
61399D04049j853k354k808k238j068l78l17j68L09M77k33j449k153j698n00M26
$$ 404049 402196 399842 397034 394796 393728 393350 393033 392865 393174 393651 393418 391969 389816 388118 387618 388044
61383C88044O48O66R22J118R57R54J661K592K849K414J950J654J298J073J313
$$ 388044 388692 389358 390280 391398 392355 393309 394970 397562 400411 402825 404775 406429 407727 408800 410113
61368D10113J657J518J140J136J324J127Q07J062J686J926J904K283K738K347
$$ 410113 411770 413288 414428 415564 416888 418015 418822 419884 421570 423496 425400 427683 430421 432768
61354D32768J439J427K629L869M488N197O519P875Q766R574J0642J1665J2489
$$ 432768 434207 435634 438263 442132 446620 451817 458336 466211 474977 484551 495193 506858 519347
61341E19347J3471J4556J5002J4342J2770J0461P520M724L013K098P15j427l271
$$ 519347 532818 547374 562376 576718 589488 599949 607469 612193 615206 617304 618019 616592 613321
61328F13321m187m794n609o181o132n893n818n568m929m323m025l701l120k562
$$ 613321 609134 604340 598731 592550 586418 580525 574707 569139 564210 559887 555862 552161 549041 546479
61314E46479k228j954j627j264o75J51O07L42J87J062K349K837K880L916N972
$$ 546479 544251 542297 540670 539406 538731 538882 539489 539831 540018 541080 543429 546266 549146 553062 559034
61299E59034P595Q301R208J0806J1951J1719J0520Q771N958J875k529o183q700
$$ 559034 566629 574930 584138 594944 606895 618614 629134 637905 643863 645738 643209 637026 628326
61286F28326r906r771r102q899q793p564n342l669l116k583j423l31L63J448L130
$$ 628326 618420 608649 599547 590648 581855 574291 568949 565280 562164 559581 558158 557827 558190 559638 562768
61271E62768M311M436M440N079N905O688Q116J0236J1742J1844J1391J1290J1269
$$ 562768 567079 571515 575955 581034 586939 593627 601743 611979 623721 635565 646956 658246 669515
61258F69515J1032J1143J1873J2635J3371J5015J7636J9760K0304J9667J8043
$$ 669515 680547 691690 703563 716198 729569 744584 762220 781980 802284 821951 839994
61247H39994J4510Q900K879k095o315j0232j3014j4020j4164j4394j4205j2991
$$ 839994 854504 863404 866283 864188 857873 847641 834627 820607 806443 792049 777844 764853
61235G64853j1512j0526r386p398n343m128l172j656k69p4o53q74o79o36m95M35
$$ 764853 753341 742815 733429 726031 720688 716560 713388 711732 711463 711389 710736 709862 709183 708547 708052 708487
61219G08487J958L239L841L699K782J528P68N01k55j739k815k775k404k362j964
$$ 708487 710445 713684 717525 721224 724006 725534 726302 726803 726548 724809 721994 719219 716815 714453 712489
61204G12489o52O67R76N96K15k82r02p63O49K594M417O505R002J1102J2648J4789
$$ 712489 711837 712504 713480 714076 714291 714009 713107 712344 712993 715587 720004 726509 735511 746613 759261 774050
61188G74050J7878K0461K1634K2613K4426K5798K5020K2377J8993J4922J0278
$$ 774050 791928 812389 834023 856636 881062 906860 931880 954257 973250 988172 998450
61177I98450O673N302M851L408J403M98N82L9j650l602n308o954q421r526j0778
$$ 998450 1005123 1010425 1015276 1018684 1020087 1020585 1021167 1021206 1019556 1015954 1010646 1003692 995271 985745 974967
61162I74967j2590j4362j5463j6229j6929j6922j6049j5499j5852j5738j4036
$$ 974967 962377 948015 932552 916323 899394 882472 866423 850924 835072 819334 805298
61151H05298j1950j1035j0615r135o806m772k878l96K041L419M384O151Q131Q660
$$ 805298 793348 782313 771698 762563 755757 750985 748107 747711 749752 753171 757555 763706 771837 780497
61137G80497P343M879J476k672o247q190r283j0527j0961r274o406m278k816o34
$$ 780497 787840 792719 794195 791523 785276 777086 767803 757276 746315 737041 730635 726357 723541 722907
61123G22907K202M510O395Q892J1723J3769J5223J7120J9220K0578K1579K3209
$$ 722907 725109 729619 736014 744906 756629 770398 785621 802741 821961 842539 864118 887327
61111H87327K4961K5699K5928K6778K7443K6275K3871K2291K1573J9756J6345
$$ 887327 912288 937987 963915 990693 1018136 1044411 1068282 1090573 1112146 1131902 1148247
61100A148247J3061J0948R188P126N209L552J508j123m095p864j2915j8183k1931
$$ 1148247 1161308 1172256 1181444 1188570 1193779 1197331 1198839 1197716 1193621 1185757 1172842 1154659 1132728
61087A132728k4008k5457k6395k6242k5456k4935k4147k2067j9482j8035j7474
$$ 1132728 1108720 1083263 1056868 1030626 1005170 980235 956088 934021 914539 896504 879030
61076H79030j6217j4293j3212j3084j2428j0745q955p323n256l127k032j811j354
$$ 879030 862813 848520 835308 822224 809796 799051 790096 782773 777517 774390 772358 770547 769193
61063G69193o24k78K07J630K896K389J134J689M139O068O487O875Q181R556J0486
$$ 769193 768569 768291 768498 770128 773024 775413 776547 778236 782375 788443 794930 801805 809986 819542 830028
61048H30028J1613J3014J4006J4861J6526J8668K0183K1362K3179K4955K5349
$$ 830028 841641 854655 868661 883522 900048 918716 938899 960261 983440 1008395 1033744
61037A033744K5199K6482K8876L0344L0746L1698L3159L3514L2884L3043L4105
$$ 1033744 1058943 1085425 1114301 1144645 1175391 1207089 1240248 1273762 1306646 1339689 1373794
61026A373794L4587L4583L5462L6678L6582L6158L8070M2158M5891M9171N4267
$$ 1373794 1408381 1442964 1478426 1515104 1551686 1587844 1625914 1668072 1713963 1763134 1817401
61015A817401O0947O6215O9217P1828P4239P5017P5943Q1407R2163J05000J19287
$$ 1817401 1878348 1944563 2013780 2085608 2159847 2234864 2310807 2392214 2484377 2589377 2708664
61004B708664J37824J60089J81036J98532K15981K36267K60122K92283L41221
$$ 2708664 2846488 3006577 3187613 3386145 3602126 3838393 4098515 4390798 4732019
60995D732019M09981M95559O00330P34716R05541J114135J370806J694592K088959
$$ 4732019 5142000 5637559 6237889 6972605 7878146 8992281 10363087 12057679 14146638
60986A4146638K538182L042178L615021M185148M499153M217347L201032J716186
$$ 14146638 16684820 19726998 23342019 27527167 32026320 36243667 39444699 41160885
60978D1160885K99732o08592r00867p08670j85785N29458J177889J358957P74344
$$ 41160885 41460617 40852025 39951158 39242488 39056703 39586161 40764050 42123007 42897351
60969D2897351m92876j990654l211780l897402m078836l918094l564378l122307
$$ 42897351 42404475 40413821 37202041 33304639 29225803 25307709 21743331 18621024
60961A8621024k667998k248661j879286j559245j289090j067908q86796p35503
$$ 18621024 15953026 13704365 11825079 10265834 8976744 7908836 7022040 6286537
60953F286537o10743n12288m35958l75679l28159k91087k60372k33114k09942
$$ 6286537 5675794 5163506 4727548 4351869 4023710 3732623 3472251 3239137 3029195
60944C029195j91193j74010j56023j38599j23509j09674r6321q6183q2008q2169
$$ 3029195 2838002 2663992 2507969 2369370 2245861 2136187 2039866 1953683 1871675 1789506
60934A789506q2878q2742q2248q0750p7092p1933o6708o1245n4724m7980m2627
$$ 1789506 1706628 1623886 1541638 1460888 1383796 1311863 1245155 1183910 1129186 1081206 1038579
60923A038579l8674l5002l1469k8777k6830k4817k2476k0049j7542j5098j3464
$$ 1038579 999905 964903 933434 904657 877827 853010 830534 810485 792943 777845 764381
60912G64381j3020j2859j1800r798p682o009m764l663k354q73k0l82j107p98L30
$$ 764381 751361 738502 726702 716904 709222 703213 698449 694786 692432 691559 691539 691157 690050 689252 689582
60897F89582N82o87k230k974l330l894m353m512n077o439p888q691r034r234r117
$$ 689582 690164 689477 687247 684273 680943 677049 672696 668184 663107 656668 648780 640089 631055 621821 612704
60882F12704q740q575q498p801o736o673q132r919j0863j1061j0684r134o468
$$ 612704 603964 595389 586891 579090 572354 565681 557549 547630 536767 525706 515022 505888 499420
60869D99420m300l925m561m644l966l325k787j685JJ468K142K185K069K244K951
$$ 499420 495120 491195 486634 481990 478024 474699 471912 470227 470228 471696 473838 476023 478092 480336 483287
60854D83287L974M841N526O477P769Q766Q973Q576P920P087O212N607N274M904
$$ 483287 487261 492102 497628 504105 511874 520640 529613 538189 546109 553196 559408 565015 570289 575193
60840E75193M491M298M109L364K075P38p11k775n034o170n769m946m676m593m132
$$ 575193 579684 583982 588091 591455 593530 594268 593557 590782 585748 579578 573809 568863 564187 559594 555462
60825E55462l726l986m584m803m634m535m666m980n586o445p176p653q190q772
$$ 555462 551736 547750 543166 538363 533729 529194 524528 519548 513962 507517 500341 492688 484498 475726
60811D75726q759p949p191p290p822p677o470m839l602l048k801k195j033%J26
$$ 475726 466967 459018 451827 444537 436715 429038 422568 417729 414127 411079 408278 406083 405050 405050 405176
60796D05176l14k88L08M25m07j168q01L07J032J086J056J340J875K585L437M151
$$ 405176 404862 404574 404882 405307 404900 403732 402931 403238 404270 405356 406412 407752 409627 412212 415649 419800
60780D19800M459M463M448M435M332M274M484M895N274N574N947O444O876O911
$$ 419800 424259 428722 433170 437605 441937 446211 450695 455590 460864 466438 472385 478829 485705 492616
60766D92616O331N345M533M303M531M892N278N541N196L978K504J734J870K296
$$ 492616 498947 504292 508825 513128 517659 522551 527829 533370 538566 542544 545048 546782 548652 550948
60752E50948K477K328J852J114M58J32j59p74j428j688j832k391l115l420l631
$$ 550948 553425 555753 557605 558719 559177 559309 559150 558376 556948 555260 553428 551037 547922 544502 540871
60737E40871m552n917o576o315o119o375o155m878l379k578k181j461m92K83R93
$$ 540871 536319 530402 523826 517511 511392 505017 498862 493984 490605 488027 485846 484385 483893 484176 485169
60722D85169K050L403M732N918O857P363P702Q573J0087J1464J2297J3332J5275
$$ 485169 487219 490622 495354 501272 508129 515492 523194 531767 541854 553318 565615 578947 594222
60709E94222J7519J8969J9531J9935K0484K0980K1605K2792K4224K4872K4278
$$ 594222 611741 630710 650241 670176 690660 711640 733245 756037 780261 805133 829411
60698H29411K3072K1945K0721J8792J6038J2830R346N376Q30l891q242j2021j5310
$$ 829411 852483 874428 895149 913941 929979 942809 952155 957531 958361 954470 946228 934207 918897
60685I18897j8058k0077k1483k2655k3669k4127k3811k3112k2375k1273j9345
$$ 918897 900839 880762 859279 836624 812955 788828 765017 741905 719530 698257 678912
60674F78912j6903j4818j3507j2639j1796j0947j0311j0020r906r408q021o155
$$ 678912 662009 647191 633684 621045 609249 598302 587991 577971 568065 558657 550636 544481
60662E44481n064n479o655p353p305p041o748o177n373m594l631k168o33K15N52
$$ 544481 539417 533938 527283 519930 512625 505584 498836 492659 487286 482692 479061 476893 476260 476475 477027
60647D77027J282K550L437L329K682K138J728J283R08O69M10J83K93P33J129J429
$$ 477027 478309 480859 484296 487625 490307 492445 494173 495456 496364 497033 497443 497626 497919 498652 499781 501210
60631E01210K021K943L534L296K567K066K106K485K771K547J630K52j210k578
$$ 501210 503231 506174 509708 513004 515571 517637 519743 522228 524999 527546 529176 529428 528218 525640
60617E25640l738m348m196l634l275l341l665m087m356m044l148k464k597l016
$$ 525640 521902 517554 513358 509724 506449 503108 499443 495356 491000 486956 483808 481344 478747 475731
60603D75731k722j630m21N43J249J287K77j110j640j096l88n6J99M52K02o27j285
$$ 475731 473009 471379 470958 471501 472750 474037 474314 473204 471564 470468 470080 470024 470223 470675 470877 470250 468965
60586D68965j187n65J69R27J591J919J971K095K340K520K804L467M214M538M620
$$ 468965 467778 467213 467382 468309 469900 471819 473790 475885 478225 480745 483549 487016 491230 495768 500388
60571E00388M991N542N891O579Q524J1358J3659J5039J6609J9068K1780K4260
$$ 500388 505379 510921 516812 523391 531915 543273 556932 571971 588580 607648 629428 653688
60559F53688K7109L0530L3172L3401L1032K6882K1295J3971M940m889j3851k0073
$$ 653688 680797 711327 744499 777900 808932 835814 857109 871080 876020 871131 857280 837207
60547H37207k2441k1415j8507j4870j0849o698k723J331O095J1502J6891K2263
$$ 837207 814766 793351 774844 759974 749125 742427 739704 741035 747130 758632 775523 797786
60535G97786K8392L5328M1903M7075N0655N2304N0940M5810L7306K6249J3346
$$ 797786 826178 861506 903409 950484 1001139 1053443 1104383 1150193 1187499 1213748 1227094
60524A227094o4j1766k0015k4630k6263k5445k2808j9380j5944j2697j0051q926
$$ 1227094 1227030 1215264 1195249 1170619 1144356 1118911 1096103 1076723 1060779 1048082 1038031 1029105
60512A029105r648j1163j2032j1613r945p176l726m04K249M443O651R115J2040
$$ 1029105 1019457 1008294 996262 984649 974704 967528 963802 963398 965647 970090 976741 985856 997896
60499I97896J5605J9727K4398L0334L8438M8552N9622P1201Q3563R6221J07609
$$ 997896 1013501 1033228 1057626 1087960 1126398 1174950 1234572 1305773 1389336 1485557 1593166
60488A593166J16697J23583J27995J28459J23780J14343J01193Q4848O5726M4591
$$ 1593166 1709863 1833446 1961441 2089900 2213680 2328023 2429216 2514064 2579790 2624381
60478B624381K1815k852k8946n4646p8275r9475j17910j31842j39185j39507j34189
$$ 2624381 2646196 2643344 2614398 2559752 2481477 2382002 2264092 2132250 1993065 1853558 1719369
60467A719369j25173j14340j03302r2768q2457p2255o2929n5092m8236m1643l5598
$$ 1719369 1594196 1479856 1376554 1283786 1201329 1129074 1066145 1011053 962817 921174 885576
60456H85576l0851k7388k4569k2033j9827j7973j6555j5748j5324j4666j3584
$$ 885576 854725 827337 802768 780735 760908 742935 726380 710632 695308 680642 667058
60445F67058j2507j1480r908p705n758m605l662k452j594j716k277k430k248k146
$$ 667058 654551 643071 633163 625458 619700 615095 611433 608981 607387 605671 603394 600964 598716 596570
60431E96570j883j096j80L02M12K88n15k160l721m265m135m161m223l642k477
$$ 596570 594687 593591 593411 593713 594125 594413 593898 591738 588017 583752 579617 575456 571233 567591 565114
60416E65114j393o44q5J60o0m09n31o16p79n09L90J011M93n56q51k86J56O7J21
$$ 565114 563721 563077 562992 563152 563092 562683 562152 561536 560757 560248 560638 561649 562142 561586 560735 560449 560605 560672 560793
60397E60793Q65J908K521K429J956J676J916K448K839L034L135K842J960J297
$$ 560793 561658 563566 566087 568516 570472 572148 574064 576512 579351 582385 585520 588362 590322 591619
60383E91619J861K950K620M78j455j495l71M54R85J848K595K481K032K237K892
$$ 591619 593480 596430 599050 599528 598073 596578 596207 596661 597646 599494 602089 604570 606602 608839 611731
60368F11731L197L295L742M161L889L436L749M542M890M999N780O970P354O698
$$ 611731 614928 618223 621965 626126 630015 633451 637200 641742 646632 651631 657411 664381 671735 678433
60354F78433N933N404M492L067K008K024L031M841P396J0281J2915J5403J8382
$$ 678433 684366 689770 694262 697329 699337 701361 704392 709233 716629 726910 739825 755228 773610
60341G73610K2132K6535L1486L6256L8851L7364L2056K4969J7486R299j95j0576
$$ 773610 795742 822277 853763 890019 928870 966234 998290 1023259 1040745 1050044 1049849 1039273
60329A039273k0593k8739l3619l4759l3227l0706k7980k4920k1622j8467j5279
$$ 1039273 1018680 989941 956322 921563 888336 857630 829650 804730 783108 764641 749362
60318G49362j1651q062n568m183k718m03K211M241N420N827N608N305N723P104
$$ 749362 737711 729649 724081 719898 717180 716777 718988 723229 728649 734476 740084 745389 751112 758216
60304G58216Q902J0594J2259J4274J7057K1254K7525L5526M3182M7306M5456L7813
$$ 758216 767118 777712 789971 804245 821302 842556 870081 905607 948789 996095 1041551 1079364
60292A079364K7221J6731O872l809j5306k4540k8016k5210j8473j0690m172p60
$$ 1079364 1106585 1123316 1130188 1126379 1111073 1086533 1058517 1033307 1014834 1004144 999972 999212
60280I99212j082l851p365j1557j7348k4260l0153l3461l4340l3494l1143k7546
$$ 999212 998130 994279 986914 975357 958009 933749 903596 870135 835795 802301 771158 743612
60268G43612k3557k0098j7535j5718j4104j2070r664p837p259p221o516n040l631
$$ 743612 720055 699957 682422 666704 652600 640530 630866 623029 615770 608549 602033 596993 593362
60255E93362k718k159k014k446k998l053k735k432j806m46Q51R07M9k45M01Q71
$$ 593362 590644 588485 586471 584025 581027 577974 575239 572807 571001 570555 571406 572313 572362 572117 572518 573389
60239E73389N56J97L86O06L70K18P74J746K485K884L216L569L917M263M523M632
$$ 573389 573945 574142 574528 575134 575504 575722 576496 578242 580727 583611 586827 590396 594313 598576 603099 607731
60223F07731M878N580O391O518N730M534L307J900K44j185j764j300j69Q76J229
$$ 607731 612609 618189 624580 631098 636828 641362 644669 646569 646813 645628 643864 642564 642395 643271 644500
60208F44500J056J132J825K655L141L469L838L848L208K328J582O70m84j149r82
$$ 644500 645556 646688 648513 651168 654309 657778 661616 665464 668672 671000 672582 673252 672768 671619 670637
60193F70637r17j738k674k694k306k517k818k043o32j32p04r87m39Q0Q2R1K55
$$ 670637 669720 667982 665308 662614 660308 657791 654973 652930 652298 652166 651462 650475 650036 650116 650198 650289 650544
60176F50544kn98o10J19O55N70N69J084J644J974K515L393M128M694N672P029
$$ 650544 650542 649944 649334 649453 650108 650678 651247 652331 653975 655949 658464 661857 665985 670679 676351 683380
60160F83380P880P870P575P204O167M299K347Q23m58j346j121J43J148Q99k26
$$ 683380 691260 699130 706705 713909 720076 724375 726722 727545 727087 725741 724620 724763 725911 726810 726584
60145G26584j388k294k830k711k008j212m74N12J630K410L043M250N995P346P892
$$ 726584 725196 722902 720072 717361 715353 714141 713667 714179 715809 718219 721262 725512 731507 738853 746745
60130G46745Q065P862O589M239J811k62k623n384p361p698p100o627o293n703
$$ 746745 754810 762672 769261 773500 775311 775049 772426 767042 759681 751983 744883 738256 731963 726260
60116G26260n014m389l350j660j57K04l51p87m97L84J527K657L604M472N482O490
$$ 726260 721246 716857 713507 711847 711690 711894 711543 710756 710259 710643 712170 714827 718431 722903 728385 734875
60100G34875P092P337P776Q629R391R426Q476O696M654L088K052O17j816m305
$$ 734875 741967 749304 757080 765709 775100 784526 793002 799698 804352 807440 809492 810109 808293 803988
60086H03988n459n390n346n704n666m841l732k674j596q40r04j323j238j035j968
$$ 803988 798529 793139 787793 782089 776423 771582 767850 765176 763580 762740 761836 760513 759275 758240 756272
60071G56272m049n979p212q415r610r733q517p084o087m988l742l316l817l927
$$ 756272 752223 746244 739032 730617 721007 711274 702757 695673 689586 684598 680856 677540 673723 669796
60057F69796l156k906m123n579n789n246n342o253p236p959q275p627n890m051
$$ 669796 666640 663734 659611 654032 648243 642997 637655 631402 624166 616207 607932 600305 594415 590364
60043E90364k951k179j055K26J292K384L461L526K034R3q40o84k26K19O02M42
$$ 590364 587413 585234 584179 584405 585697 588081 591542 595068 597102 597195 596355 595671 595445 595664 596266 596708
60027E96708n19j606k114k262k446k383j938j947l050m456m924m400l684l038
$$ 596708 596189 594583 592469 590207 587761 585378 583440 581493 578443 573987 569063 564663 560979 557941
60013E57941k158j061j12M95O42K45k17J41J346K345K696L392N127O896P442P185
$$ 557941 555783 554722 554610 555105 555747 555992 555775 555916 557262 559607 562303 565695 570822 577718 585160 592345
59997E92345P404Q294R209J0108J1382J2534J2430J0835Q634O579M617K450L5
$$ 592345 599749 608043 617252 627360 638742 651276 663706 674541 683175 689754 694371 696821 696856
59984F96856k403m369n381n668o139p217q202q324p837p468p363p201o927o701
$$ 696856 694453 690084 684703 679035 672896 665679 657477 649153 641316 633848 626485 619284 612357 605656
59970F05656o488o147n599m681l330k054j477j265l97J161K173J972J506J898
$$ 605656 599168 593021 587422 582741 579411 577357 575880 574615 574218 575379 577552 579524 581030 582928
59956E82928K983L995M783N473N802N528M892M120L207K534K708L349L211K071
$$ 582928 585911 589906 594689 600162 605964 611492 616384 620504 623711 626245 628953 632302 635513 637584
59942F37584J232J448J694R08l12r33j224k103l574m961n914o280n764m650l983
$$ 637584 638816 640264 641958 642866 642554 641621 640397 638294 634720 629759 623845 617565 611801 607151 603168
59927F03168m190m425m062l682l723l413k202r86o45n10L17J261J382J172J676
$$ 603168 598978 594553 590491 586809 583086 579673 577471 576485 575840 575330 575647 576908 578290 579462 581138
59912E81138K629L029K922L009L154K767K189K211K686K875K752K656K271J278
$$ 581138 583767 586796 589718 592727 595881 598648 600837 603048 605734 608609 611361 614017 616288 617566
59898F17566M02M65R58R06O16J120K318L203L557L989M545M644M262L875L467
$$ 617566 617968 618433 619391 620297 620913 622033 624351 627554 631111 635100 639645 644289 648551 652426 655893
59883F55893K766K135K063K143J768J473K187L472L976L431K803K525J932N89
$$ 655893 658659 660794 662857 665000 666768 668241 670428 673900 677876 681307 684110 686635 688567 689156
59869F89156j011k261k972l103k844k916l830m982n350m930m556m444l920k633
$$ 689156 688145 685884 682912 679809 676965 674049 670219 665237 659887 654957 650401 645957 642037 639404
59855F39404j132j37J77J27J90N70Q25L38o11r21j67Q66J573K348L395L993L987
$$ 639404 638272 638135 638312 638439 638629 639199 640024 640362 639751 638830 638663 639529 641102 643450 646845 650838 654825
59838F54825M671P006J0064J2629J5078J8004J9946J8626J4029Q449L848P64m16
$$ 654825 659496 666502 676566 689195 704273 722277 742223 760849 774878 783327 787175 787939 787523
59825G87523Q36L922O872P744N499j22q257j6561k2448k4972k4928k3474k1412
$$ 787523 788359 792281 799153 806897 812396 812274 804017 787456 765008 740036 715108 691634 670222
59812F70222j9335j7339j4950j2133r825q642p825o487n097m481m219l427k399
$$ 670222 650887 633548 618598 606465 596640 587998 580173 573686 568589 564108 559889 556462 554063
59799E54063j994k029j791j546j968k648k720k515k912l497l061j683o41m59o20
$$ 554063 552069 550040 548249 546703 544735 542087 539367 536852 533940 530443 527382 525699 525058 524599 523979
59784E23979r43j646k279k187j876k361l318l505k836k385k430k191j559j356
$$ 523979 523036 521390 519111 516924 515048 512687 509369 505864 503028 500643 498213 496022 494463 493107
59770D93107j717j764j149n00j78J24M20L57J88N53J242J430J132J185J795K328
$$ 493107 491390 489626 488477 487977 487799 487923 488343 488700 488888 489441 490683 492113 493245 494430 496225 498553
59754D98553K609L176M183N102N540N476M884M119M097N053N612M460K331R72
$$ 498553 501162 504338 508521 513623 519163 524639 529523 533642 537739 542792 548404 552864 555195 556167
59740E56167O77M57L2n6J05j10n55p29j037j969k527j476L13Q66J35j70L86M48
$$ 556167 556844 557301 557333 557277 557382 557272 556717 555988 554951 552982 550455 548979 549292 550158 550293 550123 550509 550957
59722E50957m81j277j390j666k389k570j788r72p67o85m11l12l07K45J184J639
$$ 550957 550476 549199 547809 546143 543754 541184 539396 538424 537657 536972 536561 536249 535942 536187 537371 539010
59706E39010J660K162L074L310K778K611L126L436L410M048N471O410O305O097
$$ 539010 540670 542832 545906 549216 551994 554605 557731 561167 564577 568625 574096 580506 586811 592908
59692E92908O417O663O412N947M996K784p0j637j367q56j234j656j213m99l42
$$ 592908 599325 605988 612400 618347 623343 626127 626057 624420 623053 622197 620963 619307 618094 617595 617253
59677F17253n74r69j840k862k900j896j356k119l166l560l899m779n373m751l359
$$ 617253 616679 615710 613870 611008 608108 606212 604856 602737 599571 596011 592112 587333 581960 577209 573850
59662E73850k088r90N4O11N22M89R52J427J621K100L146M075M380M451M539M172
$$ 573850 571762 570772 570826 571437 571959 572448 573400 574827 576448 578548 581694 585769 590149 594600 599139 603311
59646F03311L232K407J893Q57j111l163m460n162n624n701n424n279n253m703
$$ 603311 606543 608950 610843 611700 610589 607426 602966 597804 592180 586479 581055 575776 570523 565820
59632E65820l551k560k077j702j361j404j389m10J152J771J029Q5l75q41j216
$$ 565820 562269 559709 557632 555930 554569 553165 551776 551366 552518 554289 555318 555403 555028 554187 552971
59617E52971m31J386K319J222p85k357l648n005n631m941l867l517l548k918j365
$$ 552971 552540 553926 556245 557467 556682 554325 550677 545672 540041 535100 531233 527716 524168 521250 519885
59602E19885O35K417L146K299N83o71j221j705j889r37M96O47n12j046j93N96
$$ 519885 520520 522937 526083 528382 528965 528294 527073 525368 523479 522542 523038 523685 523173 522127 521934 522530
59586E22530M91N82J289J037r39k809k902k278k614l404l230k370k131k595k807
$$ 522530 523021 523603 524892 525929 524990 522181 519279 517001 514387 510983 507753 505383 503252 500657 497850
59571D97850k433j850j340j154j552k063j758q01l48n38k69N59P02R5L80J911
$$ 497850 495417 493567 492227 491073 489521 487458 485700 484899 484551 484013 483744 484303 485005 485100 485480 487391
59555D87391K693J672O46J261K363K243J435J232J325R30O57J222J910K120K846
$$ 487391 490084 491756 492402 493663 496026 498269 499704 500936 502261 503191 503848 505070 506980 509100 511946
59540E11946M813O849P923R039J1234J3719J6007J9647K4881K7598K2994J1641
$$ 511946 516759 523608 531531 540570 551804 565523 581530 601177 626058 653656 676650 688291
59528F88291q38r495j3133j2731r857o469l920j823O82L155M660N337N515M432
$$ 688291 687453 677958 664825 652094 642237 635768 631848 630025 630707 633862 638522 643859 649374 653806
59514F53806J693j062k046j953k692m432o015p286q781r929r820r086q891q760
$$ 653806 655499 654437 652391 650438 647746 643314 637299 630013 621232 611303 601483 592397 583506 574746
59500E74746p576n957n311n217m173k429j603j773j379k6R13O66k0m41o59n21
$$ 574746 567170 561213 555902 550685 546512 544083 542480 540707 539328 539302 540215 540881 540861 540420 539761 539240
59484E39240L10J307J519J137J261K271L699N335P126Q455Q812Q728Q800Q549
$$ 539240 539550 540857 542376 543513 544774 547045 550744 556079 563205 571660 580472 589200 598000 606549
59470F06549P495O368N663M228J184j892k867k368k704m149m688l207n92K239
$$ 606549 614044 620412 626075 630303 631487 629595 626728 624360 621656 617507 612819 609612 609020 611259
59456F11259N210P972R849J1068J2353J3444J3662J3617J4603J6466J7849J8228
$$ 611259 616469 624441 634290 645358 657711 671155 684817 698434 713037 729503 747352 765580
59444G65580J7984J6820J3926R533M580q26o882j2481j5959j7188j7254j6548
$$ 765580 783564 800384 814310 823843 828423 827597 820715 808234 792275 775087 757833 741285
59432G41285j4937j3268j2589j2356j1377j0031r503r383q253o260m676l276n57
$$ 741285 726348 713080 700491 688135 676758 666727 657224 647841 639588 633328 628652 625376 624819
59419F24819L495P314J0296J3252J6387J9110K1632K4504K6936K8164K9818L3509
$$ 624819 628314 635628 645924 659176 675563 694673 716305 740809 767745 795909 825727 859236
59407H59236L5975L0605J5204m593k0920l0158l2838l0482k4893j8248j1339k832
$$ 859236 895211 925816 941020 936427 915507 885349 852511 822029 797136 778888 767549 764717
59395G64717P479J5659J5901O072r856k4697l3065l4371l1761k8329k4615k0029
$$ 764717 772196 787855 803756 809828 799972 775275 742210 707839 676078 647749 623134 603105
59383F03105j5347j2131j0294q289n698l738l035k743k202j678j129PJ346J592
$$ 603105 587758 575627 565333 557044 551346 547608 544573 541830 539628 537950 536821 536828 538174 539766
59369E39766O53M1P11J932K854L603M248M253L626L252L483L718L789M342N421
$$ 539766 540419 540460 541171 543103 545957 549560 553808 558061 561687 564939 568422 572140 575929 580271 585692
59354E85692O147O376P089Q597R861J0355J1108J2991J5267J6830J7840J9133
$$ 585692 591839 598215 605304 613901 623762 634117 645225 658216 673483 690313 708153 727286
59342G27286K0847K2420K3327K3274K2217K0532J8630J6306J3100R286N631K306
$$ 727286 748133 770553 793880 817154 839371 859903 878533 894839 907939 917225 922856 925162
59330I25162r60l897n964p495r320j1346j2717j3277j3545j3353j2074j0159q917
$$ 925162 924202 920305 914341 906846 897526 886180 873463 860186 846641 833288 821214 811055 802138
59317H02138q572q046o860n793n354n048m532m154l987l584l060l224m262n329
$$ 802138 793566 785520 778660 772867 767513 762465 757933 753779 749792 746208 743148 739924 735662 730333
59303G30333n702n460m857l959k957k060j119o3P36J363K836N573Q254R629J0621
$$ 730333 724631 719171 714314 710355 707398 705338 704219 704156 704892 706255 709091 714664 722918 732547 743168
59288G43168J2883J6101J8782K1028K4415K9317L4264L7382L6611K9399J5222
$$ 743168 756051 772152 790934 811962 836377 865694 899958 937340 973951 1003350 1018572
59277A018572j726j5018k1678k3359k2276j8795j3291p351k078K692O717Q950
$$ 1018572 1016846 1001828 980150 956791 934515 915720 902429 895078 893000 895692 902409 911359
59265I11359R408R439R550Q882P146N047K441j598o533j0492j3142j5984j9239
$$ 911359 920767 930206 939756 948638 955784 960831 963272 961674 955141 944649 931507 915523 896284
59252H96284k1004k0426j9141j8515j7795j6169j4426j3280j2087j0478r288q683
$$ 896284 875280 854854 835713 817198 799403 783234 768808 755528 743441 732963 723675 714992
59240G14992p315m658k309j586j550p15Q32K297L631M916N556N262M566L649J977
$$ 714992 707677 703019 700710 699124 697574 696859 697691 699988 703619 708535 714091 719353 723919 727568 729545
59225G29545l15k192l502n299p740r477r826r764r963r784r037q753r246r277
$$ 729545 729230 727038 723536 718237 710497 701020 691194 681430 671467 661683 652646 643893 634647 625370
59211F25370q172o933o249n283l530k000j424j019j54M46K36j27k02m82q11k9
$$ 625370 617198 610265 604016 598733 595203 593203 591779 590760 590606 591052 591288 591161 590959 590477 589666 589637
59195E89637J878L217L256L325M197M565L541K561L129M546N468O088P157Q355
$$ 589637 591515 594732 597988 601313 605510 610075 613616 616177 619306 623852 629320 635408 642565 650920
59181F50920R111R646R973R304P573N975N047L977K744K827M556N961N772N484
$$ 650920 660031 669677 679650 688954 696527 702502 707549 711526 714270 717097 721653 727614 733386 738870
59167G38870O711Q608R628J0067J0903J1765J1924J1794J1757J0943Q792O404
$$ 738870 745581 754189 763817 773884 784787 796552 808476 820270 832027 842970 851762 858166
59155H58166M766L130N96k267m794p491j0392j2074j1885j1413j1988j2578j1982
$$ 858166 862932 866062 866658 864391 859597 852106 841714 829640 817755 806342 794354 781776 769794
59142G69794j1115j1091j0865r120o888n919n794m974l505k457j730n25Q85J780
$$ 769794 758679 747588 736723 727603 720715 714796 709002 704028 700523 698066 696336 695811 696696 698476
59128F98476K482L505M322M594N400P496R656J0511J0737J1658J3038J4115J5350
$$ 698476 700958 704463 708785 713379 718779 726275 735931 746442 757179 768837 781875 795990 811340
59115H11340J7129J8164J7327J5804J5256J5077J3739J1599R991Q593O211L333
$$ 811340 828469 846633 863960 879764 895020 910097 923836 935435 945426 954019 960230 963563
59103I63563J500P34k31j702l078m495o421q149q709q634r063r742r740r368r414
$$ 963563 965063 965797 965566 963864 960786 956291 949870 941721 933012 924378 915315 905573 895833 886465 877051
59088H77051r289p974o230n792o802p876q327q562q739q755r109j0204j1248j1315
$$ 877051 867762 859788 853558 847766 840964 833088 824761 816199 807460 798705 789596 779392 768144 756829
59074G56829j0902j0933j1033j0343r309q943q988q419p216o104n156m057l111
$$ 756829 745927 734994 723961 713618 704309 695366 686378 677959 670743 664639 659483 655426 652315
59061F52315k627k064j087n45j170k300l085l809m651m586l134j780j920k654
$$ 652315 649688 647624 646537 645992 644822 642522 639437 635628 630977 626391 623257 621477 619557 616903
59047F16903k468j662j292j010q3P80O94M87J182J883J455J027K272M227M527
$$ 616903 614435 612773 611481 610471 610388 611168 611862 612349 613531 615414 616869 617896 620168 624395 628922
59032F28922L153K315K988L966M193L976L916M382N725P665R036R389R872J1179
$$ 628922 632075 634390 637378 641344 645537 649513 653429 657811 663536 671201 680237 689626 699498 710677
59018G10677J2035J1350J0219R804Q867N870J970o20k039l700n100m677l049k334
$$ 710677 722712 734062 744281 754085 762952 768822 770792 770172 768133 764433 759333 754656 751607 749273
59004G49273k724k502j112M60J919L735N318N638N323N731O376N699L960K855
$$ 749273 746549 744047 742935 743395 745314 749049 754367 760005 765328 771059 777435 783134 787094 789949
58990G89949K621K018Q27j08j046k997n472o964p563q622j0066j0378r225p741
$$ 789949 792570 794588 795415 795307 794261 791264 785792 778828 771265 762643 752577 742199 732974 725233
58976G25233o298m307k112q41l34O94K507M241N720P421R005R821J0426J1684
$$ 725233 718935 714628 712516 711675 711341 712035 714542 718783 724503 731924 740929 750750 761176 772860
58962G72860J2877J2810J2035J1865J1897J0767Q650O584M123J97m389p878j0296
$$ 772860 785737 798547 810582 822447 834344 845111 853761 860345 864468 864665 860276 852398 842102
58949H42102j2699j4472j4269j2964j2696j3334j2977j1434j0224r324p193l983
$$ 842102 829403 814931 800662 787698 775002 761668 748691 737257 727033 717709 710516 706533
58937G06533j646p24oN70k62k216l361l274l514m663n612o035o834p894q061p532
$$ 706533 704887 704163 704157 704727 704465 702249 698888 695614 692100 687437 681825 675790 668956 661062 653001 645469
58921F45469p626q010o966m551k666j825p08Q07J191K46l47N6L89N26J737L947
$$ 645469 637843 629833 622867 618316 615650 613825 613117 613924 615115 615361 615014 615070 615459 615985 617722 621669
58905F21669N442N851O690Q374R571J0053J1268J3365J4493J4061J3827J4784
$$ 621669 627111 632962 639652 648026 657597 667650 678918 692283 706776 720837 734664 749448
58893G49448J5585J5169J4393J4096J3873J3820J5137J7983K0804K2649K4073
$$ 749448 765033 780202 794595 808691 822564 836384 851521 869504 890308 912957 937030
58882I37030K5093K4428K1596J7793J3991J0055O072K555r53n338r874j2963j4897
$$ 937030 962123 986551 1008147 1025940 1039931 1049986 1056058 1058613 1057660 1052322 1042448 1029485 1014588
58869A014588j7369k0103k0840j8926j6268j4241j2415j0757j0286j0858j1036
$$ 1014588 997219 977116 956276 937350 921082 906841 894426 883669 873383 862525 851489
58858H51489j0784j1650j3781j5398j5768j5946j6165j5338j3720j3057j3381
$$ 851489 840705 829055 815274 799876 784108 768162 751997 736659 722939 709882 696501
58847F96501j2688j0509q829q570q242p048o333o720o775n746m924n089n164m582
$$ 696501 683813 673304 664475 655905 647663 640615 634282 627562 620787 615041 610117 605028 599864 595282
58833E95282m341m737m568l594l186l644l522k503k121k751k733j507o41p30k75
$$ 595282 590941 586204 581636 578042 574856 571212 567690 565187 563066 560315 557582 556075 555434 554704 554429
58818E54429J160J798J013P75K230L640L375K355J910J782J626K068K879K614
$$ 554429 555589 557387 558400 559175 561405 565045 568420 570775 572685 574467 576093 578161 581040 583654
58804E83654J304R61K219L123K453J556J609J810J571J720K162J171j566l865
$$ 583654 584958 585919 588138 591261 593714 595270 596879 598689 600260 601980 604142 605313 603747 599882
58790E99882m370m268m406l594j270R48J941K675L827M516M645N591P314P747
$$ 599882 595512 591244 586838 583244 581974 582922 584863 587538 591365 595881 600526 606117 613431 621178
58776F21178O397N431N855N812M193K534J741K91k426m448m780n283o927p642
$$ 621178 627575 633006 638861 644673 648866 651400 653141 653432 651006 646558 641778 636495 629568 621926
58762F21926o164m620m828n209m005k491k292k356j251J39P14J310K400K482J127
$$ 621926 615762 611142 606314 601105 597100 594609 592317 589961 588710 588849 589563 590873 593273 595755 596882
58747E96882P28K704M831M978M596N723P346P764P898R218J0735J1038J1092J2142
$$ 596882 597610 600314 605145 610123 614719 620442 627788 635552 643450 652668 663403 674441 685533 697675
58733F97675J3061J2505J1556J1482J1147R371P595P398P544O343M859M932N943
$$ 697675 710736 723241 734797 746279 757426 766797 774392 781790 789334 795677 800536 805468 811411
58720H11411O312O315O867P350P128P239Q281Q738P696O883P539P706N273J401
$$ 811411 817723 824038 830905 838255 845383 852622 860903 869641 877337 884220 891759 899465 904738 906139
58706I06139j720m255p195r748j1121j2697j5696j8734k0274k1321k3089k4310
$$ 906139 904419 900164 892969 883221 872100 859403 843707 824973 804699 783378 760289 735979
58694G35979k3598k2119k1262j9964j7122j4307j3173j2490j0567q321p178o331
$$ 735979 712381 690262 669000 649036 631914 617607 604434 591944 581377 573056 565878 559547
58682E59547m896m254n346o165m965l360l219l213j678j38m75j192j16J701K410
$$ 559547 554651 550397 545051 538886 533921 530561 527342 524129 522451 522313 521838 520646 520530 522231 524641
58667E24641L102N382P685Q056Q227J0789J4324J5533J4253J2383R749N251M36
$$ 524641 527743 533125 540810 548866 557093 567882 582206 597739 611992 624375 634124 639375 639811
58654F39811k281l602n663p839q109p084o821p015o158n058n382o120n289l767
$$ 639811 637530 633928 628265 620426 612317 605233 598412 591397 585239 580181 574799 568679 563390 559623
58640E59623l603m019k862p25K54L51J249K382K062R89R17J098k31k195k796k670
$$ 559623 556020 552001 549139 548414 548668 549019 550268 552650 554712 555701 556618 557716 557485 555290 552494 549824
58624E49824l582m606l715j802j165j288rK348L979N322P815J0199J0254R075
$$ 549824 546242 541636 537921 536119 534954 533666 533657 536005 539984 545306 553121 563320 573574 582649
58610E82649R490J1169J1356R509P281M862J417j815k817k417k882l858l449k253
$$ 582649 592139 603308 614664 624173 631454 636316 637733 635918 633101 630684 627802 623944 620495 618242
58596F18242k394l530l640k786k339j685N22K999L721L853N825Q766J0034R990
$$ 618242 615848 612318 608678 605892 603553 601868 602390 605389 609110 612963 618788 627554 637588 647578
58582F47578J0956J2598J2705J1574J1240J1267R657P026N647N161L547J448J271
$$ 647578 658534 671132 683837 695411 706651 717918 727575 734601 740248 745409 748956 750404 751675
58569G51675K883M354O011R461J3629J6135J7590K0191K3201K4267K4100K5056
$$ 751675 754558 758912 764923 774384 788013 804148 821738 841929 865130 889397 913497 938553
58557I38553K6162K4356J9799J5258J1084N625k78m133o377r285j2140j2448j1081
$$ 938553 964715 989071 1008870 1024128 1035212 1040837 1040559 1036426 1030049 1020764 1008624 996176 985095
58544I85095j1191j2663j2767j1629j1856j3296j3446j2663j3686j6259j7383
$$ 985095 973904 961241 948474 936845 924989 911693 898247 885584 871898 855639 838256
58533H38256j6735j6697j7313j6317j3971j2763j2507j0766p819o156n476l384
$$ 838256 821521 804824 787511 771194 757223 744460 731953 721187 713368 707212 701736 698352
58521F98352n73N1j000n06J542K252J644K423M211L884J637Q17J732J561M21J381
$$ 698352 697779 697830 696830 696324 697866 700118 701762 704185 708396 712280 713917 714734 716466 718027 718448 719829
58505G19829M117M786K804J666K380K097J47o24L86K48j895l419l401l891n105
$$ 719829 723946 728732 731536 733202 735582 737679 737826 737202 737588 737836 735941 732522 729121 725230 720125
58490G20125m724k766j882k214j319N48P14p6J813O111Q606Q472R346J2275J4039
$$ 720125 715401 712635 710753 708539 707220 707768 708482 708406 710219 716330 724936 733408 742754 755029 769068
58475G69068J3575J3622J4595J3241Q920N148L323Q70k940n370n849p251j0002
$$ 769068 782643 796265 810860 824101 833021 838169 841492 842362 839422 834052 828203 820952 810950
58462H10950j0831q843p041o446m695j664l50p87O51M484O912O735P101Q974R258
$$ 810950 800119 791276 784235 777789 773094 771430 771080 770293 770944 775428 782340 789075 796176 805150 814408
58447H14408P051N195M144Q95m351p229o609o244p376o727l657k041k896k318
$$ 814408 821459 826654 830798 831693 827342 820113 813504 807260 799884 793157 789500 787459 784563 782245
58433G82245Q98K775J827J863M468N852M189L085M639N935N481O298R473J1377
$$ 782245 783143 785918 787745 789608 794076 799928 804117 807202 811841 817776 823257 829555 839028 850405
58419H50405J0356R567J0196Q821M545J722K318K551M61k93K195L905J956q07
$$ 850405 860761 870328 880524 889345 893890 895612 897930 900481 900942 900649 902844 906749 908705 907898
58405I07898j952l578o712q178o674n553o235n440k145l50j608j914N83K025N06
$$ 907898 905946 902368 895656 887478 880804 875251 869016 863576 861431 861081 859473 857559 858142 860167 860673
58390H60673j38K068L202R96q93n3M68j040j293R26J593p37j515J429L820L205
$$ 860673 860535 862603 865805 866801 865908 865855 866323 865283 863990 864916 866509 865772 864257 865686 869506 872711
58374H72711L353O244P864O314N928Q760J0350Q581Q183J1539J3718J1854J0637
$$ 872711 876064 882308 890172 896486 902414 911174 921524 930105 938288 949827 963545 975399 986036
58361I86036J3043J4497J2031J0361J2618J3917J0591P238P968R030O778M630
$$ 986036 999079 1013576 1025607 1035968 1048586 1062503 1073094 1080332 1088300 1097330 1104108 1108738
58349A108738N446N448K396J283M955P781N716L958P180J0878J0188Q744J0801
$$ 1108738 1114184 1119632 1122028 1123311 1128266 1136047 1141763 1145721 1152901 1163779 1173967 1182711 1193512
58336A193512J2890J1395J0329J3444J6574J5707J4627J6847J8205J5309J2887
$$ 1193512 1206402 1217797 1228126 1241570 1258144 1273851 1288478 1305325 1323530 1338839 1351726
58325A351726J4666J5615J1457P158P619Q757O370M777P827J0435Q179O165R135
$$ 1351726 1366392 1382007 1393464 1400622 1408241 1416998 1423368 1428145 1435972 1446407 1454586 1460751 1469886
58312A469886J2088J0178Q487J2063J5777J4251J2426J5726J9292J7660J5666
$$ 1469886 1481974 1492152 1500639 1512702 1528479 1542730 1555156 1570882 1590174 1607834 1623500
58301A623500J8792K2157K0284J8144K1138K3890K0783J7651K0827K4474K1569
$$ 1623500 1642292 1664449 1684733 1702877 1724015 1747905 1768688 1786339 1807166 1831640 1853209
58290A853209J7583K0113K4568K3684K1810K5866L1254L0710K8275L0806L4543
$$ 1853209 1870792 1890905 1915473 1939157 1960967 1986833 2018087 2048797 2077072 2107878 2142421
58279B142421L3743L3264L8706M3767M1570L8569M2736M8263M7063M4794M9623
$$ 2142421 2176164 2209428 2248134 2291901 2333471 2372040 2414776 2463039 2510102 2554896 2604519
58268B604519N5768N4669N2024N6817O3782O3993O2440O7577P3938P3103P1081
$$ 2604519 2660287 2714956 2766980 2823797 2887579 2951572 3014012 3081589 3155527 3228630 3299711
58257C299711P6430Q2194P8676P2901P5672Q0927P8358P4769Q1333R1262R2535
$$ 3299711 3376141 3458335 3537011 3609912 3685584 3766511 3844869 3919638 4000971 4092233 4184768
58246D184768R1351R9962J12636J17331J19810J31736J46314J50883J52227J63618
$$ 4184768 4276119 4376081 4488717 4606048 4725858 4857594 5003908 5154791 5307018 5470636
58236E470636J78468J83500J86080K00705K20446K30516K37809K57275K81518
$$ 5470636 5649104 5832604 6018684 6219389 6439835 6670351 6908160 7165435 7446953
58227G446953K95001L05525L29478L59131L78191L96065M31122M74173N05900
$$ 7446953 7741954 8047479 8376957 8736088 9114279 9510344 9941466 10415639 10921539
58218A0921539N36077N85965O46685O97032P47442Q21792R10908R91448J075516
$$ 10921539 11457616 12043581 12690266 13387298 14134740 14956532 15867440 16858888 17934404
58209A7934404J191433J331166J470469J624807J828090K073104K335338K638672
$$ 17934404 19125837 20457003 21927472 23552279 25380369 27453473 29788811 32427483
58201C2427483L030841L513238M069716M746211N621366O721244Q056988R724221
$$ 32427483 35458324 38971562 43041278 47787489 53408855 60130099 68187087 77911308
58193G7911308J1854945J4482723J7560423K1074190K5005187K9236134L3661122
$$ 77911308 89766253 104248976 121809399 142883589 167888776 197124910 230786032
58186B30786032L8196836M2146984M3406083L8970774K7143013R523614r439783
$$ 230786032 268982868 311129852 354535935 393506709 420649722 430173336 420733553
58179D20733553k5118221l5091912l9449435l9558295l6918848l2774675k8077551
$$ 420733553 395615332 360523420 321073985 281515690 244596842 211822167 183744616
58172A83744616k3427313j9072168j5075499j1486545q333752n520937k884422
$$ 183744616 160317303 141245135 126169636 114683091 106349339 100828402 97943980
58165I7943980m99883J075071J071332p65906l723600o533588q278900q850958
$$ 97943980 97444097 98519168 99590500 98824594 95100994 88567406 80288506 71437548
58157G1437548q628484p964594p056295o071226n159483m366103l663260l057198
$$ 71437548 62809064 54844470 47788175 41716949 36557466 32191363 28528103 25470905
58149B5470905k581009k214464j900127j623403j405260j233866j072424r21528
$$ 25470905 22889896 20675432 18775305 17151902 15746642 14512776 13440352 12518824
58141A2518824q10457p35796o65483n95085n46960n20193m90671m55323m30737
$$ 12518824 11708367 10972571 10307088 9712003 9165043 8644850 8154179 7698856 7268119
58132G268119m12938l81485l39112l07132k85701k56626k20906j96460j82817
$$ 7268119 6855181 6473696 6134584 5827452 5541751 5285125 5064219 4867759 4684942
58123D684942j64129j43711j40332j52356j58877j54891j53681j56204j49398
$$ 4684942 4520813 4377102 4236770 4084414 3925537 3770646 3616965 3460761 3311363
58114C311363j34228j25518j23870j15700j00857r2986r2751q7124p5409p0257
$$ 3311363 3177135 3051617 2927747 2812047 2711190 2618204 2525453 2438329 2362920 2292663
58104B292663p2551p0091o1699n8603o1338n8754n0644m8444n2480n0923m2558
$$ 2292663 2220112 2150021 2088322 2029719 1968381 1909627 1858983 1810539 1758059 1707136 1664578
58093A664578l8770m1463m0166l2808k8881l0123k7897k1541k0013k3515k2496
$$ 1664578 1625808 1584345 1544179 1511371 1482490 1452367 1424470 1402929 1382916 1359401 1336905
58082A336905j6600j5931k1602k3535j9760j9587k5147k7563k4381k3579k7137
$$ 1336905 1320305 1304374 1282772 1259237 1239477 1219890 1194743 1167180 1142799 1119220 1092083
58071A092083k7296k2311j9863k1665k0328j4600j2429j5672j6691j3223j2018
$$ 1092083 1064787 1042476 1022613 1000948 980620 966020 953591 937919 921228 908005 895987
58060H95987j4664j4256r387p353j0161j1057q155p964j2072j3642j0555r056
$$ 895987 881323 867067 857680 850327 840166 829109 820954 812990 800918 787276 776721 767665
58048G67665j1062j0636o421n001q313j0013p786p269j0314j1256q365p362j0059
$$ 767665 756603 745967 739546 734545 726232 716219 708433 701164 690850 679594 671229 663867 653808
58035F53808j0859p973o901r299r644o374n364q611j0371q179p043r027r268o149
$$ 653808 642949 634976 628075 618776 609132 602758 597394 588783 578412 570233 563190 554163 544895 538746
58021E38746n009p757q925o031m062n690o725n093m865p406p910m644k522l747
$$ 538746 533737 525980 517055 511024 506962 501272 494547 489454 484589 477183 469273 464629 462107 458360
58007D58360l990j528r22l746m846j849M46o91j118J578L331J742P06K576L735
$$ 458360 454370 452842 451920 448174 443328 441479 441925 441234 440116 441694 445025 446767 447473 450049 453784
57992D53784K203J774M375N999M354L029M105M129J410k51R79J148j768l690j990
$$ 453784 455987 457761 462136 468135 472489 475518 479623 483752 485162 484911 485890 487038 485270 481580 479590
57977D79590q8n88q22Q65J407n99j695l43q2k353l370j696j627n063p390n632
$$ 479590 479502 478914 478092 478957 480364 479765 478070 477727 477645 475292 471922 470226 468599 463536 456146 450514
57961D50514l558m303m992l195j971l668n166m009l069m583n628m025k764m086
$$ 450514 446956 442653 437661 434466 432495 428827 423661 419652 416583 412000 406372 402347 399583 395497
57947C95497n063l447k106l265m073k212k86m60l43J701K891J784J811M888P416
$$ 395497 390434 386987 384881 381616 377543 375331 375045 374585 374242 375943 378834 380618 382429 387317 394733
57932C94733O920O694R330J1649J0807R607J0706J1284Q658N809N984O913N630
$$ 394733 401653 408347 417677 429326 440133 449740 460446 471730 480388 486197 492181 499094 504724
57919E04724M113M751N033K143j559k966l865o980j0435j1299j0911j1769j2786
$$ 504724 508837 513588 518621 520764 519205 516239 512374 505394 494959 483660 472749 460980 448194
57906D48194j2181j1453j2123j2284j0564r498j0877j1934j0415q909r680r869
$$ 448194 436013 424560 412437 400153 389589 380091 369214 357280 346865 337956 328276 318407
57894C18407o820l621m016n898n339l335l008l531k365m79j39k46J159K585K006
$$ 318407 311587 307966 303950 298052 292713 289378 286370 282839 280474 279995 279856 279610 280769 283354 285360
57879B85360J204K482M113L685K911M267N832M551J827Q48R72k85k081k084j248
$$ 285360 286564 289046 293159 296844 299755 304022 309854 314405 316232 317080 318052 317767 315686 313602 312354
57864C12354j931l269l075k243k742l310j716P04J230N99J330L025L653L684M742
$$ 312354 310423 307154 304079 301836 299094 295784 294068 294772 296002 296601 297931 300956 304609 308293 313035
57849C13035N926N598N032O321Q386Q912Q447Q779R187Q169O865O885O786M563
$$ 313035 318961 324559 329591 335912 344298 353210 361657 370436 379623 387792 394657 401542 408328 412891
57835D12891J605J79q08l401o132o379n285n911p951q703p868p324p327o835o360
$$ 412891 414496 414675 413867 410466 404334 397955 392670 386759 378808 370105 362237 354913 347586 340751 334391
57820C34391o739o478l937p12O61P61J525K373J896J499L200N486N471L710K851
$$ 334391 327652 321174 317237 316525 317186 317947 319472 321845 323741 325240 328440 333926 339397 343107 345958
57805C45958K930K142R10J028J784J005j084k685m005o283q467q645p701p796
$$ 345958 348888 351030 351940 352968 354752 355757 354673 351988 347983 341700 333233 324588 316887 309091
57791C09091q457p803o399o096o299n232l750l923m982m596l136k723l004j959
$$ 309091 300634 292831 286432 280336 274037 268805 265055 261132 256150 251554 248418 245695 242691 240732
57777B40732k9N27k15j54J003J870K621M427O392O722O163O736P862P439N866
$$ 240732 240703 241230 241015 240861 241864 243734 246355 250782 257174 263896 270059 276795 284657 292096 297962
57762B97962N211N211L953J849R04O12j315m542o363o214o056o432n933m624m333
$$ 297962 303173 308384 312337 314186 315090 315702 314387 309845 303482 297268 291212 284780 278847 274223 269890
57747B69890n331n933n577n236m976m054l045k976k935j607l54j374l672m374
$$ 269890 264559 258626 253049 247813 242837 238783 235738 232762 229827 228220 227866 226492 222820 218446
57733B18446l336k673k474r90J320K082J220R46J576J280J06K29J805K450J390
$$ 218446 215110 212437 209963 208973 210293 212375 213595 214541 216117 217397 217503 217732 219537 221987 223377
57718B23377N80J048J475J020M65K2r15j592n59J253J262p31k366k635k765l043
$$ 223377 223957 225005 226480 227500 227965 227987 227072 225480 224921 226174 227436 226705 224339 221704 218939 215896
57702B15896k222m91K71k35l31L68M34k24N7J422J946J071N17J095J539J160Q23
$$ 215896 213674 213183 213454 213219 212888 213256 213690 213466 213523 214945 216891 217962 218479 219574 221113 222273 223096
57685B23096P17l7j036o18J149K376K727M012O797R370J0893J2862J6498K1247
$$ 223096 223813 223776 222740 222122 223271 225647 228374 232386 239183 248553 259446 272308 288806 310053
57671C10053K6736L3882M3109N3567O4828P7578R1870J05609J14097J09993Q6191
$$ 310053 336789 370671 413780 467347 532175 609753 701623 807232 921329 1031322 1117513
57660A117513M2794r128n4241q3849r8370j01275r5299q4131p2337o1801n1495
$$ 1117513 1160307 1151179 1096938 1013089 914719 813444 718145 634014 561677 499876 448381
57649D48381m1470l3762k8693k4087j9062j5150j2769j0154o930n184n655o132
$$ 448381 406911 373149 344456 320369 301307 286157 273388 263234 256304 251120 245465 239333
57637B39333n069l700l196k681j474m47J05J220K777K968J437J34N5j10j034j483
$$ 239333 234264 230564 227368 224687 223213 222766 222871 224091 226868 229836 231273 231407 231462 231352 230318 228835
57621B28835j056j237k460l077k476k317l354m005l395k883l192k920j439l38
$$ 228835 227779 226542 224082 221005 218529 216212 212858 208853 205458 202575 199383 196463 195024 194686
57607A94686m51l46O64R40l29j364r70o45j543k172j182Q0N1m88l91l80j162j540
$$ 194686 194235 193889 194553 195493 195164 193800 192830 192185 190642 188470 187288 187368 187419 186931 186540 186160 184998 183458
57589A83458n97K58m73j913k601k811l249l293k470j886k393k954k531j867j826
$$ 183458 182861 183119 182646 180733 178132 175321 172072 168779 166309 164423 162030 159076 156545 154678 152852
57574A52852j794j253j172k194l259l470l486l679l058j464o56j523k388j789
$$ 152852 151058 149805 148633 146439 143180 139710 136224 132545 129487 128023 127367 125844 123456 121667
57560A21667p50n67n48P6K67p24j473p96J1m60j055j75J300J603J058J024J261
$$ 121667 120917 120350 119802 119878 120145 119421 117948 117152 117163 116703 115648 115473 116773 118376 119434 120458 121719
57543A21719P49j46m96o33j092r54P33L054M547N186N297M102J346j029j175o8
$$ 121719 122468 122322 121826 121193 120101 119147 119880 122934 127481 132667 137964 142066 143412 142383 141208 141140
57527A41140R9q27j453j461j571j719j298n58p2M18J159J358N74n9M89J431J666
$$ 141140 141239 140412 138959 137498 135927 134208 132910 132352 132280 132698 133857 135215 135789 135730 136219 137650 139316
57510A39316J657K099K207J207J81M11J125R02J21r8j62j059k097j932j046j006
$$ 139316 140973 143072 145279 146486 146667 147078 148203 149105 149226 149128 148966 147907 145810 143878 142832 141826
57494A41826j855k329k098j869j715j166n12l51l10K22P53N56J96N61J109O59
$$ 141826 139971 137642 135544 133675 131960 130794 130282 129931 129621 129843 130596 131152 131348 131909 133018 133677
57478A33677o84j886k567k808k276r89r4l74q12j73R50J251Q42O19M47k98j137
$$ 133677 132993 131107 128540 125732 123456 122467 122373 121999 121187 121014 121964 123215 124057 124676 125123 124825 123688
57461A23688j223q54o99l11R40K302K665K312K094J789R51L49P92J498J399J056
$$ 123688 122465 121611 120912 120601 121541 123843 126508 128820 130914 132703 133654 134003 134795 136293 137692 138748
57445A38748J374J525K72j523k005j166m19J6J021K315K625J900J320J216R21
$$ 138748 140122 141647 141919 140396 138391 137225 136806 136822 137843 140158 142783 144683 146003 147219 148140
57430A48140M77O28J164J107M92L34Q79J348J366J181Q32K71jL00L90l54j113
$$ 148140 148617 149245 150409 151516 152008 152342 153221 154569 155935 157116 157948 158219 158218 158518 158908 158554 157441
57413A57441r27m72q42j466j069N3N49K93K24N00O08Q40J760K690K529J679J390
$$ 157441 156514 156042 155200 153734 152665 152718 153267 153560 153784 154284 154892 155732 157492 160182 162711 164390 165780
57396A65780J726J929K132K815L205K317J006Q68J568J540Q54J004K065K533K045
$$ 165780 167506 169435 171567 174382 177587 179904 180910 181778 183346 184886 185740 186744 188809 191342 193387
57381A93387J831K315K477J980J788K235K413J943J589J720J773J528J373J161
$$ 193387 195218 197533 200010 201990 203778 206013 208426 210369 211958 213678 215451 216979 218352 219513
57367B19513L55n35l84N86R24K37l24q0L40M65P20J297J684J696J784K102K351
$$ 219513 219868 219333 218949 219535 220459 220696 220372 220292 220632 221097 221817 223114 224798 226494 228278 230380 232731
57350B32731K539K850K983K719K727L504M096L437K304K215K866K702J581Q70
$$ 232731 235270 238120 241103 243822 246549 250053 254149 257586 259890 262105 264971 267673 269254 270124
57336B70124J059J446J975L251M687M854L837L207L413L283K348J584J575J786
$$ 270124 271183 272629 274604 277855 282542 287396 291233 294440 297853 301136 303484 305068 306643 308429
57322C08429K054K845L736L566K439J761K052K509K849L635M583M724M376M833
$$ 308429 310483 313328 317064 320630 323069 324830 326882 329391 332240 335875 340458 345182 349558 354391
57308C54391N775N466L887L172M205N222M831M055M245N048N682O267O776O469
$$ 354391 360166 365632 369519 372691 376896 382118 386949 391004 395249 400297 405979 412246 419022 425491
57294D25491N508N356O435P156O447N415N304N587N485N564O381P022O605N844
$$ 425491 430999 436355 442790 449946 456393 461808 467112 472699 478184 483748 490129 497151 503756 509600
57280E09600N709N829N644N833O992Q063P762O653O287O964P786Q296Q706Q952
$$ 509600 515309 521138 526782 532615 539607 547670 555432 562085 568372 575336 583122 591418 600124 609076
57266F09076Q748Q275P955P858P967Q466R183R453R138R015R588J0303J0524J0399
$$ 609076 617824 626099 634054 641912 649879 658345 667528 676981 686119 695134 704722 715025 725549 735948
57252G35948J0152R549Q716Q594R707J1223J2033J2058J1922J2061J2614J3447
$$ 735948 746100 755649 764365 772959 782666 793889 805922 817980 829902 841963 854577 868024
57240H68024J3861J3231J2269J2519J4147J5416J5080J3977J3488J3613J3643
$$ 868024 881885 895116 907385 919904 934051 949467 964547 978524 992012 1005625 1019268
57229A019268J3635J4094J4872J5505J6045J6674J6998J6633J5983J5760J6087
$$ 1019268 1032903 1046997 1061869 1077374 1093419 1110093 1127091 1143724 1159707 1175467 1191554
57218A191554J6606J7085J7491J7841J8255J8767J9024J8738J8371J8584J9111
$$ 1191554 1208160 1225245 1242736 1260577 1278832 1297599 1316623 1335361 1353732 1372316 1391427
57207A391427J9169J8900J9195K0098K0696K0706K0838K1386K1902K2531K4001
$$ 1391427 1410596 1429496 1448691 1468789 1489485 1510191 1531029 1552415 1574317 1596848 1620849
57196A620849K5925K6760K6142K5650K6484K7833K8472K8557K8833K9215K9161
$$ 1620849 1646774 1673534 1699676 1725326 1751810 1779643 1808115 1836672 1865505 1894720 1923881
57185A923881K8485K7069K4773K2303K1016K1261K1979K2412K2942K3786K4415
$$ 1923881 1952366 1979435 2004208 2026511 2047527 2068788 2090767 2113179 2136121 2159907 2184322
57174B184322K4891K6250K8598L0375L0448K9593K8931K8366K7543K6922K6701
$$ 2184322 2209213 2235463 2264061 2294436 2324884 2354477 2383408 2411774 2439317 2466239 2492940
57163B492940K6022K4383K2649K1570K0550J9082J7997J8082J8585J8409J7686
$$ 2492940 2518962 2543345 2565994 2587564 2608114 2627196 2645193 2663275 2681860 2700269 2717955
57152B717955J7016J6216J5076J4219J4030J3829J3173J2837J3325J3691J3129
$$ 2717955 2734971 2751187 2766263 2780482 2794512 2808341 2821514 2834351 2847676 2861367 2874496
57141B874496J2508J2931J3949J4580J4922J5304J4987J3406J1580J0720J0375
$$ 2874496 2887004 2899935 2913884 2928464 2943386 2958690 2973677 2987083 2998663 3009383 3019758
57130C019758R572Q741Q730Q868P934O438O045P214R057J1174J3942J7286K0668
$$ 3019758 3029330 3038071 3046801 3055669 3063603 3070041 3076086 3083300 3092357 3103531 3117473 3134759 3155427
57117C155427K4166K8239L2755L7427M2800M9553N7314O5406P4287Q5045R7901
$$ 3155427 3179593 3207832 3240587 3278014 3320814 3370367 3427681 3493087 3567374 3652419 3750320
57106C750320J12487J29112J48526J70941J96561K26652K63019L06994L60217
$$ 3750320 3862807 3991919 4140445 4311386 4507947 4734599 4997618 5304612 5664829
57097E664829M25682N06700O05283P22709Q60647J019828J197819J389359J588047
$$ 5664829 6090511 6597211 7202494 7925203 8785850 9805678 11003497 12392856 13980903
57088A3980903J785836J971374K131344K254282K332501K360981K336069K254386
$$ 13980903 15766739 17738113 19869457 22123739 24456240 26817221 29153290 31407676
57080C1407676K109527J888294J573073J153072O37768O1957n22388j062674j520335
$$ 31407676 33517203 35405497 36978570 38131642 38769410 38831367 38308979 37246305 35725970
57071C5725970j875829k124905k272975k331928k317714k246847k133929j992054
$$ 35725970 33850141 31725236 29452261 27120333 24802619 22555772 20421843 18429789
57063A8429789j833482j668346j503435j343550j193159j055567r31597q20686
$$ 18429789 16596307 14927961 13424526 12080976 10887817 9832250 8900653 8079967
57055H079967p22733o37690n64305n00823m46303l99926l59780l23953k92099
$$ 8079967 7357234 6719544 6155239 5654416 5208113 4808187 4448407 4124454 3832355
57046C832355k64538k40439k18448j98396j80693j64651j49164j34570j22122
$$ 3832355 3567817 3327378 3108930 2910534 2729841 2565190 2416026 2281456 2159334
57037B159334j11831j02479r3485q5265p7911p1009o4662n9280n4558m9821m5194
$$ 2159334 2047503 1945024 1851539 1766274 1688363 1617354 1552692 1493412 1438854 1389033 1343839
57026A343839m1205l7568l3505k8864k3867j8180j1414l960L757J2494K3709L8495
$$ 1343839 1302634 1265066 1231561 1202697 1178830 1160650 1149236 1145276 1149033 1161527 1185236 1223731
57014A223731N7442Q0648J07572J38190J73317K09110K29604K11128J41857L7212
$$ 1223731 1281173 1361821 1469393 1607583 1780900 1990010 2219614 2430742 2572599 2609811
57004B609811o8716j47702j91733k07135k02809j86213j64104j41377j19835j00105
$$ 2609811 2541095 2393393 2201660 1994525 1791716 1605503 1441399 1300022 1180187 1080082
56994A080082q3265o9557n7653m6823l8064l1820k6518k0773j5333j1434q762
$$ 1080082 996817 927260 869607 822784 784720 752900 726382 705609 690276 678842 670080
56983F70080o459m666l796l539l948o178j0825j6400k0631k2572k2591k1283j9300
$$ 670080 663621 658955 655159 651620 647672 641494 630669 614269 593638 571066 548475 527192 507892
56970E07892j7349j5499j3105j0033p163n202l861k542j037Q57L384O228Q772
$$ 507892 490543 475044 461939 451906 444743 439541 435680 433138 432101 432958 436342 442570 451342
56957D51342J1089J3615J5704J5747J2916P692P39p250j4550j9088k0575k0569
$$ 451342 462431 476046 491750 507497 520413 528105 528844 521594 507044 487956 467381 446812
56945D46812k0006j8318j5295j2094r584p303m758k388m48J786M922Q647J2548
$$ 446812 426806 408488 393193 381099 371515 364212 359454 357066 356618 358404 363326 371973 384521
56932C84521J6607K0570K3845K6166K7025K4514J6730M757p525j7041k3320k6654
$$ 384521 401128 421698 445543 471709 498734 523248 539978 544735 537210 520169 496849 470195
56920D70195k6901k4907k2819k1596j9974j6987j3704j1324r457p573o393o269
$$ 470195 443294 418387 395568 373972 353998 337011 323307 311983 302526 294953 288560 282291
56908B82291n917m373k759k434k727k247j311j168j685j626p41O0L65P66J842
$$ 282291 276374 272001 269242 266808 264081 261834 260523 259355 257670 256044 255303 255363 255728 256494 258336
56893B58336L486N151O255O765P618R857J3110J5925J7739J9138J9804J8013J3004
$$ 258336 261822 266973 273228 279993 287611 297468 310578 326503 344242 363380 383184 401197 414201
56880D14201O285l31o435j1753j4937j5134j3474j1491r197o060k665J56K837
$$ 414201 420486 420155 413720 401967 387030 371896 358422 346931 337734 331674 329009 329165 332002
56867C32002O160R693J2693J5787K0257K6138L2366L8340M4116M9254N2276N0905
$$ 332002 338162 347855 360548 376335 396592 422730 455096 493436 537552 586806 639082 689987
56855F89987M2658K6594N503j4743k9340l7452m0628l9887l5735k9573k3107j6903
$$ 689987 732645 759239 764742 749999 720659 683207 642579 602692 566957 537384 514277 497374
56843D97374j0834n233k08N431J2988K2084L1329M0288M9606N9661P0152Q0121
$$ 497374 486540 481307 481099 486530 499518 521602 552931 593219 642825 702486 772638 852759
56831H52759Q6822Q5180P0528M2788P529k7116n4465p1448p8557p8247p2984o4549
$$ 852759 939581 1024761 1095289 1138077 1145606 1118490 1064025 992577 914020 835773 762789 698240
56819F98240n4628m4809l5673k6828j8259j0616l827L298J1478K0157K8844L7940
$$ 698240 643612 598803 563130 536302 518043 507427 503600 506898 518376 538533 567377 605317
56807F05317M7474N6097O1799O2236N4304L5883R410j8122m0329n5304o3722o5722
$$ 605317 652791 708888 770687 832923 887227 923110 932520 914398 874069 818765 755043 689321
56795F89321o1769n4505m6920l9579l1751k4105j8045j3277q310k868K211O912
$$ 689321 627552 573047 526127 486548 454797 430692 412647 399370 391060 388192 390403 397315
56783C97315J1903J6983K1492K5694K9803L1929K8984J9734N829r713k3713l3388
$$ 397315 409218 426201 447693 473387 503190 535119 564103 583837 589666 579953 556240 522852
56771E22852l7658l7932l6293l3488k9636k5802k3052k0753j7715j4374j2082
$$ 522852 485194 447262 410969 377481 347845 322043 298991 278238 260523 246149 234067
56760B34067j0769r312p670o708o271n431m359m067m376m085l108k623k996l251
$$ 234067 223298 213986 206316 199608 193337 187906 183547 179480 175104 171019 167911 165288 162292 159041
56746A59041k787k117j734j540j496j667j621q68K33R37J138J011L03r11j579
$$ 159041 156254 154137 152403 150863 149367 147700 146079 145211 145444 146381 147519 148530 148833 147922 146343
56731A46343j066l33l87n28K02R12K02j225j481m21N00Q47J392J999J625M31j96
$$ 146343 145277 144944 144557 144029 144231 145143 145345 144120 142639 142218 142718 143565 144957 146956 148581 149012 148816
56714A48816J68O33Q17J144J345O65m46p34k38j62o27n14L55Q42N48K91L18r4
$$ 148816 148984 149617 150434 151578 152923 153588 153142 152408 152170 152008 151381 150867 151222 152064 152612 152903 153221 153127
56696A53127r30j180o62l78o37m87M58J209R26k5r73j606j575o34N57R50N07N7
$$ 153127 152197 151017 150355 149977 149340 148853 149311 150520 151446 151421 150448 148842 147267 146633 147190 148140 148647 148704
56678A48704l6Q0N92J579K141J459L56J48N22K52m38k91N83Q36K92J81R38J750
$$ 148704 148668 148748 149340 150919 153060 154519 154875 155023 155545 155797 155359 155068 155651 156487 156779 156960 157898 159648
56660A59648K286K925L300K565J130K85J84J9r2N50J356J178O13J099J972J173
$$ 159648 161934 164859 168159 170724 171854 172139 172323 172342 172250 172800 174156 175334 175947 177046 179018 180191
56644A80191j125k469j973j376j695j698n57N96P95O52P22N64K08M63J091Q08
$$ 180191 179066 176597 174624 173248 171553 169855 169298 169894 170689 171341 172063 172627 172835 173298 174389 175197
56628A75197l07o52J26N83K68M68J437J589M70j94M60R08J25n73q5M94J09k85
$$ 175197 174890 174238 174364 174947 175215 175683 177120 178709 179179 178985 179445 180353 180478 179905 179820 180314 180423 180138
56610A80138K88R11O48M23J274K359K371J542O99k02j279j880j759j748k111j850
$$ 180138 180426 181337 181985 182408 183682 186041 188412 189954 190653 190451 189172 187292 185533 183785 181674 179824
56594A79824o31K71J00o0P29J569J370N20j86q21j424j415q59o43o08N45K605
$$ 179824 179193 179464 179564 179504 180233 181802 183172 183692 183506 182685 181261 179846 178987 178344 177736 178281 180886
56577A80886L285J587n13j016m68j18L17J343K123K006J914K579L124K933L099
$$ 180886 184171 185758 185245 184229 183761 183643 183960 185303 187426 189432 191346 193925 197049 199982 203081
56562B03081M345N368N084M725N854P913R473J0345J0688R669O993M292L100K754
$$ 203081 207426 212794 217878 222603 228457 236370 245843 256188 266876 276545 283538 287830 290930 293684
56548B93684K028J376J763K641K882K587K311J687L69r28j625k235k941k871j983
$$ 293684 295712 297088 298851 301492 304374 306961 309272 310959 311328 310400 308775 306540 303599 300728 298745
56533B98745j839l094m238m273m540o087p468p216o353o302o262n065l740l692
$$ 298745 296906 293812 289574 285301 280761 274674 267206 259990 253637 247335 241073 236008 232268 228576
56519B28576m020l198j870j452j476q30k60j025k298k467j880j891k307k118j628
$$ 228576 224556 221358 219488 218036 216560 215730 215470 214445 212147 209680 207800 205909 203602 201484 199856
56504A99856j523j105K00R43j92j691j356J00M60j93r2O69L45j065j658p30M63
$$ 199856 198333 197228 197428 198371 198179 196488 195132 195232 195692 195499 195407 196076 196421 195356 193698 192968 193431
56487A93431J010J167J091P55P67J460J753P42m94n46j11n42j158m71Q95J126
$$ 193431 194441 195608 196699 197454 198221 199681 201434 202176 201682 201136 201025 200483 199325 198854 199749 200875
56471B00875L26J36P73J030O96O39Q35N78J73L49N69J01j23J048K544K558J558
$$ 200875 201201 201337 202110 203140 203836 204475 205310 205888 206061 206410 206979 207080 206957 208005 210549 213107 214665
56454B14665J396K145K480K429K993L632K929J349O70J069J339J454K266L042
$$ 214665 216061 218206 220686 223115 226108 229740 232669 234018 234688 235757 237096 238550 240816 243858
56440B43858K203K45q00n03j22J21J011J925J349k31p81o9J36o85j090m67jm04
$$ 243858 246061 246306 245506 245003 244881 245002 246013 247938 249287 249056 248275 248206 248342 247657 246567 246100 246099 245695
56422B45695r57j093j007o86j28k74j655k782k044n26l42j005l08J685K681J955
$$ 245695 244738 243645 242638 241952 241824 241550 239895 237113 235069 234543 234201 233196 232888 234573 237254 239209
56406B39209J010M92m85j779j981j070n33n97l9J056J188K89jP40J216J055J302
$$ 239209 240219 240711 240226 238447 236466 235396 234863 234266 234227 235283 236471 236760 236759 237499 238715 239770 241072
56389B41072J978J794O56j33l67j048j834j198O61J776J634J674K227J882L81
$$ 241072 243050 244844 245500 245367 245000 243952 242118 240920 241581 243357 244991 246665 248892 250774 251155
56374B51155n95j62P53J642L020M405M288K704J401R72L26p51j079n04k81o60
$$ 251155 250560 250398 251151 252793 255813 260218 264506 267210 268611 269583 269909 269158 268079 267575 267294 266634
56358B66634o17j84l81p77M7J441J161q05k000j492r46j132p07O88J339N65o9
$$ 266634 266017 265833 265452 264675 264722 266163 267324 266519 264519 263027 262081 260949 260242 260930 262269 262834 262765
56341B62765K89L70n23j091m46M82R38J389J831J423M47L27J132J538J519K416
$$ 262765 263054 263424 262901 261810 261364 261846 262784 264173 266004 267427 267874 268201 269333 270871 272390 274806
56325B74806M024M489L571L042L451L449K803K906L790L784K669K032J990R86
$$ 274806 278830 283319 286890 289932 293383 296832 299635 302541 306331 310115 312784 314816 316806 317792
56311C17792p32j014J65L54q84r98R35K577K562K485L206L087J663J225K752L804
$$ 317792 317060 316046 316211 316565 315681 314683 315618 318195 320757 323242 326448 329535 331198 332423 335175 338979
56295C38979K588P70J76k1p02o76O36J400M92l68K68J145J001R43K038L056K703
$$ 338979 341567 342337 342513 342492 341790 341114 341750 343150 343642 343274 343542 344687 345688 346631 348669 351725 354428
56278C54428J797J456J455J739L014M589M432K665J939L129L942L167K778M034
$$ 354428 356225 357681 359136 360875 363889 368478 372910 375575 377514 380643 384585 387752 390530 394564
56264C94564N145M829M648N713O484O102O500Q762J0699J0602J0284J1773J3958
$$ 394564 399709 404538 409186 414899 421383 427485 433985 442747 453446 464048 474332 486105 500063
56251E00063J5159J6180J8238K0469K2020K4072K7453L0731L2763L4587L6905
$$ 500063 515222 531402 549640 570109 592129 616201 643654 674385 707148 741735 778640
56240G78640L8444L8689L9214M0436M0215L7650L4864L2908K9429K2866J5466
$$ 778640 817084 855773 894987 935423 975638 1013288 1048152 1081060 1110489 1133355 1148821
56229A148821R535L980k679r192j4164j8643k3414k6819k7905k8646l0395l1317
$$ 1148821 1158356 1162336 1159657 1150465 1136301 1117658 1094244 1067425 1039520 1010874 980479 949162
56217I49162k9947k8051k7318k6541k4718k3519k3818k3348k0686j8104j7486
$$ 949162 919215 891164 863846 837305 812587 789068 765250 741902 721216 703112 685626
56206F85626j6983j4816j2756j2536j2402j0578q701q387p922n846m248m886n503
$$ 685626 668643 653827 641071 628535 616133 605555 596854 588467 580545 574699 570451 565565 560062
56193E60062l807j646j428j792p30L77j74o35Q47K369J735O03J186J980R11m89
$$ 560062 556255 554609 553181 551389 550659 551036 550862 550227 551074 553443 555178 555781 556967 558947 559858 559369
56177E59369q2Q55N83N59K067K785R77n01J063L120K233J47M04K180K627K348
$$ 559369 559287 560142 560725 561284 563351 566136 567113 566612 567675 570795 573028 573175 573579 575759 578386 580734
56161E80734L388M562L883K994M242N983N676M819N990P822P905P708R603J1975
$$ 580734 584122 588684 592567 595561 599803 605786 611462 616281 622271 630093 637998 645706 655309 667284
56147F67284J2392J2557J4791J6846J5861J4368J6404K0430K2219K2186K3784
$$ 667284 679676 692233 707024 723870 739731 754099 770503 790933 813152 835338 859122
56136H59122K6992K9612L2932L9997M9979O0022P0849Q4987J01235J16303J29854
$$ 859122 886114 915726 948658 988655 1038634 1098656 1169505 1254492 1355727 1472030 1601884
56125A601884J42440J50583J49565J39495J23765J04134Q2444O4197N4232N0820
$$ 1601884 1744324 1894907 2044472 2183967 2307732 2411866 2494310 2558507 2612739 2663559
56115B663559M8938M6514M2475L2875J5734l290j6626k3577k7627k9213k8304
$$ 2663559 2712497 2759011 2801486 2834361 2850095 2846805 2830179 2806602 2778975 2749762 2721458
56104B721458l0526m2377o2382q3891j03984j22470j35394j37916j31769j22400
$$ 2721458 2690932 2648555 2586173 2502282 2398298 2275828 2140434 2002518 1870749 1748349
56094A748349j10804r5420p9246o7037n7681m7168l6805l0570k6867k1193j4628
$$ 1748349 1637545 1542125 1462879 1395842 1338161 1290993 1254188 1223618 1196751 1175558 1160930
56083A160930j1308r803n643k36J567P86K328N607O109M537N378Q027Q308P164
$$ 1160930 1149622 1139819 1134176 1133940 1135507 1136293 1138621 1144228 1150337 1154874 1160252 1168279 1176587 1183751
56069A183751Q845J2163J2605J1383J3119J6521J6809J5364J7181K0730K0484
$$ 1183751 1192596 1204759 1217364 1228747 1241866 1258387 1275196 1290560 1307741 1328471 1348955
56058A348955J7617J7819K0302J9600J6590J6721J8898J7345J3214J2923J6124
$$ 1348955 1366572 1384391 1404693 1424293 1440883 1457604 1476502 1493847 1507061 1519984 1536108
56047A536108J6829J5408J7625K2650K4037K2056K3053K7096K8306K6910K8745
$$ 1536108 1552937 1568345 1585970 1608620 1632657 1654713 1677766 1704862 1733168 1760078 1788823
56036A788823L3289L4450L2802L4513L8801L9282L6992L8890M4172M5675M4058
$$ 1788823 1822112 1856562 1889364 1923877 1962678 2001960 2038952 2077842 2122014 2167689 2211747
56025B211747M6527N2145N3081N0005N1175N6488N7818N5184N6714O2421O4225
$$ 2211747 2258274 2310419 2363500 2413505 2464680 2521168 2578986 2634170 2690884 2753305 2817530
56014B817530O2372O5281P2678P5803P4905P9003Q7805R1901R1670R7220J08515
$$ 2817530 2879902 2945183 3017861 3093664 3168569 3247572 3335377 3427278 3518948 3616168 3724683
56003C724683J14916J15703J21197J32100J38253J39630J47170J60867J69017
$$ 3724683 3839599 3955302 4076499 4208599 4346852 4486482 4633652 4794519 4963536
55994D963536J71456J80707J97617K09625K15995K29862K51944K68037K76609
$$ 4963536 5134992 5315699 5513316 5722941 5938936 6168798 6420742 6688779 6965388
55985F965388K92232L17423L38636L54750L80683M17648M49977M76802N15521
$$ 6965388 7257620 7575043 7913679 8268429 8649112 9066760 9516737 9993539 10509060
55976A0509060N68195O17796O63701P25494Q04980Q82386R57603J054966J179037
$$ 10509060 11077255 11695051 12358752 13084246 13889226 14771612 15729215 16784181 17963218
55967A7963218J309157J446921J622197J841824K083538K353124K692897L120732
$$ 17963218 19272375 20719296 22341493 24183317 26266855 28619979 31312876 34433608
55959C4433608L622264M219890M983297N955680P147338Q623425J0507847J2866051
$$ 34433608 38055872 42275762 47259059 53214739 60362077 68985502 79493349 92359400
55951I2359400J5669298J8890388K2518149K6469931L0648626L5018582L9145858
$$ 92359400 108028698 126919086 149437235 175907166 206555792 241574374 280720232
55944B80720232M1345236L8751318K9161393J3286853n019045k1058497l1932388
$$ 280720232 322065468 360816786 389978179 403265032 398245987 377187490 345255102
55937C45255102l7293032l8300440l6408636l2888027k8746436k4635421k0847833
$$ 345255102 307962070 269661630 233252994 200364967 171618531 146983110 126135277
55930A26135277j7496529j4649561j2302116j0360797q736584p398469o313285
$$ 126135277 108638748 93989187 81687071 71326274 62589690 55191221 48877936
55923D8877936n409334m633945l985293l457977l011530k617344k285035k017752
$$ 48877936 43468602 38834657 34849364 31391387 28379857 25762513 23477478 21459726
55915B1459726j787033j573733j391083j246313j118731r95051q89452q09886
$$ 21459726 19672693 18098960 16707877 15461564 14342833 13347782 12458330 11648444
55907A1648444p38863o65284o02845n59652n20111m73639m32628m05763l80356
$$ 11648444 10909581 10244297 9641452 9081800 8561689 8088050 7655422 7249659 6869303
55898F869303l47013l16514k97019k78161k52472k30191k18592k07540j89126
$$ 6869303 6522290 6205776 5908757 5630596 5378124 5147933 4929341 4721801 4532675
55889D532675j71838j62505j53097j37500j23217j14886j03884q5312o8200n8159
$$ 4532675 4360837 4198332 4045235 3907735 3784518 3669632 3565748 3480436 3412236 3354077
55879C354077m6555k7280p935N738K0322L9244N2344N1214M0600K5300Q75l2724
$$ 3354077 3307522 3280242 3272307 3278045 3298367 3337611 3389955 3441169 3481769 3507069 3507944 3475220
55867C475220o3122q1978r6562j15110j33312j44704j51730j56677j53849j40630
$$ 3475220 3412098 3330120 3233558 3118448 2985136 2840432 2688702 2532025 2378176 2237546
55857B237546j25326j14782j04851r1406p9622p3635o7902n7696m8078m3943m1142
$$ 2237546 2112220 1997438 1892587 1801181 1721559 1647924 1580022 1522326 1474248 1430305 1389163
55846A389163l5715l2066l3649l5096l1827k8277k8758k9206k5830k2935k4278
$$ 1389163 1353448 1321382 1287733 1252637 1220810 1192533 1163775 1134569 1108739 1085804 1061526
55835A061526k5336k1903j8044j7967j8275j5596j3618j5304j6276j3187j0638
$$ 1061526 1036190 1014287 996243 978276 960001 944405 930787 915483 899207 886020 875382
55824H75382j2494j4415j2322j0274j2403j4836j3293j1306j3150j5606j4332
$$ 875382 862888 848473 836151 825877 813474 798638 785345 774039 760889 745283 730951
55813G30951j1811j1577j1185p989n448o537p324m097m83n47j190J487M581M390
$$ 730951 719140 707563 696378 688389 682941 676404 669080 664983 664500 663953 662763 664250 668831 673221
55799F73221L870O789J0142R649P232O096L933j844p601r356r945j3209j6386
$$ 673221 677091 683880 694022 703671 710903 716999 720932 719088 711487 702131 692186 678977 662591
55786F62591j5431j2868j2916j3477j0400n509l211l170l118m717r715j4273j4085
$$ 662591 647160 634292 621376 607899 597499 591990 588779 585609 582491 577774 568059 553786 539701
55773E39701j1444j0622j0146o442j216J778L846Q091J2163J1233N722k09n305
$$ 539701 528257 517635 507489 501047 499831 501609 505455 513546 525709 536942 542664 542455 537150
55760E37150j0418j3894j3948j2982j3842j4487j1951q505p977q955p776n454
$$ 537150 526732 512838 498890 485908 472066 457579 445628 437123 429146 420191 412415 406961
55748D06961n470p125p264o359o986q286p671o119o267p174o219m125l045j947
$$ 406961 401491 394366 387102 380743 373757 365471 357800 351681 345414 338240 332021 327896 324851 322904
55734C22904Q95L222J970j094k170j639k184l134k261j043k412n080n596m412
$$ 322904 323799 327021 328991 327897 325727 324088 321904 318770 316509 315466 313054 307974 302378 297966
55720B97966m452n371m679k999k822l439k360m49l86j339k93K447M120M701O153
$$ 297966 293514 288143 283464 280465 277643 274204 271844 271395 271009 269670 269377 271824 275944 280645 286798
55705B86798P653O620L650J582N01j693m671o243o667p860r224q742p210p000
$$ 286798 294451 301071 304721 306303 306804 305111 300440 294197 287530 279670 270446 261704 254494 247494
55691B47494p553o591m703m289m859l953j856q70p95L90K149K243J216J567L031
$$ 247494 239941 233350 228647 224358 219499 215546 213690 212820 212025 212415 214564 216807 218023 219590 222621
55676B22621L123J793J175J261J50j848k617k358l105m527m365k690j710j662
$$ 222621 225744 227537 228712 229973 230123 228275 225658 223300 220195 215668 211303 208613 206903 205241
55662B05241r58N5m18j659j150R85K201K113K843M847O232O368O527O870O207
$$ 205241 204283 204338 203920 202261 201111 202096 204297 206410 209253 214100 220332 226700 233227 240097 246304
55647B46304M769L916L274J370j229k708l356m791o447o420n259n221o181n963
$$ 246304 251073 254989 258263 259633 258404 255696 252340 247549 241102 234682 229423 224202 218021 212058
55633B12058m498l843m350m377l707l674m076l436k154j916k286j391K66L74j082
$$ 212058 207560 203717 199367 194990 191283 187609 183533 180097 177943 176027 173741 172350 172616 172990 171908
55618A71908j854j472j548k232j976r27r07j837j769n96k87j214j674j202j094
$$ 171908 170054 168582 167034 164802 162826 161899 160992 159155 157386 156790 156503 155289 153615 152413 151319
55603A51319j478j122k75m16j262j204n54r60j823r79J130J778N60j54L75K93
$$ 151319 149841 148719 148444 148028 146766 145562 145008 144048 142225 141246 142376 144154 144714 144560 144935 145228
55587A45228q88j241j63M62j48l47O87J539J338R82P83j56j465j345L46J654J807
$$ 145228 144340 143099 142936 143398 143250 142903 143590 145129 146467 147449 148232 148076 146611 145266 145612 147266 149073
55570A49073K145L201L782L636M057N193N491M528L636L144J815m22j970k433
$$ 149073 151218 154419 158201 161837 165894 171087 176578 181106 184742 187886 189701 189279 187309 184876
55556A84876l142m325m546l635l310m145m702m337m192m663m590l651k919k508
$$ 184876 181734 177409 172863 169228 165918 161773 157071 152734 148542 143879 139289 135638 132719 130211
55542A30211j323K77M38r34j651p67J90J87J41O02P17L60O54J545J409r4j330
$$ 130211 128888 129165 129603 128669 127018 126251 126441 126628 126769 127371 128088 128448 129102 130647 132056 131962 130632
55525A30632j521j698k238k096j304j398k544k876j689o11o99r23m99j64k30J42
$$ 130632 129111 127413 125175 123079 121775 120377 117833 114957 113268 112657 111958 111035 110536 110372 110142 110284
55509A10284Q25M43r30j375l18N03J63kQ75J599J234N12o2j087k258k043m29N18
$$ 110284 111109 111552 110622 109247 108929 109432 109595 109593 110468 112067 113301 113813 113751 112664 110406 108363 107934 108452
55491A08452k1l37N96J261L81r03j190q99p52k54Q20J451J142Q92J241J213L11
$$ 108452 108431 108094 108690 109951 110332 109429 108239 107340 106588 106334 107154 108605 109747 110639 111880 113093 113404
55474A13404m43l90l12o57o47rM15M32Q12J232L71j308j539M4R85n7j212p20L34
$$ 113404 112961 112571 112259 111602 110955 110946 111361 111793 112605 113837 114208 112900 111361 111405 112390 112333 111121 110401 110735
55455A10735K87m42q11j079j560j330N4J335J436R77O72J11p30p49K71Q45K97
$$ 110735 111022 110580 109769 108690 107130 105800 105854 107189 108625 109602 110274 110385 109655 108906 109177 110022 110319
55438A10319m4O63J170M85l26k11Qn25r59m29K70K84K90R88J644J514J177J139
$$ 110319 110275 110938 112108 112593 112267 112056 112064 111539 110580 110151 110421 110705 110995 111983 113627 115141 116318 117457
55420A17457P89j3q9J062K149K174J937K305K861L326M310N430M869K186n30j683
$$ 117457 118246 118233 118144 119206 121355 123529 125466 127771 130632 133958 138268 143698 148567 150753 150223 148540
55404A48540k203l142l598k820k114k625l187k413j146q58j260j446j662k118
$$ 148540 146337 143195 139597 136777 134663 132038 128851 126438 125292 124434 123174 121728 120066 117948
55390A17948j739j17J009K27j142j213n71r48k199k821k395j532l21J175J890
$$ 117948 116209 116092 117101 117328 116186 114973 114402 113454 111255 108434 106039 104507 104186 105361 107251
55375A07251J057k27l95M25J040J055O95j43j303j877j530j216j479j431n78n9
$$ 107251 108308 108081 107686 108111 109151 110206 110901 110758 109455 107578 106048 104832 103353 101922 101344 101285
55359A01285o28j099l77N26K98l64j12O98R01O24P05R91R40Q91J172J025m4j001
$$ 101285 100657 99558 99181 99707 100005 99641 99529 100227 101128 101752 102457 103448 104388 105279 106451 107476 107432 106431
55341A06431q53l07l83o53l94k12p75j248o97J56K90K77R81J588Q43o45j284q73
$$ 106431 105578 105271 104888 104235 103841 103629 102854 101606 100909 101065 101355 101632 102613 104201 105044 104399 103115 102242
55323A02242l92j69J39L90K94J95L61L16q0k5O81Q75jo93k52K63k15p59k53M44
$$ 102242 101850 101681 101820 102210 102504 102699 103060 103376 103296 103271 103952 104827 104826 104133 103881 104144 103929 103170 102917 103361
55303A03361P1o86n35R5J20l4N19J038L04j072j584j152o57p6R67J642J015j66
$$ 103361 103432 102746 102211 102306 102426 102392 102911 103949 104253 103181 101597 100445 99788 99712 100679 102321 103336 103170
55285A03170n91m44n54n48K33R87O67j2K32R64R63N37P81J370J184M26J17J67
$$ 103170 102579 102135 101581 101033 101266 102253 102920 102908 103140 104104 105067 105604 106385 107755 108939 109365 109482 109649
55267A09649r4k80K37P52L82o7N27J369J008m3k88N3k92r87o59M45Q07L43L61
$$ 109649 109555 109275 109512 110264 110646 110579 111106 112475 113483 113440 113152 113205 112913 111926 111267 111712 112519 112862 113223
55248A13223J069J414J145R02N08o55j789j419O6P50k9j121j694j937j815j019
$$ 113223 114292 115706 116851 117753 118261 117606 115817 114398 114464 115214 115185 114064 112370 110433 108618 107599
55232A07599q6R0k07j21Q9l31r07n97K73O55P00J139J418O33l57m7R92R93O7j17
$$ 107599 107513 107603 107396 107275 107364 107033 106126 105529 105802 106457 107157 108296 109714 110347 109990 109943 110935 111928 111995 111878
55212A11878N82O28k35n88rL49J52M12J242J395N33j52n1R5p1Q0O30P86M17J97
$$ 111878 112460 113088 112853 112265 112256 112605 112757 113169 114411 115806 116339 116187 116136 116231 116160 116240 116870 117656 118073 118270
55192A18270P3o08j420j219k35J04m07n98j88j57o28n86Ko5r62j395q63l75m54
$$ 118270 118343 117735 116315 115096 114861 114965 114558 113960 113772 113615 112987 112401 112403 112338 111376 109981 109118 108743 108289
55173A08289l91R3L73M35R61J564J043k52n51M24R62K98k19K66P09L75K29R62
$$ 108289 107898 107991 108364 108799 109760 111324 112367 112115 111564 111988 112950 113248 113029 113295 114004 114379 114608 115570
55155A15570J553J149N48N41M38m85j469j534r67m45J15Q46J219J007Q39R71P21
$$ 115570 117123 118272 118820 119361 119799 119314 117845 116311 115344 114899 115014 115860 117079 118086 118925 119896 120617
55138A20617j42p41n57k91m29k68O50J442J218M79J32Q9j86o04q10r23j145j261
$$ 120617 120475 119734 119177 118886 118457 118189 118839 120281 121499 121978 122110 122199 122013 121409 120599 119676 118531 117270
55120A17270j110r38q75p37o47r90j537j469n95L59Q32R43Q39N69O22J409K233
$$ 117270 116160 115222 114347 113610 112963 111973 110436 108967 108372 108731 109563 110506 111345 111914 112536 113945 116178
55103A16178J946P58NJ44L71L33O02J184J147K41n61o17l31j8N40J058P73j02
$$ 116178 118124 118882 118887 119031 119402 119735 120337 121521 122668 122909 122348 121731 121400 121382 121922 122980 123753 123651
55085A23651m26j7L5o62j077n85R2L18M57P03M94k65p77p13o21n71M8Q91O19q44
$$ 123651 123225 123208 123243 122581 121504 120919 121011 121329 121786 122489 122983 122718 121941 121228 120607 120036 120084 120975 121594 120750
55065A20750j721r66K29M63Q9M4J94L5j54K6K85L90O87J097P56n52j654j524n00
$$ 120750 119029 118063 118292 118755 118844 118888 119082 119117 118963 118989 119274 119664 120351 121448 122204 121652 119998 118474 117974
55046A17974N86J348J400L18j239j685n59P69J049N42q5p50j196p54K91O23m9
$$ 117974 118560 119908 121308 121626 120387 118702 118143 118912 119961 120503 120418 119668 118472 117718 118009 118632 118583
55029A18583l97K58P97L54j86K5K54j69l66M55J266P43n97j326j129n39L06J228
$$ 118583 118186 118444 119241 119595 119409 119434 119688 119519 119153 119608 120874 121617 121020 119694 118565 118026 118332 119560
55011A19560J376M05o39q88r77j547j648k95J485J927J077L91M32O45P85J056
$$ 119560 120936 121341 120702 119814 118837 117290 115642 115347 116832 118759 119836 120227 120659 121304 122089 123145
54995A23145J167Q42P64J620K561K170O71k91pN48M23j38m19k62k5j03n91j062
$$ 123145 124312 125154 125918 127538 130099 132269 132940 132649 132642 133190 133613 133475 133056 132794 132769 132666 132075 131013
54977A31013q74P0J130J795K160K339K044J261N57K68K4m80r76j269j511j534
$$ 131013 130139 130209 131339 133134 135294 137633 139677 140938 141495 141763 141787 141307 140331 139062 137551 136017
54961A36017q59J90N29l9m33j15J04k37k41O90J582J499J119J359J666J166M04
$$ 136017 135158 135348 135877 135838 135405 135290 135394 135157 134916 135606 137188 138687 139806 141165 142831 143997 144401
54944A44401M14Q45N61m81j350j569j231l19Q49J223L07p60o19M39J255J687K384
$$ 144401 144815 145660 146221 145740 144390 142821 141590 141271 142120 143343 143650 142890 142271 142710 143965 145652 148036
54927A48036L271L644L433L179L118L332M232N850P256P844Q421R748J0784R896
$$ 148036 151307 154951 158384 161563 164681 168013 172245 178095 185351 193195 201616 211364 222148 232044
54913B32044P274M489K108n83l698o275p841q975r996j0311r391p630n940n028
$$ 232044 239318 243807 245915 245332 241634 235359 227518 218543 208547 198236 188845 181215 175275 170247
54899A70247m970n015m140k376j051j048j526j255m59j59l16m9O51Q91N14M65
$$ 170247 165277 160262 156122 153746 152695 151647 150121 148866 148407 148248 147932 147883 148534 149425 149939 150404
54883A50404J357K657L529L742L697M120N552P650R289R865J0030J0443J0498
$$ 150404 151761 154418 157947 161689 165386 169506 175058 182708 191997 201862 211892 222335 232833
54870B32833R103O229K710q84m271o765p795p825p857q212q522q501p944o498
$$ 232833 241936 248165 250875 249991 245720 238955 231160 223335 215478 207266 198744 190243 182299 175801
54856A75801m341k624k270k802l178l241l367l354k787k064j842j863j437p61
$$ 175801 171460 168836 166566 163764 160586 157345 153978 150624 147837 145773 143931 142068 140631 139870
54842A39870n81r26j226j392j666j722j038M9O81O64L59k27j129j639r55M66J338
$$ 139870 139289 138363 137137 135745 134079 132357 131319 131368 132049 132713 133072 132845 131716 130077 129122 129588 130926
54825A30926J163M84j84p00q04l34K03J77k37m71n11o16m46M59J675K309K120
$$ 130926 132089 132573 132389 131689 130885 130551 130754 130931 130694 130223 129712 129096 128650 129109 130784 133093 135213
54808A35213J416L80o83j008k89N67O43K97K54K04l82q23k18P31N68n34r77j67
$$ 135213 136629 137009 136326 135318 135029 135596 136239 136536 136790 136994 136612 135789 135571 136302 136870 136336 135359 135192
54790A35192Q00R47M47k03p58q92m04K47N79Q96J507J676P76j42M08J954K661
$$ 135192 135992 136939 137386 137183 136425 135533 135129 135376 135955 136851 138358 140034 140810 140668 141076 143030 145691
54773A45691K161J881K546L340L777M591O146P599Q300Q753R551J0463J1077J1240
$$ 145691 147852 149733 152279 155619 159396 163987 170133 177732 186032 194785 204336 214799 225876 237116
54759B37116J0600Q687N844L014L90k703o323r428j1121j1437j0754r426q080
$$ 237116 247716 256403 262247 265261 265651 262948 256625 247197 236076 224639 213885 204459 196379
54746A96379p201o364m918l305k567k571k136r42R2M50N80O35J64o08o48K77J179
$$ 196379 189178 182814 177896 174591 172024 169453 167317 166375 166467 166917 167497 168132 168296 167688 167040 167317 168496
54729A68496J478J703K180K383K181K405L556N074O482Q095R914J0974J0521Q913
$$ 168496 169974 171677 173857 176240 178421 180826 184382 189456 195938 204033 213947 224921 235442 244355
54715B44355O758M115J068j847m391o916r325j0646j0218q614o895n635m972m818
$$ 244355 251113 255228 256296 254449 250058 243142 233817 223171 212953 204339 197444 191809 186837 182019
54701A82019m701m108l271k863k851k579j975j614j555j260q67j164k077k469
$$ 182019 177318 173210 169939 167076 164225 161646 159671 158057 156502 155242 154375 153211 151134 148665
54687A48665j829r12l38J29N42L67l14n69j23J28k51n14k62k37q18j116n87j97
$$ 148665 146836 145924 145586 145715 146257 146624 146310 145741 145618 145746 145495 144981 144719 144482 143664 142548 141961 141764
54669A41764q71j874j979j245n81l06k53m98r77j047l57N01R19J108J296J035
$$ 141764 140893 139019 137040 135795 135214 134908 134655 134157 133180 132133 131776 132277 133196 134304 135600 136635
54653A36635J64m43j18N15O34N91J055J580J283L32l66n34m89k46K98O55M02J08
$$ 136635 136799 136356 136238 136753 137387 137978 139033 140613 141896 142228 141862 141328 140839 140593 140891 141546 141948 142056
54635A42056O02J554J899J442R41P85O31L39K09J72k96j193j725j349n03K1L3
$$ 142056 142658 144212 146111 147553 148494 149279 149910 150249 150458 150630 150334 149141 147416 146067 145564 145585 145618
54618A45618rL15R25J361J233N68k38p73q57o00l39m09o53m49M58J358J382O68
$$ 145618 145609 145924 146849 148210 149443 150011 149773 149000 148143 147543 147204 146795 146142 145693 146151 147509 148891 149559
54600A49559O2j37l27o43p07m41k51k95l20k67k28J38J121J941J444oo87N2R02
$$ 149559 149621 149484 149157 148514 147807 147366 147115 146820 146500 146233 146005 146143 147264 149205 150649 150643 149956 150008 150910
54581A50910P32J48P3R5n78j494j598r29m57o39j060j235r75k58O27J109J025
$$ 150910 151642 151790 151863 151958 151380 149886 148288 147359 146902 146263 145203 143968 142993 142735 143362 144471 145496
54564A45496Q98J061J102O46J20P4L05K55j10m02l67Q0Q75J493J228J98o21o94
$$ 145496 146394 147455 148557 149203 149323 149397 149702 149957 149847 149445 149078 149158 150033 151526 152754 152952 152331 151637
54546A51637n37n87m10L42J085J206J046J149J281R63L73q4m77q55o65M17J638
$$ 151637 151100 150513 150103 150445 151530 152736 153782 154931 156212 157175 157548 157464 156987 156132 155467 155884 157522
54529A57522J996J472P07K1n47p61n93n24p42o42P0N74J18n65k53R15J682J479
$$ 157522 159518 160990 161697 161718 161171 160410 159817 159293 158551 157909 157979 158553 158671 158106 157853 158768 160450 161929
54511A61929Q08J31n23r26o67O2M99K49l81r07j045p39k69j42m27n66k52J8k10
$$ 161929 162737 162868 162345 161419 160752 160814 161313 161562 161181 160274 159229 158490 158221 158079 157652 157086 156834 156852 156642
54492A56642n55m89k82l94n42k15K87K91j34l85l55l24j45N19J329J586J306J152
$$ 156642 156087 155598 155316 154922 154380 154165 154452 154743 154609 154224 153869 153545 153400 153919 155248 156834 158140 159292
54474A59292J367J601J683J767J769J396Q45P46J330K105K379J783M46r18j447
$$ 159292 160659 162260 163943 165710 167479 168875 169720 170466 171796 173901 176280 178063 178509 177591 176144
54459A76144j036m94m27n15l38k60o89j101p30J73O91N99L92L04J12j93m66r00
$$ 176144 175108 174614 174187 173672 173334 173074 172385 171284 170554 170727 171418 172017 172409 172713 172825 172632 172166 171266
54441A71266j642k101j558l31N49O89N00J49o61j790k478k248j322j06J079J718
$$ 171266 169624 167523 165965 165634 166183 166872 167372 167521 166860 165070 162592 160344 159022 158916 159995 161713
54425A61713J354L70j75K82J202J649J251L51m04n79k26L06P91J131R69m3j390
$$ 161713 163067 163437 163262 163544 164746 166395 167646 167997 167593 167014 166788 167094 167885 169016 169985 169942 168552
54408A68552j912j288n23l82k72N42J506J625J099R12J241J487J498J638J854
$$ 168552 166640 165352 164829 164447 164175 164717 166223 167848 168947 169859 171100 172587 174085 175723 177577
54393A77577J761J471J294R80K49k51K13J039R54ko31n54n94j081j258p81l87
$$ 177577 179338 180809 182103 183083 183332 183081 183294 184333 185287 185285 184654 184100 183506 182425 181167 180386 179999
54376A79999o06r74j063j138j293j011j38O35Q14P75Q31N64l14j162j241o77p0
$$ 179999 179393 178419 177356 176218 174925 173914 173776 174411 175225 176000 176831 177395 177081 175919 174678 174001 173931
54359A73931K81L04p5n84o50k39n3m37q05o28l20m38o49l09L47M75j57q92j039
$$ 173931 174212 174516 174441 173857 173207 172968 172915 172478 171673 171045 170725 170287 169638 169329 169676 170151 169994 169102 168063
54340A68063m94L16P03J31j131k015j874j387j644k517k728j681k96K64R2J02
$$ 168063 167569 167885 168588 168719 167588 165573 163699 162312 160668 158151 155423 153742 153446 153710 153802 153904
54324A53904N78R18P60N05N59O53M09P2J36O33J288K022K674K595J384j31p24
$$ 153904 154482 155400 156160 156665 157224 157877 158286 158358 158494 159127 160415 162437 165111 167706 169090 168959 168235
54307A68235m32l60p87p71L2N76J30m82l37Q2q0m40j80L39J90m09m27J97M74l9
$$ 168235 167803 167443 166656 165885 165917 166493 166623 166141 165804 165886 165806 165366 165186 165525 165715 165306 164879 165076 165550 165511
54287A65511p88j285j497j279n00K86M05K15N88J375J591J089O98O35J50r47j726
$$ 165511 164723 163438 161941 160662 160162 160448 160853 161068 161656 163031 164622 165711 166409 167044 167194 166247 164521
54270A64521j579j078q28n87p1L03J92k0L6P3j08J6Q89K004K504K267J759J201
$$ 164521 162942 161864 161036 160449 160378 160681 160873 160853 160889 160962 160854 160870 161759 163763 166267 168534 170293 171494
54252A71494M95k89q20q90o15l75n35j051j367j105o59o93j172j549j691j845
$$ 171494 171989 171700 170880 169990 169375 169000 168465 167414 166047 164942 164283 163590 162418 160869 159178 157333
54236A57333j765q75N03J168O31j64k42J20Q1m81j067j400j494j244n66K11O46
$$ 157333 155568 154693 155196 156364 156995 156831 156589 156709 156790 156309 155242 153842 152348 151104 150538 150749 151395
54219A51395P00O47N90L98K1l60m72j64L91Q12R08Q99R91R73N56j20p50j352j960
$$ 151395 152095 152742 153332 153730 153751 153391 152919 152755 153146 153958 154866 155765 156756 157729 158285 158165 157415 156063 154103
54200A54103k178j632p11r7K26P49J406J609J271Q96O59L27O4L46R09Q79J20m32
$$ 154103 151925 150293 149582 149485 149711 150460 151866 153475 154746 155642 156301 156628 156692 157038 157947 158826 158946 158514
54182A58514k20K14K67J91M20P74R11Q35N58p4q58j232j190j407k059k269j346
$$ 158514 158294 158508 158775 158966 159386 160160 161071 161906 162464 162390 161532 160300 159110 157703 155644 153375 152029
54165A52029J63J252J631J516R02j60j027j005k16N63P62L82j82l39L16J463K180
$$ 152029 152192 153444 155075 156591 157493 157333 156306 155301 155085 155648 156410 156792 156610 156271 156587 158050 160230
54148A60230J890R05q7o34n82p5K85r3r26j288q57l18k08j98J03M05L64K70M72
$$ 160230 162120 163025 162938 162304 161722 161647 161932 161839 160913 159625 158768 158450 158242 158044 158147 158552 158916 159186 159658
54129A59658O32K34n03q69n90l3L18K45j60n96q75j171j619j780j056L00J293
$$ 159658 160290 160524 160021 159152 158562 158529 158847 159092 158932 158336 157461 156290 154671 152891 151835 152135 153428
54112A53428J441J187J003Q55P18Q00R68P75L59M28J041J339R07M05L84M36J24
$$ 153428 154869 156056 157059 157914 158632 159432 160400 161175 161534 161962 163003 164342 165249 165654 166038 166474 166598
54095A66598k16k85m51q38p43J94J121J180P69O46O06J03n62p92p85r56q77l6
$$ 166598 166382 166097 165646 164808 164065 164259 165380 166560 167329 167975 168581 168684 168122 167330 166545 165589 164712 164676
54077A64676R38J047N29L76O08M16j99l50K23Q52J260J861K509K288J049l7j25
$$ 164676 165614 166661 167190 167566 168174 168590 168391 168041 168264 169116 170376 172237 174746 177034 178083 178046 177921
54060A77921M8o76k103k913k280o54R16J711J668J185P61O99J036J634K229K576
$$ 177921 177969 177293 175190 172277 169997 169343 170259 171970 173638 174823 175584 176283 177319 178953 181182 183758
54044A83758K671K736K809K622K045J426J176J266J423J569J823K275L069M333
$$ 183758 186429 189165 191974 194596 196641 198067 199243 200509 201932 203501 205324 207599 210668 215001
54030B15001N704O339N844M912M526M803N085M940M468L923L506L370L365K995
$$ 215001 220705 227044 232888 237800 242326 247129 252214 257154 261622 265545 269051 272421 275786 278781
54016B78781K121J390J449J974K144J775J319R15K55o66j438j887k224k440k287
$$ 278781 280902 282292 283741 285715 287859 289634 290953 291868 292123 291457 290019 288132 285908 283468 281181
54001B81181j941k025k731l501l849l992m284m544m281l360k114r80k89k25p29
$$ 281181 279240 277215 274484 270983 267134 263142 258858 254314 250033 246673 244559 243579 243290 243065 242336
53986B42336j453j984k117j888j457j019p12m97j21P70K347M365O211P342P767
$$ 242336 240883 238899 236782 234894 233437 232418 231706 231209 231088 231858 234205 238570 244781 252123 259890
53971B59890Q053Q862J0328J1695J1468Q394K765l420q040j0508j1492j1430j0196
$$ 259890 267943 276805 287133 298828 310296 318690 321455 318035 309995 299487 287995 276565 266369
53958B66369q114o212n042m128k962j904j472j432j235q83p33p40m89K57J395
$$ 266369 258255 252043 247001 242873 239911 238007 236535 235103 233868 232985 232252 231512 231023 231280 232675
53943B32675K685L735M112L773L167K708K502K702L557M829N758N924N632N186
$$ 232675 235360 239095 243207 246980 250147 252855 255357 258059 261616 266445 272203 278127 283759 288945
53929B88945M429L414K662K269J526P2j216j328n35J05J95J71M29J024J955L081
$$ 288945 293374 296788 299450 301719 303245 303317 302101 300773 300238 300343 300538 300709 301138 302162 304117 307198
53913C07198L970M400M652M954N117N196N788P030Q011Q002P553P457P284O130
$$ 307198 311168 315568 320220 325174 330291 335487 341275 348305 356316 364318 371871 379328 386612 392742
53899C92742M216K609J642P45l27j267k000k684l060k818k449k694l288l381l054
$$ 392742 396958 399567 401209 401954 401627 400360 398360 395676 392616 389798 387349 384655 381367 377986 374932
53884C74932l223m039m594m454m351m942n807o128n692m875m144l860m002m108
$$ 374932 371709 367670 363076 358622 354271 349329 343522 337394 331702 326827 322683 318823 314821 310713
53870C10713l828l450l363l360l116k936l205l440l031k529k923l854l919k870
$$ 310713 306885 303435 300072 296712 293596 290660 287455 284015 280984 278455 275532 271678 267759 264889
53856B64889j986k055k423k463k573k992l009k230j558j911k703k724j857r90
$$ 264889 262903 260848 258425 255962 253389 250397 247388 245158 243600 241689 238986 236262 234405 233415
53842B33415n90l08Q9K55k43j309k251k312j413m15k55q65j397j434j246r57l28
$$ 233415 232825 232517 232606 232861 232618 231309 229058 226746 225333 224918 224663 223798 222401 220967 219721 218764 218436
53825B18436M16N56M3k09L14R68J084J016J319J668J492J086J106J372J137L87
$$ 218436 218852 219408 219451 219242 219556 220524 221608 222624 223943 225611 227103 228189 229295 230667 231804 232191
53809B32191PN55J630K556L204L997N364P306R327J0939J2279J4002J6324J8391
$$ 232191 232198 232753 234383 236939 240143 244140 249504 256810 266137 277076 289355 303357 319681 338072
53795C38072J8834J6754J2119N721r33o113q857r489q936p815o382m988l957l210
$$ 338072 356906 373660 385779 391500 390567 384454 375597 366108 357172 349357 342975 337987 334030 330820
53781C30820k450j716j363j480j736j862k046k608l419l867l516k720k359k866
$$ 330820 328370 326654 325291 323811 322075 320213 318167 315559 312140 308273 304757 302037 299678 296812
53767B96812l734m223m299m484m893m968m296l207k307j705j081k52N35R15Q19
$$ 296812 293078 288855 284556 280072 275179 270211 265915 262708 260401 258696 257615 257363 257898 258813 259632
53752B59632N04K65J03k10p56j380j985k675l426l933m007l834l549k958k036
$$ 259632 260136 260401 260504 260294 259538 258158 256173 253498 250072 246139 242132 238298 234749 231791 229755
53737B29755j335j285j433j026j14N40N74L18O9k33n64o73n08k62K0L85N76L14
$$ 229755 228420 227135 225702 224676 224562 225102 225676 225994 226063 225830 225266 224593 224085 223823 223843 224228 224804 225118
53719B25118j28k16M4J98J49J27Jn44j120q77K52J362J827J898J847J467Q34O27
$$ 225118 224990 224774 224818 225016 225165 225292 225293 224749 223629 222752 223004 224366 226193 228091 229938 231405 232239 232866
53701B32866J130J599J236L26j30M08J588K555K658K078J763K256K799K298J077
$$ 232866 233996 235595 236831 237157 237027 237435 239023 241578 244236 246314 248077 250333 253132 255430 256507
53686B56507N28R43J022q1j484k052k001k093k123j358N3J172J462J127N35m0
$$ 256507 257035 257978 259000 258919 257435 255383 253382 251289 249166 247808 247861 249033 250495 251622 252157 252117
53670B52117l80n19p28r26o55J5K32l73r95q71m76n30o24Q7J228J523N82p26j580
$$ 252117 251737 251218 250490 249564 248909 248924 249156 248783 247788 246917 246441 245911 245287 245374 246602 248125 248707 247981 246401
53651B46401j859j567o88K13K06p46j460q45Q69K439K767J743K75m25rO10L93
$$ 246401 244542 242975 242287 242500 242706 241960 240500 239655 240524 242963 245730 247473 247748 247323 247314 247924 248317
53634B48317n37j193j140q25n43P1J196K170K203J400N92L86O89J121J506J892
$$ 248317 247780 246587 245447 244622 244079 244150 245346 247516 249719 251119 251711 252097 252786 253907 255413 257305
53618B57305K283K522K489K340K323K458K552K566K621K649K388J899J689J976
$$ 257305 259588 262110 264599 266939 269262 271720 274272 276838 279459 282108 284496 286395 288084 290060
53604B90060K288K183J975K218K703K697K094J641J867K278J968P67n70j207r88
$$ 290060 292348 294531 296506 298724 301427 304124 306218 307859 309726 312004 313972 314739 314169 312962 311974
53589C11974l85O1M9n16j496k363k476j827j182j058r84l46M03K74o61j275j084
$$ 311974 311589 311650 311699 311183 309687 307324 304848 303021 301839 300781 299797 299451 299854 300128 299467 298192 297108
53572B97108q49j073j161o89m10j022j820j737j090r80j383j237k84N41P35R56
$$ 297108 296259 295186 294025 293336 292926 291904 290084 288347 287257 286277 284894 283657 283373 283914 284649 285605
53556B85605J722K466K502K144K090K278K071J312N97N28J107J824K105J797J353
$$ 285605 287327 289793 292295 294439 296529 298807 300878 302190 302787 303315 304422 306246 308351 310148 311501
53541C11501J453K333L488M129L867L068K621L283M852O182O306N561N242O059
$$ 311501 312954 315287 318775 322904 326771 329839 332460 335743 340595 346777 353083 358644 363886 369945
53527C69945P431Q360Q616Q692R031R754J0901J2436J3923J4721J4654J4314J4392
$$ 369945 377376 385736 394352 403044 412075 421829 432730 445166 459089 473810 488464 502778 517170
53514E17170J4962J5651J6336J7227J8299J9068J9246J9201J9444J9910K0187
$$ 517170 532132 547783 564119 581346 599645 618713 637959 657160 676604 696514 716701
53503G16701K0230K0340K0503K0283J9482J8451J7641J7190J7076J7195J7234
$$ 716701 736931 757271 777774 798057 817539 835990 853631 870821 887897 905092 922326
53492I22326J6841J6194J5965J6452J7158J7521J7623J7816J7978J7609J6596
$$ 922326 939167 955361 971326 987778 1004936 1022457 1040080 1057896 1075874 1093483 1110079
53481A110079J5412J4600J4280J4210J4138J4011J3825J3292J1880R446O665M407
$$ 1110079 1125491 1140091 1154371 1168581 1182719 1196730 1210555 1223847 1235727 1245173 1251838 1256245
53469A256245K740J037j013l085m990p052r370j1409j2747j3779j5068j6419j7143
$$ 1256245 1258985 1260022 1259009 1255924 1250934 1243882 1234512 1223103 1210356 1196577 1181509 1165090 1147947
53456A147947j7079j6808j6933j7599j8631j9772k0694k1036k0608j9575j8421
$$ 1147947 1130868 1114060 1097127 1079528 1060897 1041125 1020431 999395 978787 959212 940791
53445I40791j7647j7315j7003j6398j5696j5167j4579j3578j2407j1466j0433
$$ 940791 923144 905829 888826 872428 856732 841565 826986 813408 801001 789535 779102
53434G79102q644o412m904m482m135k927j106O75K300L735M594M890N585P484
$$ 779102 770458 764046 759142 754660 750525 747598 746492 747167 749467 753202 757796 762686 768271 775755
53420G75755J0167J2660J4614J6152J7194J7765J8518J9987K1752K3048K3904
$$ 775755 785922 798582 813196 829348 846542 864307 882825 902812 924564 947612 971516
53409I71516K4842K5926K6897K7955K9525L1472L3278L4805L6198L7362L8253
$$ 971516 996358 1022284 1049181 1077136 1106661 1138133 1171411 1206216 1242414 1279776 1318029
53398A318029L9402M1307M3629M5739M7745N0033N2051N2640N1602N0053M9177
$$ 1318029 1357431 1398738 1442367 1488106 1535851 1585884 1637935 1690575 1742177 1792230 1841407
53387A841407M9250M9810N0104M9386M7543M5317M3314M1038L7688L3589K9864
$$ 1841407 1890657 1940467 1990571 2039957 2087500 2132817 2176131 2217169 2254857 2288446 2318310
53376B318310K6764K3445J9408J5124J1036O967K895o44l417o120r681j4361j9834
$$ 2318310 2345074 2368519 2387927 2403051 2414087 2421054 2423949 2423305 2419888 2413768 2404087 2389726 2369892
53363B369892k5700l1665l7556m3282m8463n2287n4219n4818n5227n5906n6428
$$ 2369892 2344192 2312527 2274971 2231689 2183226 2130939 2076720 2021902 1966675 1910769 1854341
53352A854341n6364n5647n4138n1749m9057m6972m5625m4354m2932m1997m1957
$$ 1854341 1797977 1742330 1688192 1636443 1587386 1540414 1494789 1450435 1407503 1365506 1323549
53341A323549m2247m2059m1136l9582l7495l5164l3089l1448k9900k8158k6265
$$ 1323549 1281302 1239243 1198107 1158525 1121030 1085866 1052777 1021329 991429 963271 937006
53330I37006k4270k2163k0196j8588j6841j4153j0757q041o905o756o547o100
$$ 937006 912736 890573 870377 851789 834948 820795 810038 801997 795092 788336 781789 775689
53318G75689n741n312m292k665r59M48J599K686L857N212O676Q026R174J0284
$$ 775689 769948 764636 760344 757679 756720 757168 758767 761453 765310 770522 777198 785224 794398 804682
53304H04682J1437J2413J3003J3327J3731J4565J6021J8034K0259K2384K4384
$$ 804682 816119 828532 841535 854862 868593 883158 899179 917213 937472 959856 984240
53293I84240K6170K7217K7093K6300K5939K6468K7285K7566K6963K5466K3282
$$ 984240 1010410 1037627 1064720 1091020 1116959 1143427 1170712 1198278 1225241 1250707 1273989
53282A273989K1003J9241J7825J5941J3305J0541Q127N690K766l19k927m988o849
$$ 1273989 1294992 1314233 1332058 1347999 1361304 1371845 1379972 1385662 1388428 1388109 1385182 1380194 1373345
53269A373345q629j0263j1914j3766j5567j6864j7697j8657k0256k2406k4557
$$ 1373345 1364716 1354453 1342539 1328773 1313206 1296342 1278645 1259988 1239732 1217326 1192769
53258A192769k6204k7319k8336k9632l1067l2135l2503l2222l1478l0480k9441
$$ 1192769 1166565 1139246 1110910 1081278 1050211 1018076 985573 953351 921873 891393 861952
53247H61952k8359k6920k5014k3254k2440k2538k2748k2558k2203k1921k1462
$$ 861952 833593 806673 781659 758405 735965 713427 690679 668121 645918 623997 602535
53236F02535k0558j9461j8587j8040j7653j7198j6376j4945j3079j1333j0131
$$ 602535 581977 562516 543929 525889 508236 491038 474662 459717 446638 435305 425174
53225D25174r461r069q672q019p111o297n861n624n378n395n925o451o185n209
$$ 425174 415713 406644 397972 389953 382842 376545 370684 365060 359682 354287 348362 341911 335726 330517
53211C30517m324l863l506l214l323l561l134k106j660k376l239l082k189j703
$$ 330517 326193 322330 318824 315610 312287 308726 305592 303486 301826 299450 296211 293129 290940 289237
53197B89237j982k425k500k217j749j218q38q23j192j823k449k598j929p94j5
$$ 289237 287255 284830 282330 280113 278364 277146 276308 275485 274293 272470 270021 267423 265494 264700 264685
53182B64685J2m16j003j729k353k391j881j498j545j547j193q89r64j061q50o41
$$ 264685 264697 264281 263278 261549 259196 256805 254924 253426 251881 250334 249141 248252 247288 246227 245377 244736
53166B44736o81n76m1M06K17k55l28p1J6q6n9M0j35o10j149j674k078k029j442
$$ 244736 244055 243479 243438 243844 244061 243806 243478 243407 243423 243337 243278 243318 243183 242573 241424 239750 237672 235643 234201
53147B34201q24n89m51n8K62Q2k88k77n3j53m68m21l5M3l82q17r93j239j708j866
$$ 234201 233377 232788 232337 232279 232541 232623 232335 232058 232005 231852 231384 230963 230928 230971 230589 229772 228779 227540 225832 223966
53127B23966j168P7Q74N54m90j171q71j39Q3k13j13P84J718J922J640J435J131
$$ 223966 222798 222875 223749 224303 223813 222642 221771 221632 221715 221502 221389 222173 223891 225813 227453 228888 230019
53110B30019K97p56j312j323j293j316j012m09o7l19r17j503j892j884j361o33
$$ 230019 230316 229560 228248 226925 225632 224316 223304 222895 222828 222509 221592 220089 218197 216313 214952 214319
53094B14319k53l96p15q54p81o83q03j213j581j389n79K31M68K30j32n68j027
$$ 214319 214066 213670 212955 212101 211320 210637 209834 208621 207040 205651 205072 205303 205771 206001 205869 205301 204274
53077B04274j068l43P28J306J002K9j153j971j881r87j42J7j22Q6M71M05p4k78
$$ 204274 203206 202863 203591 204897 205899 205928 204775 202804 200923 199936 199794 199811 199689 199775 200246 200651 200577 200299
53059B00299J46R12J616J931J503L43q35j273j037o50j93N09J066Q43Jn96o05
$$ 200299 200445 201357 202973 204904 206407 206750 205915 204642 203605 202955 202762 203271 204337 205180 205181 204585 203980
53042B03980n25o81o96k05N22R32Q25L85n2k00k4K51M85O86O06j42j228j527n98
$$ 203980 203455 202774 202078 201873 202395 203327 204152 204537 204485 204285 204261 204512 204997 205683 206289 206147 204919 203392 202794
53023B02794M05K23o96r67m35k35q85j627j804j620j315p61j75j40m88l02N90
$$ 202794 203199 203422 202726 201759 201324 201089 200204 198577 196773 195153 193838 193077 192902 192762 192274 191972 192562
53006A92562J104N15m50q11o94o52m67L93J532J909J203J64l75k71P0K48J84Q5
$$ 192562 193666 194181 193731 192920 192226 191574 191107 191500 193032 194941 196144 196308 195933 195662 195732 195980 196164 196249
52988A96249P4o5n37j026r76m15Q2L32P63J480J838J369N24m8m04r52j556j656
$$ 196249 196323 196258 195721 194695 193719 193304 193386 193718 194481 195961 197799 199168 199692 199644 199240 198288 196732 195076
52970A95076j101l08K93O10P67R87J458K085K467K296J659Q37j1q35j636k426
$$ 195076 193975 193667 193960 194570 195337 196324 197782 199867 202334 204630 206289 207126 207115 206280 204644 202218
52954B02218l053l035k081p58q6l20p33p86q45j267j511q29N03J402J231L51n02
$$ 202218 199165 196130 194049 193291 193205 192885 192152 191366 190521 189254 187743 186914 187417 188819 190050 190401 189899
52937A89899q61o85k74o7k55o45j025j431j807j768j144m25k46n26o43l18R8L16
$$ 189899 189038 188353 188079 188012 187757 187112 186087 184656 182849 181081 179937 179512 179266 178740 178097 177779 177877 178193
52919A78193N60J153J896K069J138n21j729j567l87N83O88M90P11J108R43K25
$$ 178193 178753 179906 181802 183871 185009 184488 182759 181192 180805 181388 182076 182566 183277 184385 185328 185553
52903A85553k95k48o0j06j42J35M80N00L03L40P01J040J102J005R09P77N35K42
$$ 185553 185258 185010 184950 184844 184702 184837 185317 185817 186120 186460 187161 188201 189303 190308 191217 191994 192529 192771
52885A92771m3l66o51n97n3N78O87J65n03q97j065j172j146r58q61j038j227j081
$$ 192771 192728 192362 191711 191114 191061 191639 192326 192491 191988 191091 190026 188854 187708 186750 185889 184851 183624 182543
52867A82543p12m02K3R59K173K815K432J563J046J115J414J583J482J075N43L80
$$ 182543 181831 181429 181452 182411 184584 187399 189831 191394 192440 193555 194969 196552 198034 199109 199652 200032
52851B00032R73K012K603K167J043J4o48j306k153k700k466j851j725k171k328
$$ 200032 201005 203017 205620 207787 208830 208844 208196 206890 204737 202037 199571 197720 195995 193824 191496
52836A91496j728j096j228j715j516n63J40M1j88L26J453K317K398J964J586J497
$$ 191496 189768 188672 187444 185729 184213 183650 183790 183831 183643 183969 185422 187739 190137 192101 193687 195184
52820A95184J397P96m01j647k249k039j342m56M81J158J192O99L87P90J733K704
$$ 195184 196581 197377 196976 195329 193080 191041 189699 189243 189724 190882 192074 192773 193160 193950 195683 198387
52804A98387L463L963L921K865P02j967m139n036m547l225j868j042q02q08p22
$$ 198387 201850 205813 209734 212599 213301 211334 207195 202159 197612 194387 192519 191477 190675 189867 189145
52789A89145o57j082k093k921k605j200J57N24N2n73r79j083p72j83K18K98N55
$$ 189145 188488 187406 185313 182392 179787 178587 178744 179268 179320 178747 177768 176685 175913 175730 175948 176246 176801
52772A76801J252J808J714J421J504J511P41k62l05N53J027N98J70M24P62M61
$$ 176801 178053 179861 181575 182996 184500 186011 186752 186490 186185 186738 187765 188363 188533 188957 189719 190180
52756A90180k12o96j002j214r42j9Q70J023O31K62m6m69o31j1J114J851J749J202
$$ 190180 189968 189272 188270 187056 186114 186095 186965 187988 188619 188881 188835 188366 187735 187724 188838 190689 192438 193640
52738A93640Q49R48J235J213O69j3l13l81p95j457j458m21P85J272J340J695K025
$$ 193640 194489 195437 196672 197885 198554 198541 198228 197847 197052 195595 194137 193716 194501 195773 197113 198808 200833
52721B00833J415q7j311j490j113j014j272j404j221j067j225j456j258n17K88
$$ 200833 202248 202161 200850 199360 198247 197233 195961 194557 193336 192269 191044 189588 188330 187813 188101
52706A88101O13L70k39j108k057k495j924q08j71k45k23L73R26P82L54M26R28
$$ 188101 188714 189084 188845 187737 185680 183185 181261 180453 180282 180037 179814 180187 181113 181895 182249 182675 183603
52689A83603J079N34l15q67p05K66J526K085J473L78k47k88k33j51K77Q88J002
$$ 183603 184682 185216 184901 184034 183329 183595 185121 187206 188679 189057 188810 188522 188289 188138 188415 189303 190305
52672A90305L49n69j112j014l36O48J420J534J025K85l32n50j38P03J133N46n17
$$ 190305 190654 190085 188973 187959 187623 188271 189691 191225 192250 192535 192203 191653 191515 192218 193351 193897 193380
52655A93380r44m19M53J284K355L686M558M447L834L516L415K674Q70j392l118
$$ 193380 192436 192017 192470 193754 196109 199795 204353 208800 212634 216150 219565 222239 223109 221717 218599
52640B18599l796l608l016k352j717j138o85m80n32o74o25k58K69O38P12O60O89
$$ 218599 214803 211195 208179 205827 204110 202972 202287 201807 201275 200601 199976 199718 199987 200625 201337 201997 202686
52623B02686P72P62O11L67K8l89p09o95k35O40J645K009R69j043k244j394M92
$$ 202686 203458 204220 204831 205198 205226 204837 204128 203433 203198 203838 205483 207492 208461 207418 205174 203780 204272
52606B04272J324O09k28k13j2k85l50N30J568J487M25l58k85J40N04R05J244J114
$$ 204272 205596 206205 205977 205764 205752 205467 205117 205647 207215 208702 209127 208769 208484 208624 209128 210033 211277 212391
52588B12391N25k3k48k73j04L72Q94R95O94M31L32J60J1K97R54J298Q98M0p77
$$ 212391 212916 212893 212645 212372 212268 212640 213534 214529 215223 215654 215986 216146 216157 216454 217408 218706 219604 219644 218867
52569B18867j334j585j512j282j032n74K53R44P33k50r39p25k21k91q90j389j579
$$ 218867 217533 215948 214436 213154 212122 211548 211801 212745 213478 213228 212289 211564 211343 211052 210162 208773 207194
52552B07194j753k017k056j599p05L10J007Q96j69j557k097j129P21K039K046
$$ 207194 205441 203424 201368 199769 199064 199374 200381 201277 201108 199551 197454 196325 197046 199085 201131
52537B01131J247N51J23m24r61q05J47J087J437J531J712J521O27j41K02J189
$$ 201131 202378 202929 203052 202628 201667 200862 201009 202096 203533 205064 206776 208297 208924 208783 208985 210174
52521B10174J469Q16L82Q09J366J277Q44O45N67L75M80J211J883J540M79M3Q75
$$ 210174 211643 212459 212841 213650 215016 216293 217137 217782 218349 218724 219204 220415 222298 223838 224317 224360 225235
52504B25235K132K703K447J822Q48p50k533l324k601j369j034j656k036j503p89
$$ 225235 227367 230070 232517 234339 235187 234437 231904 228580 225979 224610 223576 221920 219884 218381 217592
52489B17592q09j346j562j233p32j35P79J759K135J798J407J443J623J558J460
$$ 217592 216783 215437 213875 212642 211910 211775 212554 214313 216448 218246 219653 221096 222719 224277 225737
52474B25737J721K208K295J644O64J53N25J370J884J789J552J658J995K202K256
$$ 225737 227458 229666 231961 233605 234269 234422 234947 236317 238201 239990 241542 243200 245195 247397 249653
52459B49653K238J904J025q9r45j554k124k360j892j236j383k324k958k688k219
$$ 249653 251891 253795 254820 254731 253786 252232 250108 247748 245856 244620 243237 240913 237955 235267 233048
52444B33048k292k497k038j069m29m08n02l52j91l24o49q91r92j049j017p08j37
$$ 233048 230756 228259 226221 225152 224723 224315 223813 223461 223270 222946 222297 221406 220414 219365 218348 217640 217503
52427B17503K96K01k49m63k27k7k67n39j73P03J272J142P45N83O30O32N36M06
$$ 217503 217799 218000 217751 217288 217061 217034 216767 216228 216055 216758 218030 219172 219917 220500 221130 221762 222298 222704
52409B22704K62J84L39Q16J621K771M087N051N331N316N724O691P691Q131P515
$$ 222704 222966 223150 223489 224305 225926 228697 232784 237835 243166 248482 254206 260897 268588 276719 284234
52394B84234N358J784j874m071m775n263o109o393n343l635k400j846j603j618
$$ 284234 289592 291376 289502 285431 280656 275393 269284 262891 257548 253913 251513 249667 248064 246446
52380B46446j807j471j16J448J848Q70l65q13l69O11J823K865L244K903K329J958
$$ 246446 244639 243168 243052 244500 246348 247218 246853 246040 245671 246282 248105 250970 254214 257117 259446 261404
52364B61404J681J126K14o68r76n46J74N29L39J8n1O2J46K25L70M47L46K05J78
$$ 261404 263085 264211 264425 263757 262781 262235 262409 262938 263277 263295 263244 263306 263452 263677 264047 264494 264840 265045 265223
52345B65223J65P3K7J24K30L31O79J302J715J463P14l5m64l45N69K042L189L478
$$ 265223 265388 265461 265488 265612 265842 266173 266852 268154 269869 271332 272046 272011 271547 271202 271771 273813 277002 280480
52327B80480L493M088N127N842O140O567P087O946N987N102M965N108M800M167
$$ 280480 283973 288061 293188 299030 305170 311737 318824 325770 331757 336859 341824 346932 351732 355899
52313C55899L844L875L714L066K237J678J648K222L264M331M933M996M896M984
$$ 355899 359743 363618 367332 370398 372635 374313 375961 378183 381447 385778 390711 395707 400603 405587
52299D05587N253N513N716O027O515O855O485N137L224J538N83K89L57N75Q03
$$ 405587 410840 416353 422069 428096 434611 441466 447951 453088 456312 457850 458433 458722 459079 459654 460457
52284D60457Q89Q02O21L03l74j305j817j298r0P22N66Q9K95J303K332K808L011
$$ 460457 461346 462148 462769 463072 462698 461393 459576 458278 458188 458910 459476 459565 459860 461163 463495 466303 469314
52267D69314L459M039M097L271J976J069J216K499M388N953O385N569M246L503
$$ 469314 472773 476812 480909 484180 486156 487225 488441 490940 495328 501281 507666 513235 517481 520984
52253E20984L872M870N576N680N796O455P064O399M202J747M85N21Q77R22R14
$$ 520984 524856 529726 535302 540982 546778 553233 560297 566696 570898 572645 573130 573651 574528 575450 576364
52238E76364J258J823K243K485K829L438M106M412M097L372K780K709L123L794
$$ 576364 577622 579445 581688 584173 587002 590440 594546 598958 603055 606427 609207 611916 615039 618833
52224F18833M522M975M759L949L237L123L261L136K991L409M183M529M351M424
$$ 618833 623355 628330 633089 637038 640275 643398 646659 649795 652786 656195 660378 664907 669258 673682
52210F73682N099N678N487M769M077L500L053L252M444N908O399N572M281L500
$$ 673682 678781 684459 689946 694715 698792 702292 705345 708597 713041 718949 725348 730920 735201 738701
52196G38701L420L665L893L974L867L684L806M643O076P156O762M803K536J268
$$ 738701 742121 745786 749679 753653 757520 761204 765010 769653 775729 782885 789647 794450 796986 798254
52182G98254R52N79k72j042j471k313m241o635q123q056o890n380l909k608j689
$$ 798254 799206 799785 799513 798471 797000 794687 790446 783811 775688 767632 760742 755362 751453 748845 747156
52167G47156j498k223l465m174l421j454M47J383J671K046K574K846K815K787
$$ 747156 745658 743435 739970 735796 732375 730921 731368 732751 734422 736468 739042 741888 744703 747490
52153G47490K750K321J378L19l21k90L25J211K036K707L337L901M189M126L802
$$ 747490 750240 752561 753939 754258 753937 753647 753972 755183 757219 759926 763263 767164 771353 775479 779281
52138G79281L051J541n36k339l344l842m067l548k050n72l62j121j176M80L122
$$ 779281 782332 783873 783337 780998 777654 773812 769745 766197 764147 763575 763213 762092 760916 761396 764518
52123G64518N413O818P707Q641R905J1276J2036J1565J0096Q483P118N519L243
$$ 764518 769931 776749 784456 793097 803002 814278 826314 837879 847975 856458 863576 869095 872338
52110H72338P38j133k102k647l252l879m130l723k653j003J168L629N776O964
$$ 872338 873076 871943 869841 867194 863942 860063 855933 852210 849557 848554 849722 853351 859127 866091
52096H66091P173P087P261P495P246O358M963K923Q9k939m992n594n508n694o082
$$ 866091 873264 880351 887612 895107 902353 908711 913674 916597 916686 913747 908755 903161 897653 891959 885877
52081H85877n833m617l075j991j462j121q36p99j002j033o02L2L96M12L79M91
$$ 885877 880044 875427 872352 870361 868899 867778 866942 866143 865141 864108 863506 863538 863934 864346 864725 865216
52065H65216O67P93Q03O67N92J030K002K647K123Q56J18L30O92P04R38J789K421
$$ 865216 865883 866676 867479 868146 868738 869768 871770 874417 876540 877396 877514 877844 878536 879240 880178 881967 884388
52048H84388J802J46j580k976m193n095n415n463n705n889n418m440l621l041
$$ 884388 886190 886336 884756 881780 877587 872492 867077 861614 855909 850020 844602 840162 836541 833500
$$ [...]
##END NTUPLES=NMR SPECTRUM
##END=
