
##TITLE=UV1222_M6_1234-1212_10_7231161_mgfaJ3Nj4P
##JCAMPDX= 6.0         $$ Bruker NMR JCAMP-DX V2.0
##DATA TYPE= NMR SPECTRUM
##DATA CLASS= NTUPLES
##ORIGIN= BRUKER
##OWNER= Administrator
$$ 1.72 TOPSPIN		Version 2.1
$$ 2013-01-17 21:15:24.150 -0500  Administrator@X
$$ Compression mode = diff/dup
##.OBSERVE FREQUENCY= 400.02188249412
##.OBSERVE NUCLEUS= ^1H
##.ACQUISITION MODE= SIMULTANEOUS (DQD)
##.ACQUISITION SCHEME= undefined
##.AVERAGES= 64
##.DIGITISER RES= 22
##SPECTROMETER/DATA SYSTEM= spect
##.PULSE SEQUENCE= noesygpps1d.comp
##.SOLVENT NAME= COFFEE_meoh
##.SHIFT REFERENCE= INTERNAL, COFFEE_meoh, 1, 14.96104
##AUDIT TRAIL= $$ (NUMBER, WHEN, WHO, WHERE, PROCESS, VERSION, WHAT)
$$ ##TITLE= Audit trail, TOPSPIN		Version 2.1
$$ ##JCAMPDX= 5.01
$$ ##ORIGIN= Bruker BioSpin GmbH
$$ ##OWNER= Administrator
$$ $$ E:\/data/COFFEE/nmr/UV1222_M6_1234-1212_10_7231161_mgfaJ3Nj4P/22/pdata/1/auditp.txt
$$ ##AUDIT TRAIL=  $$ (NUMBER, WHEN, WHO, WHERE, PROCESS, VERSION, WHAT)
(   1,<2013-01-17 21:15:18.400 -0500>,<Administrator>,<X>,<go>,<TOPSPIN 2.1>,
      <created by zg
	started at 2013-01-17 21:03:48.711 -0500,
	POWCHK enabled, PULCHK disabled,
       configuration hash MD5:
       86 BA 57 50 F2 9D 5C 9B 26 00 A9 28 5F 66 2E 89
       data hash MD5: 64K
       8B 38 9A 20 91 FB E5 30 E6 71 B8 F0 2F 30 28 F0>)
(   2,<2013-01-17 21:15:21.432 -0500>,<Administrator>,<X>,<proc1d>,<TOPSPIN 2.1>,
      <Start of raw data processing
       efp LB = 0.3 FT_mod = 6 PKNL = 1 PHC0 = 0 PHC1 = 0 SI = 128K 
       data hash MD5: 128K
       B1 80 E1 E6 41 1F EA F9 EF 3B 9B 57 13 2B E1 D9>)
(   3,<2013-01-17 21:15:22.416 -0500>,<Administrator>,<X>,<proc1d>,<TOPSPIN 2.1>,
      <pk PHC0 = -80.76599 PHC1 = 0 
       data hash MD5: 128K
       F1 99 A5 86 13 6A D0 6A 9D 6C 8F 6C 3D 64 46 B4>)
(   4,<2013-01-17 21:15:23.088 -0500>,<Administrator>,<X>,<proc1d>,<TOPSPIN 2.1>,
      <abs ABSG = 1 
       data hash MD5: 128K
       28 E9 60 6A C9 59 67 51 17 BD 28 36 CB D3 2E B0>)
(   5,<2013-01-17 21:15:23.260 -0500>,<Administrator>,<X>,<proc1d>,<TOPSPIN 2.1>,
      <abs ABSG = 2 
       data hash MD5: 128K
       0A A9 7A AE A0 D2 B5 D6 9C 3C FE 15 B8 51 78 3F>)
(   6,<2013-01-17 21:15:23.447 -0500>,<Administrator>,<X>,<proc1d>,<TOPSPIN 2.1>,
      <abs ABSG = 3 
       data hash MD5: 128K
       57 8F 71 95 EC 4B BA 77 D9 38 58 87 7C BF B4 3E>)
(   7,<2013-01-17 21:15:23.635 -0500>,<Administrator>,<X>,<proc1d>,<TOPSPIN 2.1>,
      <abs ABSG = 4 
       data hash MD5: 128K
       9B F7 74 C1 99 DF 2B F8 7D E6 02 20 09 30 85 B1>)
(   8,<2013-01-17 21:15:23.807 -0500>,<Administrator>,<X>,<proc1d>,<TOPSPIN 2.1>,
      <abs ABSG = 5 
       data hash MD5: 128K
       28 F8 2C 46 D8 85 44 4A BD 0E 2C 74 1C CC 32 A3>)
$$ ##END=
$$ 
$$ $$ hash MD5
$$ $$ F6 8B 71 D8 41 83 07 3B 57 A2 CD 93 D3 F4 85 03
##$RELAX= 
##$RELAX= 
##$RELAX= 
##$RELAX= 
##$RELAX= 
##$RELAX= 
##$RELAX= 
##$RELAX= 
$$ Bruker specific parameters
$$ --------------------------
##$DU= <E:\>
##$EXPNO= 22
$$ [...]
##$TP07= 0
##$TPNAME0= <>
##$TPNAME1= <>
##$TPNAME2= <>
##$TPNAME3= <>
##$TPNAME4= <>
##$TPNAME5= <>
##$TPNAME6= <>
##$TPNAME7= <>
##$TPOAL= (0..7)
0.5 0.5 0.5 0.5 0.5 0.5 0.5 0.5
##$TPOFFS= (0..7)
0 0 0 0 0 0 0 0
##$TUNHIN= 0
##$TUNHOUT= 0
##$TUNXOUT= 0
##$USERA1= <user>
##$USERA2= <user>
##$USERA3= <user>
##$USERA4= <user>
##$USERA5= <user>
##$V9= 5
##$VALIST= <valist>
##$VCLIST= <CCCCCCCCCCCCCCC>
##$VD= 0
##$VDLIST= <DDDDDDDDDDDDDDD>
##$VPLIST= <PPPPPPPPPPPPPPP>
##$VTLIST= <TTTTTTTTTTTTTTT>
##$WBST= 1024
##$WBSW= 4
##$XGAIN= (0..3)
0 0 0 0
##$XL= 0
##$YL= 0
##$YMAX_a= 5998624
##$YMIN_a= -12327372
##$ZGOPTNS= <>
##$ZL1= 120
##$ZL2= 120
##$ZL3= 120
##$ZL4= 120
##$ABSF1= 14.96104
##$ABSF2= -5.597142
##$ABSG= 5
##$ABSL= 3
##$ALPHA= 0
##$AQORDER= 0
##$ASSFAC= 0
##$ASSFACI= 0
##$ASSFACX= 0
##$ASSWID= 0
##$AUNMP= <proc_prof1d_extract.lims>
##$AXLEFT= 0
##$AXNAME= <>
##$AXNUC= <1H>
##$AXRIGHT= 0
##$AXTYPE= 0
##$AXUNIT= <>
##$AZFE= 0.1
##$AZFW= 0.1
##$BCFW= 0
##$BC_mod= 0
##$BYTORDP= 0
##$COROFFS= 0
##$CY= 15
##$DATMOD= 1
##$DC= 0
##$DFILT= <>
##$DTYPP= 0
##$F1P= 0
##$F2P= 0
##$FCOR= 0.5
##$FTSIZE= 131072
##$FT_mod= 6
##$GAMMA= 0
##$GB= 0
##$INTBC= 1
##$INTSCL= 1
##$ISEN= 128
##$LB= 0.3
##$LEV0= 0
##$LPBIN= 0
##$MAXI= 10000
##$MC2= 0
##$MEAN= 0
##$ME_mod= 0
##$MI= 0
##$NCOEF= 0
##$NC_proc= -2
##$NLEV= 6
##$NOISF1= 0
##$NOISF2= 0
##$NSP= 0
##$NTH_PI= 0
##$NZP= 0
##$OFFSET= 14.96104
##$PC= 1
##$PHC0= -80.76599
##$PHC1= 0
##$PH_mod= 1
##$PKNL= yes
##$PPARMOD= 0
##$PPDIAG= 0
##$PPIPTYP= 0
##$PPMPNUM= 2147483647
##$PPRESOL= 1
##$PSCAL= 4
##$PSIGN= 0
##$PYNMP= <proc.py>
##$REVERSE= no
##$SF= 400.020009622519
##$SI= 131072
##$SIGF1= 0
##$SIGF2= 0
##$SINO= 400
##$SIOLD= 131072
##$SPECTYP= <>
##$SREGLST= <1H.CDCl3>
##$SSB= 0
##$STSI= 131072
##$STSR= 0
##$SW_p= 8223.68421052631
##$SYMM= 0
##$S_DEV= 0
##$TDeff= 65536
##$TDoff= 0
##$TI= <>
##$TILT= no
##$TM1= 0
##$TM2= 0
##$TOPLEV= 0
##$USERP1= <user>
##$USERP2= <user>
##$USERP3= <user>
##$USERP4= <user>
##$USERP5= <user>
##$WDW= 1
##$XDIM= 131072
##$YMAX_p= 413377408
##$YMIN_p= -13212
##$CURPLOT= <Network HP LaserJet P1505>
##$CURPRIN= <$Network HP LaserJet P1505>
##$DFORMAT= <normdp>
##$LAYOUT= <+/1D_H.xwp>
##$LFORMAT= <normlp>
##$PFORMAT= <normpl>
##$SURQMSG= 1
$$ End of Bruker specific parameters
$$ ---------------------------------
##NTUPLES= NMR SPECTRUM
##VAR_NAME=  FREQUENCY,     SPECTRUM/REAL,   SPECTRUM/IMAG
##SYMBOL=    X,             R,               I
##VAR_TYPE=  INDEPENDENT,   DEPENDENT,       DEPENDENT
##VAR_FORM=  AFFN,          ASDF,            ASDF
##VAR_DIM=   131072,        131072,          131072
##UNITS=     HZ,            ARBITRARY UNITS, ARBITRARY UNITS
##FACTOR=    0.0627417313425164, 1,          1
##FIRST=     8223.62146879497, -1018,        -63485
##LAST=      0,             953,             -63985
##MIN=       0,             -13212,          0
##MAX=       8223.62146879497, 413377408,    0
$$ Real data points
##PAGE= N=1
##DATA TABLE= (X++(R..R)), XYDATA
$$ [...]
65286 152087 152817 154117 155439 156160 156269 156016 155424 154442 153225 152062 151200 150816 150954 151464 152106 152656 152765
65269 152765 152003 150395 148699 147745 147589 147724 147855 147942 147751 147031 146081 145381 144733 143592 142363 142383 144181 146561
65251 146561 148037 148621 149532 151483 153884 155552 155721 154448 152482 150655 149189 147591 145342 142500 139605
65236 139605 137251 135813 135254 135060 134751 134543 135036 136140 136917 136811 136411 136491 136788 136355 134872 133012 131646
65219 131646 131140 131324 131784 132206 132683 133522 134628 135351 135207 134446 133666 133236 133421 134556 136577 138674 139950
65202 139950 140269 140008 139330 138253 137169 136586 136349 135764 134594 133453 133046 133374 133808 133708 132949 132077 131899
65185 131899 132697 133913 134847 135525 136597 138401 140474 141958 142313 141772 141290 141868 143552 145278 145930 145421
65169 145421 144465 143573 142750 141981 141418 141077 140821 140769 141381 142931 145131 147377 149301 151091 153354 156506 160176
65152 160176 163368 165376 166414 167310 168897 171782 176221 181786 187571 193220 199453 207125 216088 225509
65138 225509 235025 244905 255219 265573 275666 285508 295004 303884 312149 320103 327809 334930 341131
65125 341131 346213 349808 351444 351080 349214 346401 342979 339302 335709 332024 327441 321197 313227 304149
65111 304149 294792 285759 277135 268549 259694 250833 242533 234974 227750 220392 212864 205525 198775 192685
65097 192685 186865 180850 174758 169301 164888 161068 157182 153252 149766 146972 144906 143851 144034 145015 146026
65082 146026 146894 147984 149300 150289 150602 150415 149946 149234 148496 148092 147985 147751 147244 146772 146579 146635 146931 147368
65064 147368 147400 146507 145117 144314 144462 144817 144688 144297 144214 144662 145688 147310 149097 150206 150278 149804 149326 148899
65046 148899 148621 148957 149957 150792 150637 149605 148288 146900 145388 143944 142817 141943 141188 140592 139987 138872
65030 138872 137177 135628 134776 134193 133259 132216 131644 131313 130480 129156 128148 127897 128078 128419 129113 130223 131341
65013 131341 132090 132547 133033 133870 135421 137870 140828 143514 145475 146889 148186 149761 152000 155086 158668
64998 158668 162127 165301 168539 171910 174800 176546 177159 177148 176889 176407 175663 174792 174086 173820 174073 174747 175874
64981 175874 177820 180900 184726 188208 190437 191463 192028 192631 193045 192742 191594 189951 188066 185672 182318
64966 182318 178031 173422 169154 165540 162645 160419 158557 156575 154352 152433 151483 151522 151923 152164 152350 152943
64950 152943 154101 155292 155633 154696 152981 151396 150250 149004 147062 144458 141697 139266 137614 137192 138088
64935 138088 139790 141646 143443 145201 146580 146995 146278 144911 143527 142471 141807 141520 141684 142518 144165 146205
64919 146205 147631 147746 146937 146196 145939 145780 145424 145216 145572 146359 147170 147929 148866 150124 151748 153939 156876
64902 156876 160235 163260 165561 167677 170524 174342 178529 182629 187153 192996 200189 207694 214559 220837
64888 220837 227080 233312 238973 243789 248190 252697 257234 261276 264572 267409 270035 271998 272342 270539
64874 270539 267012 262543 257475 251850 246102 240976 236723 232982 229647 227138 225446 223612 220904 218059
64860 218059 216484 216386 216543 215876 214332 212012 208388 203062 196750 190754 185684 181285 177370 174171 171649
64845 171649 169084 165772 161850 158109 155169 153161 152033 151675 151719 151642 151276 150947 150946 151203 151669 152597 153985
64828 153985 155096 155145 154367 153705 153484 153112 152296 151804 152535 154368 156485 158465 160536 162975 165846 169156
64812 169156 172759 176198 179145 182018 185688 190506 196037 201853 208171 215417 223401 231219 237962 243348
64798 243348 247603 250793 252392 251658 248449 243528 238011 232613 227442 222313 217112 212027 207522 203940
64784 203940 201089 198453 195970 194265 193920 194718 195843 196626 196863 196653 196273 196124 196525 197580 199353 201982
64768 201982 205436 209344 213342 217446 221943 227073 232951 239578 246740 254098 261472 268735 275368 280678
64754 280678 284746 288559 292761 296824 300062 302954 306640 311351 316211 320443 324005 326990 329192 330384
64740 330384 330348 328452 323862 316475 307235 297359 287661 278642 270574 263192 255837 248302 241269 235719 232186
64725 232186 230661 230708 231438 231833 231461 230714 230202 230255 231092 232949 235707 238760 241642 244548 247940 251910 256242
64708 256242 260804 265496 269943 273614 276213 277706 277981 276669 273333 267816 260560 252607 245013 238126
64694 238126 231600 225136 218937 213347 208403 203992 200160 196961 194246 191900 190110 189064 188556 188248 188282
64679 188282 189229 191353 194213 197203 200255 203806 208078 212671 217083 221545 227066 234423 243214 252065
64665 252065 259692 265611 270016 273265 275503 276488 275733 272991 268623 263368 257908 252867 248928 246352 244435
64650 244435 242069 239019 236181 234390 233542 233144 233096 233393 233611 233429 233452 234793 237796 241755 245995 250679
64634 250679 256395 263411 271646 281042 291570 302982 314867 326839 338448 348892 357114 362335 364464
64621 364464 363914 361059 355893 348212 338096 326216 313625 301197 289233 277697 266758 256925 248557
64608 248557 241484 235344 230144 226130 223184 220833 218930 217852 217767 218137 218344 218475 218979 219796 220495 221248
64592 221248 222998 226419 231090 236021 240696 245291 249989 254474 258253 261387 264668 268874 273929 279059
64578 279059 283814 288552 293714 299097 304259 309348 314932 321100 327217 332491 336295 338031 337365 334730
64564 334730 331073 326852 321667 315018 306971 297899 288016 277448 266495 255587 245200 235853 227882
64551 227882 221142 215381 210924 208439 207768 207666 207135 206560 206963 208480 210217 211452 212377 213581 215303 217349
64535 217349 219429 221297 222696 223371 223240 222541 221622 220453 218475 215230 211102 207058 203669 200775 198203
64520 198203 196258 195229 194850 194661 194657 195114 196009 196996 197880 198782 199915 201445 203438 205678 207681 209237 210842
64503 210842 213270 216695 220559 224314 228039 232244 237266 243034 249342 256178 263582 271183 278088 283549
64489 283549 287616 290747 292866 293368 292157 290052 287745 284969 281316 277476 274795 273755 273663 273916 274725
64474 274725 276237 277638 277777 276354 273840 270459 265919 260338 254814 250650 248196 246823 245836 245126 245040
64459 245040 246004 248286 251657 255175 257715 258939 259411 259579 259165 257934 256567 256098 256694 257575 258029 257907
64443 257907 257318 256654 256932 259257 263566 268497 272787 276451 280432 285664 292688 301539 311684 322628
64429 322628 334931 350049 368764 390404 414146 440412 470349 504521 543103 587103 638383
64418 638383 698388 767537 845820 933181 1028898 1130950 1236115 1340400 1439696 1530930 1613133
64407 1613133 1686937 1752540 1808243 1851059 1878356 1888635 1881284 1856604 1816465 1764314 1703573
64396 1703573 1635536 1559014 1472329 1375765 1272214 1165990 1061431 962182 870798 788386 714793
64385 714793 649364 591537 540926 497336 460752 430893 406634 386342 368945 354254 342127
64374 342127 331906 322986 315407 309427 304850 301113 297659 293921 289424 284320 279375 274952 270447 265158
64360 265158 259243 253219 247035 240426 233881 228439 224572 221944 220189 219262 219110 219628 220980 223435 226887
64345 226887 231033 235870 241390 246859 251128 253736 255104 255536 254684 252247 248623 244555 240533 236765 233423
64330 233423 230694 228756 227779 227679 227893 227841 227662 228104 229576 231662 233664 235219 236292 236931 237252 237380 237284
64313 237284 236904 236535 236755 237784 239199 240434 241372 242158 242598 242012 239789 235986 231221 225967 220155 213714
64297 213714 207214 201506 196772 192536 188693 185794 184037 182758 181412 180416 180336 180871 181381 181858 182591 183413
64281 183413 184263 185996 189470 194115 198589 202683 207319 212773 218257 223453 229077 235504 242090 248400
64267 248400 254908 261753 267755 271566 273104 273208 272531 271423 270224 268981 267443 265887 265374 266530 268639
64252 268639 270492 271469 271237 269226 265336 260485 255482 249828 242665 234572 227298 221878 217956 214818 212094
64237 212094 209389 206314 203195 201011 200284 200526 200944 201188 201257 201207 201155 201179 201103 200772 200603 201301 202871 204307
64219 204307 204531 203353 201457 199794 199123 199728 201228 202773 203637 203631 203015 202174 201324 200323 198842 196924 195270
64202 195270 194640 195035 195815 196587 197575 199077 200957 202804 204326 205460 206368 207413 208910 210809 212916 215549
64186 215549 219673 226132 234859 244982 255622 266440 277545 288985 300310 310492 318251 322514
64174 322514 322695 318843 311715 302556 292475 281949 271037 260060 249871 241363 234783 229536 224576
64161 224576 219164 213430 208236 204365 201923 200509 199701 199136 198359 197070 195531 194363 193925 194196 195215
64146 195215 197184 199990 203050 205871 208475 211063 213594 215975 218385 220997 223598 225848 227776 229548
64132 229548 230815 230769 229023 226080 222797 219736 217195 215497 214783 214738 214886 215151 215832 217130 218981 221325
64116 221325 224176 227405 230849 234817 240135 247397 256235 265503 274138 281851 289175 296909 305197 313051
64102 313051 319043 322610 324429 325468 326100 326454 327084 328710 331480 335011 339076 343757 348985 354289 358960
64087 358960 362121 362807 360516 355722 349519 342826 336177 329904 323868 317185 309062 299938 291112 283207
64073 283207 275850 269011 263666 260570 259109 258032 256805 255619 254540 253362 252116 251080 250394 250103 250391
64058 250391 251297 252338 252873 252840 252791 253341 254846 257437 260946 264837 268541 271884 275036 278257 281868 286170
64042 286170 291100 296241 301530 307650 315301 324271 333704 343090 352519 362001 370962 378444 383538 385759
64028 385759 385309 382852 378818 373213 366447 359898 354949 351660 349060 346642 344863 344161 344328 345058 346342
64013 346342 347856 348503 347136 343509 338226 332016 325440 319007 313089 307752 302890 298505 294676 291349
63999 291349 288365 285605 282957 280302 277728 275689 274669 274705 275469 276834 279090 282422 286377 290182 293612
63984 293612 297219 301557 306395 311062 315386 319900 325057 330729 336635 342873 349672 356910 364275 371789
63970 371789 379791 388478 397744 407407 417326 427387 437658 448510 460329 473209 487195 502701
63958 502701 520260 539876 561051 583611 608259 636258 668797 706724 750609 800923 858358
63947 858358 924053 999359 1085384 1183003 1293271 1417416 1556164 1709256 1875727 2054411
63937 2054411 2243877 2442005 2645939 2852584 3059064 3262587 3459745 3645903 3815389
63928 3815389 3962581 4083178 4174724 4236208 4267272 4267634 4236958 4175212 4083237 3963081 3817839
63917 3817839 3651282 3467694 3271908 3069144 2864449 2661956 2464397 2273381 2090432
63908 2090432 1917872 1758462 1614102 1485063 1370613 1269968 1182361 1106573 1040984 984103
63898 984103 934775 891922 854463 821429 791833 764511 738534 713861 691211 671092 653139
63887 653139 636500 620614 605457 591282 578329 566731 556516 547713 540524 535346 532562 532227 533953
63874 533953 537222 541945 548700 558137 570247 584527 600937 620109 642281 666478 691358 716594
63862 716594 742803 770204 798041 825432 852175 878416 903977 928398 951321 972403 990868
63851 990868 1005472 1015055 1019223 1018599 1014354 1007293 997287 983707 966400 946025 923350 898466 870931
63838 870931 840658 808463 775699 743407 711862 680875 650300 620199 590716 562108 534801
63827 534801 509069 484718 461477 439762 420493 403889 389006 374901 361810 350583 341229 332693
63815 332693 324048 315342 307193 300046 293986 288933 284792 281469 278739 276070 272839 268960 265041 261627
63801 261627 258585 255604 252953 251105 249888 248672 247323 246175 245051 243181 240388 237670 236084 235502
63787 235502 234876 233382 230957 228039 225211 222922 221191 219665 218177 217063 216599 216288 215131 212764 210145
63772 210145 208824 209449 211114 212323 212491 212231 212242 212447 212428 212165 211868 211487 210976 210724 211044 211409 210956 209763
63754 209763 208863 208874 209315 209481 209368 209393 209692 210097 210465 210719 210820 210869 211051 211366 211725 212346 213619 215583 217932
63735 217932 220592 223792 227474 231206 234777 238356 241817 244596 246474 247947 249445 250781 251831 253212
63721 253212 255715 259361 263549 267836 272128 276403 280680 284987 288934 291649 292619 292368 291763 290898 289210
63706 289210 286553 283538 280805 278536 276732 275450 274584 273785 272810 271754 270801 270010 269494 269565 270467 272096
63690 272096 274191 276763 280087 284153 288294 291635 293889 295522 297079 298585 299717 300287 300354 300113 299932
63675 299932 300214 300893 301366 301391 301715 303173 305398 307152 307938 308450 309340 310387 311230 312182 313722 315616 317070
63658 317070 317478 316746 315167 313244 311291 308971 305547 300797 295318 289794 284447 279414 275070 271617 268770
63643 268770 266247 264249 263175 263190 264258 266130 268145 269609 270676 272289 274926 278084 281359 285288 290524
63628 290524 296849 303701 311022 318852 326650 333991 341558 350457 360760 371548 382272 393257 404986
63615 404986 417764 432074 448416 466633 486079 506609 528823 553256 579916 608714 639652
63604 639652 672307 705669 738825 771397 802911 831988 856465 874398 884929 888450 886086 879055
63592 879055 868531 855957 843098 831453 821541 812677 803194 791077 775088 755586 733856 710540
63580 710540 685354 658548 631703 606449 583103 561296 541270 523618 508342 495200 484635
63569 484635 477260 472646 469702 468183 468746 471507 475601 480325 485760 492090 499164 506951 515592 524793
63555 524793 534041 543673 554897 568439 583998 601305 620845 643097 667971 695524 726457 761284
63543 761284 799751 841667 887336 935847 983127 1022839 1049764 1062330 1062381 1053287 1038305 1019982
63531 1019982 1000363 981346 964538 950678 939403 929544 919444 907110 890723 869450 843575
63520 843575 813749 780519 744724 707859 671568 636940 604429 574126 545848 519346 494753
63509 494753 472599 453172 436152 421086 407816 396164 385610 375823 367219 360460 355424 351092
63497 351092 346486 341483 336691 332773 329843 327426 324979 322494 320481 319389 319186 319546 320163 320841 321580
63482 321580 322695 324530 326925 329273 331258 333285 335954 339383 343236 347168 351022 354736 358192 361027
63468 361027 362598 362486 361079 359279 357495 355322 352342 348724 344812 340606 336136 331967 328832 326889
63454 326889 325757 325107 324927 325290 326266 327994 330623 334174 338559 343639 349249 355406 362513 371013 380782
63439 380782 391275 402408 414801 429021 445157 463445 484597 509005 536282 566294 599857
63428 599857 637133 675353 709358 734962 751383 760500 764755 766289 767347 770402 777549 789957 807846
63415 807846 830860 858526 890495 926284 964780 1004099 1042003 1076332 1105124 1126646 1139639
63404 1139639 1143702 1139591 1129243 1115244 1099794 1083888 1067605 1051060 1034694 1018434 1000927 980125
63392 980125 954727 924914 891734 856134 818774 780506 742608 706434 672961 642654 615552
63381 615552 591353 569675 550440 533934 520340 509404 500736 494304 490396 489218 490744 494734 500562
63368 500562 507203 513976 521370 530715 542966 558125 575793 595706 617613 641198 666492 693954
63356 693954 723895 756168 790655 827531 866636 906948 947062 985786 1021827 1053346 1078564
63345 1078564 1096679 1107739 1111878 1109351 1101239 1089402 1075508 1060517 1045079 1029724 1014365 998004
63333 998004 979323 957458 932138 903487 871970 838334 803440 768216 733811 701410 671741
63322 671741 645042 621696 602519 588074 578010 571595 568709 569505 572655 574452 570428 558195 538743
63309 538743 515225 490874 467909 447488 429850 414417 400324 387243 375656 366258 359175 353750
63297 353750 349015 344342 339758 335690 332312 329245 325907 322101 318126 314486 311654 309901 308978 308038 306298
63282 306298 303857 301572 300119 299473 299225 298930 298098 296439 294412 293093 293136 294152 295355 296475 297660 298814
63266 298814 299543 299696 299629 299903 300857 302314 303600 304102 304007 304204 305243 306736 308170 309928 312961 317537 322827
63249 322827 327744 331792 335084 337987 340931 344382 348788 354544 361886 370663 380378 390672 401682 413720
63235 413720 426764 440590 455279 471206 488475 506709 525453 544525 563839 583153 602151
63224 602151 620720 639013 657315 675845 694658 713734 733149 753000 773136 793170 812890
63213 812890 832431 851741 870004 885921 898525 907454 912406 912747 907934 898163 884315 867200 847048
63200 847048 823930 798556 772318 746427 721339 697317 675248 656325 640952 628550 618569 611167
63188 611167 606668 604895 605449 608251 613406 620837 630458 642381 656515 672225 688830 706244 724682
63175 724682 743935 763388 782579 801286 819234 836268 852695 868892 884548 898724 910672
63164 910672 920104 926709 929941 929422 925062 916625 903618 885816 863595 837670 808926 778585 748002
63151 748002 717913 688196 658708 630110 603529 579623 558324 539352 522540 507629 494160
63140 494160 481879 471081 462281 455489 450027 445165 440696 436710 433045 429485 426470 425012 425518 427073
63126 427073 428340 428990 429851 431754 434669 437926 440906 443416 445691 448193 451287 455089 459594 464770 470359
63111 470359 475783 480537 484555 488040 491159 494131 497255 500457 503048 504489 505231 506321 508191 510411
63097 510411 512558 514716 516925 518702 519460 519071 517808 516064 514349 513199 512786 512732 512556 512154 511693 511253
63081 511253 510824 510573 510850 511889 513561 515504 517574 520153 523865 528819 534237 539077 543088 547134 552459
63066 552459 559665 568376 577839 587863 599045 611939 626179 640965 656452 673959 694521 717831
63054 717831 743133 770519 800593 833287 867993 904677 943910 985819 1029914 1076088 1124765
63043 1124765 1175666 1227265 1278070 1327856 1377024 1425327 1472037 1517221 1562083 1607793 1654295
63032 1654295 1700439 1745131 1788131 1829565 1868676 1903333 1930979 1949911 1959356 1958635 1946904 1923771
63020 1923771 1889742 1846024 1794300 1736667 1675234 1611621 1547216 1483869 1423738 1368315 1318176
63009 1318176 1273803 1235924 1204726 1179453 1159413 1145020 1137355 1136875 1142885 1154039 1169140 1187745
62997 1187745 1210228 1236866 1266701 1297753 1328675 1359662 1391369 1423590 1455600 1487193 1518455
62986 1518455 1548819 1577297 1603629 1628271 1650977 1670089 1683656 1690695 1690942 1683804 1668298 1644008
62974 1644008 1611541 1571832 1525430 1472962 1416166 1357787 1300040 1243462 1187697 1133199 1081634
62963 1081634 1034586 992366 954150 918856 885804 855036 827227 802881 781442 761571 742415
62952 742415 724067 706573 689232 671411 653534 636558 620838 606119 592327 579581 567528
62941 567528 555507 543536 532431 522660 513618 504454 495268 487026 480382 474987 469997 464956 460009
62928 460009 455452 451356 447663 444359 441384 438627 436252 434753 434241 433894 432684 430709 429179 428910 429429
62913 429429 429812 429811 429676 429364 428533 427053 425016 422456 419538 416870 415090 414170 413504 412609 411420 410021 408470
62896 408470 406934 405715 405078 405155 405896 407036 408356 410054 412500 415413 417765 418916 419361 419884 420401 420387
62880 420387 420090 420413 421585 422832 423548 424083 424959 425902 426126 425296 423833 422377 421217 420169 418896 417365
62864 417365 415913 414743 413544 411967 410405 409773 410360 411294 411438 410607 409649 409457 410107 410934 411344 411564 412527
62847 412527 414873 418123 421031 422758 423507 423974 424484 424806 424668 424226 423969 424232 424846 425334 425427 425253 425046 424899
62829 424899 424899 425186 425676 425966 425834 425720 426371 428044 430249 432241 433578 434345 435039 436125 437550 438913 440297
62812 440297 442523 446087 450162 453315 455204 456972 459881 464114 469054 474156 479193 484056 488766 493592
62798 493592 498887 504855 511614 519330 528159 538137 549235 561483 575004 589978 606542 624693 644469
62785 644469 666388 691517 720812 754451 792091 833658 879619 930587 986985 1048965 1116165
62774 1116165 1187526 1261767 1338060 1415806 1493705 1569579 1641240 1707010 1765176 1813500 1849851
62763 1849851 1873174 1883466 1880909 1865407 1837050 1796760 1746369 1687987 1623266 1553342 1479516
62752 1479516 1403737 1328168 1254426 1183491 1116040 1052351 992117 935187 882514 835527 794242
62741 794242 756874 721863 689501 660845 635699 612801 591678 573147 557818 545095 534039
62730 534039 524413 516368 509680 503959 499288 496029 494151 493177 492734 492681 492806 492872 493082 494068 496236 499451
62714 499451 503602 509160 516805 526630 538036 550373 563454 577551 593284 611578 633325 658808
62702 658808 687613 719327 754178 792815 835554 882086 931935 985067 1041931 1102858 1167343
62691 1167343 1234019 1301448 1368792 1435332 1499344 1557988 1608624 1649928 1681442 1702493 1712046
62680 1712046 1709364 1694244 1666768 1627560 1578336 1521602 1459501 1393336 1324296 1254120 1184662
62669 1184662 1117213 1052607 991648 934988 882666 834180 789068 747307 709265 675429 645993
62658 645993 620445 597650 576635 557300 540187 525624 513332 502757 493421 484853 476586 468504
62646 468504 460987 454422 448623 443018 437332 431781 426528 421383 416283 411757 408496 406582 405576 405280
62632 405280 405956 407657 409776 411495 412335 412130 410895 409071 407574 407145 407702 408594 409247 409350 408757 407751
62616 407751 407194 407841 409555 411682 414136 417520 422094 427257 432315 437296 442700 448827 455773 463771 473081
62601 473081 483545 494629 506068 518386 532703 549981 570405 593491 618790 646370 676550
62590 676550 709316 744156 780339 817154 853986 890289 925266 957380 984536 1005203 1019182
62579 1019182 1026871 1028046 1022020 1008877 989731 965669 937159 904811 870042 834418 798743 763264
62567 763264 728419 694928 663298 633655 606016 580459 557142 536349 518381 503205 490331
62556 490331 479142 469214 460292 452254 445233 439398 434457 429739 424994 420752 417528 415019 412475 409671
62542 409671 407084 405281 404535 404913 406298 408274 410249 411769 412624 412814 412613 412503 412744 413117 413362 413819 415382
62525 415382 418838 424400 431759 440366 449733 459759 470815 483449 498071 514963 534364 556313
62513 556313 580633 607346 636929 669784 705508 743053 781571 820746 860211 898973 935609
62502 935609 968912 998170 1022920 1042537 1056147 1062996 1062948 1056537 1044494 1027435 1006216 982438
62490 982438 958270 935589 915412 898166 884327 874595 869461 868765 871937 878718 889497 904745 924252
62477 924252 947139 972547 999923 1028484 1056620 1081995 1102186 1115478 1121473 1121120 1115698 1105463
62465 1105463 1089374 1066197 1035661 998573 956441 911310 865422 820346 776470 733672 692347
62454 692347 653501 618075 586542 558978 535111 514443 496770 482439 471681 463864 457920 453346
62442 453346 450217 448231 446548 444837 443889 444719 447371 450954 454564 457801 460596 463009 465226 467432 469475
62427 469475 470718 470314 467758 463300 457771 451895 445740 439015 431834 424893 418795 413488 408568 403935
62413 403935 399867 396580 393949 391721 389737 387861 385845 383462 380800 378296 376387 375097 374047 372910
62399 372910 371779 371021 370832 371043 371381 371785 372438 373576 375331 377704 380541 383520 386207 388248 389601 390587
62383 390587 391707 393360 395724 398813 402610 407122 412367 418316 424888 431993 439606 447711 456189 464899
62369 464899 473909 483556 494224 506209 519821 535311 552520 570923 590452 612073 637157 666406
62357 666406 699832 737600 780220 827814 879782 935430 994346 1055840 1118444 1180287 1239485
62346 1239485 1293827 1340602 1377491 1403587 1419270 1425381 1422876 1412854 1396133 1372786 1342574 1305855
62334 1305855 1263774 1217707 1168985 1119058 1069385 1021129 975317 933108 895258 861287 829905
62323 829905 800576 774096 751287 731639 713738 696573 679782 662931 645426 627318 609519
62312 609519 592791 576954 561556 546984 534202 523364 513414 503403 493676 485220 478234 472036
62300 472036 466289 461514 458218 456140 454622 453248 451791 450071 448338 447451 448097 449985 452118 453739 454694
62285 454694 455217 455818 457236 460009 464010 468647 473411 478018 482290 486234 490082 493979 497831 501732 506152
62270 506152 511299 516689 521948 527738 535124 544277 554684 566593 581277 599595 621082 644924 671255
62257 671255 701098 735449 774854 819457 869046 923217 981749 1044503 1110638 1178088 1244039
62246 1244039 1305739 1360790 1407091 1442971 1467426 1480222 1481976 1474071 1458040 1434677 1403979 1366030
62234 1366030 1321553 1271468 1216508 1157819 1097635 1038715 983032 931343 883920 841208 803575
62223 803575 770795 742151 717117 695798 678596 665446 655520 647771 641665 637213 634450 633063 632459
62210 632459 631886 630550 628005 624537 620831 617162 613136 608253 602345 595382 587322 578477 569743 562071
62196 562071 555836 550902 547099 544387 542744 542162 542694 544301 546762 549890 553772 558625 564536 571437 579183
62181 579183 587504 596036 604624 613511 623083 633434 644233 654901 664879 673915 682239 690427 699129
62168 699129 709088 721402 737344 757706 782524 811560 844873 882688 924882 970717 1018858 1067428
62156 1067428 1114219 1157101 1194252 1224075 1245266 1257272 1260538 1256149 1245367 1229451 1209476 1185910
62144 1185910 1158498 1126876 1091247 1052467 1011769 970595 930330 891806 855278 821227 790942
62133 790942 765826 746171 730951 718753 708620 700184 693507 688878 686374 685428 685097 684858 685012 686267
62119 686267 689136 693732 699846 707104 715207 724081 733662 743449 752430 759448 763614 764540 762515 758483
62105 758483 753601 748667 744028 739829 735913 731465 725341 717172 707941 699163 691720 685797 681707 680049
62091 680049 680902 683370 686359 689676 694047 700126 707796 716382 725271 734341 744042 755048 767529 780712
62077 780712 793592 806257 820105 836411 854986 874649 894722 915527 937512 960546 984188
62066 984188 1008141 1032196 1056110 1079892 1104051 1129385 1156525 1185586 1215996 1246685 1276670
62055 1276670 1305320 1331685 1353746 1369090 1376633 1377259 1372585 1363590 1350571 1333602 1312342 1285843
62043 1285843 1253284 1214869 1171686 1124964 1075970 1026265 977321 929815 883768 839431 797613
62032 797613 759074 724000 692141 663158 636822 613124 592267 574346 559100 546170 535389
62021 535389 526454 518478 510385 501816 493331 485665 479052 473171 467410 461235 454681 448444 443147 438608
62007 438608 434282 430336 427696 426992 428078 430663 434751 440175 446293 452595 459213 466431 474054 481624
61993 481624 488855 495447 500825 504621 507187 509132 510464 510628 509285 506572 502674 497624 491583 484933
61979 484933 478018 471120 464615 458782 453401 447987 442557 437758 433989 430741 427089 422648 417731 412812
61965 412812 408163 404007 400662 398362 397019 396249 395623 394879 393971 392941 391826 390744 390085 390429 392180 395294
61949 395294 399328 403675 407810 411587 415495 420488 427328 436100 446383 457790 470180 483551 498021
61936 498021 513899 531432 550283 569469 588042 605816 623246 640576 657226 672147 684788
61925 684788 695572 705322 714254 721691 726714 728862 728129 724641 718720 711043 702326 692861 682788 672887
61911 672887 664681 659520 657794 659170 663266 669866 678737 689594 702188 716234 731292 746626 760920
61898 760920 772237 778934 780983 779864 776680 770859 761379 748746 734738 720342 705055 688486 671577
61885 671577 655618 640820 626679 613243 601171 590728 581505 573085 565274 557567 549150 539875 530789
61872 530789 523201 517389 512565 507998 503789 500539 498656 498161 498879 500579 503054 506332 510762 516632 523763
61857 523763 531841 541200 552873 567559 584817 603638 623682 645592 670115 697189 725893 755069
61845 755069 784002 812748 841817 871332 900453 927721 951894 972332 988745 1000846 1008161 1010030
61833 1010030 1005977 996422 982888 967192 950614 934208 919488 908083 900678 897000 896885 900652 908249
61820 908249 918697 930728 943357 955496 965577 972074 974049 970861 961815 946606 925831 900622
61808 900622 872102 841504 810349 779853 750324 721644 694178 668718 645656 624767 605772
61797 605772 588691 573600 560429 549059 539382 531191 524173 517974 512242 506781 501735 497340 493389
61784 493389 489309 485002 481175 478514 476842 475505 474172 472776 471081 468958 466953 465909 465999 466573 466879
61769 466879 466573 465708 464729 464346 464829 465474 465305 464329 463608 464095 465831 468246 470631 472266 472701 472183 471506
61752 471506 471268 471512 472052 472698 473138 473084 472655 472241 471918 471409 470617 469675 468384 466191 463021 459638 456833
61735 456833 454632 452647 450900 449840 449693 450125 450564 450722 450837 451488 453078 455468 458197 460937 463528 465786
61719 465786 467694 469758 472690 476547 480542 483783 485886 486876 486967 486683 486734 487386 488165 488343 487467 485364 482032
61702 482032 477830 473475 469517 466028 462960 460433 458403 456361 453792 450758 447700 444814 441951 438997
61688 438997 435991 432978 430050 427500 425580 424074 422409 420260 417865 415648 413722 411839 409745 407379
61674 407379 404743 401703 398102 394120 390383 387550 385781 384703 383857 383043 382268 381590 381093 380887 381001 381283
61658 381283 381494 381482 381300 381103 380911 380566 380131 380250 381666 384207 386677 388192 389289 391207 394235 397412
61642 397412 399886 401959 404569 408117 412076 415500 417726 418774 419176 419337 419108 418141 416482 414431 411926
61627 411926 408599 404479 400196 396293 392679 388961 384993 380982 377358 374592 372880 371870 370976 369941
61613 369941 368792 367324 365217 362735 360716 359565 358661 356992 354015 349784 344762 339803 335780 332803
61599 332803 330108 327077 323946 321154 318476 315371 311950 308967 306832 305070 302862 299879 296540 293552
61585 293552 291255 289424 287784 286518 285933 285762 285350 284551 283837 283367 282663 281514 280496 280054 279675 278672
61569 278672 277351 276632 276746 277036 276934 276448 275761 275014 274604 275103 276620 278541 280020 280567 280249 279618 279386
61552 279386 279846 280587 281001 280932 280627 280287 280178 280978 283354 286995 290508 292605 293188 293135 293251 293604 293804 293759
61534 293759 294014 295317 297882 301237 304744 307990 310640 312315 312893 312617 311671 309980 307717 305653 304484
61519 304484 303988 303314 301996 300314 298798 297786 297345 297140 296511 295166 293763 293339 294134 295449 296662 297848
61503 297848 299187 300268 300336 299064 296836 294385 292312 290885 290129 290041 290636 291777 293133 294391 295377 295904
61487 295904 295839 295472 295468 296088 296707 296503 295395 293953 292674 291803 291639 292392 293793 295315 296734 298071 299148
61470 299148 299790 300313 301173 302140 302548 302380 302365 302878 303513 304016 304852 306335 307821 308461 308335 308260 308701 309455 310255
61451 310255 311094 311947 312614 312989 313246 313653 314325 315179 316009 316640 317120 317779 319049 321242 324306 327710 330676
61434 330676 332901 335035 338065 342149 346395 349882 352465 354387 355592 355875 355478 355025 354924 355192 355858 357126
61418 357126 359007 361076 362863 364464 366592 369845 373896 377540 379715 380411 380453 380491 380483 380124 379333 378155 376519
61401 376519 374418 372157 370137 368416 366664 364559 362087 359537 357290 355582 354400 353609 353127 352818 352301
61386 352301 351185 349591 348133 347223 346670 346141 345659 345333 344930 344263 343826 344409 345953 347424 348112 348609 349994
61369 349994 352337 354614 356084 357133 358575 360554 362567 364298 365975 367900 370001 371967 373647 375242
61355 375242 377193 379846 383114 386576 390114 394273 399705 406367 413703 421474 429852 438670 447267 455277
61341 455277 462840 469679 474785 477797 480086 483525 488403 493393 497442 500734 503771 506448 508403 509535
61327 509535 509739 508642 506057 502382 498288 494322 490937 488415 486501 484600 482683 481540 481719 482658 483399
61312 483399 483907 485072 487546 491110 495251 499896 505396 512018 519618 527760 536135 544909 554607 565448
61298 565448 576784 587172 595016 599298 600021 598086 594575 590028 584499 578168 571463 564442 556475 546989
61284 546989 536382 525916 516705 509038 502576 496965 492150 488263 485350 483295 482026 481649 482239 483639
61270 483639 485729 488761 493019 498210 503666 509192 515132 521383 526988 531246 534782 538954 544493 551356
61256 551356 559655 569872 581896 594504 606229 616460 625312 632685 637986 640953 642370 643556 645020
61243 645020 645917 645045 642193 638139 633445 627859 621135 613950 607511 602475 598623 595446 592614 589940 587321
61228 587321 584850 582749 581140 580041 579592 580010 581327 583334 585818 588762 592304 596617 601718 607259 612599
61213 612599 617344 621740 626326 631304 636422 641342 645745 649192 651313 652270 652644 652764 652460 651663 650920 651060
61197 651060 652615 655819 660956 668251 677492 688138 699938 713203 728367 745341 763334 781085
61185 781085 797153 810343 820269 827645 833773 839526 844826 849069 851880 853336 853663 853011 851469 849076
61171 849076 845764 841468 836338 830641 824391 817279 809107 800111 790700 780957 770579 759252 746956
61158 746956 733915 720354 706366 692006 677521 663437 650249 638052 626680 616321 607846 602264
61146 602264 599883 600016 601468 603168 604421 604719 603508 600302 595057 588319 580815 573009 565274 558326 553060
61131 553060 549855 548411 548438 550111 553620 558658 564669 571354 578634 586449 595055 605294 617998 633142
61117 633142 649975 667940 687081 707642 729779 753669 779387 806463 833960 861156 887877
61106 887877 914120 939749 964677 988886 1012032 1033338 1052115 1068051 1080836 1089967 1095219 1096872
61094 1096872 1095028 1089110 1078615 1064133 1047011 1028072 1007222 984259 959436 933130 905647 877718
61082 877718 850623 825316 801635 778877 756981 736689 718419 701463 684673 667868 652252
61071 652252 639276 629175 620814 612956 605422 598877 593794 590022 587294 585735 585675 587220 590147 594055
61057 594055 598534 603331 608476 614173 620582 627816 636076 645525 656044 667432 679886 693958 709904
61044 709904 727352 745792 765163 785881 808507 833439 860569 889176 918432 948166 978829
61033 978829 1010793 1044170 1079249 1116376 1155276 1195272 1236445 1279728 1325457 1372718 1420656
61022 1420656 1469372 1518875 1568367 1617806 1669256 1725385 1787473 1856310 1934170 2024026 2127387
61011 2127387 2244897 2378713 2532373 2708948 2912050 3148750 3429103 3763263 4162860
61002 4162860 4645980 5237068 5960614 6838241 7891102 9135986 10573720 12189355 13970399
60993 13970399 15907580 17943580 19907621 21529954 22571027 22970210 22877774 22546865 22199409
60984 22199409 21976184 21954123 22138249 22407376 22501775 22126454 21114256 19513733 17536833
60975 17536833 15431682 13387867 11514810 9860965 8435645 7225632 6209703 5366629
60967 5366629 4674369 4108565 3646191 3269197 2962688 2711780 2502641 2325269 2173186
60958 2173186 2041388 1926140 1825505 1738106 1661726 1594339 1535687 1486464 1446417 1414232 1388520
60947 1388520 1367756 1349905 1333284 1317430 1302302 1287333 1272249 1258041 1245952 1236024 1227575 1220457
60935 1220457 1214692 1209466 1203799 1197941 1192927 1189031 1185685 1182606 1179911 1177267 1174033 1170157 1166009 1161392
60921 1161392 1155605 1148393 1140023 1130526 1119671 1107549 1094342 1079641 1062849 1044282 1025080 1006012
60909 1006012 987018 967879 948676 929617 910930 892927 875723 859185 843556 829692 818030
60898 818030 807778 797858 788151 779061 770398 761735 753351 745627 737883 729166 720005 711930 705170 698231
60884 698231 690076 681350 672931 664429 654964 644610 634316 624848 616353 608587 601196 594057 587529 581937
60870 581937 576812 571208 564808 558125 551570 545070 538762 533275 528961 525438 522219 519253 516590 514029
60856 514029 511403 508690 505658 501917 497557 493294 489757 487031 485045 483855 483327 482997 482439 481385 479460
60841 479460 476382 472625 469269 466848 464681 461530 456655 450237 443221 436809 431641 427392 423549 420352
60827 420352 418361 417292 416223 414972 414363 414850 415850 416853 418296 420662 423340 425152 425746 425907 426601
60812 426601 428080 429787 430926 431173 430899 430616 430381 430016 429657 429574 429674 429715 429792 429968 429717 428567 427049 426057
60794 426057 425410 424132 422095 420130 418384 415883 412129 407897 403910 399880 395482 391231 387640 384467
60780 384467 381443 378828 376573 373958 370791 367988 366131 364524 362607 361162 360899 360860 359717 357894 356844
60765 356844 356764 356666 356443 357168 359252 361791 364037 366172 368342 370100 371342 372764 374874 377353 379819 382444
60749 382444 385318 387938 389955 391879 394500 397909 401581 405025 407921 409859 410472 409738 407803 404550 399706
60734 399706 393413 386494 379947 374196 368924 363681 358483 353607 348975 344228 339507 335672 333367 332158
60720 332158 330960 329122 326765 324313 322097 320314 319021 318159 317696 317629 317753 317723 317489 317281 316986 316009 314168
60703 314168 312285 311411 311756 312743 313772 314497 314779 314970 315908 317992 320455 322173 322982 323666 324914 326929
60687 326929 329794 333380 336964 339750 341805 343854 346193 348576 351236 355060 360428 366583 372588 378362
60673 378362 384338 390596 396796 402590 407620 411387 413644 414796 415498 415770 414855 412105 407895 403501 400014
60658 400014 397436 394942 391977 388850 386193 384128 382203 379978 377509 375429 374651 375602 377495 378694 378227
60643 378227 376674 375200 374126 373002 371674 370350 368700 365838 361565 356921 353036 349879 346641 343031
60629 343031 339714 337508 336567 336426 336624 337032 337587 338031 338244 338761 340395 343052 345370 346004 345060 343888 343674
60612 343674 344659 346418 348252 349340 349193 348159 347175 346916 347472 348664 350203 351557 352236 352331 352365 352583 352821
60595 352821 353076 353645 354610 355726 357014 358950 361730 364754 367174 368660 369416 369744 369908 370112 370314 370216 369642
60578 369642 368765 367871 367188 367104 368130 370328 373078 375828 378872 383018 388643 395564 403764 413645 425308
60563 425308 438000 450662 462882 474933 486944 498331 508101 515327 519162 518842 514260 506639 498161
60550 498161 490599 484358 478895 473818 469406 466257 464750 464870 466388 469119 472995 477993 484186 491964
60536 491964 501925 514271 528453 543714 559790 576562 593089 607652 618925 626637 631010 632160
60524 632160 630312 626057 620070 612982 605676 599016 592963 586619 579552 572483 566293 561141 557153 555038
60510 555038 555034 555901 556151 555914 556533 558628 561785 566028 572288 581149 592253 605367 621200 640728 664392
60495 664392 692324 724674 761253 801292 843940 888601 934474 980080 1023520 1062969 1096835
60484 1096835 1123785 1142671 1152209 1150968 1138194 1114682 1082325 1042950 998122 949829 900341 851219
60472 851219 803258 757640 716186 679988 648456 620232 594522 571170 550146 531576 515811
60461 515811 502785 491644 481547 472575 465247 459375 453975 448330 442632 437505 433221 429497 425829
60448 425829 421914 417769 413541 409346 405399 402152 399973 398737 398045 397819 398270 399231 399932 399719 398779 397915
60432 397915 397692 397887 397747 396746 395149 393691 392693 391838 390925 390356 390420 390579 390080 388987 387940 387200 386651
60415 386651 386512 387101 388011 388447 388422 388721 389634 390683 391764 393493 396088 398914 401544 404300 407199 409381
60399 409381 410335 410925 412313 414455 416475 418032 419514 421204 423038 424988 427070 429153 431229 433604 436325
60384 436325 438782 440399 441463 442754 444605 446810 449144 451358 452903 453363 453226 453787 456135 460352 465509
60369 465509 470282 473827 476378 478804 481543 484281 486700 488912 490904 492311 493290 494955 498215 502595
60355 502595 506942 510950 515341 520849 527767 536262 546317 557493 569402 582312 596547 611291 624727
60342 624727 635541 643676 649471 652624 652327 648062 640048 629118 616397 602999 589887 577831 567261
60329 567261 557997 549514 541724 535215 530401 526698 522994 518757 514297 510123 506477 503386 500750 498396
60315 498396 496381 495140 495057 496026 497785 500499 504684 510668 518553 528552 540964 555830 572995 592462
60301 592462 614383 638730 665139 692699 719445 742289 758187 765636 764853 756600 741333 719596
60289 719596 692887 663781 635178 609250 586836 567768 551788 539006 529456 522528 517130 512329
60277 512329 507676 503142 498913 495100 491494 487813 484245 481347 479232 477271 474873 472098 469187 465980
60263 465980 462341 458731 455783 453544 451627 449895 448497 447473 446766 446413 446284 445922 445086 444172 443606 443217
60247 443217 442762 442671 443559 445295 447313 449522 452090 454531 455977 456385 456562 456918 457086 456916 456913 457305 457512 457047
60229 457047 456366 456307 457081 458298 459607 460879 462008 462937 463816 464930 466598 469139 472598 476462 480002 483073
60213 483073 486271 490146 494618 499317 504183 509420 515120 521185 527447 533705 539800 545833 552161 558998
60199 558998 566114 573017 579324 584890 589717 593852 597356 600282 602646 604381 605355 605541 605146 604353 602953
60184 602953 600535 597150 593398 589664 585679 581156 576476 572266 568567 564872 560802 556363 551759 547392
60170 547392 543837 541387 539769 538640 538002 537671 536824 534804 532119 529887 528440 527264 526159 525557 525559 525541
60154 525541 524977 524037 523137 522495 522275 522600 523227 523772 524407 525761 527958 530412 532780 535431 538688 542298
60138 542298 546055 550271 555068 559808 563963 568207 573896 581509 590122 598386 605564 611587 616550 620374
60124 620374 622882 624095 624387 624270 623987 623489 622770 622089 621816 622204 623287 624794 626239 627356 628437 629988
60108 629988 632048 634119 635735 636797 637368 637496 637229 636524 635151 632993 630372 627676 624760 621210 617224
60093 617224 613652 611031 609079 607320 605727 604515 603773 603612 604313 605968 608174 610332 612096 613413 614380
60078 614380 615200 616022 616650 616611 615657 613974 611775 608883 604876 599488 592796 585158 577055 568896 560968 553549
60062 553549 546868 540801 534892 528908 523112 517705 512419 507062 502049 497772 493843 489751 485996 483581
60048 483581 482482 481626 480548 480134 481410 484408 488589 493617 499225 504915 510312 515457 520480 525386 530254
60033 530254 535086 539303 542092 543486 544450 545606 546539 546613 545633 543310 539004 532719 525664 518994 512497
60018 512497 505245 497167 489180 482041 475793 470226 465244 460817 456986 453896 451563 449793 448526 447827
60004 447827 447276 445889 443220 440149 437995 437144 437083 437421 438142 439000 439376 438873 437657 436212 435084 434758 435365
59987 435365 436576 438068 440023 442822 446370 450096 453539 456579 459097 460782 461381 460951 459811 458270 456421
59972 456421 454198 451676 449197 446999 444892 442630 440450 438802 437647 436606 435772 435668 436340 437236 438203
59957 438203 439842 442523 445768 448940 451739 453635 453738 452035 450023 449307 450091 451648 453539 455498 456813
59942 456813 456971 456545 456367 456180 455200 453732 452964 453162 453319 452767 452016 451634 451348 450853 450692 451613 453493 455496
59924 455496 457049 458285 459782 462180 465830 470524 475637 480620 485272 489664 494121 499239 505442 512383
59910 512383 519059 524552 528390 530308 530207 528550 526318 524181 521953 519105 515675 512415 510079 508723
59896 508723 507745 506546 505104 503887 503346 503697 505075 507502 510616 513885 517333 521610 527021 532954 538689
59881 538689 544313 550244 556240 561725 566896 572643 579248 585898 591680 596450 600460 603684 605844 606677
59867 606677 605878 603102 598391 592405 585952 579449 572956 566553 560467 554934 550146 546224 543115 540592
59853 540592 538477 536884 536180 536695 538443 541205 544982 550295 557775 567333 577915 588172 597168 604313
59839 604313 608986 610606 609132 605393 600997 597887 597503 599926 603768 607010 608008 606038 601473 595615 589790
59824 589790 584281 578426 571886 565271 559258 553712 548152 542531 537048 531736 526870 523303 521583 521067
59810 521067 520639 520013 519537 518995 517572 514999 511863 508645 505219 501497 497878 494799 492290 490143 488125
59795 488125 485971 483616 481460 479923 478825 477759 476987 477179 478120 478519 477515 475811 474850 475250 476424 477390
59779 477390 477550 476908 475944 475252 475090 475297 475632 476048 476580 477173 477747 478316 478994 479849 480689 481075 480807 480390 480564
59760 480564 481193 481263 480393 479761 480857 483696 487006 489796 492015 493962 496060 499052 503440 508612 513374
59745 513374 517453 521628 526307 530997 535367 539775 544214 547687 549391 549881 550355 551279 552352 553375 554419
59730 554419 555385 556044 556431 556707 556715 556062 554631 552714 550753 549205 548536 548959 550135 551307 551785 551338 550221
59713 550221 548892 547636 546440 545297 544420 543944 543610 543141 542796 543080 543948 544824 545450 546183 547295 548475 549280
59696 549280 549714 550146 550991 552645 555362 558920 562627 565809 568100 569286 569243 568116 566257 563929 561439
59681 561439 559555 559149 560200 561582 562094 561360 559534 556694 552928 548693 544575 540768 537000 532888 528203
59666 528203 522967 517465 512117 507243 503057 499737 497278 495388 493833 492820 492657 493116 493600 493891 494303
59651 494303 495090 496237 497880 500330 503524 506919 510072 512884 515178 516571 516932 516440 515064 512544 509119
59636 509119 505692 502902 500503 497988 495453 493453 492298 491797 491469 490873 490011 489494 489899 490877 491305 490483
59620 490483 488764 486879 485136 483441 481602 479440 477049 475043 474025 473684 473089 471991 471114 470920 470957 470846
59604 470846 471094 472269 474085 476012 478177 480820 483232 484156 483211 481340 479888 479578 480220 481008 481206 480825
59588 480825 480464 480353 480000 479041 477856 476942 476174 475187 474082 473141 472166 470729 468822 466739 464466 461764
59572 461764 458781 456154 454461 453821 453826 453711 452883 451590 450754 450861 451379 451581 451479 451552 451992 452754 453932 455500
59554 455500 456904 457517 457385 457114 457209 457894 459326 461509 464197 467200 470551 474104 477386 480274 483479 487986
59538 487986 494428 503270 514905 529021 544621 561356 579897 599699 616973 626577 626339 618616 607715
59525 607715 596909 587988 581987 579159 578820 580090 582588 586081 589975 593653 596917 599523 600645 599407
59511 599407 595822 590709 584669 577590 569181 559561 549175 538452 527851 518062 509782 503139 497547
59498 497547 492314 487323 482959 479480 476706 474349 472435 471324 471336 472268 473261 473423 472836 472617 473610 475352
59482 475352 476871 478179 480113 482848 485632 488204 491473 496304 502430 509088 516048 523437 531191 539196
59468 539196 547322 554728 559823 561781 561657 561296 561479 561781 561736 561331 560698 560119 560210 561490 564047 568100 574395
59451 574395 583291 593868 604777 615605 626632 637598 647717 656651 664457 670619 674099 674402 671822
59438 671822 666661 659053 649602 639379 629108 618941 609065 599865 591539 584183 578167 573725 570322
59425 570322 567218 564625 563515 564451 567440 572770 580870 591368 603426 617080 633118 651495 671153
59412 671153 691676 713697 737238 761235 785419 810820 836550 857231 865846 859527 841612 818421
59400 818421 795337 775647 761033 751982 748374 750326 757708 768087 775833 774628 761522 738571 710779
59387 710779 682808 657280 635072 616191 600326 587183 576711 569021 564010 561188 559921 559685 560103
59374 560103 560934 562164 563907 566133 568692 571651 575247 579380 583586 587757 592410 597809 603260 607878
59360 607878 611754 615723 620191 624934 629987 635891 642844 650288 657724 665449 674062 683599 693567 703714
59346 703714 714454 726519 740302 755524 771369 786991 801969 816370 830429 843994 856103
59335 856103 865201 870177 871228 869344 864965 857733 847636 835594 822470 808184 792481 775996 759792
59322 759792 744247 729222 715005 702199 690848 680477 670897 662253 654448 647344 641387 637081 633859
59309 633859 630480 626661 623397 621399 620169 619090 618642 619902 623295 628353 634372 640978 648392 657370
59295 657370 668536 681342 693665 702472 704929 699518 686932 669926 651638 633825 616974 601696
59283 601696 589068 579565 572585 567358 563613 561140 559540 558888 559961 563328 568702 575558 583788 593313
59269 593313 603642 614451 626190 639429 653769 667881 680551 691342 700354 707637 712803 715082
59257 715082 713892 709432 702597 694266 684884 674700 664032 653258 642826 633343 625287 618613 612947
59244 612947 608253 604938 603313 603249 604420 606493 609109 612115 615857 620900 627421 635132 643531 651820 658913
59229 658913 664255 668462 672434 675940 677921 678118 677370 676124 673651 669188 663030 656009 648563 640864 633376
59214 633376 626744 621394 617403 614381 611436 607756 603375 598811 594029 588608 582948 578230 574800 571568
59200 571568 567644 563629 560573 558336 555879 552730 549376 546492 544442 543386 543253 543615 543902 543758 543146
59185 543146 542426 542391 543757 546450 549795 553446 557541 561876 565718 568783 571708 575132 578917 582720 586750
59170 586750 591487 597140 603769 611428 619835 628402 637014 646218 656319 666839 677196 687192 696436
59157 696436 703980 709196 712389 713948 713408 710004 703743 695375 685653 675094 664033 652476 640328
59144 640328 628106 616867 607013 597834 588679 579874 571857 564173 556167 548170 541116 535339 530454 526093
59130 526093 522090 518215 514413 511082 508600 506909 506003 506396 508486 511883 515961 520701 526368 532710 539184
59115 539184 545705 552631 560245 568676 577904 587346 595961 603344 610287 617624 625042 631745 637793 643855
59101 643855 649951 655292 659341 662359 664917 667324 669375 670317 669420 666953 664145 661797 659531 656927 654617
59086 654617 653385 652844 652020 650821 649854 648985 647134 643480 638070 631340 623786 616053 608642 601535 594542
59071 594542 587857 581750 576095 570743 565964 561820 557576 552636 547730 544275 542685 542089 541461 540221 537993
59056 537993 534792 531447 529001 527593 526570 525571 524792 524350 524069 523828 523454 522505 520831 519128 518135 517588
59040 517588 516778 515881 515705 516274 516729 516694 516741 517350 518304 519313 520409 521555 522632 524069 526747 531025 536437
59023 536437 542489 549228 556898 565629 575577 586800 598839 610912 622516 633377 642918 650387 655517
59010 655517 658491 659296 657761 654257 649805 645403 641720 639290 638389 638753 639961 642046 645202 649171 653671
58995 653671 659196 666433 674810 682565 688531 693167 697556 702022 706104 709392 711902 713713 714470 713371
58981 713371 709851 704343 698036 691784 685778 680397 676576 674813 674611 675598 678394 683504 690168 697407 705527
58966 705527 715270 725969 736031 745091 754284 764399 775075 785878 796860 807734 817509 825273
58954 825273 830574 832967 832075 828105 821429 811760 798736 783273 767186 751433 735721 719835 704260
58941 704260 689452 675680 663627 653945 646059 638666 631671 626393 623572 622325 621373 620114 618165 615143
58927 615143 611475 608267 605850 603449 600696 598305 596705 595205 593171 590960 589043 587225 585455 584358
58913 584358 584253 584527 584783 585638 587598 590016 592121 594368 597789 602584 608206 614442 621643 630263 640776
58898 640776 653566 668314 683896 699393 714757 730023 744528 757604 769631 781835 795350
58887 795350 810906 828937 849366 871512 894553 917812 940457 961483 980267 996577 1009799
58876 1009799 1018839 1023199 1023472 1020285 1013307 1001837 985938 966597 945137 922798 900512 878819
58864 878819 858329 840166 825216 812837 801214 789330 777833 767620 758400 749153 739253 728588
58852 728588 717185 705340 693685 682651 672163 662112 652695 644130 636547 630199 625165 620766 616021
58839 616021 610750 605437 600023 593817 586755 579643 572904 566160 559407 553472 548785 544715 540646 536792
58825 536792 533497 530727 528709 527997 528400 528904 529222 530319 532860 536322 540275 545200 551111 556637 560619
58810 560619 563639 566908 570499 573750 576492 578737 579902 579574 578463 577561 576878 575909 574651 573194 570985
58795 570985 567623 563815 560456 557213 553055 547816 542301 537224 532954 529905 528264 527608 527537 528329 530312
58780 530312 533053 535921 539022 542853 547443 552373 557161 561157 563761 565309 566836 568243 567702 563866
58766 563866 557815 551755 546605 541992 537766 534068 530408 526151 521808 518702 517386 517276 517642 518171 518804
58751 518804 519821 521785 524734 527849 530506 533094 536093 539107 541705 544430 547944 551877 555649 559790
58737 559790 565216 571669 578120 584275 590448 596323 601150 605011 608819 613207 618333 624393 631299 638147
58723 638147 644086 649411 654864 660319 665280 670168 675828 682064 688044 693991 701169 710169 720357 730968
58709 730968 741567 751395 759420 765225 768959 770367 768788 764168 757207 748425 737758 725003 709993
58696 709993 692580 673209 653283 634184 616163 598879 582552 567695 554174 541614 530391
58685 530391 521128 513523 506764 500853 496330 492859 489299 485207 481168 477648 474496 471616 469167 467071
58671 467071 465142 463692 463297 464090 466039 469601 475240 482554 490810 500067 510823 522841 535230 547347
58657 547347 558599 567690 573277 575338 574917 572760 569107 564538 559836 555115 550105 545158 540974 537503
58643 537503 534143 530920 528533 527430 527680 529439 532532 535922 538625 540851 543255 545531 546910 547594 548357
58628 548357 549014 548667 547230 545372 543105 539761 535318 530432 525240 519404 513367 508351 505073 503520 503889
58613 503889 506621 511535 517962 525544 533937 542096 548992 554720 559747 563477 564916 564371 563096 561572
58599 561572 559521 557227 555295 553388 550758 547737 545142 542534 538844 534508 531165 529346 528341 528341 530703
58584 530703 535824 542512 549810 557781 566278 574636 582926 591943 601626 611021 619975 629244 638672 647071
58570 647071 654282 661735 670504 680385 691240 703676 717960 733826 751734 772743 796640 821698
58558 821698 846711 871785 896713 920191 941196 959634 975042 986037 991691 992350 988819 982000
58546 982000 973485 964985 956790 948037 938577 929170 919896 910047 899551 888609 875854 858993 837832
58533 837832 814852 792445 771341 751958 735075 720580 707603 696560 689091 685319 683229 681512
58521 681512 680957 682227 684353 686461 688970 691832 693465 692731 690462 687877 684948 681301 677324 673418 669508
58506 669508 666011 663760 662317 660001 656263 652360 649053 645540 641418 637709 634972 632304 629222 626642
58492 626642 624997 623270 620962 619120 618344 617758 617096 617818 620843 625109 629726 635590 643350 651756 659768
58477 659768 668737 680716 695839 712751 730270 747241 762102 773952 782952 788779 790163 786886
58465 786886 780608 772719 763126 752118 741465 732407 724433 717333 712542 711090 712132 714861 719967 727756
58451 727756 736821 746092 756290 767774 778803 787506 793633 796867 795663 789686 781471 773548 765620
58438 765620 756394 746448 737374 729758 723914 720925 721018 722508 724072 726428 730233 734369 738178 743284 751037
58423 751037 760101 768737 777572 787825 798627 808416 817230 825252 830859 832537 831153 828047 822600 814028
58409 814028 803864 794172 784860 775175 766118 758793 752028 744289 736408 729869 723998 717578 711666 707982
58395 707982 705935 704059 702990 704098 706476 708272 709851 712679 716109 718161 718706 719164 719821 719914 719553 719284
58379 719284 718721 717771 717929 720220 723326 725965 729383 734960 741266 746309 750979 757236 764570 771350 778156
58364 778156 786555 796005 805125 814674 826073 838409 850119 862190 876342 891409 904920 916915
58352 916915 928734 939356 946528 950492 953108 954467 953860 952891 953975 956714 959204 961787 966047 971372
58338 971372 976237 981708 989900 1000090 1010105 1020399 1032993 1047510 1062156 1077408 1094750 1112939
58326 1112939 1129576 1145148 1161341 1176583 1187676 1194814 1200597 1205146 1206764 1206402 1206736 1207583 1206911 1205679
58312 1205679 1206992 1211063 1215652 1220822 1228570 1238429 1248192 1258347 1271009 1285172 1297931 1309766 1323607
58299 1323607 1339321 1354275 1368751 1385489 1404232 1421987 1438348 1455422 1473003 1489162 1505071
58288 1505071 1523709 1544265 1563357 1581356 1601771 1624886 1647865 1670726 1696119 1723561 1750054
58277 1750054 1776160 1805152 1836411 1866139 1894476 1925340 1959256 1993071 2026735 2063516 2103336
58266 2103336 2142756 2181824 2224085 2269771 2315962 2363349 2415531 2471698 2527634 2583877 2644963
58255 2644963 2710572 2775640 2839255 2904990 2972385 3037203 3100581 3168671 3242585 3317930 3394906
58244 3394906 3479077 3571344 3667194 3766784 3875301 3992289 4111521 4232937 4363633 4505433
58234 4505433 4652912 4805501 4969694 5147271 5333456 5528909 5741111 5971620 6214925
58225 6214925 6472149 6752249 7057304 7381069 7724826 8099452 8508819 8947239 9416981
58216 9416981 9931739 10499009 11116712 11791468 12541777 13378754 14303652 15329618 16485453
58207 16485453 17793610 19268352 20942934 22875936 25126171 27747986 30815722 34420298
58199 34420298 38633755 43513303 49154126 55709040 63360773 72338050 82988419 95793247
58191 95793247 111295487 130058081 152666177 179609841 211030087 246547261 285166609
58184 285166609 324876776 361948209 390911179 406192346 404784758 387861296 359923196
58177 359923196 326301949 291071222 256523906 223760381 193386018 165844206 141459417
58170 141459417 120369582 102470107 87454064 74934027 64535645 55911545 48739175
58163 48739175 42747344 37728227 33509273 29934032 26878987 24261800 22015851 20072583
58155 20072583 18375981 16891772 15589397 14431492 13390008 12454758 11615668 10852054
58147 10852054 10148042 9502854 8916465 8379057 7883017 7431335 7025100 6654895 6312655
58138 6312655 6000277 5718776 5460063 5216705 4989170 4776611 4571232 4368939 4175612
58129 4175612 3995965 3825707 3661063 3506422 3365729 3235186 3111083 2996337 2892785
58120 2892785 2795140 2699146 2608154 2525479 2447577 2370901 2298384 2232974 2171286 2109595 2050003
58109 2050003 1995197 1942975 1891111 1841813 1796489 1751914 1706288 1663195 1624883 1587530 1547899
58098 1547899 1508816 1473228 1438704 1402830 1368451 1338324 1309783 1279821 1250558 1224708 1200383
58087 1200383 1175330 1151756 1132006 1113733 1094092 1074545 1056984 1039236 1019082 998805 981189
58076 981189 964699 946928 929104 912965 896893 879394 862826 849475 837396 824171 811267
58065 811267 800652 790698 779604 769388 762164 755748 747271 738029 730498 723517 714743 705118 696645
58052 696645 688245 677893 666522 656028 645798 634914 625303 618936 614219 608755 603373 599865 597141
58039 597141 593203 588643 584698 580192 573965 567958 564240 561104 555729 548565 541574 534254 525133 515307
58025 515307 506834 499257 491060 482891 476106 469866 462803 455753 449807 443624 435933 428697 424447 422293
58011 422293 419822 417030 415078 413166 410211 407761 407578 407967 406194 402979 400908 399857 397848 395251 394215
57996 394215 394714 394778 394045 393732 393699 392822 391689 391892 393061 393424 392685 391727 390339 388014 386065 386064 386924 386297
57978 386297 384054 381710 379402 376311 373199 371469 370388 368103 364867 362452 361004 359269 357345 356391
57964 356391 356062 355007 353536 353197 354034 354756 355212 356239 357484 357744 357061 356260 354987 352426 349277 346703
57948 346703 344139 340548 337006 335433 335466 335233 334596 334978 336564 338410 340839 345030 350572 356078 361864
57933 361864 369347 378123 386419 394275 403455 414016 423590 430443 435084 438607 441391 443508 444639 443690
57919 443690 440184 435572 431385 426912 420829 414171 409140 405600 401545 396652 392610 390067 387953 385904
57905 385904 384756 384435 383711 382214 380503 378096 373740 367710 361679 356285 350890 345586 341181 337366 333231
57890 333231 329510 327936 328354 328878 328908 329534 330950 332006 332568 333778 335645 336780 336912 337265 338028 337854 336352
57873 336352 334816 333894 332780 331254 330335 330259 329918 328936 328311 328345 327936 326572 325215 324582 324362 324593 326044
57856 326044 328685 331552 334448 337959 341545 343689 344326 345096 346688 347965 348180 347964 347525 346035 343540
57841 343540 341421 340096 338222 335004 331330 327761 323395 317853 312552 308791 306091 303496 301076 299131
57827 299131 297282 295347 293910 293197 292590 291954 292142 293486 295072 296212 297381 299050 300841 302435 304089
57812 304089 305706 306580 306483 305778 304155 300658 295351 289518 283888 278151 272574 268378 265905 264006 261880
57797 261880 260075 259169 258927 259331 260893 263404 265863 268115 271019 274601 277792 280462 283794 287974 291464
57782 291464 293424 294996 297158 299169 300334 301650 304267 307657 310635 313100 315643 318448 321506 324864
57768 324864 327889 329393 329272 328803 328624 327707 325102 321383 317505 313569 309563 306056 303232 300451 297625
57753 297625 295809 295513 295715 295417 294975 294901 294509 292756 289506 285168 280104 275047 270991 267996 265197 262472
57737 262472 260765 260260 259793 258798 258218 258622 259018 258597 258116 258395 258855 258720 258355 258207 257687 256273 254543 252987
57719 252987 251031 248346 245902 244545 243691 242587 241633 241296 240891 239710 238254 237098 235678 233458 231178
57704 231178 229612 228163 226044 223840 222524 221843 221045 220321 220205 220344 220219 220296 221170 222238 222479 221908 221114
57687 221114 220010 218149 215647 212825 209634 206296 203716 202400 201897 202176 204417 209365 216087 223619 232807
57672 232807 245188 261055 280127 303246 331825 366106 405279 448811 496281 545911 593690
57661 593690 633303 656852 657791 635281 595317 546583 495728 446761 402586 364731 332467 304277
57649 304277 279957 260059 244121 231030 220547 212958 207724 203849 201065 199424 198320 197158 196305
57636 196305 196144 195965 195014 193789 192961 191983 190280 188857 188965 190007 190539 190601 191158 191864 191375 189566 187550
57619 187550 185712 183542 181170 179276 177569 175102 172072 169675 168176 166716 165057 163907 163399 162784 161922
57604 161922 161724 162775 164582 166383 167778 168603 169057 169785 170865 171127 169569 167034 165212 164364 163390 161831
57588 161831 160278 159004 157633 156140 154800 153215 150708 147688 145301 143785 142410 140994 140137 139953 139818
57573 139818 139455 139101 138637 137720 136635 135850 134894 132946 130407 128565 127727 126994 125808 124412 122882 121093
57557 121093 119636 119349 119836 119797 118928 118184 118126 118488 119496 122071 126187 130262 132760 133509 133194 132527 132137
57540 132137 132313 132621 132546 132486 133238 134634 135790 136542 137444 138369 138400 137244 135600 133964 132167 130195 128405
57523 128405 126828 125234 123914 123340 123185 122824 122729 124153 127352 131242 134833 137913 140368 142028 143173
57508 143173 144158 144689 144532 144501 145363 146222 145651 144123 143399 143609 143033 141040 139108 138304 137663 135945 133423
57491 133423 130983 128859 127110 126086 125547 124436 122307 120073 118767 118539 119269 120977 123021 124050 123468
57476 123468 122129 121078 120512 120341 120678 121307 121589 121332 120917 120354 119229 117730 116522 115422 113487 110734
57460 110734 108433 107346 106987 106982 107746 109291 110761 111746 112748 113797 113997 113020 111697 110507 108893 106749
57444 106749 105148 104700 104610 104252 104307 105358 106604 107127 107260 107633 107917 107638 107257 107305 107365 106957 106644 107153 108143
57425 108143 108867 109337 109893 110261 109987 109245 108434 107600 106910 106893 107415 107274 105720 103730 102875 103495 104821 106255
57407 106255 107680 109000 110111 111000 111396 110885 109702 108684 108021 107020 105544 104617 104898 105603 105771 105654
57391 105654 105927 106437 106700 106938 107628 108724 110148 112406 115783 119501 122555 124942 127314 129914 132464
57376 132464 134576 135716 135385 133862 132113 130527 128574 126138 124156 123294 123015 122655 122371 122204 121338 119322
57360 119322 117123 115907 115604 115648 116216 117626 119317 120542 121424 122274 122599 121914 120914 120740 121624 123257 125819
57343 125819 129461 133284 136034 137481 138165 138261 137682 136843 136305 135974 135517 135138 135122 135125 134825 134737 135424 136403 136808
57324 136808 136666 136560 136508 136186 135867 136060 136441 136061 134464 132019 129485 127852 128016 129800 131735 132543 132360
57307 132360 131955 131481 130827 130432 130774 131598 132478 133564 134941 136023 136466 136992 138402 140470 142703 145229
57291 145229 147844 149177 148230 146050 144519 144105 144123 144407 145101 145348 143987 141397 139103 137675 136452 135183
57275 135183 134427 134279 134117 133743 133581 133610 133297 132749 132862 134109 136057 138161 140228 142077 143503 144555 145255
57258 145255 145349 144968 145068 146356 148321 150282 152766 156630 161352 165524 168650 171140 172959 173854 174661 176769
57242 176769 180195 183640 186501 189309 192032 193543 193344 192572 192692 194110 196452 199250 201957 204141 206069
57227 206069 208472 211610 215248 219566 225189 232156 239695 247207 254767 262541 270359 277997 285285 292040
57213 292040 298461 305339 313183 321451 329440 337458 346121 354940 362905 370255 378288 387422 396796 405911
57199 405911 415343 425550 436240 447365 459659 473579 488500 503404 517773 531561 544962 558413
57187 558413 572188 585917 599119 612227 626290 641578 657255 672607 687832 703487 719798
57176 719798 736834 754801 773955 794371 815768 837429 858724 879954 902084 925280 948545
57165 948545 971402 994902 1020016 1046015 1071691 1097344 1124107 1152096 1180813 1210798 1243024
57154 1243024 1276956 1311012 1344944 1380078 1417213 1455932 1496060 1538069 1581723 1625856 1669918
57143 1669918 1714375 1759317 1804113 1848797 1894373 1941237 1988578 2035847 2083679 2132867 2183467
57132 2183467 2235334 2288584 2343216 2399196 2457144 2518069 2582346 2649923 2721452 2798058 2879988
57121 2879988 2966749 3058589 3156479 3260519 3369819 3484260 3605032 3733064 3868285 4010983
57111 4010983 4162740 4325602 4501424 4692534 4902295 5134820 5395152 5690067 6028160
57102 6028160 6419499 6876405 7414721 8053560 8814105 9719435 10794861 12067226 13564788
57093 13564788 15319402 17367642 19746174 22483047 25590794 29063660 32877988 36995881
57085 36995881 41370032 45943158 50642431 55382980 60087413 64698835 69156452 73341975
57077 73341975 77048231 80008901 81972045 82767116 82334200 80717867 78040185 74465517
57069 74465517 70170640 65331014 60120747 54713865 49279658 43974261 38931460 34253458
57061 34253458 30004781 26213587 22879169 19980066 17480509 15336919 13504183 11939292
57053 11939292 10602545 9458627 8477430 7633126 6902833 6267160 5711236 5223674 4794694
57044 4794694 4416106 4082069 3787955 3528553 3298479 3093732 2911388 2748328 2601721
57035 2601721 2470290 2353600 2250565 2160109 2082702 2019492 1970408 1934936 1914235 1910175 1922294
57024 1922294 1948112 1986597 2037907 2096937 2148133 2169530 2144023 2068429 1953776 1818130 1678070
57013 1678070 1544141 1421206 1310876 1213201 1127448 1052832 988826 934536 888220 847964 812576
57002 812576 781436 753993 729868 708909 690560 673732 657823 643246 630394 618844 608256
56991 608256 599187 592113 586423 581386 577477 575773 576676 580204 586772 596377 607410 617324 624070 625975
56977 625975 621092 608272 588767 565601 541483 518149 497076 479268 464406 451418 440036 430975
56965 430975 424855 421883 422357 426495 434006 444692 459078 477451 498754 521574 545635 570687 593924
56952 593924 610079 614687 606705 588333 563452 536138 509173 483324 458632 436296 418430 405954
56940 405954 397805 392457 389446 389215 392340 399272 410322 425606 445284 469786 499277 532691 567243
56927 567243 598531 621099 630012 623055 601665 569671 531607 492027 454797 421724 392409 366219
56915 366219 343657 325061 309223 294749 282087 272631 266267 261148 255652 249425 242863 236802 232402
56902 232402 230054 228639 226878 225035 224171 224343 224900 226095 228852 233240 238721 245783 255843 269549
56888 269549 286502 306596 330150 356585 384212 411329 436250 456361 468720 472098 467550 457031
56876 457031 442503 426260 410616 396888 385562 377376 373151 372664 375015 380251 389578 404032 424123
56863 424123 450694 484741 526204 574076 627774 686983 749541 810034 860512 892417 899422 880918
56851 880918 843143 795466 745068 695657 649947 610753 579501 556006 540485 534116 537081 547972
56839 547972 566038 592611 629537 677620 737326 809411 893618 987475 1086578 1184139 1269158
56828 1269158 1327148 1345928 1322140 1262411 1178887 1083869 987059 895405 813820 745347 690616
56817 690616 648033 615589 592604 579234 574938 578814 591325 614291 648848 694515 750281 815040
56805 815040 886017 957326 1020374 1065347 1083341 1069605 1026240 961342 884975 805885 730687
56794 730687 663643 606188 557727 517574 485596 461262 443576 432209 427428 428817 435611 448453
56782 448453 469056 497477 531262 567740 605233 640828 668626 681969 677202 655016 619401 576114
56770 576114 530790 486965 445883 408210 374843 345828 320007 296703 276587 260195 246761
56759 246761 235474 226679 220728 216529 212313 207247 201540 195723 190541 186758 184259 182056 179718 177932
56745 177932 177080 176307 174765 172843 171355 170365 169555 168907 168258 167036 165217 163727 163207 163195 163229 163744 165065
56728 165065 166462 167121 167275 167503 167743 167829 168213 169183 170074 170167 169814 169915 170889 172791 175677 179077 181853 183371
56710 183371 184164 184831 185100 184659 184045 183838 183739 183317 182966 183243 183939 184539 184967 185159 184648 183307 181786 180525
56692 180525 179178 177718 177191 178405 180610 182392 183259 183472 183096 182162 181204 180690 180369 179892 179509 179472 179430 179124
56674 179124 179046 179675 180706 181675 182665 183774 184643 185158 185831 186878 187770 188282 188951 189764 189539 187602 185047
56657 185047 183298 182330 181379 180437 179870 179352 178460 177689 177741 178367 178930 179481 180304 181027 181213 181259 181690 182208 182372
56638 182372 182547 183220 184108 184959 186474 189268 192603 195315 197386 199411 201114 201700 201280 200746 200497 200303
56622 200303 200072 199786 199016 197440 195523 193908 192524 190987 189353 187762 186009 184236 183297 183588 184313 184778
56606 184778 185505 187032 188524 188805 188043 187211 186580 185914 185467 185521 185603 185404 185791 187522 189599 190300 189421 188160
56588 188160 187222 186449 185945 186125 186749 187148 187320 187817 188795 190103 191940 194362 196551 197614 197842 198209 199008
56571 199008 199922 200981 202433 204081 205698 207684 210470 213805 217444 221804 227074 232585 238149 245131
56557 245131 254905 266982 279813 292498 304356 313790 319442 321912 322792 322506 320685 318032 315961 314636
56543 314636 313004 310663 308227 306003 303713 301377 299200 296802 293742 290493 287676 284868 281434 277932
56529 277932 275231 272766 269308 265038 261214 258159 255266 252644 250983 249887 248115 245520 243197 241636
56515 241636 240195 238424 236512 234411 231834 229115 226871 224972 223042 221646 221571 222265 222411 221794 221158 220572
56499 220572 219564 218628 218877 220231 221478 222102 222631 223252 223549 223511 223431 223039 222096 221484 222155 223373 223702 223367
56481 223367 223791 225049 225742 225371 224884 224767 224408 223632 223168 223358 223873 224738 226148 227373 227511 227208 227964 229800
56463 229800 231376 232281 233320 234631 235548 236320 237840 239468 239378 237481 235938 236170 237302 238089 238468 238510 237688
56446 237688 236099 234943 235019 235931 237216 238941 240884 242482 243839 245421 246739 246886 246354 246557 247454 247570
56430 247570 246565 245786 245914 246128 246052 246542 247892 249161 249903 250788 251840 251955 250887 249935 249886 249962 249604 249626
56412 249626 250750 252496 254298 256273 258238 259446 259944 260797 262395 264024 265558 267962 271526 275152 278084
56397 278084 280909 284268 287935 291570 294994 297412 297859 296687 295172 293588 291314 288724 286870 285214
56383 285214 281939 276823 271563 266887 261714 255704 250193 245856 241863 238159 236175 236298 236991 237459 238853
56368 238853 241683 244374 245754 246837 248737 250860 252501 254275 256537 258275 258906 259430 260567 261562 261997
56353 261997 262904 264834 266731 267920 269231 270951 271781 271225 270918 272013 273279 273405 273213 273865 274767 275157
56337 275157 276022 278545 282111 285573 289036 292765 295853 297700 299446 302304 305755 308877 312079 315996
56323 315996 319980 323113 325511 327397 328344 328562 329389 331288 332989 333742 334559 335983 336648 335574 334011 333428
56307 333428 333538 333856 335207 337881 340231 341054 341648 343661 346632 349532 352989 357890 363300 367707 370998
56292 370998 373557 375047 375841 377901 382294 387421 391533 395273 399871 404720 408851 413066 418362 423832
56278 423832 428357 432831 438533 444837 450764 457225 465408 474388 482721 491068 500914 511981 523235 535171
56264 535171 548759 563257 577384 591645 607452 625085 644519 666930 693248 722499 753729
56253 753729 788242 827855 872391 921123 975255 1036548 1104737 1178704 1258947 1346558 1440815
56242 1440815 1540051 1643682 1751102 1859705 1966282 2069247 2167401 2257829 2337164 2403728
56232 2403728 2456406 2492912 2511405 2512359 2496744 2464129 2414868 2352352 2280489 2200649 2113525 2022008
56220 2022008 1929278 1835845 1741543 1648755 1560543 1477163 1397644 1323200 1255652 1193901 1135527
56209 1135527 1080693 1031043 985898 943181 903142 867591 836214 807172 780561 757705 737690
56198 737690 718227 699521 683750 670988 659078 647439 637646 630161 623484 616740 610483 605004 600198
56185 600198 596733 595053 593862 591875 590081 589798 589688 587537 583867 580880 578983 577364 576685 577909 579559
56170 579559 579594 579055 580475 583681 586600 589260 593350 598638 603436 607961 613763 620545 626956 633663 642179
56155 642179 651623 660250 669167 680724 694189 707021 719548 734379 752024 771265 793076 819826
56143 819826 851164 885079 922686 967663 1021260 1082074 1150322 1227878 1314158 1406169 1502429
56132 1502429 1602495 1702689 1796598 1880045 1952086 2012024 2060092 2100737 2140319 2180964 2220175
56121 2220175 2255632 2285842 2306894 2314101 2307370 2290642 2266232 2234117 2195945 2153992 2105920 2045989
56109 2045989 1972289 1888277 1797309 1701006 1603289 1510425 1425794 1349054 1280822 1223335 1176145
56098 1176145 1136211 1102749 1077164 1058111 1041905 1028096 1019235 1014841 1011223 1007689 1007144 1009904 1012765
56085 1012765 1014951 1019074 1025308 1030573 1034592 1040785 1049867 1058502 1065611 1074092 1084864 1095067 1103711
56072 1103711 1113388 1124910 1135885 1145934 1157549 1170616 1182036 1192035 1204698 1220974 1237319 1252525
56060 1252525 1269470 1288738 1307172 1324318 1343661 1365773 1386911 1406028 1426343 1448271 1467865
56049 1467865 1484230 1501415 1520988 1539774 1556872 1575584 1596410 1615627 1632958 1653020 1677030
56038 1677030 1700879 1723600 1749589 1779968 1810089 1838309 1868817 1902987 1936567 1968478 2003590
56027 2003590 2043521 2083517 2121812 2163056 2208969 2254826 2298936 2346226 2398539 2450852 2501201
56016 2501201 2554741 2613885 2674229 2734342 2799396 2870775 2942658 3013453 3089776 3174386 3261429
56005 3261429 3348606 3442360 3545627 3652490 3760719 3877149 4004518 4135714 4267603 4407502
55995 4407502 4559187 4716120 4875877 5047160 5234567 5430790 5632345 5848239 6084170
55986 6084170 6333427 6592996 6873028 7180351 7508620 7855222 8231248 8643918 9086678
55977 9086678 9558264 10073417 10642851 11262159 11933494 12677676 13511221 14433486 15451655
55968 15451655 16595539 17892432 19353714 21005507 22907526 25124167 27706742 30724032
55960 30724032 34276475 38456127 43329421 48989101 55590657 63320617 72391186 83116233
55952 83116233 95950709 111419164 130060351 152456087 179162657 210444316 246040125
55945 246040125 285074669 325724945 364457775 395728301 413368091 413377408 396028100
55938 396028100 365507554 327595045 287384837 248351135 212479030 180666159 153087377
55931 153087377 129544840 109715201 93206817 79552078 68273552 58962175 51270006
55924 51270006 44876302 39510771 34983635 31154070 27888452 25073652 22640744 20540914
55916 20540914 18714692 17107392 15692317 14452438 13355958 12371442 11489237 10706049
55908 10706049 10003316 9360245 8773398 8244460 7761983 7312654 6897734 6521496 6175175
55899 6175175 5848012 5542754 5265163 5009018 4765788 4538664 4333036 4142972 3960550
55890 3960550 3789083 3634152 3490634 3351282 3219623 3102073 2995360 2893505 2799419 2718071
55880 2718071 2645548 2575791 2510806 2453409 2397112 2334197 2267375 2203131 2139963 2073351 2006014
55869 2006014 1942760 1880763 1814971 1748067 1685703 1626860 1567974 1511607 1462035 1416972 1372294
55858 1372294 1330264 1294698 1262635 1229225 1196425 1168663 1144177 1118675 1093256 1070831 1048944
55847 1048944 1023991 998398 975809 953373 926753 898794 875120 854801 833355 811559 793229
55836 793229 777334 760233 743095 729495 718146 705300 691914 681302 672193 661241 650075 642679
55824 642679 637851 631231 622864 615928 609840 601456 591498 583134 575564 565444 553413 542971 534164
55811 534164 524422 514468 507367 502677 497348 491510 487870 486321 484572 483210 484884 489267 493881 499017
55797 499017 506948 517125 526726 534903 542140 546945 547868 547181 547717 547645 543303 535540 528100 521302 512837
55782 512837 503513 496478 491333 484356 474137 462144 448475 432214 415536 402380 393170 385351 378611
55769 378611 374976 374311 374540 375873 379968 385109 387007 384484 380043 375022 368660 361728 356403 352243 346560
55754 346560 338986 331702 325199 317955 310260 304119 299165 292759 284400 276186 268807 261052 253417 248199
55740 248199 245633 243626 241554 240682 240748 239951 238480 238260 238990 238297 236119 235083 236009 236737 235963 234611 232870
55723 232870 229458 224528 219940 216004 211163 205370 200479 196837 192891 188788 186940 188219 190770 193340
55709 193340 196741 201299 205906 210343 215653 221475 225835 228227 230106 231754 231495 228625 224370 219421
55695 219421 213253 206387 200450 195460 189864 183851 179715 178251 177547 176144 174736 174038 173593 173446 174572
55680 174572 176970 179638 182743 187411 193092 197842 201412 205248 209053 210404 208426 205018 201742 198332
55666 198332 194918 192807 192110 191310 190014 189536 190070 190117 189558 190374 193213 196111 197831 199732 202949 206276
55650 206276 208424 210095 212294 214579 216365 218113 219983 221045 220877 220231 219274 216940 212817 207844 202450
55635 202450 195942 188411 181303 175357 169906 164778 160828 157963 154792 150906 147408 144615 141527 138209
55621 138209 136266 136082 135960 134949 134157 134251 134081 133016 132379 133161 134308 134568 134203 133758 132898 131517 130191
55604 130191 128666 125814 121943 119071 118030 117467 116627 116741 118452 120268 120995 121551 122792 123647 123083 122057
55588 122057 121795 121816 121214 120417 120149 120091 119914 120163 120964 121396 121395 122588 125950 130243 134096 137973 142727 147861
55570 147861 152792 158345 165435 173545 181823 190268 198475 204659 207468 207577 206226 203426 198883 193314
55556 193314 187510 181312 174804 169172 165038 161220 156472 151270 146642 142489 138387 134806 132171 129884
55542 129884 127535 125952 125778 126188 126237 126319 127093 128172 129085 130303 132021 133226 133333 133522 135019 137144 138482
55525 138482 138914 139168 139328 139177 139049 139102 138708 137743 137401 138509 140160 141224 142128 143786 145902 147647 148932
55508 148932 149587 148396 144452 138554 131838 124037 114621 104693 96054 89006 82629 76699 71874 68442
55494 68442 66123 64734 64023 63362 62581 62504 63755 65712 67485 69052 70597 71673 72033 72334 73047 73644 73804
55477 73804 74298 75586 76712 76794 76509 76809 77312 77335 77449 78542 80228 81590 82571 83288 83015 81391 79727
55460 79727 79465 80103 80224 79796 79831 80402 80698 80593 80589 80619 80324 80130 80670 81489 81629 81100 80599 80251 79827 79652
55440 79652 80055 80395 79904 78993 78573 78609 78578 78781 79899 81724 83510 85083 86493 87224 86924 86278 85945 85385
55422 85385 84029 82813 83036 84372 85555 86415 87601 88851 89270 89101 89617 91369 93880 96747 99624 101460
55406 101460 101324 99902 98777 98393 97941 96994 95825 94407 92558 90973 90659 91318 91644 91189 90685 90583 90571
55389 90571 90527 90683 90817 90429 89786 89670 90094 90287 89963 89582 89443 89456 89663 90012 89887 88860 87606 86926 86246
55370 86246 84410 81709 79706 79071 78992 78786 78774 79286 80015 80726 81647 82845 83955 84735 85224 85387 85277 85409
55352 85409 86194 87108 87240 86501 85548 84765 84079 83578 83472 83678 84123 85070 86372 86948 86030 84458 83713 84046
55334 84046 84596 84885 85040 84911 84253 83576 83650 84320 84816 84994 85249 85548 85595 85571 85638 85173 83751 82450 82765 84494
55314 84494 85997 86346 85933 85290 84750 85084 86988 89862 92308 93731 94308 93815 91989 89867 89152 90123 91488
55297 91488 92241 92367 91898 90819 89864 89846 90195 89656 88410 87930 88667 89607 90241 91138 92227 92383 91366 90540
55279 90540 90869 91667 92080 92395 93057 93663 93841 94137 95144 96566 97753 98377 98161 96885 95154 94163 94190 94227
55261 94227 93545 92662 92289 92291 92263 92209 92144 91894 91738 92315 93426 93909 93251 92412 92433 93109 93673 93967 94191 94206 93827
55240 93827 93290 92869 92426 91836 91342 91130 91016 90909 91105 91781 92651 93345 93742 93824 93659 93554 93669 93526 92552
55221 92552 91056 89924 89364 88776 87898 87225 87176 87594 88159 88539 88183 86851 85371 84955 85670 86437 86550 86312
55203 86312 86242 86668 88067 90610 93282 94607 94433 93945 93796 93524 92968 92836 93352 93611 92980 92098 91846 92248
55185 92248 92983 94110 95628 97026 97847 98224 98513 98888 99414 99891 99669 98399 96890 96290 96534 96659 96492
55168 96492 96664 97034 96623 95366 94380 94115 93760 93028 92904 93871 94834 94734 94022 93612 93545 93615 94250 95702 97192
55149 97192 97761 97333 96318 95031 94086 94398 95963 97503 98006 97834 97681 97434 96820 96232 95970 95471 94210
55132 94210 92765 92205 92926 94634 96787 98540 99084 98698 98709 99795 101081 101453 100901 99946 98713 97312 96294
55115 96294 95946 95816 95613 95786 96566 97254 97221 96895 97038 97747 98752 99960 101058 101378 100764 99908 99368 99095
55097 99095 99255 100395 102224 103430 103447 103267 103787 104584 105169 106095 107691 108918 108771 107792 106997 106263 105132
55080 105132 104277 104710 106221 107894 109503 111080 111795 110753 108506 106503 105401 105006 105322 106368 107339 107269
55064 107269 106310 105302 104380 103104 101648 100738 100619 101018 101897 103309 104758 105603 105870 105900 105565 104593 103254
55047 103254 101972 100714 99469 98725 98689 98738 98450 98397 99000 99510 99227 98801 99051 99349 98728 97799 97892 98821 99280
55028 99280 99171 99695 101172 102509 103039 103395 104221 105314 106310 107130 107521 107219 106710 106827 107469 107720 107255 106565
55010 106565 105823 104694 103413 102907 103538 104649 105609 106421 107149 107632 107976 108567 109409 110125 110631 111117 111460 111461
54992 111461 111492 112013 112575 112351 111600 111487 112395 113441 113840 113749 113545 113251 112947 112965 113438 114298 115774 118068 120539
54973 120539 122102 122560 122724 123145 123565 123649 123345 122462 120888 119365 119053 120058 121268 121829 121906 121835 121608 121494
54955 121494 122088 123207 123639 122633 120928 119814 119773 120519 121694 122961 123897 124364 124640 124850 124642 123747 122492
54938 122492 121444 120807 120372 119843 119137 118571 118685 119541 120376 120442 120082 120372 121824 124043 126539 129102 131417
54921 131417 133199 134867 137282 140497 143557 145940 148561 152728 158495 164598 169849 174164 178060 181363
54907 181363 182761 181004 176513 171232 166598 162232 157023 150921 144967 140040 136336 133770 132081 130760
54893 130760 129555 128826 128727 128506 127481 126323 126315 127524 128803 129487 129992 130680 131273 131687 132487 134158 136616
54876 136616 139695 143476 147945 152861 158042 163316 168299 172778 177098 181481 185198 187210 187353 186054
54862 186054 183240 178603 172775 167077 162086 157454 153052 149177 145708 142251 139178 137296 136390 135279
54848 135279 133470 131544 129743 127590 125209 123683 123487 123759 123674 123435 123296 122705 121096 118741 116296 114293
54832 114293 113402 114099 115578 116091 115022 113640 113264 113737 114380 115261 116580 117753 118159 118056 117837 117075 115310
54815 115310 113239 112122 112339 113296 114411 115471 116354 117052 117753 118456 118839 118880 119067 119582 119897 119720 119726 120698
54797 120698 122406 123966 124935 125469 125785 125987 126145 126114 125625 124868 124525 124920 125626 126189 126636 126929 126674 125887
54779 125887 125333 125503 125864 125837 125931 127174 129760 132982 136198 139273 142288 145336 148433 151366 153884 156247
54763 156247 159153 162868 166993 171386 176674 183384 191037 198461 204491 208054 208345 205589 201102 196021
54749 196021 190391 183872 176752 169724 163228 157540 152968 149421 146262 143176 140644 138993 137582 135673
54735 135673 133679 132729 133146 134016 134250 133673 133123 133670 135584 138027 140037 141714 143855 146554 149087 151247
54719 151247 153741 156979 160595 164606 169777 176063 181783 185361 187013 187755 187584 185773 182307 177855 172770
54704 172770 167140 161522 156644 152674 149504 147327 146112 145000 143180 140996 139318 138187 137003 135703
54690 135703 134714 133968 132899 131391 129930 128973 128820 129780 131635 133223 133465 132690 132172 132498 133141 133392 132905
54673 132905 131519 129412 127362 126108 125539 125161 125122 125902 127173 127889 127511 126394 124994 123431 121902 120782
54657 120782 120237 120238 120893 122187 123562 124437 125032 126008 127351 128331 128510 128135 127555 126896 126377 126317 126731 127398 128289
54638 128289 129503 130853 131975 132715 133032 132780 132100 131672 131921 132247 131749 130499 129404 128979 128978 129037 128952 128471
54620 128471 127613 127088 127642 128973 130014 130227 129913 129348 128442 127354 126645 126586 126824 126893 126609 126005 125318 125011
54602 125011 125346 126009 126562 127041 127631 128095 128194 128342 129103 130229 130924 130925 130617 130319 130236 130813 132186 133422 133291
54583 133291 131823 130238 129357 128965 128728 128730 128911 128815 128161 127077 125727 124389 123769 124382 125635 126422 126604 126980
54565 126980 127785 128325 128266 128215 128720 129700 131189 133528 136296 138062 137918 136593 135434 134950 134852 134886 135014 135237
54547 135237 135740 136794 138184 139278 139962 140883 142323 143535 143739 143252 143067 143679 144791 145796 146108 145443
54531 145443 144219 143375 143400 143867 144149 144127 143868 143191 142115 141303 141429 142280 142986 142982 142392 141596 140820 140029 139000
54512 139000 137674 136588 136671 138255 140534 142324 143217 143651 144033 144185 143731 142682 141477 140490 139688 138879 138155
54495 138155 137828 137952 138274 138747 139577 140532 140824 140196 139580 139937 140880 141342 141263 141556 142524 143402 143639 143616 143797
54476 143797 144138 144667 145755 147296 148464 148863 149237 150404 152046 153241 153782 154287 155259 156520 157440 157381 156178
54459 156178 154526 153645 154192 155662 157031 157725 157774 157370 156649 155744 154774 153823 152964 152136 151129 149983 149264
54442 149264 149397 149809 149411 148071 146927 146975 147907 148681 148755 148419 148343 149010 150198 150833 149856 147456 144950 143266
54424 143266 142188 141308 140935 141482 142617 143719 144805 146326 148347 150486 152455 154125 155211 155452 155027
54409 155027 154396 153776 153100 152387 151844 151642 151832 152451 153482 154731 155893 156757 157326 157809 158460 159325 160176 160797
54391 160797 161209 161502 161710 162093 163065 164432 165122 164431 163158 162634 162859 162609 161382 160084 159574 159677 160097
54374 160097 161205 163192 165215 166183 165867 164729 163188 161674 160790 160747 161051 161329 162000 163559 165649 167486
54358 167486 168862 170095 171277 172227 173030 174084 175674 177828 180448 183263 185870 188021 189624 190362 189881
54343 189881 188579 187577 187411 187258 185942 183214 179581 175489 171340 167822 165425 163832 162415 161092 160121
54328 160121 159407 158639 157860 157214 156420 155194 154023 153741 154365 155092 155480 155994 157147 158652 159668 159585 158430
54311 158430 156772 155270 154094 152846 151277 149943 149771 150969 152741 154120 154790 154990 154919 154507 153726 152916
54295 152916 152594 152876 153252 153106 152340 151311 150393 149960 150522 152217 154183 155114 154634 153606 152997 153027 153602 154804
54277 154804 156535 158203 159209 159409 158857 157587 155911 154408 153327 152525 152222 153052 154957 156777 157589 157776
54261 157776 158149 158621 158593 158183 158149 158723 159295 159244 158540 157624 157162 157819 159806 162583 165214 166974 167606 167371
54243 167371 166953 166821 166566 165389 163366 161474 160128 158620 156506 154641 154062 154584 155311 155843 156145 155860
54227 155860 154804 153758 153821 155157 157075 158985 160590 161597 162067 162664 163720 164482 164107 163025 162332 162245
54211 162245 162139 161795 161503 161202 160606 160095 160351 161137 161477 161084 160641 160618 160799 161026 161403 161639 161178 160239 159815
54192 159815 160312 160968 160893 160000 158698 157394 156546 156497 156972 157305 157286 157199 157028 156386 155368 154652 154506 154502 154463 154886
54172 154886 155978 157001 157150 156507 155639 154718 153642 152643 152178 152280 152466 152358 152146 152317 153007 153761 154154 154523
54154 154523 155618 157364 158579 158334 157101 155964 155230 154524 153828 153486 153433 153322 153333 153962 155083 156034 156640
54137 156640 157333 158294 159298 160382 161740 162948 163222 162646 162220 162491 162948 162972 162543 161786 160675 159518 158934
54120 158934 159056 159441 159950 160927 162294 163386 163967 164541 165289 165679 165627 166055 167594 169467 170461 170390 169892 169327
54102 169327 168655 168029 167801 168079 168729 169575 170245 170175 169204 167935 167148 167114 167641 168378 168820 168468 167354 166119
54084 166119 165379 165378 166303 168262 170692 172446 172938 172815 173181 174613 177103 180338 183660 186412 188811 192008
54068 192008 196834 202950 209534 216182 222742 228957 234840 240702 246102 249321 248746 244531 238282 231438
54054 231438 224618 218133 212265 207069 202547 199043 196976 196216 196189 196492 197046 197768 198608 199842 201871 204688
54038 204688 207849 210985 214090 217349 220952 225026 229548 234304 239052 243702 248257 252639 256599 259816
54024 259816 262227 264369 267038 270244 272860 273883 273765 273715 273950 273679 272800 272307 272644 272801 271746 269744
54008 269744 267483 264774 261119 256884 252873 249144 245217 241213 237866 235552 234040 233086 232557 232132 231584
53993 231584 231254 231648 232627 233640 234657 236198 238459 240962 243141 244720 245457 245025 243292 240469 236933
53978 236933 233110 229433 226119 223047 220023 217022 214001 210831 207665 205047 203300 202131 201191 200649 200751
53963 200751 201204 201495 201526 201453 201276 201145 201694 203328 205444 207160 208645 210885 214127 217371 219618 220990
53947 220990 222395 224591 227787 231654 235508 238793 241573 244327 247294 250362 253558 257160 261220 265397
53933 265397 269391 273241 277121 281186 285687 290843 296477 302105 307570 313292 319728 326851 334393 342434
53919 342434 351536 362353 375210 389969 406069 422532 437869 450169 457700 459805 457256 451662
53907 451662 444553 436962 429510 422492 415892 409513 403169 396761 390345 384233 378891 374490 370572 366286
53893 366286 361063 355110 349182 343695 338051 331179 322973 314826 308273 303396 299090 294580 289884 285012
53879 285012 279785 274614 270436 267460 264809 261795 258750 256080 253381 250210 246998 244377 242126 239587
53865 239587 236708 233924 231398 229058 227038 225350 223485 221089 218699 217092 216203 215439 214690 214194 213680
53850 213680 212650 211435 210977 211502 212206 212392 212171 211860 211382 210525 209344 208056 206878 206033 205642 205600 205812
53833 205812 206328 207001 207346 207194 207084 207458 207868 207672 207160 207096 207439 207519 207372 207795 208918 209731 209456 208594 208148
53814 208148 208407 208944 209397 209849 210670 212237 214626 217517 220554 223636 226661 229341 231788 234966 239752
53799 239752 245692 251410 256209 260474 264554 268166 271120 273755 276303 278534 280370 282198 284197 285910
53785 285910 286917 287494 288233 289373 290773 292169 293162 293227 292053 289712 286464 282609 278463 274181 269688
53770 269688 265143 261199 258268 255765 252792 249357 246075 242897 239263 235621 233425 233122 233164 231760 228763
53755 228763 225184 221676 218396 215697 213876 212507 210900 209130 207915 207609 207880 208290 208608 208654 208407 208319
53739 208319 209013 210563 212392 213911 214940 215473 215369 214498 213069 211718 211175 211762 213144 214653 215903 217089
53723 217089 218725 221177 224350 227650 230280 231816 232496 232880 233384 234239 235570 237167 238446 239120 239694 240823
53707 240823 242424 244021 245711 248052 251067 254174 257086 260021 262950 265507 267763 270223 272868 275131
53693 275131 277129 279863 283699 287605 290556 292780 294842 296351 296641 296121 295834 295992 295950 295384 294509 293198
53677 293198 290927 287792 284756 282616 281313 280454 279933 279745 279698 279651 279747 280123 280621 281030 281399 281825 282006 281312
53659 281312 279464 277000 274908 273740 273235 272874 272556 272471 272571 272605 272625 272938 273482 273743 273421 272801 272258 271866
53641 271866 271707 272098 273210 274758 276358 277892 279365 280787 282386 284475 286827 288695 289766 290655 292014
53626 292014 293684 295212 296756 298813 301415 304274 307521 311531 316051 320236 323705 327067 331141 336024
53612 336024 341168 346106 350912 355967 361356 366576 370980 374507 377702 380984 384265 387528 391313 396173
53598 396173 401865 407501 412402 416431 419580 421663 422493 422149 420977 419375 417424 414744 410937 406263 401545
53583 401545 397345 393615 390283 387606 385570 383466 380640 377350 374351 371906 369770 367895 366458 365245
53569 365245 363669 361494 359102 356998 355444 354572 354382 354546 354609 354522 354719 355539 356832 358190 359316 360119 360694
53552 360694 361323 362333 363854 365751 367818 370021 372627 376006 380047 383782 386079 386969 387907 390298 394052
53537 394052 398004 401487 404976 409301 414796 421270 428331 435639 443172 451330 460585 470990 482233 494075
53523 494075 506499 519488 532959 546856 561072 575363 589625 604154 619358 635423 652578
53512 652578 671463 692606 715565 739135 762570 786145 810394 835278 860358 885377 910330
53501 910330 935171 959728 983758 1006908 1028790 1049386 1069228 1088953 1108672 1127967 1146505
53490 1146505 1164512 1182545 1200894 1219293 1237246 1254617 1271759 1289046 1306354 1323177 1339283
53479 1339283 1355109 1371338 1388026 1404212 1418546 1430284 1439541 1446636 1451507 1453954 1454077 1452071 1447734
53466 1447734 1440641 1430776 1418551 1404271 1388076 1370545 1352764 1335464 1318433 1301031 1283004 1264491
53454 1264491 1245539 1225955 1205518 1184156 1162077 1139829 1118019 1096854 1076236 1056334 1037679
53443 1037679 1020526 1004528 989250 974689 961121 948900 938595 930784 925340 921302 917859 915084
53431 915084 913458 913193 914420 917472 922375 928503 935371 943361 952953 963663 974644 986228 999904
53418 999904 1016565 1035488 1055294 1075372 1096095 1118135 1141931 1167595 1194974 1223862 1254259
53407 1254259 1286397 1320546 1356837 1395113 1434866 1475528 1517062 1560103 1605275 1652521 1701358
53396 1701358 1751602 1803530 1857376 1912888 1969350 2025948 2082254 2138398 2194556 2250264 2304638
53385 2304638 2357328 2408730 2459025 2507540 2553355 2596021 2635284 2670716 2702167 2730082 2754763
53374 2754763 2775639 2791814 2802930 2808964 2809626 2804630 2794220 2778744 2757899 2730999 2697699 2657948
53362 2657948 2611752 2559771 2503865 2446203 2387930 2329284 2270579 2212314 2154652 2097693 2042049
53351 2042049 1988333 1936406 1885989 1837648 1792070 1748631 1705865 1663243 1621322 1580251 1539538
53340 1539538 1499457 1461283 1425774 1392594 1361552 1333082 1306984 1282053 1257799 1235417 1216179
53329 1216179 1199833 1185475 1172974 1162375 1152642 1142339 1131240 1120190 1109563 1098954 1088332
53318 1088332 1078484 1070062 1062915 1056597 1051063 1046620 1043500 1041736 1041319 1042369 1045119 1049588 1055334 1061840
53304 1061840 1069184 1077925 1088249 1099748 1112271 1126422 1142729 1160795 1179899 1200190 1222629 1247756
53292 1247756 1275050 1303595 1332965 1363233 1394271 1425333 1455373 1483702 1510110 1534351 1555889
53281 1555889 1574478 1590624 1604969 1617356 1627069 1633775 1637489 1637747 1633828 1626036 1615760 1603787 1589416
53268 1589416 1571902 1551920 1530712 1508316 1483742 1456728 1428353 1399796 1371253 1342296 1312720
53257 1312720 1282725 1252567 1222311 1191832 1160938 1129613 1098156 1067075 1036892 1008061 980797
53246 980797 954832 929495 904249 879021 853967 829134 804579 780604 757683 736253 716707
53235 716707 699310 683862 669585 655611 641634 628056 615650 605071 596410 588977 581645 573627
53223 573627 564985 556344 548201 540406 532223 522866 512177 500683 488940 477036 464958 453129 442167
53210 442167 432253 423225 415140 408175 402032 396047 389926 383916 378193 372629 367160 361817 356357 350419
53196 350419 344065 337637 331093 324196 317301 311168 305920 301125 297074 294801 294283 293641 291026 286696 282484
53181 282484 279689 278253 277554 277166 276885 276563 275987 274832 273007 271135 270119 270002 269821 268866 267478 266266
53165 266266 265296 264447 263803 263154 261900 260117 258970 259215 259939 259673 258245 256607 255319 254181 253028 251906
53149 251906 250679 249347 248517 248642 248978 248285 246465 244596 243456 242917 242808 243278 244094 244542 244423 244409 245023
53132 245023 245888 246446 246934 248193 250635 253649 255953 256526 255466 253936 253137 253455 254716 256790 259471 262110
53116 262110 264118 265756 267750 270171 272211 273101 272744 271485 269858 268493 267688 266926 265312 262557 259140
53101 259140 255617 252331 249745 248327 247910 247715 247222 246614 246264 246214 246343 246598 246892 247100 247246 247383 247240 246447
53083 246447 245134 243955 243407 243435 243718 243930 243696 242754 241286 239781 238529 237536 236886 236700 236751 236581 236116 235739
53065 235739 235613 235389 234712 233682 232608 231640 230817 230222 229869 229613 229254 228711 228109 227795 228114 228996 229948 230662
53047 230662 231407 232594 234216 235970 237522 238334 237768 235935 234029 233035 232527 231530 230233 229725 230155 230349
53031 230349 229525 228359 227854 228003 228104 227818 227374 227162 227520 228515 229625 230037 229524 228684 228142 227960 228057 228638
53013 228638 229857 231511 233348 235304 237171 238469 238978 239034 239088 239351 240073 241557 243542 245091 245587 245448
52997 245448 245455 245764 246054 246239 246412 246335 245594 244243 242860 242010 241955 242724 243988 244948 244889 244024 243419 243898 245247
52978 245247 246689 247961 249560 251872 254389 256132 256808 257155 257954 259134 260133 260792 261381 261967 262417 262972
52962 262972 264119 265686 266657 266302 265044 263879 263200 262604 261687 260601 259756 259207 258524 257301 255682 254194
52946 254194 253036 251824 250238 248560 247237 246224 245202 244191 243368 242494 241228 239933 239448 239921 240506
52931 240506 240420 239710 238773 237728 236615 235759 235460 235564 235646 235472 235156 235044 235451 236270 236897 236862 236472 236395 236710
52912 236710 236814 236273 235228 234033 233035 232692 233216 234065 234420 234227 234020 233747 232693 230793 229055 228264 228112
52895 228112 228084 228309 228940 229502 229627 229820 230700 231985 232978 233650 234515 235789 237311 238946 240404 241039 240574
52878 240574 239757 239582 240074 240479 240402 240018 239344 238200 236900 236253 236695 237996 239846 242167 244715 246952 248576
52861 248576 249846 251182 252756 254545 256458 258243 259480 259850 259361 258341 257276 256495 255769 254341 251585
52846 251585 247609 243082 238578 234345 230561 227446 225063 223241 221750 220494 219500 218797 218312 217901 217526
52831 217526 217325 217408 217748 218445 219844 221976 224112 225468 226252 227313 228688 229349 228655 227263 226102 225199
52815 225199 224138 223146 222935 223755 225194 226773 228221 229403 230401 231499 232757 233903 234942 236427 238596
52800 238596 240624 241361 240561 238863 236824 234553 232144 229820 227629 225417 223109 220789 218654 217124 216689
52785 216689 217325 218393 219447 220705 222293 223533 223655 222861 221984 221367 220819 220475 220829 221887 222928 223284
52769 223284 222964 222535 222667 223636 224865 225236 224276 222759 221697 221154 220680 220405 220771 221496 221816 221685 221826 222535
52751 222535 223367 224096 225083 226447 227694 228527 229292 230317 231425 232429 233533 234889 236316 237771 239604
52736 239604 242018 244647 246941 248564 249276 248963 248076 247547 247925 248927 250051 251186 252345 253272 253727 253831
52720 253831 253748 253356 252551 251680 251235 251266 251367 251167 250591 249690 248459 246840 244863 242758 240846 239262 237856
52703 237856 236490 235246 234187 233173 232242 231965 232898 234761 236624 237889 238713 239493 240413 241466 242473 243048
52687 243048 242996 242767 243080 244059 245195 246182 247233 248507 249752 250714 251327 251312 250060 247366 243998 241269 240141
52670 240141 240690 242083 243066 242928 242168 241936 242739 244036 245080 245670 245992 246163 246122 245666 244549 242946 241758
52653 241758 241963 243592 245834 248171 250761 253636 256247 258105 259272 259902 259905 259382 258842 258560 258206 257501 256819
52636 256819 256713 257177 257769 258124 258050 257394 256214 254885 253821 253308 253647 254995 256924 258576 259492 259853 259798
52619 259798 259070 257562 255594 253410 251053 249048 248401 249366 250863 251744 252045 252369 252666 252424 251629 250715 249909
52602 249909 249340 249465 250602 252181 253277 253684 253868 254066 254220 254568 255447 256579 257367 257893 258792 260100 261098
52585 261098 261434 261610 262069 262530 262612 262475 262466 262659 263125 264174 265868 267654 268911 269576 269924 270013 269743 269198 268511
52566 268511 267555 266168 264579 263251 262352 261688 261091 260560 259959 258969 257518 256083 255302 255349 255870 256449 256899
52549 256899 257071 256739 256000 255546 256069 257343 258306 258199 257278 256192 255096 253776 252398 251622 251941 253205 254756
52532 254756 255800 255787 254829 253725 253295 253629 254282 255034 256032 257180 257964 258143 258186 258614 259221 259427 259253 259451
52514 259451 260587 262477 264730 267390 270556 273620 275600 276440 277396 279666 282915 285684 287081 287442 287319
52499 287319 286537 284697 282075 279466 277265 275228 273087 271028 269411 268312 267487 266721 266084 265763 265652 265270
52483 265270 264290 263065 262254 261960 261681 261256 261297 262320 263877 265139 266083 267466 269633 271942 273536 274296
52467 274296 274776 275449 276271 276925 277365 278050 279563 281975 284766 287445 290011 292577 294816 296128 296250 295360
52451 295360 293700 291557 289490 288044 286981 285295 282270 278309 274455 271295 268627 266095 263805 262211
52437 262211 261557 261579 261768 261830 261819 261841 261777 261376 260537 259414 258304 257549 257438 258029 259117 260452 261898 263272
52419 263272 264248 264678 264895 265371 266117 266774 267370 268594 271125 274875 279110 283161 286861 290472 294541 299838
52403 299838 307098 316500 327358 338427 348571 357075 363300 366280 365051 359554 351010 341197 331415
52390 331415 322272 314191 307633 302709 299000 296068 294004 293154 293381 293908 294039 293831 293893 294670 296139 298138
52374 298138 300682 303828 307420 311182 314961 318758 322565 326377 330292 334400 338510 342139 344847 346518
52360 346518 347263 347165 346138 344074 341122 337821 334841 332588 331185 330777 331473 332877 334129 334861 335785 337775
52344 337775 340529 342791 343892 344518 345840 348438 352248 356934 361987 366953 371936 377504 383824 390328
52330 390328 396632 403288 411140 420337 430638 442372 456231 472097 488853 505564 522282 539336
52318 539336 556351 572553 587858 603039 618717 634669 650426 666202 682684 699929 717065
52307 717065 733297 748647 763323 776902 788907 799911 811187 823191 835138 846190 856273
52296 856273 865492 873551 880202 885616 889790 892136 892157 890037 886132 880450 873220 865344 857587 849807 841754
52281 841754 834142 827970 823050 818273 813290 809032 806524 806081 807783 811787 817773 824764 831966 839371
52267 839371 847310 855942 865394 875874 887239 898869 910242 921354 932402 943524 955046 967463
52255 967463 980705 993774 1005575 1015892 1025270 1034282 1043320 1052745 1062493 1071404 1077529 1079531 1077689
52242 1077689 1073398 1067819 1061167 1053137 1043712 1033399 1022896 1012721 1003124 994109 985506 977160 969103
52229 969103 961405 953909 946351 938744 931335 924150 916985 910081 904368 900643 898644 897301 895781 894100
52215 894100 892936 893086 894925 898088 901798 905643 909799 914406 919134 923670 928219 933160 938553 944363
52201 944363 950670 957180 962992 967499 971159 974757 978314 981516 984739 988620 992781 996080 998205 1000066
52187 1000066 1002488 1005462 1008797 1012457 1015857 1017806 1017757 1016398 1014501 1011796 1007533 1001510 994032 985396
52173 985396 976115 967170 959304 952250 945205 937906 930870 924823 920379 918009 917784 919146 921305 923813
52159 923813 926565 929489 932593 936137 940327 944834 948866 951730 953216 953497 952872 951584 949830 947952 946542
52144 946542 946168 946985 948774 951253 954063 956599 958370 959536 960649 961764 962339 962192 962069 963007 965539 969712
52128 969712 975452 982649 991268 1001684 1014544 1030034 1047641 1066931 1088175 1111848 1137808 1165262
52116 1165262 1193268 1221056 1248177 1274609 1300429 1325164 1347802 1367614 1384565 1398788 1410263
52105 1410263 1419356 1427002 1433786 1439294 1442993 1445341 1447337 1449222 1450348 1450292 1449458 1448458 1447301 1445339 1441805
52090 1441805 1436384 1429328 1420902 1410697 1397901 1382418 1365306 1347838 1330593 1313837 1298259 1284711
52078 1284711 1273552 1264853 1259002 1256358 1256391 1257783 1259551 1261757 1265213 1270837 1279147 1289899 1302154 1314977
52064 1314977 1327999 1341122 1354046 1366542 1378837 1391123 1402835 1413081 1421719 1429432 1436771 1443674
52052 1443674 1449932 1455416 1459718 1462164 1462498 1461115 1458336 1453785 1446840 1437471 1426321 1413975 1400328
52039 1400328 1384739 1366856 1347311 1327489 1308500 1290550 1273419 1257240 1242476 1229340 1217611
52028 1217611 1206951 1197073 1187647 1178341 1168927 1159201 1148972 1138366 1127908 1117943 1108160 1098025 1087481
52015 1087481 1076863 1066324 1055853 1045707 1036325 1027826 1019972 1012481 1005059 997250 988730 979588 969883
52002 969883 959162 947000 933808 920298 906224 890469 872614 853721 835302 818143 802399
51991 802399 788251 775923 765372 756309 748246 740408 732034 723092 714378 706587 699502 692302 684362
51978 684362 675524 665866 655501 644411 632317 618967 604774 590901 578486 567976 559362 552764
51966 552764 548369 545986 545091 545388 547156 550900 556754 564305 573028 582735 593288 603793 612509 617947
51952 617947 619922 619160 616121 610747 603258 594602 585970 578314 572366 568582 566900 566996 568909 573013 579309
51937 579309 587325 596853 608188 621304 635307 649025 661693 672807 681857 688678 693506 696125 695338
51924 695338 690013 680447 668128 654325 639511 624054 608716 594277 581168 569751 560636 554471
51912 554471 551531 551598 554183 558865 565671 575162 587916 603624 620544 635889 646989 652478 652662 648825
51898 648825 642301 634252 625962 618621 612526 606834 600285 591913 581024 567176 550722 533025 515556
51885 515556 499001 483651 470266 459790 452317 447143 443962 443287 445402 449562 454703 460537 467425
51872 467425 475532 484692 494929 506396 518561 529886 538664 544073 546261 545663 542534 537075 529659
51859 529659 520794 511023 500993 491537 483569 477889 474986 474742 476236 478155 479748 481288 483300 485486
51845 485486 486807 486614 485192 483063 480184 476120 470715 464267 457234 450087 443290 437155 431783 427320
51831 427320 424082 422190 421254 420779 420750 421509 423125 425247 427540 429853 431911 433232 433493 432684 430749 427474
51815 427474 423043 418480 415119 413611 413653 414624 416243 418601 421801 425706 429869 433604 436205 437260 436754
51800 436754 434886 431886 428168 424507 421814 420448 419751 418436 415666 411785 407926 404877 402498 400340
51786 400340 398500 397399 396820 395850 394124 392633 392653 394106 395656 396379 396550 396630 396293 395100 393581 392927 393787
51769 393787 395948 399054 403032 407899 413740 420922 429742 439736 449963 460118 470718 481743 491696
51756 491696 498635 501853 501963 499538 494450 486711 477252 467373 457715 448227 439010 430692 423851 418450
51742 418450 414007 410147 406760 403938 402065 401819 403630 407163 411734 417272 424366 433145 442570 451135
51728 451135 457971 462928 466006 467228 466940 465821 464607 463997 464487 465817 466778 466023 463059 458203 451981
51713 451981 445148 439028 434930 433043 432385 431840 430792 428920 426225 423471 421916 422265 424347 427896 432955
51698 432955 439205 445546 450753 454099 455172 453827 450821 447872 446446 446779 448406 451069 454440 457444
51684 457444 458651 457342 453773 448610 442560 436282 430167 424369 419336 415903 414392 414112 414400 415751 419088
51669 419088 424108 429302 433581 437050 440129 442879 445545 448952 453686 459296 464714 469154 472173 473165
51655 473165 471420 466869 460601 454546 450500 449261 450570 453930 459389 467382 477772 489219 499413
51642 499413 505929 507206 503252 495498 485683 474789 463110 451035 439240 428119 417626 407890 399615
51629 399615 393513 389545 386957 384977 383376 382454 382622 383897 385733 387322 388073 387819 386773 385441 384362
51614 384362 383615 382711 381276 379690 378735 378752 379547 380970 382995 385232 386960 387842 388167 388272 388316 388768 390428
51597 390428 393511 397272 401102 405538 411566 419266 427887 437008 446656 456086 463302 466383 464987 460246
51583 460246 453565 446027 438646 432485 428289 426325 426738 429748 435324 442996 452395 463856 478066 495055
51569 495055 513905 533608 553875 574925 596780 619186 641990 665182 688529 711667 734749
51558 734749 758817 785400 815884 851181 891541 936199 983106 1029152 1070750 1104458 1127468
51547 1127468 1138047 1135823 1121761 1097709 1065642 1027034 982911 934543 883913 833274 784345
51536 784345 738099 695217 656361 621981 592190 566943 546078 529040 514863 502687 492151
51525 492151 483195 475674 469386 464280 460337 457221 454272 450920 447062 443080 439520 436767 434965 434183
51511 434183 434528 435906 437753 439321 440399 441584 443629 446525 449296 450681 449951 447224 443180 438524 433686
51496 433686 428896 424362 420234 416479 413039 410059 407758 406070 404636 403209 401806 400435 399005 397679
51482 397679 396961 397053 397281 396540 394319 391094 387717 384654 381796 378790 375438 371911 368574 365535 362403
51467 362403 358688 354495 350636 347927 346422 345482 344488 343341 342255 341313 340487 340024 340454 342063 344536 347376
51451 347376 350458 353851 357241 360098 362492 365247 369065 373974 380073 388317 399740 414014 429519
51438 429519 444985 460323 475366 488442 497096 500253 499123 495893 492049 488155 484599 481707 478991
51425 478991 474873 467691 457171 444825 432884 422808 414653 407685 401392 395951 391853 389280 387900
51412 387900 387217 387044 387645 389398 392296 395800 399321 402865 406982 411956 417165 421565 424687 426939 428967
51397 428967 431138 433665 436771 440393 444014 447168 449981 452977 456551 461002 466907 474921 485134 497121
51383 497121 510859 527286 547692 572800 602693 637489 677700 723848 775824 832699 893138
51372 893138 955967 1020177 1084052 1144204 1195827 1234463 1257905 1266511 1261789 1244827 1216007 1175954
51360 1175954 1126465 1070376 1010605 949399 888406 829110 772888 720677 672942 630084 592656
51349 592656 560912 534308 511798 492675 476861 464205 453783 444301 435231 427187 420920 416118
51337 416118 411537 406300 400729 395786 391954 388884 385909 382595 378883 375010 371437 368560 366348 364319
51323 364319 361962 359222 356571 354673 353911 354067 354404 354233 353534 352977 353231 354270 355473 356428 357495 359423
51307 359423 362445 365928 369059 371713 374458 377757 381454 385041 388091 390251 391087 390292 388024 384818 381135
51292 381135 377083 372534 367396 361886 356656 352590 350188 349123 348505 347677 346780 346603 347923 350863 354821
51277 354821 359098 363541 368405 373603 378456 382316 385071 386808 387350 386556 384850 383013 381570 380736 380816
51262 380816 382131 384533 387487 390721 394369 398261 401423 402621 401359 398265 394606 391395 388792 386294
51248 386294 383496 380574 377906 375504 373122 370833 369182 368822 370116 372826 375852 377609 377259 375497 373636
51233 373636 372062 370178 367733 365313 363368 361526 359265 356734 354461 352710 351525 351025 351295 352204 353608
51218 353608 355417 357247 358430 358750 358871 359741 361757 364655 367849 370633 372516 373773 375384 378121 381887
51203 381887 386152 390567 394890 398751 401960 404646 406728 407676 407273 406223 405335 404419 402672 399979 397205
51188 397205 395166 393889 392893 391775 390465 389213 388337 387798 387206 386464 386017 386097 386169 385711 385174 385393 386266 386868
51170 386868 386828 386752 387175 387838 388310 388650 389139 389825 390651 391685 392957 394382 395933 397514 398691 399091 399144 399771
51152 399771 401067 401926 401333 399527 397483 395725 394252 393259 393272 394510 396487 398244 398789 397577 394870 391579
51136 391579 388464 385589 382723 380084 378309 377704 377788 377680 376806 375315 373929 373399 374073 375866 378451 381294
51120 381294 383729 385410 386670 388082 389665 390965 391979 393413 395811 398922 402344 406296 411153 416444
51106 416444 420893 423526 424515 424976 426170 428676 432039 435259 437716 439444 440434 440207 438553 436332 434854
51091 434854 434495 434463 433944 432965 432072 431602 431487 431453 431235 430796 430392 430236 430146 429854 429629 430131 431513 433124 434302
51072 434302 435036 435568 435755 435354 434772 434937 436404 438917 442031 445820 450762 457151 464871 473716 483701 495091
51056 495091 508231 523240 539477 555172 568023 576792 582496 587827 595269 605888 619623 635890
51044 635890 653394 669958 683476 693286 700145 704720 706440 703976 696585 684991 671310 658191 647467
51031 647467 639042 631025 621081 607796 591120 572201 553067 535947 522196 511793 503988 498253
51019 498253 494441 492453 492282 494215 498457 504531 511570 519206 527694 537080 546772 556153 565131 573756
51005 573756 581809 589281 596916 605638 615513 625834 636230 647104 658774 670731 682138 692779
50993 692779 703047 713138 722691 731272 738837 745523 751169 755291 757515 757981 757363 756588 756461 757432 759660
50978 759660 763282 768532 775504 783808 792638 801279 809529 817718 826582 837279 851244 869625 892803
50965 892803 920634 953083 990228 1031607 1076106 1122878 1172151 1224674 1280450 1338367 1396990
50954 1396990 1455283 1512491 1567773 1620171 1668692 1712229 1749741 1780888 1806358 1827307 1844498
50943 1844498 1858085 1868056 1874668 1878614 1881136 1883815 1887671 1892171 1895267 1894694 1889300 1879295 1865660
50930 1865660 1849557 1831977 1813400 1793518 1771444 1746355 1717973 1686439 1651865 1614132 1573096
50919 1573096 1528922 1482144 1433458 1383543 1333217 1283682 1236319 1191978 1150604 1111838 1075906
50908 1075906 1043538 1014921 989228 965577 944130 925677 910199 896425 882988 869546 856542
50897 856542 844367 833147 823104 814590 807766 802456 798226 794467 790679 787003 784221 782878 782634 782888
50883 782888 783727 785612 788312 790980 793369 796143 799688 803371 806526 809621 813782 819531 826557 834493
50869 834493 843268 852823 863036 873960 885765 898514 912420 928173 946525 967518 990629 1015767
50857 1015767 1043662 1075144 1110490 1149757 1193380 1242039 1296131 1355694 1420927 1492515 1571394
50846 1571394 1658240 1753157 1855703 1965064 2080175 2199941 2323604 2450822 2580969 2712202
50836 2712202 2841515 2965812 3082480 3188696 3280976 3356299 3413556 3453276 3476229 3483255 3476436
50825 3476436 3459202 3434689 3404731 3371055 3336749 3305652 3280600 3262850 3252770 3250009 3252969 3258808
50813 3258808 3264156 3265479 3259065 3241703 3211738 3168835 3112524 3041743 2956289 2858001 2749830 2634203
50801 2634203 2513051 2389034 2265727 2146436 2033471 1928543 1832974 1747114 1670212 1601471
50791 1601471 1541033 1489588 1447371 1413924 1388523 1370332 1358317 1351449 1348901 1349617 1351889 1353951
50779 1353951 1355085 1355697 1356197 1356194 1354891 1351830 1347034 1340726 1333207 1324761 1315423 1304917 1292933 1279264
50765 1279264 1263606 1245521 1224951 1202692 1180085 1158068 1136526 1114679 1092236 1070180 1050180
50754 1050180 1033122 1018578 1005878 995158 986790 980379 975342 972233 972252 975323 979891 985161 992362
50741 992362 1003042 1017207 1034253 1054856 1080527 1111619 1147155 1186573 1230378 1278895 1331511
50730 1331511 1387509 1446715 1508899 1573237 1638901 1705596 1773054 1840476 1906920 1971848 2034898
50719 2034898 2095336 2152034 2203773 2249333 2287425 2316715 2335809 2343366 2338675 2322306 2296040 2262238
50707 2262238 2223641 2183604 2145716 2112752 2086140 2066350 2053348 2046683 2045664 2049579 2057234 2066275
50695 2066275 2073657 2076984 2074775 2065371 2046577 2017016 1977152 1928406 1871919 1808987 1742191 1675074
50683 1675074 1610576 1550293 1495092 1445835 1403377 1368320 1340918 1321021 1308197 1302052 1302391 1308965
50671 1308965 1321365 1339275 1362483 1390350 1421632 1455143 1490205 1526079 1561393 1594658 1625080
50660 1625080 1652463 1676658 1697750 1716532 1734087 1750966 1767275 1783361 1799704 1816134 1831908
50649 1831908 1846768 1861386 1876634 1892974 1910821 1930995 1954365 1981316 2011925 2046555 2085850
50638 2085850 2130028 2178327 2229320 2281817 2335332 2389512 2443287 2494952 2543124 2587316 2627584
50627 2627584 2664147 2697562 2728644 2757711 2784065 2806070 2820689 2822414 2804225 2761900 2698143
50616 2698143 2621757 2542561 2467451 2400487 2344422 2300791 2269340 2248740 2237847 2235718 2240622 2249760
50604 2249760 2259986 2268451 2272625 2270244 2259480 2239111 2208465 2167299 2115880 2055328 1987922 1916661
50592 1916661 1844068 1771467 1699706 1630285 1565064 1504900 1449373 1398139 1351840 1311228 1276008
50581 1276008 1245126 1217790 1193575 1171853 1151768 1132749 1114632 1097460 1081659 1068300 1058564
50570 1058564 1052832 1050534 1050866 1053267 1057307 1062609 1069143 1077282 1087408 1099629 1113905 1130207 1148503
50557 1148503 1168811 1191325 1216274 1243577 1272900 1304103 1337336 1372592 1409341 1446774 1484195
50546 1484195 1521021 1556660 1590696 1623177 1654509 1685121 1715462 1746318 1778929 1814649 1854573
50535 1854573 1899496 1950114 2007113 2071100 2142522 2221634 2308518 2403133 2505441 2615465 2733168
50524 2733168 2858251 2990052 3127588 3269582 3414391 3559904 3703533 3842359 3973361
50515 3973361 4093607 4200273 4290563 4361801 4411705 4438558 4441184 4419059 4372696 4303778 4214669
50504 4214669 4107988 3987025 3856363 3721399 3587023 3457185 3335769 3227104 3135001 3061777
50494 3061777 3008837 2977718 2969492 2982993 3014432 3059068 3112752 3171503 3230084 3281599 3318580
50483 3318580 3334606 3325479 3289586 3227466 3141167 3034017 2910607 2776255 2636009 2494124
50473 2494124 2354273 2219637 2092450 1973757 1863912 1763167 1671636 1589112 1515211 1449529
50463 1449529 1391376 1339749 1293955 1254107 1220506 1192664 1169400 1149980 1134675 1124006 1117728
50452 1117728 1114774 1113968 1114493 1115685 1116731 1116856 1115965 1114948 1115110 1117134 1120718 1125231 1130524 1136938 1144698
50437 1144698 1153549 1162927 1172237 1180953 1188664 1195181 1200619 1205420 1210352 1216344 1224179 1234289 1246819
50424 1246819 1261738 1278762 1297401 1317328 1338655 1361670 1386437 1412954 1441642 1473363 1508812
50413 1508812 1548187 1591592 1639549 1692822 1751707 1815642 1883555 1954507 2027895 2103078 2178935
50402 2178935 2253926 2326471 2395052 2458032 2513845 2561584 2601043 2631669 2651674 2658645 2651041 2628686
50390 2628686 2591984 2541417 2478173 2404631 2323705 2238052 2150443 2064515 1984303 1912755 1851127
50379 1851127 1799869 1759648 1731341 1715438 1711689 1718985 1735229 1757620 1783459 1810609 1836972 1859702
50367 1859702 1875341 1880755 1873823 1853542 1820087 1774985 1720847 1660554 1596552 1530760 1464756 1399881
50355 1399881 1337335 1278273 1223580 1173419 1127141 1083907 1043339 1005538 970708 939099 911239
50344 911239 887794 868986 854253 842682 833788 827799 825163 825938 829828 836756 847056 860813 877132
50331 877132 894331 910796 925240 936185 941827 941045 934463 924155 912298 900306 889038 879245
50319 879245 871472 865745 861652 858812 857254 857327 859264 862716 866713 870173 872588 874280 876009 878323 881223
50304 881223 884318 887198 889637 891570 893188 895107 898156 902635 907978 913535 919567 926987 936093 946164
50290 946164 956525 967407 979383 992422 1006004 1019826 1033954 1048673 1064630 1082402 1100794
50279 1100794 1115697 1121906 1116847 1102314 1082685 1062128 1043442 1028173 1016616 1007941 1001135 995938
50267 995938 992596 990989 990498 990584 990968 991247 990787 989129 986255 982499 978448 974918 972669 972013 972855 975079
50251 975079 978630 983216 988336 993898 1000724 1010207 1023390 1040395 1060599 1083258 1108023 1135032 1164510
50238 1164510 1196147 1228779 1260755 1290688 1317886 1342125 1363356 1381870 1398559 1414492 1429944
50227 1429944 1443951 1454797 1460680 1459855 1450715 1432370 1405196 1370675 1330787 1287758 1243980 1201584
50215 1201584 1161939 1125828 1094001 1067170 1045453 1028181 1014189 1001851 988901 972874 952312
50204 952312 927613 900746 874237 850070 828894 810102 793013 777942 765636 755755 746768 737650
50192 737650 728947 721643 715630 710030 704552 699614 695228 690600 685064 678851 672622 666637 660704 654785
50178 654785 649329 644896 641506 638494 635145 631425 627946 625349 623978 624006 625293 626991 627993 628201 628837
50163 628837 630956 634043 636772 638892 641605 646104 652412 659809 667794 676299 685350 694874 704709 714737
50149 714737 725152 736495 749027 761971 773724 783063 789966 795204 799366 802455 804204 804640 804466
50136 804466 805002 807626 813143 821757 833594 849060 868727 893087 922509 957131 996606 1040077
50124 1040077 1086626 1135701 1187050 1240270 1294495 1348513 1401243 1452193 1501533 1549666 1596723
50113 1596723 1642453 1686441 1728191 1766930 1801314 1829203 1847719 1853867 1845674 1823000 1787354 1741044
50101 1741044 1686559 1626337 1562531 1496864 1431002 1367021 1307022 1252063 1201838 1155734 1114054
50090 1114054 1077939 1048178 1024350 1004992 988439 973566 960029 948006 937735 929285 922658 917903
50078 917903 914956 913470 912927 912880 912965 912760 911908 910430 908735 907065 905027 901824 897005 890767 883571 875733
50062 875733 867529 859423 851788 844502 837230 830092 823629 817998 812641 807073 801709 797542 795156 794358
50048 794358 794651 795703 797358 799522 802190 805539 810003 816173 824394 834309 845042 855969 866989 877900
50034 877900 888042 897171 906286 916799 928863 941231 952805 963481 973216 981188 986663 990226 993297
50021 993297 996481 999043 1000068 999563 998232 996615 994858 993161 992110 992420 994372 997592 1001479 1006015 1012110
50006 1012110 1021091 1033885 1050741 1071431 1095367 1121515 1148709 1176332 1204515 1233451 1262742
49995 1262742 1291835 1320968 1351130 1382757 1414660 1444381 1469307 1487237 1496286 1494975 1482695 1459774
49983 1459774 1427021 1385470 1336704 1282995 1226719 1169677 1113224 1058871 1008280 962511 921471
49972 921471 884439 851152 822225 798347 779181 763308 749334 736834 726027 716833 708734 701448
49960 701448 695194 690135 686070 682905 681020 680742 681770 683569 686173 690231 696370 704825 715577 728411
49946 728411 742749 757705 772366 785923 797688 807255 814627 819972 823294 824523 823846 821657 818150
49933 818150 813074 805827 795654 781934 764631 744561 723069 701457 680739 661693 644840 630415
49921 630415 618473 608915 601372 595435 591214 589300 589781 591682 593921 596500 600096 604675 609291 613252
49907 613252 616710 619979 623095 626439 631146 638307 648054 659778 672926 687256 702650 719039 736262
49894 736262 753637 769909 783947 795269 803594 808310 809063 806728 803036 798884 793382 784923 772996
49881 772996 758642 743286 727504 711103 694109 677216 661237 646436 632688 620088 609064
49870 609064 599879 592325 585997 580677 576350 573062 570901 569980 570297 571671 573869 576796 580575 585530 592027
49855 592027 600208 609873 620717 632602 645518 659303 673590 687929 701874 714996 726957 737448
49843 737448 745992 752026 755417 756642 756195 753977 749634 743172 734759 724178 711219 696669 682256
49830 682256 669382 658379 649123 641676 635933 631165 626603 622368 619420 618631 620182 623784 629225 636608
49816 636608 646094 657421 669781 682339 694799 707243 719543 731337 742471 752909 762148 769331
49804 769331 774254 777774 780786 783105 783706 781802 777301 770527 761929 752006 741131 729469 717201 704710
49790 704710 692275 679753 666894 653886 641392 630141 620713 613593 609019 606597 605298 604061 602498
49777 602498 600950 599810 598902 597757 596498 596071 597256 599779 602932 606905 612781 621057 630784 640529 649768
49762 649768 658944 668485 678142 687176 694843 700758 705006 707937 709836 710809 710788 709293 705318 697933 687157
49747 687157 673975 659528 644731 630585 618172 607995 599744 592909 587263 582659 578968 576362 575066
49734 575066 574556 573656 571810 569725 568377 568027 568607 570341 573307 576915 580510 584123 588133 592673 598065
49719 598065 605243 614937 626699 639520 653063 667529 682573 697250 710819 722740 731947 737151
49707 737151 738005 735395 730503 724238 717430 710628 703427 694775 684350 673231 663048 654811 648569 643585
49693 643585 638739 633303 627562 622320 617839 613840 610501 608707 609058 611259 614729 619269 624862 631344
49679 631344 638618 646804 655979 666147 677622 690935 706136 722672 740148 758620 777694 795662
49667 795662 810032 818910 821952 820452 816674 812661 809331 806806 805456 805982 808450 811951 815423 817967
49653 817967 817951 812775 800588 782064 759854 736619 714099 693565 675955 661413 649446 639805
49641 639805 632732 628170 625301 623196 621624 620919 621322 622704 624770 627177 629432 630848 630750 628816 625316
49626 625316 620963 616420 611869 607099 602009 596915 592307 588317 584573 580688 576843 573708 571664 570306
49612 570306 568926 567336 565933 565008 564384 563825 563552 564136 565961 568799 571865 574326 576023 577659 580023
49597 580023 583011 585690 587334 588103 588642 589405 590510 591867 593195 594187 594936 595929 597397 598873 599724 599976
49581 599976 600305 601327 603124 605377 607706 609876 611829 613569 615052 616390 618118 620890 624783 629289
49567 629289 634277 640526 648817 658822 669505 680405 691768 703364 714044 722847 729851 735277 738259
49554 738259 737412 732619 725491 717837 710328 703011 696446 691539 688395 686113 683897 681914 680850 681074 682509
49539 682509 684860 687537 689585 690288 689906 689522 690088 691843 694586 698182 702697 708332 715392 724187 734814
49524 734814 747071 760706 775715 792395 810990 831114 851407 869933 885050 896012 902834 905964
49512 905964 906291 905129 903784 903095 903509 905394 908947 913932 919772 925763 930877 933480 931720 924386 911447
49497 911447 893990 873854 853059 833063 814557 798040 784222 773438 765007 757831 751459 746042
49485 746042 741472 737407 734115 732430 732571 733658 734655 735206 735327 734977 734369 734192 734988 736647 738757 741048
49469 741048 743201 744787 745889 747371 750001 753591 757496 761626 766369 771658 776682 780606 783204 784767
49455 784767 785622 785753 784810 782598 779580 776563 773703 770190 765208 758830 751680 744102 736222 728553 721874
49440 721874 716494 712057 708134 704663 701919 700377 700608 702850 706683 711463 717146 724319 733349 743876
49426 743876 755389 767953 782069 798023 815744 835139 856063 877845 899456 920668 942467
49415 942467 965135 985629 998081 998192 987208 971014 955578 943826 936245 932746 933240 937354 944519
49402 944519 954062 964835 975356 984861 993858 1003170 1012795 1022146 1031054 1039920 1049091 1058504 1067732 1076049
49388 1076049 1082694 1087400 1090411 1091703 1090606 1086496 1079445 1069835 1057924 1044280 1030116 1016451 1003346
49375 1003346 990661 979207 970341 964620 961595 960753 961883 964636 968606 973862 980662 988440 995750 1001367
49361 1001367 1004983 1006827 1007223 1006563 1005056 1002270 997471 990615 982587 974337 966253 958460 951195 944681
49347 944681 939037 934502 931358 929548 928737 928799 929783 931295 932483 932864 932778 932752 932702 931942 929749 925871 920815
49330 920815 915693 911414 907969 904774 901609 898801 896553 894806 893896 894656 897508 901903 906911 911978 916895
49315 916895 921582 926312 931733 938196 945254 952179 958780 965435 972556 980356 989048 998954 1010409 1023600
49301 1023600 1038427 1054505 1071396 1088841 1106498 1123449 1138068 1148421 1152803 1150364 1141730 1128889
49289 1128889 1113944 1098012 1081632 1065803 1051756 1039790 1029247 1019769 1011666 1004818 998200 991054
49277 991054 983823 977346 971816 967152 963818 962469 963149 965454 969166 974015 979093 983218 985865 987308
49263 987308 988007 988311 988550 988817 988669 987559 985653 983977 983682 985415 989423 996160 1006694 1022182 1042510
49248 1042510 1065609 1088770 1110564 1130511 1146806 1155898 1155437 1146716 1132968 1115895 1095264 1071506
49236 1071506 1046971 1024202 1004211 986980 972629 961411 953264 948048 945895 946829 950380 955825 962519
49223 962519 969763 976859 983612 990446 997780 1005635 1014000 1023029 1032481 1041422 1049035 1055520 1061800 1068557
49209 1068557 1075932 1083850 1092056 1099836 1106292 1111236 1115705 1121382 1129434 1139805 1151562 1163971 1177216
49196 1177216 1191915 1207878 1223641 1237529 1249085 1259180 1268726 1277624 1285172 1291210 1296433 1301514
49184 1301514 1306371 1310567 1314164 1317817 1322189 1327779 1335219 1345147 1357647 1372408 1389756 1410927 1436932
49171 1436932 1467704 1502863 1542766 1588007 1638174 1691620 1745814 1796801 1838800 1866096 1876372
49160 1876372 1871875 1857385 1837830 1817616 1800396 1787997 1779956 1774934 1772288 1771763 1772351 1772510 1771380
49147 1771380 1769073 1765921 1762269 1759030 1757633 1759077 1763374 1769981 1778359 1787946 1798021 1807996 1817857 1828258
49133 1828258 1840105 1853881 1869236 1885317 1901526 1917715 1933696 1949067 1963848 1978873 1995048
49122 1995048 2012413 2030291 2048112 2065683 2082938 2100027 2117536 2136110 2155901 2176848 2199447
49111 2199447 2224749 2253742 2287314 2326826 2374055 2430408 2496834 2574769 2666319 2772203 2888561
49100 2888561 3005817 3112218 3201208 3277056 3351722 3432439 3510188 3561728 3565946 3520304 3442242
49089 3442242 3355055 3271954 3191382 3104484 3005621 2897190 2787274 2684492 2594561 2519579 2458776
49078 2458776 2409771 2370092 2338192 2313168 2293889 2279008 2267724 2259701 2253971 2248691 2242381 2234891
49066 2234891 2226766 2218268 2209624 2201622 2195144 2190216 2186066 2181896 2177176 2171528 2165056 2158657 2153375 2149431
49052 2149431 2146381 2144095 2142982 2143235 2144455 2146080 2147765 2149330 2150784 2152541 2155236 2159379 2165416 2173896
49038 2173896 2184996 2198086 2212332 2227651 2244278 2261430 2277143 2289619 2298182 2302992 2304763 2305032
49026 2305032 2305712 2307654 2310161 2312281 2313925 2315256 2315777 2314922 2313115 2311378 2310108 2308955 2307722 2306754 2306520
49011 2306520 2307441 2310008 2314416 2320093 2326201 2332618 2339883 2348137 2356767 2365216 2373589 2382127 2390569 2398409
48997 2398409 2405489 2412018 2418113 2423528 2427749 2430244 2430743 2429417 2426681 2422857 2418147 2412912 2407667 2402704
48983 2402704 2397908 2393012 2387959 2382971 2378453 2374867 2372509 2371280 2370775 2370642 2370764 2371060 2371278 2371030 2369979
48968 2369979 2367966 2365043 2361417 2357333 2353069 2349073 2345931 2344003 2343214 2343369 2344554 2347015 2350759 2355504
48954 2355504 2360946 2366861 2373182 2380290 2389088 2400299 2413723 2428614 2444793 2462868 2483311 2505900
48942 2505900 2530294 2556462 2584113 2612273 2640168 2668315 2698064 2730078 2763852 2798800 2835293
48931 2835293 2874414 2917030 2963214 3012219 3062767 3113700 3164716 3216424 3269528 3324053 3379495
48920 3379495 3435522 3492232 3549790 3608076 3666738 3725455 3784035 3842248 3899509 3954744 4006772
48909 4006772 4055091 4100253 4143327 4184948 4224989 4262965 4298460 4331214 4361209 4388866 4414896
48898 4414896 4439729 4463236 4485162 4505616 4524867 4542771 4558755 4572392 4583826 4593552 4601815 4608130
48886 4608130 4611249 4609736 4602781 4590590 4573981 4553792 4530669 4505147 4477588 4448216 4417341 4385358
48874 4385358 4352234 4317249 4279550 4238734 4194512 4146191 4093170 4035930 3975868 3914257 3851980
48863 3851980 3790242 3730558 3673623 3618929 3565915 3514998 3466980 3422054 3379963 3340753 3304787
48852 3304787 3272224 3242909 3216584 3192903 3171599 3152951 3137682 3125970 3117033 3110171 3105687 3104201
48840 3104201 3105498 3108877 3114278 3122199 3132667 3145137 3159336 3175381 3193013 3211578 3230920 3251537
48828 3251537 3273638 3296681 3320059 3343640 3367376 3390991 3414346 3437662 3461177 3484979 3509255
48817 3509255 3534191 3559429 3584235 3608372 3632244 3656008 3679270 3701969 3724814 3748332 3772166
48806 3772166 3795939 3820167 3845534 3871660 3897429 3922388 3947138 3972485 3998870 4026530 4055488
48795 4055488 4085295 4115286 4145133 4174614 4202854 4228478 4250758 4270087 4287080 4301758 4313985
48784 4313985 4324234 4333348 4341607 4348385 4352534 4352663 4347128 4334391 4313793 4285897 4251913 4212921 4169720
48771 4169720 4123173 4074279 4023835 3972223 3919575 3866006 3811691 3756901 3701993 3647183 3592323
48760 3592323 3537261 3482547 3429443 3378922 3330938 3284985 3241110 3199890 3161558 3125774 3092395
48749 3092395 3061922 3034904 3011189 2989998 2970544 2952419 2935636 2920568 2907778 2897731 2890654
48738 2890654 2886625 2885551 2886986 2890153 2894262 2898668 2902706 2905616 2906858 2906351 2904343 2901237 2897697 2894732
48724 2894732 2893286 2893586 2894929 2896236 2896879 2897003 2897026 2896944 2896292 2894757 2892513 2889857 2886904 2883905 2881436 2879828
48708 2879828 2878691 2877587 2876919 2877483 2879205 2881129 2882738 2884463 2886600 2888485 2889421 2889929 2891423 2894874 2900308
48693 2900308 2907344 2915661 2924962 2935066 2946143 2958457 2971651 2984554 2995886 3005100 3012399 3018021
48681 3018021 3021779 3023463 3023636 3023743 3025190 3028362 3032570 3036665 3039407 3039473 3035693 3027489 3014965 2998734
48667 2998734 2979938 2960138 2940430 2920549 2899339 2876264 2851931 2827025 2801439 2774906 2747927
48656 2747927 2721398 2695436 2668964 2640407 2608682 2573839 2537103 2500213 2464439 2430314 2398200
48645 2398200 2368765 2342739 2320502 2301923 2286128 2271353 2255718 2238566 2220588 2202330 2183256
48634 2183256 2162766 2141436 2120491 2100530 2081630 2064272 2049019 2035253 2021211 2005507 1987982
48623 1987982 1969042 1949138 1929263 1910997 1895242 1881328 1868050 1855369 1844440 1836099 1830017 1825503
48611 1825503 1822600 1822012 1824213 1828982 1835701 1843729 1852294 1860303 1866609 1870556 1872272 1872460 1872015 1871745 1872199
48596 1872199 1873649 1876268 1880209 1885279 1890630 1895035 1897555 1897650 1894711 1887993 1877340 1863664 1848348 1832364
48582 1832364 1816225 1800474 1785655 1771815 1758521 1745518 1733049 1721452 1710765 1701046 1692854 1687028
48570 1687028 1683911 1682967 1683285 1684403 1686570 1690383 1696329 1704544 1714642 1725593 1736002 1744695 1750931 1753974
48556 1753974 1752874 1747090 1737140 1724219 1709245 1692694 1675341 1658600 1643890 1631914 1622550 1614998
48544 1614998 1607815 1599275 1588191 1574443 1558655 1541545 1523731 1505864 1488585 1472345 1457412 1444000
48532 1444000 1432287 1422361 1414254 1408107 1404192 1402674 1403362 1405888 1410326 1417438 1427948 1441671 1457731
48519 1457731 1475392 1493625 1509525 1518287 1516019 1502589 1481382 1456754 1432336 1410864 1393980 1381706
48507 1381706 1372982 1367115 1364452 1365792 1371824 1382950 1398867 1418264 1439594 1462080 1485391 1508655
48495 1508655 1530652 1550477 1566678 1575951 1574503 1561474 1540039 1514776 1488939 1464374 1442216 1422429
48483 1422429 1403670 1384748 1365812 1347531 1330013 1313303 1298110 1285022 1273622 1263209 1253872
48472 1253872 1246005 1239291 1233092 1227457 1222924 1219609 1217183 1215461 1214346 1213535 1212899 1212906 1214102 1216488 1219911
48457 1219911 1224718 1231413 1239862 1249240 1258537 1266819 1273347 1277776 1279943 1279375 1275534 1268741 1260145 1250565
48443 1250565 1240136 1229383 1219664 1211942 1205762 1199915 1193429 1185530 1175562 1163621 1150632 1137370 1124181
48430 1124181 1111888 1101784 1094114 1087631 1081313 1075470 1070522 1065967 1061438 1057475 1054184 1050391 1045369
48417 1045369 1040174 1035901 1031721 1026207 1019687 1013562 1008074 1002459 996789 991851 987527 982933 978072 973837
48403 973837 970414 967077 963614 960763 959083 958282 957658 956458 954060 950567 946876 943425 939373 933761 926815
48388 926815 919240 911040 902160 893550 886342 880480 875298 870796 867208 863976 860434 856916 854020 851441
48374 851441 848783 846781 846299 846721 846790 846386 846103 845630 844114 841693 839276 837223 835377 833855 832613 830939
48358 830939 828552 826408 825348 824896 824583 825146 827039 829136 830529 832139 834764 837188 838425 840243 844876
48343 844876 851499 857655 863173 869988 878952 889544 901924 916659 933056 950216 968763 988900
48331 988900 1007726 1021310 1028724 1031658 1031407 1029167 1027891 1030436 1036624 1045019 1056335 1071987 1090865
48318 1090865 1111143 1133690 1159962 1188155 1215577 1243229 1273906 1307657 1343747 1384942 1434709
48307 1434709 1492263 1556021 1629852 1720010 1828441 1955838 2108539 2294750 2516642 2774644
48297 2774644 3076873 3435695 3859714 4361438 4969679 5721390 6645242 7767275 9122922
48288 9122922 10737034 12595569 14666446 16934766 19341590 21637627 23349241 23993201
48280 23993201 23383573 21735196 19485581 17042999 14671452 12511660 10625131 9017246
48272 9017246 7663862 6540026 5624230 4886572 4291010 3809294 3422253 3110255 2853379
48263 2853379 2639596 2463389 2317261 2192195 2084658 1995130 1920497 1854585 1795097 1743458
48253 1743458 1698617 1656969 1617771 1582998 1552274 1523069 1495379 1471405 1450995 1431909 1414144
48242 1414144 1399628 1388017 1376924 1366059 1357287 1350840 1345230 1340672 1338983 1340120 1342182 1344800 1349391
48229 1349391 1355893 1361919 1365001 1363207 1354275 1337115 1314029 1288889 1263436 1237649 1212695 1190375
48217 1190375 1170075 1149424 1127979 1107504 1088647 1070156 1051554 1033937 1017704 1001723 985121
48206 985121 967934 949918 930664 911002 892426 875175 858544 842773 828684 815797 802931
48195 802931 790391 779449 769850 760134 750431 742548 736939 731812 725823 719716 714631 710425 706450 702666
48181 702666 699297 696276 693418 690457 686999 683235 680261 678730 677675 675820 673418 671497 669992 668195
48167 668195 666397 665330 664458 662666 660317 658778 658146 657308 656019 654997 654069 652270 649861 648287 647891
48152 647891 647536 646760 646412 646809 647129 647238 648278 650646 652923 653704 653269 652720 652632 653254 654987 657765 660713
48135 660713 662994 664444 665196 665448 665719 666544 667755 668912 670381 672987 676587 680134 683304 686890 691326
48120 691326 695879 699678 702646 705130 707464 710159 713780 718367 723592 729461 736138 743243 750231 757373
48106 757373 765422 774414 783755 793416 803972 815480 827387 839555 852320 865508 878468 891173
48094 891173 904220 917655 930838 943561 956259 969017 981435 993542 1005746 1017728 1028521
48083 1028521 1037927 1046859 1056035 1065254 1074128 1082506 1089999 1096078 1100928 1105325 1109555 1113327 1116832 1120874
48069 1120874 1125780 1131074 1136314 1141358 1145856 1149586 1153356 1158494 1165286 1172902 1180774 1188772 1196016 1200915
48055 1200915 1202746 1202032 1199195 1194153 1187458 1180297 1172864 1164122 1153741 1142793 1131755 1119296 1104161
48042 1104161 1087211 1070469 1054957 1040418 1026326 1012061 996611 979251 960370 941042 922091
48031 922091 904025 887286 871887 857191 842628 828354 814763 801734 788848 776051 763694
48020 763694 752121 741466 731601 722127 712683 703316 694250 685445 676891 669163 662937 657982 653407 648935
48006 648935 645121 642240 639886 637864 636553 636025 635640 634924 634227 634175 635014 636681 638847 640801 642054 643194
47990 643194 645238 648024 650205 651139 651693 652713 653720 653804 652975 651843 650569 648889 646782 644457 641933
47975 641933 639102 636032 632956 630175 627973 626254 624326 621575 618340 615546 613572 612120 611012 610168
47961 610168 608923 606512 603397 601026 600031 599696 599460 599759 600940 602515 604149 606383 609680 613594 617656
47946 617656 622315 628247 635206 642175 648278 653303 657929 663654 671638 681219 690337 697812 704429 711473
47932 711473 719126 726761 733865 740045 744915 748600 751633 753945 754787 754061 752711 751267 749082 745666 741687
47917 741687 737760 733273 727451 720735 713969 706954 699018 690524 682672 676065 670482 665811 662224 659527
47903 659527 657148 654838 652862 651560 651070 651272 651725 651989 652236 653163 655087 657711 660927 665062 670056 675232
47887 675232 680324 685876 692220 699040 706409 715067 724881 734229 741971 749046 756868 765010 771804 776678
47873 776678 780474 783793 786313 787622 787625 786236 783546 780137 776445 771988 766027 758653 750451 741489 731555
47858 731555 721133 711148 701897 693018 684320 675865 667517 659223 651532 644944 639054 633221 627854 623998
47844 623998 621753 620044 617999 615779 614105 613728 615212 618320 621652 623775 624806 626167 628806 632407
47830 632407 636276 640043 643365 645855 647732 649941 653208 657305 661369 664692 667231 669687 673012 677533
47816 677533 682763 688402 695099 703654 713880 725005 736936 750296 765434 782330 801417 823503
47804 823503 848599 875565 903139 930716 957945 984258 1009086 1032034 1052506 1069525 1082234
47793 1082234 1090386 1094226 1094112 1090325 1083079 1072718 1059956 1045756 1030801 1015297 999448 983796
47781 983796 968856 954806 941887 930628 921177 912811 904631 896394 888211 879884 871207 862559 854439
47768 854439 846695 838811 830794 823088 815960 809574 804355 800459 797095 793127 788226 782733 776715 770070
47754 770070 763399 757762 753418 749557 745399 740900 736432 732503 729863 729105 730003 731755 733955 736852 740793
47739 740793 746109 753347 762746 773435 783988 794015 804447 816108 828712 841520 854266 866994
47727 866994 879518 891414 902281 911854 920137 927504 934275 940174 944550 947075 947820 946716 943482 938101
47713 938101 930865 922001 911676 900306 888378 876048 863349 850621 838167 825718 812977 800631
47701 800631 790060 781989 776025 771486 768004 765360 763524 762964 764220 767066 770698 774808 779721 785484
47687 785484 791645 798091 805304 813520 822374 831615 841487 852119 863313 875206 888346 902549 916317
47674 916317 927973 937025 944080 949856 954681 958544 961224 962572 962823 962292 960682 957200 951551 944275
47660 944275 935930 926534 916135 905220 894108 882471 870040 857370 845329 834144 823568 813779
47648 813779 805470 799013 793970 789632 785812 782992 781763 782199 783838 786316 789936 795375 802885 812015
47634 812015 822107 832790 843903 855218 866444 877502 888808 901317 916114 933799 954303
47623 954303 977350 1002825 1030593 1060344 1091889 1125173 1159538 1193402 1225208 1254379 1280744
47612 1280744 1303397 1320810 1331902 1336186 1333066 1321912 1302960 1277444 1246642 1211360 1172391 1130798
47600 1130798 1087525 1043246 998725 954945 912841 873256 836966 804169 774234 746653 722004
47589 722004 701090 683360 667299 652427 639693 629650 621478 614302 608326 603854 600171 596299 592222
47576 592222 588470 585037 581584 578330 575821 574011 572348 570696 569486 568914 568642 568368 568203 568299 568408 568019
47560 568019 566799 564812 562415 559991 557723 555573 553396 551029 548358 545453 542546 539764 537001 534185
47546 534185 531514 529191 527135 525237 523721 522902 522720 522847 523101 523360 523249 522349 520651 518547 516541 515215
47530 515215 515073 515954 516985 517653 518557 520485 523177 525748 527866 529633 530706 530704 530249 530453 531382 532144 532441
47513 532441 532824 533304 533067 531948 530944 530808 531216 531824 532974 534706 536140 536650 536765 537079 537077 535999 534275
47496 534275 533212 533566 535072 536951 538203 537816 535460 531927 528469 525793 523906 522559 521526 520775 520570
47481 520570 521131 522159 523180 524372 526363 529150 532003 534616 537511 540998 544579 547780 550702 553332
47467 553332 555188 556152 556850 557733 558631 559648 561500 564247 566650 567607 567464 567131 566786 566296 566109 566668 567576
47450 567576 568338 569354 571259 573986 577501 582752 590578 600194 610113 620248 631709 644748 658454
47437 658454 672686 688880 708351 730780 754954 780181 806381 833343 860439 886852 911718
47426 911718 934243 953866 970211 982896 991609 996362 997381 994801 988653 979061 966284 950724 933102
47413 933102 914391 895303 876013 856553 837177 818157 799603 781823 765455 750871 737727
47402 737727 725470 714019 703730 694985 688021 682686 678143 673358 668193 663501 659850 656913 654479
47389 654479 653154 653366 654485 655831 657936 661850 667611 674378 681737 689893 698705 707434 715447 722531
47375 722531 728630 733811 738329 742181 744910 746389 747351 748324 748437 746210 741387 735113 728332 720818 711835
47360 711835 701142 689262 677218 665896 655236 644278 632409 620173 608371 596913 585303
47349 585303 573793 563136 553550 544793 536980 530397 524741 519555 515224 512514 511115 509679 507440 504949
47335 504949 503121 502323 502470 503253 504198 505219 507087 510581 515164 519342 522389 524924 527765 531076 534728
47320 534728 538574 542042 544351 545517 546542 548263 550510 552526 553648 553428 551805 549430 547285 545759
47306 545759 544485 543148 541837 540590 539246 537985 537412 537870 539165 541075 543603 546574 549512 552137 554559
47291 554559 556933 559369 562261 566208 571480 577951 585428 593564 601573 608745 615352 622407 630408 638813
47277 638813 646819 654120 660872 667474 674421 681839 689133 695559 701092 706231 711101 715354 718849 721723
47263 721723 723878 725067 725395 725073 723875 721732 719708 719395 721270 724546 728646 733794 740011 746537 752419
47248 752419 756614 757317 752463 741669 727048 711614 697483 685653 676423 669301 663265 657756 653084
47235 653084 649660 647553 646994 648418 651559 655306 658968 662977 667906 673584 679695 686416 693835 701432
47221 701432 708892 716821 725966 736092 746202 755454 763371 769652 774333 777803 780203 781141 780250 777625
47207 777625 773478 767950 761484 754772 747988 740775 733267 726345 720488 715163 709846 704807 700341 696133
47193 696133 692073 688900 687255 686824 687247 689098 693011 698479 704575 711370 719594 729312 739952 751362
47179 751362 763820 777258 791429 806650 823350 840966 858272 874811 891172 907763 924134
47168 924134 939572 953629 966011 976631 985838 993918 1000327 1004116 1005174 1004390 1002434 999117 994077
47155 994077 987396 979269 969704 958991 947963 937349 927215 917367 908035 899719 892495 885889 879454
47142 879454 873274 867784 863200 859374 856262 854394 854534 856847 860660 865119 869800 874636 879719 885418
47128 885418 892201 899900 907410 913492 917635 919838 919945 917755 913586 908167 901974 895019 887170 878338
47114 878338 868517 858003 847414 837063 826484 815065 803028 791331 780649 770891 761777 753311
47102 753311 745574 738354 731255 724050 716910 710335 704730 699884 695061 689827 684606 680120 676540 673539
47088 673539 671010 669265 668663 669418 671654 675155 679109 682663 685861 689570 694329 699615 704485 708612 712422
47073 712422 716414 720605 724638 728183 731113 733280 734343 734057 732782 731419 730578 729961 728790 726782 724495
47058 724495 722784 722117 722419 723409 724976 727254 730377 734218 738497 743090 748029 753206 758382 763494 768705
47043 768705 774065 779424 784800 790500 796760 803588 811063 819348 828083 836224 842969 848709 854669 861702
47029 861702 869703 878009 886039 893616 900956 908315 915477 921695 926312 929365 931430 932992 934046 934188
47015 934188 933028 930700 927970 925482 922913 919267 914143 908254 902547 897350 892678 888745 885612 882778
47001 882778 879690 876431 873444 870910 868927 867991 868589 870420 872674 875105 878228 882359 887011 891485 895689
46986 895689 900097 905153 910952 917453 924711 932815 941603 950637 959635 968879 978936 990000 1001754
46973 1001754 1013817 1025941 1037789 1049021 1059711 1070194 1080380 1089745 1098207 1106301 1114144 1120878
46961 1120878 1125719 1128982 1131452 1133181 1133655 1132871 1131528 1130280 1129339 1128633 1127935 1127109 1126706 1127866 1130933 1134559
46945 1134559 1137068 1138589 1140898 1145186 1150881 1156830 1162663 1168602 1174700 1180969 1187837 1195821 1204840 1214208
46931 1214208 1223325 1232117 1240866 1249745 1258623 1267231 1275420 1283029 1289484 1293818 1295341 1294136 1290705 1285310
46917 1285310 1277916 1268585 1257592 1245258 1231951 1218150 1204224 1190230 1176161 1162312 1149261 1137604
46905 1137604 1127865 1120386 1115042 1111284 1108724 1107573 1108355 1111414 1116889 1124819 1135005 1147091 1161007
46892 1161007 1176983 1194918 1214166 1234225 1255084 1276498 1297545 1317509 1336666 1355491 1373518
46881 1373518 1389749 1403817 1415938 1426035 1433804 1439485 1443721 1446742 1448561 1449867 1451765 1454496 1457285
46868 1457285 1459673 1462295 1466028 1471108 1477382 1484859 1493625 1503641 1514973 1527871 1542373 1558083 1574431
46855 1574431 1590855 1606665 1621103 1633751 1644639 1653945 1661751 1667985 1672368 1674534 1674508 1672858 1669996
46842 1669996 1665640 1659422 1651743 1643462 1635058 1626758 1619171 1612900 1607652 1602648 1597960 1594577 1593043 1592949
46828 1592949 1593964 1596414 1600476 1605700 1611889 1619691 1629721 1641593 1654363 1667498 1680825 1693920
46816 1693920 1706186 1717344 1727422 1736303 1743613 1748951 1752070 1752952 1751825 1748956 1744421 1738326 1731204
46803 1731204 1723777 1716225 1708094 1699024 1689204 1679024 1668727 1658609 1649144 1640641 1633002 1625910 1619092
46790 1619092 1612383 1605915 1600233 1595859 1592726 1590374 1588657 1587812 1587897 1588726 1590364 1593070 1596632 1600330 1603672
46775 1603672 1606665 1609391 1611913 1614654 1618054 1621729 1624835 1627471 1630842 1635615 1641058 1646418 1652278 1659663
46761 1659663 1668503 1677923 1687677 1698309 1710098 1722711 1735858 1749525 1763515 1777382 1790986 1804562
46749 1804562 1818187 1831624 1844794 1857928 1871029 1883537 1894709 1904106 1911571 1917020 1920562 1922719
46737 1922719 1924208 1925404 1926130 1926117 1925593 1925185 1925260 1925691 1926408 1927826 1930418 1934117 1938570 1943756 1949797 1956295
46721 1956295 1962514 1968279 1974056 1979931 1985105 1988732 1990798 1991783 1991805 1990514 1987561 1982784 1976052 1967269 1956562
46706 1956562 1944271 1930683 1915796 1899246 1880637 1860087 1838430 1816574 1794741 1772620 1750102
46695 1750102 1727437 1704671 1681503 1657890 1634426 1611869 1590525 1570241 1550816 1532311 1515077
46684 1515077 1499414 1485109 1471545 1458525 1446637 1436388 1427333 1418680 1410447 1403254 1397175 1391709
46672 1391709 1386821 1383077 1380658 1379116 1378289 1378536 1379800 1381415 1383250 1386182 1390961 1397349 1404845 1413400
46658 1413400 1422890 1432682 1442381 1452295 1462474 1472001 1479971 1486543 1492193 1496518 1498743 1499058 1498454 1497421
46644 1497421 1495644 1492913 1489640 1486530 1484319 1483760 1485244 1488460 1492923 1498747 1506484 1516407 1528464 1542737
46630 1542737 1559329 1577863 1597625 1618171 1639262 1660236 1679997 1697764 1713425 1727050 1738339
46619 1738339 1746670 1751492 1752665 1750495 1745399 1737503 1726761 1713412 1697857 1679986 1659302 1636138
46607 1636138 1612244 1589484 1568241 1547661 1527273 1507736 1490115 1474936 1461979 1450501 1439646
46596 1439646 1428960 1418590 1408877 1399961 1391966 1385153 1379402 1373837 1367562 1360712 1354304 1348976 1344265
46583 1344265 1339114 1332798 1325361 1317474 1309903 1302972 1296535 1290550 1285388 1281351 1278089 1274805 1270991 1266859
46569 1266859 1263205 1260952 1260538 1261495 1262804 1263770 1264349 1264718 1265048 1265771 1267420 1269837 1272083 1273515 1274498 1275726
46553 1275726 1277420 1279660 1282850 1287140 1291809 1295953 1299525 1303197 1307543 1312936 1319779 1328063 1336961 1345575
46539 1345575 1353954 1362840 1372705 1383693 1396110 1410131 1425248 1440868 1457345 1475587 1495730 1517125
46527 1517125 1539614 1563807 1589873 1616943 1644124 1671362 1698838 1726124 1752482 1777634 1801740
46516 1801740 1824823 1846607 1866855 1885575 1902882 1918737 1932826 1944773 1954459 1962006 1967397 1970430
46504 1970430 1971289 1970815 1969784 1968156 1965420 1961511 1956897 1951924 1946520 1940496 1933750 1926240 1918135 1909942
46490 1909942 1902062 1894240 1885704 1875796 1864218 1850929 1836069 1819755 1801659 1781125 1758101 1733577
46478 1733577 1708587 1683159 1656777 1629439 1601513 1572868 1543156 1512958 1483863 1457210 1433308
46467 1433308 1411884 1392657 1375365 1359786 1345969 1334181 1324734 1318173 1315331 1316566 1321132 1327873
46455 1327873 1336346 1346613 1358245 1370506 1383429 1397767 1413655 1430162 1446326 1461835 1476429
46444 1476429 1489437 1500379 1509487 1517219 1523619 1528345 1530995 1531350 1529741 1527170 1524501 1521563 1517610 1512658
$$ [...]
##END NTUPLES=NMR SPECTRUM
##END=
