
##TITLE=UV1222_M6_1234-1212_10_7231161_mgfaJ3Nj4P
##JCAMPDX= 6.0         $$ Bruker NMR JCAMP-DX V2.0
##DATA TYPE= NMR SPECTRUM
##DATA CLASS= NTUPLES
##ORIGIN= BRUKER
##OWNER= Administrator
$$ 1.72 TOPSPIN		Version 2.1
$$ 2013-01-24 02:00:43.877 -0500  Administrator@X
$$ Compression mode = diff/dup
##.OBSERVE FREQUENCY= 400.02188249412
##.OBSERVE NUCLEUS= ^1H
##.ACQUISITION MODE= SIMULTANEOUS (DQD)
##.ACQUISITION SCHEME= undefined
##.AVERAGES= 64
##.DIGITISER RES= 22
##SPECTROMETER/DATA SYSTEM= spect
##.PULSE SEQUENCE= noesygpps1d.comp
##.SOLVENT NAME= COFFEE_meoh
##.SHIFT REFERENCE= INTERNAL, COFFEE_meoh, 1, 14.96086
##AUDIT TRAIL= $$ (NUMBER, WHEN, WHO, WHERE, PROCESS, VERSION, WHAT)
$$ ##TITLE= Audit trail, TOPSPIN		Version 2.1
$$ ##JCAMPDX= 5.01
$$ ##ORIGIN= Bruker BioSpin GmbH
$$ ##OWNER= Administrator
$$ $$ E:\/data/COFFEE/nmr/UV1222_M6_1234-1212_10_7231161_mgfaJ3Nj4P/32/pdata/1/auditp.txt
$$ ##AUDIT TRAIL=  $$ (NUMBER, WHEN, WHO, WHERE, PROCESS, VERSION, WHAT)
(   1,<2013-01-24 02:00:38.002 -0500>,<Administrator>,<X>,<go>,<TOPSPIN 2.1>,
      <created by zg
	started at 2013-01-24 01:49:07.799 -0500,
	POWCHK enabled, PULCHK disabled,
       configuration hash MD5:
       86 BA 57 50 F2 9D 5C 9B 26 00 A9 28 5F 66 2E 89
       data hash MD5: 64K
       BF 71 DB F8 18 3E 0C 68 9A 81 F1 9F 4D BA CF 0F>)
(   2,<2013-01-24 02:00:41.143 -0500>,<Administrator>,<X>,<proc1d>,<TOPSPIN 2.1>,
      <Start of raw data processing
       efp LB = 0.3 FT_mod = 6 PKNL = 1 PHC0 = 0 PHC1 = 0 SI = 128K 
       data hash MD5: 128K
       07 E9 E2 99 39 31 AE 23 79 6F 28 1D C8 6D 11 33>)
(   3,<2013-01-24 02:00:42.174 -0500>,<Administrator>,<X>,<proc1d>,<TOPSPIN 2.1>,
      <pk PHC0 = -79.14551 PHC1 = 0 
       data hash MD5: 128K
       8C 94 74 71 FF 59 78 B4 DC E4 01 7F 7A CA B5 26>)
(   4,<2013-01-24 02:00:42.830 -0500>,<Administrator>,<X>,<proc1d>,<TOPSPIN 2.1>,
      <abs ABSG = 1 
       data hash MD5: 128K
       8C A6 85 92 21 83 C0 60 E1 12 7A B7 F8 B3 A0 99>)
(   5,<2013-01-24 02:00:43.002 -0500>,<Administrator>,<X>,<proc1d>,<TOPSPIN 2.1>,
      <abs ABSG = 2 
       data hash MD5: 128K
       D4 B9 27 25 F5 63 2A CD E2 C6 5F 96 A3 C4 DA 45>)
(   6,<2013-01-24 02:00:43.190 -0500>,<Administrator>,<X>,<proc1d>,<TOPSPIN 2.1>,
      <abs ABSG = 3 
       data hash MD5: 128K
       7E 48 B0 0C 54 64 A7 75 E9 21 8E 6E A4 7C 6E C7>)
(   7,<2013-01-24 02:00:43.377 -0500>,<Administrator>,<X>,<proc1d>,<TOPSPIN 2.1>,
      <abs ABSG = 4 
       data hash MD5: 128K
       6F 23 11 C5 9E 5A 1B 11 E9 18 C6 78 76 F8 05 5B>)
(   8,<2013-01-24 02:00:43.565 -0500>,<Administrator>,<X>,<proc1d>,<TOPSPIN 2.1>,
      <abs ABSG = 5 
       data hash MD5: 128K
       46 D6 89 E9 66 9F C0 CC E2 FF A7 38 B2 5F 75 6B>)
$$ ##END=
$$ 
$$ $$ hash MD5
$$ $$ 5D AA B9 57 09 EA 6A 63 9C 09 06 A2 49 1D 0D 20
##$RELAX= 
##$RELAX= 
##$RELAX= 
##$RELAX= 
##$RELAX= 
##$RELAX= 
##$RELAX= 
##$RELAX= 
$$ Bruker specific parameters
$$ --------------------------
##$DU= <E:\>
##$EXPNO= 32
$$ [...]
##$TP07= 0
##$TPNAME0= <>
##$TPNAME1= <>
##$TPNAME2= <>
##$TPNAME3= <>
##$TPNAME4= <>
##$TPNAME5= <>
##$TPNAME6= <>
##$TPNAME7= <>
##$TPOAL= (0..7)
0.5 0.5 0.5 0.5 0.5 0.5 0.5 0.5
##$TPOFFS= (0..7)
0 0 0 0 0 0 0 0
##$TUNHIN= 0
##$TUNHOUT= 0
##$TUNXOUT= 0
##$USERA1= <user>
##$USERA2= <user>
##$USERA3= <user>
##$USERA4= <user>
##$USERA5= <user>
##$V9= 5
##$VALIST= <valist>
##$VCLIST= <CCCCCCCCCCCCCCC>
##$VD= 0
##$VDLIST= <DDDDDDDDDDDDDDD>
##$VPLIST= <PPPPPPPPPPPPPPP>
##$VTLIST= <TTTTTTTTTTTTTTT>
##$WBST= 1024
##$WBSW= 4
##$XGAIN= (0..3)
0 0 0 0
##$XL= 0
##$YL= 0
##$YMAX_a= 6694225
##$YMIN_a= -12986098
##$ZGOPTNS= <>
##$ZL1= 120
##$ZL2= 120
##$ZL3= 120
##$ZL4= 120
##$ABSF1= 14.96086
##$ABSF2= -5.597322
##$ABSG= 5
##$ABSL= 3
##$ALPHA= 0
##$AQORDER= 0
##$ASSFAC= 0
##$ASSFACI= 0
##$ASSFACX= 0
##$ASSWID= 0
##$AUNMP= <proc_prof1d_extract.lims>
##$AXLEFT= 0
##$AXNAME= <>
##$AXNUC= <1H>
##$AXRIGHT= 0
##$AXTYPE= 0
##$AXUNIT= <>
##$AZFE= 0.1
##$AZFW= 0.1
##$BCFW= 0
##$BC_mod= 0
##$BYTORDP= 0
##$COROFFS= 0
##$CY= 15
##$DATMOD= 1
##$DC= 0
##$DFILT= <>
##$DTYPP= 0
##$F1P= 0
##$F2P= 0
##$FCOR= 0.5
##$FTSIZE= 131072
##$FT_mod= 6
##$GAMMA= 0
##$GB= 0
##$INTBC= 1
##$INTSCL= 1
##$ISEN= 128
##$LB= 0.3
##$LEV0= 0
##$LPBIN= 0
##$MAXI= 10000
##$MC2= 0
##$MEAN= 0
##$ME_mod= 0
##$MI= 0
##$NCOEF= 0
##$NC_proc= -2
##$NLEV= 6
##$NOISF1= 0
##$NOISF2= 0
##$NSP= 0
##$NTH_PI= 0
##$NZP= 0
##$OFFSET= 14.96086
##$PC= 1
##$PHC0= -79.14551
##$PHC1= 0
##$PH_mod= 1
##$PKNL= yes
##$PPARMOD= 0
##$PPDIAG= 0
##$PPIPTYP= 0
##$PPMPNUM= 2147483647
##$PPRESOL= 1
##$PSCAL= 4
##$PSIGN= 0
##$PYNMP= <proc.py>
##$REVERSE= no
##$SF= 400.020009693594
##$SI= 131072
##$SIGF1= 0
##$SIGF2= 0
##$SINO= 400
##$SIOLD= 131072
##$SPECTYP= <>
##$SREGLST= <1H.CDCl3>
##$SSB= 0
##$STSI= 131072
##$STSR= 0
##$SW_p= 8223.68421052631
##$SYMM= 0
##$S_DEV= 0
##$TDeff= 65536
##$TDoff= 0
##$TI= <>
##$TILT= no
##$TM1= 0
##$TM2= 0
##$TOPLEV= 0
##$USERP1= <user>
##$USERP2= <user>
##$USERP3= <user>
##$USERP4= <user>
##$USERP5= <user>
##$WDW= 1
##$XDIM= 131072
##$YMAX_p= 435911370
##$YMIN_p= -10659
##$CURPLOT= <Network HP LaserJet P1505>
##$CURPRIN= <$Network HP LaserJet P1505>
##$DFORMAT= <normdp>
##$LAYOUT= <+/1D_H.xwp>
##$LFORMAT= <normlp>
##$PFORMAT= <normpl>
##$SURQMSG= 1
$$ End of Bruker specific parameters
$$ ---------------------------------
##NTUPLES= NMR SPECTRUM
##VAR_NAME=  FREQUENCY,     SPECTRUM/REAL,   SPECTRUM/IMAG
##SYMBOL=    X,             R,               I
##VAR_TYPE=  INDEPENDENT,   DEPENDENT,       DEPENDENT
##VAR_FORM=  AFFN,          ASDF,            ASDF
##VAR_DIM=   131072,        131072,          131072
##UNITS=     HZ,            ARBITRARY UNITS, ARBITRARY UNITS
##FACTOR=    0.0627417313425164, 1,          1
##FIRST=     8223.62146879497, 887,          -67338
##LAST=      0,             3247,            -67249
##MIN=       0,             -10659,          0
##MAX=       8223.62146879497, 435911370,    0
$$ Real data points
##PAGE= N=1
##DATA TABLE= (X++(R..R)), XYDATA
$$ [...]
63888G47662k1304j9363j8017j6986j5774j4178j2448j0912r511p841n572k823
$$ 747662 726358 706995 688978 671992 656218 642040 629592 618680 609169 601328 595756 592933
63876E92933l4K516M900P243R418J1362J3482J6248J9401K2120K4077K5829K7858
$$ 592933 592899 595415 600315 607558 616976 628338 641820 658068 677469 699589 723666 749495 777353
63863G77353K9833L1202L2061L2880L3682L3958L3206L1186K7994K4242K0753
$$ 777353 807186 838388 870449 903329 937011 970969 1004175 1035361 1063355 1087597 1108350
63852A108350J7575J3806R033M324Q61j990n993j1427j6548k0077k2949k6694
$$ 1108350 1125925 1139731 1148764 1153088 1153949 1151959 1145966 1134539 1117991 1097914 1074965 1048271
63840A048271l1040l4253l5499l5711l6086l6640l6578l5562l4103l2869l1983
$$ 1048271 1017231 982978 947479 911768 875682 839042 802464 766902 732799 699930 667947
63829F67947l1079k9838k8345k6845k5329k3519k1308j9057j7315j6275j5563
$$ 667947 636868 607030 578685 551840 526511 502992 481684 462627 445312 429037 413474
63818D13474j4612j3222j1713j0469r393q133o772n914n874o067n656m560l504
$$ 413474 398862 385640 373927 363458 354065 345932 339160 333246 327372 321305 315649 311089 307585
63805C07585l095l228l366l116k500j893j704j951k252k362k457k700k834k642
$$ 307585 304490 301262 297896 294780 292280 290387 288683 286732 284480 282118 279661 276961 274127 271485
63791B71485k456k689l051k869k096j416j303j567j898k272k641k751k526k152
$$ 271485 269029 266340 263289 260420 258324 256908 255605 254038 252140 249868 247227 244476 241950 239798
63777B39798j656p99L51J191J215N72j52m86k75K64O31M68M9m6K15K28l64j208
$$ 239798 238142 237343 237694 238885 240100 240672 240520 240034 239759 240023 240654 241122 241171 241125 241340 241568 241204 239996
63759B39996j748j772j264k89P03J005M63k47m66k71j3L30Q91J390J383Q76K74
$$ 239996 238248 236476 235212 234923 235626 236631 237094 236847 236381 236110 236097 236427 237318 238708 240091 240967 241241
63742B41241j04j74P6O29J446K542L764M499M138L044K386K692L128K767J927
$$ 241241 241137 240963 241039 241668 243114 245656 249420 253919 258057 261101 263487 266179 269307 272074 274001
63727B74001J598J980K451K672K939L459M015M390M559M518M298M153M164L837
$$ 274001 275599 277579 280030 282702 285641 289100 293115 297505 302064 306582 310880 315033 319197 323034
63713C23034K612P98o01j069j104j402k031k583k813k858k971l175l152k573j589
$$ 323034 325646 326444 325843 324774 323670 322268 320237 317654 314841 311983 309012 305837 302685 300112 298523
63698B98523q07n77n31j14P42J742K782L840M591M637M056L301K651K204K126
$$ 298523 297716 297139 296608 296494 297236 298978 301760 305600 310191 314828 318884 322185 324836 327040 329166
63683C29166K390K396J578L07m73m95l43l80k58L09R87J339J340J153Q78Q05J295
$$ 329166 331556 333952 335530 335837 335364 334869 334526 334146 333888 334197 335184 336523 337863 339016 339894 340699 341994
63666C41994K139K529K074J292P45J99q06k092l065l518l670l613l321l014l003
$$ 341994 344133 346662 348736 350028 350773 350972 350166 348074 345009 341491 337821 334208 330887 327873 324870
63651C24870l232l404l457l489l351k786j939j287j013q47n86l50k41r8K40P39
$$ 324870 321638 318234 314777 311288 307937 305151 303212 301925 300912 300065 299479 299129 298888 298790 299030 299769
63635B99769J399K399L710M847N322N283N364N868O410O573O627P223Q484R776
$$ 299769 301168 303567 307277 312124 317446 322729 328093 333961 340371 346944 353571 360794 369278 379054
63621C79054J0570J1113J1962J3117J4082J4754J5646J7172J9120K1088K3053
$$ 379054 389624 400737 412699 425816 439898 454652 470298 487470 506590 527678 550731
63610E50731K5183K7385K9496L1735L4472L7427L9436L9273L6619L2132K6695
$$ 550731 575914 603299 632795 664530 699002 736429 775865 815138 851757 883889 910584
63599I10584K0673J3976O796J23m721p091p524p201p062p459q460j0157j2656
$$ 910584 931257 945233 952029 952152 947431 940340 932816 925615 918553 911094 902634 892477 879821
63586H79821j5890j9450k2689k5130k6792k7926k8491k8101k6578k4269k1680
$$ 879821 863931 844481 821792 796662 769870 741944 713453 685352 658774 634505 612825
63575F12825j9088j6722j4820j3262j1424q930o236m010k189k73J661L066M052
$$ 612825 593737 577015 562195 548933 537509 528579 522343 518333 516144 515871 517532 520598 524650
63562E24650N443P469R178R769R746J0075J0759J1150J1304J2081J3901J6285
$$ 524650 530093 537562 546740 556509 566255 576330 587089 598239 609543 621624 635525 651810
63550F51810J8894K2185K6697L2181L7874M3260M8053N1616N2688M9831M2326
$$ 651810 670704 692889 719586 751767 789641 832901 880954 932570 985258 1035089 1077415
63539A077415L1008J8184O302l417j0843j5791j7832j7321j5590j3679j1658r730
$$ 1077415 1108423 1126607 1132909 1129492 1118649 1102858 1085026 1067705 1052115 1038436 1026778 1017048
63527A017048r098j0832j4450j8665k3109k8167l3320l6985l8216l7635l6396
$$ 1017048 1007950 997118 982668 964003 940894 912727 879407 842422 804206 766571 730175
63516G30175l5040l3587l1952k9839k6994k3882k1465j9909j8247j5780j3147
$$ 730175 695135 661548 629596 599757 572763 548881 527416 507507 489260 473480 460333
63505D60333j1368j0455r627q564p668p301p271p063o279m970l703l001k649k016
$$ 460333 448965 438510 428883 420319 412651 405350 398079 391016 384737 379767 376064 373063 370414 368398
63491C68398j080n38o34p54n49n46j029j168k34J033J398J053J350K782M322M874
$$ 368398 367318 366780 366146 365392 364843 364297 363268 362100 361866 362899 364297 365350 366700 369482 373804 378678
63475C78678M456L791L535L884M382M042K348M2j716k758l715m651m963m599m288
$$ 378678 383134 386925 390460 394344 398726 402768 405116 405158 403442 400684 396969 392318 387355 382756 378468
63460C78468m355m299l812l192k515j417r3N52L51M45J655L225M041M356N178
$$ 378468 374113 369814 366002 362810 360295 358878 358785 359337 359688 360133 361788 365013 369054 373410 378588
63445C78588O514P393P497P624Q412R526J0436J1452J3458J6853K1125K5517K9883
$$ 378588 385102 392495 399992 407616 416028 425554 435990 447442 460900 477753 498878 524395 554278
63432E54278L4560L9166M1908M0711L5237K7341J9330J2360O683K745J267K516
$$ 554278 588838 628004 669912 710623 745860 773201 792531 804891 811574 814319 815586 818102
63420H18102N988J0790J6105K1453K6785L2136L7114M0896M2840M2610L9782L4047
$$ 818102 824090 834880 850985 872438 899223 931359 968473 1009369 1052209 1094819 1134601 1168648
63408A168648K6111J7655R913K850l758r151j2316j3382j3402j3177j3086j3871
$$ 1168648 1194759 1212414 1222327 1225177 1221419 1212268 1199952 1186570 1173168 1159991 1146905 1133034
63396A133034j6418k0658k5431k9708l3341l6509l9066m0612m0833l9588l7034
$$ 1133034 1116616 1095958 1070527 1040819 1007478 970969 931903 891291 850458 810870 773836
63385G73836l3804l0616k7704k4851k1957j9204j6658j4193j1755r433p271n296
$$ 773836 740032 709416 681712 656861 634904 615700 599042 584849 573094 563661 556390 551094
63373E51094l630k143k72K320N080P227Q979J1262J4214J6825J8407J9528K1064
$$ 551094 547464 545321 545049 547369 552449 559676 568655 579917 594131 610956 629363 648891 669955
63360F69955K3058K5175K7738L1356L5817M0047M3211M5207M6041M5299M2548
$$ 669955 693013 718188 745926 777282 813099 853146 896357 941564 987605 1032904 1075452
63349A075452L7849L1645K4327J6262Q115Q29m849q778j1264j2656j3203j3272
$$ 1075452 1113301 1144946 1169273 1185535 1193650 1194479 1189630 1180852 1169588 1156932 1143729 1130457
63337A130457j3509j4628j7004k0424k4205k7646l0573l3347l6109l8071l8034
$$ 1130457 1116948 1102320 1085316 1064892 1040687 1013041 982468 949121 913012 874941 836907
63326H36907l5818l2657k9791k7008k3169j7912j2238p374l729j275m03j852n787
$$ 836907 801089 768432 738641 711633 688464 670552 658314 650940 647211 645936 645533 643681 637894
63313F37894j1213j6517k0492k2862k3864k3576k1968j9495j7067j5190j3532
$$ 637894 626681 610164 589672 566810 542946 519370 497402 477907 460840 445650 432118
63302D32118j1613r574p848o461n186m173l715l680l710l939m694n562n610m660
$$ 432118 420505 410931 403083 396622 391436 387263 383548 379868 376158 372219 367525 361963 356353 351693
63288C51693l619l117k643j522j43M78O2o73j065j257j747k521k871k110m83Q15
$$ 351693 348074 344957 342314 340792 340649 341127 341189 340516 339451 338194 336447 333926 331055 328945 328462 329277
63272C29277Q58J02j40O49J590J685J069N57M44L40Nk60o8O03J445K049K163J935
$$ 329277 330135 330237 330097 330746 332336 334021 335090 335647 336091 336431 336436 336176 336108 336711 338156 340205 342368 344303
63254C44303J833K154K717L248L807M552N295N655N567N311N120N154N670O816
$$ 344303 346136 348290 351007 354255 358062 362614 367909 373564 379131 384442 389562 394716 400386 407202
63240D07202Q286R602J0766J2166J3819J5276J6360J7488J8913K0191K0880K1306
$$ 407202 415488 425090 435856 448022 461841 477117 493477 510965 529878 550069 570949 592255
63228E92255K2026K2767K2658K1544K0362J9957K0158K0395K0695K1475K2628
$$ 592255 614281 637048 659706 681250 701612 721569 741727 762122 782817 804292 826920
63217H26920K3534K3843K3675K3037K1730J9894J7975J5832J2571P693J906l724
$$ 826920 850454 874297 897972 921009 942739 962633 980608 996440 1009011 1016704 1018610 1014886
63205A014886q977j4185j9111k2943k5333k6746k7674k8071k7638k6211k3780
$$ 1014886 1005909 991724 972613 949670 924337 897591 869917 841846 814208 787997 764217
63194G64217k0605j7341j4551j2055r250o098l181p50J658M384P115R528J1782
$$ 764217 743612 726271 711720 699665 690415 684317 681136 680386 682044 686428 693543 703071 714853
63181G14853J4036J5996J7436J8659J9937K0964K1342K1192K0839K0274J9498
$$ 714853 728889 744885 762321 780980 800917 821881 843223 864415 885254 905528 925026
63170I25026J8921J8736J8277J6785J4493J2207R943O864K593k269p054j1723
$$ 925026 943947 962683 980960 997745 1012238 1024445 1034388 1041252 1043845 1041576 1034522 1022799
63158A022799j6471k1227k5818l0068l3492l5404l5640l4771l3365l1529k9331
$$ 1022799 1006328 985101 959283 929215 895723 860319 824679 789908 756543 725014 695683
63147F95683k7135k5113k2897k0166j7319j5065j3522j2157j0497q614o934n864
$$ 695683 668548 643435 620538 600372 583053 567988 554466 542309 531812 523198 516264 510400
63135E10400n470n314m741l516k112j193q77p32l90O4L55M98Q99J882L108L699
$$ 510400 504930 499616 494875 491359 489247 488054 487177 486445 486055 486119 486474 486972 487871 489753 492861 496560
63119D96560L252K535K674L733M641M699M430M593N002M952M361L754L397L155
$$ 496560 499812 502347 505021 508754 513395 518094 522524 527117 532119 537071 541432 545186 548583 551738
63105E51738L014L067L015K451J616J184J144P71j03o07r0Q07J042N70J56R5l7
$$ 551738 554752 557819 560834 563285 564901 566085 567229 568000 567897 567290 567200 568007 569049 569619 569775 569870 569833
63088E69833m88r60j209j319j261p69J45J012J528J938K468K852K813K687L083
$$ 569833 569345 568385 567176 565857 564596 563827 563972 564984 566512 568450 570918 573770 576583 579270 582353
63073E82353M044N032N694O165O580O756O646O692P384Q648J0015J1351J2938
$$ 582353 586397 591429 597123 603288 609868 616624 623270 629962 637346 645994 656009 667360 680298
63060F80298J4814J6557J8058K0107K3512K7795L1440L3707L5491L8029M1324
$$ 680298 695112 711669 729727 749834 773346 801141 832581 866288 901779 939808 981132
63049I81132M4486M7135M9578N1730N2937N3086N2969N3124N3103N2454N1741
$$ 981132 1025618 1072753 1122331 1174061 1226998 1280084 1333053 1386177 1439280 1491734 1543475
63038A543475N1778N2394N2783N2795N2901N3040N2501N0951M8637M5349M0166
$$ 1543475 1595253 1647647 1700430 1753225 1806126 1859166 1911667 1962618 2011255 2056604 2096770
63027B096770L2688K3677J3947L339q529k1089l3176m4079n3508o0923o5859o8682
$$ 2096770 2129458 2153135 2167082 2170421 2161892 2140803 2107627 2063548 2010040 1949117 1883258 1814576
63015A814576p0102o9950o7399o2527n6684n0968m5195l8820l2076k5497j8912
$$ 1814576 1744474 1674524 1607125 1544598 1487914 1436946 1391751 1352931 1320855 1295358 1276446
63004A276446j1801m308K856R381J5421K0774K4780K7234K8808L0298L1918L3565
$$ 1276446 1264645 1260337 1263193 1272574 1287995 1308769 1333549 1360783 1389591 1419889 1451807 1485372
62992A485372L5197L6666L7540L7532L6913L6165L5406L4359L2630K9710K5089
$$ 1485372 1520569 1557235 1594775 1632307 1669220 1705385 1740791 1775150 1807780 1837490 1862579
62981A862579J8741J1390L803m055j2796k2558l2630m2042n0126n6450o0786o3321
$$ 1862579 1881320 1892710 1896513 1892458 1879662 1857104 1824474 1782432 1732306 1675856 1615070 1551749
62969A551749o4594o4882o3947o1567n8078n4104m9995m5809m1654l7787l4461
$$ 1551749 1487155 1422273 1358326 1296759 1238681 1184577 1134582 1088773 1047119 1009332 974871
62958I74871l1805k9785k8079k6244k4181k2281k0917j9972j9141j8462j8115
$$ 974871 943066 913281 885202 858958 834777 812496 791579 771607 752466 734004 715889
62947G15889j7886j7327j6440j5747j5463j5109j4148j2757j1551j0768j0037
$$ 715889 698003 680676 664236 648489 633026 617917 603769 591012 579461 568693 558656
62936E58656r025p947p277p070o805n989m725l534k721k183j826j812k151k389
$$ 558656 549631 541684 534407 527337 520532 514543 509818 506284 503563 501380 499554 497742 495591 493202
62922D93202k069j420j153j579k213k378j927j302j027j258j715k021k124k362
$$ 493202 491133 489713 488560 486981 484768 482390 480463 479161 478134 476876 475161 473140 471016 468654
62908D68654k943l492l376k467j404r77j411k162k300j268M90J755J733R45N40
$$ 468654 465711 462219 458843 456376 454972 453995 452584 450422 448122 446854 447344 449099 450832 451777 452317
62893D52317Q30J086P61K43J21L38M74M08K12j89o93p57q0O87O21j94p92p34n47
$$ 452317 453147 454233 454994 455237 455358 455696 456170 456578 456790 456601 455908 455151 455071 455758 456379 456185 455393 454659 454112
62874D54112o01m16L90J147R21j31j033j375j607j915j830j290j209k181l256
$$ 454112 453511 453095 453485 454632 455553 455422 454389 453014 451407 449492 447662 446372 445163 442982 439726
62859D39726k968j402j17K6r6N15J345J226K22m33j37L79K85k54o19o87p47q23
$$ 439726 436758 435356 435239 435265 435169 435684 437029 438255 438477 438044 437907 438286 438571 438317 437698 437011 436264 435441
62841D35441o55j92K93N61N81L67j09p26j146j010l60K67K87k55o70m10L16R72
$$ 435441 434786 434594 434887 435448 436029 436396 436287 435561 434415 433405 433045 433312 433599 433344 432674 432264 432580 433552
62823D33552J419J879K376K701K844K938K836K343J825J949K721L441L763M077
$$ 433552 434971 436850 439226 441927 444771 447709 450545 452888 454713 456662 459383 462824 466587 470664
62809D70664M576M775M421M180M764N860O640O893P020P252P514P889Q501R131
$$ 470664 475240 480015 484436 488616 493380 499240 505880 512773 519793 527045 534559 542448 550949 560080
62795E60080R512R902J0825J2311J3912J5427J7076J9091K1556K4568K8087L1733
$$ 560080 569592 579494 590319 602630 616542 631969 649045 668136 689692 714260 742347 774080
62783G74080L5261L9051M3654M9016N4624O0291O6157P2032P7381Q1925Q5577
$$ 774080 809341 848392 892046 941062 995686 1055977 1122134 1194166 1271547 1353472 1439049
62772A439049Q7910Q8303Q6653Q3253P7933P0105N9706M7335L3430J8120K110
$$ 1439049 1526959 1615262 1701915 1785168 1863101 1933206 1992912 2040247 2073677 2091797 2093907
62761B093907j3274k7356m0540n2968o3507p0879p5214p7796p9591q0665q0641
$$ 2093907 2080633 2053277 2012737 1959769 1896262 1825383 1750169 1672373 1592782 1512117 1431476
62750A431476p9120p5917p1434o6661o2296n8109n3557m8754m4348m0661l7489
$$ 1431476 1352356 1276439 1205005 1138344 1076048 1017939 964382 915628 871280 830619 793130
62739G93130l4446l1117k7183k2979j9621j7864j6967j5415j2722r830p769o652
$$ 793130 758684 727567 700384 677405 657784 639920 622953 607538 594816 584986 577217 570565
62727E70565o062n650n061l922k378j169p09m19N71K248L713M324M498N249P049
$$ 570565 564503 558853 553792 549870 547492 546323 545614 545195 545766 548014 551727 556051 560549 565798 572847
62712E72847R322J1071J2027J2962J4790J7556K0570K3345K6020K8964L2363L6275
$$ 572847 582169 593240 605267 618229 633019 650575 671145 694490 720510 749474 781837 818112
62700H18112M0610M4974M8979N2865N7410O2899O8509P3036P5923P7318P7433
$$ 818112 858722 903696 952675 1005540 1062950 1125849 1194358 1267394 1343317 1420635 1498068
62689A498068P6255P3633O9181O2255N2570M0758K7868J4341j6j5010k9611m2748
$$ 1498068 1574323 1647956 1717137 1779392 1831962 1872720 1900588 1914929 1914913 1899903 1870292 1827544
62677A827544n3989o3148o9762p3580p5241p5808p5650p4288p1420o7477o3100
$$ 1827544 1773555 1710407 1640645 1567065 1491824 1416016 1340366 1266078 1194658 1127181 1064081
62666A064081n8538n3874m9403m5354m1543l7693l3966l0766k8100k5576k2953
$$ 1064081 1005543 951669 902266 856912 815369 777676 743710 712944 684844 659268 636315
62655F36315k0344j7827j5365j3184j1775j1229j0918j0221r315q854q912q792
$$ 636315 615971 598144 582779 569595 557820 546591 535673 525452 516137 507283 498371 489579
62643D89579p904o504n335m774m607m421l951l137k069j008k12K97O07N39k04
$$ 489579 481675 475171 469836 465062 460455 456034 452083 448946 446877 445869 445657 445954 446561 447100 446896
62628D46896j391k130j833j081r59j628k154j871j228r37r18o23J3O28J173J908
$$ 446896 445505 443375 441542 440461 439502 437874 435720 433849 432621 431684 430766 430143 430156 430784 431957 433865
62612D33865K725L181L229L392M059N104O204P068P377P158P289Q890J1891J4906
$$ 433865 436590 439771 443000 446392 450451 455555 461759 468827 476204 483362 490651 499541 511432 526338
62598E26338J6934J8535K0804K3778K6617K8976L1428L4605L8426M2113M4546
$$ 526338 543272 561807 582611 606389 633006 661982 693410 728015 766441 808554 853100
62587H53100M4857M3148M0444L7436L3557K7861K0473J2445M376l837j1956j9110
$$ 853100 897957 941105 981549 1018985 1052542 1080403 1100876 1113321 1117697 1113860 1101904 1082794
62575A082794k4849k9579l3593l6443l7863l8482l8916l8736l7146l4434l1763
$$ 1082794 1057945 1028366 994773 958330 920467 881985 843069 804333 767187 732753 700990
62564G00990k9703k7670k5004k1927j9190j7244j5909j4682j3162j1393r788q575
$$ 700990 671287 643617 618613 596686 577496 560252 544343 529661 516499 505106 495318 486743
62552D86743p443o063m744m076l978l691k901k204k083k061j419l96P6k35n05
$$ 486743 479300 473237 468493 464417 460439 456748 453847 451643 449560 447499 446080 445684 445760 445525 445020
62537D45020oR41J538J520J231R58P46P28J175K060L031L890M846O060P291Q353
$$ 445020 445014 445955 447493 449013 450244 451202 451948 452676 453851 455911 458942 462832 467678 473738 481029 489382
62521D89382R650J1757J4474J6834J8302J9596K1895K5496K9646L3593L7173M0342
$$ 489382 499032 510789 525263 542097 560399 579995 601890 627386 657032 690625 727798 768140
62509G68140M2702M3966M4428M4500M3961M2213L9129L5066L0013K3447J5385
$$ 768140 810842 854808 899236 943736 987697 1029910 1069039 1104105 1134118 1157565 1172950
62498A172950O931p13p408j3647j9273k3420k5679k6499k6231k4502k1074j6724
$$ 1172950 1179881 1179168 1171760 1158113 1138840 1115420 1089741 1063242 1037011 1012509 991435 974711
62486I74711j2586q838m694L02N560J0181J3980J7458K1020K4439K6994K7896
$$ 974711 962125 953287 948593 948895 954455 964636 978616 996074 1017094 1041533 1068527 1096423
62474A096423K6671K3337J8336J2316N918l25o215j2059j8409k5374l2183l7691
$$ 1096423 1123094 1146431 1164767 1177083 1183001 1182676 1176461 1164402 1145993 1120619 1088436 1050745
62462A050745m1335m3425m4493m4623m3637m1738l9497l7199l4578l1379k7869
$$ 1050745 1009410 965985 921492 876869 833232 791494 751997 714798 680220 648841 620972
62451F20972k4481k1226j7911j4808j2549j1227j0076q255n728l120j023L61J119
$$ 620972 596491 575265 557354 542546 529997 518770 508694 500439 494711 491591 490568 490929 492048
62438D92048J577K153K943L543L570L238L044K942K289O96j452l475n083o334
$$ 492048 493625 495778 498721 502264 505834 509072 512116 515058 517347 518043 516591 513116 508033 501699
62424E01699p197p586p698p920q231q020o827n112l990l974m321l908k692j806
$$ 501699 494502 486916 479218 471298 463067 455047 448220 443108 439118 435144 430823 426915 424223 422417
62410D22417k068k884l023k209j390j409k041k503k514k407k405k226j507l12
$$ 422417 420349 417465 414442 412233 410843 409434 407393 404890 402376 399969 397564 395338 393831 393519
62396C93519Q80J661K038K304K675L018L073K789K370K002J693J449J446J895
$$ 393519 394399 396060 398098 400402 403077 406095 409168 411957 414327 416329 418022 419471 420917 422812
62382D22812K775L833M769N377N622N750O239P469R257J0919J1797J1773J1211
$$ 422812 425587 429420 434189 439566 445188 450938 457177 464646 473903 484822 496619 508392 519603
62369E19603J0620J0465J1160J2816J4993J6985J8658K0744K3995K8216L2521
$$ 519603 530223 540688 551848 564664 579657 596642 615300 636044 660039 688255 720776
62358G20776L6529M0751M5697N1074N6268O1084O5485O8811O9869O7885O2961
$$ 720776 757305 798056 843753 894827 951095 1012179 1077664 1146475 1216344 1284229 1347190
62347A347190N5673M6643L6559K6111J5701N543l933j2205j9335k6066l2915l9553
$$ 1347190 1402863 1449506 1486065 1512176 1527877 1533420 1529487 1517282 1497947 1471881 1438966 1399413
62335A399413m5252m9548n2127n2634n1135m8459m5454m2081l7920l3421k9859
$$ 1399413 1354161 1304613 1252486 1199852 1148717 1100258 1054804 1012723 974803 941382 911523
62324I11523k7842k6562k4858k2587k0529j9336j8992j9101j9262j9213j8922
$$ 911523 883681 857119 832261 809674 789145 769809 750817 731716 712454 693241 674319
62313F74319j8538j8122j7530j6673j5702j4702j3471j1833j0078q736p926p277
$$ 674319 655781 637659 620129 603456 587754 573052 559581 547748 537670 528934 521008 513731
62301E13731o423n333m099k732j323j98K86J04l48m74J36J382K661L347L285K773
$$ 513731 507308 501975 497876 495144 493821 493623 493909 494013 493665 493191 493327 494709 497370 500717 504002 506775
62285E06775K186J804J892K567L524M200M376M375M515M607M260L473K725K528
$$ 506775 508961 510765 512657 515224 518748 522948 527324 531699 536214 540821 545081 548554 551279 553807
62271E53807L106M346N869P241Q370R649J1508J3916J6500J9065K1742K4763K8322
$$ 553807 556913 561259 567128 574369 582739 592388 603896 617812 634312 653377 675119 699882 728204
62258G28204L2646L7841M3698M9795N5814O1480O6290O9637P1212P0944O8482
$$ 728204 760850 798691 842389 892184 947998 1009478 1075768 1145405 1216617 1287561 1356043
62247A356043O3232N5123M4998L3981K2766J1736J372p958j6483k4902l3639m2376
$$ 1356043 1419275 1474398 1519396 1553377 1576143 1587879 1589251 1581293 1564810 1539908 1506269 1463893
62235A463893n0214n6193n9820o1362o1483o0447n7912n3748m8660m3530l8393
$$ 1463893 1413679 1357486 1297666 1236304 1174821 1114374 1056462 1002714 954054 910524 872131
62224H72131l2751k6822k1759j8309j5912j3472j0614p792n474l811k837k627
$$ 872131 839380 812558 790799 772490 756578 743106 732492 724700 719226 715415 712578 709951
62212G09951l167m301n693o674o561n505m710n239o667p598p491p216p577q037
$$ 709951 706784 702483 696790 690116 683555 678050 673340 668101 661434 653836 646345 639129 631552 623515
62198F23515p511n911m199l062k244j260j49P65J514K499L963N612O843P311P347
$$ 623515 616004 610093 605894 602832 600588 599328 599179 599944 601458 603957 607920 613532 620375 627686 635033
62183F35033P659Q563R561R966R721R280Q805P993O786N725N346N657O478P969
$$ 635033 642692 651255 660816 670782 680503 689783 698588 706581 713367 719092 724438 730095 736573 744542
62169G44542J0395J3748J7924K3024K8909L4749L9639M3614M7432N1223N3888
$$ 744542 754937 768685 786609 809633 838542 873291 912930 956544 1003976 1055199 1109087
62158A109087N4015N0994M5117L7138K8067J8971J0557K987l759r649j4860j9918
$$ 1109087 1163102 1214096 1259213 1296351 1324418 1343389 1353946 1356933 1353174 1343525 1328665 1308747
62146A308747k5197l0461l5178l9058m1924m3359m2966m1040l8539l6169l3731
$$ 1308747 1283550 1253089 1217911 1178853 1136929 1093570 1050604 1009564 971025 934856 901125
62135I01125l0467k5995k0858j6145j2591j0077q052o392n451n262n084m097k293
$$ 901125 870658 844663 823805 807660 795069 784992 776940 770548 765097 759835 754751 750654 748361
62122G48361k92J551L376N258O937Q278R593J1196J2757J3365J2215R284N365
$$ 748361 748069 749620 752996 758254 765191 773469 783062 794258 807015 820380 832595 841879 847244
62109H47244J547j413l299m186m198l654l176l376m396n846p194q059q203p440
$$ 847244 848791 847378 844079 839893 835695 832041 828865 825489 821093 815247 808053 799994 791791 784351
62095G84351n691l170m81J551K576L159M252O000P514Q084Q127Q460R065R351
$$ 784351 778660 775490 775009 776560 779136 782295 786547 792547 800061 808145 816272 824732 833797 843148
62081H43148R424J0171J1943J3970J5418J6448J7702J9234K0516K1279K1829K2566
$$ 843148 852572 862743 874686 888656 904074 920522 938224 957458 977974 999253 1021082 1043648
62069A043648K3506K4329K4754K4904K5299K6380K7997K9655L1171L2695L3989
$$ 1043648 1067154 1091483 1116237 1141141 1166440 1192820 1220817 1250472 1281643 1314338 1348327
62058A348327L4240L2835K9827K5433J9591J2592N556l98n273r898j4812k0070
$$ 1348327 1382567 1415402 1445229 1470662 1490253 1502845 1508401 1508003 1502730 1492832 1478020 1457950
62046A457950k5771l1873l7510m1575m4128m6339m8724n0384n0471m9471m8243
$$ 1457950 1432179 1400306 1362796 1321221 1277093 1230754 1182030 1131646 1081175 1031704 983461
62035I83461m6586m3824m0337l7242l4691l1670k7690k3669k0703j8767j7173
$$ 983461 936875 893051 852714 815472 780781 749111 721421 697752 677049 658282 641109
62024F41109j5604j4107j2615j1149j0132r791r529q631p421o978p666q630q884
$$ 641109 625505 611398 598783 587634 577502 567711 558182 549551 542130 535152 527486 518856 509972
62011E09972q290p201n810m230k842k008j586j027R3J835L983O138P793Q588Q527
$$ 509972 501682 494481 488671 484441 481599 479591 478005 476978 477071 478906 482889 489027 496820 505408 513935
61996E13935Q019P674P896Q346P913N781K617R3r83j480k493l791m420m400m781
$$ 513935 521954 529628 537524 545870 553783 559564 562181 562274 561291 559811 557318 553527 549107 544707 539926
61981E39926o057p456q077p950p574p028o119n038m281m021m005m060m268m582
$$ 539926 533869 526413 518336 510386 502812 495784 489665 484627 480346 476325 472320 468260 463992 459410
61967D59410m620m110l309k757k583k358j766j105q45p78k09R08J642J294N27
$$ 459410 454790 450680 447371 444614 442031 439673 437907 436802 435957 435179 434970 435878 437520 438814 439341
61952D39341O06J736K913L408L685M554O072P700R128J0416J1574J2520J3392
$$ 439341 439947 441683 444596 448004 451689 456243 462315 470015 479143 489559 501133 513653 527045
61939E27045J4491J5893J7392J8837K0255K1530K2243K1966K0749J9117J7562
$$ 527045 541536 557429 574821 593658 613913 635443 657686 679652 700401 719518 737080
61928G37080J6072J4295J2103R812P756N824L581P85k448n756q640j0564j1376
$$ 737080 753152 767447 779550 789362 797118 802942 806523 807308 804860 799104 790464 779900 768524
61915G68524j1472j1178j0135p764m313p85K290N343Q735J1877J3972J5142J6066
$$ 768524 757052 745874 735739 727975 723662 722877 725167 730510 739245 751122 765094 780236 796302
61902G96302J6745J6365J4423J1326P698L697o37m801q143j0640j2891j5237j7207
$$ 796302 813047 829412 843835 855161 862859 866556 865919 861118 852975 842335 829444 814207 797000
61889G97000j8065j7729j6845j6035j5374j4679j3894j3048j2080j1120j0626
$$ 797000 778935 761206 744361 728326 712952 698273 684379 671331 659251 648131 637505
61878F37505j0842j1216j0959j0129r551r588r579q756p152n242l269j393o8M53
$$ 637505 626663 615447 604488 594359 584808 575220 565641 556885 549733 544491 541222 539829 539761 540214
61864E40214P88J942M187O802Q891J0089J0633J1257J2834J5584J8569K0603K1725
$$ 540214 541002 542944 547131 553933 562824 572913 583546 594803 607637 623221 641790 662393 684118
61851F84118K3204K5901K9224L1986L3763L4857L5357L4900L3372L1194K8732
$$ 684118 707322 733223 762447 794433 828196 863053 898410 933310 966682 997876 1026608
61840A026608K5788K1876J6835J0973M763j425p288j2357j5942j7438j6864j5004
$$ 1026608 1052396 1074272 1091107 1102080 1106843 1105418 1098130 1085773 1069831 1052393 1035529 1020525
61828A020525j2747j0225o829k159L249Q364J2475J5269J6323J5218J2245Q328
$$ 1020525 1007778 997553 990724 988565 991814 1000178 1012653 1027922 1044245 1059463 1071708 1080036
61816A080036M006j053p122j3535j9294k4169k8488l2045l4125l4596l4191l3410
$$ 1080036 1084042 1082989 1075867 1062332 1043038 1018869 990381 958336 924211 889615 855424 822014
61804H22014l1924k9447k6561k4087k2104k0128j7969j5806j3704j1612r796q673
$$ 822014 790090 760643 734082 709995 687891 667763 649794 633988 620284 608672 598876 590203
61792E90203q192p801p151o397n745n029m021k914k232k275k797l313l604l756
$$ 590203 582011 574210 567059 560662 554917 549888 545867 542953 540721 538446 535649 532336 528732 524976
61778E24976l726l160j933o34r7m52j056j359j395j319j017m58L4K49M48Q79J262
$$ 524976 521250 518090 516157 515523 515426 514974 513918 512559 511164 509845 508828 508370 508404 508653 509101 509980 511242
61761E11242J192P91N69P96J370K005K297J927J191Q84J198J235J87j413k382
$$ 511242 512434 513225 513794 514590 515960 517965 520262 522189 523380 524264 525462 526697 526884 525471 523089
61746E23089k461k312k233j908j456j548k194k400j537k80L50K47k9j98l45m06
$$ 523089 520628 518316 516083 514175 512719 511171 508977 506577 505040 504760 505110 505357 505328 505130 504785 504379
61730E04379k18J29M82R80J779K552K752K332J846J782K065K231J943J327R09
$$ 504379 504161 504290 504772 505752 507531 510083 512835 515167 517013 518795 520860 523091 525034 526361 527270
61715E27270J120J837K521K778K608K036R01p66k454l558l941l913l807l770l774
$$ 527270 528390 530227 532748 535526 538134 540170 541071 540305 537851 534293 530352 526439 522632 518862 515088
61700E15088l588k903j715n37ql24j191k198l055l526l442k772j710o96l50j073
$$ 515088 511500 508597 506882 506345 506337 506013 504822 502624 499569 496043 492601 489829 488119 487423 487073 486000
61684D86000k491l554l497k680k215k687l503l619k792j847j698k261k654k405
$$ 486000 483509 479955 476458 473778 471563 468876 465373 461754 458962 457115 455417 453156 450502 448097
61670D48097k040k211k657k590j884j221j009q89n82n10j047j715j720j050l48
$$ 448097 446057 443846 441189 438599 436715 435494 434485 433596 433014 432504 431457 429742 428022 426972 426624
61655D26624M2K85M13K46kK94J270K207K413K081J930K275K846L352L782M168
$$ 426624 426666 426951 427364 427610 427608 427902 429172 431379 433792 435873 437803 440078 442924 446276 450058 454226
61639D54226M372M176L479K366J132J12o22j339k249l134l557l433l132l017l112
$$ 454226 458598 462774 466253 468619 469751 469863 469241 467902 465653 462519 458962 455529 452397 449380 446268
61624D46268l252l332l245k879k285j728j351j060q69j080j757k248j855r42p99
$$ 446268 443016 439684 436439 433560 431275 429547 428196 427136 426267 425187 423430 421182 419327 418385 417586
61609D17586k164m329n990o613o583o324n815m997m138l623l521l588l574l485
$$ 417586 415422 411093 405103 398490 391907 385583 379768 374771 370633 367010 363489 359901 356327 352842
61595C52842l512l704l814l533k860k095j477j026p54p07q29r95j251j657j873
$$ 352842 349330 345626 341812 338279 335419 333324 331847 330821 330067 329360 328531 327536 326285 324628 322755
61580C22755j437o24m65j446k661k791j630j63N80K62q31j965k235j345q2M97
$$ 322755 321318 320694 320229 318783 316122 313331 311701 311538 312118 312380 311549 309584 307349 306004 305922 306419
61564C06419K14l25o99q77p03k1O99P31J94K4O69J537J916J739J249O62L65O81
$$ 306419 306633 306308 305609 304732 304029 304008 304707 305438 305632 305656 306325 307862 309778 311517 312766 313428 313793 314474
61546C14474J171J001L30M01J674K866K611J311M49N77J045J320J546J848J984
$$ 314474 315645 316646 316976 317377 319051 321917 324528 325839 326288 326865 327910 329230 330776 332624 334608
61531C34608J825J548J367J358J514J557J050O0o58o63n69j106j887k048j714
$$ 334608 336433 337981 339348 340706 342220 343777 344827 344887 344229 343566 342997 341891 340004 337956 336242
61516C36242j745k153j973q99J46M44M39P07R12N47n7k85l29p79j462j556q74
$$ 336242 334497 332344 330371 329472 329618 330062 330501 331208 332120 332667 332610 332325 331996 331217 329755 328199 327325
61499C27325k26l74j174j908k052j531o44O9J94r6j52L62J060J429J564J913K398
$$ 327325 327099 326725 325551 323643 321591 320060 319416 319485 319679 319583 319431 319793 320853 322282 323846 325759 328157
61482C28157K312J285n9p21m20L48J059J566J790J638J351J455J956K064J135
$$ 328157 330469 331754 331695 330974 330554 330902 331961 333527 335317 336955 338306 339761 341717 343781 344916
61467C44916l09j079p48j8L24K76K42K49Lm46n86j13N85Q26N21K62N17R73J007
$$ 344916 344607 343528 342780 342762 343086 343362 343604 343853 343856 343410 342824 342711 343296 344122 344643 344905 345422 346395 347402
61448C47402O07L72O31J047J223J208J119Q27L95M23J311K477K978K778K757L394
$$ 347402 348009 348381 349012 350059 351282 352490 353609 354436 354831 355254 356565 359042 362020 364798 367555 370949
61432C70949M127M207L613K840K235J861J713J688J564J296J223J667K431K980
$$ 370949 375076 379283 382896 385736 387971 389832 391545 393233 394797 396093 397316 398983 401414 404394
61418D04394L109L148L467L897L879L134K104J559J710J925J407N9j472k498k858
$$ 404394 407503 410651 414118 418015 421894 425028 427132 428691 430401 432326 433733 433792 432320 429822 426964
61403D26964k859k879l037l161l052k803k701k763k624k076j395r08n00lK37j98
$$ 426964 424105 421226 418189 415028 411976 409173 406472 403709 401085 399009 397614 396706 396206 396203 396440 396242
61387C96242r56j206p92m36o12q99q30o38o81o42J0J070J788J873J684J481J189
$$ 396242 395286 394080 393288 392852 392240 391341 390511 389873 389192 388550 388560 389630 391418 393291 394975 396456 397645
61370C97645R12J067J702K233K185J775J401R47J42o44o32L33J549K418L097L918
$$ 397645 398557 399624 401326 403559 405744 407519 408920 409867 410009 409365 408733 409066 410615 413033 416130 420048
61354D20048M665M936M950N351O281P202P683P887Q086Q201Q071P817P620P395
$$ 420048 424713 429649 434599 439950 446231 453433 461116 469003 477089 485290 493361 501178 508798 516193
61340E16193O990O477N984N435M772M182L782L280K333J141K78n9k39p24j600
$$ 516193 523183 529660 535644 541079 545851 550033 553815 557095 559428 560569 560847 560788 560549 559825 558225
61325E58225k624l419l684l448l084k826k478j796r44k12M43J069J303R31P15
$$ 558225 555601 552182 548498 545050 541966 539140 536662 534866 533922 533710 534153 535222 536525 537456 538171
61310E38171J745L885N754O548P026Q222R975J1434J2336J2951J3064J2007R672
$$ 538171 539916 543801 549555 556103 563129 571351 581326 592760 605096 618047 631111 643118 652790
61297F52790O750L912J332r00k619m036n702p649r045r187q618q595r486j0265
$$ 652790 659540 663452 664784 663884 661265 657229 651527 643878 634833 625646 617028 608433 598947 588682
61283E88682r781q241o914o542o481n687m111k675j925j317k3J980L987N397O049
$$ 588682 578901 570660 563746 557204 550723 545036 540925 538250 536325 535008 534985 536965 540952 546349 552398
61268E52398N917N121M187L811M110M517M658M897N725P024Q363R693J1156J2338
$$ 552398 558315 563436 567623 571434 575544 580061 584719 589616 595341 602365 610728 620421 631577 643915
61254F43915J2477J1536J0354R439Q261O225L846K227J645J372P34l97k037m157
$$ 643915 656392 667928 678282 687721 695982 702207 706053 708280 709925 711297 712031 711634 709597 705440
61240G05440o132o975o579n898n578n108m002l011l165m128m607m187l606l216
$$ 705440 699308 692333 685754 679856 674278 669170 665168 662157 658992 654864 650257 646070 642464 639248
61226F39248k384p16J135K444L367M281M868M698M178M114M533M725M404M082
$$ 639248 636864 636148 637283 639727 643094 647375 652243 656941 661119 665233 669766 674491 678895 682977
61212F82977M207M552M651M382L857L092K121J201O63N68O43N79L50K94R23K514
$$ 682977 687184 691736 696387 700769 704626 707718 709839 711040 711703 712271 712914 713493 713843 714137 715060 717574
61196G17574M892P544R991J2077J3964J5940J8047J9829K0499J9516J7134J4221
$$ 717574 722466 730010 740001 752078 766042 781982 800029 819858 840357 859873 877007 891228
61184H91228J1605R537P736N875L990K472J655J410J201N27o96k120l318m169
$$ 891228 902833 912370 920106 925981 929971 932443 934098 935508 936709 937236 936540 934420 931102 926933
61170I26933m994o227p837r257j0021j0378j0982j2065j3249j4192j5008j5827
$$ 926933 921939 915712 907875 898618 888597 878219 867237 855172 841923 827731 812723 796896
61158G96896j6348j6186j5417j4428j3369j2104j0596r021p464n847m167k517
$$ 796896 780548 764362 748945 734517 721148 709044 698448 689427 681963 676116 671949 669432
61146F69432q78P97K111K259Q21j576l711m883n430o094p028p576o999n334l442
$$ 669432 668554 669351 671462 673721 674542 672966 669255 664372 658942 652848 645820 638244 631245 625911 622469
61131F22469k114j309l97J006K690M357O042P837R512J0772J1810J3174J5131
$$ 622469 620355 619046 618649 619655 622345 626702 632744 640581 650093 660865 672675 685849 700980
61118G00980J7462J9906K2410K4775K6517K7335K7508K7579K7801K8186K8703
$$ 700980 718442 738348 760758 785533 812050 839385 866893 894472 922273 950459 979162
61107I79162K9082K8652K6974K4586K2564K1206J9642J6967J3337R497N647J270
$$ 979162 1008244 1036896 1063870 1088456 1111020 1132226 1151868 1168835 1182172 1191669 1197316 1198586
61095A198586l886r104j3252j5925j7852k0048k2717k5100k6446k6800k6708k6509
$$ 1198586 1194700 1185596 1172344 1156419 1138567 1118519 1095802 1070702 1044256 1017456 990748 964239
61083I64239k6246k5995k5747k5115k3684k1706j9919j8617j7391j5833j3964
$$ 964239 937993 911998 886251 861136 837452 815746 795827 777210 759819 743986 730022
61072G30022j1910r696p587o073n210m483l532k551j754j012k22N32J397K665
$$ 730022 718112 708416 700829 694756 689546 685063 681531 678980 677226 676214 675992 676524 677921 680586
61058F80586L981M523M340M631O042P706Q739R754J1666J3877J5093J5502J6566
$$ 680586 684567 689090 693430 698061 704103 711809 720548 730302 741968 755845 770938 786440 803006
61045H03006J8757K0936K2261K3305K4851K6679K8207K9543L1176L3106L4848
$$ 803006 821763 842699 864960 888265 913116 939795 968002 997545 1028721 1061827 1096675
61034A096675L6049L6795L7473L8409L9638M1081M2971M5652M8642N0634N0979
$$ 1096675 1132724 1169519 1206992 1245401 1285039 1326120 1369091 1414743 1463385 1514019 1564998
61023A564998N0545N0441N0635N0886N2241N6154O2465O9713P7159Q5044R3138
$$ 1564998 1615543 1665984 1716619 1767505 1819746 1875900 1938365 2008078 2085237 2170281 2263419
61012B263419J00851J08890J19237J33345J51944J76668K10126K54322L11049
$$ 2263419 2364270 2473160 2592397 2725742 2877686 3054354 3264480 3518802 3829851
61003C829851L84011M78483N98962P49921R38572J172051J448838J753376K054551
$$ 3829851 4213862 4692345 5291307 6041228 6979800 8151851 9600689 11354065 13408616
60994A3408616K298131K399061K264390J858391J260454O45285J84314m5238o6094
$$ 13408616 15706747 18105808 20370198 22228589 23489043 24134328 24318642 24273404 24207310
60985B4207310N6291K49315M17073M32331J92867k96082r06070j465447j861081
$$ 24207310 24263601 24512916 24929989 25362320 25555187 25259105 24353035 22887588 21026507
60976B1026507k073007k134890k083766j946219j749374j524575j298487j087458
$$ 21026507 18953500 16818610 14734844 12788625 11039251 9514676 8216189 7128731
60968G128731r00626p42788o13314n07119m19668l49495k95251k53040k18397
$$ 7128731 6228105 5485317 4872003 4364884 3945216 3595721 3300470 3047430 2829033
60959B829033j89254j65297j45637j28580j13078r9061q6570p5320o4864n4752
$$ 2829033 2639779 2474482 2328845 2200265 2087187 1988126 1901556 1826236 1761372 1706620
60949A706620m4922l6264l0218k7281k6289k5596k4474k3090k1629k0029j8270
$$ 1706620 1661698 1625434 1595216 1567935 1541646 1516050 1491576 1468486 1446857 1426828 1408558
60938A408558j6479j4778j3265j1893j0413q725p256o537o356n899m837l751l229
$$ 1408558 1392079 1377301 1364036 1352143 1341730 1333005 1325749 1319212 1312856 1306957 1302120 1298369 1295140
60925A295140l220l442l889m561n213n833o895q677j0621j1866j2298j2661j3666
$$ 1295140 1291920 1288478 1284589 1280028 1274815 1268982 1262087 1253410 1242789 1230923 1218625 1205964 1192298
60912A192298j5284j6932j8132j8953j9757k0554k0826k0078j8477j6657j5135
$$ 1192298 1177014 1160082 1141950 1122997 1103240 1082686 1061860 1041782 1023305 1006648 991513
60901I91513j4184j3997j4419j4698j4115j2902j1942j1543j1143j0428r970j0338
$$ 991513 977329 963332 948913 934215 920100 907198 895256 883713 872570 862142 852172 841834
60889H41834j1105j1289j0550r482q928r274j0333j1551j2331j2366j1743j0792
$$ 841834 830729 819440 808890 799408 790480 781206 770873 759322 746991 734625 722882 712090
60877G12090r877r263q988q849q614q182p507o631n866n655n947o063n566m938
$$ 712090 702213 692950 683962 675113 666499 658317 650810 644179 638313 632658 626711 620648 615082 610144
60863F10144m842n064m799l862k915k517k594k882l272l614l791m025m582n147
$$ 610144 605302 600238 595439 591577 588662 586145 583551 580669 577397 573783 569992 565967 561385 556238
60849E56238n045m198l302k963l108l351l316k678j556r49j929m162o005o401
$$ 556238 551193 546995 543693 540730 537622 534271 530955 528277 526721 525772 523843 519681 513676 507275
60835E07275n978n807n921n621m726l703k844j990j040j98K63K74O2J03P45J777
$$ 507275 501297 495490 489569 483948 479222 475519 472675 470685 469645 469447 469710 469984 470046 470149 470894 472671
60819D72671K602K999L292L593L383K189M24r44j392j203q97o65l81L4L74L60
$$ 472671 475273 478272 481564 485157 488540 490729 491153 490209 488817 487614 486717 486052 485671 485705 486079 486439
60803D86439Rl58n87q77j283j384q81k41j95p98j502j989k272k231j808j662k629
$$ 486439 486448 486090 485503 484626 483343 481959 481078 480837 480642 479844 478342 476353 474081 471850 470042 468380 465751
60786D65751m415n718n841n395n052m604l753k986k932l378l622l435l088k761
$$ 465751 461336 455618 449777 444382 439330 434726 430973 427987 425055 421677 418055 414620 411532 408771
60772D08771k398j996j584j141p31m87l00J16P14J133J342J716K367K912L139
$$ 408771 406373 404377 402793 401652 400921 400434 400134 400250 400964 402097 403439 405155 407522 410434 413573
60757D13573L233L161K603J786J581K233K875K807K547K876L568L869L662L368
$$ 413573 416806 419967 422570 424356 425937 428170 431045 433852 436399 439275 442843 446712 450374 453742
60743D53742L134K908K869K962K359L24k604n083o456p032p149o791o137n665
$$ 453742 456876 459784 462653 465615 467974 468298 465694 460611 454155 447123 439974 433183 427046 421381
60729D21381n593n743n987o304o417n938m958m040l534l277k944k416j734j019
$$ 421381 415788 410045 404058 397754 391337 385399 380441 376401 372867 369590 366646 364230 362496 361477
60715C61477m29p0J9k75r68j654j745j334j209j715k164j830r63k54J52M88O81
$$ 361477 361048 360978 360997 360722 359754 358100 356355 355021 353812 352097 349933 348103 347140 346886 347038 347526 348207
60698C48207O52Q33J547K163J815P71J59M01Q63J099J501K433L491M074M129L937
$$ 348207 348859 349692 351239 353402 355217 355988 356147 356548 357411 358510 360011 362444 365935 370009 374138 378075
60682C78075L585L097K794L169M326N751O712P001P149P657Q120P682O368N222
$$ 378075 381660 384757 387551 390720 395046 400797 407509 414510 421659 429316 437436 445118 451486 456708
60668D56708M736M006K125l57k193l120l726m088l816l245l299m047m473m019
$$ 456708 461444 465450 467575 467218 465025 461905 458179 454091 450275 447030 443731 439684 435211 431192
60654D31192l309k984k677j774m56N61Q99P31M44M44Q41J064K85j510l262m013
$$ 431192 427883 424899 422222 420448 419992 420553 421452 422183 422627 423071 423912 424976 425261 423751 420489 416476
60638D16476l935l875m189m499m358l787l144k679k233j377j2J274J697J164L42
$$ 416476 412541 408666 404477 399978 395620 391833 388689 386010 383777 382400 382388 383662 385359 386523 386865
60623C86865j59l16l14p1N72J397J850J524N93k74m43R3P37R29O05J4o32j101
$$ 386865 386706 386390 386076 386005 386577 387974 389824 391348 391941 391667 391224 391317 392054 392983 393588 393602 392970 391869
60605C91869j086n63K3L15N01R22J431J628J487J287J109R37J013J548K180K302
$$ 391869 390783 390220 390243 390558 391059 391981 393412 395040 396527 397814 398923 399860 400873 402421 404601 406903
60589D06903J900J444J119P04K33N5J35l9o64j249j245o82M4O39J019J293J696
$$ 406903 408803 410247 411366 412070 412303 412358 412493 412454 411790 410541 409296 408614 408658 409297 410316 411609 413305
60572D13305K373L209M112N323P030Q859J0252J1284J2516J4027J5095J4995J3666
$$ 413305 415678 418887 422999 428322 435352 444211 454463 465747 478263 492290 507385 522380 536046
60559E36046J1527R067O602M087J151k259n367p169p536p185o687n980m898l508
$$ 536046 547573 556640 563242 567329 568480 566221 560854 553685 546149 538964 532277 526297 521399 517891
60545E17891j831J60K155L667M746O050P997J0260J2261J3762J4914J6016J7260
$$ 517891 516060 516220 518375 522042 526788 532838 540835 551095 563356 577118 592032 608048 625308
60532F25308J8289J8167J6200J2738Q731M769J054j994m028n461o881p892p561
$$ 625308 643597 661764 677964 690702 699433 704202 705256 703262 699234 693773 686892 679000 671439
60519F71439o136n126n292n713n342m481l926l558k725j449l62K86Q25J534K421
$$ 671439 665303 660177 654885 649172 643830 639349 635423 631865 629140 627691 627329 627615 628440 629974 632395
60504F32395L508M880O579Q773J1791J5728K0237K4958K9853L4888L9737M4125
$$ 632395 635903 640783 647362 656135 667926 683654 703891 728849 758702 793590 833327 877452
60492H77452M8092N1542N3819N4100N1982M7493M0780L2079K1788J0350j766j3887
$$ 877452 925544 977086 1030905 1085005 1136987 1184480 1225260 1257339 1279127 1289477 1287711 1273824
60480A273824k5229l5208m3433m9378n2564n3206n2223n0452m8129m5158m1462
$$ 1273824 1248595 1213387 1169954 1120576 1068012 1014806 962583 912131 864002 818844 777382
60469G77382l7058l2287k8004k4957k2898k0902j8617j6488j4696j2779j0563
$$ 777382 740324 708037 680033 655076 632178 611276 592659 576171 561475 548696 538133
60458E38133q661p563o887o100n267m723m546m748n382o016n792m531l185k623
$$ 538133 529472 521909 515022 508922 503655 498932 494386 489638 484256 478240 472448 467917 464732 462109
60444D62109k557k247j613j043o18k80k57o99j193j284j086q51m19K77O73K75
$$ 462109 459552 457305 455692 454649 454031 453751 453494 452795 451602 450318 449232 448381 447962 448239 448912 449187
60428D49187n02r41j071j341j634j476r76o74n89l17N9N1j44L71J832L143L059
$$ 449187 448685 447744 446673 445332 443698 442222 441246 440572 439983 439666 439725 439776 439632 440003 441835 444978 448037
60411D48037J608o0r18q42l40J32N36J031J585K014K307K598K730K274J237L51
$$ 448037 449645 449585 448667 447825 447485 447617 448153 449184 450769 452783 455090 457688 460418 462692 463929 464280
60395D64280K90Q77J435J661J720J717J587J455J664K315L026L237K801K192K006
$$ 464280 464570 465447 466882 468543 470263 471980 473567 475022 476686 479001 482027 485264 488065 490257 492263
60380D92263K198K098J458J039J610K736L411L677M455N676N987M749L138K495
$$ 492263 494461 496559 498017 499056 500666 503402 506813 510490 514945 520621 526608 531357 534495 536990
60366E36990K591K486K144K089K114J598P77N88J296K166K555K606K929M089O337
$$ 536990 539581 542067 544211 546300 548414 550012 550789 551377 552673 554839 557394 560000 562929 567018 573355
60351E73355R302J2132J4265J5791J6783J6831J5754J4173J2666J0835P932L921
$$ 573355 582657 594789 609054 624845 641628 658459 674213 688386 701052 711887 719819 723740
60339G23740o62n343r426j1779j1964j1171j0981j1500j1707j1203j0472r652
$$ 723740 723078 717735 708309 696530 684566 673395 662414 650914 639207 628004 617532 607880
60327F07880q322o608n317m817m659m489m455m626m671m357l687k612j172J47
$$ 607880 599558 592950 587633 582816 578157 573668 569213 564587 559916 555559 551872 549260 548088 548235
60313E48235R32J560K725M410O128P876J0018J2489J5124J8468K3080K8125L1861
$$ 548235 549167 550727 553452 557862 563990 571866 581884 594373 609497 627965 651045 679170 711031
60300G11031L3500L3333L1140K6004J8069Q950j57r445j8846k6693l1133l2043
$$ 711031 744531 777864 809004 835008 853077 862027 861870 852425 833579 806886 775753 743710
60288G43710l0697k8188k4952k1299j7518j3783j0452q072o713n798m994m656
$$ 743710 713013 684825 659873 638574 621056 607273 596821 588749 582036 576238 571244 566588
60276E66588m954n290n157m957n233n663n566n016m642m529m106l063j815r14
$$ 566588 561634 556344 551187 546230 540997 535334 529768 524752 520110 515581 511475 508412 506597 505683
60262E05683n21m48n30p83j311j978k333k036j366r28q06n03K31R55J221J173
$$ 505683 505162 504714 504184 503401 502090 500112 497779 495743 494377 493449 492643 492140 492371 493326 494547 495720
60246D95720J227J500J838K114K186J861J138L35j99l71k58j0J86K50K90L49K69
$$ 495720 496947 498447 500285 502399 504585 506446 507584 507919 507720 507349 507091 507081 507267 507517 507807 508156 508425
60229E08425Q9K91J132K027K276K134K325K672K269J077L14Q68K231L393M032
$$ 508425 508514 508805 509937 511964 514240 516374 518699 521371 523640 524717 525031 525899 528130 531523 535555
60214E35555M355M524M715N100N460N372N100N473O564P288O950O233O071O202
$$ 535555 539910 544434 549149 554249 559709 565081 570181 575654 582218 589506 596456 602689 608760 614962
60200F14962N791M888M302M347M560M575M495M402M068L311K293J354O28j82j490
$$ 614962 620753 625641 629943 634290 638850 643425 647920 652322 656390 659701 661994 663348 663976 663794 662304
60185F62304l079l921l329k142j955l075m159m120l500l425m019m517m335l484
$$ 662304 659225 655304 651975 649833 647878 644803 640644 636524 633024 629599 625580 621063 616728 613244
60171F13244k374j669j825k379k332j589j242j935k823k829k124j538j214p89
$$ 613244 610870 609201 607376 604997 602665 601076 599834 597899 595076 592247 590123 588585 587371 586582
60157E86582l53l06n95q61r28o28L45J628K041J075r6q6Q75J612J902K338K838
$$ 586582 586229 585923 585328 584467 583539 582911 583256 584884 586925 588000 587904 587818 588693 590305 592207 594545 597383
60140E97383K748K286K440L448M639N784P273Q772R160Q212P105O678O327N179
$$ 597383 600131 602417 604857 608305 612944 618728 626001 634773 643933 652145 659250 665928 672255 677434
60126F77434L397J619K5j280j719r87K25R27R59Q35Q45J029J650K945M462N231
$$ 677434 680831 682450 682475 681195 679476 678489 678714 679641 680600 681435 682280 683309 684959 687904 692366 697597
60110F97597M732L304J660K69p92j630k287k591k383j891j718k224l112l782l989
$$ 697597 702329 705633 707293 707562 706770 705140 702853 700262 697879 695988 694270 692046 688934 685152 681163
60095F81163l963l922l749l261k601k098j734j093m0Q37R94R39J748L444M664
$$ 681163 677200 673278 669529 666268 663667 661569 659835 658742 658702 659539 660533 661472 663220 666664 671328
60080F71328M364L151K286J943J293l7j544k804l991n332o662p716q326q342p862
$$ 671328 675692 678843 681129 683072 684365 684328 682784 679980 675989 670657 663995 656279 647953 639611 631749
60065F31749p463p633q040p956p397p066p132o885n871m605l846l726l930m127
$$ 631749 624286 616653 608613 600657 593260 586194 579062 572177 566306 561701 557855 554129 550199 546072
60051E46072l895k840j209J16O68R86J693K558K986L065L400M154M913N405N751
$$ 546072 542177 539337 538128 538244 538912 539898 541591 544149 547135 550200 553600 557754 562667 568072 573823
60036E73823O001N941N441M676L766K570J011n13j334j201p43j075k707m968o674
$$ 573823 579824 585765 591206 595882 599648 602218 603229 602716 601382 600181 599438 598363 595656 590688 584014
60021E84014p350p504p753q077q062p487o414n073l881l291l341l567l602l550
$$ 584014 576664 569160 561407 553330 545268 537781 531367 526294 522413 519122 515781 512214 508612 505062
60007E05062l509l104k015p18r0l61r04j141j130j173j270j207r21n19j75r9l78
$$ 505062 501553 498449 496434 495716 495626 495265 494361 493220 492090 490917 489647 488440 487519 487000 486825 486726 486348
59990D86348o43k15J131K695L467L125K222J465J173J362J917K487K492J546j17
$$ 486348 485705 485490 486621 489316 492783 495908 498130 499595 500768 502130 504047 506534 509026 510572 510455
59975E10455j771k702k693k191k017k589l378l446k620j696j256q34K34J575K246
$$ 510455 508684 505982 503289 501098 499081 496492 493114 489668 487048 485352 484096 483262 483496 485071 487317
59960D87317K160K167K618K843K358J776J850K232J893N65r85j906j984j470p24
$$ 487317 489477 491644 494262 497105 499463 501239 503089 505321 507214 507779 506794 504888 502904 501434 500710
59945E00710j04K09L61N70P52O44K42j62l56m34o18j009j477j672j288l68P46
$$ 500710 500606 500815 501176 501746 502498 503142 503384 503222 502866 502432 501814 500805 499328 497656 496368 496000 496746
59928D96746J862K974L873M105L594K892K481K249K042K287L411M979O076O424
$$ 496746 498608 501582 505455 509560 513154 516046 518527 520776 522818 525105 528516 533495 539571 545995
59914E45995O453O420O112N409M460L265J776M30j72j96n13j391k074j950j471
$$ 545995 552448 558868 564980 570389 574849 578114 579890 580320 580148 579952 579439 578048 575974 574024 572553
59899E72553j310j303r40m20m49j132j792j798r96N12K415L979M526M346M531
$$ 572553 571243 569940 569000 568580 568131 566999 565207 563409 562413 562925 565340 569319 573845 578191 582722
59884E82722N598O759O960O180N312N049N450O344P477Q247P946O530M760L302
$$ 582722 588320 595079 602039 608219 613531 618580 624030 630374 637851 646098 654044 660574 665334 668636
59870F68636K022M19j556l433m749n340n386n378n833o710p293p005o060n017
$$ 668636 670658 671077 669521 666088 661339 655999 650613 645235 639402 632692 625399 618394 612334 607317
59856F07317m076l230k686k446j826k16J877L483M663O358Q741J0852J1987J2238
$$ 607317 603241 600011 597325 594879 593053 592837 594714 598197 602860 609218 617959 628811 640798 653036
59842F53036J1303Q302L620l51j624r20l42n09l59N80J380J205K90q62k180l562
$$ 653036 664339 672641 676261 675910 674286 673366 673024 672515 672156 672736 674116 675321 675611 674749 672569 669007
59826F69007m576n103n568o192o569o353n870n651n680n471m717l687l065l295
$$ 669007 664431 659328 653760 647568 640999 634646 628776 623125 617445 611974 607257 603570 600505 597210
59812E97210l954m000k948j602j155j830k874l671m187m419m169l472k714k233
$$ 597210 593256 589256 586308 584706 583551 581721 578847 575176 570989 566570 562401 558929 556215 553982
59798E53982k149k517l145l408k894k123j967k395k525j982j346j087q47k11N23
$$ 553982 551833 549316 546171 542763 539869 537746 535779 533384 530859 528877 527531 526444 525597 525386 525909
59783E25909Q02N94K71M0j37k80l19j13L94R17Q39l2q95p41L17J199J294R93P12
$$ 525909 526711 527305 527576 527616 527479 527199 526880 526767 527161 528078 528917 528885 527990 527249 527566 528765 530059 531052 531764
59764E31764K97j64Q8J441K948L235K144Q76N85J321K278K774K806K808L015L269
$$ 531764 532061 531897 531985 533426 536374 539609 541753 542629 543214 544535 546813 549587 552393 555201 558216 561485
59748E61485L466L814M372M719M578M390M597M681L847K516J984K502K792J905
$$ 561485 564951 568765 573137 577856 582434 586824 591421 596102 599949 602465 604449 606951 609743 611648
59734F11648N42p8J80N90O90M75k5o13p49j65O20Q55M09l38j055j500j431r31
$$ 611648 612190 612112 612292 612882 613572 614047 614022 613409 612660 612495 613115 613970 614379 614041 612986 611486 610055 609124
59716F09124n04l93k01L52P54L92m68j029j022p99o27m61k90q8M43J450K347K290
$$ 609124 608620 608227 608026 608378 609132 609524 609056 608027 607005 606206 605579 605118 604828 604740 605183 606633 608980 611270
59698F11270J313M06L09O97P87M13J22L46P49O60K4l69Q0P98O62m71j473j416
$$ 611270 612583 612989 613298 613995 614782 615195 615317 615663 616412 617072 617096 616727 616807 617605 618267 617796 616323 614907
59680F14907o59r2Oj46o58j848l452m683n101m945m664m477m401m355m146l689
$$ 614907 614248 614156 614162 614016 613358 611510 608058 603375 598274 593329 588665 584188 579787 575432 571286 567597
59664E67597l176k818k505k054j645j608j789j540m90R58K031K352K195K125K406
$$ 567597 564421 561603 559098 557044 555399 553791 552002 550462 549972 550930 552961 555313 557508 559633 562039
59649E62039K760K694K100J489J441J848J907R70o69k041k624k916l624m486m452
$$ 562039 564799 567493 569593 571082 572523 574371 576278 577248 576579 574538 571914 568998 565374 560888 556436
59634E56436l081j221k2K02j81p91j258j147n60l66j063j867j825j391j758k878
$$ 556436 553355 552134 552112 552314 552133 551342 550084 548937 548377 548011 546948 545081 543256 541865 540107 537229
59618E37229l442k864j987j597j525j529j833k230j845m72Q82J468J815K504L010
$$ 537229 533787 530923 528936 527339 525814 524285 522452 520222 518377 517905 518787 520255 522070 524574 527584
59603E27584K702K100J972J950J182j11r10r01o39m39j14L07N15N16N37M39l9
$$ 527584 530286 532386 534358 536308 537490 537379 536469 535568 534929 534490 534376 534683 535198 535714 536251 536690 536651
59586E36651n33l62L83P95K91p29j505j779j933k450l292l764l256k103j307j262
$$ 536651 536118 535756 536139 536934 537225 536496 534991 533212 531279 528829 525537 521773 518517 516414 515107 513845
59570E13845j453j505j759k322k443j608n21j60m21n29k50J61P29J475J826J274
$$ 513845 512392 510887 509128 506806 504363 502755 502234 502074 501653 501124 500874 501035 501764 503239 505065 506339
59554E06339M01K25P65J188J211J360J883K374K522K516K582K833L508M786O475
$$ 506339 506740 506965 507730 508918 510129 511489 513372 515746 518268 520784 523366 526199 529707 534493 540968
59539E40968Q393J0861J4110J7546K0253K1762K1569J8482J1884L514l400p029
$$ 540968 549361 560222 574332 591878 612131 633893 655462 673944 685828 689342 685942 678913
59527F78913q043p816o766m776k118O54L091M719N139M506L393K033K72j664l213
$$ 678913 670870 663054 656288 651512 649394 650048 653139 657858 662997 667503 670896 672929 673201 671537 668324
59512F68324m358n737p553r116r838r984j0089j0154r870r237q543q018p635p098
$$ 668324 663966 658229 650676 641560 631722 621738 611649 601495 591625 582388 573845 565827 558192 551094
59498E51094o032m478l116k553k516k230j475p15k69O6M75Q22Q65N20p0l53L38
$$ 551094 545062 540584 537468 534915 532399 530169 528694 527979 527710 527776 528251 529073 529938 530458 530388 530035 530373
59481E30373J899L265L699L806M503N603O396P065Q217R329R091P356N380L995
$$ 530373 532272 535537 539236 543042 547545 553148 559544 566609 574826 584155 593246 600602 605982 609977
59467F09977K816J526O61O80J231J820K306K484K165J969K940N022O850P510P540
$$ 609977 612793 614319 614980 615660 616891 618711 621017 623501 625666 627635 630575 635597 642447 649957 657497
59452F57497P846Q544R370J0205J0776J0662J0005R366Q575O707L539j4l269o464
$$ 657497 665343 673887 683257 693462 704238 714900 724905 734271 742846 749553 753092 753078 749809 743345
59438G43345r605j1789j2393j1945j1157j0093q808p773p005n864m389l631l896
$$ 743345 733740 721951 709558 697613 686456 676363 667555 659782 652777 646913 642524 638893 634997
59425F34997l852k389j00K041M384P609J1115J3803J5759J7801K0015K2031K4129
$$ 634997 631145 628756 628656 630697 635081 642690 653805 667608 683367 701168 721183 743214 767343
59412G67343K6758K9393L0999L0927K8235K1174R253m567j5595k1391k2744k1115
$$ 767343 794101 823494 854493 885420 913655 934829 944082 939515 923920 902529 879785 858670
59400H58670j6970j0780l777K837Q080J0239P383l04r864j8049k3684k7025k8044
$$ 858670 841700 830920 827143 829980 838060 848299 855682 855378 845514 827465 803781 776756 748712
59387G48712k6570k3380j9870j6649j3342r746o499m336l107j948l65J119J621
$$ 748712 722142 698762 678892 662243 648901 639155 632656 628320 625213 623265 622900 624019 625640
59374F25640J095M95O36J344J999K486L112L944M794N619O437O978O985O686O452
$$ 625640 626735 627230 627866 629210 631209 633695 636807 640751 645545 651164 657601 664579 671564 678250 684702
59359F84702O234N865N650O044O887P653Q299R187J0269J1090J1587J2195J3083
$$ 684702 690936 696801 702451 708495 715382 723035 731334 740521 750790 761880 773467 785662 798745
59346G98745J4020J4969J6099J7086J7220J6382J5250J4242J2908J0660P552M105
$$ 798745 812765 827734 843833 860919 878139 894521 909771 924013 936921 947581 955133 959238
59334I59238P73k148m619p074j0042j3294j5886j7299j7978j8498j8704j8139
$$ 959238 960011 957863 953244 946170 936128 922834 906948 889649 871671 853173 834469 816330
59322H16330j6782j4938j2786j0594r014q541q746q601p562n953m325k902j783
$$ 816330 799548 784610 771824 761230 752216 743675 734929 726328 718766 712813 708488 705586 703803
59309G03803j281j660k577l095k400n52J641L432M760O042P642R733J2336J5062
$$ 703803 702522 700862 698285 695190 692790 692238 693879 697311 702071 708113 715755 725488 737824 752886
59295G52886J6723J5711J1190L977l867j0415j4908j7624j9019j9183j8141j6283
$$ 752886 769609 785320 796510 800487 796620 786205 771297 753673 734654 715471 697330 681047
59283F81047j4176j1991r509o713m026j812k8J578L171M897O842Q770J0270J1310
$$ 681047 666871 654880 645371 638658 634632 632820 632792 634370 637541 642438 649280 658050 668320 679630
59269F79630J2273J3250J3825J3781J3436J2880J1555R114O156L462R71j760m538
$$ 679630 691903 705153 718978 732759 746195 759075 770630 779744 785900 789362 790333 788573 784035
59256G84035o852q804j0741j2179j2207j0937r574q773p984o645n118l960l020
$$ 784035 777183 768379 757638 745459 733252 722315 712741 703968 695984 689339 684221 680261 677241
59243F77241j890o13N48J604K581L273L710M461N821P105P398O789O252O334O583
$$ 677241 675351 674738 675286 676890 679471 682744 686454 690915 696736 703841 711239 718028 724280 730614 737197
59228G37197O258N103L315J169j031k973m579o031p364q156p925o754n296m137
$$ 737197 743455 748558 751873 753042 752011 749038 744459 738428 731064 722908 714983 708229 702933 698796
59214F98796l367k841k636k946l660m340m673m667m375l713k779k091k152k803
$$ 698796 695429 692588 689952 687006 683346 679006 674333 669666 665291 661578 658799 656708 654556 651753
59200F51753l340l306k930k706k678k437j806j235j270j712j701q02L83R83R78
$$ 651753 648413 645107 642177 639471 636793 634356 632550 631315 630045 628333 626632 625830 626213 627196 628174
59185F28174R93J249J308R43O39R43J768K589L040L140L177L495M116M598M668
$$ 628174 629167 630416 631724 632667 633306 634249 636017 638606 641646 644786 647963 651458 655574 660172 664840
59170F64840M896O135Q209R910J0492J0489J0699J1118J1314J1164J0619R350
$$ 664840 669736 675871 684080 693990 704482 714971 725670 736788 748102 759266 769885 779235
59158G79235P256M827K514J72k290m341n566o484p839r555j1056j2155j2876j2916
$$ 779235 786491 791318 793832 794004 791714 787373 781807 775323 767484 757929 746873 734718 721842 708926
59144G08926j2154j1263j0903j0722j0037r136q769q730q117o907n993n701n439
$$ 708926 696772 685509 674606 663884 653847 644711 635942 627212 619095 612188 606195 600494 595055
59131E95055m908m446m001l008j590p11o19k86J041K739L881M493N014N439N810
$$ 595055 590147 585701 581700 578692 577102 576391 575772 575486 576527 579266 583147 587640 592654 598093 603903
59116F03903O791Q702J0548J1002J0076Q945Q401Q338Q556R045R396Q885P516
$$ 603903 610694 619396 629944 640946 651022 659967 668368 676706 685262 694307 703703 712588 720104
59103G20104O307O020O056N169L133J107K12J76j66j245k226k254j671j398j528
$$ 720104 726411 732431 738487 743656 746789 747896 748108 748284 748118 746873 744647 742393 740722 739324 737796
59088G37796j243k11P69P61j99j442k678m028n261n777n535n484o491q083q846
$$ 737796 736553 736342 737111 737872 737673 736231 733553 729525 724264 718487 712952 707468 700977 692894 684048
59073F84048q201p165o951p334p131o020m885m392m198l928l849l984l565k271
$$ 684048 675847 668682 661731 654397 647266 641246 636361 631969 627771 623843 619994 616010 612445 610174
59059F10174j173j363k230k354j697j524k214k665k112j258r84j012o91k53m34
$$ 610174 609001 607638 605408 603054 601357 599833 597619 594954 592842 591584 590600 589588 588897 588644 588210
59044E88210j227j812j641j025o35p15q89o01K37J056J252Q41L90M16J047K072
$$ 588210 586983 585171 583530 582505 581870 581155 580266 579665 579902 580958 582210 583051 583441 583857 584904 586976
59028E86976L047L649M163N312P199Q934R795J0237J1020J1892J2076J1675J1418
$$ 586976 590023 593672 597835 603147 610346 619280 629075 639312 650332 662224 674300 685975 697393
59015F97393J1201J0101P913N482L335J126j238l035l786l920l844l229j831k54
$$ 697393 708594 718695 726608 732090 735425 736551 735313 732278 728492 724572 720728 717499 715668 715414
59001G15414P82J343J961K863M010N349O568P166P093O853O616N869M353K687
$$ 715414 716196 717539 719500 722363 726373 731722 738290 745456 752549 759402 766018 771887 776240 778927
58987G78927J561Q59Q1q65j825k858l991m881n177m938m406l689k903k114r29
$$ 778927 780488 781347 781428 780563 778738 775880 771889 767008 761831 756893 752487 748798 745895 743781 742852
58972G42852J205M055O587Q253R541J0819J1568J1404J1130J1746J2895J3284
$$ 742852 744057 748112 754699 762952 772493 783312 794880 806284 817414 829160 842055 855339
58960H55339J2439J1141J0147R239P739N352K282j152m747q239j1099j2764j3361
$$ 855339 867778 878919 889066 898305 906044 911396 913678 912526 907779 899540 888441 875677 862316
58947H62316j3990j5653j7887j9080j8270j6143j4000j2404j1074r568p693n665
$$ 862316 848326 832673 814786 795706 777436 761293 747293 734889 723815 714247 706554 700889
58935G00889m108l463l294k759j808j230j324j491j423j663k414k812k244j530
$$ 700889 696781 693318 690024 687265 685457 684227 682903 681412 679989 678326 675912 673100 670856 669326
58921F69326j843k972l688l433k687j937j222o04l01k23qN22J280K214L272M194
$$ 669326 667483 664511 660823 657390 654703 652766 651544 650940 650639 650416 650408 650930 652210 654424 657696 661890
58905F61890M707M935N391O648Q996J2046J4659J5802J5630J5217J5108J4857
$$ 661890 666597 671532 676923 683571 692567 704613 719272 735074 750704 765921 781029 795886
58893G95886J4182J3642J3752J4326J5253J7020J9716K2324K3910K4784K5583
$$ 795886 810068 823710 837462 851788 867041 884061 903777 926101 950011 974795 1000378
58882A000378K5852K4593K1777J8283J4576J0449N856J170l349p646j1522j4879
$$ 1000378 1026230 1050823 1072600 1090883 1105459 1115908 1121764 1122934 1119585 1111939 1100417 1085538
58870A085538j7998k0934k2912k3072k1595j9480j7358j5296j3437j2082j1170
$$ 1085538 1067540 1046606 1023694 1000622 979027 959547 942189 926893 913456 901374 890204
58859H90204j0436r960r986j0419j0967j1589j2217j2389j1863j1274j1320j1562
$$ 890204 879768 869808 859822 849403 838436 826847 814630 802241 790378 779104 767784 756222
58847G56222j0898r144p355o516o647p203p669p659p106o480o391o897p444p497
$$ 756222 745324 736180 728825 722309 715662 708459 700790 693131 686025 679545 673154 666257 658813 651316
58833F51316o922o016n403n601o306o514n742m638l914l246j948j67J401K582
$$ 651316 644394 638378 632975 627374 621068 614554 608812 604174 600260 597014 595066 594899 596300 598882
58819E98882L708M804N575N913N768M973L899L625M542N334M588K866J889J921
$$ 598882 602590 607394 612969 618882 624650 629623 633522 637147 641689 647023 651611 654477 656366 658287
58805F58287J598L05r21j201j155j665k503k943k899k728k500k209k218k903m071
$$ 658287 659885 660190 659269 658068 656913 655248 652745 649802 646903 644175 641675 639466 637248 634345 630274
58790F30274n124n648n498m659l306j816n55L85J197K146L265M158M417M296M495
$$ 630274 625150 619502 614004 609345 606039 604223 603668 604053 605250 607396 610661 614819 619236 623532 628027
58775F28027N046N010L773J964M60q82k588m227m841m511m381n149o451p698q565
$$ 628027 633073 638083 641856 643820 644280 643398 640810 636583 631742 627231 622850 617701 611250 603552 594987
58760E94987q659p587n606l435j456L25J717K533L181M082M648L991K597K039
$$ 594987 586328 578741 573135 569700 568244 568569 570286 572819 576000 580082 584730 588721 591318 593357
58746E93357K819L725L792L681M419N794O830P186P232P175O861O259N627N238
$$ 593357 596176 599901 603693 607374 611793 617587 624417 631603 638835 646010 652871 659130 664757 669995
58732F69995N237N657O395P237P968Q314P964O929N751M980M674M681N098N921
$$ 669995 675232 680889 687284 694521 702489 710803 718767 725696 731447 736427 741101 745782 750880 756801
58718G56801O659P013P576R005J0774J1701J1577J1200J0871R933Q078N961M121
$$ 756801 763460 770473 778049 787054 797828 809529 821106 832306 843177 853110 861188 867149 871270
58705H71270K153n28l773p037j0037j2688j4870j6660j8424k0304k1898k2600
$$ 871270 873423 872895 869122 862085 852048 839360 824490 807830 789406 769102 747204 724604
58693G24604k2114k0592j8554j6567j4720j2628j0277q420p609p276o494n344
$$ 724604 702490 681898 663344 646777 632057 619429 609152 600732 593123 585847 579353 574009
58681E74009m660m690m939n111n266n142m365l295k669k379j601j23J398K624
$$ 574009 569349 564659 559720 554609 549343 544201 539836 536541 533872 531493 529892 529769 531167 533791
58667E33791L955N605P287Q955J0938J3038J4358J4279J2913J0545P430M245J791
$$ 533791 537746 543351 550638 559593 570531 583569 597927 612206 625119 635664 643094 647339 649130
58654F49130J17j330k707l773m701n814o643o451n659n443n876n862n056m373
$$ 649130 649247 647917 645210 641437 636736 630922 624279 617828 612169 606726 600850 594988 589932 585559
58640E85559m167l545k058o41p8K14J027K094K791L098L045K217P23l31j69N57
$$ 585559 581392 577847 575789 575148 575070 575284 576311 578405 581196 584294 587339 589556 590279 589948 589779 590336
58624E90336Q47O97O37O82O58Q99J687K618L309M163N640P234Q106Q297Q464Q578
$$ 590336 591183 591880 592517 593199 593857 594756 596443 599061 602370 606533 612173 619407 627513 635810 644274 652852
58608F52852P780N591K747O33QK95J83j001k662l877m476m756m723m410m419n068
$$ 652852 660632 666223 668970 669603 669611 669906 670089 669088 666426 662549 658073 653317 648594 644184 639765 634697
58592F34697n426m381k439j059m15O72K610M553O108P857R765J0812J0751J0644
$$ 634697 629271 624890 622451 621392 620977 621649 624259 628812 634920 642777 652542 663354 674105 684749
58578F84749J1004J1014J0228R426Q986Q084O493N543O167P436Q290R333J1544
$$ 684749 695753 706767 716995 726421 735407 743491 749984 755527 761694 769130 777420 786753 798297
58565G98297J4435J6957J9165K1674K4289K6511K8494L0265L0720K8804K5012
$$ 798297 812732 829689 848854 870528 894817 921328 949822 980087 1010807 1039611 1064623
58554A064623K0603J5993J0964N740P94l783p669r861r897q866q216q191q348
$$ 1064623 1085226 1101219 1112183 1117923 1118717 1114934 1107265 1097404 1087507 1078641 1070425 1062234 1053886
58541A053886q753r732j1132j2926j5635j9144k1971k2880k2419k1719k0651j8474
$$ 1053886 1045133 1035401 1024269 1011343 995708 976564 954593 931713 909294 887575 866924 848450
58529H48450j5455j2487r728o985m774l611k717r16J514L164L387K781K040J418
$$ 848450 832995 820508 810780 803795 799021 795410 792693 791777 793291 796455 799842 802623 804663 806081
58515H06081J032P47M5j218k347k868l325m230m978m890m509m661m986m675m019
$$ 806081 807113 807860 807905 806687 804340 801472 798147 793917 788939 784049 779540 774879 769893 765218 761199
58500G61199l826l911l507k834k768l279l413k761j771q27KN60Q48J423K615L766
$$ 761199 757373 753462 749955 747121 744353 741074 737661 734900 733129 732302 732304 732864 733712 735135 737750 741516
58484G41516M179M291M991O295P722R439J1856J4477J6294J7054J7151J6587J4980
$$ 741516 745695 749986 754977 761272 768994 778433 790289 804766 821060 838114 855265 871852 886832
58471H86832J2295Q768M498j47m234p173r283j0823j1221j0181q589p333o022
$$ 886832 899127 907895 912393 912246 908012 900839 891556 880733 869512 859331 850742 843409 837387
58458H37387l897j167J646M651P760R867J0344J0433J1562J2962J2515R484N054
$$ 837387 833490 832323 833969 838620 846380 856247 866591 877024 888586 901548 914063 923547 928601
58445I28601N86l229n976p669r015j0443j1258j0639q906o852m681k563j222q03
$$ 928601 929187 925958 919982 912313 903298 892855 881597 870958 862052 855200 850519 847956 846734 845931
58431H45931j77J384K892L319L461M612O452P904R077J0631J2117J2664J2371
$$ 845931 845754 847138 850030 853349 856810 861422 867874 875778 884855 895486 907603 920267 932638
58418I32638J1512R367N630J821n65k190m311o294o922o999q108r694r962r002
$$ 932638 944150 953517 959147 960968 960403 958213 953902 947608 940686 933687 925579 915885 905923 896921
58404H96921q455q549q081o988o349o044m861k941j701j324m60J439L426M668
$$ 896921 888466 879917 871836 864848 858499 852455 847594 844653 842952 841628 841168 842607 846033 850701
58390H50701N002M174K393J114J363J835P24j262k001j376j044j281p34R15K618
$$ 850701 855703 859877 862270 863384 864747 866582 867306 866044 864043 862667 861623 860342 859608 860523 863141
58375H63141M155O176Q199Q982Q768Q796Q982Q502Q219R687J2045J2852J1911
$$ 863141 867296 873472 881671 890653 899421 908217 917199 925701 933920 943607 955652 968504 980415
58362I80415J1399J2212J3082J3379J3822J4291J3828J2942J3050J3447J1898
$$ 980415 991814 1004026 1017108 1030487 1044309 1058600 1072428 1085370 1098420 1111867 1123765
58351A123765Q440N557M226L006J453J157K531L740L800L987N169O451P362Q798
$$ 1123765 1132205 1137762 1141988 1144994 1146447 1147604 1150135 1153875 1157675 1161662 1166831 1173282 1180644 1189442
58337A189442J0930J2580J3453J4634J6339J7495J7885J8302J8445J7314J5655
$$ 1189442 1200372 1212952 1226405 1241039 1257378 1274873 1292758 1311060 1329505 1346819 1362474
58326A362474J5155J5166J3416J0090P767P142O331M806M238M793M496L168L208
$$ 1362474 1377629 1392795 1406211 1416301 1424068 1431210 1437541 1442347 1446585 1451378 1455874 1459042 1462250
58313A462250N363P379Q064R007J1021J2539J2909J3786J5741J6954J6701J6743
$$ 1462250 1467613 1474992 1483056 1492063 1503084 1515623 1528532 1542318 1558059 1575013 1591714 1608457
58301A608457J7852J8404J7853J8061J9675K0683K0154J9950K1183K2337K2523
$$ 1608457 1626309 1644713 1662566 1680627 1700302 1720985 1741139 1761089 1782272 1804609 1827132
58290A827132K3138K4822K6110K6540K7623K9452L0040K9287K9714L1917L3357
$$ 1827132 1850270 1875092 1901202 1927742 1955365 1984817 2014857 2044144 2073858 2105775 2139132
58279B139132L3084L3432L5374L6614L6170L6505L9024M1678M3106M4922M7826
$$ 2139132 2172216 2205648 2241022 2277636 2313806 2350311 2389335 2431013 2474119 2519041 2566867
58268B566867M9787N0173N1451N4668N7592N9235O1681O5508O8287O9515P1991
$$ 2566867 2616654 2666827 2718278 2772946 2830538 2889773 2951454 3016962 3085249 3154764 3226755
58257C226755P6173P8590P8106P8237Q0788Q2945Q3361Q5043Q9296R2859R4327
$$ 3226755 3302928 3381518 3459624 3537861 3618649 3701594 3784955 3869998 3959294 4052153 4146480
58246D146480R7264J03627J10276J15410J21940J31043J39110J44946J52857J64599
$$ 4146480 4243744 4347371 4457647 4573057 4694997 4826040 4965150 5110096 5262953 5427552
58236E427552J75533J83195J92035K04857K17472K27110K38257K54395K71865
$$ 5427552 5603085 5786280 5978315 6183172 6400644 6627754 6866011 7120406 7392271
58227G392271K87790L05972L28881L52165L73599L98819M31436M66400N00237
$$ 7392271 7680061 7986033 8314914 8667079 9040678 9439497 9870933 10337333 10837570
58218A0837570N38497N85612O37185O90229P50721Q22796R01524R85209J082959
$$ 10837570 11376067 11961679 12598864 13289093 14039814 14862610 15764134 16749343 17832302
58209A7832302J200711J332715J477320J647306J853357K092779K367573K697405
$$ 17832302 19033013 20365728 21843048 23490354 25343711 27436490 29804063 32501468
58201C2501468L100986L584098M164220M889491N818059P003571Q522598J0488080
$$ 32501468 35602454 39186552 43350772 48240263 54058322 61061893 69584491 80072571
58193H0072571J3007230J6151636J9986056K4557158K9758081L5178368M0072207
$$ 80072571 93079801 109231437 129217493 153774651 183532732 218711100 258783307
58186B58783307M3375829M3716028L9675702L0573774J7329257K457473j1128073
$$ 258783307 302159136 345875164 385550866 416124640 433453897 435911370 424783297
58179D24783297k1584858k8638216l2915847l5040371l5319139l3980476l1414591
$$ 424783297 403198439 374560223 341644376 306604005 271284866 237304390 205889799
58172B05889799k8144541k4657516k1287232j8198330j5441195j3025917j0958798
$$ 205889799 177745258 153087742 131800510 113602180 98160985 85135068 74176270
58165G4176270r228951p794849o605222n622051m813307m140650l570767l088119
$$ 74176270 64947319 57152470 50547248 44925197 40111890 35971240 32400473 29312354
58157B9312354k683798k342032k048417j800031j595286j423101j272652j144233
$$ 29312354 26628556 24286524 22238107 20438076 18842790 17419689 16147037 15002804
58149A5002804j039647r50482q66566p88187p19743o58369n98781n42896m95082
$$ 15002804 13963157 13012675 12146109 11357922 10638179 9979810 9381029 8838133 8343051
58140H343051m53204m12981l76131l46194l21249k98144k78930k65920k55149
$$ 8343051 7889847 7476866 7100735 6754541 6433292 6135148 5856218 5590298 5335149
58131E335149k41709k27128k14884k03339j89589j75845j65453j56603j46166
$$ 5335149 5093440 4866312 4651428 4448089 4258500 4082655 3917202 3760599 3614433
58122C614433j35842j28506j22394j14687j07077j02089r7597r0690q3389p8988
$$ 3614433 3478591 3350085 3227691 3113004 3005927 2903838 2806241 2715551 2632162 2553174
58112B553174p6102p1781o7145o4571o2541n8679n4851n3894n4165n2504m9823
$$ 2553174 2477072 2405291 2338146 2273575 2211034 2152355 2097504 2043610 1989445 1936941 1887118
58101A887118m8714m8165m5809m2840m1735m1391l9417l6946l6494l7030l5827
$$ 1887118 1838404 1790239 1744430 1701590 1659855 1618464 1579047 1542101 1505607 1468577 1432750
58090A432750l3216l1216k9426k6550k3897k3221k3112k1597k0122k0816k2090
$$ 1432750 1399534 1368318 1338892 1312342 1288445 1265224 1242112 1220515 1200393 1179577 1157487
58079A157487k1257j9466j9537k0866k0887j9835j9617j9620j8071j6075j5999
$$ 1157487 1136230 1116764 1097227 1076361 1055474 1035639 1016022 996402 978331 962256 946257
58068I46257j7090j6878j5640j5408j5747j4625j2425j1130j0518q990p254p237
$$ 946257 929167 912289 896649 881241 865494 850869 838444 827314 816796 807806 800552 793315
58056G93315q378q634q365r419j1270j1754j0927j0527j0372q916o756o016o682
$$ 793315 784937 776303 767938 758519 747249 735495 724568 714041 703669 694753 687997 681981 675299
58043F75299o907o443o509o909o432n609n859o588o206n345n838p256p690p306
$$ 675299 668392 661949 655440 648531 642099 636490 630631 624043 617837 612492 606654 599398 591708 584402
58029E84402p787q955r293r161j0015j0964r759o904n231n510n917n738o081o785
$$ 584402 576615 567660 558367 549206 539191 528227 518468 511564 506333 500823 494906 489168 483087 476302
58015D76302o165m259l140l543m076m122m534n132m489k759j913k538k985k276
$$ 476302 470137 465878 462738 459195 455119 450997 446463 441331 436842 434083 432170 429632 426647 424371
58001D24371j404j164j044q11j018j503j387q39q46j208q42L5K78J66R98K369
$$ 424371 422967 421803 420759 419948 418930 417427 416040 415201 414355 413147 412305 412340 412618 412784 413782 416151
57985D16151K474J183K70L69K08p35j435j650k477l977m569l612k467k235k348
$$ 416151 418625 419808 420078 420447 420655 419920 418485 416835 414358 410381 405812 402200 399733 397498 395150
57970C95150k103j848j904j930j846j959j933j152j34J7m57l67K99M93J87K87
$$ 395150 393047 391199 389295 387365 385519 383560 381627 380475 380341 380358 379901 379534 379833 380326 380513 380800
57954C80800N70j48j744k794k933l065l208k398q86j11k39K4R20J306J160J969
$$ 380800 381370 381222 379478 376684 373751 370686 367478 365080 364194 364083 363844 363868 364788 366094 367254 369223
57938C69223M045N819O505P263Q842J0164J0197R488Q957Q734Q752Q920Q377O191
$$ 369223 373268 379087 385592 392855 401697 411861 422058 431546 440503 449237 457989 466909 475286 481477
57924D81477L095P83n87k213l979m398l530l409m873o302o358n729n272m613l592
$$ 481477 484572 485355 484768 482555 478576 474178 470648 467239 462366 456064 449706 443977 438705 434092 430500
57909D30500l064l209k959k008j549k138k739k757k996l768m141m059m952o986
$$ 430500 427436 424227 421268 419260 417711 415573 412834 410077 407081 403313 399172 395113 390161 383175
57895C83175p892o146l357j876j711j467q02k96j3K72L64L23P95J756K176J767
$$ 383175 375283 369137 365780 363904 362193 360726 359924 359628 359615 359887 360251 360574 361369 363125 365301 367068
57879C67068J612K160K174Q15q78j765k269k938k987j792m25j21m50n28p62j709
$$ 367068 368680 370840 373014 373829 372951 371186 368917 365979 362992 361200 360775 360654 360204 359676 358914 357205
57863C57205k410j629P2J195J542J995K661K810K300J800J737K001K389K595K237
$$ 357205 354795 353166 353238 354433 355975 357970 360631 363441 365741 367541 369278 371279 373668 376263 378500
57848C78500J509J149J207P85l74j186r22n54j383l272n212o672p402o950n478
$$ 378500 380009 381158 382365 383150 382776 381590 380668 380114 378731 375459 370247 363575 356173 349223 343745
57833C43745m242m131m473m223l436k617j580j68Q13N89k51o02l49k8L28R69J596
$$ 343745 339503 335372 330899 326676 323240 320623 319043 318875 319688 320277 320026 319424 319075 319047 319375 320344 321940
57816C21940J852K079K699L368L535L230K489P83k042m891o408o356n415m303
$$ 321940 323792 325871 328570 331938 335473 338703 341192 341975 339933 335042 328634 322278 316863 312560
57802C12560l681l972m579m170k517j014n93m03M75J321J201Q64J557K822L215
$$ 312560 308879 304907 300328 296158 293641 292627 292034 291631 292106 293427 294628 295492 297049 299871 303086
57787C03086K674K497L177L814L621K802J910J353J438K100K727K918L070L622
$$ 303086 305760 308257 311434 315248 318869 321671 323581 324934 326372 328472 331199 334117 337187 340809
57773C40809M162M068L441K704J791N83m94j079j561k382l211l614l924m664n680
$$ 340809 344971 349039 352480 355184 356975 357558 357064 355985 354424 352042 348831 345217 341293 336629 330949
57758C30949o504o937o683n297l221j810j569j376l78N98O41N01J264K348K478
$$ 330949 324445 317508 310825 305528 302307 300497 298928 297552 297174 297772 298413 298914 300178 302526 305004
57743C05004J852J614J852J755J352J394J794J740J118N54K11j36k14K00K66r04
$$ 305004 306856 308470 310322 312077 313429 314823 316617 318357 319475 320029 320240 320104 319890 320090 320356 319452
57727C19452k519k928k044j442k002k949l344l255l074k849k632k706l151l714
$$ 319452 316933 314005 311961 310519 308517 305568 302224 298969 295895 293046 290414 287708 284557 280843
57713B80843m124m118l536k854l035m139m836m214l227l130l409k818j769j838
$$ 280843 276719 272601 269065 266211 263176 259037 254201 249987 246760 243630 240221 237403 235634 233796
57699B33796l157m082l531k174j120p61j027j570j617p41K25J61o91j152r30o78
$$ 233796 230639 226557 223026 220852 219732 218971 217944 216374 214757 214016 214241 214402 213711 212559 211629 210951
57683B10951m79K34J342K155K892M427O559Q094Q943J0477J3462J7198K1245K6492
$$ 210951 210472 210706 212048 214203 217095 221522 228081 236175 245118 255595 269057 286255 307500 333992
57669C33992L3709M2224N0673N7902O2327O1479N3308L7775J7018n346k5173l9409
$$ 333992 367701 409925 460598 518500 580827 642306 695614 733389 750407 745061 719888 680479
57657F80479m7572n1145n1407m8566m3075l6425l0123k4697k0083j6173j2748
$$ 680479 632907 581762 530355 481789 438714 402289 372166 347469 327386 311213 298465
57646B98465r677p451o598o538n998m776l833l513k962j771p76n82n77k51k83
$$ 298465 288788 281337 274739 268201 262203 257427 253594 250081 247119 245348 244572 243990 243413 243162 242879
57631B42879j278k373k286j144j84n4k70j47M46J075R84k74k080l079k641j602
$$ 242879 241601 239228 236942 235798 235614 235560 235290 235143 235589 236664 237648 237374 235294 232215 229574 227972
57615B27972j120j362j745j856j569p62L80J155J070N98N76J045J200M78p29j562
$$ 227972 226852 225490 223745 221889 220320 219558 219938 221093 222163 222761 223337 224382 225582 226060 225331 223769
57599B23769j624j284j161j437j739j741j572j500j565j785k375l339m135m247
$$ 223769 222145 220861 219700 218263 216524 214783 213211 211711 210146 208361 205986 202647 198512 194265
57585A94265l784l098k178r96o7R5k78o84j197k001k555k250j540j317j429j076
$$ 194265 190481 187383 185205 184209 184142 184237 183959 183275 182078 180077 177522 175272 173732 172415 170986 169910
57569A69910m21m31j121j420j001p19r14p53J62Q46M30n36j037r25n48K4O02O19
$$ 169910 169489 169058 167937 166517 165516 164797 163883 163130 163292 164138 164568 164032 162995 162070 161522 161546 162148 162767
57551A62767M6j59O99K006K764K870K711K232J308N31N66J050J011L11j42L47
$$ 162767 162813 162654 163353 165359 168123 170993 173704 175936 177244 177775 178341 179391 180402 180713 180571 180918
57535A80918J342J780J111j49r25p18j08K0m08q04r24j055j266j306j220j299
$$ 180918 182260 184040 185151 185002 184077 183359 183251 183271 182863 182059 181135 180080 178814 177508 176288 174989
57519A74989j263m77Q28J498R69K6l98k59J68R63J984K357J488N6o97l70M01Q33
$$ 174989 173726 173249 174077 175575 176544 176570 176172 175913 176081 177044 179028 181385 182873 182929 182232 181862 182263 183096
57501A83096O17r0q02j046p83l52J6K30j8r44k068k586k462k351k420k144j446
$$ 183096 183713 183623 182821 181775 180992 180640 180656 180886 180868 179924 177856 175270 172808 170457 168037 165893 164447
57484A64447r92j035r35k86L90N81N49O58P10N14L13J82k71j098j687j691j466
$$ 164447 163455 162420 161485 161199 161589 162170 162719 163377 164087 164601 164914 165096 164825 163727 162040 160349 158883
57467A58883j177m89M52P25O9m59PQ97J281J235J230J133P42N37Q63J109O65K0
$$ 158883 157706 157217 157669 158394 158463 158004 158011 158908 160189 161424 162654 163787 164529 165066 165929 167038 167703 167723
57449A67723p8J86L07M79R24J002K11o07l65N11Q48O63Q97J568J798J484J381
$$ 167723 167645 167831 168138 168617 169541 170543 170754 170147 169782 170293 171141 171804 172701 174269 176067 177551 178932
57432A78932J444O94q95j885j318l5O79P53R58J546K060K105J668R43K41o6J88
$$ 178932 180376 181070 180175 178290 176972 176937 177616 178369 179327 180873 182933 185038 186706 187649 187890 187824 188012
57415A88012P37J123J066O46K52L15Q96J566J826J529Q64J07m68o55m75j30K57
$$ 188012 188749 189872 190938 191584 191836 192151 193047 194613 196439 197968 198832 198939 198471 197816 197341 197211 197468
57398A97468N85N89J58j67L10J313J778J332Q46J066J645K027K469L319M052L928
$$ 197468 198053 198642 198800 198633 198943 200256 202034 203366 204212 205278 206923 208950 211419 214738 218790 222718
57382B22718L107K318J807J476J555K275L099L117K142P63m61j252j385q74j98
$$ 222718 225825 228143 229950 231426 232981 235256 238355 241472 243614 244377 243916 242664 241279 240405 240207
57367B40207K32N98J193J761J851J495R74L44k70l51L77J398K070K381K488K169
$$ 240207 240439 241037 242230 243991 245842 247337 248311 248655 248385 248034 248411 249809 251879 254260 256748 258917
57351B58917J450J118J707K506K537J988J734J879J862J643J662J844J747J500
$$ 258917 260367 261485 263192 265698 268235 270223 271957 273836 275698 277341 279003 280847 282594 284094
57337B84094J616K008K165K128K311K514K169J504J406K104K877L111K752J839
$$ 284094 285710 287718 289883 292011 294322 296836 299005 300509 301915 304019 306896 310007 312759 314598
57323C14598N80k42Q3J095J703J796K255L313M080L976L565L532L713L601L157
$$ 314598 315178 314936 315019 316114 317817 319613 321868 325181 329261 333237 336802 340334 344047 347648 350805
57308C50805K677K387K467L028L836M419M550M338L953L696L964M676N025M521
$$ 350805 353482 355869 358336 361364 365200 369619 374169 378507 382460 386156 390120 394796 399821 404342
57294D04342L853L960M637N046N166N597O194O250N924O146O953P313O819O281
$$ 404342 408195 412155 416792 421838 427004 432601 438795 445045 450969 457115 464068 471381 478200 484481
57280D84481O231O147N676N420N789O084N514M364L448L091L251L945M916N486
$$ 484481 490712 496859 502535 507955 513744 519828 525342 529706 533154 536245 539496 543441 548357 553843
57266E53843N393N291N854O875P725Q299Q904R658J0422J1063J1426J1347J0976
$$ 553843 559236 564527 570381 577256 584981 593280 602184 611842 622264 633327 644753 656100 667076
57253F67076J0778J0986J1368J1716J2155J2727J3154J3274J3351J3668J4143
$$ 667076 677854 688840 700208 711924 724079 736806 749960 763234 776585 790253 804396
57242H04396J4605J5087J5603J5958J6055J6157J6667J7667J8745J9277J9105
$$ 804396 819001 834088 849691 865649 881704 897861 914528 932195 950940 970217 989322
57231I89322J8950J9740K1268K2140K1551K0503K0541K1753K3013K3724K4245
$$ 989322 1008272 1028012 1049280 1071420 1092971 1113474 1134015 1155768 1178781 1202505 1226750
57220A226750K4733K4823K4516K4324K4332K4128K3806K4118K5333K6797K7932
$$ 1226750 1251483 1276306 1300822 1325146 1349478 1373606 1397412 1421530 1446863 1473660 1501592
57209A501592K8826K9624L0109L0228L0300L0481L0703L1175L2246L3583L4351
$$ 1501592 1530418 1560042 1590151 1620379 1650679 1681160 1711863 1743038 1775284 1808867 1843218
57198A843218L4322L4102L4081L4087L4114L4449L4855L4641L3887L3610L4332
$$ 1843218 1877540 1911642 1945723 1979810 2013924 2048373 2083228 2117869 2151756 2185366 2219698
57187B219698L5333L5796L5809L5810L5819L5779L5943L6491L7268L8164L9127
$$ 2219698 2255031 2290827 2326636 2362446 2398265 2434044 2469987 2506478 2543746 2581910 2621037
57176B621037L9712L9360L8425L8002L8499L9193L9440L9392L9195L8410L6812
$$ 2621037 2660749 2700109 2738534 2776536 2815035 2854228 2893668 2933060 2972255 3010665 3047477
57165C047477L4885L3052L1108K8773K6188K3505K0824J8667J7644J7367J6670
$$ 3047477 3082362 3115414 3146522 3175295 3201483 3224988 3245812 3264479 3282123 3299490 3316160
57154C316160J5247J4055J3689J3560J3111J2778J3029J3469J3655J3809J4031
$$ 3316160 3331407 3345462 3359151 3372711 3385822 3398600 3411629 3425098 3438753 3452562 3466593
57143C466593J3649J2183J0196Q463O982N427L816K178K10k012l782m753n494
$$ 3466593 3480242 3492425 3502621 3511084 3518066 3523493 3527309 3529487 3529697 3527685 3523903 3519150 3513656
57130C513656o476p365p872q354q935q904p790o246n112m330l483k670k095j515
$$ 3513656 3507180 3499815 3491943 3483589 3474654 3465750 3457960 3451714 3446602 3442272 3438789 3436119 3434024 3432509
57116C432509p17J3N24J183K200L221M044N060O742R648J5054K4324L7320N2713
$$ 3432509 3431792 3431805 3432329 3433512 3435712 3438933 3442977 3448037 3454779 3464427 3479481 3503805 3541125 3593838
57102C593838P0249R1338J17107J47833J84991K32008K91915L65973M55510N62998
$$ 3593838 3664087 3755425 3872532 4020365 4205356 4437364 4729279 5095252 5550762 6113760
57092F113760O89726Q33755R90949J155560J318411J466977J588909J672549J702264
$$ 6113760 6803486 7637241 8628190 9783750 11102161 12569138 14158047 15830596 17532860
57083A7532860J659157J534598J344495J125734R15274P30484N63812L90005J81037
$$ 17532860 19192017 20726615 22071110 23196844 24112118 24842602 25406414 25796419 25977456
57074B5977456p5266l63554o48900q99859j104749j267367j392595j479587j525389
$$ 25977456 25902190 25538636 24889736 23989877 22885128 21617761 20225166 18745579 17220190
57065A7220190j529666j495501j428698j337314j230282j115640j000086q89118
$$ 17220190 15690524 14195023 12766325 11429011 10198729 9083089 8083003 7193885
57057G193885p86277o92626o08071n32920m67431m10576l60491l15913k76371
$$ 7193885 6407608 5714982 5106911 4573991 4106560 3695984 3335493 3019580 2743209
57048B743209k41355k10266j82991j59711j40125j23497j09287r7295q7271p8830
$$ 2743209 2501854 2291588 2108597 1948886 1808761 1685264 1575977 1478682 1391411 1312581
57038A312581p1556o4955n8581n2423m6777m1485l5847k9508k2819j5818p594
$$ 1312581 1241025 1176070 1117489 1065066 1018289 976804 940957 911449 888630 872812 865218
57027H65218K597J4102K5581L6455M6296N2630N0740L7079J2963j5625m1925o1902
$$ 865218 867815 881917 907498 943953 990249 1042879 1093619 1130698 1143661 1128036 1086111 1024209
57015A024209p4441p9712p8544p2799o4870n6249m7387l8991l2354k7899k4484
$$ 1024209 949768 870056 791512 718713 653843 597594 550207 511216 478862 450963 426479
57004D26479k1012j7857j5782j4370j2754j1156j0378j0156r471q233p333o980
$$ 426479 405467 387610 371828 357458 344704 333548 323170 313014 303543 295310 287977 280997
56992B80997o392n161l722k284m57J787L875N668P601R543J0489R790P751M764
$$ 280997 274605 269444 265722 263438 262981 264768 268643 274311 281912 291455 301944 311734 319485 324249
56978C24249Q11l705p674j0365j2046j3071j3132j1937r955p948o263m924l776
$$ 324249 325060 321355 313681 303316 291270 278199 265067 253130 243175 235227 228964 224040 220264
56965B20264k310M6L071N860Q038J0264J3166J6469J9361K1120K0970J8199J2892
$$ 220264 217954 218000 221071 226931 234969 245233 258399 274868 294229 315349 336319 354518 367410
56952C67410O147q33p422j3164j7392j9684k0242j9473j7630j5025j2056q858
$$ 367410 373557 372724 365302 352138 334746 315062 294820 275347 257717 242692 230636 221778
56940B21778n382j977Q13L168O031R906J4265J8405K2251K5852K8576K9105K6166
$$ 221778 216396 214419 215232 218400 224431 234337 248602 267007 289258 315110 343686 372791 398957
56927C98957J9305R505j000j0088j7034k2088k5200k6072k5237k3848k2260j9881
$$ 398957 418262 427767 426767 416679 399645 377557 352357 326285 301048 277200 254940 235059
56915B35059j6627j3484j1238r647q225o987o030n208m606m473m450l803k622
$$ 235059 218432 204948 193710 184063 175838 168851 162821 157613 153007 148534 144084 140281 137659
56902A37659j771j393o57N97J295Q63L40Q64K149L383M603O220Q066R901J2156
$$ 137659 135888 134495 133838 134435 135730 136593 136933 137797 139946 143329 147932 154152 162218 172119 184275
56887A84275J5142J8131K0103K0757J9944J6871J1099L826k919q066j1674j3796
$$ 184275 199417 217548 237651 258408 278352 295223 306322 310148 307229 299163 287489 273693
56875B73693j4225j3137j1014q093m555r88K130N192Q935J3409J8207K3409K9489
$$ 273693 259468 246331 235317 227224 222669 221681 223811 229003 237938 251347 269554 292963 322452
56862C22452L6390M3460N0110N5635N8393N6023M7019L2024J3717m410j9584l0698
$$ 322452 358842 402302 452412 508047 566440 622463 669482 701506 715223 710813 691229 660531
56850F60531l7915m1430m1072l7275l1619k5668j9588j2570m301M615J3513K2424
$$ 660531 622616 581186 540114 502839 471220 445552 425964 413394 409093 413708 427221 449645
56838D49645L1957M2809N5144O8108Q0069Q9321R4101R1874P9715N6735K5996
$$ 449645 481602 524411 579555 647663 727732 817053 911154 1003028 1082743 1139478 1165474
56827A165474o515l5066n6506p0378p7699p9617p6723o9536n9464m8698l8755
$$ 1165474 1158959 1123893 1067387 997009 919310 839693 762970 693434 633970 585272 546517
56816E46517k9573k0335j0689p86R281J9499K9731L9891M9874N8854O4896O5585
$$ 546517 516944 496609 485920 485134 494415 513914 543645 583536 633410 692264 757160 822745
56804H22745N8879M3769K1353m284k7506m4600n5561o2097o4798o3232n7873n0615
$$ 822745 881624 925393 946746 942462 914956 870356 814795 752698 687900 624668 566795 516180
56792E16180m3270l6453k9813k2792j5256p755j025M967J0959J7154K2795K7295
$$ 516180 472910 436457 406644 383852 368596 360841 359816 364783 375742 392896 415691 442986
56780D42986L0758L2686L1152K4455J3168l32j3729k5394l3922l8499l9616l8503
$$ 442986 473744 506430 537582 562037 575205 574873 561144 535750 501828 463329 423713 385210
56768C85210l6002l2523k8640k4853k1190j7802j5349j3989j2634j0351p910o690
$$ 385210 349208 316685 288045 263192 242002 224200 208851 194862 182228 171877 163967 157277
56756A57277o587o324n514m914m833m671m163l643l033j813l25K29n39j590j921
$$ 157277 150690 144366 138852 133938 129105 124434 120271 116628 113595 111782 111457 111686 111147 109557 107636
56741A07636j730j624j593j323p96j90L65N97K58l45n21j31K04j9n86j007j006
$$ 107636 105906 104282 102689 101366 100570 100380 100745 101342 101600 101255 100734 100603 100807 100788 100202 99195 98189
56724I8189n10L62J134J328J075R50J181J493J675J803J863J731J470J251J017
$$ 98189 97679 98041 99175 100503 101578 102528 103709 105202 106877 108680 110543 112274 113744 114995 116012
56709A16012P02N55P31Q54N54J67J76L32J29k00r7J66j01o33n10J57J90p25j417
$$ 116012 116714 117269 118000 118854 119408 119575 119751 120083 120212 120012 119915 120081 119980 119347 118837 118994 119184 118459 117042
56690A17042j024j88J70K25N36Q62O47J74K61J047J860K112J824J316Q31M69J58
$$ 117042 116018 115830 116000 116225 116761 117623 118270 118444 118705 119752 121612 123724 125548 126864 127695 128164 128322
56673A28322j74l35L2R35J882K388K396K081J569J019P21P85R73R95R17J047J498
$$ 128322 128148 127813 127845 128780 130662 133050 135446 137527 139096 140115 140836 141621 142594 143589 144506 145553 147051
56656A47051J972K039J582R50N72N18O18Q36J153J172M69o00j112q71p00j032
$$ 147051 149023 151062 152644 153594 154166 154684 155302 156138 157291 158463 158932 158332 157220 156349 155649 154617
56640A54617j082j61R93J151L14n14q77j115j276r38j37M51M16Nm47p88p48j58
$$ 154617 153535 153374 154367 155518 155832 155318 154441 153326 152050 151112 150975 151426 151842 151847 151400 150612 149864 149706
56622A49706N55P57M85K83K38o9o97j179j241j073q46o23o45j036j291q33K3L91
$$ 149706 150261 151018 151503 151786 152024 151955 151258 150079 148838 147765 146919 146296 145651 144615 143324 142491 142514 142905
56604A42905Q3k23j19Q0K9j95m74p91r06n19J66N94N60L31J47J60N98J371J749
$$ 142905 142988 142765 142646 142726 142755 142560 142086 141295 140389 139870 140036 140630 141190 141521 141668 141828 142426 143797 145546
56585A45546J173R7o05p60o51k07O03J098P56L00O54J245Q43j68j51J179K262
$$ 145546 146719 146816 146211 145451 144800 144593 145196 146294 147050 147350 148004 149249 150092 149924 149773 150952 153214
56568A53214K150J781K180L008L642M364N583O903P856Q680R624J0280J0198R481
$$ 153214 155364 157145 159325 162333 165975 170339 175922 182825 190681 199361 208985 219265 229463 238944
56554B38944Q294O461M095J888L95l46l81J72O54M26kM49J553J835P39o37j460
$$ 238944 247238 253699 257794 259682 260077 259731 259350 259522 260176 260602 260600 261049 262602 264437 265176 264539 263079
56537B63079k259l452m277m133l622l316k788j894j731k987m485m714l966l607
$$ 263079 260820 257368 253091 248958 245336 242020 239232 237338 235607 232620 228135 223421 219455 215848
56523B15848l990m404m457m175l356k114j521k333l573l710k868k466k913l141
$$ 215848 211858 207454 202997 198822 195466 193352 191831 189498 185925 182215 179347 176881 173968 170827
56509A70827k435j262j28J080K223K539J806R79J041J801K357K284J818J181L52
$$ 170827 168392 167130 167002 168082 170305 172844 174650 175629 176670 178471 180828 183112 184930 186111 186463
56494A86463n64j168j182p62k51K71R43J565J518N21p75j416j159m72K46Q34R23
$$ 186463 185899 184731 183549 182787 182536 182807 183750 185315 186833 187354 186579 185163 184004 183532 183778 184612 185535
56477A85535K05q33j133l57O83J087Q30M49L74Q01J630K340K359J788J247R28
$$ 185535 185740 184907 183774 183417 184100 185187 186017 186466 186840 187641 189271 191611 193970 195758 197005 197933
56461A97933L99n73j603k213k215j536l12Q20J268J254J297J066j06j672k059
$$ 197933 198332 197759 196156 193943 191728 190192 189880 190700 191968 193222 194519 195585 195479 193807 191748
56446A91748p74R37J871K188K429K442J965J312P61O6p40r59k86M82N00n2n01
$$ 191748 190974 191911 193782 195970 198399 200841 202806 204118 204879 204945 204205 203246 202960 203442 203942 203890 203389
56429B03389n74k75M30J242J512J129P78R01J128J036P45L89j33o04m94J31O58
$$ 203389 202815 202540 202970 204212 205724 206853 207631 208532 209660 210696 211441 211830 211697 211093 210599 210730 211388
56412B11388R93J576K155J849P00k17n48j061j768j502r8P51l1j206j257o26m82
$$ 211388 212381 213957 216112 217961 218661 218444 217896 216835 215067 213565 213467 214218 214187 212981 211724 211098 210616
56395B10616o41k84L69O92R70J576J733O08j015j672j198m55K09R19J379J369
$$ 210616 209975 209691 210060 210752 211722 213298 215031 215639 214624 212952 211754 211299 211508 212427 213806 215175
56379B15175J535K367L081K780J968J645J536Q04k02m27R9M37L89N03P74P08M37
$$ 215175 216710 219077 222158 224938 226906 228551 230087 230891 230689 230262 230361 230798 231187 231690 232464 233172 233609
56362B33609N05P39N87K86N08J100J335J176J190J428J475J299J145R16O18Q48
$$ 233609 234114 234853 235440 235726 236234 237334 238669 239845 241035 242463 243938 245237 246382 247298 247916 248764
56346B48764J852K665K324J334Q32Q44O93M38O28J026J000P95J128J862K362K698
$$ 248764 250616 253281 255605 256939 257771 258615 259308 259746 260374 261400 262400 263195 264323 266185 268547 271245
56330B71245L279L730L468K941K954L225K975K478K549K886K528J624J165J134
$$ 271245 274524 278254 281722 284663 287617 290842 293817 296295 298844 301730 304258 305882 307047 308181
56316C08181N89m79r18j65J048J872K070J610P32K87Q80J802J899J252Q94J228
$$ 308181 308770 308291 307373 307208 308256 310128 312198 313808 314540 314827 315707 317509 319408 320660 321554 322782
56300C22782J935L001M407N208M491L050K551L142L439K894K503K949L567L624
$$ 322782 324717 327718 332125 337333 341824 344874 347425 350567 354006 356900 359403 362352 365919 369543
56286C69543L412L546M067M610M841M638M384M849O179P448P836P707P778Q017
$$ 369543 372955 376501 380568 385178 390019 394657 399041 403890 410069 417517 425353 433060 440838 448855
56272D48855Q236Q871J0019J0662J0203R831J0863J2630J3624J3963J4911J6651
$$ 448855 457091 465962 475981 486643 496846 506677 517540 530170 543794 557757 572668 589319
56260E89319J8423K0270K2796K5632K8041L0595L4417L9183M3840M8788N5268
$$ 589319 607742 628012 650808 676440 704481 735076 769493 808676 852516 901304 956572
56249I56572O2940P0221P6855Q3929R1470R8147J03481J08204J12235J14291J13746
$$ 956572 1019512 1089733 1166588 1250517 1341987 1440134 1543615 1651819 1764054 1878345 1992091
56238A992091J11041J06114R8204Q7337P4268N8952M0919K1148J698j6543l3941
$$ 1992091 2103132 2209246 2307450 2394787 2469055 2528007 2568926 2590074 2591772 2575229 2541288
56227B541288n0037o3421p3736q1946q8435r2701r4925r5941r5681r3516r0003
$$ 2541288 2491251 2427830 2354094 2272148 2183713 2091012 1996087 1900146 1804465 1710949 1620946
56216A620946q6378q2523p7483p1742o6732o2303n7162n1699m7723m5301m2511
$$ 1620946 1534568 1452045 1374562 1302820 1236088 1173785 1116623 1064924 1017201 971900 929389
56205I29389l8653l5073l2399k9623k6437k3939k2293k0146j7132j4638j3359
$$ 929389 890736 855663 823264 793641 767204 743265 720972 700826 683694 669056 655697
56194F55697j2344j1008r928r064p532n674m971n387n163l820k835k805k525j564
$$ 655697 643353 632345 622417 613353 605821 600147 595176 589789 584626 580806 577971 575166 572641 571077
56180E71077j082j295q14N72J070r4j358j498j162q52M5J281J483Q33J361L513
$$ 571077 569995 568700 567886 568458 569528 569434 568076 566578 565416 564564 564609 565890 567373 568206 569567 573080
56164E73080N174N160M906N478N892N713O363Q206R275Q655Q375J0038J2190J3026
$$ 573080 578254 583414 588320 593798 599690 605403 611766 619972 629247 637902 646277 656315 668505 681531
56150F81531J3173J3819J4500J4741J5702J8273K1638K5364L0634L7840M5389
$$ 681531 694704 708523 723023 737764 753466 771739 793377 818741 849375 887215 932604
56139I32604N2647O1429P2685Q4197R3467J00207J03939J02175R3801Q2001P1046
$$ 932604 985251 1046680 1119365 1203562 1297029 1397236 1501175 1603350 1697151 1779152 1850198
56128A850198O2101N4449M8590M5100M2263L7603L0733K2571J3375L623m782j0468
$$ 1850198 1912299 1966748 2015338 2060438 2102701 2140304 2171037 2193608 2206983 2210606 2205824 2195356
56116B195356j4553j8945k4247l0885m0151n2194o4695p5397q4104r0598r2952
$$ 2195356 2180803 2161858 2137611 2106726 2066575 2014381 1949686 1874289 1790185 1699587 1606635
56105A606635r0028q3589p5881o7111n7196m7691l9807l2628k5404j9491j5938
$$ 1606635 1516607 1433018 1357137 1290026 1232830 1185139 1145332 1112704 1087300 1067809 1051871
56094A051871j3382j0473q056o793n160k175L19P36P22K353M715O004O853Q623
$$ 1051871 1038489 1028016 1019960 1013167 1008007 1005832 1006151 1006887 1007609 1009962 1014677 1020681 1027534 1036157
56080A036157J0371J0444R455Q995R041Q953R335J0618J1598J1533J1692J2862
$$ 1036157 1046528 1056972 1066427 1075422 1084463 1093416 1102751 1113369 1124967 1136500 1148192 1161054
56068A161054J3612J3069J2889J4306J5840J6165J6524J7925J8886J8412J8206
$$ 1161054 1174666 1187735 1200624 1214930 1230770 1246935 1263459 1281384 1300270 1318682 1336888
56057A336888J9374K0078J9145J8709K0343K1923K1442K0542K1052K1434K0199
$$ 1336888 1356262 1376340 1395485 1414194 1434537 1456460 1477902 1498444 1519496 1540930 1561129
56046A561129J9343K0691K2181K1649K0997K2725K5438K6778K7582K9331L0752
$$ 1561129 1580472 1601163 1623344 1644993 1665990 1688715 1714153 1740931 1768513 1797844 1828596
56035A828596L0834L1702L4601L6748L6232L6078L9056M2593M3553M3841M6169
$$ 1828596 1859430 1891132 1925733 1962481 1998713 2034791 2073847 2116440 2159993 2203834 2250003
56024B250003M8516M8288M7903N0486N3975N5279N6404O0333O4816O6544O7668
$$ 2250003 2298519 2346807 2394710 2445196 2499171 2554450 2610854 2671187 2736003 2802547 2870215
56013B870215P1698P6702P9217Q1115Q5832R1467R4590R7137J02457J08384J11528
$$ 2870215 2941913 3018615 3097832 3178947 3264779 3356246 3450836 3547973 3650430 3758814 3870342
56002C870342J14527J21497J30146J36198J41592J50447J60822J68697J75968
$$ 3870342 3984869 4106366 4236512 4372710 4514302 4664749 4825571 4994268 5170236
55993E170236J86231J97028K04909K13482K27477K43661K57104K71159K91230
$$ 5170236 5356467 5553495 5758404 5971886 6199363 6443024 6700128 6971287 7262517
55984G262517L14165L34558L55922L84239M16222M46131M78306N20093N68301
$$ 7262517 7576682 7911240 8267162 8651401 9067623 9513754 9992060 10512153 11080454
55975A1080454O16194O67702P30416Q01170Q73990R55534J056266J173448J300546
$$ 11080454 11696648 12364350 13094766 13895936 14769926 15725460 16781726 17955174 19255720
55966A9255720J445969J623812J834412K074953K360933K715397L147439L667245
$$ 19255720 20701689 22325501 24159913 26234866 28595799 31311196 34458635 38125880
55958C8125880M313416N140562O195119P535923R262497J1483426J4270628J7680371
$$ 38125880 42439296 47579858 53774977 61310900 70573397 82056823 96327451 114007822
55950A14007822K1773483K6508646L1568831L6292684L9702072M0520094L7352783
$$ 114007822 135781305 162289951 193858782 230151466 269853538 310373632 347726415
55943C47726415K9342756J7045100K635451j1049246k1924628k9309144l3488324
$$ 347726415 377069171 394114271 396749722 385700476 363775848 334466704 300978380
55936C00978380l4980663l4265845l1898123k8537681k4792355k1095915j7718329
$$ 300978380 265997717 231731872 199833749 171296068 146503713 125407798 107689469
55929A07689469j4799840j2360907j0345467q690259p345958o254228n350365
$$ 107689469 92889629 80528722 70183255 61492996 54147038 47892810 42542445
55922D2542445m592897l963099l437584k986891k597470k269569j994500j755166
$$ 42542445 37949548 33986449 30548865 27561974 24964504 22694935 20700435 18945269
55914A8945269j545875j370645j224063j093104r75527q77958p97667p23687o54185
$$ 18945269 17399394 16028749 14804686 13711582 12736055 11858097 11060430 10336743 9682558
55905I682558n96030n48472n03154m59216m23159l94364l65072l34397l08725
$$ 9682558 9086528 8538056 8034902 7575686 7152527 6758163 6393091 6058694 5749969
55896E749969k88472k67431k45123k27285k13934j98891j81525j67656j58258
$$ 5749969 5461497 5194066 4948943 4721658 4507724 4308833 4127308 3959652 3801394
55887C801394j48067j35947j26215j18999j09222r6224q5196p8173p2278o7422
$$ 3801394 3653327 3517380 3391165 3272166 3162944 3066720 2981524 2903351 2831073 2763651
55877B763651o7060p0408p2227p1225p1091p2738p3073p1876p2265p3782p2397
$$ 2763651 2696591 2626183 2553956 2482731 2411640 2338902 2265829 2193953 2121688 2047906 1975509
55866A975509o8028o4844o3573o0571n5145n0898m8928m6406m2705m0528m0076
$$ 1975509 1907481 1842637 1779064 1718493 1663348 1612450 1563522 1517116 1474411 1433883 1393807
55855A393807l8339l4942l2792l2239l0525k7579k6449k7396k7438k6284k6803
$$ 1393807 1355468 1320526 1287734 1255495 1224970 1197391 1170942 1143546 1116108 1089824 1063021
55844A063021k8937k9071k6354k3997k3287k2000j9607j8539j9068j8318j5663
$$ 1063021 1034084 1005013 978659 954662 931375 909375 889768 871229 852161 833843 818180
55833H18180j3925j4069j3736j2133j1386j1830j0984q482p222q189q890q272
$$ 818180 804255 790186 776450 764317 752931 741101 730117 721635 714413 706224 697334 689062
55821F89062q584j0776j2523j2462j2219j2691j2330j0577r186q772p793o088
$$ 689062 680478 669702 657179 644717 632498 619807 607477 596900 587714 578942 571149 565061
55809E65061n570o320n898l690k043j882j120J262L440M386N526P409Q274P444
$$ 565061 559491 553171 547273 543583 541540 539658 538538 539800 543240 547626 553152 560561 568835 576279
55795E76279O578O259M799J755q49k173l919o716q570q446q001q278q039o933
$$ 576279 582857 589116 593915 595670 594821 592648 588729 582013 573443 564997 556996 548718 540679 533746
55781E33746p034r434j2264j3726j4230j4179j2634r684p191n593k793K176P139
$$ 533746 526712 517278 505014 491288 477058 462879 450245 440561 433370 427777 424984 427160 434299
55768D34299R873J0497R339N443j035p431j1429j3216j3614j2543j0544r342r406
$$ 434299 444172 454669 464008 469451 468416 460985 449556 436340 422726 410183 399639 390297 380891
55755C80891r250q296p992q885r208p848o197n619n431m838m561n012n039l954
$$ 380891 371641 363345 355353 346468 337260 329412 323215 317596 312165 307327 302766 297754 292715 288761
55741B88761k857k633k630k307k144j992q74P00O54j297k735k173j123j327k357
$$ 288761 285904 283271 280641 278334 276190 274198 273324 274024 274678 273381 270646 268473 267350 266023 263666
55726B63666l312m468n787o128n337m969n595n683m443l334l337l092j346R87
$$ 263666 260354 255886 250099 243971 238634 233665 228070 222387 217944 214610 211273 208181 206835 207822
55712B07822K800M574O665P925P668O945O430N078K419K0r12j412k672m117n013
$$ 207822 210622 215196 221861 229786 237454 244399 250829 255907 258326 258346 257434 256022 253350 249233 244220
55697B44220n927p078p304o195n245n347n307m311l552l757l409j444N89J097
$$ 244220 238293 231215 223911 217716 212471 207124 201817 197506 193954 190197 186788 185344 185933 187030
55683A87030J076J990K988K688J952K449L780M353L900L110J908J14j298j470
$$ 187030 188106 190096 193084 195772 197724 200173 203953 208306 212206 215316 217224 217338 216040 214570
55669B14570j172j440j833j575j216j486j771j247m31o4K62J049J687J705J763
$$ 214570 213398 211958 210125 208550 207334 205848 204077 202830 202399 202335 202597 203646 205333 207038 208801
55654B08801K239K295J687J697K853L544K587J339J404J999J525K04q76j832l137
$$ 208801 211040 213335 215022 216719 219572 223116 225703 227042 228446 230445 231970 232174 231298 229466 226329
55639B26329m153m404m920o416p569p154o318o614p213o397m490l072k370j653
$$ 226329 222176 217772 212852 206436 198867 191713 185395 178781 171568 165171 160681 157609 155239 153586
55625A53586j106j204j229n29j47j142k427k447j798j882k220j553n31o89j647
$$ 153586 152480 151276 150047 149518 149371 148229 145802 143355 141557 139675 137455 135902 135371 134682 133035
55610A33035j920j669k033k420j316O30J133k09j515j734j686j902j753j096p45
$$ 133035 131115 129446 127413 124993 123677 124307 125440 125231 123716 121982 120296 118394 116641 115545 114800
55595A14800r16r60p26o21l83M86J244O72p73j364o84Jp2l74n49r28j400j255
$$ 114800 113884 112924 112198 111577 111194 111680 112924 113596 112823 111459 110775 110776 110704 110330 109781 108853 107453 106198
55577A06198m33L70Q30J091R81L86K9N20J091P62J90O71J811K139J633J595K163
$$ 106198 105765 106135 106965 108056 109037 109423 109452 109972 111063 111825 112015 112686 114497 116636 118269 119864 122027
55560A22027K052R33O7J27K21m86j631k542k972k661j455p4M10j5m26m45l99k15
$$ 122027 124079 125012 125079 125206 125427 124941 123310 120768 117796 115135 113680 113606 114016 114001 113575 113130 112731 112516
55542A12516N27J512J946J839J782J734J232O08O05J019J123J110J623K151J518
$$ 112516 113043 114555 116501 118340 120122 121856 123088 123696 124301 125320 126443 127553 129176 131327 132845
55527A32845j39j513k110k539k936k742k039j528j158m04K58j69j272j548q20
$$ 132845 132706 131193 129083 126544 123608 120866 118827 117299 116141 115737 115995 115826 114554 113006 112186
55512A12186m71j100j683j484j094j083j139j038j124j379j289q97p60p53k51
$$ 112186 111715 110615 108932 107448 106354 105271 104132 103094 101970 100591 99302 98405 97645 96892 96641
55497I6641M39L67k60k44M73N77l87j261j274j146j527j913j779j452j172n73
$$ 96641 97080 97447 97187 96943 97416 97993 97606 96345 95071 93925 92398 90485 88706 87254 86082 85509
55481H5509K79O10K55O3M71Q51P61O05O14L95n6j34J97K55K3K67R29R40J56j71
$$ 85509 85788 86398 86653 86716 87187 88038 88799 89404 90018 90413 90357 90223 90420 90675 90698 90965 91894 92834 92990 92819
55461I2819M62Q02r5j344j730j441j193r25m65l15p07q37j79M68L01l9M01J148
$$ 92819 93281 94083 93988 92644 90914 89473 88280 87355 86890 86575 85868 85031 84852 85320 85621 85582 85983 87131
55443H7131J017qq23q61n73m43m00k37JJ36R1P5N16J438J993J328r9q86n25Q5
$$ 87131 88148 88140 87317 86456 85883 85440 85040 84803 84804 84940 85031 85106 85622 87060 89053 90381 90282 89396 88871 88956
55423H8956J45n9o3n3k10j52L44Q34J029J326J925K155J369l4j108j385r89k53
$$ 88956 89101 89042 88979 88926 88716 88564 88908 89742 90771 92097 94022 96177 97546 97512 96404 95019 94030 93777
55405I3777L82N73M42L70K61k85j031j226q00n01n72l19N81J293J014P7o66q79
$$ 93777 94159 94732 95174 95544 95805 95520 94489 93263 92463 91962 91390 91071 91652 92945 93959 94036 93370 92491
55387I2491o91k60J65L31M13P37R40L22p94j133k95N72M83n2k6O40J349J739J692
$$ 92491 91800 91540 91705 92036 92449 93186 94126 94448 93654 92521 92226 92798 93281 93229 93203 93843 95192 96931 98623
55368I8623J077J13o19r69j374j927k110j769j501j614j602j129o63n82o13n57
$$ 98623 99700 99813 99194 98225 96851 94924 92814 91045 89544 87930 86328 85199 84536 83954 83341 82784
55352H2784o98r04m43O77J242N16n31n63L70J275J641J500Q27k25r95j064q55
$$ 82784 82086 81182 80739 81416 82658 83174 82643 82080 82450 83725 85366 86866 87693 87468 86473 85409 84554
55335H4554q42p83l71%j23m32m51l25l23j11O90J641J979J580Q76K41j05l4K05
$$ 84554 83712 82929 82558 82558 82435 82003 81552 81227 80904 80793 81483 83124 85103 86683 87559 87800 87695 87661 87866
55316H7866J79P3N30J389J500M40o50o85j62j22m94m92n7K23J81O4j45m95n60
$$ 87866 88045 88118 88648 90037 91537 91977 91327 90642 90480 90358 89864 89372 89315 89538 89719 89783 89638 89143 88583
55297H8583LP38J049J181J666K169J781L17j393k491k688k149j306o46k64J74
$$ 88583 88586 89324 90373 91554 93220 95389 97170 97487 96094 93603 90915 88766 87460 86814 86550 86724
55281H6724P46J027Q27O89J041J461J318O81L6m39q23j044j051r93q41l23M25
$$ 86724 87470 88497 89324 90013 91054 92515 93833 94514 94550 94111 93288 92244 91193 90200 89359 89036 89461
55264H9461P46L73j55l26k50o8L98R79J041N66L69O78N56m44j187o15M92O31k20
$$ 89461 90207 90580 90425 90099 89849 89781 90179 91158 92199 92765 93134 93812 94368 93924 92737 92122 92614 93245 93025
55245I3025q10n46K0K76K7p82j866k357j739o84k07k83j86K76O60P89Q42Q01N57
$$ 93025 92215 91669 91689 91965 91992 91210 89344 86987 85248 84564 84357 84074 83888 84164 84824 85613 86455 87256 87813
55226H7813L26K80J59j44j09O01J347J376R42P34P13M02p1k37j75k69l74r1M61
$$ 87813 88139 88419 88578 88434 88325 88926 90273 91649 92591 93325 94038 94440 94369 94132 93957 93688 93314 93223 93684
55207I3684R03J216J394J007k7q10n73O8O1m11l43L16N45j31j034j355j025n04
$$ 93684 94587 95803 97197 98204 98177 97367 96794 96862 96923 96512 96169 96485 97030 96899 95865 94510 93485 92981
55189I2981l57r00j694j663l45J385K303K139J315J88p66q21l7L74l58j289j193
$$ 92981 92624 91724 90030 88367 88022 89407 91710 93849 95164 95352 94586 93765 93728 94102 93744 92455 91262
55172I1262l63K11O11J372J909J259m4n32l3L35J84K03O04Q02P12Q62J120P41
$$ 91262 90899 91110 91721 93093 95002 96261 96217 95685 95652 95987 96171 96374 96978 97780 98492 99354 100474 101215
55154A01215j46o18n56p35j186j067l23J6l44m04L65J092R87N00L03K41k5k49
$$ 101215 101069 100451 99895 99160 97974 96907 96584 96600 96256 95852 96217 97309 98296 98796 99099 99340 99315 99066
55136I9066j12K21N20O98M79l07r77o38K79L39p28j497r85j0K79J18M07J140J522
$$ 99066 98954 99175 99695 100393 100872 100565 99588 98950 99229 99568 98840 97343 96358 96348 96627 96745 97152 98292 99814
55117I9814J104J53p39r57k80O39P16k52j276j391o77K22Q75J109Q33J73n79j220
$$ 99814 100918 101071 100332 99375 99095 99734 100450 100198 98922 97531 96854 97076 97951 99060 99893 100066 99487 98267
55099I8267j493r58L67J550J762J449J502J638Q88m41r34k57L49J13k47r4N4k47
$$ 98267 96774 95816 96183 97733 99495 100944 102446 104084 104972 104531 103597 103340 103689 103802 103555 103461 103515 103268
55081A03268m29o5K76K19M76J543K471K064O17n70q39n03o5J37m3k55J23J005
$$ 103268 102839 102774 103050 103269 103745 105288 107759 109823 110440 109870 109031 108528 108463 108600 108557 108302 108425 109430
55063A09430J448R97L95L92O30M40K8J3L28L42k26j163k136k729k553j752r91
$$ 109430 110878 111875 112270 112662 113292 113732 113760 113773 114101 114443 114217 113054 110918 108189 105636 103884 102893
55046A02893n46L8J012J833J891J245K33r36j843j884j147n62o23p28l04K59M21
$$ 102893 102347 102385 103397 105230 107121 108366 108599 107663 105820 103936 102789 102227 101604 100876 100572 100831 101252
55029A01252M26O42P14K48k99j94N07J142J260P42l33j387j494m45R06J790K296
$$ 101252 101678 102320 103034 103282 102983 102789 103296 104438 105698 106440 106107 104720 103226 102781 103687 105477 107773
55012A07773K543K036O40p06j129r86j009j033n77oK9j99M0O70J008R47R35J104
$$ 107773 110316 112352 112992 112286 111157 110171 109162 108129 107552 107546 107575 107376 107416 108086 109094 110041 110976 112080
54994A12080J249J465J898K158J780J037M85J02l50n38p0N47N01j00m91m94n29
$$ 112080 113329 114794 116692 118850 120630 121667 122152 122254 121904 121366 121296 121843 122344 122244 121753 121259 120730
54977A20730n80k88J36J12j68O5Q09J069K99q42j369r54J06J234J750J311L23
$$ 120730 120150 119862 119998 120110 119942 120007 120816 121885 122184 121342 119973 119019 119125 120359 122109 123420 123743
54960A23743n33j116j628j795j147l0N17J36m26m40l2M04Q70J462J860J688J086
$$ 123743 123210 122094 120466 118671 117524 117494 118011 118147 117721 117281 117249 117653 118523 119985 121845 123533 124619
54943A24619N94N72R41J295J192M40p34j867k491k241j086M01J313J306R62R38
$$ 124619 125213 125785 126726 128021 129213 129653 128919 127052 124561 122320 121234 121635 122948 124254 125216 126154
54927A26154J103R65O12N89J057J616K014K478L339M654O135P191P241O291N001
$$ 126154 127257 128222 128834 129423 130480 132096 134110 136588 139927 144581 150716 157907 165148 171439 176440
54912A76440L877K711J108p78k513l979n170n760n517m892m591m656m570m052
$$ 176440 180317 183028 184136 183358 180845 176866 171696 165936 160419 155527 150936 146280 141710 137658
54898A37658l185k071r49m04p46j316j140j97O35Q20O22M05K08J27M23J031J515
$$ 137658 134473 132402 131453 131049 130303 128987 127847 127650 128285 129105 129727 130132 130340 130467 130890 131921 133436
54881A33436J646J620J643J744K030K666L565M506N482O510P138O718N216L246
$$ 133436 135082 136702 138345 140089 142119 144785 148350 152856 158338 164848 171986 178704 183920 187166
54867A87166J268p55k852m639n644n745n214m513l979l585l089k564k419k684
$$ 187166 188434 187679 184827 180188 174544 168799 163585 159072 155093 151508 148419 145855 143436 140752
54853A40752k774k376j992k119k356k100j617j509j561j129m49l82q90r45j65
$$ 140752 137978 135602 133610 131491 129135 127035 125418 123909 122348 121219 120770 120388 119498 118553 118388
54838A18388N34M13j9K2L32J76n03j075j222j321j783k351k262j074O34J643J319
$$ 118388 118922 119335 119316 119338 119670 119846 119343 118268 117046 115725 113942 111591 109329 108255 108889 110532 111851
54821A11851K48m65l01N65J761K758K793J585Ko80k21M93P09M71J05k21k69J65
$$ 111851 112099 111634 111333 111898 113659 116417 119210 120795 120797 120117 119896 120389 121098 121569 121674 121453 121184 121349
54803A21349P26P14O6m66l23J78M03J86j49j80L50J275J932J690O81l52q86r15
$$ 121349 122075 122789 122855 122389 122066 122244 122647 122833 122684 122504 122854 124129 126061 127751 128432 128080 127194 126279
54785A26279n68N7O84R98J005Q65N17j4k06L68J213J457J135J065J499J780J556
$$ 126279 125711 125768 126452 127450 128455 129320 129837 129823 129617 129985 131198 132655 133790 134855 136354 138134 139690
54768A39690J431K095L500N111O339O671O080N449N656O189N614L589J328k42
$$ 139690 141121 143216 146716 151827 158166 164837 170917 176366 182022 188211 193825 197414 198742 198500
54754A98500j635l458n106n731n649n716n865n338m065k868k323k153j787j019
$$ 198500 196865 193407 188301 182570 176921 171205 165340 160002 155937 153069 150746 148593 146806 145787
54740A45787j27L75J55n77j303j831k288k492j941o87N01J153J660K354K833K749
$$ 145787 145660 146035 146190 145613 144310 142479 140191 137699 135758 135071 135572 136725 138385 140739 143572 146321
54724A46321K596K962L561L842L992M540N273N506N144M633L969K668P50j067
$$ 146321 148917 151879 155440 159282 163274 167814 173087 178593 183737 188370 192339 195007 195757 194690
54710A94690k316l273m355n491o239o178n178l680k582k399k584k189j135l04
$$ 194690 192374 189101 184746 179255 173016 166838 161660 157980 155398 152999 150415 148226 147091 146787
54696A46787l42r34j425j620j711j805j850j791j584j198p38l71r9K62P26R84
$$ 146787 146445 145511 144086 142466 140755 138950 137100 135309 133725 132527 131789 131418 131319 131581 132307 133291
54680A33291P06n7q34j117p60j01L35L22O8j16j58j74k21k48k04j07J0J34L70
$$ 133291 133997 133940 133106 131989 131229 131128 131463 131785 131853 131737 131579 131405 131184 130936 130732 130625 130635 130769 131139
54661A31139Q24J316J256K60j104j660r37K62Q47O38J88k06o89j220j365q62j2
$$ 131139 131963 133279 134535 134795 133691 132031 131094 131356 132203 132841 133029 132823 132134 130914 129549 128687 128675
54644A28675P13J141J352J378J133N91q3n52n42r3L75M01r0o85q55m02L44P68
$$ 128675 129388 130529 131881 133259 134392 134983 134900 134348 133806 133713 134088 134489 134399 133714 132859 132457 132801 133569
54626A33569N32lo0O69J490J324n2j539j796p19M11M14m15q01j58P38R05L86k2
$$ 133569 134101 134098 134038 134707 136197 137521 137469 135930 134134 133415 133826 134240 133825 133024 132866 133604 134509 134895 134873
54607A34873Q0L94N24M26K02o7k63k64q2K20N48N92p3j264j955j310K31J488J918
$$ 134873 134953 135347 135871 136297 136499 136432 136169 135905 135823 136043 136591 137183 137110 135846 133891 132581 132812 134300 136218
54588A36218J840J502Q04o1n83p50j026j362j072j03N12K7q72r79j50P28R65O62
$$ 136218 138058 139560 140364 140303 139720 138970 137944 136582 135510 135407 135919 135946 135074 134095 133945 134673 135638 136300
54570A36300K31m8j01n4j41m04o41p61q35p04l5R54J411Q86L4k89j49k00n87q49
$$ 136300 136531 136483 136382 136328 136187 135783 135142 134381 133546 132842 132807 133761 135172 136058 136092 135803 135654 135454 134867 134018
54550A34018p54m75m7P93J948K781K721J873Q37Q0l22m30j30P26J821K329J725
$$ 134018 133264 132789 132742 133535 135483 138264 140985 142858 143695 143775 143453 143023 142893 143619 145440 147769 149494
54533A49494M30o62j223j500j471p67L88J000N05m03o78j66N40J059J366J344
$$ 149494 149924 149262 148039 146539 145068 144301 144689 145689 146194 145791 145113 144947 145487 146546 147912 149256
54517A49256P61k94j338j888j744j118n51m87p61q67p04o00m89Q8J015J371P93
$$ 149256 150017 149723 148385 146497 144753 143635 143084 142597 141836 140969 140265 139665 139176 139264 140279 141650 142443
54500A42443J40J91M33K1p02p48n3N29O54P47R12O64n1n51m56k38l74o46o53m44
$$ 142443 142583 142774 143207 143228 142526 141778 141725 142254 142908 143655 144567 145231 145180 144629 144173 143935 143561 142915 142262 141818
54480A41818j85K80J086J838J980J496R06N68L37o6n71p88m71K25R72J596K053
$$ 141818 141633 141913 142999 144837 146817 148313 149219 149787 150124 150058 149487 148699 148228 148453 149425 151021 153074
54463A53074K229K071J794J651J475Q94oo41p32o59q49j178j261r26k49N45R98
$$ 153074 155303 157374 159168 160819 162294 163188 163182 162541 161809 161150 160301 159123 157862 156936 156687 157232 158230
54446A58230O30m78j672k367k382j653l06Q72R41K4p40p85p46j085j184n04L63
$$ 158230 158860 158382 156710 154343 151961 150308 150002 150874 151815 151839 151099 150314 149568 148483 147299 146795 147158
54429A47158P29R87J721K357J947O67n35j287j605j041O33K282K428J240K28P6
$$ 147158 147887 148874 150595 152952 154899 155566 155031 153744 152139 151098 151731 154013 156441 157681 157909 157985
54413A57985J92J97L38L72l31j332j298m7R50P18K0j92j85m23l42O32J769J975
$$ 157985 158177 158374 158712 159084 158753 157421 156123 156076 157026 157744 157764 157572 157387 156964 156622 157254 159023 160998
54395A60998J493J475K184K601J827R6j589k340j873o03O50J289J272R32O72P52
$$ 160998 162491 163966 166150 168751 170578 170674 169085 166745 164872 164269 164919 166208 167480 168412 169084 169836
54379A69836R67O23o46k077k438j588n87j72M6N03P68L30l75m78J71R97J533J704
$$ 169836 170803 171426 170780 168703 166265 164677 164090 163918 163964 164467 165235 165565 165190 164712 164883 165880 167413 169117
54361A69117J564J253J012R82J073J265J650K072K184K046K099K397K373J760
$$ 169117 170681 171934 172946 173928 175001 176266 177916 179988 182172 184218 186317 188714 191087 192847
54347A92847J037O04J77m93r66q61o94j145j928k230k030k118k873l707l866l238
$$ 192847 193884 194488 194665 194172 193206 192345 191651 190506 188578 186348 184318 182200 179327 175620 171754 168516
54331A68516k255j400q89n93k49J05L6o26j333j345n71L88R07P62Q1p80j355j376
$$ 168516 166261 164861 163972 163379 163130 163235 163271 162645 161312 159967 159396 159784 160691 161453 161534 160754 159399 158023
54313A58023r61m06K0R5k63p17o98j25M10L77r1n95j045j440j488r62j46M94R14
$$ 158023 157062 156656 156676 156771 156508 155791 155093 154968 155378 155755 155664 155069 154024 152584 151096 150134 149988 150482 151396
54294A51396J314J552J222L23n95r13m70L51Q87P41K52J32N38Q74P21M22M13M85
$$ 151396 152710 154262 155484 155807 155212 154299 153829 154180 155067 155808 156060 156192 156730 157604 158325 158747 159160 159645
54276A59645K66l3J7K61K59O7K2l1n09j146j142l67L99O81R69J736K440K254J358
$$ 159645 159911 159878 159895 160156 160415 160482 160504 160473 159964 158818 157676 157309 157708 158389 159358 161094 163534 165788 167146
54257A67146Q29J189J698J324N6j086j232n37K04N12N54O38P41O10J06o68j398
$$ 167146 167975 169164 170862 172186 172242 171156 169924 169387 169591 170103 170657 171295 172036 172646 172752 172084 170686
54240A70686j725j577j344j439j615j170mR39O81n55j523j321l12L96J51n63p30
$$ 170686 168961 167384 166040 164601 162986 161816 161812 162751 163432 162877 161354 160033 159721 160117 160268 159705 158975
54223A58975PR38J241J029R28R48M96l71p13k5R11J110O14R9j93m04l69J58Q41
$$ 158975 158982 159920 161161 162190 163118 164066 164562 164191 163478 163453 164364 165474 166088 166187 165994 165590 165221 165379 166220
54204A66220J066P30J89l95r47j014k12R09J220L23j073k121k500k131j053K33
$$ 166220 167286 168016 168205 167810 166863 165849 165637 166546 167766 168089 167016 164895 162395 160264 159211 159444
54188A59444R47Q83N71M29K67j13m34m11k28j28l2R5j06q23j487j304k84P77J232
$$ 159444 160391 161274 161845 162274 162541 162428 161994 161583 161355 161227 161195 161290 161184 160361 158874 157570 157286 158063 159295
54169A59295J083N95r1p96j171j013n71l26n01r31j315j457j302r09m43k0M45
$$ 159295 160378 160973 160882 160086 158915 157902 157331 157005 156504 155573 154258 152801 151499 150590 150147 150127 150572
54152A50572J086J713J797J075K2n38l05K42M66J90k87n76m54L6O28J015J061
$$ 150572 151658 153371 155168 156243 156265 155727 155422 155664 156130 156320 156033 155457 155003 155039 155667 156682 157743
54135A57743P89K67l40p43p99o90n70k22N16J186J167O58N86J328K174K291J670
$$ 157743 158532 158799 158459 157716 156917 156227 155657 155435 155951 157137 158304 158962 159548 160876 163050 165341 167011
54118A67011Q46K40R9N35J224J509J175O99M37J57k54l64N2M30L37K88Q25J375
$$ 167011 167857 168097 168196 168731 169955 171464 172639 173338 173775 173932 173678 173314 173366 173796 174133 174421 175246 176621
54100A76621J010m8p56r22j335k241k791k274j022L01J464K309K349J392J74k36
$$ 176621 177631 177583 176827 175905 174570 172329 169538 167264 166242 166543 168007 170316 172665 174057 174231 173995
54084A73995M81J649K329K121J401R14J049J542J932K114K218K235K212K626L956
$$ 173995 174476 176125 178454 180575 181976 182890 183939 185481 187413 189527 191745 193980 196192 198818 202774
54069B02774N909P566Q348Q371P882O849N227L171Q38j659l967n560o169o013
$$ 202774 208683 216249 224597 232968 240850 247699 252926 256097 256935 255276 251309 245749 239580 233567
54055B33567n520n048m687m159l112j818j178j565k125j845r49l75j64M87J670
$$ 233567 228047 222999 218312 214153 211041 209223 208045 206480 204355 202510 201561 201186 201022 201509 203179
54040B03179K416K273K095K749L914M804N341N934O579O888O699O206N665N249
$$ 203179 205595 207868 209963 212712 216626 221430 226771 232705 239284 246172 252871 259077 264742 269991
54026B69991M934M366L199J735P16L11l1n11m74M86J624J857J064n7r93j740k424
$$ 269991 274925 279291 282490 284225 284941 285252 285221 284710 284236 284722 286346 288203 289267 289210 288217 286477 284053
54009B84053l174m107m992n242m658l821l292k857k094j258r13j048j180j058
$$ 284053 280879 276772 271780 266538 261880 258059 254767 251910 249816 248558 247645 246597 245417 244359
53995B44359n91N34K340L859L923K608J090N6p95j593j756j119p28j636l395m535
$$ 244359 243768 244302 246642 250501 254424 257032 258122 258178 257383 255790 254034 252915 252187 250551 247156 242621
53979B42621m338l435k747k508k494k614k872l022k687j876j051o30n51m86l07
$$ 242621 238283 234848 232101 229593 227099 224485 221613 218591 215904 214028 212977 212347 211796 211310 211003
53964B11003j62j22j0L55R15J429J685J648J491J461J557J455R63M85O19J307
$$ 211003 210841 210719 210709 211064 211979 213408 215093 216741 218232 219693 221250 222705 223668 224153 224772 226079
53948B26079J836J846J834K328L061L423L409L496L754L791L580L772M800O092
$$ 226079 227915 229761 231595 233923 236984 240407 243816 247312 251066 254857 258437 262209 267009 273101
53934B73101O583N905M731L956L784L812L796L984M569N245N698O332P899J0387
$$ 273101 279684 285589 290320 294276 298060 301872 305668 309652 314221 319466 325164 331496 339395 349782
53920C49782J2919J4963J6931J8979J9829J7743J2638O474J385j959m040n303
$$ 349782 362701 377664 394595 413574 433403 451146 463784 470258 471643 469684 465644 460341
53908D60341n869n935n831n693n444n125m925m938n092n365n758o013n731m925
$$ 460341 454472 448537 442706 437013 431569 426444 421519 416581 411489 406124 400366 394353 388622 383697
53894C83697m270m393n082n551n493n429n803o213o005n338n083n659o524o927
$$ 383697 379427 375034 369952 364401 358908 353479 347676 341463 335458 330120 325037 319378 312854 305927
53880C05927o691o078n279m352l482k909k710k820l101l257k964k315j922k306
$$ 305927 299236 293158 287879 283527 280045 277136 274426 271606 268505 265248 262284 259969 258047 255741
53866B55741l239l980m078l690l220k886k671k404j895j101k97Q6k06r72j647
$$ 255741 252502 248522 244444 240754 237534 234648 231977 229573 227678 226577 226280 226366 226160 225188 223541
53851B23541j714j227q69j320k405l149k824j714p13k51kM66J025J144O42N2P2
$$ 223541 221827 220600 219731 218411 216006 212857 210033 208319 207606 207355 207353 207819 208844 209988 210630 210682 210754
53834B10754O58R45K77q79j453j102n12l42m20k53J67N23P76J166J691K036J934
$$ 210754 211412 212357 212634 211755 210302 209200 208688 208346 207926 207673 207840 208363 209139 210305 211996 214032 215966
53817B15966J394O54P1n6J69K91J03M0O38J817K965L608L660L309K984L305M514
$$ 215966 217360 218014 218085 218029 218198 218489 218592 218632 219270 221087 224052 227660 231320 234629 237613 240918 245432
53800B45432N985O739O472N686M845L912K838K036J969K527L090L121K535J657
$$ 245432 251417 258156 264628 270314 275159 279071 281909 283945 285914 288441 291531 294652 297187 298844
53786B98844R54P20Q44R16O37J07m22q84j398j988k544l058l715m604n392n577
$$ 298844 299798 300518 301362 302278 302915 303022 302600 301716 300318 298330 295786 292728 289013 284409 279017 273440
53770B73440n060m267l622l140k734k624k959l249k778j678j043j604k743l186
$$ 273440 268380 264113 260491 257351 254617 251993 249034 245785 243007 241329 240286 238682 235939 232753
53756B32753k451j247n93r17j878k723k805k047r44n7M16N37L56o7m90o08l15
$$ 232753 230302 229055 228462 227545 225667 222944 220139 218092 217148 217091 217507 218044 218400 218333 217843 217235 216920
53739B16920K36O95P47M49L53Q54J428J090j26q22J05J949K956K338Q50l10n08
$$ 216920 217156 217851 218598 219047 219400 220254 221682 222772 222646 221824 221929 223878 226834 229172 230022 229712 229204
53722B29204K64J557K573K716K161J592J361J346J468J772K003J734J068O75R51
$$ 229204 229468 231025 233598 236314 238475 240067 241428 242774 244242 246014 248017 249751 250819 251494 252445
53707B52445J577K071K299K294K046J734J725K089K416K343K006J785J910K440
$$ 252445 254022 256093 258392 260686 262732 264466 266191 268280 270696 273039 275045 276830 278740 281180
53693B81180L241L901M013L723L552L543L044J698J29p79r20q05o77l77P2K96
$$ 281180 284421 288322 292335 296058 299610 303153 306197 307895 308024 307245 306325 305520 304843 304466 304538 304834
53677C04834N3m87j070j604j997k037j625j005o03o23q54r18p24o17r32j460j591
$$ 304834 304887 304400 303330 301726 299729 297692 296067 295062 294459 293836 292982 292064 291340 290723 289791 288331 286740
53660B86740j050k84Q4k0j54n2Q7m5l85o00n48m19l42p6O45J519J834J357P46
$$ 286740 285690 285406 285490 285470 285316 285264 285351 285306 284921 284321 283773 283354 283012 282936 283581 285100 286934 288291 289037
53641B89037O97J024J043O79N89J114J792K107K143K172K085J746J547J941K612
$$ 289037 289734 290758 291801 292480 293069 294183 295975 298082 300225 302397 304482 306228 307775 309716 312328
53626C12328K745K152J591J741K291K460K089J783J998K455K695K836L371M277
$$ 312328 315073 317225 318816 320557 322848 325308 327397 329180 331178 333633 336328 339164 342535 346812
53612C46812M877M773M478M681N177N130M365L817M377N734O729O699O028N499
$$ 346812 351689 356462 360940 365621 370798 375928 380293 384110 388487 394221 400950 407649 413677 419176
53598D19176N421N495N292M649L617K215M30j519l093l854l901l708l587l483
$$ 419176 424597 430092 435384 440033 443650 445865 446295 444776 441683 437829 433928 430220 426633 423150
53584D23150l267l003k920l184l708m079l825k923j970j532j509j497j522j889
$$ 423150 419883 416880 413960 410776 407068 402989 399164 396241 394271 392739 391230 389733 388211 386322
53570C86322k370k274j443n66k09j78j41k44n92o37J44J297J858J581J063P06
$$ 386322 383952 381678 380235 379669 379460 379282 379141 378897 378305 377668 377812 379109 380967 382548 383611 384317
53554C84317L49j5O4Q24J804K437K658K666K432J884J344J288J781K443K950L311
$$ 384317 384666 384651 384715 385539 387343 389780 392438 395104 397536 399420 400764 402052 403833 406276 409226 412537
53538D12537L728M376N316O330O857O517N750N650O815Q599R858J0248J0404J0835
$$ 412537 416265 420641 425957 432287 439144 445661 451411 457061 463876 472475 482333 492581 502985 513820
53524E13820J1274J1368J1515J2409J3949J5249J5756J5826J6058J6597J7419
$$ 513820 525094 536462 547977 560386 574335 589584 605340 621166 637224 653821 671240
53513F71240J8735K0648K2662K4075K4766K5165K5573K5932K6207K6454K6475
$$ 671240 689975 710623 733285 757360 782126 807291 832864 858796 885003 911457 937932
53502I37932K5933K5010K4439K4570K4795K4290K2980K1365J9737J8181J7185
$$ 937932 963865 988875 1013314 1037884 1062679 1086969 1109949 1131314 1151051 1169232 1186417
53491A186417J7440J8841K0272K0792K0578K0314K0071J9356J8133J7101J6908
$$ 1186417 1203857 1222698 1242970 1263762 1284340 1304654 1324725 1344081 1362214 1379315 1396223
53480A396223J7508J8324J8737J8313J6958J4993J2814J0381P397L998Q67j533
$$ 1396223 1413731 1432055 1450792 1469105 1486063 1501056 1513870 1524251 1531648 1535646 1536513 1534980
53468A534980l459n388p485r763j2273j4652j5987j5829j5123j5386j6982j8758
$$ 1534980 1531521 1526133 1518648 1508885 1496612 1481960 1465973 1450144 1435021 1419635 1402653 1383895
53456A383895j9522j9308j9087j9618k0843k2056k2530k2175k1613k1439k1507
$$ 1383895 1364373 1345065 1325978 1306360 1285517 1263461 1240931 1218756 1197143 1175704 1154197
53445A154197k1233k0454j9530j8597j7349j5666j3855j2085j0052p569n041l064
$$ 1154197 1132964 1112510 1092980 1074383 1057034 1041368 1027513 1015428 1005376 997807 992766 989702
53433I89702j820j147q59o13J60J792L915N813P134Q047Q922J0081J1690J3617
$$ 989702 987882 986735 985876 985263 985423 987215 991130 996943 1004077 1012124 1021046 1031127 1042817 1056434
53419A056434J5458J6930J8128J9339K0732K2344K4115K5796K7121K8255K9748
$$ 1056434 1071892 1088822 1106950 1126289 1147021 1169365 1193480 1219276 1246397 1274652 1304400
53408A304400L1788L3773L5058L5867L7131L9405M2307M4899M6494M7223M7998
$$ 1304400 1336188 1369961 1405019 1440886 1478017 1517422 1559729 1604628 1651122 1698345 1746343
53397A746343M9777N2575N5365N7139N7843N8091N8330N8675N9175N9712N9741
$$ 1746343 1796120 1848695 1904060 1961199 2019042 2077133 2135463 2194138 2253313 2313025 2372766
53386B372766N8728N6726N4193N1397M8433M5714M3659M1831L9078L4816K9747
$$ 2372766 2431494 2488220 2542413 2593810 2642243 2687957 2731616 2773447 2812525 2847341 2877088
53375B877088K4963K0736J6565J2074P362K581k512q433j5521k3501l1480l8491
$$ 2877088 2902051 2922787 2939352 2951426 2958788 2961369 2958857 2950424 2934903 2911402 2879922 2841431
53363B841431m4207m9011n3340n7111n9868o1343o1636o1037n9934n8764n7758
$$ 2841431 2797224 2748213 2694873 2637762 2577894 2516551 2454915 2393878 2333944 2275180 2217422
53352B217422n6632n4785n1983m8736m5871m3915m3008m3143m4036m4805m4411
$$ 2217422 2160790 2106005 2054022 2005286 1959415 1915500 1872492 1829349 1785313 1740508 1696097
53341A696097m2773m1036m0188l9665l7950l4500l0392k6923k4240k1765j9344
$$ 1696097 1653324 1612288 1572100 1532435 1494485 1459985 1429593 1402670 1378430 1356665 1337321
53330A337321j7309j5725j4282j2900j1922j1608j1821j2259j2669j2846j2665
$$ 1337321 1320012 1304287 1290005 1277105 1265183 1253575 1241754 1229495 1216826 1203980 1191315
53319A191315j2213j1605j0673r158p191n304l805k440q19J042K710L793M243
$$ 1191315 1179102 1167497 1156824 1147666 1140475 1135171 1131366 1128926 1128107 1129149 1131859 1135652 1139895
53306A139895M349M521N065O092P612R577J1807J4068J6321J8712K1103K2882
$$ 1139895 1144244 1148765 1153830 1159922 1167534 1177111 1188918 1202986 1219307 1238019 1259122 1282004
53294A282004K3691K4148K5366K7667L0151L1742L2183L1832L0905K9333K7163
$$ 1282004 1305695 1329843 1355209 1382876 1413027 1444769 1476952 1508784 1539689 1569022 1596185
53283A596185K4660K2038J9450J7141J5279J3509J1043P423L036j301n093q325
$$ 1596185 1620845 1642883 1662333 1679474 1694753 1708262 1719305 1726728 1729764 1728463 1723370 1715045
53271A715045j1092j3470j5716j8114k0452k2116k3021k4038k6002k8550l0562
$$ 1715045 1703953 1690483 1674767 1656653 1636201 1614085 1591064 1567026 1541024 1512474 1481912
53260A481912l1560l1967l2087l1774l1257l1349l2173l2569l1628l0181k9731
$$ 1481912 1450352 1418385 1386298 1354524 1323267 1291918 1259745 1227176 1195548 1165367 1135636
53249A135636l0302l0454k9439k8098k7383k7085k6569k5906k5467k5000k3923
$$ 1135636 1105334 1074880 1045441 1017343 989960 962875 936306 910400 884933 859933 836010
53238H36010k2291k0745j9603j8642j7672j6747j5758j4379j2608j0921r678q755
$$ 836010 813719 792974 773371 754729 737057 720310 704552 690173 677565 666644 656966 648211
53226F48211q025p746q091q627q758q675r260j0847j2562j3251j2799j2090j1813
$$ 648211 640186 632440 624349 615722 606964 598289 589029 578182 565620 552369 539570 527480 515667
53213E15667j1782j1453j0724r964r573r654r974j0038r409q118o690n713n440
$$ 515667 503885 492432 481708 471744 462171 452517 442543 432505 423096 414978 408288 402575 397135
53200C97135n793o450o908o777o201n697n494n331n071n030n365n596n169m234
$$ 397135 391342 384892 377984 371207 365006 359309 353815 348484 343413 338383 333018 327422 322253 318019
53186C18019l404k981k851k872k850k371j297k32N2l31n96m92n77j195j877k103
$$ 318019 314615 311634 308783 305911 303061 300690 299393 299161 299213 298882 298286 297794 297217 296022 294145 292042
53170B92042k025k023k007j671j141r25j274j847k022j481o13k90j003k222k881
$$ 292042 290017 287994 285987 284316 283175 282250 280976 279129 277107 275626 275013 274723 273720 271498 268617
53155B68617k527j625p94k73j38m46q68p93j20M29J98o05j323j643j558r85nQ21
$$ 268617 266090 264465 263671 263398 263260 262814 261946 261153 261033 261462 261660 261055 259732 258089 256531 255546 255541 256362
53137B56362R59O09M20O25R41J186J391J401R62L32J96P28J281J221P08L03J97
$$ 256362 257321 257930 258350 258975 259916 261102 262493 263894 264856 265188 265384 266112 267393 268614 269322 269625 269822
53120B69822K47N37J296K318K857K372J148j8n75n53k80j08l05r23j596j776j400
$$ 269822 270069 270606 271902 274220 277077 279449 280597 280579 280004 279451 279171 279063 278758 277835 276239 274463 273063
53103B73063j134j595k479k840k267j357q74q43p85n40m39p07j112j234r09l04
$$ 273063 271929 270334 267855 265015 262748 261391 260517 259674 258889 258349 257910 257203 256091 254857 253948 253644
53087B53644K85O26O74N52L89K10%k30m46o24o98n85l36j85l24o58q60o67p7O29
$$ 253644 253929 254555 255229 255781 256170 256380 256380 256150 255704 255080 254382 253797 253461 253276 252952 252294 251434 250767 250690 251319
53067B51319R76N98l24j074j018l34J35j69r08j307j129q41q12p46k13M97N76
$$ 251319 252295 252893 252569 251495 250477 250143 250278 250109 249201 247894 246765 245924 245112 244366 244153 244650 245226
53050B45226j31p40m27M37Q25M56J6j9q5p27j593j811j129k17K43K91L89O45O62
$$ 245226 245095 244355 243928 244365 245190 245646 245662 245643 245558 244831 243238 241427 240298 240081 240324 240615 241004 241649 242311
53031B42311J48n86r15o52k80l11n95n41O9P46R16O26M53P82J328J387N72o63
$$ 242311 242459 241873 240958 240306 240026 239715 239120 238579 238648 239394 240310 240936 241389 242171 243499 244886 245458 244795
53013B44795j288o33R35K282K478J525K53l58Q5J072J667J380N65j35n28q63j297
$$ 244795 243507 242874 243809 246091 248569 250094 250347 249989 250074 251146 252813 254193 254758 254623 254095 253232 251935
52996B51935j677j786j502q14M5N75M56l8l92n20p08r55q72j97Q85K013K855L122
$$ 251935 250258 248472 246970 246156 246201 246776 247232 247194 246802 246282 245574 244619 243747 243550 244435 246448 249303 252425
52978B52425K801K326K120K004J571J022R84J500J910J836J562J297Q48L00K07
$$ 252425 255226 257552 259672 261676 263247 264269 265253 266753 268663 270499 272061 273358 274206 274506 274713
52963B74713O61R30M94k15n94p00p49n35q1j58j231k413k513j710j180j334j527
$$ 274713 275374 276304 276798 276583 275989 275289 274540 274005 273924 273766 272535 270122 267609 265899 264719 263385 261858
52946B61858j430j470j735j531n16N36O45k18j287j924j977j586j016n19r1M38
$$ 261858 260428 258958 257223 255692 255176 255712 256357 256139 254852 252928 250951 249365 248349 247830 247739 248177
52930B48177R80J152P63J00m54q26j108j248j046m37L60R70J147J012Q66P76M97
$$ 248177 249157 250309 251072 251172 250718 249892 248784 247536 246490 246053 246413 247383 248530 249542 250408 251184 251681
52913B51681l4m19k76K22N64M75Q1l50n30k99J20K74J27Q6J57l08j423k107j411
$$ 251681 251647 251228 250952 251174 251738 252213 252294 251944 251414 251115 251235 251509 251636 251722 251879 251571 250148 248041 246630
52894B46630j0O81M74K75L68K20l7M92J703K141J098k23n42l14o21j198r92r4
$$ 246630 246620 247301 247775 248050 248418 248638 248601 249093 250796 252937 254035 253812 253270 252956 252335 251137 250145 250051
52876B50051L66N5j03N26J346J514J090P63R25J404J815J933J838J726J600J212
$$ 250051 250417 250472 250369 250895 252241 253755 254845 255608 256533 257937 259752 261685 263523 265249 266849 268061
52860B68061N34m1k02j40j10N1M86O99R2j085k001k427k880l503l638k911k008
$$ 268061 268595 268554 268352 268212 268102 268153 268639 269338 269430 268345 266344 263917 261037 257534 253896 250985 248977
52843B48977j809k232k453k027j263o94n94r21j330j333q06k13k6m2L05R84J258
$$ 248977 247168 244936 242483 240456 239193 238499 237905 236984 235654 234321 233515 233302 233276 233234 233539 234523 235781
52826B35781O85k01n19m0O98J061Q25J74m42n80j98K30K69O6R4M40Q04J091J502
$$ 235781 236466 236265 235746 235706 236404 237465 238290 238464 238022 237442 237244 237474 237743 237809 237903 238343 239147 240238 241740
52807B41740K011K254K113J859J553Q21m22j581k126k258k286j990j287j011j985
$$ 241740 243751 246005 248118 249977 251530 252351 251929 250348 248222 245964 243678 241688 240401 239390 237405
52792B37405l500l847k501p80p5l31p23r12r42n84L76J481J965J664J090P25O63
$$ 237405 233905 230058 227557 226777 226702 226371 225648 224736 223794 223210 223586 225067 227032 228696 229786 230511 231174
52775B31174Q50J197J545J739J733J481R42L39P0J15n9p21j375j501j358j491
$$ 231174 232024 233221 234766 236505 238238 239719 240661 241000 241070 241185 241126 240405 239030 237529 236171 234680
52759B34680j740j462o24N4R5j44o8M38J011J156O61q0j83P90K109K590K087J581
$$ 234680 232940 231478 230854 230908 231003 230859 230791 231229 232240 233396 234057 233977 233794 234584 236693 239283 241370 242951
52741B42951J705J911J513R03R70J680K026J429M89J68O33J248J487J472J590
$$ 242951 244656 246567 248080 248983 249953 251633 253659 255088 255577 255745 256378 257626 259113 260585 262175
52726B62175J851J857J304L33o50j380j857k144k266k256k191k078j798j244n48
$$ 262175 264026 265883 267187 267520 266870 265490 263633 261489 259223 256967 254776 252698 250900 249656 249108
52711B49108j06k76q91j307j084n86n47j010j212o52J46L87J15nK54M64L76K77
$$ 249108 249002 248726 247835 246528 245444 244858 244311 243301 242089 241437 241583 241970 242085 242080 242334 242798 243174 243451
52693B43451L72M38K92J76L30N90O83O79P75R14R26Q30O30Q4r48j955k071j007
$$ 243451 243823 244261 244553 244729 245059 245649 246332 247011 247786 248700 249626 250456 251086 251170 250222 248267 246196 245189
52675B45189M87J297R54m2p87q05l38J50N72J125J726J916J515R84Q56J045J147
$$ 245189 245676 246973 247927 247885 247098 246293 245955 246105 246677 247802 249528 251444 252959 253943 254799 255844 256991
52658B56991J135J343J782K001J777J494J660K257K780K697J759J57j389k012
$$ 256991 258126 259469 261251 263252 265029 266523 268183 270440 273220 275917 277676 277833 276444 274432
52644B74432j488n91l41r23j644j872j689j557j673j859j834j375m09P76J571
$$ 274432 272944 272353 272012 271089 269445 267573 265884 264327 262654 260795 258961 257586 257177 257953 259524
52629B59524J641J469J876K919L622L105J642K53n56j150j887k419k204j390p87
$$ 259524 261165 262634 264510 267429 271051 274156 275798 276051 275495 274345 272458 270039 267835 266445 265658
52614B65658r54j580j858j339l42M04M70N6l14l41o7L53P94J068R80N77J49j51
$$ 265658 264704 263124 261266 259927 259585 259989 260459 260515 260201 259860 259793 260146 260940 262008 262988 263565 263714 263563
52596B63563m41p28o94q6Q47J598J874J632R13J4m47j57L95N30L96O65J314J569
$$ 263563 263122 262394 261700 261614 262461 264059 265933 267565 268478 268492 268045 267888 268283 268813 269209 269874 271188 272757
52578B72757J150P59Q77R73M58k49l81qK85M21O29N43m08j826k544k140j346p79
$$ 272757 273907 274666 275543 276516 276974 276725 276344 276336 276621 277042 277671 278214 277806 275980 273436 271296 269950 269171
52560B69171k56L66N93J50l48k53R9j06r48j681j688j075l91m3Q5M78J232J597
$$ 269171 268915 269281 269874 270024 269676 269423 269522 269416 268468 266787 265099 264024 263633 263590 263675 264153 265385 266982
52542B66982Q36m94r48q1R50J059N96L80L05j67q25j096j104j293j359o90M07
$$ 266982 267818 267324 266376 266295 267245 268304 268900 269280 269585 269418 268593 267497 266393 265100 263741 263051 263458
52525B63458R96R08Q01R13Q46N21L45L20J23P2Q60K152K736K371K220K913L424
$$ 263458 264454 265362 266163 267076 267922 268443 268788 269108 269231 269303 270163 272315 275051 277422 279642 282555 285979
52508B85979K721J453J034J745K660K866K037L66j382k212k001j752k195k774
$$ 285979 288700 290153 291187 292932 295592 298458 300495 300861 299479 297267 295266 293514 291319 288545
52494B88545k628j915j287p92k00J40j91p41p56l89l00m23k12J91J78p1J76P17
$$ 288545 285917 284002 282715 281923 281723 281863 281672 280931 280175 279786 279486 279063 278851 279042 279220 279149 279325 280042
52476B80042M87o73j489r69L85J561K315K849L006K604K024J816J983K176K283
$$ 280042 280529 279856 278367 277398 277783 279344 281659 284508 287514 290118 292142 293958 295941 298117 300400
52461C00400K385K364K032J480R87O55L42j61j001k077k963l213k861k390k173
$$ 300400 302785 305149 307181 308661 309648 310303 310645 310484 309483 307406 304443 301230 298369 295979 293806
52446B93806k233k471k714k607j902r48m08m57p79j249j959k486k012n71O36O86
$$ 293806 291573 289102 286388 283781 281879 280931 280523 280066 279287 278038 276079 273593 271581 271010 271646 272332
52430B72332J18K4N47R88J009R26R48Q94O74M74M10L82K94N7m61j160j440p51
$$ 272332 272450 272474 273021 274009 275018 275944 276892 277786 278460 278934 279344 279726 280020 280077 279616 278456 277016 276265
52412B76265O48J943K854L854N226O451P005P357Q501J0514J2169J2182J0493
$$ 276265 276913 278856 281710 285564 290790 297241 304246 311603 320104 330618 342787 354969 365462
52399C65462P909M850J144k883n968p169p112p263q118q823q558p437n907m064
$$ 365462 373371 378221 379365 376482 370514 363345 356233 348970 340852 332029 323471 316034 310127 306063
52385C06063k018k92P41J354J862J990J402O26N88J411K284K597K619K902L543
$$ 306063 304045 303753 304494 305848 307710 309700 311102 311728 312316 313727 316011 318608 321227 324129 327672
52370C27672M264M912N518N988N934M900K884O67o54o67o9J98l3k58j47J17K77
$$ 327672 331936 336848 342366 348354 354288 359188 362072 362739 362085 361418 361349 361547 361514 361256 361109 361226 361503
52353C61503K56pm76q02n76Q4O52R58J313J759J782J142N78J082K660M305N130
$$ 361503 361759 361752 361276 360474 359898 359982 360634 361592 362905 364664 366446 367588 368166 369248 371908 376213 381343
52336C81343N191N126N394O010O781P577Q330Q934R273R426R879J1246J3610J6189
$$ 381343 386534 391660 397054 403064 409845 417422 425752 434686 443959 453385 463264 474510 488120 504309
52322E04309J7871J8156J7479J6640J6109J5893J5846J5876J5978J6231J6746
$$ 504309 522180 540336 557815 574455 590564 606457 622303 638179 654157 670388 687134
52311F87134J7414J7747J7306J6323J5678J5975J6846J7356J6983J5968J4814
$$ 687134 704548 722295 739601 755924 771602 787577 804423 821779 838762 854730 869544
52300H69544J3829J3113J2641J2192J1448J0309Q888P183M996K339l72k715m621
$$ 869544 883373 896486 909127 921319 932767 943076 951964 959147 964143 966482 966110 963395 958774
52287I58774o184p331q012q412q665q494p523n935m455l594l163k587j506J1J668
$$ 958774 952590 945259 937247 928835 920170 911676 904153 898218 893763 890169 887006 884419 882913 882924 884592
52272H84592L162M324N176N938O951Q450J0221J1541J1792J1205J0741J1040J1780
$$ 884592 887754 892078 897254 903192 910143 918593 928814 940355 952147 963352 974093 985133 996913
52259I96913J2326J2674J3249J4030J4452J4191J3565J3010J2610J2263J1848
$$ 996913 1009239 1021913 1035162 1049192 1063644 1077835 1091400 1104410 1117020 1129283 1141131
52248A141131J1002R152O227L060O45r20k396m371o575q250q923q702q080p642
$$ 1141131 1152133 1161285 1167512 1170572 1171217 1170297 1167901 1163530 1156955 1148705 1139782 1131080 1123000 1115358
52234A115358p791q532r431r931r824r339q828q433q165q110q255q148p131n232
$$ 1115358 1107567 1099035 1089604 1079673 1069849 1060510 1051682 1043249 1035084 1026974 1018719 1010571 1003440 998208
52220I98208l455k805l026k847j487M72J900K412K541K917L689M646N516O050
$$ 998208 994753 991948 988922 986075 984588 985060 986960 989372 991913 994830 998519 1003165 1008681 1014731
52206A014731O128N869N500N073M521L935L562L463L477L566L934M567N012M910
$$ 1014731 1020859 1026728 1032228 1037301 1041822 1045757 1049319 1052782 1056259 1059825 1063759 1068326 1073338 1078248
52192A078248M576M621N120N518N425N043M658M138L175J712r3k081m000n466
$$ 1078248 1082824 1087445 1092565 1098083 1103508 1108551 1113209 1117347 1120522 1122234 1122141 1120060 1116060 1110594
52178A110594o356p064p995q997r619r796r787r579q845p547o027m519l028j759
$$ 1110594 1104238 1097174 1089179 1080182 1070563 1060767 1050980 1041401 1032556 1025009 1018982 1014463 1011435 1009676
52164A009676j029n50N38K507M376M949M190L096K486K375K318J869Q35m73j304
$$ 1009676 1008647 1008097 1008635 1011142 1015518 1020467 1024657 1027753 1030239 1032614 1034932 1036801 1037636 1037163 1035859
52149A035859j142l13M56R20J348J823J996J598P96l7o14p97o49m02j34L76J224
$$ 1035859 1034717 1034404 1034860 1035780 1037128 1038951 1040947 1042545 1043341 1043304 1042690 1041893 1041244 1040842 1040708 1041084 1042308
52132A042308K008K399K891M293O521Q609J0121J1817J4521J7936K1065K3378
$$ 1042308 1044316 1046715 1049606 1053899 1060420 1069029 1079150 1090967 1105488 1123424 1144489 1167867
52120A167867K4996K6087K6695K7065K7535K8026K8020K7179K5729K4068K2239
$$ 1167867 1192863 1218950 1245645 1272710 1300245 1328271 1356291 1383470 1409199 1433267 1455506
52109A455506J9997J7356J4850J3088J2037J1000R456P739O602O237O099N677
$$ 1455506 1475503 1492859 1507709 1520797 1532834 1543834 1553290 1561029 1567631 1573868 1579967 1585644
52097A585644N011M331L534K261K34k552n753q729j1049j3001j5218j7662j9466
$$ 1585644 1590655 1594986 1598520 1600781 1601015 1598463 1592710 1583981 1572932 1559931 1544713 1527051 1507585
52084A507585j9956j9415j8412j6934j4687j1928r346p274n547m057k906j943
$$ 1507585 1487629 1468214 1449802 1432868 1418181 1406253 1396907 1389633 1384086 1380029 1377123 1375180
52072A375180o28J445M146P018R647J1766J3256J4126J4405J4056J3179J2180
$$ 1375180 1374552 1375997 1380143 1387161 1396808 1408574 1421830 1435956 1450361 1464417 1477596 1489776
52060A489776J1562J1517J1806J1948J1527J0574R700R486R540Q632O181L109
$$ 1489776 1501338 1512855 1524661 1536609 1548136 1558710 1568410 1577896 1587436 1596068 1602249 1605358
52048A605358O80j151l418o502r703j2404j4703j6597j7552j7411j6995j7120
$$ 1605358 1606038 1604887 1601469 1594967 1585264 1572860 1558157 1541560 1524008 1506597 1489602 1472482
$$ [...]
##END NTUPLES=NMR SPECTRUM
##END=
