
##TITLE=UV1223_M6_1234-1212_20_7231249_iH2Jjf6jFW
##JCAMPDX= 6.0         $$ Bruker NMR JCAMP-DX V2.0
##DATA TYPE= NMR SPECTRUM
##DATA CLASS= NTUPLES
##ORIGIN= BRUKER
##OWNER= Administrator
$$ 1.72 TOPSPIN		Version 2.1
$$ 2013-01-17 20:26:06.071 -0500  Administrator@X
$$ Compression mode = diff/dup
##.OBSERVE FREQUENCY= 400.02188249412
##.OBSERVE NUCLEUS= ^1H
##.ACQUISITION MODE= SIMULTANEOUS (DQD)
##.ACQUISITION SCHEME= undefined
##.AVERAGES= 8
##.DIGITISER RES= 22
##SPECTROMETER/DATA SYSTEM= spect
##.PULSE SEQUENCE= zg30
##.SOLVENT NAME= COFFEE_meoh
##.SHIFT REFERENCE= INTERNAL, COFFEE_meoh, 1, 14.98509
##AUDIT TRAIL= $$ (NUMBER, WHEN, WHO, WHERE, PROCESS, VERSION, WHAT)
$$ ##TITLE= Audit trail, TOPSPIN		Version 2.1
$$ ##JCAMPDX= 5.01
$$ ##ORIGIN= Bruker BioSpin GmbH
$$ ##OWNER= Administrator
$$ $$ E:\/data/COFFEE/nmr/UV1223_M6_1234-1212_20_7231249_iH2Jjf6jFW/20/pdata/1/auditp.txt
$$ ##AUDIT TRAIL=  $$ (NUMBER, WHEN, WHO, WHERE, PROCESS, VERSION, WHAT)
(   1,<2013-01-17 20:25:58.071 -0500>,<Administrator>,<X>,<go>,<TOPSPIN 2.1>,
      <created by zg
	started at 2013-01-17 20:24:52.086 -0500,
	POWCHK enabled, PULCHK disabled,
       configuration hash MD5:
       86 BA 57 50 F2 9D 5C 9B 26 00 A9 28 5F 66 2E 89
       data hash MD5: 64K
       E8 37 B0 05 E2 2C 54 B4 F3 BD 38 9B D1 19 54 C7>)
(   2,<2013-01-17 20:26:01.086 -0500>,<Administrator>,<X>,<proc1d>,<TOPSPIN 2.1>,
      <Start of raw data processing
       efp LB = 0 FT_mod = 6 PKNL = 1 PHC0 = 0 PHC1 = 0 SI = 32K 
       data hash MD5: 32K
       85 A7 D0 E7 15 EE BC 94 1C 43 82 64 A9 F3 22 95>)
(   3,<2013-01-17 20:26:01.539 -0500>,<Administrator>,<X>,<proc1d>,<TOPSPIN 2.1>,
      <pk PHC0 = 96.63574 PHC1 = 0 
       data hash MD5: 32K
       AF FC AA DE 96 35 81 46 E1 5D 7A 44 66 F6 E5 A5>)
(   4,<2013-01-17 20:26:01.758 -0500>,<Administrator>,<X>,<proc1d>,<TOPSPIN 2.1>,
      <abs ABSG = 1 
       data hash MD5: 32K
       C6 E3 F4 9A 40 44 0E DA 46 D3 EB 0B E9 14 B8 E6>)
(   5,<2013-01-17 20:26:01.914 -0500>,<Administrator>,<X>,<proc1d>,<TOPSPIN 2.1>,
      <abs ABSG = 2 
       data hash MD5: 32K
       C0 AD 2C 3A 2C 6C DD 30 DC 55 E4 BC E4 5B 29 92>)
(   6,<2013-01-17 20:26:02.055 -0500>,<Administrator>,<X>,<proc1d>,<TOPSPIN 2.1>,
      <abs ABSG = 3 
       data hash MD5: 32K
       7A F6 9B C3 71 20 6C 87 32 70 86 B8 97 DF 5B 9F>)
(   7,<2013-01-17 20:26:02.211 -0500>,<Administrator>,<X>,<proc1d>,<TOPSPIN 2.1>,
      <abs ABSG = 4 
       data hash MD5: 32K
       81 D4 32 AF FA 01 13 05 F0 C1 E6 D2 E3 0A EC 04>)
(   8,<2013-01-17 20:26:02.352 -0500>,<Administrator>,<X>,<proc1d>,<TOPSPIN 2.1>,
      <abs ABSG = 5 
       data hash MD5: 32K
       90 6E 47 0A 3B 15 FE 73 30 2A BF 31 5B A6 DD 3D>)
$$ ##END=
$$ 
$$ $$ hash MD5
$$ $$ 0A 2F 50 B7 CE 1F F2 CD 1B 5B DE 23 67 A3 D5 51
##$RELAX= 
##$RELAX= 
##$RELAX= 
##$RELAX= 
##$RELAX= 
##$RELAX= 
##$RELAX= 
$$ Bruker specific parameters
$$ --------------------------
##$DU= <E:\>
##$EXPNO= 20
$$ [...]
150 150 150 150 150 150 150 150
##$TP07= 0
##$TPNAME0= <>
##$TPNAME1= <>
##$TPNAME2= <>
##$TPNAME3= <>
##$TPNAME4= <>
##$TPNAME5= <>
##$TPNAME6= <>
##$TPNAME7= <>
##$TPOAL= (0..7)
0.5 0.5 0.5 0.5 0.5 0.5 0.5 0.5
##$TPOFFS= (0..7)
0 0 0 0 0 0 0 0
##$TUNHIN= 0
##$TUNHOUT= 0
##$TUNXOUT= 0
##$USERA1= <user>
##$USERA2= <user>
##$USERA3= <user>
##$USERA4= <user>
##$USERA5= <user>
##$V9= 5
##$VALIST= <valist>
##$VCLIST= <CCCCCCCCCCCCCCC>
##$VD= 0
##$VDLIST= <DDDDDDDDDDDDDDD>
##$VPLIST= <PPPPPPPPPPPPPPP>
##$VTLIST= <TTTTTTTTTTTTTTT>
##$WBST= 1024
##$WBSW= 4
##$XGAIN= (0..3)
0 0 0 0
##$XL= 0
##$YL= 0
##$YMAX_a= 666620
##$YMIN_a= -567252
##$ZGOPTNS= <>
##$ZL1= 120
##$ZL2= 120
##$ZL3= 120
##$ZL4= 120
##$ABSF1= 14.98509
##$ABSF2= -5.573092
##$ABSG= 5
##$ABSL= 3
##$ALPHA= 0
##$AQORDER= 0
##$ASSFAC= 0
##$ASSFACI= 0
##$ASSFACX= 0
##$ASSWID= 0
##$AUNMP= <proc_prof1d_extract_pilot.lims>
##$AXLEFT= 0
##$AXNAME= <>
##$AXNUC= <1H>
##$AXRIGHT= 0
##$AXTYPE= 0
##$AXUNIT= <>
##$AZFE= 0.1
##$AZFW= 0.1
##$BCFW= 0
##$BC_mod= 0
##$BYTORDP= 0
##$COROFFS= 0
##$CY= 15
##$DATMOD= 1
##$DC= 0
##$DFILT= <>
##$DTYPP= 0
##$F1P= 0
##$F2P= 0
##$FCOR= 0.5
##$FTSIZE= 32768
##$FT_mod= 6
##$GAMMA= 0
##$GB= 0
##$INTBC= 1
##$INTSCL= 1
##$ISEN= 128
##$LB= 0
##$LEV0= 0
##$LPBIN= 0
##$MAXI= 10000
##$MC2= 0
##$MEAN= 0
##$ME_mod= 0
##$MI= 0
##$NCOEF= 0
##$NC_proc= -8
##$NLEV= 6
##$NOISF1= 0
##$NOISF2= 0
##$NSP= 0
##$NTH_PI= 0
##$NZP= 0
##$OFFSET= 14.98509
##$PC= 1
##$PHC0= 96.63574
##$PHC1= 0
##$PH_mod= 1
##$PKNL= yes
##$PPARMOD= 0
##$PPDIAG= 0
##$PPIPTYP= 0
##$PPMPNUM= 2147483647
##$PPRESOL= 1
##$PSCAL= 4
##$PSIGN= 0
##$PYNMP= <proc.py>
##$REVERSE= no
##$SF= 400.02
##$SI= 32768
##$SIGF1= 0
##$SIGF2= 0
##$SINO= 400
##$SIOLD= 32768
##$SPECTYP= <>
##$SREGLST= <1H.CDCl3>
##$SSB= 0
##$STSI= 32768
##$STSR= 0
##$SW_p= 8223.68421052631
##$SYMM= 0
##$S_DEV= 0
##$TDeff= 65536
##$TDoff= 0
##$TI= <>
##$TILT= no
##$TM1= 0
##$TM2= 0
##$TOPLEV= 0
##$USERP1= <user>
##$USERP2= <user>
##$USERP3= <user>
##$USERP4= <user>
##$USERP5= <user>
##$WDW= 1
##$XDIM= 32768
##$YMAX_p= 474395810
##$YMIN_p= -650914
##$CURPLOT= <Network HP LaserJet P1505>
##$CURPRIN= <$Network HP LaserJet P1505>
##$DFORMAT= <normdp>
##$LAYOUT= <+/1D_H.xwp>
##$LFORMAT= <normlp>
##$PFORMAT= <normpl>
##$SURQMSG= 1
$$ End of Bruker specific parameters
$$ ---------------------------------
##NTUPLES= NMR SPECTRUM
##VAR_NAME=  FREQUENCY,     SPECTRUM/REAL,   SPECTRUM/IMAG
##SYMBOL=    X,             R,               I
##VAR_TYPE=  INDEPENDENT,   DEPENDENT,       DEPENDENT
##VAR_FORM=  AFFN,          ASDF,            ASDF
##VAR_DIM=   32768,         32768,           32768
##UNITS=     HZ,            ARBITRARY UNITS, ARBITRARY UNITS
##FACTOR=    0.250966925370066, 1,           1
##FIRST=     8223.43324360094, -339830,      -46347
##LAST=      0,             -57401,          -115466
##MIN=       0,             -650914,         0
##MAX=       8223.43324360094, 474395810,    0
$$ Real data points
##PAGE= N=1
##DATA TABLE= (X++(R..R)), XYDATA
$$ [...]
$$ plain form
19531 -4701 -178557 53039 31053 32353 -269333 265892 -249139 -125221 21066 -228120 111497
19519 -226351 -588235 42457 -61287 -475222 -411091 -84142 -249554 -91138 -39428 -199403 -121342
19508 -121342 -239097 134406 -206963 161176 -4371 -148718 -379554 340806 -354979 78325
19497 59509 44508 -178528 56715 375881 -131237 -64691 187993 -320022 -153076 276869
19486 92795 -2005 -240668 287217 848 -73965 -377555 33097 152139 -221328 -329093 12220
19474 -129615 -349979 -122282 104409 41261 56063 94786 57678 -162826 -27827 -167888
19464 -167888 93674 17543 292212 -192620 -158439 -387750 -62567 -98573 -586378 44861 -4749
19452 -165163 -135682 -222157 -166586 -129504 -197711 -206368 39321 -272305 -252505 -131871 28457
$$ packed form
19531d701j73856E3039k1986J300b69333B65892b49139J23918B1066b28120A11497
19519b26351l61884D2457f1287m13935O4131h4142j65412i1138c9428j59975P8061
19508a21342j17755A34406b06963A61176d371j44347k30836C40806c54979G8325
19497E9509j5001a78528E6715L19166a31237f4691A87993c20022a53076B76869
19486I2795b005k38663B87217H48g3965l03590C3097J19042b21328j07765A2220
19474a29615k20364a22282A04409D1261J4802L8723l7108a62826b7827j40061
19464a67888I3674A7543K74669a92620L4181k29311f2567l6006m87805D4861d749
19452a65163K9481q6475N5571L7082o8207q657C9321b72305J9800J20634B8457
$$ plain form
19440 -63532 106220 -9774 -263455 39315 -103450 -149608 60347 -92289 -196725 -256020 5143
19428 20878 -425340 237525 -64911 48379 -387504 -163546 190371 4842 249033 -262870
19417 -143065 -81820 123056 -93097 -26434 -35282 247706 -116159 233503 599 -112809 135229
19405 -225675 -193336 4175 -42824 41944 280505 147443 -19768 69622 -191357 100791 -186854
19393 -106274 92476 -87839 17089 -97217 -100911 -234239 -336206 49190 132495 180627 -118363
19381 8164 -134093 -180409 128364 94712 48488 -2139 52674 -233967 11018 88845 -14165
19369 -103475 -315416 -170808 -131905 -157397 438893 -496916 -417352 -234956 -24913 192859
19358 -35999 -157448 37622 28591 -161035 91176 -116218 52285 14825 -317561 60346 -75485
$$ packed form
19440f3532A06220i774k53681C9315a03450m6158F0347i2289j04436n9295E143
19428B0878d25340B37525f4911D8379c87504a63546A90371D842K44191b62870
19417a43065O1245A23056i3097b6434q848B47706a16159B33503E99a12809A35229
19405b25675L2339D175d2824D1944K38561j33062a9768F9622a91357A00791a86854
19393a06274I2476h7839A7089i7217l694j33328j01967D9190Q3305M8132a18363
19381H164a34093m6316A28364l3652m6224b139E2674b33967A1018P7827a4165
19369a03475k11941J44608L8903k5492D38893d96916P9564J82396b4913A92859
19358c5999j21449C7622r031a61035I1176a16218E2285A4825c17561F0346g5485
$$ plain form
19346 54063 -92817 -281982 -51274 336182 -59091 33190 164370 -164244 -188901 26744 -550626
19334 -197426 -510239 -11432 -199553 244551 -70583 142557 44914 -75193 -207650 -122185
19324 -122185 137534 -383764 206721 -341183 -196931 -193703 -30150 4669 -159451 11466 -418794
19312 -123954 -213556 -145876 96714 -240473 -101597 -169250 9974 -79462 -142332 -288735 -76883
19300 -136004 -25992 -9244 143690 305425 -184395 -259244 -154005 51509 -37524 37244 -324874
19288 -72852 -138362 41523 -273314 -295999 -168202 -60576 -138358 315019 -84198 -226543 -6991
19276 -85140 -122558 5654 -370744 6039 -43572 -196693 198299 116702 -334534 9208 -316414
19264 57033 85534 55402 63027 -162567 -104491 192711 -73491 -385935 158918 -18226 -109074
$$ packed form
19346E4063i2817j89165e1274C36182e9091C3190J31180a64244k4657B6744e50626
19334a97426l12813a1432j88121B44551g0583A42557D4914g5193j32457Q5465
19324a22185A37534c83764B06721c41183J44252L228c0150D669a59451A1466d18794
19312a23954q9602O7680I6714b40473a01597o7653I974g9462o2870j46403g6883
19300a36004b5992i244A43690J61735a84395p4849J05239E1509c7524C7244c24874
19288g2852o5510D1523b73314k2685J27797f0576p7782C15019h4198j42345f991
19276h5140l7418E654c70744F039d3572j53121A98299q1597c34534I208c16414
19264E7033K8501l0132P625a62567N8076A92711g3491l12444A58918a8226r0848
$$ plain form
19253 -109074 -46461 -122315 122022 -210572 -182004 159739 -182480 159990 -48373 -369577
19243 -369577 86198 3413 17003 -412612 17163 -57777 -130762 -229803 301411 341716 -96261
19231 -77280 118366 -162735 -99884 236437 -61533 60090 -161493 -117925 133180 99132 34539
19219 -7466 90319 84350 12607 -239164 154281 31927 -131304 -230566 -3803 -151762 -83444
19208 -83444 -12548 -22192 110021 -213328 149356 178129 -322664 -193875 5115 -183969 -4953
19196 -118351 -424197 193603 -165548 17164 -203241 -83061 -311371 -145914 -80326 -327916
19186 -327916 -240040 138986 -103566 8202 25570 -315824 -50797 194601 -2392 -72783 111762
19174 -22636 144379 171299 25024 -121310 -14828 -58090 -113369 -50831 18841 -9713 -141000
$$ packed form
19253a09074d6461p5854A22022b10572K8568A59739a82480A59990d8373l21204
19243c69577H6198C413J3590d12612A7163e7777p2985r9041C01411M0305i6261
19231g7280A18366a62735O2851B36437f1533F0090a61493M3568A33180l4048C4539
19219g466I0319n969A2607b39164A54281C1927a31304r9262c803j47959O8318
19208h3444a2548r644A10021b13328A49356K8773c22664J28789E115a83969d953
19196a18351l05846A93603a65548A7164b03241h3061k28310a45914O5588k47590
19186c27916Q7876A38986a03566H202J7368c15824e0797A94601b392p0391A11762
19174b2636A44379K6920B5024a21310a4828m3262n5279e0831A8841i713j31287
$$ plain form
19163 -141000 188030 197724 -172765 15321 303869 -60709 143611 -19292 -129975 -53706 -299397
19152 -299397 301371 111283 68545 88716 -131987 -92181 143289 -187847 -207759 -224181
19142 -224181 54729 26685 219906 -2830 47439 -42923 330754 167032 173525 -269839 138872
19130 35591 -157665 -163250 126708 -47446 91985 -84385 43125 142332 181479 212660 199395
19119 199395 -632800 13728 81146 -288150 17346 -95462 144610 -310273 189202 64307
19108 58010 -158069 35581 204142 145495 67129 -221251 -510964 -289864 198061 190814 131122
19097 131122 78732 -6978 150016 -176544 65604 -194187 235717 298734 190161 -88663 -353729
19086 -353729 -303981 36522 -165177 -277174 -210372 -21553 -210649 15633 -33995 28177 -174688
$$ packed form
19163a41000A88030R694a72765A5321K88548f0709A43611a9292j10683e3706k45691
19152b99397C01371A11283m2738K0171a31987L9806A43289a87847j9912j6422
19142b24181E4729B6685J93221b830D7439d2923C30754j63722O493b69839A38872
19130C5591a57665n585A26708d7446I1985h4385D3125R9207L9147L1181j3265
19119A99395f32800A3728O7418b88150A7346i5462A44610c10273A89202F4307
19108E8010a58069C5581J68561n8647F7129b21251k89713K21100A98061p247n9692
19097A31122n2390f978A50016a76544F5604a94187B35717O3017j08573h8663k65066
19086c53729M9748C6522a65177j11997O6802b1553j89096A5633c3995B8177a74688
$$ plain form
19074 -347296 -178767 97581 43386 34979 113877 101841 -265241 -147152 -188377 -35271 20967
19062 148157 -355271 -166449 134592 -43733 107716 -207723 -210765 41198 -297857 241750
19051 123613 -122154 -167847 -229958 -159648 161118 -341235 142193 -314772 222115 -15467
19040 -138616 10004 21560 -194239 221283 -63758 -82877 -157630 -136985 -85973 103032 -22513
19028 316041 -59729 -200945 -166775 359663 -111730 -121404 61683 -11713 196361 -91038 -199245
19017 -199245 -198766 -118102 451671 156423 -290979 -26559 -108439 -164972 -223697 -38357 -30470
19006 -30470 -79577 132046 -61274 -22937 -319021 -24854 -70917 34003 -236380 17629 17875
18995 17875 -12385 194018 58742 65644 99039 -228072 123072 13649 -448440 -47498 365606
$$ packed form
19074c47296J68529I7581D3386q407P8898j2036b65241J18089m1225c5271B0967
19062A48157c55271a66449A34592d3733A07716b07723l042D1198b97857B41750
19051A23613a22154m5693o2111P0310A61118c41235A42193c14772B22115a5467
19040a38616A0004J1556a94239B21283f3758j9119p4753K0645N1012A03032b2513
19028C16041e9729j41216L4170C59663a11730r674F1683a1713A96361i1038j08207
19017a99245M79Q0664D51671A56423b90979b6559q1880n6533n8725c8357P887
19006c0470m9107A32046f1274b2937k96084b4854m6063C4003b36380A7629K46
18995A7875a2385A94018E8742O902L3395b28072A23072A3649d48440d7498C65606
$$ plain form
18983 -374372 60523 -94192 68733 -145934 -63446 -43531 38780 -89147 -32464 -58245 -334708
18972 -334708 -620 120173 124621 220156 -390942 113687 -91646 -82154 -71141 -53398 36298 -57842
18959 234076 -180032 -27362 36585 193867 -169076 15909 416716 242053 -115142 -179107
18949 -179107 -53396 -88623 86479 -334606 181923 -247962 -164093 -230174 8838 449593 -129232
18937 47971 -98876 335542 -290799 7399 -83808 241343 -175529 -95087 -97622 143848 -275185
18925 161061 58382 -176251 -248470 -46362 -181440 35947 226598 -449986 -42793 -245416
18915 -245416 -113061 58105 -309444 -29881 -182284 187671 252216 -157041 154403 -265254
18904 -215933 -401792 243994 -137006 289750 379748 -195323 267019 -334459 -140752 678
$$ packed form
18983c74372F0523i4192F8733a45934f3446J9915C8780h9147c2464k5781k76463
18972c34708f20A20173M448R5535c90942A13687i1646R492J1013J7743C6298e7842
18959B34076a80032b7362C6585J57282a69076A5909M00807j74663a15142o3965
18949a79107e3396l5227H6479c34606A81923b47962Q3869o6081H838M40755a29232
18937D7971i8876C35542b90799G399h3808B41343a75529Q0442k535A43848b75185
18925A61061E8382a76251p2219d6362j35078C5947J90651d49986d2793k02623
18915b45416a13061E8105c09444b9881j52403A87671O4545a57041A54403b65254
18904b15933j85859B43994a37006B89750Q9998a95323B67019c34459a40752F78
$$ plain form
18893 179 -93034 184369 -73828 -63862 -146843 -282673 110778 -136051 89770 -81484 -86909 -379812
18881 -379812 25207 175669 -109144 -180173 -1087 -25632 -8246 121242 -305985 3475 39822
18870 39822 227558 -200688 -37614 162808 -204943 -67335 -181734 -15286 -146483 180555
18859 -47930 13617 -486834 -159874 18982 -121320 -25423 71039 -298417 -74480 -86735 14049
18847 -17515 75659 124513 -364485 -230631 -286853 -49641 -37114 -314204 33823 -243509 225298
18835 28816 76360 -291464 -107290 -270499 -128229 83748 -76029 -151160 39994 -200494 -344848
18824 -344848 -103750 120634 -115788 -302410 -151902 -102516 43290 28962 479357 -43647
18813 -205716 -158874 305971 198457 307397 203609 274554 -75633 163156 227566 51530
$$ packed form
18893A79i3034A84369g3828R966q2981j35830A10778a36051H9770h1484n425k92903
18881c79812B5207J50462a09144p1029a087k4545h246A21242c05985C475L6347
18870C9822J87736b00688c7614A62808b04943f7335j14399a5286j31197A80555
18859d7930A3617d86834a59874A8982a21320b5423G1039b98417g4480j2255A4049
18847a7515G5659M8854c64485J33854n6222d9641J2527k77090C3823b43509B25298
18835B8816M7544b91464a07290j63209a28229H3748g6029p5131C9994b00494j44354
18824c44848a03750A20634a15788j86622J50508M9386D3290j4328M50395d3647
18813b05716M6842C05971j07514J08940j03788P0945g5633A63156O4410E1530
$$ plain form
18802 -69496 -60923 -235706 -249 45980 57048 -230327 -350890 19012 -209387 -97874 -321110
18791 -321110 135166 32268 111310 258866 243492 -96354 37989 58893 343066 -234706 125231
18779 -36831 -130312 -6157 314587 -15761 80079 -55754 -73583 38712 -222195 -87155 -120779
18768 -120779 -50659 -92939 -135045 -73720 -344948 -205499 -190365 -67242 42614 69749 -58338
18756 243804 127176 -369883 -74104 -233727 55815 -164311 214773 120686 142296 -116042
18745 -2682 -318460 -134732 -20385 -100364 -42476 -112890 -86980 -138218 320231 273205 -273701
18733 40032 70477 61316 -96657 -280726 89530 -115395 -214682 -237190 -174081 -122346 158270
18721 -119304 -84557 267886 71916 81053 254770 163232 55141 206672 282422 -170607 16286
$$ packed form
18802f9496Q573j74783b49D5980J1068b30327j20563A9012b09387i7874k23236
18791c21110A35166C2268P9042J47556j5374i6354C7989K0904K84173b34706A25231
18779c6831r3481f157C14587a5761H0079e5754j7829C8712b22195h7155l3624
18768a20779e0659m2280m2106O1325k71228J39449J5134f7242D2614K7135e8338
18756B43804j16628c69883g4104j59623E5815a64311B14773r4087K1610a16042
18745b682l15778a34732b0385p9979d2476p0414K5910n1238C20231m7026b73701
18733D0032L0445r161i6657j84069H9530a15395r9287k2508O3109N1735A58270
18721a19304L4747B67886G1916R137J73717r1538E5141J51531P5750a70607A6286
$$ plain form
18709 -312248 -153384 46012 -485388 -247026 368089 135773 -401890 -145232 294872 -115973
18698 -528800 -37523 -103834 177053 -136160 79812 123966 124723 -55565 -293506 -131281 -94328
18687 -94328 -150649 2549 254 -151118 -155810 -170802 -10846 -21435 -127670 251716 296116 -214797
18674 33928 -140927 -12471 91401 -225041 139240 -254747 -231174 -169410 -424793 -366003 -181252
18662 -23252 -2927 145090 276611 -168220 69022 36791 -204895 -186441 -175242 -166597 -182035
18651 -182035 -22022 25218 -205593 -148461 171297 161539 -156148 -333640 119874 -51495 24332
18639 113072 322462 -88544 154248 -77319 191240 43986 -59173 -88575 -380530 17564 -148612
18627 182038 -240336 -182262 -402089 -93425 106306 81480 30758 328000 -34223 -160765
$$ packed form
18709c12248a53384D6012d85388K38362C68089A35773d01890a45232B94872a15973
18698e28800c7523o6311A77053a36160G9812M4154P57e5565k37941a31281L6953
18687i4328n6321B549B54a51118m692j4992a0846j0589j06235B51716M4400b14797
18674C3928a40927a2471I1401b25041A39240b54747K3573O1764k55383N8790a81252
18662b3252b927A45090J31521a68220F9022l2231b04895J8454J1199Q645j5438
18651a82035b2022B5218b05593N7132A71297r758a56148j77492A19874e1495B4332
18639A13072K09390h8544A54248g7319A91240D3986e9173k9402k91955A7564a48612
18627A82038b40336N8074k19827i3425A06306k4826C0758K97242c4223j26542
$$ plain form
18617 -160765 -373718 169846 -54934 105580 90895 -57403 250678 -229906 -70971 -42912
18607 -42912 -251317 -900 162637 -38414 138799 -229826 198785 -46243 -381404 -57772 -165161
18596 -165161 -139174 -89837 -73829 -104905 225128 235215 -57708 101820 -179208 -170612 -297190
18585 -297190 -469935 380073 -59292 246887 -194761 -194444 -123838 -201828 -73251 -224962 -63981
18573 148479 -148402 356847 169442 -230450 -4282 -579800 68690 28072 -164741 -218715
18563 -218715 -78438 58524 156595 -238885 52027 170437 160177 -256877 -112502 -4213 96313
18551 -270453 154203 -119101 -61000 50707 -48884 4139 -238873 78672 -168704 -9761 -216400
18540 -216400 -187028 49993 81278 137269 3706 -278308 -41112 -48586 -18909 130003 12329
$$ packed form
18617a60765k12953A69846e4934A05580j4685e7403B50678b29906g0971K8059
18607d2912k08405i00A62637c8414A38799b29826A98785d6243l35161e7772j07389
18596a65161K5987M9337J6008l1076B25128J0087e7708A01820a79208Q596j26578
18585b97190j72745C80073e9292B46887a94761L17P0606p7990g3251j51711f3981
18573A48479a48402C56847A69442b30450d282n75518F8690B8072a64741n3974
18563b18715g8438E8524R8071b38885E2027J18410j0260b56877a12502d213I6313
18551b70453A54203a19101N8101E0707d8884D139b38873G8672a68704i761k06639
18540b16400K9372D9993L1285N5991C706b78308d1112p474a8909A30003A2329
$$ plain form
18528 -284955 -563151 -11941 194614 -17809 -179204 -121100 -281068 -166715 -168113 -71923 -38787
18517 -38787 158958 -314492 66293 -72662 -341888 -218790 130023 -8761 57813 142047 -261896
18505 -238473 -89759 -36701 -32962 331325 9083 -33554 -195202 -10360 -65897 -182688 -264597
18494 -264597 -126480 78854 -99452 81344 -205515 -91026 -123139 230465 39908 -381454 134578
18482 9585 -14720 13890 -186290 -18874 -505353 133505 26474 162480 -311368 -137594 91468
18470 -65603 -71301 -180645 46634 -131932 -384351 -529583 142170 227725 290437 195075 111911
18459 111911 -351368 75110 123340 -115006 -142301 -73739 -105475 -110927 -210649 -6549 -31972
18448 -31972 76043 -43757 -287087 -102716 -289163 -167921 -60758 -13653 134664 15342 -9964
$$ packed form
18528b84955k78196a1941A94614a7809j61395N8104j59968J14353j398g1923L3136
18517c8787A58958c14492F6293g2662k69226J23098A30023h761E7813Q4234b61896
18505b38473h9759c6701L739C31325I083c3554j61648a0360n5537j16791q1909
18494b64597a26480G8854i9452H1344b05515i1026l2113B30465C9908c81454A34578
18482I585a4720A3890a86290a8874m86479A33505B6474J36006c11368a37594I1468
18470f5603n698j09344D6634a31932k52419j45232A42170Q5555O2712r5362q3164
18459A11911c51368G5110M8230a15006k7295O8562l1736n452r9722f549k5423
18448c1972G6043d3757k43330a02716j86447J21242f0758a3653A34664A5342i964
$$ plain form
18436 -218059 -368291 -191314 -291993 145862 159868 6482 16828 -15509 -124608 64301 -11533
18424 54845 -8456 -296125 139909 103022 -273210 -90604 199446 246337 200184 -6100 -58903
18413 -58903 153540 271168 3990 -149498 119033 165841 88643 90552 -136649 149787 178834
18402 178834 -188712 -297869 69159 218031 -236844 47347 -88978 7317 -80198 -27547 -390263
18391 -390263 -172261 -59686 -84256 239430 58401 180483 -272868 -19541 151410 -14013
18380 -250024 -224320 -162934 42342 -156156 -14169 262398 -178796 114320 158966 89256 312938
18369 312938 -4760 -15432 -89252 240762 288469 -164195 -123064 -337990 17039 240406 -135708
18357 29823 196768 -95848 -116191 -11063 102142 -259912 -220164 -70692 19276 -89711 -75895
$$ packed form
18436b18059j50232J76977j00679A45862J4006F482J0346a5509j09099F4301a1533
18424E4845h456k87669A39909l6887b73210i0604A99446M6891m6153f100n2803
18413e8903A53540J17628C990a49498A19033M6808p7198J909a36649A49787K9047
18402A78834a88712j09157F9159J48872b36844D7347h8978G317h0198b7547l62716
18391c90263a72261e9686k4570B39430E8401J22082b72868a9541A51410a4013
18380b50024K5704O1386D2342a56156a4169B62398a78796A14320M4646o9710K23682
18369C12938d760j0672p3820B40762M7707a64195M1131k14926A7039K23367a35708
18357B9823J66945i5848k0343a1063A02142b59912L9748g0692A9276h9711J3816
$$ plain form
18346 -75895 -32781 -169093 -430592 -106189 479459 -281351 -131504 35468 53691 -220680
18335 34828 -224768 102350 -168938 -303225 -305817 -130400 164141 -81738 -121054 -24066 -60384
18324 -60384 -56463 -109294 69576 -81109 305099 24309 -310355 -131994 99330 -185424 145562
18312 -120719 196412 236875 -450501 -117892 -408757 -36203 -167446 -19504 -154161 -66908
18301 133713 -239690 -63959 297822 -167044 128110 -210583 278877 162386 -448384 -2417
18290 -366887 -248829 269414 -199414 203472 -47832 -40772 -170579 -192504 85792 -123268
18279 -173554 -55379 -99890 -145262 126392 -222498 251649 45216 254778 -122392 2731 226266
18268 226266 186378 -105892 -249827 56860 -119425 -226373 -89849 -91176 34756 -60903 -76298
$$ packed form
18346g5895c2781j36312k61499a06189D79459b81351a31504C5468J8223b20680
18335C4828b24768A02350a68938j34287k592a30400A64141h1738l9316b4066l6318
18324f0384L921n2831F9576h1109C05099B4309c10355a31994I9330a85424A45562
18312a20719A96412M0463d50501a17892k90865c6203j31243a9504j34657f6908
18301A33713b39690f3959B97822a67044A28110b10583B78877j16491d48384b417
18290c66887J18058B69414a99414B03472d7832P060j29807k1925H5792a23268
18279a73554e5379m4511m5372A26392b22498B51649D5216K09562a22392B731K23535
18268B26266l9888a05892j43935E6860a19425j06948h9849j327C4756f0903j5395
$$ plain form
18257 -76298 259105 130493 -220009 121157 105081 -294993 -255354 91783 70415 56755 1800
18245 40322 121903 192439 143974 -159363 -27243 -192448 107902 8000 22010 66524 -139092
18233 -349669 -301842 187094 -119162 -173695 -161974 99821 84427 -92514 -136679 44288 -42755
18221 -122621 -340934 6221 -153995 -310839 -180649 -327556 91053 -7440 -118705 -199405 44775
18209 1801 -159999 -160596 -99047 -4427 -263763 -141160 -24470 -84408 -21565 22298 136837 -32031
18196 -118223 -126929 -158142 1643 28459 -157872 163642 5166 -249465 -33115 41426 -166325
18184 137527 -221248 -65852 -337757 -255561 -49341 32012 -51944 27091 -64786 287773 -47259
18172 -272985 -45662 84156 -56635 91143 111312 -70797 -295358 -41309 -246583 56725 76774
$$ packed form
18257g6298B59105j28612b20009A21157j6076b94993L9639I1783k1368j3660A800
18245D0322Q1581P0536m8465a59363b7243j65205A07902H000J4010M4514a39092
18233c49669M7827A87094a19162n4533J1721I9821j5394i2514m4165D4288d2755
18221a22621k18313F221a53995j56844J30190j46907I1053g440j11265q0700D4775
18209A801a59999n97O1549d427k59336J22603b4470n9938b1565B2298J14539c2031
18196a18223q706l1213A643K6816a57872A63642E166b49465c3115D1426a66325
18184A37527b21248f5852k71905Q2196d9341C2012e1944B7091f4786B87773d7259
18172b72985d5662H4156e6635I1143K0169g0797k24561d1309k05274E6725K0049
$$ plain form
18161 76774 69783 27396 3979 -299992 191439 1433 -102068 -224476 -327975 22451 -31275
18149 -279674 -79560 173429 -31259 -59287 -119806 21152 121659 -246434 189893 -213012
18138 -276732 119971 -115582 52811 -232902 -98900 -127615 -158562 -125440 8627 257921 438717
18127 438717 -36740 -140311 87642 97307 -54233 122417 57985 126512 92367 -78813 -257906
18116 -257906 -342895 -31713 -25256 -368038 -12455 273647 -290268 88222 -300910 62518 -236594
18104 -98480 -190517 -42916 229205 -85450 -3482 30458 -272314 149354 70223 -14842 -391746
18093 -391746 -147790 27446 -102412 -166110 18424 -299850 26952 82912 256948 -211545
18082 44052 -273531 -32768 94021 52126 -51672 -108463 270307 232164 -325572 -25179 -212954
$$ packed form
18161G6774o991B7396C979b99992A91439A433a02068j22408j03499B2451c1275
18149b79674g9560A73429c1259k8028o0519B1152J00507b46434A89893b13012
18138b76732A19971a15582E2811b32902i8900k8715l0947L3122H627K49294J80796
18127D38717c6740j03571H7642R665e4233A22417E7985O8527l4145g8813j79093
18116b57906q4989c1713O457l42782a2455B73647b90268H8222c00910F2518b36594
18104i8480r2037d2916B29205h5450c482C0458b72314A49354G0223a4842l76904
18093c91746a47790B7446a02412o3698A8424b99850B6952N5960J74036b11545
18082D4052b73531c2768I4021m1895e1672n6791B70307l8143c25572b5179j87775
$$ plain form
18071 -212954 -188201 86431 73988 -152099 165999 20988 231960 259149 -158925 -264400
18061 -264400 45837 17401 -210417 108999 175931 40077 -117139 -57824 -327948 -74537 182399
18049 -147368 -31210 180603 293989 24024 234110 -111943 -26289 -167424 10258 63122
18039 63122 -11099 45297 18775 27768 -105475 -244235 -156087 59981 -141878 -99313 -209160
18028 -209160 -18607 193023 -213670 342446 -181911 -250708 -18012 -146091 259907 -20484
18017 -54649 3674 -112059 -98326 29234 -139409 -78708 -136364 141054 -161059 -146498 -103428
18006 -103428 186089 -54719 141661 -323104 -252551 151625 -156938 89395 72666 -63513
17995 -34609 60489 -261635 -205907 -105967 -192361 21213 -327564 -108763 -65183 -426361 -84265
$$ packed form
18071b12954K4753H6431j2443a52099A65999B0988K10972K7189a58925j05475
18061b64400D5837A7401b10417A08999O6932D0077a17139e7824k70124g4537A82399
18049a47368c1210A80603J13386B4024K10086a11943b6289j41135A0258N2864
18039F3122a1099D5297A8775Q993a05475j38760Q8148E9981a41878M2565j09847
18028b09160a8607A93023b13670C42446a81911o8797a8012j28079B59907b0484
18017e4649C674a12059J3733B9234a39409O0701n7656A41054a61059J4561M3070
18006a03428A86089e4719A41661c23104P0553A51625a56938H9395j6729f3513
17995c4609F0489b61635N5728R9940q6394B1213c27564a08763M3580l61178h4265
$$ plain form
17983 111238 -306404 68267 242618 -7749 -17612 117372 59909 115493 182558 480255 -215753
17971 41675 -159596 51963 119252 -33405 -178786 393385 -4037 52938 -39143 -189860 -222266
17960 -222266 217924 -40838 -188794 -61340 -85855 -266419 337499 -7950 47003 -62134 -84067
17949 -84067 -67912 289301 -154240 -2364 -111535 189626 -43542 195308 166372 152266 38309
17937 158481 -172205 43461 -141260 284388 -267352 -151970 -93462 87313 -212257 -345028
17927 -345028 248216 -58739 -152873 -140737 -162961 -331771 -316424 -150347 -61795 -49395 -296060
17916 -296060 -121721 133448 -96822 96332 63680 42038 -541433 27147 297079 -180437
17905 -99173 52530 128694 -209688 239067 -86978 253667 3232 -9790 414313 -27248 292061
$$ packed form
17983A11238c06404F8267J74351g749r863A17372n7463N5584O7065K97697b15753
17971D1675a59596E1963O7289c3405j45381C93385d037E2938c9143j50717l2406
17960b22266B17924d0838j47956f1340k4515j80564C37499g950D7003f2134k1933
17949h4067J6155B89301a54240b364j09171A89626d3542A95308k8936j4106C8309
17937A58481a72205D3461a41260B84388b67352J15382N8508H7313b12257j32771
17927c45028B48216e8739r4134J2136k2224j68810J5347a50347f1795J2400k46665
17916b96060a21721A33448i6822I6332l2652k1642e41433B7147K69932a80437
17905i9173E2530P6164b09688B39067h6978B53667C232i790D14313b7248B92061
$$ plain form
17893 -299314 -102733 -233777 -263536 203965 -327360 -112615 -50458 -356380 -44542 -81482
17883 -81482 -39092 -412375 -58601 -165296 240625 -23707 -41915 161428 -57237 11264 -45486
17871 233389 5516 -285191 -204984 -198892 -325796 -150731 -70231 -198451 80237 -147274 63191
17859 148606 53713 63970 44350 123918 -74435 244270 -9783 -8910 44437 119683 -7654 -195761
17847 -195761 187538 -119418 220375 -300885 -66676 -15744 109935 193696 -359426 69821
17836 -526674 394496 177358 134161 -134357 87295 121892 -88803 -105207 -149057 -34271 -89250
17825 -89250 17609 -51168 -22649 132866 393278 -48709 -431982 -131966 -44123 226215 41965
17813 216662 88705 141634 -235380 116125 -131152 54043 263853 -33779 -61425 -235358
$$ packed form
17893b99314a02733j31044k9759B03965c27360a12615e0458l05922d4542l6940
17883h1482c9092l73283e8601j06695B40625b3707j8208A61428e7237A1264d5486
17871B33389E516b85191Q0207O092j26904a50731g0231j28220H0237a47274F3191
17859A48606E3713J0257j9620P9568g4435B44270i783Q73D4437P5246g654j88107
17847a95761A87538a19418B20375c00885f6676a5744A09935Q3761c59426F9821
17836e26674C94496A77358m3197a34357H7295L4597h8803j6404m3850c4271n4979
17825h9250A7609e1168b2649A32866K60412d8709l83273a31966d4123B26215D1965
17813B16662H8705N2929b35380A16125a31152E4043K09810c3779k7646j73933
$$ plain form
17803 -235358 5679 5859 -635083 296979 -50688 -468975 -137909 25637 -54857 238268 -127209
17791 -32252 89892 277841 -1950 15801 -28805 -136855 -19793 110485 -14139 47310 85298
17780 85298 337623 -162845 -47549 266212 26451 205441 133926 61621 -10134 18992 -86629
17768 59388 -126536 170951 -228807 -66745 -225578 -309500 36418 -407615 -112294 -137555
17758 -137555 185445 -109929 59202 -47541 -327601 142657 -192493 26816 -144941 -48143
17747 304812 94242 -182026 -21003 -18887 156175 121483 -278996 113962 -26463 -154682 155198
17735 -89823 84851 -239256 93370 -40647 132945 -109567 -205696 -180414 -8492 186142 181355
17724 181355 235138 98739 47443 -372638 -8393 51295 1122 -201610 102722 65015 -90805
$$ packed form
17803b35358E679J80f35083B96979e0688m18287a37909B5637e4857B38268a27209
17791c2252H9892J87949a950A5801b8805j08050a9793A10485a4139D7310L7988
17780H5298K52325a62845d7549B66212B6451J78990p1515F1621a0134A8992h6629
17768E9388a26536A70951b28807f6745j58833q3922C6418d07615a12294k5261
17758a37555A85445a09929E9202d7541k80060A42657a92493B6816a44941d8143
17747C04812I4242a82026b1003K116A56175l4692b78996A13962b6463j28219A55198
17735h9823H4851b39256I3370d0647A32945a09567r6129K5282h492A86142m787
17724A81355N3783I8739D7443c72638h393E1295A122b01610A02722l7707i0805
$$ plain form
17712 -203000 209348 351890 -195741 -138654 -109957 -194235 134107 3676 191650 -137302
17701 -318760 -451082 86851 -11709 -162283 57369 85428 -73397 29615 144747 244443 -37551
17689 -291584 498840 147764 -68296 108275 206576 -126793 -139929 -155926 -148995 -134703 212852
17677 -99802 103801 -145745 -153480 -170117 267863 156855 70291 -182401 -35991 -16497 -58368
17666 -58368 -224113 81839 88026 -31308 85980 198914 -54839 149441 135462 47624 249230
17655 249230 -92075 -59391 -24974 172120 -10530 187477 -70552 324832 37486 -2133 124677
17643 52365 -7476 129129 -105468 121302 -59519 -96072 -1604 60341 -23045 -47418 -23633
17631 -107809 -146824 -41919 405595 -238272 488548 310200 44778 -138204 -47326 178637
$$ packed form
17712b03000B09348J42542a95741N7087K8697q4278A34107C676J87974a37302
17701c18760j32322H6851a1709j50574E7369K8059g3397B9615J15132R9696c7551
17689b91584D98840A47764f8296A08275R8301a26793j3136j5997O931J4292B12852
17677i9802A03801a45745p735j6637B67863j11008G0291a82401c5991a6497m1871
17666e8368j65745H1839O187c1308H5980J12934e4839A49441j3979D7624K01606
17655B49230i2075L2684b4974A72120a0530A87477g0552C24832C7486b133A24677
17643E2365g476A29129a05468A21302e9519l6553a604F0341b3045k4373b3633
17631a07809l9015d1919D05595b38272D88548j78348D4778a38204d7326A78637
$$ plain form
17620 258954 -206839 -291733 -150575 -199633 262544 1531 -83438 344896 186339 -55324 198047
17608 52872 -29880 96867 270086 -4580 -70713 -83077 139718 -10164 -338468 -33346 176870
17596 -70334 115881 392722 -173829 268171 38635 206240 -45874 -113453 -93416 -16027 -73861
17585 -73861 169799 -110982 -270668 146115 235900 176414 -202058 -49225 71746 85516 -101852
17573 -248115 36787 -227865 -45611 -91021 66322 118520 -25631 138231 -28644 -262602 -202101
17562 -202101 45675 324575 -168341 111935 178679 137273 160916 34253 -350510 -90219 26179
17550 1675 57300 -467656 -112493 -140495 101829 228409 247400 170371 137056 -15153 -59524
17539 -59524 331091 -68456 -66192 60571 -89163 -53369 -62764 224930 171873 5720 20174 211766
$$ packed form
17620B58954b06839q4894J41158m9058B62544A531h3438C44896j58557e5324A98047
17608E2872b9880I6867J73219d580o6133j2364A39718a0164l28304c3346A76870
17596g0334A15881K76841a73829B68171C8635J67605d5874o7579K0037a6027n7834
17585g3861A69799a10982j59686A46115Q9785n9486b02058d9225G1746J3770a01852
17573b48115C6787b27865d5611m5410F6322N2198b5631A38231b8644k33958O0501
17562b02101D5675K78900a68341A11935O6744m1406K3643C4253c50510i0219B6179
17550A675N5625d67656a12493k8002A01829J26580J8991p7029l3315a5153m4371
17539e9524C31091f8456K264F0571h9163L5794r395B24930n3057E720J4454J91592
$$ plain form
17527 211766 -74251 -122442 181114 -111926 -95933 -10286 -73362 -71682 373304 248366 62565
17515 -12564 108184 -191736 304244 189646 -71260 -178712 54343 281803 -141758 -262166
17505 -262166 10845 107534 -255733 -55865 339811 122308 266663 -90339 -98951 129485 -250587
17493 83948 -156516 198524 173917 271955 -120523 21091 -55704 208952 -12921 198844 -61074
17481 57712 226753 38897 209629 161383 338082 65860 182833 143851 239977 22898 -44984
17469 108053 206711 166425 -55032 40516 -11130 109058 367259 212470 76779 95643 293151
17458 293151 134107 291063 -113154 66441 -131205 404072 420808 161382 373405 104186
17447 -103122 71504 228101 76090 366827 -105717 2388 -77784 143914 200083 485883 421079
$$ packed form
17527B11766g4251m8191A81114a11926J5993a0286o3076J680C73304j24938F2565
17515a2564A08184a91736C04244j14598g1260j07452E4343K27460a41758j20408
17505b62166A0845R6689b55733e5865C39811A22308J44355i0339q612A29485b50587
17493H3948a56516A98524k4607R8038a20523B1091e5704B08952a2921A98844f1074
17481E7712J69041C8897J70732m8246J76699F5860J16973l8982R6126B2898d4984
17469A08053R8658m0286e5032D0516a1130A09058K58201j54789G6779J8864J97508
17458B93151A34107J56956a13154F6441a31205D04072J6736A61382K12023A04186
17447a03122G1504J56597G6090K90737a05717B388g7784A43914N6169K85800o4804
$$ plain form
17436 421079 221974 267105 283063 20165 300008 152819 143055 450769 31394 311173 135678
17424 332595 448894 526241 408385 261952 96233 310254 133296 323391 89692 579663
17414 579663 -133730 -91323 185205 596760 423414 -280992 350074 266110 -154332 -59372
17403 -7979 -39836 -126780 125063 -70497 142249 -139552 659486 217438 447843 30967 -49228
17391 -303834 90922 59748 190628 -67411 482618 499731 -37292 -10450 272856 -324429 88572
17379 282468 -47266 -275823 240770 -120171 80938 241594 284686 400355 144780 -169937
17368 -47032 -90073 239951 149293 -69913 18107 289648 -5430 176698 98911 215579 -287783
17356 365431 192894 213398 263825 -31270 -230953 271020 -29256 151516 639118 164108
$$ packed form
17436D21079j99105M5131J5958B0165K79843j47189r764L07714C1394K79779A35678
17424C32595J16299P7347j17856j46433I6233K14021A33296J90095H9692M89971
17414E79663a33730M2407A85205M11555j73346b80992C50074q3964a54332e9372
17403g979l1857q6944A25063g0497A42249a39552F59486B17438K30405C0967d9228
17391c03834I0922l1174J30880f7411D82618J7113c7292a0450B72856c24429H8572
17379B82468d7266k28557B40770a20171H0938J60656M3092J15669A44780a69937
17368d7032m3041B39951r0658f9913A8107K71541e430A76698p7787J16668b87783
17356C65431j72537K0504N0427c1270j99683B71020b9256A51516M87602A64108
$$ plain form
17345 148314 161261 306229 215040 242487 250200 117406 -87754 413763 109871 -338215 133825
17333 -14725 246907 26542 -128101 52308 77172 263181 62019 123584 338939 304859 300197
17322 300197 -91361 -137263 159102 286534 78297 268264 392751 -49259 38583 327889
17312 327889 12894 4892 28898 209006 -186270 392603 259658 38347 -74038 99807 84434
17301 84434 90504 360168 166841 -133499 -158911 123670 491811 222233 14246 311411
17291 311411 387336 -41033 210658 39061 52032 68405 122214 -181888 279963 85720 295776
17280 295776 296691 17272 300788 -43862 205851 -15885 158823 -9375 248321 206806 358550
17269 358550 181162 250488 563578 338660 -119089 184898 188874 177996 252596 -335159
$$ packed form
17345A48314J2947J44968r1189K7447P713A17406h7754D13763A09871c38215A33825
17333a4725B46907B6542a28101E2308K4864J86009F2019O1565K15355l4080m662
17322C00197i1361m5902A59102J27432G8297J89967J24487d9259C8583K89306
17312C27889A2894D892K4006J80108a86270C92603j32945C8347g4038I9807j5373
17301H4434O070K69664A66841a33499k5412A23670L68141B22233A4246K97165
17291C11411P5925d1033B10658C9061J2971J6373N3809a81888B79963H5720K10056
17280B95776R15A7272K83516d3862B05851a5885A58823i375B48321m1515J51744
17269C58550j77388O9326L13090k24918a19089A84898L976j0878P4600c35159
$$ plain form
17258 134223 128668 266878 127583 -57724 59087 237504 162472 63616 186597 -128642 227947
17246 285854 -847 213672 292108 58561 42543 -169332 451823 409167 409749 289331 213107
17235 213107 113578 118842 95929 85320 120196 48253 400291 361559 319767 288536 334105
17224 334105 254912 469543 98010 168845 -14163 245286 141746 -17629 228498 785526
17214 785526 144452 230943 223708 141174 350883 285764 -107473 182550 607226 142384
17203 -7848 120790 96351 440188 231806 198075 25836 273270 391574 431812 270528 294163
17192 294163 167697 40681 125166 263710 99616 176726 77686 439335 439346 269652 451850
17181 451850 17351 497113 423679 252457 239009 324563 113861 38788 52092 377677 296790
$$ packed form
17258A34223n555J38210A27583e7724E9087J78417p5032F3616J22981a28642B27947
17246B85854h47B13672P8436E8561j6018a69332D51823m2656N82j20418p6224
17235B13107r9529N264k2913j0609L4876D8253L52038l8732m1792l1231M5569
17224C34105p9193K14631I8010P0835a4163B45286j03540a7629B28498N57028
17214G85526A44452Q6491p235q2534K09709o5119a07473A82550M24676A42384
17203g848A20790k4439L43837k08382l3731B5836K47434J18304M0238j61284K3635
17192B94163j26466D0681Q4485J38544I9616P7110G7686L61649J1j69694J82198
17181D51850A7351M79762p3434j71222j3448Q5554A13861C8788J3304L25585q0887
$$ plain form
17170 296790 320420 73397 350009 342983 258367 334610 230714 164055 411971 -42798 171638
17158 340186 484807 377211 366808 95097 48260 359650 -105777 435559 405342 405477 300644
17147 300644 203929 350908 2343 244798 341783 448764 270041 482211 353035 473971
17137 473971 315585 412535 170773 -39871 8241 97337 623610 372768 227326 482659
17127 482659 221624 348123 548114 209015 552322 254706 268740 381295 444508 227500
17117 227500 302987 505300 269173 466450 571609 438105 300237 121128 349936 573177
17107 573177 451426 252600 405254 147291 -25723 251181 508885 72545 214156 544639
17097 544639 549186 219329 509842 301055 194567 259685 488855 356750 161077 352296
$$ packed form
17170B96790K3630G3397K76612p026q4616P6243j03896o6659K47916d2798A71638
17158C40186J44621j07596j0403I5097m6837L11390a05777D35559l0217J35j04833
17147C00644r6715J46979B343K42455R6985J06981j78723K12170j29176J20936
17137D73971j58386R6950A70773c9871H241Q9096N26273k50842j45442K55333
17127D82659B21624J26499J99991B09015L43307B54706J4034J12555O3213k17008
17117B27500P5487K02313k36127J97277J05159j33504j37868A21128K28808K23241
17107E73177j21751j98826J52654A47291b5723B51181K57704G2545J41611L30483
17097E44639M547B19329K90513k08787j06488O5118K29170j32105A61077J91219
$$ plain form
17087 352296 570276 519530 396520 687608 211475 633724 497731 432123 616993 82501
17076 412848 559361 334890 624808 436202 280296 280303 204745 311018 568554 289794 857261
17065 857261 546762 368129 630058 494621 330512 302609 428506 581738 404364 561812
17055 561812 566929 394155 580039 251952 432650 796936 454576 344486 553425 396403
17045 396403 679835 225932 634751 531874 727418 200290 403887 484007 492640 714262
17035 714262 573654 381961 425745 687627 492593 736279 722903 621629 720211 498692
17025 498692 944131 924509 524758 543635 680571 709175 531036 199394 670259 658505
17015 658505 254664 516845 462460 781395 775717 268930 851135 570896 593632 523095
$$ packed form
17087C52296K17980n0746j23010K91088B11475M22249j35993o5608J84870H2501
17076D12848J46513k24471K89918j88606j55906Pp5558J06273K57536k78760N67467
17065H57261l10499j78633K61929j35437j64109k7903J25897J53232j77374J57448
17055E61812N117j72774J85884B51952J80698L64286l42360j10090K08939j57022
17045C96403K83432B25932M08819j02877J95544B00290K03597Q0120Q633K21622
17035G14262j40608j91693M3784K61882j95034K43686j3376j01274R8582k21519
17025D98692M45439j9622l99751J8877J36936K8604j78139A99394M70865j1754
17015F58505B54664K62181n4385L18935n678B68930N82205k80239K2736p0537
$$ plain form
17005 523095 958130 1064362 563707 686675 758512 752959 745851 565802 710639 1059695
16995 1059695 485154 883886 727799 614116 506326 819409 687759 561646 1118643
16986 1118643 738075 710974 954732 794757 751250 1126762 644099 902383 930372 796958
16976 796958 866641 1057488 1103370 1075101 777764 526249 852192 1383864 1050900 833095
16966 833095 743498 1264183 1010246 590732 980050 938958 1282261 1133934 1062726 943805
16956 943805 883512 1303867 930318 935022 970145 831666 956687 1060930 918254 878383
16946 878383 1202383 1032276 1556139 1357996 1170204 1141598 1500443 1310197 1369944 1203439
16936 1203439 1306969 1150209 1328278 1328361 1600342 1003992 1405933 1321191 1360292 1539253
$$ packed form
17005E23095M35035J06232n00655J22968P1837n553p108j80049J44837L49056
16995A059695D85154L98732j56087j13683j07790L13083j31650j26113N56997
16986A118643l80568k7101K43758j59975m3507L75512m82663K58284K7989j33414
16976G96958O9683J90847M5882k8269k97337k51515L25943N31672l32964k17805
16966H33095q9597N20685k53937m19514L89318m1092L43303j48327p1208j18921
16956I43805o0293M20355l73549M704L5123j38479J25021J04243j42676l9871
16946H78383L24000j70107N23863j98143j87792k8606L58845j90246N9747j66505
16936A203439J03530j56760J78069Q3K71981n96350M01941q4742L9101J78961
$$ plain form
16926 1539253 1056115 1356860 1487912 1194703 1754938 1159439 1177359 1543074 1900154 1598702
16916 1598702 1712957 1713716 1382811 1777166 1462591 1925165 1324756 1561582 1572101 1999164
16906 1999164 1747873 1492990 1683079 1609704 1901677 1641728 1829731 1971746 1823221 1742505
16896 1742505 1918457 1822117 2045316 1960749 1996817 2037403 2062982 2297130 2129775 1782867
16886 1782867 2227843 2459703 1837400 1942966 2182451 2227447 1973148 2246858 2082455 2665951
16876 2665951 2011708 1962963 2498900 2246006 2357449 2253220 2310580 2330856 2637618 2647704
16866 2647704 2598797 2766384 2627587 2808723 2872620 2639286 2751046 2797287 3101983 2989132
16856 2989132 3033567 3043893 3343615 3308823 3366029 3130477 3011118 3371533 3284928 3708099
$$ packed form
16926A539253m83138L00745J31052k93209N60235n95499J7920L65715L57080l01452
16916A598702J14255P59l30905L94355l14575M62574o00409K36826J0519M27063
16906A999164k51291k54883J90089p3375K91973k59949J88003J42015j48525q0716
16896A742505J75952r6340K23199q4567L6068M0586K5579K34148j67355l46908
16886A782867M44976K31860o22303J05566K39485M4996k54299K73710j64403N83496
16876B665951o54243m8745N35937k52894J11443j04229N7360K0276L06762J0086
16866B647704m8907J67587j38797J81136O3897k33334J11760M6241L04696j12851
16856B989132M4435J0326K99722l4792N7206k35552j19359L60415q6605M23171
$$ plain form
16846 3708099 3384522 3660193 3570270 3542174 3904379 3905887 3955854 3906680 4309862 4151864
16836 4151864 4192065 3944571 4102913 4206964 4421497 4422708 4590564 4392822 4641299 4872959
16826 4872959 4812067 4957646 4675974 5021299 5313735 4954489 5374845 5389478 5591062 5474425
16816 5474425 5757804 6140316 6163892 6294922 6461327 6701215 6571630 6632651 6485732 7194001
16806 7194001 7461070 7135858 7450108 7722928 7505973 7811541 8233195 8413947 8839906
16797 8839906 9007656 8917482 9028688 9688896 9524136 10000401 10126830 10682918 10671796 11191199
16787 11191199 11187589 11492073 12104711 12194232 12699474 13145143 13358746 13558247 14277102 14979588
16777 14979588 15142297 15783411 15903628 16722499 17024139 17434225 18546468 19112645 19645180
$$ packed form
16846C708099l23577K75671q9923k8096L62205J508M9967m9174M03182j57998
16836D151864M0201k47494J58342J04051K14533J211J67856j97742K48477K31660
16826D872959o0892J45579k81672L45325K92436l59246M20356J4633K01584j16637
16816E474425K83379L82512K3576J31030J66405K39888j29585O1021j46919P08269
16806G194001K67069l25212L14250K72820k16955L05568M21654J80752M25959
16797H839906J67750r0174J11206O60208j64760M76265J26429N56088j1122N19403
16787A1191199l610L04484O12638Q9521N05242M45669K13603J99501P18855P02486
16777A4979588J62709O41114J20217Q18871L01640M10086J112243N66177N32535
$$ plain form
16768 19645180 20222933 21310824 21760115 22296201 23533536 24322762 25525249 26401354 27408664
16759 27408664 28740741 30094001 31220690 32600974 33881299 35194822 36773611 38588267
16751 38588267 40149002 42408604 44543298 46964227 48912776 51796041 54413701 56902073
16743 56902073 60326077 63113801 67170116 70740676 74860403 79294564 83921727 88749631
16735 88749631 94230486 99459357 105535167 111731442 118534103 125194799 132387512 139512113
16727 139512113 147136389 154534343 162101207 169307396 175754401 182173115 187575058 191929524
16719 191929524 195412013 197359783 198255223 197933323 196165379 193144688 188944935 183922852
16711 183922852 177983773 171229964 164054098 156768537 149028768 141443635 133853281 126119653
$$ packed form
16768A9645180N77753J087891M49291N36086J237335P89226J202487Q76105J007310
16759B7408664J332077J353260J126689J380284J280325J313523J578789J814656
16751C8588267J560735K259602K134694K420929J948549K883265K617660K488372
16743E6902073L424004K787724M056315L570560M119727M434161M627163M827904
16735H8749631N480855N228871O075810O196275O802661O660696P192713P124601
16727A39512113P624276P397954P566864P206189O447005O418714N401943M354466
16719A91929524L482489J947770Q95440l21900j767944l020691m199753n022083
16711A83922852n939079o753809p175866p285561p739769p585133p590354p733628
$$ plain form
16703 126119653 119365903 112432767 106167007 99804585 93944952 88333782 83172190 78611319
16695 78611319 74042179 70263500 65863153 62252451 59043483 56113967 53231572 50423707
16687 50423707 47429713 45291800 42981221 40914257 38989045 37292354 35408544 33970808
16679 33970808 32148970 30810466 29301765 28560176 27125772 26141572 25014126 24106166
16671 24106166 23348592 22431963 20985629 20591011 19563715 18721456 18463782 17823369 17150646
16662 17150646 16482255 15800648 15438650 15200907 14918481 13831740 13375656 13144331 12754807
16653 12754807 12617650 12039370 11766747 11236498 11177951 10863451 10507308 9995511 10033862 9462092
16643 9462092 9218292 9077548 8661262 8676615 8448849 8316366 8036226 7702082 7574169 7456366
$$ packed form
16703A26119653o753750o933136o265760o362422n859633n611170n161592m560871
16695G8611319m569140l778679m400347l610702l208968k929516k882395k807865
16687E0423707k993994k137913k310579k066964j925212j696691j883810j437736
16679C3970808j821838j338504j508701p41589j434404r84200j127446r07960
16671B4106166p57574r16629j446334l94618j027296q42259k57674o40413o72723
16662A7150646o68391o81607l61998k37743k82426j086741m56084k31325l89524
16653A2754807j37157n78280k72623n30249n8547l14500l56143n11797L8351n71770
16643I462092k43800j40744m16286J5353k27766j32483k80140l34144j27913j17803
$$ plain form
16633 7456366 7270916 7382341 6633369 6873477 6801578 6385683 6334806 6084610 5963167 5757406
16623 5757406 5969685 5992151 5854126 5675173 5374470 5121844 4958102 4788306 4637941 5015729
16613 5015729 4569475 4462168 4635012 4825664 4105510 3949817 4166901 4272663 4604859
16604 4604859 4023420 3977557 3894177 4121772 3510495 3550074 4109887 3598156 3628889 3358825
16594 3358825 3454343 3212264 3122518 3111706 3175118 2977763 2850482 2648279 2945572 2963276
16584 2963276 3075284 2734225 2848361 2965464 2400152 2678005 2518777 2410808 2667186
16575 2667186 2491771 2464643 2793721 2364642 2391602 2486649 2488402 2358040 2063208 2153221
16565 2153221 2127964 2232411 2081509 1947662 1968064 1919080 2020751 1976297 1447409 1706923
$$ packed form
16633G456366j85450J11425p48972K40108p1899m15895n0877k50196j21443k05761
16623E757406K12279K2466j38025j78953l00703k52626j63742j69796j50365L77788
16613E015729m46254j07307J72844J90652p20154j55693K17084J05762L32196
16604D604859n81439m5863q3380K27595o11277L9579N59813n11731L0733k70064
16594C358825R5518k42079q9746j0812O3412j97355j27281k02203K97293J7704
16584B963276J12008l41059J14136J17103n65312K77853j59228j07969K56378
16575B667186j75415k7128L29078m29079K6960R5047J753j30362k94832R0013
16565B153221k5257J04447j50902j33847K0402m8984J01671m4454n28888K59514
$$ plain form
16555 1706923 2180915 1788160 1798494 1838638 1791262 1732765 1438938 1406785 1330370 1651075
16545 1651075 1534773 1847021 1747497 1360343 1506599 1573330 1358487 1603492 1369375 1354391
16535 1354391 1610588 1272544 1222959 1135729 1403332 1632157 1224192 1148041 1289623 1113777
16525 1113777 1799902 1562271 1322350 1047330 1504626 1170886 1093617 1226884 1382340 747007
16515 747007 1044712 1139090 1195342 1119086 940213 802869 1199847 799186 1354756 1251025
16505 1251025 1037999 929072 1410308 861208 979695 768415 1199205 779355 792817 796215
16495 796215 908998 907773 991218 657550 1155101 902012 729723 819754 859362 1001550
16485 1001550 909551 762773 905256 368197 670276 802842 986124 664948 877398 879168
$$ packed form
16555A706923M73992l92755J0334M0144m7376n8497k93827l2153p6415L20705
16545A651075j16302L12248r9524l87154J46256O6731k14843K45005k34117j4984
16535A354391K56197l38044m9585q7230K67603K28825m07965p6151J41582j75846
16525A113777O86125k37631k39921k75020M57296l33740p7269J33267J55456o35333
16515G47007K97705R4378N6252p6256j78873j37344L96978m00661N55570j03731
16505A251025k13026j08927M81236n49100J18487k11280M30790m19850J3462L398
16495G96215J12783j225Q3445l33668M97551k53089j72289R0031L9608J42188
16485A001550r1999j46778J42483C68197L02079J32566J83282l21176K12450J770
$$ plain form
16475 879168 1087301 787648 734775 844122 752903 521214 695805 679713 560959 696105
16465 696105 439639 484502 624979 724413 682004 815178 656203 654557 623889 569139 751164
16454 751164 825514 263213 637046 824653 452253 388998 819362 591368 517126 537495
16444 537495 588706 483044 296383 944006 511869 774362 393755 773399 627234 331157
16434 331157 565823 587962 443855 397501 587771 603318 662122 415027 299917 496500
16424 496500 134745 193077 281885 450403 565173 488010 424358 454642 388756 577984 561742
16413 561742 481306 531693 557465 295492 182166 342947 496354 656826 396418 590632
16403 590632 468694 137164 207919 439415 539285 391405 24123 94759 363845 376076
$$ packed form
16475H79168K08133k99653n2873J09347r1219k31689J74591j6092j18754J35146
16465F96105k56466M4863J40477R9434m2409J33174j58975j646l0668n4750J82025
16454G51164P4350B63213L73833J87607l72400o3255M30364k27994p4242K0369
16444E37495N1211j05662j86661O47623m32137K62493l80607L79644j46165k96077
16434C31157K34666K2139j44107m6354J90270J5547N8804k47095j15110J96583
16424D96500A34745N8332Q8808J68518J14770p7163o3652L0284o5886J89228j6242
16413E61742q0436N0387K5772k61973j13326J60781J53407J60472k60408J94214
16403E90632j21938A37164P0755K31496R9870j47880B4123P0636K69086J2231
$$ plain form
16393 376076 143889 456978 179152 329281 717005 144200 297726 452261 533327 354401
16383 354401 421444 262705 508556 173577 364330 328764 12647 147805 264418 222500
16373 222500 498379 394725 544295 512695 362061 285665 111764 357272 273858 63146
16362 169760 473763 237609 391433 322026 -58871 134598 322981 88841 162549 292520
16352 292520 280765 448828 617932 -135613 54546 -121100 157684 225807 663508 202766
16341 131219 442161 83130 480625 351036 -16038 170582 281868 266005 458512 402385
16331 402385 252984 -93287 154149 207637 515251 117332 90534 415185 183665 16479
16320 195397 203284 -8666 191624 236007 -14932 -229458 241698 196852 149863 218197 -80476
$$ packed form
16393C76076A43889L13089A79152J50129L87724A44200J53526J54535Q1066j78926
16383C54401O7043j58739K45851A73577J90753l5566A2647J35158J16613m1918
16373B22500K75879j03654J49570l1600j50634p6396A11764K45508q3414F3146
16362A69760L04003k36154J53824o9407e8871A34598J88383H8841P3708J29971
16352B92520j1755J68063J69104a35613E4546a21100A57684O8123M37701B02766
16341A31219L10942H3130L97495j29589a6038A70582J11286j5863J92507n6127
16331D02385j49401i3287A54149N3488L07614A17332k6798L24651A83665A6479
16320A95397P887h666A91624M4383a4932k14526B41698m4846m6989O8334h0476
$$ plain form
16308 -76700 228551 -76493 -173188 71659 496246 12778 180508 229669 175771 7290 42870
16297 42870 -209218 282901 320694 242879 63036 98983 293763 74021 238833 206421 389112
16286 389112 348066 212022 54702 381451 -3004 101027 318051 285915 353602 132264 260711
16275 260711 -330574 -110485 483634 -43235 -134115 125560 65693 252548 298085 138086
16264 262246 -53691 79165 -52219 -180632 35765 281696 -18446 331485 -89407 -90975 -78632
16253 -78632 129843 -284145 332766 7108 474582 154901 42810 265902 -128350 141644
16242 219872 -200811 15547 -324899 102687 290036 35237 334815 -23095 246125 461530
16232 461530 76911 88107 -81313 345736 120746 56698 122453 -139647 -55215 407988 -38509
$$ packed form
16308g6700B28551g6493r6695G1659M24587A2778J67730M9161n3898G290L5580
16297D2870b09218B82901L7793p7815F3036L5947J94780G4021J64812l2412J82691
16286C89112m1046j36044E4702L26749c004A01027K17024l2136O7687A32264J28447
16275B60711c30574a10485D83634d3235r0880A25560n9867J86855M5537A38086
16264B62246e3691G9165e2219j28413C5765K45931a8446C31485h9407j568J2343
16253g8632A29843b84145C32766G108M67474A54901D2810K23092a28350A41644
16242B19872b00811A5547c24899A02687J87349C5237K99578b3095B46125K15405
16232D61530G6911J1196h1313C45736A20746E6698O5755a39647e5215D07988c8509
$$ plain form
16220 6698 -197219 267074 356930 76300 -20364 214720 198232 348163 306003 -113537 90354
16208 166590 -13917 5203 -179337 -131737 -17139 526520 -73657 236972 332888 275880 -158362
16196 -109204 -3414 -130452 215669 -73816 103489 240664 341614 -84888 22337 -149630
16185 455807 -267203 -47511 -285747 146233 -151005 330564 -88615 -9710 412217 7462 -256406
16173 16864 -160114 295290 99735 59406 119698 314161 408905 -127 37875 29882 -165383
16161 -14452 38024 156160 -28857 242023 -32878 -61320 -115207 -192396 -92919 70465 76086
16150 76086 144164 59678 -67844 -335720 -68500 229018 284019 49990 79738 141508 207257
16139 207257 -152889 24976 -69388 273871 240376 -132087 48010 -127122 5051 -385647 213502
$$ packed form
16220F698a97219B67074Q9856G6300b0364B14720j6488J49931m2160a13537I0354
16208A66590a3917E203a79337M7600a7139E26520g3657B36972R5916n7008a58362
16196a09204c414j27038B15669g3816A03489J37175J00950h4888B2337a49630
16185D55807b67203d7511k38236A46233a51005C30564h8615i710D12217G462b56406
16173A6864a60114B95290I9735m0329O0292J94463R4744a27C7875p993a65383
16161a4452C8024J18136b8857B42023c2878k8442n3887p7189i2919G0465N621
16150G6086O8078E9678f7844k67876f8500B29018N5001D9990K9748O1770O5749
16139B07257a52889B4976f9388B73871l3495a32087D8010a27122E051c85647B13502
$$ plain form
16127 -145029 153396 71196 -75676 -113754 156141 294004 -150941 168691 -18605 98948
16116 -22246 16668 -109773 262067 69823 268969 -39175 58712 257809 74751 -238091 55899
16104 384615 341960 188681 318818 45836 220636 -229324 -212878 160828 -186329 96026
16093 65779 -392182 150146 6891 126934 171972 -138865 -183746 -107214 -5273 -24358 -166399
16082 -166399 337888 148608 -234898 -134020 201097 -112528 155598 -12962 85203 -10262
16071 -252685 27708 -41583 -116975 -37587 291086 -160277 222694 123500 -59705 22102 269232
16060 269232 95637 -253711 -195135 139151 -109278 116024 164587 -689 -107936 127595 -260192
16048 -25144 96438 -163736 114413 -229779 -22812 147735 -296165 -75938 -36964 366742
$$ packed form
16127a45029A53396G1196g5676l8078A56141J37863a50941A68691a8605I8948
16116b2246A6668a09773B62067F9823J99146c9175E8712J99097G4751b38091E5899
16104C84615m2655j53279J30137D5836J74800b29324J6446A60828a86329I6026
16093F5779c92182A50146F891J20043M5038a38865m4881P6532e273j9085j42041
16082a66399C37888A48608b34898J00878B01097a12528A55598a2962H5203a0262
16071b52685B7708d1583p5392c7587B91086a60277B22694r9194e9705B2102K47130
16060B69232I5637b53711N8576A39151a09278A16024M8563f89j07247A27595b60192
16048b5144I6438a63736A14413b29779b2812A47735b96165g5938c6964C66742
$$ plain form
16037 -131046 -42869 -76619 189903 35513 198362 184885 -416603 -80256 283603 -113623
16026 -77091 2140 170413 -110305 308041 243580 155712 243317 -94106 168546 -93494 6491
16014 -190100 -23176 -276215 -193396 -264264 30302 146947 -112636 -145563 -249599 -162222 73979
16002 -212010 113205 31255 19937 -648704 -83126 -119583 -37242 -300766 -111966 -25206 -81393
15991 -81393 20717 -110508 -33271 -328797 -167301 96839 -397212 49912 307206 342371 217085
15980 217085 311012 189878 257381 420661 -166248 209294 90044 303627 261186 279979
15970 279979 -227831 307425 -72233 -241950 -295891 -66570 75716 30292 218888 171810 410187
15959 410187 57336 -421895 -195116 91452 -121947 4160 389465 124582 57563 50057 -228529
$$ packed form
16037a31046d2869l3750A89903C5513J62849j3477d16603h0256B83603a13623
16026g7091B140J68273a10305C08041o4461q7868Q7605i4106A68546i3494F491
16014a90100b3176k53039Q2819p0868C0302J16645a12636l2927j04036Q7377G3979
16002b12010A13205C1255j1318f48704h3126l6457c7242k63524a11966b5206n6187
15991h1393B0717a10508c3271k95526J61496I6839c97212D9912K57294L5165j25286
15980B17085R3927j21134O7503J63280a66248B09294I0044K13583m2441J8793
15970B79979b27831C07425g2233j69717n3941f6570G5716C0292J88596m7078K38377
15959D10187E7336d21895a95116I1452a21947D160L85305A24582E7563p506b28529
$$ plain form
15947 303917 -148097 -2290 -51092 -172800 -347268 -133365 -172769 -113304 104704 -141743
15936 -32664 -7633 91542 206450 -52192 -66506 -185654 -52262 -297490 -117739 72749 -103810
15924 -201786 142592 895 -121025 103836 -117353 290010 -190777 -390708 -82941 176679
15913 194820 -59653 -2384 -28599 55122 -126466 -202697 124977 -51805 -52009 305582 -220200
15901 -54274 -46579 -96475 -33628 222105 -101135 -137252 108115 37594 -34236 97432 89787
15890 89787 275296 -31317 -316749 -492284 -384733 -109971 68400 161528 107686 206169 1613
15878 33296 -87222 -253993 -54164 -228831 241902 -79850 196344 -156651 120268 367743
15868 367743 -113161 -218757 -449424 -101550 6186 221744 -69435 -229784 -232264 -300740 -130382
$$ packed form
15947C03917a48097b290m8802j21708j74468a33365l9404N9465A04704a41743
15936c2664g633I1542J14908e2192j4314j19148e2262k45228a17739G2749a03810
15924b01786A42592H95a21025A03836a17353B90010a90777j99931h2941A76679
15913A94820e9653b384k6215E5122a26466p6231A24977e1805k04C05582b20200
15901e4274P695m9896c3628B22105a01135l6117A08115C7594c4236I7432p645
15890H9787J85509c1317k85432j75535J07551a09971F8400R3128n3842R8483A613
15878C3296h7222j66771e4164j74667B41902g9850A96344a56651A20268K47475
15868C67743a13161j05596k30667a01550F186K15558f9435j60349k480o8476a30382
$$ plain form
15856 15924 -146764 -299693 199376 -215639 115727 -118444 1976 11157 -208721 -60808 -194031
15845 -194031 -108262 364 -281591 308550 24683 211708 -442253 -85267 -128823 168422 114716
15834 114716 -324196 23194 -330294 -48896 112347 62785 170517 270677 -56859 25146
15823 2771 -271793 41193 -274055 179731 -59939 96382 -129688 48132 236242 -320694 -217900
15812 -217900 263536 24174 -213151 -36301 14137 -186920 -376215 -70501 -74018 -32196 -220484
15801 -220484 190050 136561 -116239 -46951 -89954 96880 -207373 36905 -27967 8490 -318587
15789 -35712 215598 50067 22973 51302 301927 -4321 135766 -50032 -306975 -361717 177190
15777 -54731 259169 37904 -215267 -342560 2067 -15256 -208792 80428 -142700 67245 -380930
$$ packed form
15856A5924a46764j52929A99376b15639A15727a18444A976R181b08721f0808j33223
15845a94031Q5769C64b81591C08550B4683J87025d42253h5267m3556A68422n3706
15834A14716c24196B3194c30294d8896A12347m9562J07732J00160e6859B5146
15823B771b71793D1193b74055A79731e9939I6382a29688D8132J88110c20694J02794
15812b17900B63536B4174b13151c6301A4137a86920j89295g0501l517c2196j88288
15801b20484A90050n3489a16239d6951m3003I6880b07373C6905b7967H490c18587
15789c5712B15598E0067B2973K8329K50625d321A35766e0032k56943n4742A77190
15777e4731B59169C7904b15267j27293B067a5256j93536H0428a42700F7245c80930
$$ plain form
15765 -346103 108017 105270 3587 -262177 -67038 52170 -334095 463673 474374 115435 -396820
15753 -9150 -237884 123746 126363 176079 -139222 -176819 173102 264704 -44089 126749 110094
15742 110094 -220946 -59256 -142926 -27069 110873 -261403 316032 71959 -176036 -230722
15732 -230722 -133254 43361 -303635 -70791 115633 -146420 280919 63009 -305041 -199389
15722 -199389 58897 262322 84038 -17061 67194 -179764 -120755 -156643 11849 7204 257604
15711 257604 -153826 -2019 -88125 -201481 121292 149897 164599 58964 78766 1567 -346276
15699 -146688 -395516 -269283 54640 -165914 142847 -252508 -186761 413225 -27159 111203
15688 -191674 16108 96135 -10520 -158599 119332 -32603 12442 119961 -20095 63963 9816
$$ packed form
15765c46103A08017k747C587b62177f7038E2170c34095D63673J0701A15435c96820
15753i150k28734A23746K617M9716a39222l7597A73102R1602d4089A26749j6655
15742A10094b20946e9256q3670b7069A10873b61403C16032G1959a76036n4686
15732b30722R7468D3361c03635g0791A15633a46420B80919F3009c05041J05652
15722a99389E8897K03425H4038a7061F7194a79764N9009l5888A1849m645K50400
15711B57604a53826b019q6106j13356A21292K8605J4702E8964J9802A567c46276
15699a46688k48828J26233E4640a65914A42847b52508O5747D13225b7159A11203
15688a91674A6108Q0027a0520j48079A19332c2603A2442J07519b0095F3963I816
$$ plain form
15676 -83366 47181 -72568 -72520 263804 9212 -73224 -55749 344737 -65595 -113512 -352623 -315413
15664 -315413 -47542 -183825 -243139 310221 -345926 81790 -21523 -192644 -356219 -245956
15654 -245956 -14363 -28550 -36179 -26527 -227287 62492 67293 -286308 160912 -84340 156864
15642 -140263 73246 -28801 201215 -174170 -13944 -104733 50915 -400276 -302032 -6051 -436761
15631 -436761 113244 207818 -63254 -17113 -16794 330753 30929 220056 72672 -163742 -73649
15619 -147191 144459 65271 -90196 -148936 -13142 -266818 -303393 -519492 -41435 -183428 -145092
15608 -145092 -107870 -56405 -161553 -49943 -136051 -248993 -20567 10499 -46132 -196283 281726
15596 98530 101332 86945 -55394 -133590 -16262 27833 -177659 -153876 -132064 210237 -45766
$$ packed form
15676h3366D7181g2568M8B63804I212g3224J7475C44737f5595m7917k39111L7210
15664c15413d7542j36283n9314C10221c45926H1790b1523j71121j63575J10263
15654b45956a4363j4187p629R652k00760F2492M801b86308A60912h4340A56864
15642a40263G3246b8801B01215a74170a3944r0789E0915d00276R8244f051m30710
15631d36761A13244R4574f3254a7113L19C30753C0929J89127G2672a63742g3649
15619a47191A44459F5271i0196n8740a3142k53676l6575k16099d1435j41993L8336
15608a45092L7222N1465j05148d9943q6108j12942b0567A0499d6132j50151B81726
15596I8530K802j4387e5394p8196a6262B7833a77659K3783K1812B10237d5766
$$ plain form
15584 -437687 -374788 -147017 -23445 -199074 109999 -197819 -59965 -114138 -193900 59687 64541
15573 64541 23973 -108982 -266127 42948 47442 41046 -319776 -121482 160790 176136 55696
15561 294456 -151833 -93400 -240736 102340 131254 83649 35359 -204112 -34652 63525 32044
15550 32044 -164346 -170702 113093 105096 76629 -116834 101874 -171911 83117 -108887 -121781
15539 -121781 -159814 -165090 308268 7783 17473 -134977 42055 134916 -89407 -24015 -46736 -85010
15527 -85010 9512 -52971 -23301 -226222 -84599 -96438 104301 -330500 -107232 25725 -209736
15515 128941 155603 105623 132570 314365 192234 -39209 39179 135276 -179107 271234 102665
15503 116227 -64065 -481 -32358 -116173 -27002 265854 -107210 -183962 -53350 299254 -214489
$$ packed form
15584d37687O2899a47017b3445j75629A09999a97819e9965n4173p9762E9687M854
15573F4541B3973a08982j57145D2948M494o396c19776a21482A60790J5346E5696
15561B94456a51833N8433j47336A02340K8914m7605C5359b04112c4652F3525l1481
15550C2044a64346o356A13093p997k8467a16834A01874a71911H3117a08887j2894
15539a21781l8033n276C08268G783R690a34977D2055R2861h9407b4015k2721l8274
15527h5010I512e2971b3301k02921h4599j1839A04301c30500a07232B5725b09736
15515A28941K6662m9980K6947J81795j22131c9209C9179R6097a79107B71234A02665
15503A16227f4065d81l1877q3815b7002B65854a07210p6752e3350B99254b14489
$$ plain form
15491 -54046 73279 61408 -34869 -90591 -247604 -2386 194086 -84520 60000 -193469 113454
15479 -183291 -143334 239941 86841 -39131 167166 -50809 309483 30205 -135120 15507 82229
15468 82229 -246067 -375553 -60437 102883 -267707 -53288 -232482 -165838 -33390 413587
15457 -139758 -359878 -159449 16118 -13745 45252 -104474 -189671 -250601 107896 218558
15447 218558 -245790 -206488 140893 265322 328332 -448757 -184338 5734 -30142 229170
15436 -13127 135332 -258560 269588 -219646 61915 -46484 274917 67897 -273462 64309
15425 -192545 -87858 -58619 202214 120196 -325991 106257 67223 84165 266878 228496 -23312
15413 -72550 170981 164818 -81710 -45314 476487 -101113 -310839 120356 258235 -237706
$$ packed form
15491e4046G3279j1871c4869n5722j57013b386A94086h4520F0000a93469A13454
15479a83291L9957B39941H6841c9131A67166e0809C09483C0205a35120A5507O6722
15468H2229b46067j29486f0437A02883b67707e3288j79194O6644c3390D13587
15457a39758k20120a59449A6118a3745D5252a04474q5197o0930A07896J10662
15447B18558b45790L9302A40893J24429O3010d48757a84338E734c0142B29170
15436a3127A35332b58560B69588b19646F1915d6484B74917F7897b73462F4309
15425a92545h7858K9239B02214q2018c25991A06257l9034J6942J82713l8382b3312
15413g2550A70981o163h1710L6396D76487a01113k09726A20356J37879b37706
$$ plain form
15402 -174482 -18779 361202 -181114 43178 98941 136964 -209947 84236 258368 -65541 -306067
15391 -306067 39843 -159591 116165 35358 -121817 -324131 37011 67646 -88856 67964 50560
15380 50560 286282 -229042 44308 -249518 186640 -237214 -210941 -262574 182006 -211742
15369 -195833 26713 1981 18274 -14687 -139009 -7873 43203 -24749 -230747 -151504 445890
15357 -253481 186811 -177440 -63861 52443 76809 -78026 -206243 -70298 -149388 -18221 -1645
15345 100119 -123538 -306389 187770 251166 13154 -819 -186197 53488 -113206 298938 -295635
15333 1656 247275 -21225 124221 -211162 115005 -60379 51635 -138166 -310132 -152833
15322 -209967 153593 139644 144679 314991 75337 280765 -228725 -95332 -110058 263846 82582
$$ packed form
15402a74482a8779C61202a81114D3178N5763L8023b09947H4236J74132f5541k40526
15391c06067C9843a59591A16165C5358a21817k02314C7011L0635h8856F7964j7404
15380E0560K35722b29042D4308b49518A86640b37214K6273n1633A82006b11742
15369a95833B6713A981J6293a4687j24322g873D3203b4749k05998P9243D45890
15357b53481A86811a77440f3861E2443K4366g8026j28217g0298p9090a8221a645
15345A00119a23538j82851A87770O3396A3154h19j85378E3488a13206B98938b95635
15333A656K45619b1225A24221b11162A15005f0379E1635a38166j71966a52833
15322b09967A53593j3949N035J70312G5337K05428b28725i5332j4726B63846H2582
$$ plain form
15310 36239 -112189 147644 133883 216242 54231 80528 -362617 360666 201572 32941 -277954
15298 101734 90602 144048 170057 39547 94230 131255 -149817 -324627 65443 -8358 83922
15286 -210945 57660 -67591 218723 90841 -281513 36669 -37463 -415324 121503 188832 -75548
15274 -25790 -172462 200856 350501 157880 392359 75936 -46098 -46277 61496 331142 24440
15262 117419 -350937 -99090 -69031 200103 -97838 136441 -43593 -12397 -153586 -168180 -233629
15251 -233629 212299 325938 344962 886288 2197311 1082105 1554394 1625477 781794 198791
15240 198824 230034 -151573 247351 43429 285873 -142177 272088 -20558 389626 153019
15229 74472 319224 -315904 86099 -380103 390330 135141 329033 -62865 -313885 50086
$$ packed form
15310C6239a12189A47644j3761Q2359E4231K6297c62617C60666j59094C2941b77954
15298A01734j1132N3446K6009C9547N4683L7025a49817j74810F5443h358H3922
15286b10945E7660f7591B18723I0841b81513C6669c7463l77861A21503O7329g5548
15274b5790j46672B00856J49645A57880K34479G5936d6098j79F1496K69646B4440
15262A17419c50937i9090L0059B00103i7838A36441d3593a2397j41189j4594o5449
15251b33629B12299J13639J9024N41326J311023A082105M72289P1083G81794A98791
15240A98824L1210a51573B47351D3429K42444a42177B72088b0558C89626A53019
15229G4472K44752c15904H6099c80103C90330A35141J93892f2865k51020E0086
$$ plain form
15218 172415 190748 -165858 55658 288169 93396 39756 186696 229571 248036 -76401 12361
15206 19944 -58069 198241 112557 153379 -32734 249763 254963 92039 257824 115996 138893
15195 138893 -204580 -114648 -6849 128638 89036 -174283 -74493 -65357 -436854 860 -33575
15183 149153 -157594 193323 -8455 -117016 181408 -111715 166703 213962 19950 156541
15173 156541 174821 317101 376949 -159252 52447 201537 22644 -171486 -251821 269321
15162 186834 236367 -143449 193975 -85670 110880 -22883 25340 4169 25677 246718 63054
15150 164563 487336 215351 -146603 103091 375917 -138998 -108584 11388 89089 16729
15139 171043 -188865 46376 -160381 22713 53233 -72511 346292 -18106 16160 195542 -189927
$$ packed form
15218A72415J8333a65858E5658K32511I3396C9756J46940M2875J8465g6401A2361
15206A9944e8069A98241q5684M0822c2734B49763N200I2039J65785A15996K2897
15195A38893b04580Q9932f849A28638l9602a74283g4493R136l71497H60c3575
15183A49153a57594A93323h455j08561A81408a11715A66703M7259A9950J36591
15173A56541J8280J42280N9848a59252E2447J49090B2644a71486q0335B69321
15162A86834M9533a43449A93975h5670A10880b2883B5340D169K1508K21041F3054
15150A64563L22773B15351a46603A03091K72826a38998L0414A1388P7701A6729
15139A71043a88865D6376a60381B2713L0520g2511C46292a8106A6160J79382a89927
$$ plain form
15127 219972 582280 330167 188190 -192056 398718 127862 465027 114274 160132 108227
15117 108227 439730 99601 183464 -71020 243694 64101 125130 55090 237517 284968 138278
15105 154474 61433 9915 -51108 51504 89788 64084 327221 24465 168315 160692 -220448
15093 -201552 236552 -268493 -116269 321340 249612 269505 334214 430399 33448 -145 31061
15081 423502 2490 -84848 -189830 373450 -70143 187326 166402 172564 151245 377209 50514
15069 -55709 128161 232593 -59711 -31275 -54748 500773 162220 275771 -116340 261733
15058 -129803 244493 98119 171431 -120956 189324 376686 173107 -36322 4381 101826 20782
15046 -96946 119392 366423 -68742 102955 202581 65843 76635 148883 323319 600526 271277
$$ packed form
15127B19972L62308k52113j41977a92056C98718A27862L37165A14274M5858n1905
15117A08227L31503I9601Q3863g1020B43694F4101O1029E5090J82427M7451A38278
15105A54474F1433I915e1108E1504L8284k5704K63137B4465J43850p623b20448
15093b01552B36552b68493a16269C21340p1728J9893O4709R6185C3448a45C1061
15081D23502B490h4848j04982C73450g0143A87326k0924O162k1319K25964E0514
15069e5709A28161J04432e9711K8436k3473E00773A62220J13551a16340B61733
15058a29803B44493I8119P3312a20956A89324J87362A73107c6322D381R7445B0782
15046i6946A19392K47031f8742A02955R9626F5843J0792P2248J74436K77207B71277
$$ plain form
15034 330928 302885 198316 355631 131548 252908 -122637 526694 -130716 111525 202403
15024 202403 949 431242 181706 206194 385337 176204 138327 51099 198208 111280 44884
15012 48877 240710 403018 -121059 174823 56104 271654 317148 36642 267461 392851
15002 392851 286497 425415 228731 535090 333750 35796 53126 278786 68058 177280
14992 177280 288143 8361 401282 373583 -73356 152167 25418 267240 355056 225372 26272
14980 -148243 311910 60298 347775 81091 136710 270843 273711 60006 259032 -42691 -258223
14969 -258223 288027 360344 154535 54639 -70234 596090 225769 436996 294937 647288
14959 647288 194827 273419 189286 302030 89515 234316 98516 196876 271748 -113573 44546
$$ packed form
15034C30928k8043j04569J57315A31548J21360a22637E26694a30716A11525R0878
15024B02403I49M30293A81706K4488J79143A76204l7877E1099J47109q6928D4884
15012D8877J91833J62308a21059A74823E6104K15550M5494C6642K30819J25390
15002C92851j06354J38918j96684L06359k01340C5796J7330K25660F8058J09222
14992A77280J10863H361L92921k7699g3356A52167B5418K41822Q7816j29684B6272
14980a48243C11910F0298K87477H1091N5619J34133K868F0006J99026d2691k15532
14969b58223B88027P2317A54535E4639g0234E96090B25769K11227j42059L52351
14959F47288A94827P8592q4133J12744H9515J44801I8516R8360P4872a13573D4546
$$ plain form
14947 33649 216487 186272 280526 18403 273189 -199305 412132 111196 276602 201368
14937 201368 515106 254814 455805 564089 293744 145439 401387 280952 191530 158007
14927 158007 108122 118087 367397 136206 313630 434652 273485 387380 188062 318208
14917 318208 260257 309949 120944 357220 276297 90343 586490 27790 473358 125809
14906 134045 210126 -82952 245674 290444 486827 294181 552170 -33071 289855 344605
14896 344605 410946 388272 471283 540269 374245 245577 148108 577644 468844 691810
14886 691810 547022 309680 469348 576178 294922 317590 390183 538567 360239 220884
14876 220884 193965 352475 439682 183079 288393 49743 542366 534924 539785 270995 134416
$$ packed form
14947C3649J82838l0215R4254A8403K54786a99305D12132A11196J65406p5234
14937B01368L13738B54814K00991J08284k70345A45439K55948j20435q9422l3523
14927A58007m9885R965K49310A36206J77424J21022j61167J13895A88062J30146
14917C18208n7951M9692A20944K36276q0923I0343M96147B7790M45568A25809
14906A34045P6081h2952B45674M4770J96383j92646K57989c3071B89855N4750
14896C44605O6341k2674Q3011O8986j66024j28668r7469M29536j08800K22966
14886F91810j44788k37342J59668J06830k81256K2668P2593J48384j78328j39355
14876B20884k6919J58510Q7207A83079J05314D9743M92623p442M861k68790A34416
$$ plain form
14864 544272 410594 654307 194756 190804 329289 483680 49564 305317 398075 349360
14854 349360 366407 279905 -82332 186728 493683 253375 264168 -130515 480508 290168
14844 290168 404341 317128 592595 339947 370997 497276 522849 484966 404964 455121 761769
14833 761769 476329 273559 427736 267469 421147 453741 492033 597835 334769 579289
14823 579289 474708 410320 562018 390527 557094 359735 458670 637357 356471 379632
14813 379632 519713 666817 299873 284971 652333 228971 473157 373082 476317 444756
14803 444756 617063 168759 898222 760428 217637 648347 647179 405681 287988 561758
14793 561758 465729 693553 451250 538223 637845 788258 581737 723835 274765 268926
$$ packed form
14864E44272j33678K43713A94756l952J38485J54391D9564K55753R2758m8715
14854C49360J7047q6502h2332A86728L06955k40308J0793a30515D80508j90340
14844B90168J14173q7213K75467k52648L1050J26279K5573l7883q0002N0157L06648
14833G61769k85440k02770J54177j60267J53678L2594L8292J05802k63066K44520
14823E79289j04581o4388J51698j71491J66567j97359R8935J78687k80886K3161
14813C79632J40081J47104B99873j4902L67362B28971K44186j00075J03235l1561
14803D44756J72307A68759P29463j37794B17637M30710j168k41498j17693K73770
14793E61758r6029K27824k42303Q6973R9622J50413k06521J42098B74765n839
$$ plain form
14783 268926 883653 370106 646894 354313 693296 440543 526617 821605 821179 770536
14773 770536 393436 566042 520609 409358 547334 894521 575436 477410 558631 805518
14763 805518 350172 815250 521949 562670 514600 629402 611256 614117 503887 548478 638443
14752 638443 787171 912072 696864 492095 952422 316151 581908 870598 737160 783593
14742 783593 827564 887905 940425 672288 710193 638259 686429 807256 694961 575713 716998
14731 716998 990382 732888 731562 728111 608675 576849 893878 815700 742260 1004976 546185
14720 546185 817898 522818 622389 1008122 658879 925284 648103 988266 765660 1241249
14710 1241249 1165336 808151 1095369 913708 1158272 780483 981817 723886 606119 605888
$$ packed form
14783B68926O14727C70106K76788k92581L38983k52753Q6074K94988m26n0643
14773G70536l77100J72606m5433j11251J37976L47187l19085r8026Q1221K46887
14763H05518C50172M65078k93301M0721m8070J14802j8146K861j10230M4591Q9965
14752F38443J48728J24901k15208k04769M60327C16151K65757K88690j33438M6433
14742G83593M3971O0341N2520k68137L7905p1934M8170J20827j12295j19248J41285
14731G16998K73384k57494j326l451j19436l1826L17029p8178p3440K62716m58791
14720E46185K71713k95080R9571L85733l49243K66405k77181L40163k22606M75589
14710A241249p5913l57185K87218j81661K44564l77789K01334k57931j17767k31
$$ plain form
14700 605888 834259 881702 1031135 645793 426158 817193 1007238 938534 780583 1083557
14690 1083557 737604 837098 865954 1215127 1037559 952814 903295 737714 705437 802562
14680 802562 968073 926745 1157540 1024382 1106292 849345 1239184 1002914 1258204 1016704
14670 1016704 1100335 1176995 965329 1080969 1162934 1040516 1125233 1074969 796304 1158304
14660 1158304 893149 1409526 1100750 1242612 968955 1078573 1300842 962928 906160 1163349
14650 1163349 1463812 1149040 1345720 1212248 997501 1050321 1212376 1055164 1258714 1357953
14640 1357953 1221943 1136148 1342329 1189077 1606315 1437510 1591864 1079387 1324245 1484924
14630 1484924 1510228 1344990 1155990 1309003 1465416 1014528 1045398 1494643 1572484 1378387
$$ packed form
14700F05888K28371M7443J49433l85342k19635L91035J90045o8704j57951L02974
14690A083557l45953R9494K8856L49173j77568q4745m9519j65581l2277R7125
14680H02562J65511m1328K30795j33158Q1910k56947L89839k36270K55290k41500
14670A016704Q3631P6660k11666J15640Q1965j22418Q4717n0264k78665L62000
14660A158304k65155N16377l08776J41862k73657J09618K22269l37914n6768K57189
14650A163349L00463l14772J96680j33472k14747N2820J62055j57212K03550R9239
14640A357953j36010q5795K06181j53252M17238j68805J54354n12477K44858J60679
14630A484924K5304j65238j89000J53013J56413m50888L0870M49245P7841j94097
$$ plain form
14620 1378387 1541674 1357669 1539382 1379611 1228063 1283595 1316045 1391321 1269889 1843757
14610 1843757 1613353 1395701 1598387 1617428 1658995 1817056 1449449 1717003 1887419 1632426
14600 1632426 1450668 1703360 1579638 1642294 1854055 1662470 1964390 1703637 1810075 1447568
14590 1447568 1883795 1974816 1986957 1641480 1682853 1842373 1759882 1996983 1805779 2104183
14580 2104183 2157636 2385076 2050867 2053210 2088681 1800566 2048805 2197093 2126249 2238958
14570 2238958 2103759 1915255 2174699 2459843 2309397 2415051 2710597 2876361 2547032
14561 2547032 2541465 2952816 2616358 2848771 2901300 3068723 3264938 3264164 3946403 4610643
14551 4610643 4906611 5626753 7862937 12151956 21567599 42900006 47852243 20790395
$$ packed form
14620A378387J63287j84005J81713j59771j51548N5532L2450P5276j21432N73868
14610A843757k30404k17652K02686J9041M1567J58061l67607K67554J70416k54993
14600A632426j81758K52692j23722O2656K11761j91585L01920k60753J06438l62507
14590A447568M36227R1021J2141l45477M1373J59520q2491K37101j91204K98404
14580B104183N3453K27440l34209K343L5471k88115K48239J48288p0844J12709
14570B238958j35199j88504K59444K85144j50446J05654K95546J65764l29329
14561B547032n567M11351l36458K32413N2529J67423J96215p74O82239O64240
14551D610643K95968P20142K236184M289019R415643K1332407M952237B0790395
$$ plain form
14542 10995385 4876140 2577383 2370705 2269601 2097568 1984073 2289803 2254892 1892942
14533 1892942 1823377 2139206 2352675 2359753 2444623 2337020 2311530 2181883 2008101 2107124
14523 2107124 2401090 2301928 2388767 2472072 2655750 2818943 2583967 2619012 2650942 2520052
14513 2520052 2557515 2946039 2899132 2609356 2958592 3147093 3234142 2996130 2928522 2803238
14503 2803238 3317881 3188194 3549044 3056668 2990168 3225931 3304670 3212093 3485177 3488101
14493 3488101 3544639 3713624 3480741 3345225 3717652 3668733 3641772 3793585 3573133 3904356
14483 3904356 3872618 4056220 4050884 3738758 3972717 3849590 4161542 4371622 4284131 4148705
14473 4148705 4137307 4430747 4233366 4227265 4675550 4884276 4476993 4509296 4850458 4922378
$$ packed form
14542A0995385D876140k298757k06678j01104j72033j13495L05730l4911l61950
14533A892942o9565L15829K13469P078Q4870j07603k5490j29647j73782R9023
14523B107124K93966r9162Q6839Q3305J83678J63193k34976L5045L1930j30890
14513B520052L7463L88524m6907k89776L49236J88501Q7049k38012o7608j25284
14503B803238N14643j29687L60850m92376o6500K35763P8739r2577K73084K924
14493C488101N6538J68985k32883j35516L72427m8919k6961J51813k20452L31223
14483C904356l1738J83602n336l12126K33959j23127L11952K10080q7491j35426
14473D148705j1398K93440j97381o101M48285K08726m07283L2303L41162P1920
$$ plain form
14463 4922378 4454725 4901235 4805821 4768248 5468715 5540657 5009479 5387156 5128312 5315901
14453 5315901 5397483 5620364 5568446 5497338 5508618 5487091 5565258 5582291 5900673 6090655 6059138
14442 6059138 6242368 6486158 5959159 6364957 6370800 6522493 6712972 6508555 6534622 7135018
14432 7135018 6987341 6939076 7108539 7361349 7556794 7364202 7226019 7571724 7781037 7950368
14422 7950368 7712099 7880442 8279804 8535068 8176923 8582035 8909003 8998062 9135720 8863905
14412 8863905 9183886 9104253 9359409 9324819 9886738 9447070 9999308 10015635 10300251 10520782
14402 10520782 10776381 10788204 10644696 10926467 11348921 11383587 11919233 11723585 12143958 12254417
14392 12254417 12455671 12688610 12444484 13096724 13270344 13621584 13674757 13962541 14105584
$$ packed form
14463D922378m67653M46510r5414l7573P00467P1942n31178L77677k58844J87589
14453E315901Q1582K22881n1918p1108J1280k1527P8167J7033L18382J89982l1517
14442F059138J83230K43790n26999M05798N843J51693J90479k04417K6067O00396
14432G135018j47677m8265J69463K52810J95445j92592j38183L45705K09313J69331
14422G950368k38269J68343L99362K55264l58145M05112L26968Q9059J37658k71815
14412H863905L19981p9633K55156l4590N61919m39668N52238J6327K84616K20531
14402A0520782K55599J1823j43508K81771M22454L4666N35646j95648M20373J10459
14392A2254417K01254K32939k44126O52240J73620L51240N3173K87784J43043
$$ plain form
14383 14105584 14503470 14894818 15065060 15129347 15468302 15989212 16350778 16034324 16910467
14374 16910467 17138875 17462908 17725250 17952253 18709905 18699686 18948181 19753536 19819086 20414638
14364 20414638 20661793 21544116 21645762 22252950 22777205 23521928 23758549 24160201 25039195
14355 25039195 25403174 26078705 26852309 27270121 27868941 28800666 29249403 30050043 30436874
14346 30436874 31546694 32335172 33272111 33950989 35065666 36055887 36931314 37986060 39177377
14337 39177377 40356383 41458242 42366844 44079567 45380781 46758394 48281061 49571556
14329 49571556 51161424 52423668 54520944 56302923 57891894 59932309 61796147 64301748
14321 64301748 66577375 68474000 71318731 74164869 77211924 80027782 82832304 85926945
$$ packed form
14383A4105584L97886L91348J70242O4287L38955N20910L61566l16454Q76143
14374A6910467K28408L24033K62342K27003P57652j0219K48495Q05355O5550N95552
14364B0414638K47155Q82323J01646O07188N24255P44723K36621M01652Q78994
14355B5039195L63979O75531P73604M17812N98820R31725M48737Q00640L86831
14346C0436874J109820P88478R36939O78878J114677R90221Q75427J054746J191317
14337C9177377J179006J101859R08602J712723J301214J377613J522667J290495
14329D9571556J589868J262244K097276J781979J588971K040415J863838K505601
14321F4301748K275627J896625K844731K846138L047055K815858K804522L094641
$$ plain form
14313 85926945 89387490 93029410 96806689 100872328 105252156 109757309 114368334 119442143
14305 119442143 124669545 130248908 136123705 142441807 149043999 156249345 163559764 171524510
14297 171524510 179911295 188638396 198440472 208150469 218779068 229681074 241478919
14290 241478919 253438378 266245496 279591087 293519908 307770216 322497963 337741214
14283 337741214 352620902 367891487 383357284 397981803 412464953 426245935 439114455
14276 439114455 450637671 460769711 468621411 473115522 474395810 473822102 472765357 470948371
14268 470948371 467309807 463060251 455477978 445174254 433230425 419963858 405469233
14261 405469233 390254112 374187524 358346804 342195781 326706738 311009407 295804289
$$ packed form
14313H5926945L460545L641920L777279M065639M379828M505153M611025N073809
14305A19442143N227402N579363N874797O318102O602192P205346P310419P964746
14297A71524510Q386785Q727101R802076R709997J0628599J0902006J1797845
14290B41478919J1959459J2807118J3345591J3928821J4250308J4727747J5243251
14283C37741214J4879688J5270585J5465797J4624519J4483150J3780982J2868520
14276D39114455J1523216J0132040P851700M494111J280288n73708j056745j816986
14268D70948371l638564m249556p582273j0303724j1943829j3266567j4494625
14261D05469233j5215121j6066588j5840720j6151023j5489043j5697331j5205118
$$ plain form
14254 295804289 282612714 269285649 256087900 243007642 231029418 219770345 209020470
14247 209020470 198782861 189317176 179889405 171766044 163865708 155855676 148797991 141915035
14239 141915035 135939888 130021903 124744338 119021412 114156614 108830740 104629037 100692909
14231 100692909 96934952 93073636 89394881 85696873 82717408 79672688 76502258 74020661
14223 74020661 71036049 68626610 66702659 64207461 62400635 59860186 58261877 56210402
14215 56210402 54191139 53100541 51641971 49729453 48480513 46568220 45365596 44278456
14207 44278456 43616072 42654331 40909095 39850853 38804690 37748794 36886670 36011306 35083672
14198 35083672 34109349 33235781 32020269 31150542 30829196 30248175 29301587 28369674 27811067
$$ packed form
14254B95804289j3191575j3327065j3197749j3080258j1978224j1259073j0749875
14247B09020470j0237609r465685r427771q123361p900336q010032p057685o882956
14239A41915035n975147n917985n277565n722926m864798n325874m201703l936128
14231A00692909l757957l861316l678755l698008k979465l044720l170430k481597
14223G4020661k984612k409439j923951k495198j806826k540449j598309k051475
14215E6210402k019263j090598j458570j912518j248940j912293j202624j087140
14207D4278456o62384r61741j745236j058242j046163j055896q62124q75364r27634
14198C5083672r74323q73568j215512q69727l21346n81021r46588r31913n58607
$$ plain form
14189 27811067 27072738 26604703 26054239 25150638 24857385 24122066 23512345 23097319 22234358
14180 22234358 22075458 21702084 21229900 20690980 20260747 20106867 19328779 19197956 18960429
14171 18960429 18189889 17964203 18025521 17869360 16647976 17121398 16470173 16039303 16154488
14162 16154488 15394767 15392191 15228228 14933304 14718207 14549252 14025301 13757015 13425962 13433512
14152 13433512 13187628 12764582 12647340 12856836 12502575 12082128 11907571 11788484 11488454
14143 11488454 11470846 11337941 11155015 10716890 10493510 10769313 10302630 10343860 9966395 9867721
14133 9867721 9635374 9385562 9477063 9540961 9216501 8979909 9153582 8806418 8585205 8420506
14123 8420506 8375911 8572841 8362126 8189299 8053037 8007198 7985481 7660937 7626841 7593634
$$ packed form
14189B7811067p38329m68035n50464r03601k93253p35319o09721m15026q62961
14180B2234358j58900l73374m72184n38920m30233j53880p78088j30823k37527
14171A8960429p70540k25686O1318j56161j221384M73422o51225m30870J15185
14162A6154488p59721k576j63963k94924k15097j68955n23951k68286l31053P550
14152A3433512k45884m23046j17242K09496l54261m20447j74557j19087l00030
14143A1488454j7608j32905j82926m38125k23380K75803m66683M1230l77465r8674
14133I867721k32347k49812R1501O3898l24460k36592J73673l47164k21213j64699
14123H420506m4595J96930k10715j72827j36262m5839k1717l24544l4096l3207
$$ plain form
14113 7593634 7227668 7311214 7392591 7181579 7027933 7271498 7114511 6785707 6876190 6960687
14103 6960687 6371687 6502255 6553084 6467181 6358068 6220191 5981716 6105644 6132305 5896872
14093 5896872 5744109 5618654 5918539 5618084 5362978 5757113 5557982 5448512 5541228 5133406
14083 5133406 5166543 4993448 5205571 5109908 5049172 4710825 5056136 5075298 4646548 4870239
14073 4870239 4597227 4646449 4744223 4605290 4520962 4313367 4208481 4040745 4486194 4270484
14063 4270484 4460038 4315512 4516766 4044384 4339391 4426501 4470412 4141570 4355342 4094368
14053 4094368 3921707 3887358 3670345 3977533 3409612 3313193 3531804 3889879 3852441 3679165
14043 3679165 3307759 3466570 3809395 3414028 3386558 3488372 3346431 3149335 3246991 3352445
$$ packed form
14113G593634l65966Q3546Q1377k11012j53646K43565j56987l28804R0483Q4497
14103F960687n89000J30568N0829q5903j09113j37877k38475J23928K6661k35433
14093E896872j52763j25455K99885l00455k55106L94135j99131j09470R2716m07822
14083E133406L3137j73095K12123r5663o0736l38347L45311J9162m28750K23691
14073D870239k73012M9222R7774j38933q4328k07595j04886j67736M45449k15710
14063D270484J89554j44526K01254m72382K95007Q7110M3911l28842K13772k60974
14053D094368j72661l4349k17013L07188n67921r6419K18611L58075l7438j73276
14043C679165l71406J58811L42825l95367k7470J01814j41941j97096R7656J05454
$$ plain form
14033 3352445 2933239 3366965 3475346 3378172 3305314 3205630 3040624 2933302 2995372 3316242
14023 3316242 2886482 2427770 2807205 2728610 2810978 2913979 2960419 2740019 2824699 2930935
14013 2930935 2831981 2794230 2813117 2674670 2651541 2538419 2034243 2422465 2203833 2247050
14003 2247050 2508252 2429122 2287676 2417410 2046514 2194467 2524418 2319798 2005786 1862954
13993 1862954 2022820 2435372 2290376 2715163 3796610 6778872 14149968 34567746 51041415
13984 51041415 26349934 12918360 7656723 6027799 4336553 4089362 3685485 3210706
13976 3210706 3447992 2928556 3134592 3031723 2703143 3265151 2927492 2714708 2404661
13967 2404661 2276394 2530384 2508834 2644494 2305347 2676869 2232724 2804502 2182743 2483914
$$ packed form
14033C352445m19206M33726J08381r7174p2858r9684j65006j07322O2070L20870
14023C316242m29760m58712L79435p8595Q2368J03001M6440k20400Q4680J06236
14013B930935r8954l7751J8887j38447k3129j13122n04176L88222k18632M3217
14003B247050K61202p9130j41446J29734l70896J47953L29951k04620l14012j42832
13993A862954J59866M12552j44996M24787J081447K982262P371096K0417778J6473669
13984E1041415k4691481A2918360n261637j628924j691246k47191m03877m74779
13976C210706K37286n19436K06036j02869l28580N62008l37659k12784l10047
13967B404661j28267K53990k1550J35660l39147L71522m44145N71778o21759L01171
$$ plain form
13957 2483914 1970930 2546793 2035271 2263725 2149515 1832016 2170074 2090655 2268929 2135817
13947 2135817 1923675 2017764 1841883 2067813 1650808 1955780 1988351 1880950 1897875 1838753
13937 1838753 1889236 1943622 1401092 1697450 1877892 1749107 1799201 1981405 1796343 1582899
13927 1582899 1910801 1603136 1841791 1838864 1587813 1547363 1728313 2034120 1714091 1514269
13917 1514269 1794411 1600566 1375367 1538610 1828339 1638074 1699224 1710298 1569997 1560902
13907 1560902 1318056 1309140 1615344 1402904 1451358 1352518 1399288 1820676 1337490 1077247
13897 1077247 1699105 1638756 1236054 1439538 1462852 1766488 1414577 1277072 1215336 1674995
13887 1674995 977354 1734998 1438491 1604404 1742797 1664636 1081411 1399543 1265117 1282933
$$ packed form
13957B483914n12984N75863n11522K28454j14210l17499L38058p9419J78274j33112
13947B135817k12142R4089j75881K25930m17005L04972L2571j07401J6925n9122
13937A838753N0483N4386n42530K96358J80442j28785N0094J82204j85062k13444
13927A582899L27902l07665K38655k927k51051m0450J80950L05807l20029j99822
13917A514269K80142j93845k25199J63243K89729j90265O1150J1074j40301r095
13907A560902k42846q916L06204k12440M8454r8840M6770M21388m83186k60243
13897A077247O21858o0349m02702K03484K3314L03636l51911j37505o1736M59659
13887A674995o97641P57644k96507J65913J38393p8161n83225L18132j34426J7816
$$ plain form
13877 1282933 980557 1329996 996245 1249615 1538599 1303047 1116250 1160275 1086632 991959
13867 991959 1079472 1611774 1023201 1095265 1379776 1230129 1268724 1194367 758819 1519939
13857 1519939 1429883 1061298 953230 1342917 1140551 1205345 1217601 1218524 1154413 1093573 1262998
13846 1262998 1069227 1168458 1019570 1238145 1169742 948418 1117540 968841 883485 1098898
13836 1098898 1249676 962812 944811 1047368 1114712 961134 975511 866829 1076249 1025274
13826 1025274 640584 996144 947545 884407 622593 1118950 666318 932240 1187101 724772
13816 724772 725531 1048339 990016 1036174 1126819 701035 691849 976507 900670 859095 1014022
13805 1014022 815487 1052079 517354 772700 834792 673287 790834 927704 1070419 794638
$$ packed form
13877A282933l02376L49439l33751K53370K88984k35552j86797M4025p3643r4673
13867I91959Q7513N32302n88573P2064K84511j49647L8595p4357m35548P61120
13857A519939r0056l68585j08068L89687k02366O4794J2256R23o4111o0840J69425
13846A262998j93771R9231j48888K18575o8403k21324J69122j48699q5356K15413
13836A098898J50778k86864j8001J02557O7344j53578J4377j08682K09420n0975
13826A025274l84690L55560m8599o3138k61814M96357m52632K65922K54861m62329
13816G24772P59L22808n8323M6158R0645m25784r186K84658p5837m1575J54927
13805A014022j98535K36592E17354K55346O2092j61505J17547J36870J42715k75781
$$ plain form
13795 794638 587543 1075355 959774 814005 1193683 904248 662870 895802 837702 932503
13785 932503 980051 1083949 1148164 727382 723012 866585 644771 679831 763283 587874 803211
13774 803211 755713 707245 554967 856272 739760 872095 886375 619621 630680 543924
13764 543924 705695 668171 830559 585053 891575 952411 751050 779263 735099 619373
13754 619373 827603 774469 638403 703318 709231 781494 776813 553574 585346 1025814 796530
13743 796530 599308 784885 881665 583382 811150 493116 774333 746337 152104 860623
13733 860623 898513 804962 754335 510071 857351 1014795 652949 933628 682128 503175
13723 503175 734043 600412 440989 609318 310898 704371 744638 662043 493909 312381
$$ packed form
13795G94638k07095M87812j15581j45769L79678k89435k41378K32932n8100R4801
13785I32503M7548J03898O4215m20782m370J43573k21814L5060Q3452j75409K15337
13774H03211m7498m8468j52278L01305j16512J32335J4280k66754J1059q6756
13764E43924J61771l7524J62388k45506L06522O0836k01361K8213m4164j15726
13754F19373K08230n3134j36066O4915N913P2263m681k23239L1772M40468k29284
13743G96530j97222J85577R6780k98283K27768l18034K81217k7996A52104P08519
13733H60623L7890r3551n0627k44264L47280J57444l61846K80679k51500j78953
13723E03175K30868j33631j59423J68329k98420L93473M0267q2595j68134j81528
$$ plain form
13713 312381 334508 510857 492430 683263 574002 655285 851078 926462 624663 576019
13703 576019 378385 399853 625404 696691 530214 223744 758489 611890 579252 998387
13693 998387 567807 776306 637919 457477 671727 740074 625119 280749 600532 520214
13683 520214 509638 463209 666933 586369 577756 653655 571773 626720 794937 447488 665585
13672 665585 491500 387649 632497 530269 701363 424313 764105 557695 177972 719079
13662 719079 40655 638643 338893 668334 677340 995141 634945 395748 580505 664243
13652 664243 124674 234201 778394 526237 287310 489754 139964 365392 351559 283255
13642 283255 571820 607040 389033 306728 381253 287958 480022 492332 590802 618074 90293
$$ packed form
13713C12381K2127J76349j8427J90833j09261Q1283J95793P5384l01799m8644
13703E76019j97634K1468K25551P1287j66477B23744N34745j46599l2638M19135
13693I98387m30580K08499j38387j80442K14250O8347j14955B80749L19783q0318
13683E20214j0576m6429K03724q0564q613P5899q1882N4947J68217l47449K18097
13672F65585j74085j03851K44848j02228J71094k77050L39792k06410A77972N41107
13662G19079D0655N97988k99750L29441R006L17801l60196k39197J84757Q3738
13652F64243A24674J09527N44193k52157k38927K02444A39964K25428j3833o8304
13642B83255K88565L5220k18007q2305P4525r3295J92064J2310R8470K7272I0293
$$ plain form
13630 346200 476710 96055 501936 360090 531434 332059 301174 658217 381243 372625
13620 372625 -9983 459747 295268 289036 457356 453985 372844 334961 447168 607063 376059
13609 376059 369843 576009 435781 360857 572229 309955 461481 463676 695204 156547
13598 446611 467408 417453 -55476 465142 236978 327105 642820 390279 305743 518213
13588 518213 283727 210166 304099 647308 -87626 110074 310281 523979 522181 357104
13578 357104 353208 127416 356637 102456 534817 376182 517051 374095 16348 493173
13568 493173 246240 248925 270506 502653 546959 411154 330490 227628 595263 629181 452885
13557 452885 381371 91859 307591 162485 180444 368371 280407 80128 226329 347207
$$ packed form
13630C46200J30510I6055M05881j41846J71344j99375l0885L57043k76974q618
13620C72625i983D59747j64479o232J68320l371q1141l7883J12207J59895k31004
13609C76059o216K06166j40228p4924K11372k62274J51526K195K31528A56547
13598D46611K0797m9955e5476D65142k28164R0127L15715k52541q4536K12470
13588E18213k34486p3561R3933L43209h7626A10074K00207K13698j798j65077
13578C57104l896A27416K29221A02456M32361j58635J40869j42956A6348M76825
13568D93173B46240K685K1581K32147M4306j35805q0664j02862L67635L3918j76296
13557D52885p1514I1859K15732j45106J7959J87927q7964H0128J46201J20878
$$ plain form
13547 347207 377069 405342 292453 93447 67014 93016 138055 334095 145292 393795 283188
13536 283188 272029 49102 137700 502 493831 53590 27523 488676 375671 529256 140768
13524 276153 240892 407721 769116 552474 209114 131420 43176 423756 299966 341154
13514 341154 159090 226742 225730 308845 488521 199075 296916 297375 379594 252302 249420
13503 249420 426895 158641 336541 303031 100645 77329 185749 663695 404455 392236
13493 392236 222280 372278 453938 58628 410914 446207 121417 436817 325835 190676
13483 190676 7328 361480 216863 238342 353798 225146 266551 435554 363224 235074
13473 235074 324943 -36574 186454 357782 305436 368272 221597 104067 383513 366337
$$ packed form
13547C47207K9862K8273j12889I3447k6433K6002M5039J96040A45292K48503j10607
13536B83188j1159D9102Q8598E02M93329E3590k6067M61153j13005J53585A40768
13524B76153l5261J66829L61395k16642B09114p7694D3176L80580j23790M1188
13514C41154A59090O7652j012Q3115J79676A99075R7841M59Q2219j27292k882
13503B49420J77475A58641J77900l3510A00645k3316J08420M77946k59240j2219
13493C92236j69956J49998Q1660E8628L52286L5293A21417L15400j10982j35159
13483A90676G328L54152j44617K1479J15456j28652M1405J69003p2330j28150
13473B35074Q9869c6574A86454J71328n2346O2836j46675A04067K79446j7176
$$ plain form
13463 366337 -83948 275649 322759 -4253 445507 447933 666205 249739 229925 302159 310748
13452 310748 434684 256414 291700 253617 99413 233999 377839 -28778 174178 146363
13442 146363 485806 271551 346961 327065 447446 -244993 1210 -76708 372291 598908
13432 598908 613946 87920 118438 337987 390039 140568 366023 508651 256922 -82530
13421 132806 98362 143084 119531 -58237 348709 50215 367916 219505 16684 -1047 408305
13409 135654 261462 46156 323183 562894 304804 188448 109775 -37942 65542 117590
13399 117590 143231 185516 -6731 -78231 313100 147131 122218 19940 73456 236477 199439
13388 199439 402718 333619 -18981 85247 124891 235477 222533 208129 423337 99145 232465
$$ packed form
13463C66337h3948B75649M7110d253D45507K426K18272B49739j9814P2234Q589
13452C10748J23936j78270L5286l8083I9413J34586J43840b8778A74178k7815
13442A46363L39443k14255P5410j9896J20381b44993A210g6708C72291K26617
13432E98908J5038H7920L0518K19549N2052A40568K25455J42628k51729h2530
13421A32806l4444M4722k3553e8237C48709E0215L17701j48411A6684a047D08305
13409A35654J25808D6156K77027K39711k58090j16356p8673c7942F5542N2048
13399A17590K5641M2285f731p1500C13100A47131k4913A9940N3516J63021l7038
13388A99439K03279o9099a8981H5247L9644J10586j2944j4404K15208I9145J33320
$$ plain form
13377 232465 329056 315561 580048 273709 185128 189251 -31981 299526 16630 418085 -24713
13365 177476 133602 -7270 486668 267235 405907 177555 377789 376542 72096 450312 239150
13354 239150 172877 442906 -22057 533221 159830 495701 196090 7593 217578 494030
13344 494030 390502 56082 214691 305504 603722 458992 507640 153113 126376 149962
13334 149962 72906 234605 193310 212572 703529 195248 253321 188514 -2437 3334 -5958
13322 431473 271848 595575 307301 201394 129404 219206 223123 425858 144857 273173
13312 273173 81823 330590 280863 350454 373233 150778 239178 173977 446380 62144 195554
13301 195554 36989 -18424 142448 170136 74299 160141 162042 430502 245813 547948 89506
$$ packed form
13377B32465R6591j3495K64487B73709q8581M123c1981B99526A6630M01455b4713
13365A77476m3874g270D86668k19433J38672A77555K00234j247G2096L78216k11162
13354B39150o6273K70029b2057E33221A59830L35871A96090G593K09985K76452
13344D94030j03528E6082J58609R0813K98218j44730M8648A53113k6737K3586
13334A49962G2906J61699m1295J9262M90957A95248N8073o4807b437C334e958
13322D31473j59625L23727k88274j05907p1990Q9802L917K02735A44857J28316
13312B73173H1823K48767m9727O9591K2779A50778Q8400o5201K72403F2144J33410
13301A95554C6989a8424A42448K7688G4299Q5842J901K68460j84689L02135H9506
$$ plain form
13289 272297 248180 296595 294654 192866 -168836 29731 343568 200415 434711 111070
13278 77203 287377 102977 113043 37811 -96539 156224 154875 197775 345094 254594 -29069
13266 255059 117543 -7875 311734 71874 62030 20290 414049 304580 191885 562006 56091
13254 186441 56757 195559 361555 147810 -150678 -23143 227020 60472 -58171 327615
13243 279813 -7218 -45821 -17586 -889 271484 43023 -18357 154520 44141 -134161 401385
13231 89179 456161 -83713 -40655 140450 55315 155625 -51570 -50214 159393 174934 271590
13220 271590 165553 185988 257588 4233 -563 429287 83228 -316235 323739 -65513 299672
13208 17091 -35475 238543 89475 286648 7056 67057 -161863 133040 -98131 76257 64659
$$ packed form
13289B72297k4117M8415j941j01788a68836B9731L13837j43153K34296A11070
13278G7203K10174A02977J0066C7811i6539A56224j349M2900J47319r0500b9069
13266B55059A17543g875C11734G1874r844B0290L93759j09469j12695L70121E6091
13254A86441E6757J38802J65996A47810a50678b3143B27020F0472e8171C27615
13243B79813g218l8603a7586h89B71484D3023a8357A54520D4141a34161D01385
13231H9179L66982h3713d0655A40450E5315J00310e1570J356A59393J5541R6656
13220B71590j06037K0435P1600D233e63D29287H3228c16235C23739f5513B99672
13208A7091c5475B38543H9475J97173G056O0001a61863A33040i8131G6257j1598
$$ plain form
13197 64659 46120 -30045 214030 -93650 328752 124177 293849 204648 -257713 502517
13186 149773 -100911 -124535 159423 147494 343666 134129 17063 70533 399781 200265
13176 200265 -101566 -263437 -58186 -146785 207604 -171520 46970 51860 -48279 169338 -24621
13164 141361 -21046 326441 165589 259823 -20722 34143 233011 172176 -80973 -136185 -83175
13153 -83175 83175 52501 226624 229197 164930 196894 -6117 147495 435688 345281 96668
13141 -21436 -171776 147226 -80554 -27228 121228 357631 119751 113566 206513 -163922 -27416
13129 189310 157594 -6540 190335 209630 -325017 32944 185912 142206 321846 233366 304717
13118 304717 194716 268716 104751 -117754 165861 -47003 -39207 223359 218908 308123 325968
$$ packed form
13197F4659j8539c0045B14030i3650C28752A24177J69672q9201b57713E02517
13186A49773a00911k3624A59423j1929J96172A34129A7063N3470L29248j99516
13176B00265a01566j61871e8186q8599B07604a71520D6970M890d8279A69338b4621
13164A41361b1046C26441j60852R4234b0722C4143J98868o0835h0973n5212N3010
13153h3175H3175l0674J74123K573o4267L1964f117A47495K88193r0407I6668
13141b1436j50340A47226h0554b7228A21228K36403A19751o185R2947a63922b7416
13129A89310l1716f540A90335J9295c25017C2944J52968m3706J79640q8480P1351
13118C04717j10001P4000A04751a17754A65861d7003P796B23359m451Q9215J7845
$$ plain form
13107 325968 -159331 467229 -136158 204047 55679 506200 24919 208401 60054 -9119
13096 113275 205955 288128 -173669 162495 155542 71081 146027 164334 -13579 107647 148746
13085 148746 -198185 83238 -20160 237607 10410 -255661 214246 77485 128268 -67967 191857
13073 -148541 -64531 -47411 373783 284880 282561 -166194 206387 55984 -90996 172505 -21625
13061 345353 -1934 -155992 160382 100654 109326 -62866 284230 -26183 225624 -68800 200867
13049 83871 1763 -7154 130394 115612 220515 54443 120885 65654 48922 -243777 136087
13037 232635 80130 381062 153955 -23416 -22709 31430 -87936 260936 67667 276738 17336
13025 -89950 381645 -419159 10562 38891 9506 232949 252478 351558 205831 178019 139317
$$ packed form
13107C25968a59331D67229a36158B04047E5679M50521B4919J83482F0054i119
13096A13275R2680Q2173a73669A62495o953G1081P4946J8307a3579A07647M1099
13085A48746a98185H3238b0160B37607A0410b55661B14246G7485N0783f7967A91857
13073a48541f4531J7120C73783q8903k319a66194B06387E5984i0996A72505b1625
13061C45353a934j54058A60382n9728Q672f2866B84230b6183B25624f8800B00867
13049H3871A763g154A30394j4782J04903E4443O6442n5231j6732b43777A36087
13037B32635H0130L00932A53955b3416P07C1430h7936B60936F7667K09071A7336
13025h9950C81645d19159A0562K8329I506K23443J9529R9080j45727k7812l8702
$$ plain form
13014 139317 92905 -5792 -56438 -125603 203408 28106 196564 44910 56048 351288 156094
13002 56103 186888 225167 -2387 561562 44317 58748 245255 263524 85848 307106 281915
12991 281915 411009 60814 65453 132646 -80882 156179 206836 24839 172865 229983 54987
12979 161963 84009 152856 40265 -156423 183162 95809 279798 -278176 82399 20706 -93696
12967 -73878 -19808 168150 105068 4274 -122289 -10490 133714 -1851 -215689 -214476 -35446
12955 -20463 108294 131257 -41140 -108685 430873 303952 -38920 -65929 123290 55639 399891
12944 399891 -213724 9435 44176 72593 157820 15994 -50452 -189417 39060 5470 37292
12933 37292 89698 -15452 -30121 -281593 -246445 -221427 -20008 -230726 118944 -63986 104635
$$ packed form
13014A39317m6412e792n0646o9165B03408B8106J68458D4910J1138K95240A56094
13002E6103J30785L8279b387E61562D4317J4431J86507J8269H5848K21258k5191
12991B81915J29094F0814M639O7193h0882A56179N0657B4839J48026N7118E4987
12979A61963p7954O8847D0265a56423A83162q7353J83989b78176H2399B0706i3696
12967g3878a9808A68150o3082D274a22289a0490A33714a851k13838J213c5446
12955b0463A08294K2963d1140o7545D30873j26921c8920k7009A23290E5639L44252
12944C99891b13724I435L4741K8417Q5227A5994e0452j38965C9060E470L1822
12933C7292N2406a5452j4669k51472L5148K5018b0008k10718A18944f3986A04635
$$ plain form
12921 -138831 6299 175898 -51108 -14014 -25185 32803 125983 43180 -406160 -242119 162710
12909 147416 -239636 -27195 47166 320813 -232802 -61957 -336232 16327 -121890 -49175
12898 -133324 17340 71669 120862 38305 -139515 254546 337441 136927 188089 -64315 394631
12886 181889 225764 -221274 -168820 -30318 -81195 14129 15085 304089 115502 -27109 58782
12874 443416 69350 97948 112498 135263 -128077 197718 29895 -143217 -142109 204943 -208775
12862 201621 99183 381915 241435 -292864 240910 56143 -25411 90480 78907 274996
12852 274996 -330049 -11767 -48091 291802 190307 124818 129014 140682 60861 -46161 180883
12840 -87024 119980 102314 273003 199855 258251 105852 -96126 -177168 -92084 17209 142094
$$ packed form
12921a38831F299J69599e1108a4014j1171C2803R3180D3180d06160J64041A62710
12909A47416b39636b7195D7166K73647b32802f1957k74275A6327a21890d9175
12898a33324A7340N4329M9193C8305a39515B54546Q2895A36927N1162f4315C94631
12886A81889M3875b21274N2454c0318n0877A4129R56K89004A15502b7109E8782
12874D43416F9350K8598J4550K2765a28077A97718B9895a43217J108B04943b08775
12862B01621I9183K82732j40480b92864B40910E6143b5411I0480j1573J96089
12852B74996c30049a1767l6324B91802j01495o5489M196J1668F0861d6161A80883
12840h7024A19980j7666J70689p3148N8396A05852i6126q1042Q5084A7209J24885
$$ plain form
12829 142094 -144520 231569 35218 -185422 90593 -139595 75385 -254176 85375 -75430
12818 45909 -59351 -103561 -161680 137650 -212232 -246748 106297 -29767 3537 46121 -126528
12806 205040 137992 101935 41878 -146832 168872 247834 72757 132624 295692 189304 -172907
12794 -160812 69454 -60706 -305828 7223 31356 359071 272433 246337 -97344 -38658 188797
12782 77836 -55954 -122942 -307622 -88309 -115317 -48529 52429 -336570 436184 17635 99232
12771 99232 47180 -120802 -170224 -156180 30153 -150989 106514 -66156 44764 23933 -199407
12759 16488 -108665 -178530 104405 -212392 -149210 -206852 148329 408490 -312352 21644
12748 53927 165891 -131499 -85875 123841 164384 319839 232460 138255 3263 -139492 854
$$ packed form
12829A42094a44520B31569C5218a85422I0593a39595G5385b54176H5375g5430
12818D5909e9351m4210n8119A37650b12232l4516A06297b9767C537M2584a26528
12806B05040o7048l6057D1878a46832A68872P8962G2757N9867J63068j06388a72907
12794a60812F9454f0706k45122G223K4133L27715q6638k6096i7344c8658A88797
12782G7836e5954o6988j84680h8309k7008d8529E2429c36570D36184A7635Q1597
12771I9232D7180a20802m9422J4044C0153a50989A06514f6156D4764k0831a99407
12759A6488a08665o9865A04405b12392O3182n7642A48329K60161c12352B1644
12748E3927J11964a31499M5624A23841M0543J55455q7379r4205C263a39492H54
$$ plain form
12736 126939 98952 299139 -101889 211184 226506 -49521 142645 157194 -133189 157107
12725 -69125 -82282 -142820 -222673 315044 -77253 -8657 320945 245420 -8061 54465 -300062
12713 -45486 89778 31286 78210 280439 60625 465460 109593 317693 120344 392911
12703 392911 150031 170818 96554 -207661 -194066 92165 161163 148971 -90077 70981 161533
12692 161533 120110 258892 181259 41410 213134 -110147 -23300 104252 245917 56576
12681 80946 -9416 237056 -95250 123286 104084 149155 -28967 100942 128048 318622 -25177
12669 -135314 144277 221131 136044 402908 -43267 -55009 65375 268637 120858 279994
12659 279994 62567 307534 -77725 274086 -38710 183705 -27324 242139 227424 -42296 506590
$$ packed form
12736A26939k7987K00187a01889B11184J5322d9521A42645J4549a33189A57107
12725f9125j3157o0538p9853C15044g7253h657C20945p5525h061E4465c00062
12713d5486H9778C1286M6924K02229F0625M04835A09593K08100A20344K72567
12703C92911A50031K0787p4264b07661J3595I2165O8998j2192i0077G0981R0552
12692A61533m1423J38782p7633D1410J71724a10147b3300A04252J41665E6576
12681H0946i416B37056i5250A23286j9202M5071b8967A00942K7106J90574b5177
12669a35314A44277P6854q5087K66864d3267j1742F5375K03262A20858J59136
12659B79994F2567K44967g7725B74086c8710A83705b7324B42139j4715d2296E06590
$$ plain form
12647 275403 -199004 31901 181899 -72500 -93507 -388159 -313757 387372 -81951 584337
12636 24635 -279666 1417 200329 163068 -133353 359794 56300 161974 560437 343207
12626 343207 -6785 724665 -209150 -1643 -245798 159283 279295 156739 -53196 275022
12615 168748 318998 14279 51300 -78861 9167 11604 94770 218565 406313 127175 -30260
12603 25811 58993 202650 -38161 28166 184271 305712 106543 -52866 22302 81966 -218948
12591 275365 -164766 116501 -62789 309665 53090 62249 -37433 -285872 -46892 -43136 76683
12579 84574 66314 103143 -121465 223788 -185069 -14180 32470 -85587 -112068 159775 70985
12567 120892 -110167 4575 294706 -74528 9415 -225108 66414 414590 -71802 110676 166096
$$ packed form
12647B75403a99004C1901J49998g2500k1007k94652P4402C87372h1951E84337
12636B4635b79666A417J98912l7261a33353C59794E6300J05674L98463k17230
12626C43207f785G24665b09150a643k44155A59283J20012j22556e3196B75022
12615A68748J50250A4279L7021g8861I167K437Q3166J23795J87748A27175c0260
12603B5811L3182J43657c8161B8166J56105J21441A06543e2866B2302N9664b18948
12591B75365a64766A16501f2789C09665E3090R159c7433k48439d6892L756G6683
12579H4574j8260L6829a21465B23788a85069a4180C2470h5587k6481A59775G0985
12567A20892a10167D575K90131g4528I415b25108F6414L48176g1802A10676N5420
$$ plain form
12556 166096 135355 333772 -51619 -20856 69330 -31426 -948 7225 56755 190369 -60525 -256329
12544 -256329 267117 -186135 84251 -17144 75088 238103 -387246 8511 -93019 8208 -56243
12532 -33513 -116148 120324 -166321 -77504 324942 17700 146306 290466 -110974 96929
12521 -85057 102562 -115555 -78651 50802 -76316 -31783 183413 -138081 -264046 -101648
12510 -55486 358834 -26651 85570 2043 78941 -102111 -218309 -38566 57417 98345 -404744
12498 86783 -3745 -99273 75425 101813 167061 176317 -210286 -2918 -126120 251379 48885 -18300
12485 -136771 28077 264653 -99707 80723 25808 164422 -191959 -130099 -66289 -81350 22735
12473 169455 28273 113880 232618 38512 -52371 23606 -62544 54698 -76452 115447 -178779
$$ packed form
12556A66096l0741J98417e1619b0856F9330c1426i48G225M9530J33614f0525j95804
12544b56329B67117a86135H4251a7144G5088J63015c87246H511i3019H208e6243
12532c3513q2635A20324a66321g7504C24942A7700J28606J44160a10974I6929
12521h5057A02562a15555L6904E0802g6316c1783A83413a38081j25965a01648
12510e5486C58834b6651H5570B043P6898a02111j16198c8566E7417M0928d04744
12498H6783c745r5528G5425K6388O5248R256b10286b918j23202B51379D8885a8300
12485a36771B8077K36576i9707H0723B5808J38614a91959O1860O3810j5061B2735
12473A69455B8273Q5607J18738C8512e2371B3606f2544E4698g6452A15447a78779
$$ plain form
12461 69915 172739 161463 108925 -37904 -191166 -148286 -17738 15344 332533 -78043 -196706
12450 -196706 -364360 -67288 393369 -219236 142840 3693 25057 -26657 383355 126576
12439 244795 63182 140488 -162303 105551 -107361 243677 378916 -130442 -56350 -74130
12429 -74130 22017 -186878 -174297 -231625 -549632 -127602 176226 -160592 217999 -552269
12418 231029 -147115 332736 23309 116793 82324 345452 80992 -103097 -129035 141676
12407 -223484 200706 -175835 -175830 -185963 -130590 190588 -57632 -165845 -139235 98594 76705
12396 76705 19499 322911 -123129 116212 -153058 -63358 100139 210567 -78620 95631
12385 71312 7330 94587 114679 126073 142473 84993 -125379 6217 -129357 16528 32729 25877
$$ packed form
12461F9915J02824j1276n2538c7904j53262M2880a7738A5344L17189g8043j18663
12450a96706j67654f7288C93369b19236A42840C693K1364b6657C83355A26576
12439B44795F3182P7306a62303A05551a07361B43677J35239a30442e6350j7780
12429g4130B2017a86878J2581n7328l18007a27602A76226a60592B17999e52269
12418B31029a47115C32736B3309R3484l4469K63128H0992a03097k5938A41676
12407b23484B00706a75835Nj0133N5373A90588e7632j08213K6610I8594k1889
12396G6705A9499L03412a23129A16212a53058f3358A00139J10428g8620I5631
12385G1312G330Q7257K0092J1394J6400n7480a25379F217a29357A6528J6201o852
$$ plain form
12373 25877 -27023 111346 -158472 282958 84345 81035 25991 -47744 275893 207283 45235
12361 -224622 224241 -51600 52405 -289020 23659 12983 -214087 -126126 -290201 118349
12350 -56907 265315 -361694 45298 36059 31454 -170131 -35070 221145 -11302 -123006 161991
12338 44426 164938 -189121 99737 243833 84016 -165775 39046 -252198 176272 -20671
12327 -155643 183896 -42448 -61645 231306 -53071 65157 -24770 -133888 121638 165695 -9475
12315 -106091 350709 68679 -229559 -7237 303482 120072 -192935 -138771 38444 -294565
12304 -51082 165316 -81686 -141553 189633 -320904 -36844 7176 141824 -10948 250412 -393398
12292 161791 21071 -73338 -60931 189002 64426 270187 -9894 369676 128365 -112599 -242104
$$ packed form
12373B5877b7023A11346a58472B82958H4345l310B5991d7744B75893o8610D5235
12361b24622B24241e1600E2405b89020B3659j0676b14087Q7961j64075A18349
12350e6907B65315c61694D5298r239m605a70131c5070B21145a1302j11704A61991
12338D4426J20512a89121I9737J44096H4016a65775C9046b52198A76272b0671
12327a55643A83896d2448j9197B31306e3071F5157b4770j09118A21638M4057i475
12315a06091C50709F8679b29559g237C03482A20072a92935N4164C8444b94565
12304e1082A65316h1686n9867A89633c20904c6844G176J34648a0948B50412c93398
12292A61791B1071g3338J2407A89002F4426K05761i894C69676A28365a12599j29505
$$ plain form
12281 -242104 297139 -203787 -77424 33334 -24055 -84789 23756 236051 -25078 265931 293219
12270 293219 -174917 72148 -42178 280332 -10698 216264 167385 229467 226310 150122 -24851
12258 -125737 186246 104043 683872 421134 -57839 170112 -225750 133115 157205 -78300
12247 72320 406831 70813 79365 -50733 -158282 140001 131404 160974 -113479 268977 127039
12235 -384088 533107 109286 249121 185387 191316 232683 -116024 291627 -191544 -72178
12224 111690 449257 422083 84964 106164 71588 299804 242637 128372 183183 197238 -146452
12212 191068 157699 245463 279165 112400 -49237 -126891 187735 170949 67833 308926 496522
12201 496522 -255780 438489 99703 -78749 315000 56096 185214 -3296 -91258 91622 19691
$$ packed form
12281b42104B97139b03787g7424C3334b4055o0734B3756K12295b5078B65931K7288
12270B93219a74917G2148d2178B80332a0698B16264m8879O2082l157p6188b4851
12258a25737A86246q2203N79829k62738e7839A70112b25750A33115K4090g8300
12247G2320L34511G0813Q552e0733j07549A40001q597K9570a13479B68977A27039
12235c84088E33107A09286J39835o3734N929M1367a16024B91627a91544g2178
12224A11690L37567k7174H4964K1200l4576K28216n7167j14265N4811J4055a46452
12212A91068l3369Q7764L3702A12400d9237p7654A87735j6786F7833K41093J87596
12201D96522b55780D38489I9703g8749C15000E6096J29118c296q7962I1622A9691
$$ plain form
12189 109060 228936 239673 214391 299691 -19860 10686 -166971 76050 109333 -59263 146373
12177 -96422 -101578 105300 -62675 3075 165194 4214 130364 202881 -144760 62567 334748
12166 334748 134702 -21149 128527 143500 664704 175131 449091 370509 -136594 -153656
12156 -153656 -244591 206414 -120979 161317 -193383 -130457 -269192 63071 443566 -203765
12145 302211 -76977 355644 -96264 52401 782 288161 4058 96457 212499 188190 277469
12134 277469 316005 -64754 -44101 147943 163350 -101410 -77311 149812 9482 -235676 181569
12122 264137 -40308 150569 -118044 292987 -231645 -213697 -71406 -15532 -82401 159194
12111 116054 -51709 92471 433882 84581 -36213 224800 4406 260340 176438 22975 -180880
$$ packed form
12189A09060J19876J0737k5282Q5300a9860A0686a66971G6050L3283e9263A46373
12177i6422n156A05300f2675C075J62119D214J26150P2517a44760F2567K72181
12166C34748A34702b1149A28527J4973N21204A75131K73960p8582a36594j7062
12156a53656r0935B06414a20979A61317a93383O2926j38735F3071L80495b03765
12145C02211g6977C55644i6264E2401G82K87379D058R2399J16042k4309Q9279
12134B77469L8536f4754K0653A47943J5407a01410K4099A49812I482b35676A81569
12122B64137d0308A50569a18044B92987b31645J7948g1406a5532o6869A59194
12111A16054e1709I2471L41411H4581c6213B24800D406K55934q3902B2975a80880
$$ plain form
12099 -267999 187314 482492 17461 57627 421713 -210242 164584 73809 65814 72901 138375
12088 138375 50800 -74730 61597 130126 -216938 124096 -63121 58263 -105322 -86126 249948
12076 171153 -204317 34119 218672 118412 491890 694524 2376397 998833 539939 252931
12065 287731 -102460 -164285 173284 -2407 97657 -98911 255769 -203240 -101002 8598 -82994
12053 306891 246546 -129590 172792 -157723 127790 -260488 74135 183587 -308051 178719
12042 -122279 -282952 118342 249289 -36511 -52763 -55183 23822 -96688 14589 105045 173732
12031 173732 103267 -62889 98346 -292204 -173168 -288126 -52744 66891 -84286 -126067 25480
12019 -145414 -15234 -140523 -44649 -49707 72046 277729 13153 -39712 257509 -17737 -44568
$$ packed form
12099b67999A87314K95178A7461M0166L64086b10242A64584G3809p995P087O5474
12088A38375E0800g4730F1597O8529b16938A24096f3121E8263a05322J9196B49948
12076A71153b04317C4119J84553j00260L73478K02634J681873I98833m58894B52931
12065B87731a02460o1825A73284b407I7657i8911B55769b03240a01002H598h2994
12053C06891o0345a29590A72792a57723A27790b60488G4135J09452c08051A78719
12042a22279j60673A18342J30947c6511j6252k420B3822i6688A4589R0456O8687
12031A73732p0465f2889I8346b92204J19036j14958e2744F6891h4286m1781B5480
12019a45414a5234j25289d4649n058G2046K05683A3153c9712B57509a7737k6831
$$ plain form
12008 -44568 60118 21882 -61597 90612 -97977 -48219 -170921 92770 64188 -196722 -154993
11997 -154993 -45775 164431 314280 164249 -152266 -306831 -40918 -91729 -60579 -320912
11987 -320912 29208 -49922 -98788 62321 -202804 137348 117963 -295889 -193593 293993
11976 -69155 -194754 -47563 28644 155149 -86485 -203879 -218634 -92708 -131587 9 125828 53398
11963 31106 -146514 203875 8072 14901 -84036 -12901 46063 -131274 152814 115860 154633
11952 154633 -231529 481027 346 -294204 84632 159553 -16483 -4416 -160732 77918 129094
11941 129094 84010 27543 -302606 -75405 64039 -51925 82860 79820 156584 290698 369683
11930 369683 121154 -478911 -90045 -237589 -150548 -202374 -14019 33140 429343 -176356
$$ packed form
12008d4568F0118B1882f1597I0612i7977d8219j22702I2770k8582a96722M1729
11997a54993d5775A64431J49849j50031a52266j54565d0918n0811L1150k60333
11987c20912B9208d9922m8866F2321b02804A37348j9385b95889J02296B93993
11976f9155j25599d7563B8644J26505h6485j17394j4755i2708l8879IJ25819E3398
11963C1106a46514B03875H072O829h4036a2901D6063a31274A52814l6954L8773
11952A54633b31529D81027C46b94204H4632P4921a6483d416j56316G7918N1176
11941A29094m5084B7543c02606g5405F4039e1925H2860l040P6764J34114P8985
11930C69683A21154d78911i0045j47544Q7041n1826a4019C3140L96203a76356
$$ plain form
11919 -414797 9723 -83263 -47017 135419 293044 -58885 168688 167723 -171857 -237067 236414
11907 95849 -110058 21889 762008 348226 185727 99936 164941 -129702 234784 48258
11896 -42824 -94442 91607 -395400 115473 -155830 221261 87779 -96990 44650 -166890 67205
11884 -495309 277441 -257117 -211665 225578 -82645 -127549 -349355 -119377 93893 -115659
11873 -3247 132644 110681 226649 -228454 226709 -109988 -295982 -5824 12309 69892 -361614
11861 -138476 474875 -98158 105787 -17279 -150482 195427 -22432 -105561 -82123 89200 98293
11850 98293 -406586 179625 -51977 -39890 182070 -238055 297739 69364 32194 -37495 -30250
11839 -30250 -171346 13896 147709 -137069 -124180 -22241 62492 -334515 -269665 62327 -261072
$$ packed form
11919d14797I723h3263L6246A35419J57625e8885A68688r65a71857o5210B36414
11907I5849a10058B1889P40119C48226j62499q5791O5005a29702B34784D8258
11896d2824n1618I1607c95400A15473a55830B21261H7779i6990D4650a66890F7205
11884d95309B77441b57117M5452B25578h2645m4904k21806a19377I3893a15659
11873c247A32644k1963J15968b28454B26709a09988j85994e824A2309N7583c61614
11861a38476D74875i8158A05787a7279j33203A95427b2432q3129K3438H9200R093
11850I8293d06586A79625e1977J2087A82070b38055B97739F9364C2194c7495P245
11839c0250j41096A3896J33813a37069J2889b2241F2492c34515O4850F2327b61072
$$ plain form
11827 -36453 -394037 -61238 221541 125315 -2580 -274888 -57404 179569 5604 -235660 -92519
11815 44014 -107273 -110985 -49675 251311 -33119 -49221 -100859 137040 179263 -188559 -70378
11803 -240911 440946 32103 163476 -307626 395308 -38266 -59992 420490 -75491 190855
11792 2098 35500 54966 -59217 57565 -17226 -370295 133251 171233 -132598 -51134 79124
11780 59408 95917 18144 -190801 -102199 -93967 157447 -156928 -223157 -57163 46093 -58493
11768 35592 31488 -91458 -266165 -154713 44099 98561 -3863 6414 -29399 165511 -199353
11756 -166189 -68380 194117 -155067 167818 73696 361903 86752 -21155 -56279 30845 111450
11745 111450 -637 99181 -138664 68898 100905 85910 20601 -213934 -173 -329572 217856
$$ packed form
11827c6453l57584f1238B21541r6226b580k72308e7404A79569E604b35660i2519
11815D4014a07273l712d9675B51311c3119j6102n1638A37040M2223a88559g0378
11803b40911D40946C2103J31373c07626C95308c8266k1726D20490g5491A90855
11792B098L3402J9466e9217E7565a7226l53069A33251L7982a32598e1134G9124
11780E9408L6509A8144a90801Q8602Q232A57447a56928o6229e7163D6093e8493
11768C5592m104i1458j74707J11452D4099N4462c863F414b9399A65511a99353
11756a66189f8380A94117a55067A67818G3696K88207H6752b1155l5124C0845Q0605
11745A11450f37I9181a38664F8898L2007j4995B0601b13934a73l29399B17856
$$ plain form
11733 -172783 122455 68883 17650 -185690 29194 42314 -367788 -87408 115398 -14381 265536
11721 156943 -75031 -184088 127010 70635 91251 193143 -389049 2983 338954 15171 61591
11710 61591 49767 199426 293167 239419 -143413 221439 -112587 160770 240559 -197394
11699 124395 213237 332432 -62629 -95391 350308 66731 163720 42165 -92851 90996 50030
11688 50030 261545 257165 244985 174629 400968 278600 295590 4098 -115439 27596 273000
11677 273000 14308 -107966 -45819 -25706 123789 121687 -78538 -18897 -397174 -325689 -220663
11666 -220663 -278588 53716 126477 -116719 183944 -87060 -153441 326882 67990 210563 210110
11655 210110 -97374 119085 6544 187962 -17922 183128 -452480 -539185 -176762 378465
$$ packed form
11733a72783A22455n3572A7650a85690B9194J3120c67788h7408A15398a4381B65536
11721A56943g5031j09057A27010n6375K0616J01892c89049B983L35971A5171M6420
11710F1591j1824J49659R3741n3748a43413B21439a12587A60770P9789a97394
11699A24395Q8842J19195f2629l2762C50308F6731R6989D2165i2851I0996m0966
11688E0030K11515m380j2180p0356K26339j22368J6990D098a15439B7596K45404
11677B73000A4308a07966d5819K0113A23789k102g8538a8897l78277P1485J05026
11666b20663n7925E3716P2761a16719A83944h7060o6381C26882F7990J42573m53
11655B10110i7374A19085F544J81418a7922A83128d52480q6705a76762C78465
$$ plain form
11644 -69524 273222 -45373 379339 -21810 195720 -152424 -175222 -154027 110990 -154165
11633 22782 297497 69637 -149737 -51121 -77880 58209 -33644 113334 350016 -210699 -82098
11621 56875 -248939 68617 55173 -215243 -107016 -247895 -115953 48568 189118 332413
11611 332413 -5394 285682 57669 46313 -72056 193295 184506 -160494 -10535 518963 51850
11599 -198210 -160369 -101977 243403 205171 -80793 -24046 -267136 222637 -152432 -364970
11589 -364970 -215007 205598 -130571 75130 297769 293804 139476 -52048 86512 170300 -71921
11577 43319 96052 -249854 252893 -296559 137046 27941 -188073 -194020 -57537 211939 7001
11565 278266 187877 55166 230731 -15530 135746 231383 395914 222142 -155737 16429
$$ packed form
11644f9524B73222d5373C79339b1810A95720a52424k2798K1195A10990a54165
11633B2782K74715F9637a49737e1121k6759E8209c3644A13334K36682b10699h2098
11621E6875b48939F8617j3444b15243a07016j40879a15953D8568J40550J43295
11611C32413e394B85682E7669j1356g2056A93295q789a60494a0535E18963E1850
11599a98210L7841N8392B43403l8232h0793b4046k43090B22637a52432k12538
11589c64970J49963B05598a30571G5130K22639l965A39476e2048H6512Q3788g1921
11577D3319N2733b49854B52893b96559A37046B7941a88073n947e7537B11939G001
11565B78266r0389E5166J75565a5530A35746R5637J64531j73772a55737A6429
$$ plain form
11554 -122090 -39851 -152553 -224438 -1296 12567 -87021 -230197 -153525 179863 -79190 -106790
11543 -106790 138494 117037 192553 130673 -6946 148075 271134 360049 157573 38801 242002
11532 242002 198554 127771 216070 -75198 51989 218602 138309 320889 261364 -31625 -92777
11521 -92777 173293 228660 21417 -9230 160180 -101595 178748 103784 -95542 220166 256248
11510 256248 18755 361587 227217 -62406 202705 265084 104895 349991 204392 -182384
11499 355324 178099 30375 -275370 236357 301215 503285 66969 -253959 -30941 98961
11488 141335 117577 17454 102887 158434 -135538 -50435 201030 431257 58639 14014 32494
11477 32494 284313 620374 154849 153737 158631 73780 196182 69912 -69549 -20553 257335
$$ packed form
11554a22090c9851j12702p1885a296A2567h7021j43176P6672A79863g9190k7600
11543a06790A38494k1457P5516o1880f946A48075J23059Q8915A57573C8801K03201
11532B42002m3448p0783Q8299g5198E1989J66613q0293J82580n9525c1625o1152
11521i2777A73293N5367B1417i230A60180a01595A78748p4964i5542B20166L6082
11510B56248A8755L42832j34370f2406B02705O2379A04895K45096j45599a82384
11499C55324j77225C0375b75370B36357O4858K02070F6969b53959c0941I8961
11488A41335k3758A7454Q5433N5547a35538e0435B01030K30227E8639A4014J8480
11477C2494K51819L36061A54849j112M894G3780J22402F9912f9549b0553B57335
$$ plain form
11465 136091 -140062 461816 -90994 54607 300028 164922 57955 -26061 161170 140655
11455 140655 322424 168237 132974 122827 -66232 138795 72899 -170535 -126260 86240 26318
11443 -42028 108181 215127 -29978 -49003 234215 244938 449879 -136228 146264 135417
11433 135417 -276885 67791 -152960 -60871 -168482 -50621 -120207 -89470 -7865 434115 -273033
11421 20594 25307 -115008 -47989 -164211 183913 72284 -184606 -150990 -127102 1118 -120078
11409 276326 8453 31577 -172430 -171972 63938 -43938 -31885 -100023 223050 257855 -199140
11397 500412 366762 -67440 -69804 -17061 -373698 124549 -100508 -117160 -57596 -22052 -121988
11386 -121988 -409179 -21889 -13245 -114576 -227870 36673 -179025 18638 -222821 48910 13927
$$ packed form
11465A36091a40062D61816i0994E4607K45421j35106E7955b6061A61170k0515
11455A40655J81769j54187l5263j0147f6232A38795o5896a70535M4275H6240B6318
11443d2028A08181J06946b9978j9025B34215J0723K04941a36228A46264j0847
11433A35417b76885F7791a52960f0871j07611e0621o9586L0737g865D34115b73033
11421B0594M713a15008d7989j16222A83913G2284a84606L3616K3888A118a20078
11409B76326H453K3124a72430M58F3938d3938J2053o8138B23050L4805a99140
11397E00412j33650f7440k364a7061l56637A24549a00508j6652e7596b2052r9936
11386a21988k87191b1889Q644j01331j13294C6673a79025A8638b22821D8910A3927
$$ plain form
11374 -181318 209094 -99045 -294115 204233 82769 190060 188517 -176891 34573 -50958 43771
11362 -149389 164164 53068 -45378 169192 59933 415387 170547 -130079 58540 254105
11352 254105 -73226 17380 77742 -95141 -232761 -30912 -179382 -285429 -287730 212526 -148833
11340 58477 200239 -97102 -166196 38602 -184359 12315 123491 -452302 66744 -114731 -190810
11329 -190810 5997 -124172 -48013 -13876 -23676 -422517 -220627 169048 -19386 60007 -144380
11317 -151585 -227402 -73151 117802 114140 178088 -36021 13035 -48109 31345 -364759 -7971
11305 133611 -261822 58605 -76097 -222066 -112309 59685 108727 43613 252581 -160881
11294 -30600 76080 -4007 443870 -348760 -233238 266649 -55433 -395645 22338 -294139 -52358
$$ packed form
11374a81318B09094i9045j95070B04233H2769J07291j543a76891C4573e0958D3771
11362a49389A64164E3068d5378A69192E9933L55454A70547a30079E8540J95565
11352B54105g3226A7380O0362i5141j37620c0912j48470j06047k301B12526a48833
11340E8477J41762i7102o9094C8602a84359A2315J11176d52302F6744a14731p6079
11329a90810E997a24172d8013a3876r800l98841K01890A69048a9386F0007a44380
11317a51585p5817g3151A17802l662O3948c6021A3035d8109C1345c64759g971
11305A33611b61822E8605g6097j45969J09757E9685M9042D3613K08968a60881
11294c0600G6080d007D43870c48760J15522B66649e5433l40212B2338b94139e2358
$$ plain form
11282 -83691 -320218 92449 57107 436022 201771 -128528 90330 -249454 -227422 -236048 -360889
11271 -360889 -93843 -201617 48599 19476 142922 -354384 199748 -180228 101571 78027
11261 78027 -48375 89236 -182562 161388 130835 -28412 -22687 23105 99473 -75200 -46069
11250 -46069 185726 145626 230431 -97917 -14700 76525 -69893 -154217 74778 -392460 -246643
11239 -246643 -274828 -15813 -24419 103577 72720 52307 28157 -1255 86877 117996 -122617
11227 48856 -43030 309606 -250811 -184963 279816 36393 -41477 -79452 -46680 32813 -291512
11215 173030 -98910 -122421 -28435 -342022 -204509 284511 57910 200245 395728 -51786
11204 275631 -31110 338155 -71016 -71753 -78021 -121157 -130158 -52122 21093 -311490 148946 160259
$$ packed form
11282h3691k36527I2449l5342L78915B01771a28528I0330b49454K2032q626j24841
11271c60889i3843j07774D8599A9476J23446c54384A99748a80228A01571k3544
11261G8027d8375H9236a82562A61388l0553b8412N725B3105P6368g5200K9131
11250d6069A85726m0100Q4805i7917a4700G6525f9893q4324G4778c92460J45817
11239b46643k8185a5813q606A03577l0857k0413k4150a255H6877L1119a22617
11227D8856d3030C09606b50811O5848B79816C6393d1477l7975L2772C2813b91512
11215A73030i8910k3511b8435l13587J37513B84511E7910J42335J95483e1786
11204B75631c1110C38155g1016p37o268m3136r001e2122B1093c11490A48946J1313
$$ plain form
11192 160259 40864 130252 -20435 -158203 224733 -264074 -185485 185505 -149942 -105266
11182 -105266 -30084 92740 2789 -111670 -23401 -211008 -202966 302635 -7154 -55794 -60607 1314
11169 120179 -162130 -241466 -147539 135263 261124 -403058 -138053 24123 -21158 102705
11158 -197725 -79269 78314 195089 -28031 -194758 28118 242451 138315 -95557 56065 -100103
11146 -162028 -138490 -60524 -156989 -262417 262752 1468 -84452 144831 -171268 196097 187218
11135 187218 47218 79609 -64215 -178571 49318 56089 -89850 51866 -46458 231851 354524
11124 354524 301306 225341 -73624 205145 -74227 269597 -333484 -57214 204720 -107698
11113 162426 -131881 98584 278553 -231624 176606 -33005 188153 418082 145652 132878
$$ packed form
11192A60259D0864Q9388b0435j37768B24733b64074P8589A85505a49942M4676
11182a05266c0084I2740B789a11670b3401j87607Q042C02635g154m8640m813A314
11169A20179a62130p9336R3927A35263J25861d03058a38053B4123b1158A02705
11158a97725g9269G8314J16775b8031j66727B8118K14333j04136i5557E6065a00103
11146a62028K3538f0524r6465j05428B62752A468h4452A44831a71268A96097q879
11135A87218D7218L2391f4215j14356D9318O771h9850E1866d6458B31851J22673
11124C54524n3218p5965g3624B05145g4227B69597c33484e7214B04720a07698
11113A62426a31881I8584J79969b31624A76606c3005A88153K29929A45652j2774
$$ plain form
11103 132878 129180 79551 258480 -212705 136337 229764 28083 243678 230540 486727 238918
11091 249388 85395 138202 341303 384172 -242205 440607 216088 299154 419452 159989
11080 310802 2196 220863 -32221 -103347 241880 500541 319743 319009 136600 198334 511292
11069 511292 302417 500977 697884 481789 361522 140196 261722 612238 52213 459617
11059 459617 573967 608537 752866 687875 291120 643459 752434 582729 737953 657894
11049 657894 728027 727023 753740 846499 923826 897943 698133 853645 840927 1073363 840469
11038 840469 738440 619802 755539 739359 415445 486581 749696 447643 681889 848795
11028 848795 335751 1050579 580922 744931 609907 609047 622224 637862 478160 696514
$$ packed form
11103A32878l698m9629J78929b12705A36337R3427B8083K15595j3138K56187B38918
11091B49388H5395N2807K03101M2869b42205D40607B16088Q3066J20298A59989
11080C10802B196K18667c2221p1126B41880K58661j80798p34A36600O1734L12958
11069E11292k08875J98560J96907k16095j20267A40196J21526L50516E2213M07404
11059D59617J14350L4570J44329o4991B91120L52339J08975j69705J55224q0059
11049F57894P0133j004K6717R2759P7327k5883j99810J55512j2718K32436k32894
11038H40469j02029j18638J35737j6180l23914P1136K63115l02053K34246J66906
11028H48795C35751P14828m69657J64009j35024q60J3177J5638j59702K18354
$$ plain form
11018 696514 898168 729979 259825 371311 495986 603919 606846 378894 315468 628105
11008 628105 803258 543389 417590 373379 507850 416531 787977 607738 515631 761331
10998 761331 663807 798221 857291 558611 782129 680331 552104 733886 808533 732029
10988 732029 813534 1006589 934911 964881 696391 948450 1216514 1090672 1295431 1510994
10978 1510994 1536042 1680082 1722397 1742976 2605090 2926991 2726764 2804670 3073125 2596181
10968 2596181 2611092 2248742 2051537 1851555 1698446 1646032 1525284 1580470 1520994 1184458
10958 1184458 1603653 1473173 1701779 1375160 1231152 1159971 1070022 671329 831169 799539
10948 799539 366582 180883 331518 148383 362623 381267 -49664 362390 55678 134467
$$ packed form
11018F96514K01654j68189B59825J11486J24675J07933K927k27952o3426L12637
11008F28105J75153k59869j25799m4211J34471r1319L71446j80239r2107K45700
10998G61331r7524J34414N9070k98680K23518j01798j28227J81782P4647p6504
10988G32029Q1505J93055p1678K9970k68490K52059K68064j25842K04759K15563
10978A510994K5048J44040M2315K0579Q62114L21901k00227P7906K68455m76944
10968B596181J4911l62350j97205j99982j53109n2414j20748N5186n9476l36536
10958A184458M19195j30480K28606l26619j44008p1181q9949l98693J59840l1630
10948G99539C66582A80883J50635A48383K14240J8644d9664C62390E5678P8789
$$ plain form
10938 134467 143001 277882 150538 346581 -2685 -242844 -189885 -137543 249488 89486 -95978
10926 -133362 136044 118781 289765 -64534 132408 34205 -181207 48006 -35077 168362
10915 195305 -409279 -67751 169693 -76218 17639 290917 -199615 655438 62926 -17289
10904 113361 19516 143538 -247898 -292811 -274892 139144 205423 224988 40863 80421 107657
10893 107657 32323 -38075 -319283 -130865 35446 1385 -100995 -121257 33348 277852 11778
10881 -75425 -172859 -313997 -129808 -176742 -121163 86053 -110297 -19489 -347263 33245 152113
10870 152113 110449 -347124 194928 26198 57033 -185041 246010 50248 96596 80933 -142054
10858 -251047 64168 299674 75407 22940 -122006 -8587 360836 -13592 95749 -244309 33728
$$ packed form
10938A34467Q534J34881j27344J96043b685k40159N2959N2342B49488H9486i5978
10926a33362A36044j7263J70984f4534A32408C4205a81207D8006c5077A68362
10915A95305d09279f7751A69693g6218A7639K73278a99615F55438F2926a7289
10904A13361A9516J24022b47898m4913J7919A39144O6279J9565D0863L9558K7236
10893A07657C2323c8075k81208a30865C5446A385a00995k0262C3348K44504A1778
10881g5425r7434j41138a29808m6934N5579H6053a10297a9489l27774C3245J18868
10870A52113m1664c47124A94928B6198L0835a85041B46010E0248M6348j5663a42054
10858b51047F4168K35506G5407B2940a22006h587C60836a3592I5749b44309C3728
$$ plain form
10846 14424 58131 -322881 -34523 -229504 -60472 167115 76907 143084 -340388 163426 100165
10835 100165 138863 -117457 119861 158411 -132594 83176 214947 -185940 -246654 -94383
10824 186480 -192061 -152594 -88342 481659 48709 -145233 -141737 -19224 -124498 -14982 149435
10812 162860 29971 -196736 75965 -178136 -164907 -321863 -248544 -205162 19658 126305 183412
10801 183412 274637 -277359 -363967 17978 72251 211521 -82979 77195 -131132 -51167 -37748
10790 -37748 99865 -202383 -123140 59368 173969 101862 -182555 51085 -121321 50981 148147
10779 148147 -83408 -82859 82476 12479 329588 -3424 -216826 -214619 213415 -127687 46872
10767 -40855 -372324 -206600 -49676 -90925 -109075 -20481 -53574 209290 -435186 -27078 165657
$$ packed form
10846A4424M3707c22881c4523j94981f0472A67115G6907O6177c40388A63426o3261
10835A00165L8698a17457A19861L8550a32594H3176J31771a85940o0714i4383
10824A86480a92061L9467O4252D81659D8709a45233L496a9224j05274a4982A49435
10812A62860B9971a96736G5965a78136J3229j56956P3319M3382A9658J06647N7107
10801A83412R1225b77359q6608A7978N4273J39270h2979G7195a31132e1167J3419
10790c7748I9865b02383P9243E9368J14601p2107a82555E1085a21321E0981R7166
10779A48147h3408N49H2476A2479L17109c424k13402K207B13415a27687D6872
10767d0855l31469J65724d9676m1249j8150b0481l3093B09290d35186b7078A65657
$$ plain form
10755 19707 -269872 -43480 232803 -207692 104576 -77490 -9317 -127036 -94165 53603 -31236
10743 190674 71736 118486 -93842 -130876 -41129 19537 50796 32507 227980 71896 -113976
10731 -198857 339497 214468 -283352 38085 -255104 213708 -72083 88864 38131 108256
10721 108256 36063 224279 -46053 177424 -91408 -20928 33788 116981 191493 -17926 98155
10709 -38243 -474818 202853 -103118 -337601 -106745 -42058 -11092 -109509 244051 39579
10698 -237579 -216066 -177793 -75641 178297 111145 -314591 -106789 10690 -215841 36863 -96805
10686 -271316 -32632 2419 -261706 -101173 -250133 -211199 -40822 -122407 -109933 45014 -59641
10674 -179694 -129129 42334 -71185 -46390 250401 44927 -21190 -98857 27500 63306 1398
$$ packed form
10755A9707b69872d3480B32803b07692A04576g7490i317j17719L2871E3603c1236
10743A90674G1736M6750i3842l7034d1129A9537L1259j8289J95473G1896a13976
10731a98857C39497j25029b83352C8085b55104B13708g2083H8864C8131P0125
10721A08256C6063J88216d6053A77424i1408b0928C3788Q3193P4512a7926I8155
10709c8243m36575B02853a03118k34483a06745d2058a1092r8417B44051C9579
10698b37579K1513L8273g5641A78297o7152c14591a06789A0690b15841C6863i6805
10686b71316c2632B419b61706a01173j48960L8934d0822q1585J2474D5014e9641
10674a79694N0565D2334g1185K4795B50401D4927b1190p7667B7500L5806A398
$$ plain form
10662 109297 -248591 125544 -236155 -308155 -107267 -139749 123679 -10011 101141 -195089
10651 -332914 218935 51218 -129782 41175 -38131 -96809 -167882 17596 -179696 -101309 -34840
10639 -476383 -82182 -34473 -13876 -86360 -188321 -35562 -457315 -56832 -179352 -99847 15818
10627 62175 -290974 80378 30482 -81841 -66199 -213349 -140448 -206198 52933 1769 22645
10616 22645 24701 141438 -172059 39965 -123903 -41613 -10517 -219728 -86504 12821 -139464
10604 -138754 -112734 96555 -151069 -102087 -336999 192173 -94205 -92772 133160 -145818 -108658
10593 -108658 108931 -212821 -204073 13761 220088 212787 -53204 13482 -129221 -144721 26304
10581 -4591 249399 -70667 -240824 -79032 4959 516817 -165857 -152892 -187798 -83567 -58301
$$ packed form
10662A09297b48591A25544b36155p2000a07267l2482A23679a0011A01141a95089
10651c32914B18935E1218a29782D1175c8131n8678p1073A7596a79696P8387c4840
10639d76383h2182c4473a3876p2484j01961c5562m21753e6832j22520P9505A5818
10627F2175b90974H0378C0482h1841J5642j47150P2901o5750E2933A769K0876
10616B2645K056J16737a72059C9965a23903d1613a0517k09211h6504A2821a39464
10604a38754K6020I6555a51069M8982k34912A92173i4205J433A33160a45818L7160
10593a08658A08931b12821Q748A3761K06327p301e3204A3482a29221j5500B6304
10581d591B49399g0667j70157g9032D959N11858a65857J2965l4906h3567K5266
$$ plain form
10570 -58301 162763 -159067 -102663 -72845 -91579 -136174 153594 -142057 -104265 -339380 -288663
10559 -288663 -331903 67443 38648 29314 -30370 8865 213811 -206658 -472569 2455 116063
10548 116063 -160060 -65347 -137045 -13774 149578 101838 403656 82468 153200 139041 96114
10537 96114 36455 -167080 -558169 71730 -275925 376912 -167882 103418 -362316 -148822
10526 282806 244018 -256408 149478 110543 -190782 -50818 -125240 173793 -199629 33325
10515 -237987 -100292 71225 -198408 120958 118570 29462 -11496 -172850 -223400 36238 -227836
10503 168421 130304 18945 -155176 6685 -67332 315012 -116337 -86970 -252208 35367 153027
10492 153027 -58048 -229384 -301066 -232380 -106774 1619 74326 183378 -10502 84914 157129
$$ packed form
10570e8301A62763a59067N6404K9818j8734m4595A53594a42057L7792k35115N0717
10559b88663m3240F7443k8795r334c0370H865K04946b06658k65911B455J13608
10548A16063a60060f5347p1698a3774A49578m7740L01818H2468P0732j4159m2927
10537I6114C6455a67080l91089G1730b75925C76912a67882A03418c62316a48822
10526B82806l8788b56408A49478l8935a90782e0818p4422A73793a99629C3325
10515b37987a00292G1225a98408A20958k388B9462a1496j61354n0550C6238b27836
10503A68421l8117A8945a55176F685f7332C15012a16337K9367j65238C5367J17660
10492A53027e8048j71336p1682O8686a06774A619P2707J09052a0502H4914P2215
$$ plain form
10481 157129 133585 134970 558812 352539 206753 105888 299492 32855 19778 240063
10471 240063 112495 203216 1000 166702 -119167 10735 112035 269980 223062 -31476 154375
10459 -173074 -93568 -348065 -205532 161116 343771 -260706 89945 5474 -235792 -297893
10449 -297893 -146867 -236309 58452 -103527 -257271 55217 -98472 -351534 -242896 48030
10438 128091 -21480 -150954 91300 -105527 -50238 195260 -353410 -291364 -194079 881 67081
10427 67081 -18571 -105911 -256203 -340711 87901 725 40220 101785 51544 5620 152529 101522
10415 101522 -82974 -117617 -42366 -174604 26963 -115933 -156843 -172210 29166 -226776 35253
10403 87888 146561 7394 -111242 -68633 37176 91757 -56459 -76701 -7690 51717 -265438 40309
$$ packed form
10481A57129k3544J385M23842k06273j45786j00865J93604C2855j3077K20285
10471B40063A12495R0721A000J65702a19167A0735J01300J57945m6918c1476A54375
10459a73074P9506k54497J42533A61116J82655b60706H9945E474b35792o2101
10449b97893a46867q9442E8452a03527j53744E5217i8472k53062J08638D8030
10438A28091b1480j29474I1300a05527e0238A95260c53410O2046R7285H81O6200
10427F7081a8571q7340j50292q4508H7901G25L9495O1565n0241E620J46909n1007
10415A01522h2974l4643d2366j32238B6963a15933m0910j5367B9166b26776C5253
10403H7888N8673G394a11242M2609C7176N4581e6459k0242g690E1717b65438D0309
$$ plain form
10390 161500 144324 183418 243523 168145 -71929 145223 41213 106394 113899 456116 231950
10379 231950 -171849 348954 311145 283852 593134 513399 102532 293402 54013 460300
10369 460300 212376 218807 351685 561181 572829 680964 397484 -20177 108769 401068
10359 401068 151514 212843 225386 298748 370694 347683 317943 811829 626372 929578 319080
10347 218854 286490 203853 238129 502773 417048 361347 410160 225024 12237 2222 418377
10336 418377 295708 233960 -48189 -65885 9906 326686 -43028 -107493 162609 249705 184559
10325 184559 124896 590727 204002 224037 121899 21933 401869 320827 -219587 294181
10314 345819 300125 11926 124015 47069 273836 -125792 12307 -23597 -257015 -239780 105687
$$ packed form
10390A61500j7176L9094O0105p5378g1929A45223D1213O5181P505L42217k24166
10379B31950a71849C48954l7809k7293L09282p9735A02532J90870E4013M06287
10369D60300B12376O431J32878K09496J1648J08135k83480b0177A08769K92299
10359D01068A51514O1329J2543P3362P1946k3011k9740M93886j85457L03206C19080
10347B18854O7636q2637L4276K64644q5725n5701M8813j85136A2237B222M16155
10336D18377j22669o1748d8189j7696I906L16780d3028o4465A62609Q7096o5146
10325A84559n9663M65831B04002K0035j02138B1933L79936q1042b19587B94181
10314C45819m5694A1926J12089D7069K26767a25792A2307b3597k33418J7235A05687
$$ plain form
10302 -46556 2645 148377 -35950 76638 155809 -132899 28335 -93753 -47681 -165768 -65397
10290 58428 -68042 59613 -52889 -109651 -27149 68466 6485 58986 -180974 -133558 -13551 -79758
10278 -79758 580822 -17079 -170921 185285 -213664 102295 53387 -20979 288880 145319
10268 145319 274264 -7201 3629 -219567 -187365 38614 -207691 199082 43231 480858 139161
10256 146156 262226 121137 106790 23098 -30663 53728 145035 2958 124060 118421 78544
10245 78544 41723 128365 -91901 347717 52980 -184195 -171079 473377 -126937 223174 -103290
10233 -46061 -44609 -187933 -142526 -389134 -154670 -10414 -96914 306048 64304 4539 -4911
10221 -232223 82512 -113954 -83620 82091 -264734 25602 -16958 9005 -60917 23571 122618
$$ packed form
10302d6556B645J45732c5950G6638P9171a32899B8335i3753M6072j18087f5397
10290E8428f8042E9613e2889n6762b7149F8466F485N2501a80974M7416a3551o6207
10278g9758E80822a7079j53842A85285b13664A02295m8908b0979B88880j43561
10268A45319J28945g201C629b19567L2202C8614b07691A99082D3231M37627A39161
10256A46156J16070A21137j4347B3098c0663E3728R1307B958J21102n639l9877
10245G8544l6821Q6642i1901C47717E2980a84195J3116D73377a26937B23174a03290
10233d6061J452j43324M5407k46608a54670a0414q6500C06048F4304D539d911
10221b32223H2512a13954L0334H2091b64734B5602a6958I005f0917B3571R9047
$$ plain form
10210 122618 -401618 -120271 294303 63872 -221951 135682 -59597 -149560 -160258 73397
10199 -322862 -258973 -55396 55783 172728 -41 -106140 -129953 -246880 -189754 -209607 -281173
10188 -281173 39193 16216 64654 -199842 -19026 -73640 -99543 -132528 -94846 -102483 -262464
10177 -262464 -320294 -205416 -262455 80208 -48786 378560 -134363 -50033 75147 -70986 -104464
10166 -104464 -272557 122389 -111770 -186567 -444880 -303004 -58902 70734 -411774 -287611
10156 -287611 -209813 -123338 -34592 74566 74195 -343706 7510 -164366 -152178 2215 342159 -215020
10143 -107643 -36746 147302 -574127 100905 -409878 -18282 -155673 -44068 -190636 11641
10132 -138741 -450179 -67669 -165110 -20651 7459 193993 20195 -203317 -178133 74996 -121145
$$ packed form
10210A22618d01618a20271B94303F3872b21951A35682e9597q9963j0698G3397
10199c22862O3889e5396E5783J16945d1j06099k3813j16927N7126j9853p1566
10188b81173C9193A6216M8438a99842a9026n4614k5903l2985L7682p637j59981
10177b62464n7830J14878n7039H0208d8786C78560a34363e0033G5147g0986l3478
10166a04464j68093A22389a11770p4797k58313J41876e8902G0734d11774J24163
10156b87611P7798Q6475c4592G4566l71c43706G510a64366J2188B215L39944b15020
10143a07643c6746A47302e74127A00905d09878a8282j37391d4068j46568A1641
10132a38741l11438f7669r7441b0651G459J86534B0195b03317K5184G4996a21145
$$ plain form
10120 -187663 -258439 -8281 -193973 -49493 15022 -38299 208830 118142 132486 -217176 93910
10108 -89468 60030 -259463 -97154 125724 -199306 179593 56249 43588 -217417 -422499
10098 -422499 34185 182155 -13863 27625 -35947 -217188 260004 130632 -28366 -331211
10088 -331211 256023 -78187 -37799 94375 -204806 -117363 -112191 -10158 34763 -27911 58425
10076 229542 -9401 -341886 28412 -432053 37185 -210160 -392021 56532 337170 -21444 -144897
10065 -144897 -130702 -161304 19471 -85213 17639 -136803 90152 -333288 -11145 191457 -478330
10053 -202288 270558 -140175 169854 -135989 14063 505262 -159009 -138647 -50350 -279094
10043 -279094 123159 -187949 -57156 -120843 57134 9495 -246442 -912 48336 217023 132053
$$ packed form
10120a87663p0776h281j85692d9493A5022c8299B08830r0688J4344b17176I3910
10108h9468F0030b59463i7154A25724a99306A79593E6249j2661b17417k05082
10098d22499C4185J47970a3863B7625c5947j81241B60004j29372b8366l02845
10088c31211B56023g8187c7799I4375b04806Q7443N172a0158C4763b7911E8425
10076B29542i401l32485B8412d32053C7185b10160j81861E6532K80638b1444j23453
10065a44897J4195l0602A9471h5213A7639a36803I0152c33288a1145A91457d78330
10053b02288B70558a40175A69854a35989A4063M91199a59009K0362e0350k28744
10043b79094A23159a87949e7156o3687E7134I495b46442i12D8336J68687q4970
$$ plain form
10032 132053 530902 203586 53491 101471 -12170 -374385 -293445 63407 -140911 -52665 -101937
10021 -101937 -344773 -364112 -273267 -150401 -3782 12737 63795 -74095 -60121 -437681 -456257
10010 -456257 35748 98763 2256 -51387 -271958 339711 -22306 -281804 -231570 -37204 -436306
9999 -436306 -456738 -166002 -42277 324931 -246102 226265 52858 -175870 65467 -67186 -412503
9988 -412503 57403 -176157 200391 114001 -70012 -185483 159995 12767 -77780 -95750 -131927
9977 -131927 13598 163883 -273637 147306 -209457 -93067 86931 -417238 -13479 51194 -98043
9965 -211145 106732 -164009 29590 13150 -315154 10573 -158363 -251099 -305491 -129637 -319267
9954 -319267 -312278 128569 187164 -127001 79641 11345 -63569 -455794 53302 -196088 56927
$$ packed form
10032A32053L98849B03586E3491M7980a2170l62215Q0940F3407a40911e2665m9272
10021a01937k42836j9339R0845J22866c782A2737N1058g4095J3974l77560j8576
10010d56257C5748O3015B256e1387k20571C39711b2306k59498N0234c7204l99102
9999d36306k0432a66002d2277C24931b46102B26265E2858a75870F5467f7186l45317
9988d12503E7403a76157B00391q6390g0012j15471A59995A2767g7780j7970l6177
9977a31927A3598J50285b73637A47306b09457i3067H6931d17238a3479E1194i8043
9965b11145A06732a64009B9590A3150c15154A0573a58363r2736n4392a29637j89630
9954c19267O989A28569N8595a27001G9641A1345f3569l92225E3302a96088E6927
$$ plain form
9942 -222055 -127197 -156134 -255038 76655 150351 9304 -147050 26264 44514 99654 -34751 -120970
9930 -120970 -393278 266663 23973 -241815 -171433 -38261 122498 -328795 97993 65677 186203
9919 186203 -121438 -387699 -278325 -193144 -186313 -49280 227546 162343 -133361 -88119 204402
9907 201785 -212539 -113519 -69087 40604 -304595 -408421 -10019 -81372 -59478 -131955 304920
9895 260213 103129 -147807 -51197 11662 113406 293468 114352 -306875 -25271 -7476 -59858
9884 -59858 26716 304466 34088 20704 -165402 -378816 -596517 -2212 -238438 -7369 -50306
9873 -50306 -59549 -64695 -323772 -315816 117994 -335323 -170291 -92475 56244 -87268 -97579 10088
9860 -69144 7312 -229280 -373003 179142 168498 286923 -222820 -42168 -65036 -1993 -175872
$$ packed form
9942b22055R4858k8937r8904G6655P3696I304a47050B6264J8250N5140c4751q6219
9930a20970k72308B66663B3973b41815P0382c8261A22498c28795I7993l2316J20526
9919A86203a21438k66261J09374Q5181O831d9280B27546o5203a33361M5242B04402
9907B01785b12539R9020M4432D0604c04595j03826a0019p1353K1894p2477C04920
9895B60213A03129a47807e1197A1662J01744J80062A14352c06875b5271g476n2382
9884e9858B6716K77750C4088j3384a65402k13414k17701b212k36226g369m2937
9873e0306r243n146k59077P956A17994c35323J65032P7816E6244h7268j0311A0088
9860f9144G312b29280j43723A79142j0644J18425b22820d2168k2868a993j73879
$$ plain form
9849 -175872 1560 45006 -292910 177363 -135607 -69994 160354 -37217 -218864 -144049 81467
9837 -311605 180597 -323688 14270 -24979 39488 -266074 85456 45658 -44355 -307575 447736
9825 -423831 62518 -77987 -17462 370823 62548 -41811 181170 234718 35065 19543 -245403
9813 -55393 144324 -8262 -49643 80457 -82256 -53592 139342 16776 133857 234814 -117411
9801 145955 302437 41742 37186 -201220 -273276 -173613 -217842 -48408 -146824 -90370 -100522
9790 -100522 -401303 -22369 -187682 -370231 -299756 -185173 171485 -280027 -336815 89946
9779 -117310 334451 22245 -264730 -67901 -280631 -455196 -41415 -183308 84832 -322571
9768 158148 133723 105437 -123233 -224246 -253216 -187890 23963 -170242 -245815 -246493 116563
$$ packed form
9849a75872A560M3446b92910A77363a35607O5613A60354c7217j81647P4815H1467
9837c11605A80597c23688A4270b4979C9488b66074H5456l9798d4355k63220D47736
9825d23831F2518g7987a7462C70823F2548d1811A81170N3548C5065j5522b45403
9813e5393A44324h262m1381H0457h2256K8664A39342A6776J17081J00957a17411
9801A45955J56482D1742m556b01220p2056R9663m4229d8408r8416N6454j0152
9790a00522l00781b2369j65313j82549P0475J14583A71485b80027n6788H9946
9779a17310C34451B2245b64730f7901k12730j74565d1415j41893H4832c22571
9768A58148k4425k8286a23233j01013k8970O5326B3963a70242p5573o78A16563
$$ plain form
9756 -97669 -421789 -73249 -367419 149038 -126647 67536 12265 62695 -166551 78346 -67889
9744 87950 24362 -82503 -1716 -183319 -68406 -182820 -210333 215559 138000 -29465 -17686
9733 -17686 -247793 87993 -14145 -80175 315233 -147346 -100129 1355 -152803 89802 -146949
9721 -232664 -222800 207725 -192088 132105 -125674 7515 -18169 94289 -228473 65618 -53287
9709 -248033 -56499 168426 76748 117550 -37158 -346355 -139842 -24114 -13848 60003 -191166
9697 -426656 55707 -13664 -39837 136758 190783 -3742 138281 -291501 157323 178619 178008
9686 178008 -282248 -125191 10748 98461 80948 -123759 -209018 -148216 119422 -147662 186357
9674 -340317 -189838 -256998 137880 232856 -92891 -28920 59571 -212575 -45046 -462805 154087
$$ packed form
9756i7669l24120g3249k94170A49038a26647F7536A2265N0430a66551G8346f7889
9744H7950B4362h2503a716j81603f8406j14414k7513B15559p7559b9465J1779
9733a7686k30107H7993a4145o6030C15233a47346M7217A355a52803H9802a46949
9721b32664R864B07725a92088A32105a25674G515a8169I4289b28473F5618e3287
9709b48033e6499A68426G6748M0802c7158l09197a39842b4114J0266F0003a91166
9697d26656E5707a3664k6173A36758N4025c742A38281b91501A57323K1296o11
9686A78008b82248a25191A0748Q7713j7513a23759q5259O0802A19422a47662A86357
9674c40317J50479o7160A37880R4976i2891b8920E9571b12575d5046m17759A54087
$$ plain form
9662 -211185 -122972 260276 -334833 -321298 222913 -62451 41796 -116578 -108039 -168655 -222467
9651 -222467 151808 -166777 -24602 139479 -309479 245339 64651 -436968 58060 -174289
9640 -457884 -292213 -390259 -426807 -173654 -179258 90307 -87845 -157505 -278280 -148971 -377977
9629 -377977 -77621 -234533 -269451 -323568 -374421 73034 -246963 -181354 -324492 -162735 90837
9617 -99695 -126514 -152883 130175 -218773 100155 57216 -236745 -247222 31782 342030 95865
9605 70958 -174248 -121379 9830 200890 -118389 144513 -239132 -68630 -277654 -115696 -135455
9594 -135455 -52579 -66976 -171004 121516 300406 84629 28550 -24081 -323131 83752 -243475
9582 -60120 -40055 -65107 261471 -94232 -132152 -25652 -92938 -249990 -92553 -192176 98338
$$ packed form
9662b11185Q8213B60276c34833J3535B22913f2451D1796a16578Q539o0616n3812
9651b22467A51808a66777b4602A39479c09479B45339F4651d36968E8060a74289
9640d57884J65671r8046l6548a73654n604I0307h7845o9660j20775J29309k29006
9629c77977g7621j56912l4918n4117n0853G3034b46963O5609j43138J61757I0837
9617i9695k6819k6369A30175b18773A00155m2939b36745j0477C1782L10248I5865
9605G0958a74248N2869I830J91060a18389A44513b39132f8630k09024a15696j9759
9594a35455e2579j4397j04028A21516J78890H4629B8550b4081k99050H3752b43475
9582f0120K0065k5052B61471i4232l7920b5652o7286j57052i2553r9623I8338
$$ plain form
9570 115446 92502 -280535 197717 -338614 -97987 9819 120318 -2174 4053 -167042 18668
9558 109133 -48475 -280782 -41099 65062 -158011 -159198 189044 -304239 -88194 66403 -8 -97316
9546 -97316 21701 21157 -94276 168112 -214660 -142486 31327 160667 338290 63853 -258003
9534 -66042 140215 -24437 62203 288134 9939 -88482 338023 -162965 -77735 -61251 -93743
9523 -93743 209697 -75342 -26546 -25561 47355 34352 -93136 21627 -294244 -214109 -390803 -25727
9510 -65217 -149332 -65201 74541 -165480 -159225 55365 -98457 -127370 -174550 -98140 -155099 -94492
9498 -94492 -10381 -25158 133096 -190763 -370094 -101606 23311 -79983 -444520 21044 390028
9487 390028 -215044 -39123 18153 -63958 18024 -231011 -97467 -176077 -65859 -356987 29784
$$ packed form
9570A15446k2944b80535A97717c38614i7987I819J10499b174D053a67042A8668
9558A09133d8475k32307d1099F5062a58011j187A89044c04239h8194F6403hr7308
9546i7316B1701n44i4276A68112b14660P2174C1327J29340J77623F3853b58003
9534f6042A40215b4437F2203K25931I939h8482C38023a62965g7735J6484l2492
9523i3743B09697g5342b6546R85D7355j3003i3136B1627b94244Q0135j76694b5727
9510f5217q4115f5201G4541a65480O255E5365i8457k8913m7180P6410n6959O0607
9498i4492a0381j4777A33096a90763j79331a01606B3311g9983l64537B1044L68984
9487C90028b15044c9123A8153f3958A8024b31011i7467p8610f5859k91128B9784
$$ plain form
9475 -76338 -58793 -246241 -230249 -89700 -64341 -179359 157945 119731 -68480 -96317 60171
9463 263740 -54646 -23406 28047 -10387 65889 161210 -32409 -418495 -253558 -233642 -123580
9452 -123580 12918 105049 33103 335109 311495 -226252 5283 163184 -143044 -118601 -121227
9441 -121227 258803 140238 -60877 170133 -76927 -250578 -118335 -341133 -433067 229124
9430 362521 -6698 -238359 179624 -267360 66968 34295 -186159 -39066 -421881 -114019 234658
9418 -115983 50747 -238746 203282 -94462 65885 45800 -278274 -194900 -82086 105014 -140798
9406 -369128 -275725 188882 -25853 216385 -329849 -66914 -479973 -45508 -184081 136331
9395 -232587 199529 106808 -45128 51549 -88249 9862 135794 -261598 -179816 -35827 -140036
$$ packed form
9475g6338J7545j87448J5992h9700K5359j15018A57945l8214f8480k7837F0171
9463B63740e4646b3406B8047a0387F5889R5321c2409l86086J64937J9916J10062
9452a23580A2918R2131C3103L02006k3614b26252E283J57901a43044K4443k626
9441a21227B58803j18565f0877A70133g6927j73651a18335k22798r1934B29124
9430C62521f698k31661A79624b67360F6968l2673a86159c9066l82815a14019B34658
9418a15983E0747b38746B03282i4462F5885k0085b78274Q3374h2086A05014a40798
9406c69128R3403A88882b5853B16385c29849f6914m13059d5508j38573A36331
9395b32587A99529r2721d5128E1549h8249I862J25932b61598Q1782c5827j04209
$$ plain form
9384 -140036 -440798 10383 201677 -203287 -4315 277310 -69015 32889 22618 -11195 -61154
9373 -61154 -74756 -189162 -70053 -166073 -206658 -176533 8426 267558 -69150 135794 74058
9362 74058 -52325 97952 -250724 120740 256158 -115961 -41416 -105104 -139116 -18186 -33242
9351 -33242 206681 -377458 75713 -85160 -300955 -19458 111923 -90988 204060 -22144 -102441
9340 -102441 10891 -191204 44439 116073 303364 90455 -123273 245559 -2517 -143709 119010
9328 -7528 -49993 -25081 -377479 163744 -225590 154867 -49788 -371118 396220 -194570 -186813
9317 -186813 26025 -236992 -128134 -175124 -212990 5789 -69786 267426 -352620 -479432 -50783
9305 151668 -188881 -264756 -272164 42626 69001 -255104 -245885 -35438 -76072 -258897 80787
$$ packed form
9384a40036l00762A0383J91294b03287d315B77310f9015C2889j0271a1195m9959
9373f1154j3602j14406g0053r6020m0585L0125H426K59132f9150A35794o1736
9362G4058e2325I7952b50724A20740J35418a15961d1416o3688l4012a8186j5056
9351c3242B06681c77458G5713h5160k15795a9458A11923i0988B04060b2144q0297
9340a02441A0891a91204D4439P1634J87291I0455a23273B45559b517j41192A19010
9328g528m2465K4912l52398A63744b25590A54867d9788l21330C96220a94570P757
9317a86813B6025b36992J08858m6990l7866E789f9786B67426c52620j26812e0783
9305A51668a88881p5875p408D2626K6375b55104R219c5438m0634j82825H0787
$$ plain form
9293 -283060 141727 -264832 -65518 -27836 -195640 68208 338729 23975 -164257 -143317 70818
9281 -125437 -219890 -46173 -482986 -85998 24708 -220058 -148985 -21092 -428856 21334 -309704
9269 82605 -34920 255808 107818 -353196 -211099 -154335 197401 -23797 -135348 67769 -26463
9257 35384 -155628 -148337 100571 -1587 -42105 270226 -41537 -51700 107715 -219540 -138403
9246 -138403 142767 158826 -115830 -364427 -107279 -312666 -99351 113408 -27823 47242
9235 -185933 -16175 -112052 58589 -132883 -82909 -315192 -5587 95846 62942 -418881 187583
9223 318640 -142927 -226012 -142215 116271 -261902 -186170 -13885 95048 -26994 57268 -186928
9211 -64335 -225332 -181701 -96535 83897 -374984 173426 -119108 86423 31878 -217972 192187
$$ packed form
9293b83060A41727b64832f5518b7836j67804F8208K70521B3975a64257K0940G0818
9281a25437r4453d6173m36813h5998B4708b20058P1073b1092m07764B1334c09704
9269H2605c4920B55808A07818c53196J42097N6764A97401b3797j11551F7769b6463
9257C5384a55628P291A00571a587m0518B70226d1537j0163A07715b19540Q1137
9246a38403A42767J6059a15830k48597a07279k05387i9351A13408b7823D7242
9235a85933a6175r5877E8589a32883M9974k32283e587I5846l2904d18881A87583
9223C18640a42927q3085Q3797A16271b61902P5732a3885I5048b6994E7268a86928
9211f4335j60997M3631Q5166H3897c74984A73426a19108H6423C1878b17972A92187
$$ plain form
9199 59615 -166932 236223 -196036 -456357 -235640 -496722 18225 -86041 -149760 79261 -12515
9187 418005 -112275 47523 -189053 33251 -114732 -10548 1517 -221974 352429 80052 -76234
9175 69266 -345817 -47219 -242731 -109660 96311 82859 -60551 372162 188033 -32671 -94614
9164 -94614 211261 -94652 -273506 -109216 81884 -59098 -12285 -29741 63656 -117243 -413389
9153 -413389 -266042 335561 73860 -110551 -353655 110806 -179029 -366102 175101 -184109
9142 73992 26688 -11628 -203664 347141 -116628 345614 -94310 120256 -202975 177261
9131 -459771 -129663 -377273 -31902 111909 -243678 -104615 35365 -9183 -291033 67601 186085
9120 186085 -31595 -177825 -177934 127755 -78544 -67358 68151 -52218 24115 -137937 66182
$$ packed form
9199E9615a66932B36223a96036k60321K20717k61082A8225h6041o3719G9261a2515
9187D18005a12275D7523a89053C3251a14732a0548A517b21974C52429H0052g6234
9175F9266c45817d7219j95512a09660I6311j3452f0551C72162j84129c2671o1943
9164i4614B11261i4652j78854a09216H1884e9098a2285j7456F3656a17243k96146
9153d13389J47347C35561G3860a10551k43104A10806a79029j87073A75101a84109
9142G3992B6688a1628j92036C47141a16628C45614i4310A20256b02975A77261
9131d59771a29663k47610c1902A11909b43678a04615C5365i183k81850F7601J18484
9120A86085c1595j46230j09A27755g8544J1186F8151e2218B4115a37937F6182
$$ plain form
9108 -128263 -266465 15323 -70732 -190524 -111641 46713 18035 6977 140291 -75395 127154
9096 -107574 313649 5504 -76273 -290329 -16724 51436 -168117 61871 89939 -188257 -34072
9084 -286493 -107875 112593 -74062 -200384 191948 257331 28675 120398 -141505 -251691
9074 -251691 72870 53143 -170898 -169168 66510 -397234 -304778 -131959 -51690 116981 94819
9063 94819 -224716 20650 -397202 -162426 -78733 -154053 45156 194374 228900 -116471 -199675
9052 -199675 33984 247451 -169135 -249543 212546 -87035 -80218 501828 -112998 -316333 -359258
9041 -359258 130029 75515 29069 60021 119680 -147675 149398 -195954 -54403 -17348 -238893
9030 -238893 -73470 -15597 45786 1274 263183 145324 33284 -156174 -56060 143040 -115304
$$ packed form
9108a28263j38202A5323g0732j19792P8883D6713A8035F977J33314g5395A27154
9096a07574C13649E504g6273k14056a6724E1436a68117F1871K8068a88257c4072
9084b86493a07875A12593g4062j26322A91948O5383B8675R1723a41505j10186
9074b51691G2870j9727a70898J730F6510c97234R2456a31959e1690A16981k2162
9063I4819b24716B0650c97202a62426g8733p5320D5156J49218L4526a16471q3204
9052a99675C3984K13467a69135q0408B12546h7035O817E01828a12998k03335m2925
9041c59258A30029n4514B9069L0952N9659a47675A49398a95954e4403a7348k21545
9030b38893g3470a5597D5786A274K61909j17859C3284a56174e6060A43040a15304
$$ plain form
9018 165305 56324 141707 -292399 -193864 -235402 -58565 69141 -66588 -170356 -241062 112075
9006 -325261 -124671 55141 13969 -103310 -46111 -47245 -144546 26032 -21021 -62470 -84892
8995 -84892 -294007 -50365 -8792 -16415 -54552 234026 -293551 30496 -81224 175157 112520
8984 112520 42116 -263233 35276 -12476 -158095 -60323 93106 -131072 26490 -260809 -214249
8973 -214249 30995 9454 56456 -393438 -96200 -62883 131371 -304660 418179 -193566 107467
8961 -178781 -194505 -229296 -436107 -65449 36531 211460 -154340 -171804 -125123 -81036 -6278
8949 -276346 274167 -165483 -158959 -217311 -107362 -199047 96138 -190632 -103032 209680 214556
8938 214556 24477 111723 363910 563141 -8191 13764 31057 214191 56682 222639 -54141
$$ packed form
9018A65305E6324Q5383b92399R8535m1538e8565F9141f6588j03768p0706A12075
9006c25261a24671E5141A3969a03310d6111j134r7301B6032b1021m1449k2422
8995h4892k09115e0365h792p623l8137B34026b93551C0496h1224A75157o2637
8984A12520D2116b63233C5276a2476j45619f0323I3106a31072B6490b60809M6560
8973b14249C0995I454M7002c93438i6200L3317A31371c04660D18179a93566A07467
8961a78781j5724l4791k06811f5449C6531J74929a54340j7464M6681M4087f278
8949b76346B74167a65483O524n8352a07362r1685I6138a90632Q7600B09680M876
8938B14556B4477Q7246K52187J99231h191A3764J7293J83134E6682J65957e4141
$$ plain form
8926 280942 382829 1371782 1868299 5415898 21947445 10994360 3240118 747902 244641
8916 107207 -257529 137647 -69039 85371 -79577 -162432 42696 84224 446172 371971 -38635
8904 13944 -61326 -89629 12763 103950 -179381 -172829 -285063 -12136 149662 -494745 -248474
8893 -248474 -4420 45500 -128531 -218287 51673 -128076 66368 10383 57123 -78649 95056
8881 -157539 -166338 274153 -115943 196089 157379 25389 70726 145606 -448554 -87796 -5244
8869 -253010 -225792 -59328 -368728 -342135 25642 -97647 -153720 -11551 -48634 83197 35842
$$ packed form
8926B80942J01887R88953M96517L547599J6531547j0953085C240118G47902B44641
8916A07207b57529A37647f9039H5371g9577q2855D2696M1528L61948p4201c8635
8904A3944f1326k8303A2763R1187a79381O552j12234a2136A49662d94745K46271
8893b48474d420D5500a28531q9756E1673a28076F6368A0383M6740g8649I5056
8881a57539q799B74153a15943A96089l8710B5389M5337P4880d48554h7796e244
8869b53010K7218e9328l09400K6593B5642i7647n6073a1551l7083H3197C5842
$$ [...]
##END NTUPLES=NMR SPECTRUM
##END=
