
##TITLE=UV1223_M6_1234-1212_20_7231249_iH2Jjf6jFW
##JCAMPDX= 6.0         $$ Bruker NMR JCAMP-DX V2.0
##DATA TYPE= NMR SPECTRUM
##DATA CLASS= NTUPLES
##ORIGIN= BRUKER
##OWNER= Administrator
$$ 1.72 TOPSPIN		Version 2.1
$$ 2013-01-17 20:39:07.899 -0500  Administrator@X
$$ Compression mode = diff/dup
##.OBSERVE FREQUENCY= 400.02188249412
##.OBSERVE NUCLEUS= ^1H
##.ACQUISITION MODE= SIMULTANEOUS (DQD)
##.ACQUISITION SCHEME= undefined
##.AVERAGES= 64
##.DIGITISER RES= 22
##SPECTROMETER/DATA SYSTEM= spect
##.PULSE SEQUENCE= noesygpps1d.comp
##.SOLVENT NAME= COFFEE_meoh
##.SHIFT REFERENCE= INTERNAL, COFFEE_meoh, 1, 14.96076
##AUDIT TRAIL= $$ (NUMBER, WHEN, WHO, WHERE, PROCESS, VERSION, WHAT)
$$ ##TITLE= Audit trail, TOPSPIN		Version 2.1
$$ ##JCAMPDX= 5.01
$$ ##ORIGIN= Bruker BioSpin GmbH
$$ ##OWNER= Administrator
$$ $$ E:\/data/COFFEE/nmr/UV1223_M6_1234-1212_20_7231249_iH2Jjf6jFW/22/pdata/1/auditp.txt
$$ ##AUDIT TRAIL=  $$ (NUMBER, WHEN, WHO, WHERE, PROCESS, VERSION, WHAT)
(   1,<2013-01-17 20:39:02.211 -0500>,<Administrator>,<X>,<go>,<TOPSPIN 2.1>,
      <created by zg
	started at 2013-01-17 20:27:32.149 -0500,
	POWCHK enabled, PULCHK disabled,
       configuration hash MD5:
       86 BA 57 50 F2 9D 5C 9B 26 00 A9 28 5F 66 2E 89
       data hash MD5: 64K
       C0 0B 73 01 9B B5 C2 B9 7A 2D 0C 8D 2F F7 22 94>)
(   2,<2013-01-17 20:39:05.242 -0500>,<Administrator>,<X>,<proc1d>,<TOPSPIN 2.1>,
      <Start of raw data processing
       efp LB = 0.3 FT_mod = 6 PKNL = 1 PHC0 = 0 PHC1 = 0 SI = 128K 
       data hash MD5: 128K
       FF 33 BD B0 56 BC 7B 43 12 39 5D B4 4C E0 9A A4>)
(   3,<2013-01-17 20:39:06.258 -0500>,<Administrator>,<X>,<proc1d>,<TOPSPIN 2.1>,
      <pk PHC0 = -81.45813 PHC1 = 0 
       data hash MD5: 128K
       77 A4 FB 26 B5 1B BD 28 1D 53 76 61 10 EE 5E C1>)
(   4,<2013-01-17 20:39:06.883 -0500>,<Administrator>,<X>,<proc1d>,<TOPSPIN 2.1>,
      <abs ABSG = 1 
       data hash MD5: 128K
       9A 64 92 8E B6 57 5F 00 17 B7 A4 03 87 63 5B EF>)
(   5,<2013-01-17 20:39:07.055 -0500>,<Administrator>,<X>,<proc1d>,<TOPSPIN 2.1>,
      <abs ABSG = 2 
       data hash MD5: 128K
       43 47 FA 76 27 0B F3 51 78 1A F3 4F 76 9E 3A 90>)
(   6,<2013-01-17 20:39:07.227 -0500>,<Administrator>,<X>,<proc1d>,<TOPSPIN 2.1>,
      <abs ABSG = 3 
       data hash MD5: 128K
       E7 CD 94 F3 66 13 71 A8 E7 90 4C 0F 2D A8 A9 E5>)
(   7,<2013-01-17 20:39:07.399 -0500>,<Administrator>,<X>,<proc1d>,<TOPSPIN 2.1>,
      <abs ABSG = 4 
       data hash MD5: 128K
       22 98 18 4C AD 83 B8 CC C7 56 2E A3 46 FC 86 1C>)
(   8,<2013-01-17 20:39:07.555 -0500>,<Administrator>,<X>,<proc1d>,<TOPSPIN 2.1>,
      <abs ABSG = 5 
       data hash MD5: 128K
       4D B4 4C 25 8C AD 4C 58 61 8C 02 FD 21 09 24 F9>)
$$ ##END=
$$ 
$$ $$ hash MD5
$$ $$ AE 53 ED B8 38 53 A4 72 A5 4E 2C 39 B2 D0 C5 EC
##$RELAX= 
##$RELAX= 
##$RELAX= 
##$RELAX= 
##$RELAX= 
##$RELAX= 
##$RELAX= 
##$RELAX= 
$$ Bruker specific parameters
$$ --------------------------
##$DU= <E:\>
##$EXPNO= 22
$$ [...]
##$TP07= 0
##$TPNAME0= <>
##$TPNAME1= <>
##$TPNAME2= <>
##$TPNAME3= <>
##$TPNAME4= <>
##$TPNAME5= <>
##$TPNAME6= <>
##$TPNAME7= <>
##$TPOAL= (0..7)
0.5 0.5 0.5 0.5 0.5 0.5 0.5 0.5
##$TPOFFS= (0..7)
0 0 0 0 0 0 0 0
##$TUNHIN= 0
##$TUNHOUT= 0
##$TUNXOUT= 0
##$USERA1= <user>
##$USERA2= <user>
##$USERA3= <user>
##$USERA4= <user>
##$USERA5= <user>
##$V9= 5
##$VALIST= <valist>
##$VCLIST= <CCCCCCCCCCCCCCC>
##$VD= 0
##$VDLIST= <DDDDDDDDDDDDDDD>
##$VPLIST= <PPPPPPPPPPPPPPP>
##$VTLIST= <TTTTTTTTTTTTTTT>
##$WBST= 1024
##$WBSW= 4
##$XGAIN= (0..3)
0 0 0 0
##$XL= 0
##$YL= 0
##$YMAX_a= 6341611
##$YMIN_a= -13052453
##$ZGOPTNS= <>
##$ZL1= 120
##$ZL2= 120
##$ZL3= 120
##$ZL4= 120
##$ABSF1= 14.96076
##$ABSF2= -5.597422
##$ABSG= 5
##$ABSL= 3
##$ALPHA= 0
##$AQORDER= 0
##$ASSFAC= 0
##$ASSFACI= 0
##$ASSFACX= 0
##$ASSWID= 0
##$AUNMP= <proc_prof1d_extract.lims>
##$AXLEFT= 0
##$AXNAME= <>
##$AXNUC= <1H>
##$AXRIGHT= 0
##$AXTYPE= 0
##$AXUNIT= <>
##$AZFE= 0.1
##$AZFW= 0.1
##$BCFW= 0
##$BC_mod= 0
##$BYTORDP= 0
##$COROFFS= 0
##$CY= 15
##$DATMOD= 1
##$DC= 0
##$DFILT= <>
##$DTYPP= 0
##$F1P= 0
##$F2P= 0
##$FCOR= 0.5
##$FTSIZE= 131072
##$FT_mod= 6
##$GAMMA= 0
##$GB= 0
##$INTBC= 1
##$INTSCL= 1
##$ISEN= 128
##$LB= 0.3
##$LEV0= 0
##$LPBIN= 0
##$MAXI= 10000
##$MC2= 0
##$MEAN= 0
##$ME_mod= 0
##$MI= 0
##$NCOEF= 0
##$NC_proc= -2
##$NLEV= 6
##$NOISF1= 0
##$NOISF2= 0
##$NSP= 0
##$NTH_PI= 0
##$NZP= 0
##$OFFSET= 14.96076
##$PC= 1
##$PHC0= -81.45813
##$PHC1= 0
##$PH_mod= 1
##$PKNL= yes
##$PPARMOD= 0
##$PPDIAG= 0
##$PPIPTYP= 0
##$PPMPNUM= 2147483647
##$PPRESOL= 1
##$PSCAL= 4
##$PSIGN= 0
##$PYNMP= <proc.py>
##$REVERSE= no
##$SF= 400.020009732317
##$SI= 131072
##$SIGF1= 0
##$SIGF2= 0
##$SINO= 400
##$SIOLD= 131072
##$SPECTYP= <>
##$SREGLST= <1H.CDCl3>
##$SSB= 0
##$STSI= 131072
##$STSR= 0
##$SW_p= 8223.68421052631
##$SYMM= 0
##$S_DEV= 0
##$TDeff= 65536
##$TDoff= 0
##$TI= <>
##$TILT= no
##$TM1= 0
##$TM2= 0
##$TOPLEV= 0
##$USERP1= <user>
##$USERP2= <user>
##$USERP3= <user>
##$USERP4= <user>
##$USERP5= <user>
##$WDW= 1
##$XDIM= 131072
##$YMAX_p= 447574885
##$YMIN_p= -13663
##$CURPLOT= <Network HP LaserJet P1505>
##$CURPRIN= <$Network HP LaserJet P1505>
##$DFORMAT= <normdp>
##$LAYOUT= <+/1D_H.xwp>
##$LFORMAT= <normlp>
##$PFORMAT= <normpl>
##$SURQMSG= 1
$$ End of Bruker specific parameters
$$ ---------------------------------
##NTUPLES= NMR SPECTRUM
##VAR_NAME=  FREQUENCY,     SPECTRUM/REAL,   SPECTRUM/IMAG
##SYMBOL=    X,             R,               I
##VAR_TYPE=  INDEPENDENT,   DEPENDENT,       DEPENDENT
##VAR_FORM=  AFFN,          ASDF,            ASDF
##VAR_DIM=   131072,        131072,          131072
##UNITS=     HZ,            ARBITRARY UNITS, ARBITRARY UNITS
##FACTOR=    0.0627417313425164, 1,          1
##FIRST=     8223.62146879497, -667,         -66835
##LAST=      0,             1944,            -67256
##MIN=       0,             -13663,          0
##MAX=       8223.62146879497, 447574885,    0
$$ Real data points
##PAGE= N=1
##DATA TABLE= (X++(R..R)), XYDATA
$$ [...]
63879E86482q723o565m143j141K190N349Q237J1054J3678J5690J7120J8647K0826
63866F78701K3439K5841K7753K9379L0912L2229L3140L3681L3980L3888L2880
63855A015823L0587K7305K3762K0289J6521J2097P311K744j490n692j0009j4414
63843A124834j9077k4124k8939l2481l4490l5832l7312l8674l9190l8734l7755
63832G58226l6517l5008l3346l1697k9880k7642k5301k3521k2315k0840j8494
63821D53665j5840j4062j3641j3851j3517j2105j0102q455p645p288o659n592
63809C24908m610m169m067l842l468l278l305l191k823k567k616k550k006j504
63795B80912j927l238m348m456l888l381l099k824k572k359j764m28J124J883
$$ plain form
63879 586482 577759 571194 567051 565910 568100 573449 581686 592740 606418 622108 639228 657875 678701
63866 678701 702140 727981 755734 785113 816025 848254 881394 915075 949055 982943 1015823
63855 1015823 1046410 1073715 1097477 1117766 1134287 1146384 1153695 1156439 1154949 1149257 1139248 1124834
63843 1124834 1105757 1081633 1052694 1020213 985723 949891 912579 873905 834715 795981 758226
63832 758226 721709 686701 653355 621658 591778 564136 538835 515314 492999 472159 453665
63821 453665 437825 423763 410122 396271 382754 370649 360547 352092 344447 337159 330500 324908
63809 324908 320298 316129 312062 308220 304752 301474 298169 294978 292155 289588 286972 284422 282416 280912
63795 280912 278985 275747 271399 266943 263055 259674 256575 253751 251179 248820 247056 246628 247752 249635
63781B49635J531O19l52j316k061k153j666j277j209q54P1O77J5j397k028j273
63765B36962j17K23k80p49o32k55k35o26q85o12j80k64q69j199o67L45J034J184
63747B32178J191J335J437J302J133J354K131L061L439K974K305K407L403M339
63733B63989M380L763L180K683J951J311J638L064M503M831M118L366L300L813
63719C09890M401M670M414L552K266J068M21J64l31j300k143k259k007k252l008
63704C17546l329k767k128k281k875k869j893m23J026K140K578K286J942K290
63690C11243L135L624L485L242L189K931K158J159L57j31k43J18O77P81J81n60
63674C35346o87M0J298K481K902K275J182N96P39R24O71L23K93L15j03r38j931
$$ plain form
63781 249635 251166 251785 251433 250117 248056 245903 244237 242960 241751 240897 240968 241645 241660 240263 238235 236962
63765 236962 236845 237068 236788 236039 235407 235152 234917 234291 233406 232794 232614 232350 231481 230282 229615 229960 230994 232178
63747 232178 233369 234704 236141 237443 238576 239930 242061 245122 248561 251535 253840 256247 259650 263989
63733 263989 268369 272132 275312 277995 279946 281257 282895 285959 290462 295293 299411 302777 306077 309890
63719 309890 314291 318961 323375 326927 329193 330261 330682 330846 330515 329215 327072 324813 322806 320554 317546
63704 317546 314217 311450 309322 307041 304166 301297 299404 298981 300007 302147 304725 307011 308953 311243
63690 311243 314378 318002 321487 324729 327918 330849 333007 334166 334523 334392 334149 334267 334944 335725 335906 335346
63674 335346 334659 334699 335997 338478 341380 343655 344837 345433 346172 347096 347767 348090 348383 348698 348595 347657 345726
63657C45726l056m260n117n367n398n633n732n025l590k238j480j127q30m77j2
63642B96384O27J261J594J709K046K715L225L082K436J953K164L138M551N929
63628C32814O895P382P646Q000Q529R060R426R706J0214J1188J2559J4154J5951
63615D63524J7987K0057K1872K3491K5328K7592L0100L2728L5579L8315L9806
63604G76379L9006L6007L1657K6233J9198J0532J698n182r031j0449j0759j0733
63592H94556j0297r270q209q364j0708j4947j9580k3022k4777k5516k6066k6451
63580F87349k6101k4829k3211k1732j9980j7222j3633j0280p752n507k913l51
63568E13838J348K198L058M393N719O458O797P350Q296R185R559R497R497J0005
$$ plain form
63657 345726 342670 338410 333293 327926 322528 316895 311163 306138 302548 300310 298830 297703 296873 296396 296384
63642 296384 297011 298272 299866 301575 303621 306336 309561 312643 315079 317032 319196 322334 326885 332814
63628 332814 339709 347091 354737 362737 371266 380326 389752 399458 409672 420860 433419 447573 463524
63615 463524 481511 501568 523440 546931 572259 599851 629951 662679 698258 736573 776379
63604 776379 815385 851392 883049 909282 928480 939012 940710 935528 926497 916048 905289 894556
63592 894556 884259 874989 866780 858416 847708 832761 813181 790159 765382 739866 713800 687349
63580 687349 661248 636419 613208 591476 571496 554274 540641 530361 522609 517102 514189 513838
63568 513838 515186 517384 520442 524835 530554 537012 543809 551159 559455 568640 578199 587696 597193 607198
63554F07198J1188J3106J5824J9180K2675K5968K9442L3901L9655M6254N2870
63543I17261N8124N9339N3257L8938J9776J555j1738j9777k4007k5241k3583j9637
63531A024267j4847j0765q464q407j0400j3847j8301k3545k8936l3205l5452l6033
63519G82065l5936l5514l4404l2507l0247k7876k5196k2253j9637j7756j6249
63508D84490j4559j2778j1440j0749j0340r713q525o700m651l247l075l731m251
63495C80731m173l782l328k647j721r82o72l84K57Q83R75Q80J477K819L890L942
63479C78165L469L437M027M615M736M490M045L271K062P07m11j366k647m456o256
63464C97888p208p005o063m880l651k530j900j888j952j436m16N19J244K215L565
$$ plain form
63554 607198 618386 631492 647316 666496 689171 715139 744581 778482 818137 864391 917261
63543 917261 975385 1034724 1087981 1126919 1146695 1148250 1136512 1116735 1092728 1067487 1043904 1024267
63531 1024267 1009420 998655 990191 981784 971384 957537 939236 915691 886755 853550 818098 782065
63519 782065 746129 710615 676211 643704 613457 585581 560385 538132 518495 500739 484490
63508 484490 469931 457153 445713 434964 424624 414911 406386 399686 395035 391788 388713 384982 380731
63495 380731 376558 372776 369448 366801 365080 364098 363426 363042 363299 364182 365157 366037 367514 370333 374223 378165
63479 378165 381634 385071 389098 393713 398449 402939 406984 410255 412317 413024 412613 411247 408600 404144 397888
63464 397888 390680 383675 377612 372732 369081 366551 364651 362763 360811 359375 358959 359478 360722 362937 366502
63449C66502M722N273N620O384P535Q571R226R608R886J0346J1468J3489J6032
63436D84662J8732K2089K7103L3873M0904M5857M6769M2754L4339K3509J3040
63425H33631N106L51j808k091o34K928Q792J6326K4100L0800L6129M0516M3821
63412A037967M4678M1477L3976K3710J2925L239m768j1022j5275j7079j6353j3961
63400A119514j1519j0533j1644j4670j9147k4596l0297l5185l8320l9547l9503
63389H44553l8762l7210l4449l0707k6981k4109k1951j9749j7061j4127j1357
63378E68090q858o548m474k789j473k19J339L318N487P524R350J1193J3220J5276
63364F10436J7102J8806K0882K3672K6897K9895L2316L4432L6752L9423M2051
$$ plain form
63449 366502 371224 376497 382117 388501 396036 404607 413833 423441 433327 443673 455141 468630 484662
63436 484662 503394 525483 552586 586459 627363 673220 719989 762743 797082 820591 833631
63425 833631 838737 839088 837280 835189 834555 837483 846275 862601 886701 917501 953630 994146 1037967
63412 1037967 1082645 1124122 1158098 1181808 1194733 1197972 1193204 1182182 1166907 1149828 1133475 1119514
63400 1119514 1107995 1097462 1085818 1071148 1052001 1027405 997108 961923 923603 884056 844553
63389 844553 805791 768581 734132 703425 676444 652335 630384 610635 593574 579447 568090
63378 568090 559232 552684 548210 545421 543948 543729 545068 548386 553873 561397 570747 581940 595160 610436
63364 610436 627538 646344 667226 690898 717795 747690 780006 814438 851190 890613 932664
63353I32664M3937M4297M2398L7848L0948K2602J3773N089k942r589j4054j5942
63341A131029j5563j3935j2549j2599j4139j6265j8573k1959k7250l3331l7670
63330I07196l8860l7790l6058l4173l1800k8837k5332k0973j5602r893m614M19
63318F23683N489R114Q368J809q472j8327k4780k7425k7335k5480k2454j9038
63306D75152j6233j4536j3400j1842r591p302n615m436l449k883l156l995m523
63293C74191m316l827l678l952m327m511m357l806k965k114j488j171j151j290
63279C31238j260q27j88K03K21J44J50N4k86n67l31M70J346J669J241N34K67O43
63261C34721J077R88O49Q69J850K843L070K641K278K438K993L607M137M652N212
$$ plain form
63353 932664 976601 1020898 1063296 1101144 1132092 1154694 1168467 1173556 1170614 1161025 1146971 1131029
63341 1131029 1115466 1101531 1088982 1076383 1062244 1045979 1027406 1005447 978197 944866 907196
63330 907196 868336 830546 794488 760315 728515 699678 674346 653373 637771 627878 623264 623683
63318 623683 629172 638286 646654 648463 639991 621664 596884 569459 542124 516644 494190 475152
63306 475152 458919 444383 430983 419141 409550 402248 396633 392197 388748 385865 382709 378714 374191
63293 374191 369875 366048 362370 358418 354091 349580 345223 341417 338452 336338 334850 333679 332528 331238
63279 331238 329978 329151 328963 329166 329387 329531 329681 329735 329449 328882 328551 329021 330367 332036 333277 333811 334078 334721
63261 334721 335798 336786 337435 338304 340154 342997 346067 348708 350986 353424 356417 360024 364161 368813 374025
63246C74025N700N870N633N282N331O059P280Q504R354R906J0714J2279J4492
63233D80429J6654J8171J8976J9275J9293J9401J9998K0902K1275K0649J9546
63222F94569J8695J8016J7172J6621J7156J8565J9730K0075J9985J9696J8680
63211H98960J6488J3297R314M457r95o139j0385j4049j7539k0651k3101k5053
63199H24604k6544k6950k5730k3279k0421j7445j4223j0885p674m518j370J351
63187F46916L295M897O858R158J1234J2948J4604J6157J7200J7735J8255J8893
63175G98150J9135J8602J7635J6855J6510J6411J6224J5628J4441J2679J0362
63164I72632P374L692l97m625r117j4043j9037k3429k6950k9771l1827l2693l2222
$$ plain form
63246 374025 379725 385595 391228 396510 401841 407900 415180 423684 433038 442944 453658 465937 480429
63233 480429 497083 515254 534230 553505 572798 592199 612197 633099 654374 675023 694569
63222 694569 713264 731280 748452 765073 782229 800794 820524 840599 860584 880280 898960
63211 898960 915448 928745 938059 942516 941521 935382 924997 910948 893409 872758 849657 824604
63199 824604 798060 771110 745380 722101 701680 684235 670012 659127 651453 646935 645565 646916
63187 646916 650211 655108 661966 671124 682358 695306 709910 726067 743267 761002 779257 798150
63175 798150 817285 835887 853522 870377 886887 903298 919522 935150 949591 962270 972632
63164 972632 980006 983698 983301 978676 969559 955516 936479 913050 886100 856329 824502 791809 759587
63151G59587l0858k9137k7218k5091k2898k0787j8684j6493j4326j2410j0797
63140E30888r341p892o507n440m944m963n075m730l607j848n9J044J327J451K062
63125D82366K858L052K710K855L950N084N217M538L958L850M070M674N647O285
63111E41114N853M683L755L310K809K131J809K005K208K104J914J718J285O96
63097E77394L23N8m77r45n75L60O00j14m49L82J184O05p03j059k30N83P96J005
63079E78738J503J685J244Q96J334K234K838L025L330M143N246O105O456O648
63065F25425P361Q893J0806J2479J3792J5034J6408J7965J9841K2160K4850K7858
63053H22872L1240L4762L7740L9855M1758M4193M6771M8384M8752M8707M8847
$$ plain form
63151 759587 728729 699592 672374 647283 624385 603598 584914 568421 554095 541685 530888
63140 530888 521547 513655 507148 501708 496764 491801 486726 481996 478389 476541 476482 477526 478853 480304 482366
63125 482366 485224 488276 490986 493841 497791 502875 508092 512630 516588 520438 524508 529182 534829 541114
63111 541114 546967 551650 555405 558715 561524 563655 565464 567469 569677 571781 573695 575413 576698 577394
63097 577394 577717 577775 577298 576353 575778 576138 576738 576624 576175 576557 577741 578346 577643 576584 576354 576937 577733 578738
63079 578738 580241 581926 583170 584066 585400 587634 590472 593497 596827 600970 606216 612321 618777 625425
63065 625425 632786 641679 652485 664964 678756 693790 710198 728163 748004 770164 795014 822872
63053 822872 854112 888874 926614 966469 1008227 1052420 1099191 1147575 1196327 1245034 1293881
63042A293881M8789M8017M6803M5789M5225M5011M5105M5444M5766M5796M5367
63031A800993M4139M1506L7071L0963K3512J4932N406m837j5752k7278l8668m8503
63019A863484n5800o0711o3758o4874o3808o1082n7692n3899m9055m2731l5442
63008A254632k8090k1154j4688q641k922K619Q002J3107J7909K2439K6393K9152
62996A298758L0466L0902L1224L1653L1980L2234L2655L3083L2956L2087L1009
62985A649007L0138K8914K6180K1329J4744P146j021r542j8192k6869l5612m4128
62973A642094n1460n6567n9257o0211o0079n8872n6419n3041m9447m6112m3027
62962A047602l9947l6728l3386l0135k7346k5300k3845k2482k0882j9268j8142
$$ plain form
63042 1293881 1342670 1390687 1437490 1483279 1528504 1573515 1618620 1664064 1709830 1755626 1800993
63031 1800993 1845132 1886638 1923709 1954672 1978184 1993116 1998522 1993685 1977933 1950655 1911987 1863484
63019 1863484 1807684 1746973 1683215 1618341 1554533 1493451 1435759 1381860 1332805 1290074 1254632
63008 1254632 1226542 1205388 1190700 1182059 1179137 1181756 1189758 1202865 1220774 1243213 1269606 1298758
62996 1298758 1329224 1360126 1391350 1423003 1454983 1487217 1519872 1552955 1585911 1617998 1649007
62985 1649007 1679145 1708059 1734239 1755568 1770312 1777458 1776437 1766895 1748703 1721834 1686222 1642094
62973 1642094 1590634 1534067 1474810 1414599 1354520 1295648 1239229 1186188 1136741 1090629 1047602
62962 1047602 1007655 970927 937541 907406 880060 854760 830915 808433 787551 768283 750141
62951G50141j7627j7314j6787j6177j5930j6006j5715j4588j3138j2344j2362
62940E82153j2266j1237r579q236p615p316o874o274n640m911l994l085k508k355
62926D90263k384k315k080j848j766j770j733j778k229l099l777l526k268o86
62912D59004M59R03P66J92p40j840k728k969k416j448o78k61K98J397K598L083
62896D55620K760K364K393K468J987R86M4l83k81mm8n93j118q77N0O56K81n18
62878D65787p84m13j3R9K1k89r34j532j483q35k71k31o19j329k295k999k777j915
62860D47188j552k054k260j046R54K051J611O59M18R70J589J734J404Q09J61j89
62844D52447J41J030J592R27o91j797j351L6R45Q96N19K60o8m01j61O59J134O56
$$ plain form
62951 750141 732514 715200 698413 682236 666306 650300 634585 619997 606859 594515 582153
62940 582153 569887 558650 549071 540835 533220 525904 519030 512756 507116 502205 498211 495126 492618 490263
62926 490263 487879 485564 483484 481636 479870 478100 476367 474589 472360 469261 465484 461958 459690 459004
62912 459004 459463 460366 461132 461324 460584 458744 456016 453047 450631 449183 448505 448244 448542 449939 452537 455620
62896 455620 458380 460744 463137 465605 467592 468578 468622 468239 467958 467954 467906 467313 466195 465318 465368 466024 466305 465787
62878 465787 465003 464590 464577 464676 464697 464408 463474 461942 460459 459624 459353 459122 458503 457174 454879 451880 449103 447188
62860 447188 445636 443582 441322 440276 441230 443281 444892 445551 445969 446939 448528 450262 451666 452475 452636 452447
62844 452447 452588 453618 455210 456137 455446 453649 452298 452334 453279 454175 454694 454954 454886 454485 454324 454983 456117 456773
62826D56773j24k95Q9M59P47J203J714K110K624L325L592L075K593L033L773L497
62810D88188K261J384J392J549J591K358M109N672O073N855N934O245O479P162
62796E46252Q730J0272J0599J0080J0214J1499J3093J4503J6347J9145K2436K5651
62784G18821K8989L2890L7289M1911M6897N2515N8546O4389O9594P3952P7185
62773A302978P8937P8999P7384P4149O9303O2819N4653M4775L3279K0412O570
62762A904258p636k1430l4162m5532n5340o3152o8570p1729p3247p3599p2936
62751A316925p1446o9422o6845o3323n8768n3727m8828m4238l9939l6106l2801
62740G31482k9620k6268k3158k0850j9012j6702j3756j1153r694q927p864o328
$$ plain form
62826 456773 456649 456354 456443 456902 457649 458852 460566 462676 465300 468625 472217 475292 477885 480918 484691 488188
62810 488188 490449 491833 493225 494774 496365 498723 502832 508504 514577 520432 526366 532611 539090 546252
62796 546252 554982 565254 575853 585933 596147 607646 620739 635242 651589 670734 693170 718821
62784 718821 747810 780700 817989 859900 906797 959312 1017858 1082247 1151841 1225793 1302978
62773 1302978 1381915 1460914 1538298 1612447 1681750 1744569 1799222 1843997 1877276 1897688 1904258
62762 1904258 1896622 1875192 1841030 1795498 1740158 1677006 1608436 1536707 1463460 1389861 1316925
62751 1316925 1245479 1176057 1109212 1045889 987121 933394 884566 840328 800389 764283 731482
62740 731482 701862 675594 652436 631586 612574 595872 582116 570963 561269 552342 544478 538150
62728E38150m988m266l808l062j965q95k24n7j44M8J011K785M913O857Q375R525
62712E52255J0506J1550J2836J4363J5973J7626J9615K2355K5945L0036L4141
62701G67201L8067M1898M5644M9048N1939N4637N7768O1600O5757O9548P2313
62690A375420P3368P1987O7837O1228N2645M2218L0036J6715L111j0483k4157
62679A759925l7303m8454n6672o2587o7428p1307p3197p2542p0205o7496o4744
62668A067990o1320n6813n1740m6927m2617l8523l4553l1049k8168k5413k2212
62657F28655j8792j6046j4452j3461j2195j0466q937q340q715r360r452q772p785
62644D81882o981o332n502m412l293k293j393n81J78J052J941K183J272j76r27
$$ plain form
62728 538150 533162 528896 525088 522026 520061 519166 518942 518885 518741 518789 519800 522585 527498 534355 542730 552255
62712 552255 562761 574311 587147 601510 617483 635109 654724 677079 703024 733060 767201
62701 767201 805268 847166 892810 941858 993797 1048434 1106202 1167802 1233559 1303107 1375420
62690 1375420 1448788 1520775 1588612 1649840 1702485 1744703 1774739 1791454 1794565 1784082 1759925
62679 1759925 1722622 1674168 1617496 1554909 1487481 1416174 1342977 1270435 1200230 1132734 1067990
62668 1067990 1006670 949857 898117 851190 808573 770050 735497 704448 676280 650867 628655
62657 628655 609863 593817 579365 565904 553709 543243 534306 525966 517251 507891 498439 489667 481882
62644 481882 474901 468569 463067 458655 455362 453069 451676 451095 451273 452325 454266 456449 457721 457545 456618
62629D56618o96m25q19j437j594j385j267j297j364j555j694j199J1J081J456
62614D44434J835L016M445N047M975N246N927O053N421N043N581O436O952P486
62600E17897Q816J1140J4126J7392K0585K3473K6252K9245L2272L4841L6941L8838
62588H11818M0072L9638L7405L4321L0932K6589K0638J3498N987j589r042j5805
62576A034462k1514k6456l0756l3810l5204l5577l5731l5420l3880l1209k8373
62565F86532k6082k4345k2901k1513j9909j8043j6190j4440j2480j0276q490p665
62553D84198p434p096o491n780m878l820l147l102k908j746j03Q74J054J297J916
62538D42834K273J956J364R15N43J93N6J13J26K47R95K439M058N528P014Q539
$$ plain form
62629 456618 455922 455497 454678 453241 451647 450262 448995 447698 446334 444779 443085 441886 441897 442978 444434
62614 444434 446269 449285 453730 458777 463752 468998 474925 480978 486399 491442 497023 503459 510411 517897
62600 517897 526713 537853 551979 569371 589956 613429 639681 668926 701198 736039 772980 811818
62588 811818 851890 891528 928933 963254 994186 1020775 1041413 1054911 1060898 1059309 1050267 1034462
62576 1034462 1012948 986492 955736 921926 886722 851145 815414 779994 746114 714905 686532
62565 686532 660450 636105 613204 591691 571782 553739 537549 523109 510629 500353 491863 484198
62553 484198 476764 469668 463177 457397 452519 448699 445552 442450 439542 437796 437693 438567 439621 440918 442834
62538 442834 445107 447063 448427 449342 449885 450078 450134 450247 450373 450620 451615 454054 458112 463640 470654 479193
62522D79193R771J0696J1879J3717J5940J8166K0467K3030K5754K8533L1589L5151
62510G23886L8894M1968M3544M3383M1998M0120L7850L4542K9792K4138J8258
62499A118373J1924M603l155r878j4839j8614k1751k3713k3595k1323j7637j3349
62487I67046q971m763p01L443P890J2758J8009K3193K7488L0502L2676L4188L3707
62474A176465K9418K1447J2328M684q83n594j1135j8796k8709l9094m7075n1033
62462A042023n1857n1452n0737m9580m7824m5449m2190l7910l3143k8626k4518
62451E78737k0619j6979j3835j1201q994p270n912m556l136k003j094K71K159
62438D85568L473L448K905L024L504L221K161J308Q94J90j026k204l346n128p318
$$ plain form
62522 479193 488964 499660 511539 525256 541196 559362 579829 602859 628613 657146 688735 723886
62510 723886 762780 804748 848292 891675 933673 973793 1011643 1046185 1075977 1100115 1118373
62499 1118373 1130297 1134900 1131745 1121867 1107028 1088414 1066663 1042950 1019355 998032 980395 967046
62487 967046 958075 953312 952611 956054 963944 976702 994711 1017904 1045392 1075894 1108570 1142758 1176465
62474 1176465 1205883 1227330 1239658 1244342 1243459 1237865 1226730 1207934 1179225 1140131 1093056 1042023
62462 1042023 990166 938714 887977 838397 790573 745124 702934 665024 631881 603255 578737
62451 578737 558118 541139 527304 516103 507109 499839 493927 489371 486235 484232 483138 483409 485568
62438 485568 489041 492489 495394 498418 501922 505143 507304 508612 509506 509696 508670 506466 503120 497992 490674
62423D90674q497p947o683n935n661n314m977m832m365l248k369k779l937m200
62409D19930k977j348m69k87j24K29M70L74L5l07m28k82m7J69N92J491K653L506
62391D23180L821L880L917L739L139K375J955K150K847L738M497M953N260N767
62377D75218O600P528Q320Q958R428R623R733J0337J1715J3273J4260J4879J6129
62364F16001J8482K1385K4239K7267L0995L5420M0184M5274N0846N6560O1600
62353A028253O5391O7813O8635O7122O2458N4356M3405L1047J9127Q948N37o979
62341A510113j4299k1507k8479l5116m1000m5441m8156m9601n0245m9867m7974
62330A078428m4666m0676l6697l2940k9386k6100k3263k1041j9489j8618j8514
$$ plain form
62423 490674 482177 474230 467547 461612 455951 450637 445660 440828 436463 433215 430846 428067 424130 419930
62409 419930 416953 415605 415136 414849 414725 414954 415424 415798 415833 415526 415098 414816 414769 414938 415530 417021 419674 423180
62391 423180 427001 430881 434798 438537 441676 444051 446006 448156 451003 454741 459238 464191 469451 475218
62377 475218 481818 489346 497666 506624 516052 525675 535408 545745 557460 570733 584993 599872 616001
62364 616001 634483 655868 680107 707374 738369 773789 813973 859247 910093 966653 1028253
62353 1028253 1093644 1161457 1230092 1297214 1359672 1414028 1457433 1488480 1507607 1516555 1517092 1510113
62341 1510113 1495814 1474307 1445828 1410712 1369712 1324271 1276115 1226514 1176269 1126402 1078428
62330 1078428 1033762 993086 956389 923449 894063 867963 844700 823659 804170 785552 767038
62319G67038j9233k0430k1267k1085k0132j9162j8358j7218j5620j4246j3506
62308E66781j2792j1381r568q114o947n378l444k070j701j690j369r76r62r80
62294D99409l16R40J865J913J630J916K968M187M970N215N036M406L318K140J434
62279E41031J399J814K537L666N039O039O228N892N680N972O858Q362J0188J1669
62265F22374J2564J3707J6108J9691K3602K7635L2391L7987M3707M9200N4982
62254I53948O1118O6391O9637P1056P1147O8992O2926N2872M0772K8576J6882
62243A564317N761m288j2956k0886k8913l6972m4420n1076n7139o2208o5209o5454
62231A120557o3230n9256n4114m8401m2888l8078l3815k9632k5356k1118j7042
$$ plain form
62319 767038 747805 727375 706108 685023 664891 645729 627371 610153 594533 580287 566781
62308 566781 553989 542608 533040 524926 517979 512601 509157 507087 505386 503696 502327 501351 500389 499409
62294 499409 499093 500033 501898 503811 505441 507357 510325 514512 519482 524697 529733 534139 537457 539597 541031
62279 541031 542430 544244 546781 550447 555486 561525 567753 573645 579325 585297 592155 600517 610705 622374
62265 622374 634938 648645 664753 684444 708046 735681 768072 806059 849766 898966 953948
62254 953948 1015066 1081457 1151094 1222150 1293297 1362289 1425215 1478087 1518859 1547435 1564317
62243 1564317 1570078 1565790 1552834 1531948 1503035 1466063 1421643 1370567 1313428 1251220 1186011 1120557
62231 1120557 1057327 998071 943957 895556 852668 814590 780775 751143 725787 704669 687627
62220F87627j3203r793o963m579k500r82m06m42n3J319K926L573L151K713K904
62205F65292L052K271R49L74R63J549Q25j104k923l593l114k097j070l20R3L63
62189F61510Q18J647K770L958M948N564N938O501P410Q112P827O509N001M165
62175G32678M282N220O614P848Q504R201J1356J5670K1323K7124L2845L8739M4311
62162I65715M8509N0960N2063N1766M9186M3682L5755K6580J7223Q423O30o165
62150A344327j2295j7970k3249k8362l3513l8263m1732m3569m4115m3494m1321
62139I76444l7664l3535k9838k6473k3034j9747j6987j4422j1545q780p056o355
62127G41008n593m040k131p02k6J52L09J126L179O127Q709J0086J0930J2609J5242
$$ plain form
62220 687627 674424 664631 657668 653089 650589 649607 649201 648759 648706 650025 652951 656524 659675 662388 665292
62205 665292 668344 670615 671564 671938 672901 674450 675275 674171 671248 667655 664541 662444 661374 661054 661147 661510
62189 661510 662328 663975 666745 670703 675651 681215 687153 693654 701064 709176 717003 723512 728513 732678
62175 732678 736960 742180 748794 756642 765146 774347 785703 801373 822696 849820 882665 921404 965715
62162 965715 1014224 1065184 1117247 1169013 1218199 1261881 1297636 1324216 1341439 1349862 1350492 1344327
62150 1344327 1332032 1314062 1290813 1262451 1228938 1190675 1148943 1105374 1061259 1017765 976444
62139 976444 938780 905245 875407 848934 825900 806153 789166 774744 763199 754419 747363 741008
62127 741008 735415 731375 729244 728542 728516 728668 728977 730103 733282 739409 748118 758204 769134 781743 796985
62112G96985J7042J5901J1426N304k18l916n755o008m764k395p3O12j250n103
62098H17788r112j1283j0806q504n866l663j711K69K114L649M965O039O605O833
62084G97317P552R229J1138J2208J2476J2953J4237J5998J7843J9893K2255K4472
62072I77571K5884K6341K6309K6435K7032K7835K8353K8607K9335L1107L3422
62061A288231L5123L5598L5001L3355L0098K4777J7781J0116K755l654q876j3184
62049A487121j7247k1703k6834l2437l7853m2255m5258m7166m8323m8511m7448
62038A072086m5646m4000m2641m0918l8587l6166l3881l1171k7653k3868k0504
62027F87051j7582j4919j2894j1916j1614j1272j0781j0507j0470j0370j0249
$$ plain form
62112 796985 814027 829928 841354 846658 846440 842524 836769 830761 825997 823602 823529 824141 822891 817788
62098 817788 808676 797393 786587 778083 772217 768554 766843 767112 769226 772875 777840 783879 790484 797317
62084 797317 804869 814098 825236 837444 849920 862873 877110 893108 910951 930844 953099 977571
62072 977571 1003455 1029796 1056105 1082540 1109572 1137407 1165760 1194367 1223702 1254809 1288231
62061 1288231 1323354 1358952 1393953 1427308 1457406 1482183 1499964 1510080 1512835 1509181 1500305 1487121
62049 1487121 1469874 1448171 1421337 1388900 1351047 1308792 1263534 1216368 1168045 1119534 1072086
62038 1072086 1026440 982440 939799 898881 860294 824128 790247 759076 731423 707555 687051
62027 687051 669469 654550 641656 629740 618126 606854 596073 585566 575096 564726 554477
62016E54477j0383j0558j0190r201q153p318o307m824l284k275j756j079L57K587
62002D82093M993O560O598N421M109L496L508L613L527L249K762K022J134J95
61988E33280r12k326l856n085n785o012n910n597n167m588l635k297j182j109
61974D79819k080l080l092k134r89k03K42M04J21o08j307j429q95j45L17L22J44
61957D65407K33P46J360J654J671J863K486L350M136M693N018N306O114P960J0479
61942E22476J2524J3508J4188J5694J8061K0370K1966K2856K3060K2423K1178
61931G28304J9992J9168J8344J7195J5874J4487J2642R901O299K179k053n745
61919H56587q200r511j0674j2190j3061j1946r040n830l066l9L864P955J1221
$$ plain form
62016 554477 544094 533536 523346 514145 505992 498674 492367 487543 484259 481984 480228 479149 479506 482093
62002 482093 487086 493646 500244 505665 509774 513270 516778 520391 523918 527167 529929 531951 533085 533280
61988 533280 532368 530042 526186 521101 515316 509304 503394 497797 492630 488042 484407 482110 480928 479819
61974 479819 477739 474659 471567 469433 468444 468241 468483 468887 469008 468400 467093 465664 464769 464624 464941 465263 465407
61957 465407 465640 466386 467746 469400 471071 472934 475420 478770 482906 487599 492617 497923 504037 511997 522476
61942 522476 535000 548508 562696 578390 596451 616821 638787 661643 684703 707126 728304
61931 728304 748296 767464 785808 803003 818877 833364 846006 855907 862206 864385 862332 856587
61919 856587 848387 838876 828202 816012 802951 791005 781965 776135 773069 773030 776894 784849 796070
61906G96070J3689J5884J7429J7316J5458J2925J0361P126K583k568p019j0442
61894H88812j3470j6338j8498j9680k0384k0971k0929j9662j7498j5433j4102
61883F91847j3454j3138j2755j1938j0711r641r236r329r401r314r230q977q071
61870E56652o344m144j886R3J429K031K530L765N688P374Q272Q990J0462J2856
61856F07768J5571J7960J9804K1426K3583K6817L0688L3992L6060L7375L8623
61845I09667L9556L9395L7943L5611L2468K7966K1789J4535P256N80n487j1012
61833A150267j5591j8422j8927j7227j3940r625m594Q05O092J0911J5007J7817
61821A102573J8521J6797J3266Q770L459k959j0207j7265k3280k8244l2524l5997
$$ plain form
61906 796070 809759 825643 843072 860388 875846 888771 899132 906258 908841 906273 899254 888812
61894 888812 875342 859004 840506 820826 800442 779471 758542 738880 721382 705949 691847
61883 691847 678393 665255 652500 640562 629851 620210 610974 601645 592244 582930 573700 564723 556652
61870 556652 550308 546164 544278 544371 545800 547831 550361 554126 559814 567188 575460 584450 594912 607768
61856 607768 623339 641299 661103 682529 706112 732929 763617 797609 833669 871044 909667
61845 909667 949223 988618 1026561 1062172 1094640 1122606 1144395 1158930 1166186 1166766 1161279 1150267
61833 1150267 1134676 1116254 1097327 1080100 1066160 1056535 1051941 1052746 1058838 1069749 1084756 1102573
61821 1102573 1121094 1137891 1151157 1159927 1163386 1160427 1150220 1132955 1109675 1081431 1048907 1012910
61809A012910l8081l8491l7711l6440l4828l2548k9617k6688k4272k2055j9470
61798F72709j6748j4679j3364j1962j0020q302p675p671p032n503m185l932m193
61785E57443l882k931k258k405k841k729j922r39k92k39q84k012k886k794j883
61770E26546j012o54n13l90o08j101r48L59J706J617L38m33J47J297K196K994
61754E31541L787L868K848J532Q78P37M75J14OJ2j60l16l23p53j945k894k314
61737E37093n52O67M51m54j040j150r50l73M28R10Q98R29J437K171K695K914K827
61720E48901K347J701J436J667J881J828J940K398K480J484j45j344j799k051
61706E62724k501l055l615m160m327l644k441j849k468l490l597k542j369j153
$$ plain form
61809 1012910 974829 936338 898627 862187 827359 794811 765194 738506 714234 692179 672709
61798 672709 655961 641282 627918 615956 605936 597634 589959 582288 575256 569753 565568 561636 557443
61785 557443 553561 550630 548372 545967 543126 540397 538475 537536 537244 537005 536121 534109 531223 528429 526546
61770 526546 525534 524880 524367 523977 523369 522268 521320 521679 523385 525002 525340 524907 525054 526351 528547 531541
61754 531541 535328 539196 542044 543576 544454 545191 545666 545780 545786 545798 545638 545322 544999 544246 542301 539407 537093
61737 537093 536541 537208 537659 537205 536165 535015 534065 533692 534120 535030 535928 536857 538294 540465 543160 546074 548901
61720 548901 551248 552949 554385 556052 557933 559761 561701 564099 566579 568063 567918 566574 564775 562724
61706 562724 560223 557168 553553 549393 545066 541422 538981 537132 534664 531174 527577 525035 523666 522513
61692E22513j888k714k884k406j837j686j969k249k148j859k012k913l956m131
61678D87861l183j962j478j796k200k186j861j500j127p38n51p85j363j979k338
61663D62814k286j928j639j794k282k493k010j107l47J39O40J225J520J272Q20
61648D52544P42J188J854K535L345M301M996M973M279L444K915K702K509J984
61634D94311R22n39j885k718l266m059n052n533n064m129l495l248k930k371j881
61619D49063j694j631j441j152r73j063j413j849k204k592l340m433n275n340
61605D14663m909m742n096n503n502n110m500l707k886k441k603l089l429l457
61591C57689l309l103k918k841k886k851k502j843j127o11l95m17n33o87r09j174
$$ plain form
61692 522513 520625 517911 515027 512621 510784 509098 507129 504880 502732 500873 498861 495948 491992 487861
61678 487861 484678 482716 481238 479442 477242 475056 473195 471695 470568 469830 469279 468494 467131 465152 462814
61663 462814 460528 458600 456961 455167 452885 450392 448382 447275 446928 447067 447707 448932 450452 451724 452544
61648 452544 453286 454474 456328 458863 462208 466509 471505 476478 480757 484201 487116 489818 492327 494311
61634 494311 495233 494694 492809 490091 486825 482766 477714 472181 467117 462988 459493 456245 453315 450944 449063
61619 449063 447369 445738 444297 443145 442172 441109 439696 437847 435643 433051 429711 425278 420003 414663
61605 414663 409754 405012 399916 394413 388911 383801 379301 375594 372708 370267 367664 364575 361146 357689
61591 357689 354380 351277 348359 345518 342632 339781 337279 335436 334309 333698 333303 332886 332353 331666 330757 329583
61575C29583j276j051o65n05p31j161j523j649j387o75J78O27M57L9j90k76m96
61558C19299p54n72K32J163J511J110M81K40M68P80Q91R57J217J605J851J836
61542C32315J627J283R25Q47J244J843K155K145K306K966L844M427M410L652K137
61527C68126K58j212j789j742j608j584j703k239l315m302m268l096j605m73M16
61512C39864J323J943J817J098M06P2m5j32k25m12p62j022p83j37J64m86j774
61495C40909k676k415j073N78J660J740J042K05k59l15k38k17j91j2L69Q50J269
61478C41226J542J740J955K118K048J683J154O28K37R5K04L03J11k22k53Q5L36
61461C54990K56K48O76J115Q16k64j341j641j049KR02J229J107J089J408J646
$$ plain form
61575 329583 328307 327256 326591 326086 325355 324194 322671 321022 319635 318960 319138 319765 320222 320261 320071 319795 319299
61558 319299 318545 317973 318205 319368 320879 321989 322470 322710 323178 323958 324849 325806 327023 328628 330479 332315
61542 332315 333942 335225 336150 336997 338241 340084 342239 344384 346690 349656 353500 357927 362337 365989 368126
61527 368126 368384 367172 365383 363641 362033 360449 358746 356507 353192 348890 344622 341526 339921 339448 339864
61512 339864 341187 343130 344947 346045 346451 346523 346478 346346 346121 345709 344947 343925 343142 343005 343169 342683 340909
61495 340909 338233 335818 334745 335323 336983 338723 339765 339970 339711 339396 339158 338941 338750 338738 339107 339957 341226
61478 341226 342768 344508 346463 348581 350629 352312 353466 354094 354331 354426 354630 354933 355044 354822 354569 354654 354990
61461 354990 355246 355494 356170 357285 358101 357837 356496 354855 353806 353808 354710 355939 357046 358135 359543 361189
61445C61189J424J056J023J142R88P61R94J502J666J639K269L661M798M905M289
61430C93306L497K599J775J588K030K072J044k48n73J34J132K222L707N264N930
61415D25479N294L976K833K254K106J866Q72r15k501k785j942j277j657k627l202
61400D27774l049k631k420k236j496j29R72Q28l39j298j422j306j505j513p54
61385D09476J90L68LJ46R67J467R44j40r21j061p64l96k38j76L29J522K826L486
61367D18028L492L220K550J242j7k3J332K813L405L350L305L399L479L712M321
61352D57608N171N970O629P211P829Q686R870J0983J1382J0803R444P583N593
61339E64762M204M005M640N070M739L883K784J459J12q33j448k328l667m876n397
$$ plain form
61445 361189 362613 363669 364692 365834 366822 367583 368577 370079 371745 373384 375653 379314 384112 389017 393306
61430 393306 396803 399402 401177 402765 404795 406867 407911 407663 407090 407224 408356 410578 414285 419549 425479
61415 425479 430773 434749 437582 439836 441942 443808 444680 443765 441264 438479 436537 435260 433603 430976 427774
61400 427774 424725 422094 419674 417438 415942 415813 416785 417613 417274 415976 414554 413248 411743 410230 409476
61385 409476 409666 410034 410037 410183 411150 412617 413561 413421 412500 411439 410675 410279 410041 409865 410194 411716 414542 418028
61367 418028 421520 424740 427290 428532 428515 428492 429824 432637 436042 439392 442697 446096 449575 453287 457608
61352 457608 462779 468749 475378 482589 490418 499104 508974 519957 531339 542142 551586 559169 564762
61339 564762 568966 572971 577611 582681 587420 591303 594087 595546 595658 594825 593377 591049 587382 582506 577109
61324E77109n265m710l808k810k212k154k253k140j738q52P29K605L896M321M505
61309E65223M971N529O030O901Q431J0145J1419J2242J2900J3333J3264J2446
61297F82834J0450O804J909k712n684p038p771q591r530j0345j0748j0500r744
61284F19334r046q686q280p505o696o187n496l953j870l56Q1J14O78J963L501
61269E67596M814N686O061N944N489N012M770M754M823N053N812P293R242J1296
61255F53645J3276J4782J4902J3016R812O897N213M324L305J785K7j571k831l945
61241G32637n234o576p201o574n265m333m014l670k908k035j418j109j081j100
61227F80119n18J029K775L613L613L733M141M098L571L496M129M497M077L643
$$ plain form
61324 577109 571844 567134 563326 560516 558304 556150 553897 551757 550019 549167 549896 552501 556397 560718 565223
61309 565223 570194 575723 581753 588654 597085 607230 618649 630891 643791 657124 670388 682834
61297 682834 693284 700088 701997 699285 693601 686563 678792 670201 660671 650326 639578 629078 619334
61284 619334 610288 601602 593322 585817 579121 572934 567438 563485 561615 561259 561340 561454 562132 564095 567596
61269 567596 572410 578096 584157 590101 595590 600602 605372 610126 614949 620002 625814 633107 642349 653645
61255 653645 666921 681703 696605 709621 719433 726330 731543 735867 739172 740957 740984 739413 736582 732637
61241 732637 727403 720827 713626 707052 701787 697454 693440 689770 686862 684827 683409 682300 681219 680119
61227 680119 679601 680630 683405 687018 690631 694364 698505 702603 706174 709670 713799 718296 722373 726016
61213G26016L753L671K706J528J103J252J275J078P90R4r89j406l31J579L148
61198G45267M294N637P201Q741J0762J3812J7133J9380K0492K1493K2433K1939
61186I18584J9193J5176J1483Q665O386M545L578L704M310M267K947Q77q61j919
61172A000935k977m735p127r735j2246j4185j4932j4644j4517j5368j6582j7149
61160H56738j7210j7572j8128j7902j6653j5364j4828j4527j3306j0758p609m861
61148F88020k860j225M24J970L094L636L231J156k592o338q049p634o793o483
61134F59557n941m554l114k286j277Q23L428N440O977Q854J1024J2838J4339J6069
61120G22177J7998J9721K1384K3337K5242K6541K7532K8920L0537L1501L1468
$$ plain form
61213 726016 729769 733440 736146 737674 738777 740029 741304 742382 743172 743266 742277 740871 740540 742119 745267
61198 745267 749561 755198 762399 771140 781902 795714 812847 832227 852719 874212 896645 918584
61186 918584 937777 952953 964436 973101 979487 984032 987610 991314 995624 999891 1002838 1003715 1002854 1000935
61172 1000935 997958 993223 986096 976361 964115 949930 934998 920354 905837 890469 873887 856738
61160 856738 839528 821956 803828 785926 769273 753909 739081 724554 711248 700490 692881 688020
61148 688020 685160 683935 684359 686329 689423 693059 696290 697446 694854 688516 680467 672833 666040 659557
61134 659557 653616 649062 645948 643662 642385 643208 646636 652076 659053 667907 678931 691769 706108 722177
61120 722177 740175 759896 781280 804617 829859 856400 883932 912852 943389 974890 1006358
61109A006358L0899L0160K9151K7680K5657K3199K0896J9464J8602J6878J3403
61098A262347Q819L948j495p846j4082j8862k2290k5333k8070k9870l0855l1681
61086A064730l2182l1633l0207k8916k8076k7022k5351k3381k1433j9650j8350
61075G78529j7651j6810j4856j1881q917o719n351m652m310l727k574j268l20
61062F79493L75J098J794K587L928N661O832P215P890R399J0598J0596J0571J2098
61048G70135J4765J7014J8457J9719K0988K2331K4539K7842L0714L1689L1644
61037A029837L2374L3857L4812L5218L6107L7504L8555L9247M0167M1239M2349
61026A441266M4352M7628N0704N2134N2487N2583N1624M9557M9288N3415O0565
$$ plain form
61109 1006358 1037257 1067417 1096568 1124248 1149905 1173104 1194000 1213464 1232066 1248944 1262347
61098 1262347 1271166 1275114 1273619 1265773 1251691 1232829 1210539 1185206 1157136 1127266 1096411 1064730
61086 1064730 1032548 1000915 970708 941792 913716 886694 861343 837962 816529 796879 778529
61075 778529 760878 744068 729212 717331 708414 701695 696344 691692 687382 683655 681081 679813 679493
61062 679493 679868 680966 682760 685347 689275 694936 701768 708983 716873 726272 736870 747466 758037 770135
61048 770135 784900 801914 820371 840090 861078 883409 907948 935790 966504 998193 1029837
61037 1029837 1062211 1096068 1130880 1166098 1202205 1239709 1278264 1317511 1357678 1398917 1441266
61026 1441266 1485618 1533246 1583950 1636084 1688571 1741154 1792778 1842335 1891623 1945038 2005603
61015B005603O8332P7810R1094J05997J18189J27628J38223J52363J71075J98381
61005C254695K39293K93878L59373M37483N32807O45862P77585R40450J153657
60996H635083J427301J765581K179301K651851L059277L157420K730117J801385
60988B7407316O84066k20880o84741p19235m40900M7001O09632R94796R10992
60979B8588047K51767p76766j787198k476027k769075k759644k571225k290796
60971A3409083j977555j675064j404304j166051r58408p84245o42827n26540m29442
60962C844647l51423k91904k46138k09842j81802j60245j41726j25092j11868
60953B024607j01482r0554p7971o6153n6172m6220l6405l0409l0140l2573l4076
$$ plain form
61015 2005603 2073935 2151745 2242839 2348836 2467025 2594653 2732876 2885239 3056314 3254695
61005 3254695 3493988 3787866 4147239 4584722 5117529 5763391 6540976 7481426 8635083
60996 8635083 10062384 11827965 14007266 16659117 19718394 22875814 25605931 27407316
60988 27407316 28091382 27870502 27185761 26466526 26025626 26072627 26682259 27677055 28588047
60979 28588047 28839814 28063048 26275850 23799823 21030748 18271104 15699879 13409083
60971 13409083 11431528 9756464 8352160 7186109 6227701 5443456 4800629 4274089 3844647
60962 3844647 3493224 3201320 2955182 2745340 2563538 2403293 2261567 2136475 2024607
60953 2024607 1923125 1832571 1754600 1688447 1632275 1586055 1549650 1519241 1489101 1456528 1422452
60942A422452l4494l4911l4701l3190l1529l0654k9552k7379k5068k3318k1193
60931A096463j8251j5847j4779j3816j2032j0393r486p938m804j525L34J401K868
60918I92195M323N029N757P510R784J1659J3358J5192J6324J6171J5756J6232
60906A129290J7083J7220J6711J6000J4615J2050Q979O255L626O71k056m123o391
60893A229930r666j3087j5310j6490j7760j9329k0498k1037k1320k1463k1354
60882A032616k1200k1222k1205k1015k0984k1152k0800j9463j7722j6285j5062
60871H16506j3806j2822j2298j1706j0640r524q747p923o796o006o136o743p139
60858F96220p325p419p028o088n562o235p537q372q514q303p680o479n167m347
$$ plain form
60942 1422452 1387958 1353047 1318346 1285156 1253627 1222973 1193421 1166042 1140974 1117656 1096463
60931 1096463 1078212 1062365 1047586 1033770 1021738 1011345 1001859 993921 989117 987592 987926 989327 992195
60918 992195 996518 1001547 1007304 1014814 1024598 1036257 1049615 1064807 1081131 1097302 1113058 1129290
60906 1129290 1146373 1163593 1180304 1196304 1210919 1222969 1231948 1238203 1241829 1242500 1240444 1236321 1229930
60893 1229930 1220264 1207177 1191867 1175377 1157617 1138288 1117790 1096753 1075433 1053970 1032616
60882 1032616 1011416 990194 968989 947974 926990 905838 885038 865575 847853 831568 816506
60871 816506 802700 789878 777580 765874 755234 745710 736963 729040 722244 716238 710102 703359 696220
60858 696220 688895 681476 674448 668360 662798 656563 649026 640654 632140 623837 616157 609678 604511 600164
60844F00164l976l803m057m980o215p286q156q740q643p998p714q108q178p069
60830E05241n401m214l483k683k045j962j830p67Q69J900J954J625J333J074J045
60815D92656J486J989J913J381J042J059J122J233J635K040J879J177N47K88K26
60800E11673K71M02K52n55j619k053j646j146j288j994k668k901k775k721l043
60785D88189l495l511l018k698l145m139n029n511n642n416m823m091l444k802
60771D31425k070j493j412j742j971j661q26K5K56k15o77m03M44J154J575K135
60755D24544K865L205K987K756K874L057L041L014L113L258L675M741O011O307
60741D75448N128L165J141r27k899m133m511m875n722o436o426o100n981n867
$$ plain form
60844 600164 596188 592385 588328 583348 577133 569847 561691 552951 544308 536310 528596 520488 512310 505241
60830 505241 499840 495626 492143 489460 487415 485453 483623 482856 483725 485625 487579 489204 490537 491611 492656
60815 492656 494142 496131 498044 499425 500467 501526 502648 503881 505516 507556 509435 510612 511159 511447 511673
60800 511673 511944 512346 512598 512043 510424 508371 506725 505579 504291 502297 499629 496728 493953 491232 488189
60785 488189 484694 481183 478165 475467 472322 468183 463154 457643 452001 446585 441762 437671 434227 431425
60771 431425 429355 427862 426450 424708 422737 421076 420250 420275 420531 420316 419639 419236 419680 420834 422409 424544
60755 424544 427409 430614 433601 436357 439231 442288 445329 448343 451456 454714 458389 463130 469141 475448
60741 475448 480576 483741 484882 483955 481056 476923 472412 467537 461815 455379 448953 442853 436872 431005
60727D31005n682o046p010p250n811l808l079l675m084l479k486j837j483j163
60713C74112q69o69o62j040j713k086j766j137p02l20K54O00J87o50j079p87n1
60696C61622Q37J546J661J295J315K170L038K969K287J978K178K300K246K401
60682C89843K754L017L438M488N887O858P216P312P117O356N439N222N749O083
60668D66779N484M055K219L47j077j680j695j690j786j720j526j510j644j660
60654D62896j705k198l002l345k695j336l8N79M68K15L77N51l22k394m355n042
60638D38654m902n010n325n007m001l106k686k348j856j370q88k71K13K08p5k05
60622D02025k90n16l23Q12K101K215J206M41N23O36J93k26r7O5l44r57r83k51
$$ plain form
60727 431005 425323 419277 412267 405017 399206 395398 392319 388644 384560 381081 378595 376758 375275 374112
60713 374112 373243 372574 371912 370872 369159 367073 365307 364170 363468 363148 363402 364002 364189 363539 362460 361673 361622
60696 361622 362459 364005 365666 366961 368276 370446 373484 376453 378740 380718 382896 385196 387442 389843
60682 389843 392597 395614 399052 403540 409427 416285 423501 430813 437930 444286 449725 454947 460696 466779
60668 466779 472263 476318 478537 478884 477807 476127 474432 472742 470956 469236 467710 466200 464556 462896
60654 462896 461191 458993 455991 452646 449951 448615 448577 449156 449624 449839 450216 450767 450445 448051 443696 438654
60638 438654 433752 428742 423417 418410 414409 411303 408617 406269 404413 403043 402155 401884 402097 402305 402230 402025
60622 402025 401735 401219 400896 401708 403809 406024 407230 407671 408194 408830 409023 408797 408700 408765 408421 407464 406481 406230
60604D06230P93J598J661P77m88j154r18l81M0O95J819K807K948K407J917J876
60588D22627K178K611K969K917K253J181J10o88j069q98k19N84J073J247J576
60573D38452K500L910N225O013O539P515R297J1533J3582J5042J5865J6299J6684
60560E68456J6876J5928J2946Q340L506q49n147r390j2318j2866j1621r861p936
60547E56064n531k947q97N93K055L660N297P311J0039J2986J5434J7636K0277
60534F41977K2978K4526K4450K3177K0667J6351J0585M876J80l878p608j0250
60522G68031j1102j0743j0329j0192r918r318q641p983p092n659l628j240R89
60509F73175K486K985K710K322K661M262O856R687J2527J5985K0463K5412L0225
$$ plain form
60604 406230 407023 408621 410282 411059 410571 409417 408499 408118 408158 408853 410672 413479 416427 418834 420751 422627
60588 422627 424805 427416 430385 433302 435555 436736 436846 436158 435089 434191 433972 434556 435629 436876 438452
60573 438452 440952 444862 450087 456100 462639 470154 479451 490984 504566 519608 535473 551772 568456
60560 568456 585332 601260 614206 622546 626052 625203 620056 610666 598348 585482 573861 564000 556064
60547 556064 550533 547586 546689 547282 549337 552997 558294 565605 575644 588630 604064 621700 641977
60534 641977 664955 689481 713931 737108 757775 774126 784711 789587 789767 785889 778281 768031
60522 768031 756929 746186 735857 725665 715747 706429 697788 689805 682713 677054 673426 672186 673175
60509 673175 675661 678646 681356 683678 686339 690601 697457 707144 719671 735656 756119 781531 811756
60496H11756L5263M1206M7751N3831N8744O2195O3526O2095N8279N3014M6223
60485A393883L6785K4308R981m601j8664l1931m3915n3937o1432o5976o7400o6072
60473A051029o2643n7578n1369m5008l9528l5056l0928k6773k2888j9657j7204
60462F42397j5642j4954j4619j3948j2751j1181r196o878n006m385m688m833m461
60449E19855m095m029l989l915m049m154l622k527j634j233q17n8P38J268J517
60434D89256J322N00n57j253j652k158k456j960j126j042j651j781j123o95r23
60419D72701q21K28J195R53n6o10l95P2N14J011J527J936K215K254J866J269R28
60402D86787Q25N83L77P77J585J893J591J633K391K960K710K344K638L192L228
$$ plain form
60496 811756 847019 888225 935976 989807 1048551 1110746 1174272 1236367 1294646 1347660 1393883
60485 1393883 1430668 1454976 1464957 1460356 1441692 1409761 1365846 1311909 1250477 1184501 1117101 1051029
60473 1051029 988386 930808 879439 834431 794903 759847 728919 702146 679258 659601 642397
60462 642397 626755 611801 597182 583234 570483 559302 550106 543228 538222 533837 529149 524316 519855
60449 519855 515760 511731 507742 503827 499778 495624 492002 489475 487841 486608 485791 485733 486471 487739 489256
60434 489256 490578 491078 490521 489268 487616 485458 483002 481042 479916 478874 477223 475442 474319 473624 472701
60419 472701 471880 472108 473303 474256 474200 473590 473195 473267 473781 474792 476319 478255 480470 482724 484590 485859 486787
60402 486787 487612 488195 488572 489349 490934 492827 494418 496051 498442 501402 504112 506456 509094 512286 515514
60387E15514K800K393K170K277L065M234M695M006L136K980L068K659K205K619
60373E57821L737M606M836M720M468M183M109M202L873K927K109K034K226K017
60359F07868J746K086K858L475M090N268P013R061J1650J4945J8212K0726K2928
60346G31926K5447K7348K6811K3461J8611J3055O190k176j0434j6482j9770k1305
60334H02682k2143k2422k1639j9450j6264j3147j0950r571q376p292o861p171
60322F37396p369o652n224l895k971k167j413j095j173o86J289M315O925Q414
60308F25694R699J2040J5459J9087K2668K7021L2888L9748M5620M7880M4747L6623
60296I79174K5670J3541J20j4718k8946l9391m4653m5711m3828l9502l3606k7752
$$ plain form
60387 515514 518314 520707 522877 525154 528219 532453 537148 541154 544290 547270 550338 552997 555202 557821
60373 557821 561558 566164 571000 575720 580188 584371 588480 592682 596555 599482 601591 603625 605851 607868
60359 607868 609614 611700 614558 618033 622123 627391 634404 643465 655115 670060 688272 708998 731926
60346 731926 757373 784721 811532 834993 853604 866659 872849 870673 860239 843757 823987 802682
60334 802682 780539 758117 736478 717028 700764 687617 676667 667096 658720 651428 644567 637396
60322 637396 630027 623375 618151 614256 611285 609118 607705 606610 605437 604751 606040 610355 617280 625694
60308 625694 635393 647433 662892 681979 704647 731668 764556 804304 849924 897804 942551 979174
60296 979174 1004844 1018385 1018505 1003787 974841 935450 890797 845086 801258 761756 728150 700398
60284G00398k2824j8408j4312j1299r663q422o827n506n195n433n507n613n993
60271E75396n940m895l754l759m614m933m163k962k015j483j334j307q37J71P98
60256E34369K43r14j370p71J41P15Q66O41J19k74j23M24R22J211J294R89L39o8
60238E38753K01P56R96J003J198J520J643J624J713J846J856J856J927J846J586
60223E60324J524J685J452O26Q0O59K071L514M685N480N571N142N254O420P565
60208F12052P485O592O082O065N878N612N896O439O251N218M183L583L123K689
60194F87148K449K141J379N81M26N30j57j633k699k720k469k895l898m618m378
60179F69187l290k307k500l760m641m096k814j987j530o69L54O60L78M14P32M05
$$ plain form
60284 700398 677574 659166 644854 633555 623892 615470 608643 603137 597942 592509 587002 581389 575396
60271 575396 569456 564561 560807 557048 552434 547501 543338 540376 538361 536878 535544 534237 533400 533571 534369
60256 534369 534612 533698 532328 531557 531698 532413 533279 533920 534039 533765 533642 534066 534988 536199 537493 538482 538821 538753
60238 538753 538954 539710 540706 541709 542907 544427 546070 547694 549407 551253 553109 554965 556892 558738 560324
60223 560324 561848 563533 564985 565611 565691 566350 568421 571935 576620 582100 587671 592813 598067 604487 612052
60208 612052 619537 626129 632211 638276 644154 649766 655662 662101 668352 673570 677753 681336 684459 687148
60194 687148 689597 691738 693117 693698 694124 694654 694497 692864 690165 687445 684976 682081 678183 673565 669187
60179 669187 665897 663590 661090 657330 652689 648593 645779 643792 642262 641593 641947 642607 642985 643399 644131 644536
60163F44536p02j713k266k774l136k729j887j789k483k538j244K79Q85R70J362
60148F24771J836J752J351J371J923K539K973L364L900M742N840O677O746O488
60134F76273P023Q614J0039R954Q300O050M077K688J731P86l55j332j655j543
60120G30650j589j661j001M74J836K425K546K569K261J580J224J640K124J756
60106G46834P78K36M67O74nj524l111m066m271m105l956l941l967l859l289j982
60090G10913k90Q29Q54M18M86J106J603J625J344Q34J12m26l69k3l5n03j209k418
60072G14851m386o361p251p296p754q861r408q678p504o846o510n993n538n514
60058F16951n588n349n115n295n532n200m351l499k845k223j503n98N52J694K379
$$ plain form
60163 644536 643834 642121 639855 637081 633945 631216 629329 627540 625057 622519 621275 621554 622439 623409 624771
60148 624771 626607 628359 629710 631081 633004 635543 638516 641880 645780 650522 656362 663039 669785 676273
60134 676273 683296 691910 701949 711903 720203 726253 730330 733018 734749 735535 735180 733848 732193 730650
60120 730650 729061 727400 726399 726873 728709 731134 733680 736249 738510 740090 741314 742954 745078 746834
60106 746834 747612 747848 748315 748989 748984 747460 744349 740283 736012 731907 727951 724010 720043 716184 712895 710913
60090 710913 710623 711452 712306 712724 713210 714316 715919 717544 718888 719722 719834 719408 719039 719016 718981 718478 717269 714851
60072 714851 710465 704104 696853 689557 681803 672942 663534 654856 647352 640506 633996 628003 622465 616951
60058 616951 611363 606014 600899 595604 590072 584872 580521 577022 574177 571954 570451 569853 570405 572099 574478
60043E74478K683L293M467N544N936N958O123O148N433M086K769J789R69J94n70
60028F29300j622l234n020o186o435o257o260o636p279p990q397p989o608m778
60014E44609l328k657k472k255j783j152n20p6m2l41m26J44R86J371J299J367
59998E34724J505Q48p43k058k124j490j135r00j45P86J055Q92J319K409L094K783
59982E40820K047J508J097O23K34pl90j180k401l915n168n242l844k052j156j095
59966E19879q84k44L16P28J378K001J964J671K265L696M495L864K712K100J846
59951E47787J371Q02M88K23k70o84n69N5Q06J207P47o39k092k496j814r90o33
59934E43299o09q47j429j827j300j42N64O59J077K087K781K728K683L093L297
$$ plain form
60043 574478 577161 580454 584921 590465 596401 602359 608482 614630 620063 624149 626918 628707 629676 629870 629300
60028 629300 627678 624444 619424 613238 606803 600546 594286 587650 580371 572381 563984 555995 549387 544609
60014 544609 541281 538624 536152 533897 532114 530962 530442 530366 530324 529983 529557 529701 530687 532058 533357 534724
59998 534724 536229 537077 536334 534276 532152 530662 529527 528627 528482 529268 530323 531215 532534 534943 538037 540820
59982 540820 542867 544375 545472 546095 546329 546322 545932 544752 542351 538436 533268 528026 524182 522130 520974 519879
59966 519879 518995 518751 519067 519795 521173 523174 525138 526809 529074 532770 537265 541129 543841 545941 547787
59951 547787 549158 549960 550448 550671 550401 549717 549148 549203 550009 551216 551963 551324 549232 546736 544922 543932 543299
59934 543299 542690 541843 540414 538587 537287 537145 537709 538368 539445 541532 544313 547041 549724 552817 556114
59919E56114K941K804L411L997L891L705M189M880M969M622M303L688K313O39
59905F06466n56j342k187k877k822k086j290p60m55k92o2N94J626K508L133M061
59889F03659N415O324O150N469N172N246N229N191N421N687N614N405N547O096
59875F81625O717O956O176L943Q13j962l939n763p649q647q192p235o870o805
59861F49168o202n234m648m419m002l413l031k720k052j075l4J293L200N363P264
59846F29458Q908J0570J2308J4172J6114J7047J5051R650L136j540l547l856k951
59833G24520m72L057N711N800L231p93m713p376q683r538j0663j1601j1473j0326
59819F66681r049q254p893p776p709p260o073m371k766j720j477k098l146l810
$$ plain form
59919 556114 559055 561859 565270 569267 573158 576863 581052 585932 590901 595523 599826 603514 605827 606466
59905 606466 605910 604568 602381 599504 596682 594596 593306 592546 592091 591799 591737 592331 593957 596465 599598 603659
59889 603659 609074 615398 621548 627017 632189 637435 642664 647855 653276 658963 664577 669982 675529 681625
59875 681625 688342 695298 701474 705417 706230 704268 700329 694566 686917 678270 670078 662843 655973 649168
59861 649168 642966 637732 633084 628665 624663 621250 618219 615499 613447 612372 612338 613631 616831 622194 629458
59846 629458 638366 648936 661244 675416 691530 708577 723628 733278 736414 734874 731327 727471 724520
59833 724520 724048 727105 732816 738616 741847 741054 736341 728965 720282 710744 700081 688480 677007 666681
59819 666681 657632 649378 641485 633709 626000 618740 612667 608296 605530 603810 602333 600235 597089 593279
59805E93279l811l681l753l564k802k050j895j983j785j627k016k539k433j844
59791E57496j489j400r61j1R47J474J486J029L80K8Nl51j348k268k417k240k447
59774E47913k638j898m56M61L39p2j3L38L58j56p91r16l10M84P92Q33J503K889
59756E48660L845L527K595K226K672L479M356N146N517N472N548N884N791M903
59742F09621L925L465L073K231J420J149R40L10j06L10Q08M03l80l50L45N91K16
59725F27971K4K28K51j27n51q58r80n72K44L52q76k230k224j354j170j588j074
59708F15466O70K138K259J597R69M04j19k05K32P78J288J924K428K377K126K390
59692F36722K939K856J986R81k2j341k464k304r36K47M37J27k24r06j908k510
$$ plain form
59805 593279 589468 585787 582034 578470 575668 573618 571723 569740 567955 566328 564312 561773 559340 557496
59791 557496 556007 554607 553646 553635 554582 556056 557542 558571 558951 558979 558984 558633 557285 555017 552600 550360 547913
59774 547913 545275 543377 542921 543382 543721 543649 543636 543974 544332 544176 543385 542469 542159 542643 543435 544268 545771 548660
59756 548660 552505 556032 558627 560853 563525 567004 571360 576506 582023 587495 593043 598927 604718 609621
59742 609621 613546 617011 620084 622315 623735 624884 625824 626134 626028 626338 627146 627549 627169 626819 627164 627755 627971
59725 627971 627995 628223 628474 628347 627796 626938 625958 625386 625630 625982 625106 622876 620652 619298 618128 616540 615466
59708 615466 616136 618274 620533 622130 623099 623503 623384 623179 623411 624189 625477 627401 629829 632206 634332 636722
59692 636722 639661 642517 644503 645484 645462 644121 641657 639353 638417 638664 639101 639228 639004 638098 636190 633680
59676F33680k473k557l312m281m864n074n075m829m540m624m930m756l923l022
59662E75420k418j830j115o25m86k81L45J320K489L651M344M321M092M215M311
59647E97753L690K639J914J204n02k974m646m730m191m125m346m061l027j585
59633E73013k51L70P9l89p3Q41J210N60m10j034j368j589j679j906k639l496l641
59616E57598l081k688k754k623j977j369j132p78O6J058J876K735L704M293M100
59601E59028L273K112Q01l10q30q76r16j101j288j495j636j140K06J391J309M26
59585E58954M8K02k73j546k390k215j939k361k997l136k864k522k108j749j811
59570E31293k195k320k064j792j458p00J57M25M26J116K250K446J374L41K34M64
$$ plain form
59676 633680 631207 628650 625338 621057 616193 611119 606044 601215 596675 592051 587121 582365 578442 575420
59662 575420 573002 571172 570057 569432 568946 568665 569010 570330 572819 576470 580814 585135 589227 593442 597753
59647 597753 601443 604082 605996 607200 606698 603724 599078 594348 590157 586032 581686 577625 574598 573013
59633 573013 572762 573132 573211 572822 572749 573590 574800 575360 574950 573916 572548 570959 569280 567374 564735 561239 557598
59616 557598 554517 551829 549075 546452 544475 543106 541974 541196 541262 542320 544196 546931 550635 554928 559028
59601 559028 562301 564413 565214 564904 564074 563198 562282 561181 559893 558398 556762 555622 555828 557219 558528 558954
59585 558954 559002 559204 558931 557385 554995 552780 550841 548480 545483 542347 539483 536961 534853 533104 531293
59570 531293 529098 526778 524714 522922 521464 520764 520921 521346 521772 522888 525138 527584 528958 529299 529533 529997
59554E29997N08Q89J773K141J455Q17J336K389K706K308K215K884M025N533P548
59539E68524R839J1986J4213J7354K1613K5303K5094J8507O883m701j1518j2893
59527F90204j1223q312m404j02L167M975O266P362P305N736L755K190N31j666
59513G05784l785n390p075r198j1022j1948j2386j2661j2219j0749q979p632o642
59500E86098n983n945o039n047k971j418j242j314o54j32p07j492j208m15m51
59485E51080j056p59P79K396L182L333L389L683M448N631O731P389P829Q258Q312
59470F14625P616O349M782K909J020j18k50j43m79q43m04R81K869M824O511P812
59454F58061R145J0970J2755J3367J2759J2231J2610J3180J2844J1306Q634M796
$$ plain form
59554 529997 530505 531394 533167 535308 536763 537580 538916 541305 544011 546319 548534 551418 555443 560976 568524
59539 568524 578363 590349 604562 621916 643529 668832 693926 712433 719316 714615 703097 690204
59527 690204 678981 670669 666265 666163 669330 674305 680571 687933 695238 700974 704729 706919 707450 705784
59513 705784 701999 696609 689534 680336 669314 657366 644980 632319 620100 609351 600372 592740 586098
59500 586098 580115 574170 568131 563084 560113 558695 557453 556139 555485 555353 554646 553154 551946 551531 551080
59485 551080 550024 549265 550044 552440 555622 558955 562344 566027 570475 576106 582837 590226 598055 606313 614625
59470 614625 622241 628590 633372 636281 637301 637183 636933 636790 636311 635468 635064 636045 638914 643738 650249 658061
59454 658061 667206 678176 690931 704298 717057 729288 741898 755078 767922 779228 787862 792658
59442G92658K45m076p833j1433j4623j6197j5674j4089j2445j0608q398o613n949
59429F64965n942n783n283m295k227J020M504P379R811J2215J4485J6531J8684
59416G26064K0965K2769K3803K4730K6723L0743L6371M0105L6031K1068k68j8873
59404I90231k9170l2166l0831k6151j8646r867l99J0297J9635K0847R859q619
59392H95020k5093l4034l6171l4105k9557k4297k0091j6990j3783j0244p225m839
59380F38591k474l97N39N83Q98J790K570K887K927K724K467K904M221N259N142
59365F70631M715N116N872O013N928O453P083O983O848P794R208R726R637J0267
59351G72274J1531J2287J2708J4102J6544J8568J9298J9166J8704J8101J7766
$$ plain form
59442 792658 792903 788827 780994 769561 754938 738741 723067 708978 696533 685925 677527 670914 664965
59429 664965 659023 653240 647957 643662 641435 642455 646959 654338 664149 676364 690849 707380 726064
59416 726064 747029 769798 793601 818331 845054 875797 912168 952273 988304 1009372 1009104 990231
59404 990231 961061 928895 898064 871913 853267 843400 843001 853298 872933 893780 903639 895020
59392 895020 869927 835893 799722 765617 736060 711763 691672 674682 660899 650655 643430 638591
59380 638591 636117 635720 636259 636842 637740 639530 642100 644987 647914 650638 653105 656009 660230 665489 670631
59365 670631 675346 680462 686334 692347 698275 704728 711811 718794 725642 733436 742644 752370 762007 772274
59351 772274 783805 796092 808800 822902 839446 858014 877312 896478 915182 933283 951049
59340I51049J7705J6721J3771R724O186L065r21n743r958j2902j5209j7233j8621
59327I37634j9392j9913j9936j9068j7899j7181j6308j4167j1187q875p686o924
59315G59098o385o367o343n452m111l453l378k821j682q27k97O87J997K627K472
59300G25765K587L658N568Q296J1886J5766J9215K1840K2253J7580O606p194j8170
59287H35656k3813k5578k5106k2512j8435j4737j2213r723o477l371j249M15K391
59274F75248M638O988R565J2073J3855J5049J6430J7941J8508J7492J5121J1620
59262H34528P246L041R5j996m527p608j0142j1668j2706j3352j3170j2409j1795
59249G45537j1169r838q136p051o434n252l370j497L67K589M438M943M942O163
$$ plain form
59340 951049 968754 985475 999246 1008970 1015156 1018221 1017300 1011557 1001599 988697 973488 956255 937634
59327 937634 918242 898329 878393 859325 841426 824245 807937 793770 782583 773708 766022 759098
59315 759098 752713 746346 740003 734551 730440 726987 723609 720788 719106 718279 717982 718669 720666 723293 725765
59300 725765 728352 732010 737578 745874 757760 773526 792741 814581 836834 854414 861020 853826 835656
59287 835656 811843 786265 761159 738647 720212 705475 693262 683539 677062 673691 672442 672857 675248
59274 675248 679886 686874 696439 708512 722367 737416 753846 771787 790295 807787 822908 834528
59262 834528 841774 844815 844910 842914 838387 830779 820637 808969 796263 782911 769741 757332 745537
59249 745537 734368 724530 716394 709343 702909 697657 694287 692790 693157 695746 700184 705127 710069 716232
59235G16232Q357R571R229Q613Q222P080N035L387K614J603k63k264m046o127
59221G67243q185q922q288p777p885p306n427l551k676k012q01J42j41j254k390
59206G00770l491m549m960m390l393k584k144k232k773k908j978r30j155k130
59192F61153k121j042m59o95l59Q65J463P89K46Q38J647J772J809K343K825K910
59176F73984L268M099M503M188M224N252O503P328Q141R163R868J0301J1277J2702
59162G74801J3407J3056J2432J1409Q870N181K412J203l19l504p248j0144j2348
59149H09208j4112j4678j3946j3238j3062j2190j0272r154j0008j1193j0789r418
59137F67148q703q577q037p125o395n590m479l801l880l567k033l23L09L73R87
$$ plain form
59235 716232 724589 734160 743389 752002 760224 767304 772339 775726 778340 779943 779680 777416 773370 767243
59221 767243 759058 750136 741848 734071 726186 718880 713453 709902 707226 705214 704413 704555 704414 703160 700770
59206 700770 697279 692730 687770 683380 679987 677403 675259 673027 670254 667346 665368 664438 663283 661153
59192 661153 659032 657990 657531 656836 656477 657342 658805 659594 659840 660678 662325 664097 665906 668249 671074 673984
59176 673984 677252 681351 685854 690042 694266 699518 706021 713349 721490 730653 740521 750822 762099 774801
59162 774801 788208 801264 813696 825105 833975 839156 841568 842771 842452 838948 831700 821556 809208
59149 809208 795096 780418 766472 753234 740172 727982 717710 708556 698548 687355 676566 667148
59137 667148 658445 649868 641831 634706 628311 622721 618242 614441 610561 606994 604961 604638 604947 605320 606307
59122F06307K055L039M396O658R118J0776J1661J2062J1647J0536R987J0651J1256
59109G20149J0396Q579P230O696O422O155N824N101M071L405L173K585J487O71
59095G91944J34j240l438m609l725k137j288q07j37r3j209k364k759l536n646
59080G59090p821q557q598r338j0195r717q217p160o778o253n528n092m684l884
59066F57268l370l925m823m677l404j998j016m44l80p32r37r22j460k625l092
59051F23463k022m75J45j76q61j880k830k452n10J145Q90m30r90n27M3L16L08
59034F13157k61j187j349k49J125K011L039M612N853O404P516R815J1814J2311
59020F74611J2502J3772J5133J4873J3270J1513R435O417L286J085q81l628o224
$$ plain form
59122 606307 608362 611401 615797 622455 631573 642349 654010 666072 677719 688255 698242 708893 720149
59109 720149 730545 739124 746354 753050 759472 765627 771451 776552 780623 784028 787201 789786 791273 791944
59095 791944 792078 790838 787400 782791 779066 776929 775641 774834 774697 774604 773395 771031 768272 764736 759090
59080 759090 751269 742712 734114 724776 714581 704864 696647 689487 682709 676456 670928 665836 661152 657268
59066 657268 653898 649973 645150 640473 637069 635071 634055 633611 633231 632499 631562 630640 629180 626555 623463
59051 623463 621441 620966 621111 620935 620074 618194 615364 612912 612402 613547 614437 614007 613017 612490 612533 612849 613157
59034 613157 612896 611709 610360 610111 611236 613247 616286 620898 626751 633155 640671 650486 662300 674611
59020 674611 687113 700885 716018 730891 744161 755674 765109 771526 774812 775897 775016 771388 765164
59007G65164p028o190m980l623j731K37J813L690O220Q014P985P403P861Q534
58993G93369P810O285N665N813N354M272L405K243k72l426n601o785p952q773
58979H01407q222o768n560m184j580J516L440M356N723P573Q724R229J0209J1603
58965H37466J2354J2510J2975J3541J3306J2583J2217J1562R340O024L095M01
58953I57374l370p976j1856j4706j7465j9933k0803k0035j8950j8049j6681j4813
58941G72737j3031j1089q431n914m880m889m473l700l740m312l969k761k152k404
58927F96992k345j750j654k201k375j922j552j267n72j30j044k572k807j596n60
58912F72645k67K90J381K039K166K878M459N975P191Q867J0950J2444J3323J4561
$$ plain form
59007 765164 758136 751946 746966 743343 741612 741849 743662 747352 753572 761586 769571 776974 784835 793369
58993 793369 801179 807464 813129 818942 824296 828568 831973 834216 833944 830518 824917 818132 810180 801407
58979 801407 793185 786417 780857 776673 775093 776609 780049 784405 790128 797701 806425 815654 825863 837466
58965 837466 849820 862330 875305 888846 902152 914735 926952 938514 947854 953878 956973 957374
58953 957374 954004 946028 934172 919466 902001 882068 861265 841230 822280 804231 787550 772737
58941 772737 759706 748617 740186 734272 729392 724503 720030 716330 712590 708278 704309 701548 699396 696992
58927 696992 694647 692897 691243 689042 686667 684745 683193 681926 681354 681224 680180 677608 674801 673205 672645
58912 672645 672378 672668 674049 676088 678254 681132 685591 691566 698757 707624 718574 731018 744341 758902
58898G58902J6114J6719J6009J4991J4269J3589J3226J4105J6303J9010K1929
58887I35166K5188K8157K9995L1003L1689L1050K7816K2824J7983J3357P748J607
58875A203583l280p007j1569j7501k2976k6604k8698k9409k7995k4616k0784j7500
58863I65644j4716j2733j2210j2587j2529j2077j2350j3202j3342j2826j3034
58852H24038j4000j4094j2709j1024r787q544p422p357q115q206p292o595o621
58839G02272o494n961n921o525o797o606o939p794p830o628n388m821m256l219
58825F17093k149j140K29J611K140K105K611L517L679L189L305M122M474M223
58811F49009M441N158N137M147L302K836J712k60j970k950l817m576m521l934
$$ plain form
58898 758902 775016 791735 807744 822735 837004 850593 863819 877924 894227 913237 935166
58887 935166 960354 988511 1018506 1049509 1081198 1112248 1140064 1162888 1180871 1194228 1201976 1203583
58875 1203583 1200303 1193296 1181727 1164226 1141250 1114646 1085948 1056539 1028544 1003928 983144 965644
58863 965644 950928 938195 925985 913398 900869 888792 876442 863240 849898 837072 824038
58852 824038 810038 795944 783235 772211 762424 753880 746458 739101 730986 722780 715488 708893 702272
58839 702272 695778 689817 683896 677371 670574 663968 657029 649235 641405 634777 629389 624568 620312 617093
58825 617093 614944 613804 614033 615644 617784 619889 622500 626017 629696 632885 636190 640312 644786 649009
58811 649009 653450 658608 663745 667892 671194 674030 675742 675482 673512 670562 666745 662169 657648 653714
58797F53714l901m300m032l220l137l970m679m986n285m923k911j95J299J692
58783F11166K726M568N668N711N863O198N675M651M558N068M510L061K373K064
58769F73860j0l691o133o106n371n206m774l781l448l884l573k365j986k729k606
58754F18197p45J282K411L394M391M242L036K453K770K553J886K673M931O298
58740F59772O148O622Q400R213P906O431O124N637M397M510P040R555R811R001
58726G60567R098R568R037P886P042O261N408N451O636P701Q141R060J0704J1605
58712H74165J1277J1054J1161R845O625L400J026k096o575j0374j2341j4228j7318
58699H65621k0096k1259k2074k3678k4810k4280k3046k1893j9720j6056j2674
$$ plain form
58797 653714 649813 645513 641481 638261 635124 631154 626475 621489 616204 611281 608370 608175 609474 611166
58783 611166 613892 618460 624128 629839 635702 641900 647575 652226 656784 661852 666362 669423 671796 673860
58769 673860 673850 670159 664026 657920 652549 647343 642569 638788 635340 631456 627883 625518 623532 620803 618197
58754 618197 617452 618734 621145 624539 628930 633172 636208 638661 641431 643984 645870 648543 653474 659772
58740 659772 665920 672542 680942 690155 698061 704492 710616 716253 720650 725160 732200 741755 751566 760567
58726 760567 769665 779233 788270 796156 803198 809459 814867 820318 826954 834655 842796 851856 862560 874165
58712 874165 885442 896496 907657 917502 924127 927527 928553 926457 919882 909508 897167 882939 865621
58699 865621 845525 824266 802192 778514 753704 729424 706378 684485 664765 648709 636035
58688F36035j0775r196p156n938o090n892m579m038n279o201n101l511l151l011
58674E56117j782n55m79l73R83K544L302M387O679Q837R903J1276J3882J5917
58660F30638J5637J3853J1542P804K498j911l659m300n652o797o534o060o593
58647F40466o952o074n403o149o730n568l959l552l353j923j97M34O12J212J480
58632E94344J222K208M959O761N565L266K561L162L686M581O411P731P421O727
58618F60605O666N960M000K905M089N664N834N789O559O275L592O22o84j860m399
58603G11617o254n442l978m406n420m815l869m730o049n420l778l358l471k231
58589F48396l64N37J573M465P927R712J0373J1526J2492J2072J1480J2028J2117
$$ plain form
58688 636035 625260 616064 608908 602970 596880 590988 586409 582371 577092 570891 565790 562279 559128 556117
58674 556117 554335 553780 553301 552928 553911 556455 559757 564144 570823 579660 589563 600839 614721 630638
58660 630638 646275 660128 671670 679474 681972 680061 676402 672102 666450 659653 653119 647059 640466
58647 640466 633514 627440 622037 615888 609158 603590 599631 596079 592726 590803 590606 591040 591652 592864 594344
58632 594344 595566 597774 602733 609494 615059 618325 620886 624048 627734 632315 638726 646457 653878 660605
58618 660605 667271 673231 677231 680136 684225 689889 695723 701512 708071 714346 717938 718560 717876 716016 711617
58603 711617 705363 699921 695943 691537 686117 681302 677433 672703 666654 661234 657456 654098 650627 648396
58589 648396 648032 648569 650142 654607 662534 672246 682619 694145 706637 718709 730189 742217 754334
58576G54334J0106P765P380P779O882N722O205P377P761Q915J2619J6984J9402
58563H79231K1062K4365K8197L0049L0580L1692L2121K9338K4101J8921J3754
58552A163411P233M30m515p830j0537j1624j0343q984r543j0217r049q226j0566
58539A069640j4484j6965j8779k2007k5104k5410k4164k3963k3572k0383j5755
58528H39054j2682j0356o276j768O3J5J127L068L406K774L477M527L382J012J79
58513H31002K42j230l362l656l070m099n602m898l288l942n966o052m487l977
58499G77615m094k612p89j537l720m004k994l733n454m801k024j93O73K853N549
58484G50735O089N413O635R287J0641J1400J4209J7925J9346J9176K0167K0865
$$ plain form
58576 754334 764440 772205 779585 787364 794246 799968 806173 813550 821311 830226 842845 859829 879231
58563 879231 900293 924658 952855 982904 1013484 1045176 1077297 1106635 1130736 1149657 1163411
58552 1163411 1170644 1171074 1166559 1158729 1148192 1136568 1126225 1117241 1107698 1097481 1088432 1080206 1069640
58539 1069640 1055156 1038191 1019412 997405 972301 946891 922727 898764 875192 854809 839054
58528 839054 826372 816016 809740 807972 808035 808050 809177 812245 815651 818425 821902 826429 829811 830823 831002
58513 831002 831244 830014 826652 822996 819926 815827 810225 805327 802039 798097 792131 786079 781592 777615
58499 777615 773521 770909 770120 768583 764863 760859 757865 754132 748678 743877 741853 741660 742333 745186 750735
58484 750735 756824 762237 768872 778159 788800 800200 814409 832334 851680 870856 891023 911888
58472I11888J7594J1360O291K509k870q896j1800j1838j2425j3434j2046r249
58460H67084q423q445n356m6K913L535O095J0912J3836J3816J3760J3889J1332
58447I34902O465K701j7m625j0089j2194j1031j0639j1447j0217p237o112o495
58434H53965m560o63J066P07K372N965P099N574N957R157J1253J1330J2615J5053
58420I36890J4708J1364R045Q192N115j14l194l716n770r668j1181r913j0154
58407I31604j2459j2610j0075r104j0224r061n016k672l197k587Q6J090MP89L541
58392H60109L740J045K64K179K256j42l43K270K738P0r01J029J487j50Q47M815
58376H81313O110L538K639N170O185M143L984P225Q877P307P313J0375J1674R937
$$ plain form
58472 911888 929482 940842 947133 949642 946772 937876 926076 914238 901813 888379 876333 867084
58460 867084 858661 850216 844860 844814 847727 851262 857357 868269 882105 895921 909681 923570 934902
58447 934902 941367 944068 944051 939426 929337 917143 906112 895473 884026 873809 866572 860460 853965
58434 853965 849405 848742 849808 850515 852887 858852 865951 871525 877482 886639 897892 909222 921837 936890
58420 936890 951598 962962 972007 980199 985314 985200 982006 978290 972520 962852 951671 941758 931604
58407 931604 919145 906535 896460 887356 877132 868071 863055 860383 857186 854599 854685 855775 855779 856568 860109
58392 860109 863849 864894 865158 867337 869593 869451 869108 871378 874116 874186 873285 874314 875801 875651 876498 881313
58376 881313 887423 890961 893600 898770 904955 909098 913082 920307 929184 936491 943804 954179 965853 975790
58362I75790J0277J4059J5940J4249J4162J7218J7928J4322J1584J1658R637M206
58350A131030J027J941J468k014k566J683M256K226J389M845P428O366O626J0578
58336A176283J3127J2187J3130J7881K0513J8620J7956K0797K1163J6705J3681
58325A362043J4664J3315O990K495L344L409o55k791K78K497O05N84N428Q795
58311A421001P477P774J2689J5517J2958J1791J5515J7497J4558J3741J8190K0180
58299A588888J5970J3533J7334J9753J6189J4240J8848K2755K0924J9999K4182
58288A792615K6419K3105K2430K8489L2387K9062K7098L1649L4084K9428K7253
58277B104019L3554L8799L6149L4468M0488M5348M2258M0123M5799N0248M6648
$$ plain form
58362 975790 986067 1000126 1016066 1030315 1044477 1061695 1079623 1093945 1105529 1117187 1126824 1131030
58350 1131030 1132057 1133998 1135466 1133452 1130886 1132569 1136825 1139051 1140440 1145285 1152713 1159079 1165705 1176283
58336 1176283 1189410 1201597 1214727 1232608 1253121 1271741 1289697 1310494 1331657 1348362 1362043
58325 1362043 1376707 1390022 1397012 1399507 1402851 1406260 1405605 1402814 1403092 1405589 1406194 1406778 1412206 1421001
58311 1421001 1428478 1436252 1448941 1464458 1477416 1489207 1504722 1522219 1536777 1550518 1568708 1588888
58299 1588888 1604858 1618391 1635725 1655478 1671667 1685907 1704755 1727510 1748434 1768433 1792615
58288 1792615 1819034 1842139 1864569 1893058 1925445 1954507 1981605 2013254 2047338 2076766 2104019
58277 2104019 2137573 2176372 2212521 2246989 2287477 2332825 2375083 2415206 2461005 2511253 2557901
58266B557901M4647N1777N8468N6771N5967O3795P0469O7702O5199P1361P6244
58255C240301P1161O6349P1161P5817P1324O8153P5965Q4365Q3435Q3486R4319
58244D085836J05271J06467J08895J22229J34396J35107J37182J51756J65670
58235E252809J67204J70031J86655K03262K07151K13155K35121K58003K67378
58226G160769K78967L08141L38803L54894L73208M10880M51056M76838N07088
58217A0660644N60493O17770O60126P09889P89713Q78695R55499J045938J177675
58208A8056442J328967J476524J650891J886277K162293K459620K824100L306364
58200C5151478L892129M569134N403972O467073P749264R253088J1094589J3401795
$$ plain form
58266 2557901 2602548 2654325 2712793 2769564 2825531 2889326 2959795 3027497 3092696 3164057 3240301
58255 3240301 3311462 3377811 3448972 3524789 3596113 3664266 3740231 3824596 3908031 3991517 4085836
58244 4085836 4191107 4297574 4406469 4528698 4663094 4798201 4935383 5087139 5252809
58235 5252809 5420013 5590044 5776699 5979961 6187112 6400267 6635388 6893391 7160769
58226 7160769 7439736 7747877 8086680 8441574 8814782 9225662 9676718 10153556 10660644
58217 10660644 11221137 11838907 12499033 13208922 13998635 14877330 15832829 16878767 18056442
58208 18056442 19385409 20861933 22512824 24399101 26561394 29021014 31845114 35151478
58200 35151478 39043607 43612741 49016713 55483786 63233050 72486138 83580727 96982522
58192I6982522J6199929J9538736K3632120K8663955L4468494M0458679M5561577
58185C05506012M7848286M4579776L3686861J5953950m452757k2178898l3701354
58178C87241876l8547126l8362316l5450998l1874916k8917664k6765785k4813029
58171A62510042k2504866j9855561j7190215j4697075j2403971j0372606q678570
58164E6807178p282681o089476n082795m287801l659338l119091k656266k295397
58156B2334333k007323j739890j499254j319850j185849j055164r31442q44077
58148A1751484p82992p16236o48242o02345n67556n17294m60342m22153l95151
58139F639173l55726l11426k84890k68894k42143k12953k03899k08142k02194
$$ plain form
58192 96982522 113182451 132721187 156353307 185017262 219485756 259944435 305506012
58185 305506012 353354298 397934074 431620935 447574885 443122128 420943230 387241876
58178 387241876 348694750 310332434 274881436 243006520 214088856 187323071 162510042
58171 162510042 140005176 120149615 102959400 88262325 75858354 65485748 56807178
58164 56807178 49524497 43435021 38352226 34064425 30405087 27285996 24629730 22334333
58156 22334333 20327010 18587120 17087866 15768016 14582167 13527003 12595561 11751484
58148 11751484 10968492 10252256 9604014 9001669 8434113 7916819 7456477 7034324 6639173
58139 6639173 6283447 5972021 5687131 5418237 5176094 4963141 4759242 4551100 4348906
58130D348906j88087j83590j83998j71948j53017j45053j43319j30955j13045
58121B935894j06674j07609r9480q6013q2553q5095p8475o6440o3791o7199o2630
58110B029935n3459n3011n7243n2525m2971m2828m8890m7100l9839m0386m6453
58099A505230m5048l8095l8023m2858m0219l1666k9283l2116k9072k1485k0279
58088A137086k4145k2295j5772j4946j8917j7858j2701j2615j6140j4412r837
58077I57448j2123j8900j9468j4751j4590j8322j6993j2028j2707j7468j6446
58066G83652j0572r719j3674j3100p911o846r988r172m830n250r911j0292o648
58053F65739p360j2208j2637q290p294j0191r398m724l873p251p370l741l536
$$ plain form
58130 4348906 4160819 3977229 3793231 3621283 3468266 3323213 3179894 3048939 2935894
58121 2935894 2829220 2721611 2622131 2536118 2453565 2368470 2289995 2223555 2159764 2092565 2029935
58110 2029935 1976476 1923465 1866222 1813697 1770726 1727898 1679008 1631908 1592069 1551683 1505230
58099 1505230 1460182 1422087 1384064 1341206 1300987 1269321 1240038 1207922 1178850 1157365 1137086
58088 1137086 1112941 1090646 1074874 1059928 1041011 1023153 1010452 997837 981697 967285 957448
58077 957448 945325 926425 906957 892206 877616 859294 842301 830273 817566 800098 783652
58066 783652 773080 763361 749687 736587 728676 721830 711842 702670 697840 692590 682679 672387 665739
58053 665739 658379 646171 633534 625244 617950 607759 598361 593637 589764 582513 575143 571402 567866
58040E67866p073p162l371k805o118o683m041m418p584o919k923l067p712r578
58026D88412p636q086j1083j0105n327m129p234p576m085l449o739p306l783k417
58012C99457m663m730j483o86l313l529k74O63j861k203Q44J948J99R17M645N545
57996C91476K828K615O308Q095O221N792P991P366K579o89k47o30l369m107k024
57981D30205k080n299o587m733m732p699q432n582m389o466o653l083p48j941
57967C61781k455m58P7k063k380N46K103N74J96K369K619m95k203m99L12j776
57951C58248k846j268j052l544m238j353O05o00r42J754L682K760K605N124O814
57936C65749O086O720J0382J3120J2913J3257J5624J5846J1934Q175P480O689
$$ plain form
58040 567866 560793 553631 550260 547455 541337 534654 530613 526195 518611 511692 508769 505702 497990 488412
58026 488412 480776 472690 461607 451502 446175 442046 434812 427236 423151 419702 412963 405657 401874 399457
58012 399457 394794 390064 388581 387895 384582 381053 380779 381442 379581 377378 378222 380170 380369 381286 385931 391476
57996 391476 394304 396919 403227 411322 417543 423335 431326 438692 441271 440582 440335 439705 436336 432229 430205
57981 430205 428125 422826 416239 411506 406774 399075 390643 385061 380672 374206 367553 364470 363722 361781
57967 361781 359326 358868 358945 356882 354502 355048 357151 357725 357921 360290 362909 362414 360211 359712 360024 358248
57951 358248 355402 354134 353082 349538 345300 343947 344552 343952 343010 344764 348446 351206 353811 358935 365749
57936 365749 371835 378555 388937 402057 414970 428227 443851 459697 471631 479806 487286 493975
57924D93975L352L30k92j191l924n627n211o200r821j1853j0037q103q832r527
57910D17039q046o909p674p504m951l096l553l516j974k416n945q203o694m827
57896C41731n154n071k829j316k083j959O48K365J418J119L091L722J329J36K755
57881C39902N262M348K941L871M236J348j645j370j93j302k897k257r03r40q72
57866C49529M12K37k875n455m653k932l026l115j246L09l71p09J472L530K945
57851C34052K017L166M145K560O69J065J816M86j199j162j303l560n688n327m336
57836C27401m956n642m785m321n597n913l388q99r81j317M61K025J085J97J955
57821B95325L865L042J772L066M765L483Q14J39O97J28m17J033K456R55k071l643
$$ plain form
57924 493975 497327 497657 497365 496174 492250 486623 481412 475212 465391 453538 443501 435398 426566 417039
57910 417039 408993 402084 394410 386906 381955 378859 375306 371790 369816 367400 361455 353252 346558 341731
57896 341731 336577 331506 328677 327361 325278 323319 323967 326332 327750 328869 331960 335682 337011 337147 339902
57881 339902 345164 349512 352453 356324 360560 361908 360263 358893 358700 357398 354501 352244 351341 350401 349529
57866 349529 349941 350178 347303 341848 337195 334263 331237 328122 326876 327185 326814 326105 327577 331107 334052
57851 334052 336069 339235 343380 345940 346609 347674 349490 349976 348777 347615 346312 342752 337064 331737 327401
57836 327401 322445 316803 312018 307697 302100 296187 292799 291900 290919 289602 290063 292088 293173 293370 295325
57821 295325 299190 302232 304004 307070 311835 315318 316132 316271 316968 317096 316679 317712 320168 321123 319052 315409
57805C15409m250n579o219m418k181j966k158l93J600J195o0N97K033J827J107
57790B96544K000K972J639l31m8J303Q12p78q10L35N74L73J334K531K428K294
57774C13172L652M796L814K516L181M120K750L74m98q68k762m758m679m157n649
57759C15004p430o520m253l907m950m608l191k913l226k148m42J70J119M526Q445
57744B85676R325P599O214N432L726K000K057K463P25j990k902k669l667n017
57730C08972m291k577k721l976l500j844j868l268l362k278k372l340k903j548
57716B69124j685k822k493j212j549k913k398l69m4j709k312j007k39r56j349
57701B46067q15r19j803j631j31R22J075J573K301J762J47q58j128j832k602k243
$$ plain form
57805 315409 311159 305580 299361 294943 292762 290796 288638 288245 289845 291040 290980 291577 293610 295437 296544
57790 296544 298544 301516 303155 302824 302776 304079 304891 304113 303303 303638 304212 304585 305919 308450 310878 313172
57774 313172 316824 321620 325434 327950 331131 335251 338001 338375 337877 337009 334247 329489 324810 320653 315004
57759 315004 307574 301054 296801 292894 287944 283336 280145 277232 274006 271858 271416 271586 272705 277231 285676
57744 285676 295001 302600 308814 314246 317972 319972 322029 324492 325217 323227 320325 317656 313989 308972
57730 308972 304681 302104 299383 295407 291907 290063 288195 284927 281565 279287 276915 273575 270672 269124
57716 269124 267439 264617 262124 260912 259363 256450 254052 253683 253639 251930 249618 248611 248372 247416 246067
57701 246067 245252 244333 242530 240899 240768 241690 242765 244338 246639 248401 248548 247690 246562 244730 242128 239885
57685B39885j595k264l189k068N58K327L357N592Q615J0309J1199J3946J8719
57672C05391K3257K7390L3538M2501N2623O2949P3067P9323P5277N7370K8055
57661H60741o303l8145o0463p0090o9834o4987n8093m9442m0739l4294k9445k3938
57649C14968j8196j4521j2687j0421p655o276o012m758k692j974k505k069n98
57636B24604k44j181j374n40m18j008n14Q60R82j83n06J48l38k148k984k160j538
57619B11458j965k317k369l158m222l933k706k430k874k219r04j057k217j772
57605A77315K89J338R57J564L667M822L974K887K453J539J27k45J45p39k621k905
57589A94567j340o50j698k183j115m79j201j406k06N54k09j011q63q85j605j831
$$ plain form
57685 239885 238290 236026 232837 230769 231327 233654 237011 242603 251218 261527 272726 286672 305391
57672 305391 328648 356038 389576 432077 484700 547649 620716 700039 775316 832686 860741
57661 860741 854438 816293 755830 685740 615906 550919 492826 443384 402645 368351 338906 314968
57649 314968 296772 282251 269564 259143 251488 245212 239200 234442 231750 229776 227271 225202 224604
57636 224604 224360 223179 221805 221265 220847 219839 219325 220185 221167 220984 220478 220626 220288 218140 215156 212996 211458
57619 211458 209493 207176 204807 201649 197427 193494 190788 188358 185484 183265 182361 181304 179087 177315
57605 177315 177604 178942 179899 181463 185130 189952 193926 196813 199266 200805 200932 200687 200832 200093 197472 194567
57589 194567 193227 192577 190879 188696 187581 187102 185901 184495 184289 184843 184634 183623 182760 181875 180270 178439
57573A78439j274j221j716j265o4j44j584k055r07j57o20p72k13m68j455j074
57557A63450O85J299M25Q11L093M086K213M16J320L255L575K614J840J059j31
57542A90010p21l12k30r36p84R52K433K192J153L04r40k526k802j276J89M09M79
57525A87594J146J365Q41J071K454L120K168J290J719K330K147K016K394K155
57511B13810R38L1k17j096k720l437l027l230m233m092k729k670m438n216l810
57496A73864k951m434n909n052l262k508j863j53J069K84r17m77P24Q55L45M55
57480A50070P59L91lK63L77k44o96o11j120k340k507j163m05j202j557j98J033
57463A40847N89m8N22R07j38r76n3J174J000N39J244K009J494Q63J343J542J30
$$ plain form
57573 178439 177165 175944 174228 172963 172899 172755 171171 169116 168209 168052 167432 166660 166447 165979 164524 163450
57557 163450 164135 165434 165859 166670 169763 173849 176062 176478 177798 181053 184628 187242 189082 190141 190010
57542 190010 189289 188977 188747 187811 187027 187979 190412 192604 193757 194061 193121 190595 187793 186517 186706 187115 187594
57525 187594 188740 190105 190946 192017 194471 197591 199759 201049 202768 205098 207245 209261 211655 213810
57511 213810 214748 214779 214562 213466 210746 207309 204282 201052 196819 192727 189998 187328 182890 177674 173864
57496 173864 170913 166479 160570 155518 152256 149748 147885 147732 148801 149085 148168 147691 148415 149270 149615 150070
57480 150070 150829 151220 151217 151480 151857 151613 150917 150306 149186 146846 144339 143176 142771 141569 140012 139814 140847
57463 140847 141436 141388 141910 142817 142679 141703 141650 142824 143824 144363 145607 147616 149110 149973 151316 152858 152988
57446A52988j240o97N19M24j23O18J822J748R84J064J510J124M95N26J99j358
57430A60603k492j490L39Q46N12R08J495J017L56R08J633Q18n98n02Q03J453J313
57413A67922J567K054J817J364J755K379K031J169Q54N92m63j441j254p57j073
57398A78516j259o4J446J606J061J359K011J663Q65J014J737J948K236L531M707
57383B02377M261L182L296L970L352J809J177J471J272O18O90J236J063M85O47
57368B30906J025K11j308j671n88O12J360K099K672K558K226K346K356J643J206
57353B47653K170L668M143L711L311K765J771J400K381L273K685J832K424L522
57339B86709L220K056J822K243J885J274J982L441L735K894K541K862K763K384
$$ plain form
57446 152988 151748 151051 151570 151994 151871 152489 154311 156059 157043 158107 159617 160741 161236 161762 161961 160603
57430 160603 158111 156621 156960 157806 158318 159226 160721 161738 162094 163002 164635 165453 164855 164353 165156 166609 167922
57413 167922 169489 171543 173360 174724 176479 178858 180889 182058 182912 183504 183041 181600 180346 179589 178516
57398 178516 177257 177193 178639 180245 181306 182665 184676 186339 187204 188218 189955 191903 194139 197670 202377
57383 202377 206638 209820 213116 217086 220438 222247 223424 224895 226167 226785 227475 228711 229774 230259 230906
57368 230906 231931 232142 230834 229163 228575 229187 230547 232646 235318 237876 240102 242448 244804 246447 247653
57353 247653 249823 253491 257634 261345 264656 267421 269192 270592 272973 276246 278931 280763 283187 286709
57339 286709 289929 291985 293807 296050 297935 299209 301191 304632 308367 311261 313802 316664 319427 321811
57325C21811K688L130K530J686K286L796M205L384K942L211L116K680K971L836
57311C64272M250M515N644P010P068O066N512N504N003M265M460N329N665N612
57297D40175O135O864O901O950Q168R707R992R543R841J0355R702Q770R497J1304
57283E63904J2017J1671J2033J2860J2156R938Q285P781P177O478O897P851P422
57270F86470N942N684O780P019O028O021P773R288R439R647J0898J2068J2387
57257G95444J2845J4040J5118J5739J6760J8128J8509J7717J7212J7591J7904
57246I77007J7947J8785K0342K1055K0562K0361K1159K1883K2023K2447K3241
57235A206812K3140K1913K1012K1098K1159K0757K0932K2071K3063K3318K3631
$$ plain form
57325 321811 324499 327629 330159 331845 334131 337927 342132 345516 348458 351669 354785 357465 360436 364272
57311 364272 368522 373037 378681 385691 392759 398825 404337 409841 414844 419109 423569 428898 434563 440175
57297 440175 446310 453174 460075 467025 475193 484900 494892 504435 514276 524631 534333 543103 552600 563904
57283 563904 575921 587592 599625 612485 624641 634579 642864 650645 657822 664300 671197 679048 686470
57270 686470 692412 698096 704876 711895 717923 723944 731717 741005 750444 760091 770989 783057 795444
57257 795444 808289 822329 837447 853186 869946 888074 906583 924300 941512 959103 977007
57246 977007 994954 1013739 1034081 1055136 1075698 1096059 1117218 1139101 1161124 1183571 1206812
57235 1206812 1229952 1251865 1272877 1293975 1315134 1335891 1356823 1378894 1401957 1425275 1448906
57224A448906K4420K5082K5583K6599K7731K7665K6519K5790K5704K4977K3612
57213A732588K3319K4554K5615K5504K5256K5635K5923K5809K6306K7778K9138
57202B017425K9840L0645L1620L1496K9938K8517K8496K9327K9950L0033K9461
57191B346748K8261K7378K7827K8984K9441K9363K9982L1040L1234L0946L1780
57180B672984L3440L3977L3259L3138L3881L3659L2158L1407L2105L2416L1507
57169C033931L1145L2337L3399L2946L2147L2272L2452L1587L0324K9561K9007
57158C381108K8488K8725K9565K9446K7763K5838K4640K3577K2411K2080K2642
57147C666283K2712K1907K1515K1852K1481K0059J9303J9906K0182J9119J8147
$$ plain form
57224 1448906 1473326 1498408 1523991 1550590 1578321 1605986 1632505 1658295 1683999 1708976 1732588
57213 1732588 1755907 1780461 1806076 1831580 1856836 1882471 1908394 1934203 1960509 1988287 2017425
57202 2017425 2047265 2077910 2109530 2141026 2170964 2199481 2227977 2257304 2287254 2317287 2346748
57191 2346748 2375009 2402387 2430214 2459198 2488639 2518002 2547984 2579024 2610258 2641204 2672984
57180 2672984 2706424 2740401 2773660 2806798 2840679 2874338 2906496 2937903 2970008 3002424 3033931
57169 3033931 3065076 3097413 3130812 3163758 3195905 3228177 3260629 3292216 3322540 3352101 3381108
57158 3381108 3409596 3438321 3467886 3497332 3525095 3550933 3575573 3599150 3621561 3643641 3666283
57147 3666283 3688995 3710902 3732417 3754269 3775750 3795809 3815112 3835018 3855200 3874319 3892466
57136C892466J8356J8521J7517J6313J5883J5429J4297J3555J4051J5014J5996
57125D067398J7961K1163K4220K6707L0187L5225M0117M4100M9034N5938O2729
57114D474779O7695P2582P9780Q8948R9046J11451J28297J49618J74953K06077
57104E653226K45538K94138L52474M23642N11960O20727P53731R17227J117329
57095A0889992J356286J633480J948194K297919K674595L065049L453863L822969
57087C1142347M150113M412245M590477M668050M624426M438954M106207L645680
57079F5778499L090532K464049J768129R95321J50878p37005j624694k466116
57071F9419593l219372l848470m326789m641302m792103m788632m648639m399123
$$ plain form
57136 3892466 3910822 3929343 3946860 3963173 3979056 3994485 4008782 4022337 4036388 4051402 4067398
57125 4067398 4085359 4106522 4130742 4157449 4187636 4222861 4262978 4307078 4356112 4412050 4474779
57114 4474779 4542474 4615056 4694836 4783784 4882830 4994281 5122578 5272196 5447149 5653226
57104 5653226 5898764 6192902 6545376 6969018 7480978 8101705 8855436 9772663 10889992
57095 10889992 12246278 13879758 15827952 18125871 20800466 23865515 27319378 31142347
57087 31142347 35292460 39704705 44295182 48963232 53587658 58026612 62132819 65778499
57079 65778499 68869031 71333080 73101209 74096530 74247408 73510403 71885709 69419593
57071 69419593 66200221 62351751 58024962 53383660 48591557 43802925 39154286 34755163
57063C4755163m072929l701336l310025k920489k550536k211596j908135j641367
57055A2438750j411607j216568j050826r09170p88767o87013n99889n24098m58664
57046D792148m02875l54641l12262k75690k44684k17710j93822j73447j56191
57037B460826j40233j24903j11342r9509q7408p4464o2640n2711m2565l0676j7949
57026A616426m363J2654L4810O1469R2308J25071J47317J37947Q5641M198p6492
57015B236986j33938j63979j72828j67156j52653j34813j16946r9780q4153p1577
57005I39163o1779n2744m3893l6711l1825k8018k4562k2056k0551j9051j7410
56994E80563j6692j7191j7755j7368j5929j3518j0293o912l760j99M204Q351J0779
$$ plain form
57063 34755163 30682234 26980898 23670873 20750384 18199848 15988252 14080117 12438750
57055 12438750 11027143 9810575 8759749 7850579 7061812 6374799 5774910 5250812 4792148
57046 4792148 4389273 4034632 3722370 3446680 3201996 2984286 2790464 2617017 2460826
57037 2460826 2320593 2195690 2084348 1984839 1897431 1822967 1760327 1707616 1665051 1634375 1616426
57026 1616426 1612063 1624717 1659527 1720996 1813304 1938375 2085692 2223639 2309280 2313478 2236986
57015 2236986 2103048 1939069 1766241 1599085 1446432 1311619 1194673 1094893 1010740 939163
57005 939163 877384 824640 780747 744036 712211 684193 659631 637575 617024 597973 580563
56994 580563 563871 546680 528925 511557 495628 482110 471817 464905 461145 460946 465150 473501 484280
56981D84280J1132R250M237l707j1841j7357k0207k1662k1542j9215j5975j3665
56969C63728j1886r059n432k433M8L115O360Q621J0617J4133J9009K3489K7100
56956D47410L0347L1808K8353J8757N159r070k1093k8779l1451l0655k8559k5771
56944C86456k2014j7978j4532j1044o572j948J453M232Q061J3021J8039K3206
56932C80380K9332L5760M0622M2387L9356K9212J1956p694k3677l3818l9470m1516
56920D62830l9873l5922l1845k7811k2829j7871j4987j3760j1885r078p200o646
56908B23123n856m454l700l604k663p23P33J369K326L689M364M569N585P119P750
56893B39627Q014R906J3282J5950J7564K0093K4033K7384K8947K9270K7612K1523
$$ plain form
56981 484280 495412 504662 508899 505192 493351 475994 455787 434125 412583 393368 377393 363728
56969 363728 351842 342783 337351 334918 334966 338081 344441 353062 363679 377812 396821 420310 447410
56956 447410 477757 509565 537918 556675 561834 552764 531671 502892 471441 440786 412227 386456
56944 386456 364442 346464 331932 320888 314316 312368 313821 318053 326114 339135 357174 380380
56932 380380 409712 445472 486094 528481 567837 597049 609005 601311 577634 543816 504346 462830
56920 462830 422957 387035 355190 327379 304550 286679 271692 257932 246047 236969 229769 223123
56908 223123 217267 212813 209113 205509 202846 202123 202856 204225 206551 210240 214604 219173 224758 231877 239627
56893 239627 247641 257547 270829 286779 304343 324436 348469 375853 404800 434070 461682 483205
56881D83205J0733j410j1658j9337k4306k5539k3213j9604j6291j2549p626k461
56869C29944K047O429J1229J6101K1166K7488L5444M4373N4191O5229P5835Q2000
56857G71476P9858O7210M3529J1610k0911m5222n7946o2011o1036n5889m7261
56846F23407l7591k8659j9830j0317q44Q205J7891K8736L9921N1574O5541Q2627
56834H20661J01143J18663J32090J34957J18585P9554K5017l1183p6862j05987
56824A316638j18380j17861j09674r7565q3249o8316n4721m2813l1016j8465o230
56813E68348M835J5525K6817L8831N1960O6862Q2239R4043R7391Q8028O3088K4046
56801A222013k0499n8489q2768r4090r6045r0698q0176o8256n7565m7540l7267
$$ plain form
56881 483205 493938 492528 480870 461533 437227 411688 388475 368871 352580 340031 332405 329944
56869 329944 331991 338420 349649 365750 386916 414404 449848 494221 548412 613641 689476 771476
56857 771476 851334 918544 962073 973683 952772 907550 849604 787593 726557 670668 623407
56846 623407 585816 557157 537327 527010 526166 534371 552262 580998 620919 672493 738034 820661
56834 820661 921804 1040467 1172557 1307514 1426099 1505653 1530670 1499487 1422625 1316638
56824 1316638 1198258 1080397 970723 873158 789909 721593 666872 624059 593043 574578 568348
56813 568348 573183 588708 615525 654356 706316 773178 855417 949460 1046851 1134879 1197967 1222013
56801 1222013 1201514 1143025 1060257 966167 870122 779424 699248 630992 573427 525887 488620
56790D88620k7938k0622j4091o933K64O774J3668K1934L0675L8757M5976N0649
56778F27733M8477L6395J6282o830k8477m5368n4910n6898n4275n0141m5096l8954
56766C47938l2993k8565k5080k1443j8051j5562j3237j0327p704o354n657m768
56754A58197m213m446m469l541k701k933l322k769j984k028k387k189j897k090
56740A17228k094j415j033j632k079j332k96p5l0P83J686J698J228Q89K08q18
56724A12916o94J246L127L049J738R20O95M26N02J191J300Q0r91l23J272K043
56708A28497J865J468O75o33j281n41K93q1q58q41n52p68o37N46J520J110M61
56691A30243R72J725J353O99J099J686J062J35M94J375J038l5j51M71L87k63l52
$$ plain form
56790 488620 460682 440060 425969 419036 419300 426074 439742 461676 492351 531108 577084 627733
56778 627733 676210 712605 728887 722057 693580 648212 593302 536404 482129 431988 386892 347938
56766 347938 314945 286380 261300 239857 221806 206244 193007 182680 174976 168622 162965 158197
56754 158197 153984 149538 145069 141528 138827 135894 132572 129803 127819 125791 123404 121215 119318 117228
56740 117228 115134 113719 112686 111054 108975 107643 107347 107272 107242 108025 109711 111409 112637 113526 113734 112916
56724 112916 112222 113468 116595 119644 121382 122302 122997 123423 123925 125116 126416 126496 125505 125182 126454 128497
56708 128497 130362 131830 132505 131872 130591 130050 130343 130262 129404 128563 128011 127243 126606 127152 128672 129782 130243
56691 130243 131215 132940 134293 134992 136091 137777 138839 138974 139468 140843 141881 141846 141695 142166 142553 142290 141938
56674A41938k17q54j568j059j2R6j83O65K050K151J174Q98J454J380N58L51R20
56657A49742R49N3p63j038j196j193p35n04j309k455k773k588k806k929k023p83
56641A27649m33l95O55K176K641K240K301K661K204J352J507K373K441J711J458
56626A52541J562P35p73j205j55R16J070P53K53o34j406j224m55j87m20l39L3
56609A51065J67L72J093J549Q41k62n19l25o87j092n49K65J79j33O21J740J703
56592A56028J011J166J731J192M4NP50M79o11n38R41J898J471P77N28L22L15J120
56574A68629K114K105J553J769K425K322K042K973M268L981K891L831P118J0023
56560B18044J1096J1792J3201J4210J3714J1988R240N380J751M60J268J641M21
$$ plain form
56674 141938 141721 140867 139299 138240 138228 138324 138141 138806 140856 143007 144181 145079 146533 147913 148471 148822 149742
56657 149742 150691 150744 149981 148943 147747 146554 145819 145315 144006 141551 138778 136190 133384 130455 128432 127649
56641 127649 127216 126821 127476 129652 132293 134533 136834 139495 141699 143051 144558 146931 149372 151083 152541
56626 152541 154103 154838 154065 152860 152705 153621 154691 155444 155697 155063 153657 152433 151978 151791 151371 151032 151065
56609 151065 151232 151604 152697 154246 155087 154825 154306 153981 153294 152202 151653 151918 152097 151964 152585 154325 156028
56592 156028 157039 158205 159936 161128 161172 161177 161927 162406 161795 161257 162198 164096 165567 166344 166872 167194 167509 168629
56574 168629 170743 172848 174401 176170 178595 180917 182959 185932 190200 194181 197072 200903 208021 218044
56560 218044 229140 240932 254133 268343 282057 294045 303285 308665 310416 310876 312144 313785 314206
56547C14206r03j056o75n44n07o86j647k919l381l278l732m369l819k534k445
56532B81711l722m539m318m388n144n328m605m129m008k929q83L64J89p9R8m88
56516B37802k240l770m183m117l903k985j740j536k383k786k352k265k832k931
56502A97779k317k008k080j481l57r5p26q25k11j43o51m49L50K59n84m40P32J085
56484A87838L25J54Q35O19p63j384o33j49m12J92J917K622J499N41J055J749J582
56467A97587J474J902J774R18P29J225N99j163j568J46J485R45L07R94J483M45
56451B09282o68m54n5o38j064k06Q47R90J093J882K208J283M26P55J388J444J516
56434B20029J713Q36r93j626l67O13o0p52p5O61K42p5P71J391O09k02K53P13j17
$$ plain form
56547 314206 313303 312247 311572 311028 310521 309835 308188 305269 301888 298610 294878 290509 286690 284156 281711
56532 281711 277989 273450 269132 264744 259600 254272 249667 245538 241530 238601 237718 238082 238271 238192 238290 237802
56516 237802 235562 231792 227609 223492 219589 216604 214864 213328 210945 208159 205807 203542 200710 197779
56502 197779 195462 193454 191374 189893 189536 189441 188715 187890 187679 187536 186885 186436 186786 187045 186461 186021 186753 187838
56484 187838 188163 188317 189152 189771 189008 187624 186991 186842 186430 186622 188539 191161 192660 193201 194256 196005 197587
56467 197587 199061 200963 202737 203655 204384 205609 206208 205045 203477 203623 205108 206053 206360 207354 208837 209282
56451 209282 208614 208160 208105 207467 206403 206197 207044 208034 209127 211009 213217 214500 214926 215681 217069 218513 220029
56434 220029 221742 222578 221585 219959 219592 220205 220145 219393 219318 219979 220221 220146 220917 222308 222917 222715 222968 223681 223564
56415B23564r79k77J169J777J642J363N77n81p34K95N74p46j816j313o09r09r89
56398B22008J83J237R11K07P5m46j753k082m82J273J816K467M362O185O924P915
56382B50800R881J0904R745Q084P122N171J338j803k242j976l266m580l791k424
56368B82963k917m243m045k859k488k351j066K90N8o45L6J173R03PL46J384J531
56351B68077J280J871K482J831Q54Q99J038N8q48k63O10K59j80O87J566J070Q54
56334B82145K664M661M292K626K025J850M76o15Q84L517M058K680J990K264J810
56319C17327P94O83Q60k38j567r48R19J540Q60P78J424J374P64P69R53L58J00
56302C26750J657L793M406M086M540N072M096K656K751L597L179K095K277L235
$$ plain form
56415 223564 222585 222308 223477 225254 226896 228259 228836 228255 227521 227816 228390 227644 225828 224515 223906 222997 222008
56398 222008 222191 223428 224339 224546 224621 224175 222422 220340 219858 221131 222947 225414 229776 235961 242885 250800
56382 250800 260681 271585 281330 289414 296536 301707 303045 301242 299000 297024 293758 289178 285387 282963
56368 282963 280046 275803 271758 268899 266411 264060 262994 263284 263342 262697 262733 263906 264809 264816 265162 266546 268077
56351 268077 269357 271228 273710 275541 276395 277294 278332 278390 277542 277279 277889 278148 277968 278655 280221 281291 282145
56334 282145 284809 289470 293762 296388 298413 300263 300739 300124 301008 304525 308583 311263 313253 315517 317327
56319 317327 318121 318804 319664 319426 317859 316911 317830 319370 320230 321008 322432 323806 324570 325339 326292 326650 326750
56302 326750 328407 332200 336606 340692 345232 350304 354400 357056 359807 363404 366583 368678 370955 374190
56288C74190L250K875L566M400L893L448N106P403P541O192N950O586O154N383
56274D45937O477Q612R132Q316Q672J0325J1316J1594J2644J4013J4255J4322
56262E75615J6032J8303J9043J9486K2355K6885L0169L2366L6068M1495M6858
56251H84675N2502O0121O8657P5517Q1107Q7794R5214J01026J05287J09619J13000
56240A834519J12891J09572J04868R7826Q6258P1290N5614L8666J8545k669k0921
56229B506459l6248n1441o5901p6527q3616r0037r5384r6827r5066r3472r1947
56218A629993q7707q1523p7016p4073o9288o2803n8226n5770n1832m5807m0982
56207I24966l8212l4884l0676k8278k7652k5615k1817j9281j8485j6734j3836
$$ plain form
56288 374190 377440 380315 383881 388281 392174 395622 400728 408131 415672 421864 427814 434400 440554 445937
56274 445937 452414 461026 470158 478474 487146 497471 508787 520381 533025 547038 561293 575615
56262 575615 591647 609950 628993 648479 670834 697719 727888 760254 796322 837817 884675
56251 884675 937177 997298 1065955 1141472 1222579 1310373 1405587 1506613 1611900 1721519 1834519
56240 1834519 1947410 2056982 2161850 2259676 2345934 2417224 2472838 2511504 2530049 2527380 2506459
56229 2506459 2470211 2418770 2352869 2276342 2192726 2102689 2007305 1910478 1815412 1721940 1629993
56218 1629993 1542286 1460763 1383747 1309674 1240386 1177583 1119357 1063587 1011755 965948 924966
56207 924966 886754 851870 821194 792916 765264 739649 717832 698551 680066 663332 649496
56196F49496j2414j2164r978o244m770n810n572l291k342l488l563j813j180k148
56182E74719j784R2K19j570j598P67J947R57P16J598N92j917j677J689L501K196
56166E80447J577L241M065L148L908P033Q521P170O930R319J0651R317Q818J0840
56152F74985J2220J1577J2071J4900J6886J7131J9133K3812K7619L0056L5517
56141H95907M4937N3439N9504O8454Q3091R8553J10418J20116J27949J28467J18078
56130A908913J01087Q3658O7888N5484N0251N2173N4920N3209M7150L6860K0233
56119B531826m12j6966k5075k8565l1476l3405l6103m5841o4237q4191r9514j11081
56107A954960j19535j20517j12469j01200r1253q0273o6769n5270m8265m1132
$$ plain form
56196 649496 637082 624918 614940 608696 603926 598116 592544 589253 586911 583423 579860 578047 576867 574719
56182 574719 572935 573027 573246 571676 570078 570845 572792 573749 574465 576063 576655 574738 573061 574750 578251 580447
56166 580447 582024 585265 589330 592478 596386 603419 611940 619110 626040 635359 646010 655327 664145 674985
56152 674985 687205 698782 710853 725753 742639 759770 778903 802715 830334 860390 895907
56141 895907 940844 994283 1053787 1122241 1205332 1303885 1414303 1534419 1662368 1790835 1908913
56130 1908913 2010000 2093658 2161546 2217030 2267281 2319454 2374374 2427583 2474733 2511593 2531826
56119 2531826 2531414 2514448 2489373 2460808 2429332 2395927 2359824 2313983 2249746 2165555 2066041 1954960
56107 1954960 1835425 1714908 1602439 1501239 1409986 1329713 1262944 1207674 1159409 1118277
56097A118277l0869k1996j7980j4815r115m676m673n059k086J055J264J643M552
56084A015522O205M388L682O890R213P275N691Q163J0360Q502O662Q560J0425
56071A111538R110Q840J2641J5557J3825J2223J4888J7531J6331J5541J8498K0310
56059A286833J7548J5749J8887K1133J7745J4417J6506J8946J6543J4352J7697
56048A476356K1547K0300J8507K1359K4161K2079K0442K4372K8069K5798K3392
56037A726382K7182L1698L0602K9393L4433L9676L7692L3873L6128M0276L9513
56026B106848L8435M3455M9101M8149M5715M9033N3272N1913N0675N6359O2671
56015B655626O2306O1846O8909P6380P5925P4931Q2676R2039R3141R2540R9899
$$ plain form
56097 1118277 1087408 1065412 1047432 1032617 1023502 1018826 1014153 1009094 1007008 1008063 1009327 1010970 1015522
56084 1015522 1021727 1026115 1029797 1036687 1045900 1053175 1058866 1067029 1077389 1085891 1092553 1101113 1111538
56071 1111538 1120648 1129488 1142129 1157686 1171511 1183734 1198622 1216153 1232484 1248025 1266523 1286833
56059 1286833 1304381 1320130 1339017 1360150 1377895 1392312 1408818 1427764 1444307 1458659 1476356
56048 1476356 1497903 1518203 1536710 1558069 1582230 1604309 1624751 1649123 1677192 1702990 1726382
56037 1726382 1753564 1785262 1815864 1845257 1879690 1919366 1957058 1990931 2027059 2067335 2106848
56026 2106848 2145283 2188738 2237839 2285988 2331703 2380736 2434008 2485921 2536596 2592955 2655626
56015 2655626 2717932 2779778 2848687 2925067 3000992 3075923 3158599 3250638 3343779 3436319 3536218
56004C536218J08432J08628J08364J18456J31051J34250J35138J45718J59103
55995D685358J63370J65816J78812J94824K00985K05143K21053K41308K52397
55986F509066K62543K85997L14236L32580L50356L83297M21795M49641M77800
55977I787311N24606N79689O24763O72099P42727Q25478R00468R83422J100758
55968A6741321J241329J382756J544088J758686K017955K301282K638481L078887
55960C2704785L624963M268035N061523O078399P327097Q802323J0586966J2799378
55952I1253469J5480917J8668473K2538223K7297385L2898019L8901536M4377307
55945B91415329M7530966M5605583L6118625J9109665j805489k1170583l4879682
$$ plain form
56004 3536218 3644650 3753278 3861642 3980098 4111149 4245399 4380537 4526255 4685358
55995 4685358 4848728 5014544 5193356 5388180 5589165 5794308 6015361 6256669 6509066
55986 6509066 6771609 7057606 7371842 7704422 8054778 8438075 8859870 9309511 9787311
55977 9787311 10311917 10891606 11516369 12188468 12931195 13756673 14657141 15640563 16741321
55968 16741321 17982650 19365406 20909494 22668180 24686135 26987417 29625898 32704785
55960 32704785 36329748 40597783 45659306 51737705 59064802 67867125 78454091 91253469
55952 91253469 106734386 125402859 147941082 175238467 208136486 247038022 291415329
55945 291415329 338946295 384551878 420670503 439780168 437974679 416804096 381924414
55938C81924414m1922368m3599641m1775135l7949212l3238460k8441700k3974245
55931A31023653j9966434j6487425j3594334j1240806r304577p711633o441087
55924D6277357n434463m600940l900703l339505k892101k505269k164994j891201
55916A9548181j673848j476143j292655j146031j032402r23479q16891p34271
55908A0452461o74013o12631n48799n02034m71100m35179l93328l63647l45746
55899F105984l21320k89902k68507k57435k40167k15955k00166j93199j80032
55890C939301j60031j47666j43829j34808j19476j10263j07249r7707q1452p1015
55880B765805o6402n4876l6757k7193l0646l6378m0494n0256o4903p3743p5507
$$ plain form
55938 381924414 340002046 296402405 254627270 216678058 183439598 154997898 131023653
55931 131023653 111057219 94569794 80975460 69734654 60430077 52718444 46277357
55924 46277357 40842894 36241954 32341251 29001746 26109645 23604376 21439382 19548181
55916 19548181 17874333 16398190 15105535 13959504 12927102 12003623 11186732 10452461
55908 10452461 9778448 9165817 8617018 8114984 7643884 7208705 6815377 6451730 6105984
55899 6105984 5784664 5494762 5226255 4968820 4728653 4512698 4312532 4119333 3939301
55890 3939301 3779270 3631604 3487775 3352967 3233491 3123228 3015979 2918272 2836820 2765805
55880 2765805 2699403 2644527 2607770 2580577 2549931 2513553 2473059 2422803 2357900 2284157 2208650
55869B208650p9583q6499q6629p9507p5180p5030p0129n9932n4131n4358n1958
55858A435714m5447m2606m3825m0678l2698k8673k9644k7314k1002j9588k4500
55847A079739k7004k4616k4399k7654k7003k1340j8566k0573k0185j5702j4104
55836H38593j6900j6955j2440j0250j2463j2749r280q145j0830j1111p510o334
55824G03626r246j0094p142o399r666j1214r315r325j2296j2269q014n921q010
55811E84715q463n248l824n929n910j839P57j81N72M853P389O398P197J1425J3218
55796F05130J0205P880Q702P272R27m858o499q094j2327j4891j3041j0837j0926
55783E58643r780o048n126j0044j5694j7207j6678j6858j5642j1608p989o507
$$ plain form
55869 2208650 2129067 2042568 1955939 1876432 1801252 1726222 1656093 1596161 1542030 1487672 1435714
55858 1435714 1390267 1347661 1303836 1263158 1230460 1201787 1172143 1144829 1123827 1104239 1079739
55847 1079739 1052735 1028119 1003720 976066 949063 927723 909157 888584 868399 852697 838593
55836 838593 821693 804738 792298 782048 769585 756836 747556 739411 728581 717470 709960 703626
55824 703626 694380 684286 677144 670745 661079 649865 640550 631225 618929 606660 598646 592725 584715
55811 584715 576252 571004 567180 561251 555341 553502 554259 554078 554650 559503 566892 573290 580487 591912 605130
55796 605130 615335 623215 631917 639189 640116 635258 628759 620665 608338 593447 580406 569569 558643
55783 558643 548863 542815 537689 527645 511951 494744 478066 461208 445566 433958 425969 419462
55771D19462l957J040M683M985N106O111L977k344p400p914p624r354r808o874
55757C90089m624o029p488n673l289l214l174j251n31l301o236o205n440o477
55743C27157p329o069m932n609n641l513k122l266m044k490j418k716l358j173
55729B73477Q56J25j013l69l43k981n605n592m760n109m972l149k012k790k715
55714B33048m67P84n69r20K120N064M661L307L910M511K758Q25J033J147j241
55699B59971l978m613m993p047q358o668m593n032n911m262j702j070j263j06
55685B00375J145O96K57J750L286K737J913L045M453L945L035L624L930J958l43
55670B35806o70p12k651m614m007k247j809j700j45J319O84m37K36J483J388J298
$$ plain form
55771 419462 415505 416545 421228 426213 431319 437430 441407 439063 431663 423749 416125 406771 396963 390089
55757 390089 385465 379436 371948 366275 362986 359772 356598 355347 354816 351515 345279 339074 333634 327157
55743 327157 319828 313759 308827 303218 297577 294064 291942 288676 284632 282142 280724 278008 274650 273477
55729 273477 274333 274458 273445 273076 272733 269752 264147 258555 253795 248686 243714 240565 238553 235763 233048
55714 233048 232581 233365 232796 231876 233996 239060 243721 247028 250938 255449 258207 259032 260065 261212 259971
55699 259971 255993 251380 246387 239340 230982 224314 219721 214689 208778 204516 202814 201744 200481 200375
55685 200375 201520 202216 202473 204223 207509 210246 212159 215204 219657 223602 226637 230261 234191 236149 235806
55670 235806 235136 234424 231773 227159 223152 220905 219096 217396 217251 218570 219254 218817 219053 220536 221924 223222
55654B23222K912M517M095L197L659L772J820J56J214K667J161k033l727m334
55640B42298n894p396o901n962p059q812q318o184m888m242k846j805k651l654
55626A65686k584j008j450k602j804j16k04j212n50R39N06j309j722q19j072k640
55610A48039l402k874k332j879r35m56j313j884n56J010N60p35n84J45o71k072
55594A30061j684j11L62p9J52M55n09j409l17J342J010m22l29R04J078O54J640
55577A32798L326L504K859L758N646O001N044N226O724P542P404P559P372N130
55563B09893J764j61o34j741l711n088o037p722r118q272o026m864m738l805k362
55548A47378k253l089k965k245k733l782l224j490q72j231m77J223J736J077J206
$$ plain form
55654 223222 226134 230651 234746 237943 241602 245374 247194 247350 248564 251231 252392 250359 246632 242298
55640 242298 236404 229008 222107 216145 209086 200274 191956 185772 180884 176642 173796 171991 169340 165686
55626 165686 163102 162094 160644 158042 156238 156122 155918 154706 154156 155095 155601 154292 152570 151751 150679 148039
55610 148039 144637 141763 139431 137552 136617 136161 134848 132964 132408 133418 133978 133243 132659 132804 132133 130061
55594 130061 128377 128266 128628 128549 128701 129156 128647 127238 126921 128263 129273 128851 128522 129426 130504 131158 132798
55577 132798 136124 139628 142487 146245 151891 157892 162936 168162 174886 182428 189832 197391 204763 209893
55563 209893 211657 211496 210862 209121 205410 200322 194285 186563 177445 169173 163147 158283 153545 149740 147378
55548 147378 145125 142036 139071 136826 134093 130311 127087 125597 124725 123494 123017 124240 125976 127053 128259
55533A28259K038J649K37q7O90N31p25j283j009j386k142j749j006k107m286m522
55517A13102k647j638k669l824m148m884o138o042m052j689M56L188N882O630
55503I1527N608M986N209M668L177K373K382J598N2n27k69j165l160l868k740
55488A09851j917k254k097q14n6n15o91P7M00l11p14j48L07J49K03N15J09p21
55470A01373n58L78L75o62j040m56l34q57o42L06M48k50k35N18M30m28l56N21
55452I8531L12q34o30J117J856P09j92L43P48O5l63K19N80K07L46J136Q82p41
55434A04291j710j111n55r74j019P0R24P00M99R10Q50J8j59P86J445J253J399
55417A07617K053J629o9r02J42J423J719J976K689K520R32n44j046j747l095l516
$$ plain form
55533 128259 130297 131946 132183 132096 132786 133317 132592 131309 130300 128914 126772 125023 124017 121910 117624 113102
55517 113102 110455 108817 106148 102324 98176 93292 87154 81112 77060 75371 75827 79015 84897 91527
55503 91527 97135 102121 107330 111998 115175 117548 119930 121528 121580 121053 120784 119619 116459 112591 109851
55488 109851 107934 105680 103583 102769 102713 102198 101507 101584 101984 101673 100959 100811 101118 101267 101470 101985 102094 101373
55470 101373 100815 101193 101568 100906 99866 99410 99076 98219 97577 97883 98331 98081 97846 98364 98794 98366 98010 98531
55452 98531 98843 98009 97379 98496 100352 101061 100869 101212 101960 102025 101662 101881 102461 102668 103014 104150 105032 104291
55434 104291 102581 101470 100915 99941 98922 98992 99916 100616 101115 102025 102875 102893 102734 103520 104965 106218 107617
55417 107617 109670 111299 111230 110328 110470 111893 113612 115588 118277 120797 121729 121185 120139 118392 115297 111781
55401A11781k348j353j724k162j415l30L7O7j7q81k114j947k17R25L81l82l02
55384I7999l70j071j031K45R91J12j069j376j518j891j387P2O17m60j361j058
55368H7444j026k119k628j349K79J010J944L778M700L365J438Q24P64n8q33m60
55352I7073J77O9J04J017J485M99l92L25J352Q02o24j133q43q89j101q17o09j067
55334I5428j268l82O22P10O15J140J378N13l49j45J20o34j315o33M27L54j68K95
55316I6708J163R81J35N7O58P38J79k37m31p52q30l23J03j31m01j67j13p13r59
55297I5665j9J142J282P58N50O02M66L54L74Q9k37M19J726J814L09o71R2R28K77
55278A05920p10n41o4n38j121o43L6k65o50J08J057P40j36j24K58l01j257j110
$$ plain form
55401 111781 109433 108080 106356 104194 102779 102449 102486 102553 102536 101655 99541 97594 97377 98302 98683 98301 97999
55384 97999 97629 96558 95527 95772 96763 96875 95806 94430 92912 91021 89634 89706 90323 89863 88502 87444
55368 87444 86418 84299 81671 80322 80601 81611 83555 87333 92033 95398 96836 97660 98424 98366 97533 97073
55352 97073 97250 97319 97423 98440 99925 100424 100032 100357 101709 102511 101887 100754 99911 99022 97921 97104 96495 95428
55334 95428 94160 93778 94400 95110 95725 96865 98243 98756 98407 98262 98382 97748 96433 95800 96227 96581 96413 96708
55316 96708 97871 98852 98987 99044 99702 100440 100619 100382 99951 99199 98369 98046 98149 98018 97617 97450 97337 96624 95665
55297 95665 95646 96788 98070 98828 99378 99980 100446 100800 101174 101263 101026 101445 103171 104985 105294 104623 104715 105643 105920
55278 105920 105210 104669 104605 104067 102946 102303 102339 102074 101424 101532 102589 103329 103193 103069 103327 103026 101769 100659
55260A00659M2J029J649K263K355J460M29Q5j58p45o43O66J545O40p61r42o34
55243A08939j329k304j908n17L49O66J256J531M39j256j920j532j181r89m98j18
55227I9628k69j80O99J258O22r0K57O62l9p50q2Q75L31j089j642j390j302q21
55209I6678Q19K197J575Pk79M55L66m43m11L36L70j69J7O77N41l1K50Q97M57n95
55189A03714n63L93P29M85R13J633J140k45q59p37j270k201j944p25l30q82p71
55172I8480K28O88M14O65J396J194J28j88L76K17q42j033J98J208R90M93M80M04
55154A05496N8J29N49L50l70m20K37L03m54o98J35R88J021N35j71r81j100J13
55136A05720J495J302k3m99J64L71l93q70m61J6K62Q69J535J195O5n61n76q99
$$ plain form
55260 100659 100701 101730 103379 105642 107997 109457 109886 109971 109813 109068 108425 109091 110636 111276 110515 109573 108939
55243 108939 107610 105306 103398 102881 103230 103896 105152 106683 107122 105866 103946 102414 101233 100244 99746 99628
55227 99628 99359 99179 99878 101136 101758 101668 101925 102587 102548 101798 101716 102591 102922 101833 100191 98801 97499 96678
55209 96678 97497 99694 101269 101276 100997 101452 101818 101375 100964 101300 101670 101501 101518 102195 102736 102705 102955 103852 104309 103714
55189 103714 103151 103544 104273 104758 105671 107304 108444 108199 107340 106603 105333 103132 101188 100463 100133 99251 98480
55172 98480 98708 99396 99810 100475 101871 103065 103193 103005 103381 103598 102756 101723 101921 103129 104119 104612 105092 105496
55154 105496 105554 105683 106232 106582 106212 105792 106029 106332 105878 105180 105315 106303 107324 107859 107688 106707 105607 105720
55136 105720 107215 108517 108494 107995 108159 108530 108137 107267 106806 106822 107084 107953 109488 110683 110748 110187 109611 108712
55118A08712j159j62J452J692N60L3N40L64r09j440m21N05J82l57j70J14J39O75
55100A10350J665J739P85O00J813K576J600K58J49O91O42K45K65M09J61r3M9J72
55082A24076o4l12m84r71j477j105p4L12j94m41n2n0p17r36l19J9l46k27R71J979
55062A19588J634M76n55j323j690j204l13k04p79o24M70R85L51q3L59M51l85o67
55044A16487N91J953J780O35j26n14j054j222m16P23J334J567J662J088k01r64
55028A23323l69O03O39j75j060j814k307j851k81J294J781J334O47K9k48J37P77
55011A22459Q25M42N69R78L65j159j661l24J177J265O01M16N09K18j24o0k2k63
54993A26211q1Q41J589J534J251J092L23j190k132j713j015j109j322p19J30K75
$$ plain form
55118 108712 107553 107391 108843 110535 111095 111128 111668 112032 111123 109683 109262 109767 109949 109592 109422 109536 109675 110350
55100 110350 112015 113754 114539 115139 116952 119528 121128 121386 121535 122226 122868 123113 123378 123787 123948 123855 123904 124076
55082 124076 124012 123700 123216 122245 120768 119663 119589 119901 119707 119266 119214 119164 118447 117511 117192 117211 116865 116638 117609 119588
55062 119588 121222 121698 121143 119820 118130 116926 116613 116409 115630 115006 115476 116461 116812 116729 117088 117539 117154 116487
55044 116487 117078 119031 120811 121446 121320 120806 119752 118530 118114 118837 120171 121738 123400 124488 124287 123323
55028 123323 122954 123557 124196 124021 122961 121147 118840 116989 116708 118002 119783 121117 121764 121793 121545 121682 122459
55011 122459 123284 123726 124295 125273 125638 124479 122818 122494 123671 124936 125537 125953 126462 126680 126556 126496 126474 126211
54993 126211 126130 126971 128560 130094 131345 132437 132760 131570 129438 127725 126710 125601 124279 123560 123690 123965
54977A23965N0J95M68L78K57M28L64k56p06m37l2l1M6N74R87R13Q76J021N46o51
54957A28955j282n61O13J285J688J945J312j47q94k40M00j22p73l18M80L58k87
54940A32412m47l74o97r50o60o07j373j806p55Q63J456J156J147J620K090K798
54924A35873M079N158N244N050N707O893P499P390P072O427N165L760K666J297
54910B09280r62l533n521o816p382o666m938l855m299m912m225k930k478k730
54896A48033k729k615k890k897j873o33m00p47m54M05R20J068J363J596J565K153
54880A41865L935N657N879N346N824P307Q294Q156P417O195M251K103M35j229
54866B11435l616o028p170p163p106p144o558n344m164l083j857r48r19j320j442
$$ plain form
54977 123965 124015 124210 124678 125056 125313 125741 126105 125849 125143 124706 124674 124643 124689 125263 126250 127163 128039 129060 129606 128955
54957 128955 127673 127112 127725 129010 130698 132643 133955 133808 132914 132674 133074 132952 132179 131861 132341 132699 132412
54940 132412 131965 131591 130894 129944 129284 128677 127304 125498 124743 125606 127062 128218 129365 130985 133075 135873
54924 135873 139952 145110 150354 155404 161111 168004 175503 182893 189965 196392 201557 205317 207983 209280
54910 209280 208318 204785 199264 192448 185066 178400 173462 169607 165308 160396 156171 153241 150763 148033
54896 148033 145304 142689 139799 136902 135029 134396 133996 133249 132795 133200 134120 135188 136551 138147 139712 141865
54880 141865 145800 151457 157336 162682 168506 175813 184107 192263 199680 205875 210126 212229 212664 211435
54866 211435 207819 201791 194621 187458 180352 173208 166650 161306 157142 154059 152202 151254 150335 149015 147573
54851A47573j511j884j987j406j072j788k556k072r04l89l83LL71j96j092j061
54835A29646m37m64r88r27m32m46o71j25P19O16q4N6R85J309P68L31M1q70j896
54816A27131j613k20N90L97M60J132J198K12o44n60r5K80Q30J387J222M78Q6N9
54798A32330m00j029o98L79P05O5q2P42J151M33j84K32P25K59m99m62J82O82J045
54779A35576J534J883J922K171K928L562L396K607J819J432J779L059M794O091
54765A74553O781P445Q185Q310P508O365N336M142K483O02j238l113n052o829
54751B15478q211q949q686p492o163n321m629l630k738k364j886p39J94j10p81
54736A53973k40J101J370L34k31N56J506J623J523J852K077J788J754K652L981
$$ plain form
54851 147573 146062 144178 142191 140785 139713 137925 135369 133297 132393 132004 131621 131624 131995 131799 130707 129646
54835 129646 129209 128745 127757 126830 126398 125952 125281 125156 125875 126491 126407 126463 127448 128757 129525 129856 129897 129027 127131
54816 127131 125518 125298 125888 126285 126745 127877 129075 129287 128643 128083 127988 128268 129098 130485 131707 132185 132271 132330
54798 132330 131930 130901 130203 130582 131287 131352 131270 132012 133163 133596 133412 133644 134369 134628 134129 133667 133849 134531 135576
54779 135576 137110 138993 140915 143086 146014 149576 152972 155579 157398 158830 160609 163668 168462 174553
54765 174553 181334 188779 196964 205274 212782 219147 224483 228625 231108 231710 230472 227359 222307 215478
54751 215478 207267 198318 189632 182140 175977 170656 166027 162397 159659 157295 155409 154670 154864 154754 153973
54736 153973 153733 154834 156204 156538 156307 156863 158369 159992 161515 163367 165444 167232 168986 171638 175619
54721A75619N018N869O790P361P036N778L748J115j538l470m689n746o514o183
54707A90194m707l276k962l700m709n168m477k815j404j302k008k195j592j019
54693A48860q14n47k27l68q19p30R5R57J357J217K51j553l031k840j349j74K2
54676A40307j51m15j044j544r70K87P51J51k50J30L88n9n46n47m31m17j49L00
54658A35791L79K10L20K80p27j954j706r5R10N46J40M35L37o99j331n52O75J258
54640A34217J648K313K356J140k11m06J43M03M16O46P50L45k9O2k2p82j404r85
54622A40600j03J02m17q70q80m77L74J394J809J342P17N81O86O91P58Q37M20l73
54604A47191o45k65k87j069j398m38P34Q27L35M89J155J149J43r67j211l23J196
$$ plain form
54721 175619 180637 186506 193296 200657 207693 213471 217219 218334 216796 213326 208637 202891 196377 190194
54707 190194 185487 182211 179249 175549 170840 165672 161195 158380 156976 155674 153666 151471 149879 148860
54693 148860 148046 147499 147272 146904 146085 145355 145450 146407 147764 148981 149232 147679 144648 141808 140459 140285 140307
54676 140307 140156 139741 138697 137153 136183 136470 137221 137372 137122 137252 137640 137581 137035 136488 136057 135640 135491 135791
54658 135791 136170 136380 136700 136980 136253 134299 132593 132498 133408 133954 134094 134529 134866 134167 132836 132284 132959 134217
54640 134217 135865 138178 140534 141674 141463 141057 141200 141603 142019 142665 143415 143760 143731 143793 143771 142989 141585 140600
54622 140600 140497 140599 140182 139312 138432 137955 138329 139723 141532 142874 143591 144172 144858 145549 146307 147144 147564 147191
54604 147191 146546 146281 145994 144925 143527 143089 143823 144650 144985 145474 146629 147778 147921 146954 145743 145420 146616
54587A46616K215J824M62n39p93j207k121k560j977j236r56l62J060K168J797
54572A44391O68K36M94L88k84q04q36o63m28j49o2j73k1N50R42Q02O31P92Q00
54553A47274L35k1J18J58l05n12J84J066J168P77P19R79J096J204J555J694J220
54536A58709O86P01P83K05o90j074r40q30p34l45J05J95M2n5k50o02o27r5L06
54517A55490o1p84j155j164r93l58P68J549J352O82J99l75j366k061j657o44p4
54500A49348m0O8L40M72N93R55J219R30L03k35p37j235j212l81O37J252J740K366
54482A56383K519J651L85l87o96r02o72K86J239J341R44Q71J030Q81P03J079J678
54465A68333J690J155P22M33j56q77j070n88N2M25L99p3p76j209j219j210j357
$$ plain form
54587 146616 148831 150655 151117 150578 149785 148578 146457 143897 141920 140684 139728 139366 140426 142594 144391
54572 144391 145059 145295 145789 146177 145893 145089 144253 143590 143162 143013 142951 142778 142757 143307 144249 145051 145682 146474 147274
54553 147274 147609 147588 147706 147864 147559 147047 147231 148297 149465 150242 150961 151940 153036 154240 155795 157489 158709
54536 158709 159395 160096 160879 161084 160394 159320 158380 157550 156816 156471 156576 156771 156813 156758 156508 155906 155279 155184 155490
54517 155490 155429 154645 153490 152326 151333 150975 151743 153292 154644 155326 155525 155150 153784 151723 150066 149422 149348
54500 149348 149308 149376 149716 150188 150781 151736 152955 153885 154188 153953 153216 151981 150769 150388 151025 152277 154017 156383
54482 156383 158902 160553 160938 160551 159855 158953 158281 158567 159806 161147 162091 162962 163992 164873 165576 166655 168333
54465 168333 170023 171178 171900 172333 172177 171300 170230 169642 169694 170119 170518 170445 169669 168460 167241 166031 164674
54448A64674j282q06k62K98J160J869J442J28m90J10N16j80q39m31J7o32j407
54431A63885q45M45R25P02Q54J174P82K73Q69J976J828L73o67n47k16k42m6M75
54413A71998M52l99j189j283j021p41k61L81P24O15L16m0l36n4R52J766J534Q64
54395A74278Q94J402J302N49J74N12Q92Q84N89q2j098j573p71M38N84j97n23r3
54377A78161R0k72k84L77R31R77J061J355J207M44j00J73Q69J329J227L63j085
54360A86823k046j440L45J786K090J670J047M07J64P28J644K090K145K416K608
54345B02477J843K75r61j464j824k249k322k185k529l170l070k033j099r62j190
54330A79537j210r42l04O90J309Q11k31n49j46j73q18r28m1P58N11m11j226j653
$$ plain form
54448 164674 163392 162586 162324 162622 163782 165651 167093 167221 166731 166841 167357 167177 166338 165907 165924 165292 163885
54431 163885 163040 163485 164410 165112 165966 167140 167922 168195 169064 171040 172868 173241 172574 172027 171811 171569 171523 171998
54413 171998 172450 172051 170862 169579 168558 167817 167556 167937 168661 169276 169592 169552 169216 169162 170114 171880 173414 174278
54395 174278 175172 176574 177876 178425 178599 179111 180003 180887 181476 181394 180296 178723 177952 178390 178974 178777 178254 178161
54377 178161 178251 177979 177695 178072 179003 179980 181041 182396 183603 184047 183947 184120 184989 186318 187545 187908 186823
54360 186823 184777 183337 183682 185468 187558 189228 190275 190682 190846 191574 193218 195308 197453 199869 202477
54345 202477 204320 204595 203634 202170 200346 198097 195775 193590 191061 187891 184821 182788 181689 180727 179537
54330 179537 178327 177385 177081 177771 179080 179891 179660 179111 178965 178792 177974 177046 177005 177763 178274 177863 176637 174984
54312A74984j566q98k44l42q17o34J01J99n72j077p74m97p40p73n8Q04J253J573
54294A69922J845J472M66j33J39L47k20q62p40k49r2n9K87N88L82L5J02L14R1
54275A73635m87r34j100j083q50m19j5L50Q81J410J433R40M94K35k73r92j140
54258A72085m17M43P72P98R03R21P23O83R64J012L38p18j439j468q51P5O33L00
54240A75757n44r78p38l76j89O8L22N5o69j052q21o70j053j387r88pR84J685J970
54221A71369J704J008K14n76j333j667j283p15o86q45k96P74J218P79M30O92R48
54204A71735Q33R28J513J843J280J98p49j384j613j240n76k96m06k60K31M35K36
54187A72708J89L48J08n33q70q85j272j824j445k40J57r11j887j309J79J097J131
$$ plain form
54312 174984 173418 172520 172276 171934 171117 170483 170584 170783 170211 169134 168360 167863 167123 166350 166292 167096 168349 169922
54294 169922 171767 173239 173705 173572 173711 174058 173838 172976 172236 171987 171895 171836 172123 172711 173093 173128 173230 173544 173635
54275 173635 173148 172214 171114 170031 169181 168762 168747 169097 169978 171388 172821 173761 174255 174490 174217 173225 172085
54258 172085 171668 172111 172883 173681 174584 175505 176228 176911 177875 178887 179225 178507 177068 175600 174749 174824 175457 175757
54240 175757 175213 174235 173497 173121 172932 173000 173322 173377 172708 171656 170835 170165 169112 167725 166737 166730 167714 169399 171369
54221 171369 173073 174081 174295 173719 172386 170719 169436 168721 168035 167190 166894 167668 168886 169665 170095 170787 171735
54204 171735 172568 173496 175009 176852 178132 178330 177581 176197 174584 173344 172768 172472 172066 171806 172037 172472 172708
54187 172708 172897 173245 173353 172820 171950 171065 169793 167969 166524 166284 166441 165530 163643 162334 162513 163610 164741
54170A64741P84K40k94j57P11J263P80k6k71j76k57k77M7K38k8j82J48L04j62
54151A67426m61Q2O88L60l57k39O76J285J141P46M35M8l96o26n29j33N42J194
54133A71882J266O71j8m30q33j332j476j019l59K45R41J486J228L43n6M21Q56
54116A73816O64N01Q37J034P35P83J686K447K097J168M87k27j234j572n54O36
54100A83304N44k89l52L33N83K85L70Q66Q45K58R8N98P76J42m93k92M26P30K24
54081A88956o39j016m96M07Q41Q55J286K142K257J284P76K062M006M503L578L360
54065B14162N054P574R323R971J0067R731Q379N422J065l393o334p228o974o671
54051B50148o525o285n900n227l833j751J75J318J963K425K383J794J524K171
$$ plain form
54170 164741 165525 165765 165471 165314 166025 167288 168068 168042 167771 167595 167338 167061 167108 167346 167318 167136 167284 167588 167426
54151 167426 166965 167047 167735 168095 167738 167499 168175 169460 170601 171347 171782 171830 171434 170808 170279 170146 170688 171882
54133 171882 173148 173819 173801 173371 172538 171206 169730 168711 168352 168597 169538 171024 172252 172595 172539 172960 173816
54116 173816 174480 174981 175818 176852 177587 178370 180056 182503 184600 185768 186255 186028 184794 183222 182668 183304
54100 183304 183848 183559 183207 183540 184123 184408 184778 185644 186489 186747 186845 187443 188219 188361 187868 187576 188002 188732 188956
54081 188956 188317 187301 186805 187212 188053 188908 190194 192336 194593 195877 196653 198715 202721 207224 210802 214162
54065 214162 219216 226790 236113 246084 256151 265882 274261 279683 280748 277355 271021 263793 256819 250148
54051 250148 243623 237338 231438 226211 222378 220627 220802 222120 224083 226508 228891 230685 232209 234380
54037B34380L117L625M027M851N670N892N827N843N353L896K433K194K880L317
54023B93305L243L036K414R55n68j002o49p65j440j599j005p02j308k241k905
54008B88769l441m041m468m550m394m069l646l418l440l213k462j783j718j777
53994B42349j301p00o81r24p26m33p62j202o14Q58K010K545L211M094M377L985
53978B56086L829M095L666J863n11k339l412m058m411m584m771m812m279l188
53964B33174k068j222n97k84m23o32l18L99P97O44M47O45J192J890K500K658K298
53947B41100J941J987K062J782J667K392L635M685N670P055Q284Q337P361O471
53933C04429N962N109L722K592K158J942J540J134Q59O51Q50J875L267M069M309
$$ plain form
54037 234380 237497 241122 245149 250000 255670 261562 267389 273232 278585 282481 284914 287108 289988 293305
54023 293305 296548 299584 301998 302953 302385 301383 300734 299969 298529 296930 295925 295223 293915 291674 288769
54008 288769 285328 281287 276819 272269 267875 263806 260160 256742 253302 250089 247627 245844 244126 242349
53994 242349 241048 240348 239667 238743 238017 237584 236822 235620 235006 235864 237874 240419 243630 247724 252101 256086
53978 256086 259915 264010 267676 269539 269028 266689 263277 259219 254808 250224 245453 240641 236362 233174
53964 233174 231106 229884 229287 229003 228580 227948 227630 228029 228826 229470 229917 230562 231754 233644 236144 238802 241100
53947 241100 243041 245028 247090 248872 250539 252931 256566 261251 266921 273976 282260 290597 297958 304429
53933 304429 310391 315500 319222 321814 323972 325914 327454 328588 329447 330098 330948 332823 336090 340159 344468
53918C44468N098P036R539J1915J4195J6707J9685K3245K6647K7581K3537J4537
53906E44190L675n450j1272j4290j5607j5989j5633j4409j2489j0696r746r430
53894D12854r094q577p987p022n516m302m403n531o480o813o997p114o717n939
53880C20362n469n332m908m203l910m095m042l569l263l279l071k587k483k955
53866B67196l381l460l533l640l311k582k083j911j567j138j293j930k080j508
53852B33779j061j066p80N7N38J32l56j81J28j58p10q25n80m27l03R9O26Q70O42
53833B30424q1j146j926j744q50k48l38n71n91o88q47m30O12J321J110O76Q38
53816B25521J337J490J330J305J447J511J503J539J619J866K472L168L344L036
$$ plain form
53918 344468 349566 356602 366141 378056 392251 408958 428643 451888 478535 506116 529653 544190
53906 544190 547865 542415 531143 516853 501246 485257 469624 455215 442726 432030 422284 412854
53894 412854 403760 395183 387196 380174 374658 370356 365953 360422 353942 347129 340132 333018 326301 320362
53880 320362 314893 309561 304653 300450 296540 292445 288403 284834 281571 278292 275221 272634 270151 267196
53866 267196 263815 260355 256822 253182 249871 247289 245206 243295 241728 240590 239297 237367 235287 233779
53852 233779 232718 231652 230872 230929 231467 231599 231243 231062 231190 231032 230322 229497 228917 228490 228187 228286 228912 229782 230424
53833 230424 230343 229197 227271 225527 224677 224429 224091 223520 222929 222241 221394 220964 221576 222897 224007 224683 225521
53816 225521 226858 228348 229678 230983 232430 233941 235444 236983 238602 240468 242940 246108 249452 252488
53802B52488L043L799M782N381N601N595N253M715M506M702M664M026L230K668
53788C14453K014J004J65R6N22O20m6j202k140k128j167m35j268l422n124n232
53772B96710m535m441n083n414m687l248k088j949k713l488l521k978k474k067
53758B48024j340l79J40j51r53j858k570k638j803o54j14k59m46n00q28j352j387
53741B30932p52JN48J056J369J014J75l27j74K47P63J461J849J241J05l19Q8J96
53723B39473l11l56N98J574J740J598J743J777J338J038J327J556J118O00Q10
53708B55623J494J978K332K929L529L652L400L130K817K319J837J627J754K380
53694B90801L604M744M650L149J358K37l17o15n07n2J63o5j40K53N29J44p08j609
$$ plain form
53802 252488 255531 259330 264112 269493 275094 280689 285942 290657 295163 299865 304529 308555 311785 314453
53788 314453 316467 317471 317636 317732 318254 318874 318828 317626 315486 313358 312191 311756 310488 307066 301942 296710
53772 296710 292175 287734 282651 277237 272550 269302 267214 265265 262552 259064 255543 252565 250091 248024
53758 248024 246684 246305 246445 246294 245341 243483 240913 238275 236472 235818 235704 235445 234999 234499 233671 232319 230932
53741 230932 230180 230181 230729 231785 233154 234168 234343 234016 233842 234089 234852 236313 238162 239403 239508 239189 239277 239473
53723 239473 239162 238806 239404 240978 242718 244316 246059 247836 249174 250212 251539 253095 254213 254813 255623
53708 255623 257117 259095 261427 264356 267885 271537 274937 278067 280884 283203 285040 286667 288421 290801
53694 290801 294405 299149 303799 306948 308306 308543 308226 307611 307104 307052 307215 307150 307010 307263 307792 307936 307228 305619
53676C05619k313k377j472l50k25r22r76j5M91m16j652j864j299q91o71k96q4
53659B90287l65o72m98j42O1L88Q39O41m85j526j523p59J12J067K070K514K227
53642B94236J913J793J061m05j204m17Q44J193J042J525K489L006K979K785K235
53627C15075J229O39J136J951K067J792J833J834J312J037J854K960L140K920
53613C40779L671N116N668N011M470M818N313N152M469L761L342L459M042M400
53599D03471L992L278L020L182L268L284L401L342K928K646K631J896k08k587
53585D37544l723l785m064m876n480n575n449m981l950k989k842k999k384j102
53571C83345k27j53m41r45j678j953j084K01N09j94o22j69M71O20L66j0k65N7
$$ plain form
53676 305619 303306 300929 299457 299107 298882 297960 296984 296969 297460 297044 295392 293528 292229 291338 290667 290371 290287
53659 290287 289922 289250 288752 288610 288671 289059 289898 290539 290054 288528 287005 286246 286358 287425 289495 292009 294236
53642 294236 296149 297942 299003 298598 297394 296977 297821 299014 300056 301581 304070 307076 310055 312840 315075
53627 315075 316304 316943 318079 320030 322097 323889 325722 327556 328868 329905 331759 334719 337859 340779
53613 340779 344450 349566 355234 360245 364715 369533 374846 379998 384467 388228 391570 395029 399071 403471
53599 403471 407463 410741 413761 416943 420211 423495 426896 430238 433166 435812 438443 440339 440131 437544
53585 437544 433821 430036 425972 421096 415616 410041 404592 399611 395661 392672 389830 386831 384447 383345
53571 383345 383118 382965 382524 381579 379901 377948 376864 377065 377574 377380 376758 376589 377060 377680 378046 378036 377771 377828
53553C77828J090K030K034J453J172J219J112J097J743K726L342L811M689N471
53539D10817N243M438M314N005N567N811O407P285P630P519P971R167J0162J0583
53525E07919J1127J2109J2908J3180J3346J3631J3804J4073J5094J6767J8137
53514F62095J8744J9141J9961K1322K3175K5209K6647K7070K7233K7884K8251
53503I26732K7090K4926K3616K3730K4041K3584K2635K1510K0087J8810J8587
53492A175348J9232J9459J8876J8550J9118J9686J9199J7818J6450J5864J6541
53481A376141J8295J9845J9817J8323J6528J4784J2502R837P780O401M563J783
53469A526599j162l851o843j0219j3053j4937j6572j8198j8955j8483j7749j7551
$$ plain form
53553 377828 378918 380948 382982 384435 385607 386826 387938 389035 390778 393504 396846 400657 405346 410817
53539 410817 416060 420498 424812 429817 435384 441195 447602 454887 462517 470036 478007 487174 497336 507919
53525 507919 519046 531155 544063 557243 570589 584220 598024 612097 627191 643958 662095
53514 662095 680839 699980 719941 741263 764438 789647 816294 843364 870597 898481 926732
53503 926732 953822 978748 1002364 1026094 1050135 1073719 1096354 1117864 1137951 1156761 1175348
53492 1175348 1194580 1214039 1232915 1251465 1270583 1290269 1309468 1327286 1343736 1359600 1376141
53481 1376141 1394436 1414281 1434098 1452421 1468949 1483733 1496235 1506072 1513852 1520253 1524816 1526599
53469 1526599 1525437 1521586 1514743 1504524 1491471 1476534 1459962 1441764 1422809 1404326 1386577 1369026
53457A369026j7628j7974j9442k2048k4099k4269k3323k2677k2359k1689k0930
53446A132588k0837k1165k1005k0129j8944j7376j4970j1907r087p100n721m383
53434I59964k814j261k14K46P72K046L877N539O832Q096R326J0184J0939J2324
53420A025856J4414J6506J8275K0000K1594K2563K3171K4441K6604K8707L0193
53409A272324L1681L3597L5236L6011L6655L8267M0833M3439M5528M7318M9337
53398A710226N1898N4643N6528N6864N6455N6830N8304N9633N9854N9381N8980
53387B339596N8574N7590N5751N3083M9850M6683M4104M1724L8690L4922L1045
53376B851612K7160K2770J7974J3539R542N210K65m878j0502j7752k6792l6052
$$ plain form
53457 1369026 1351398 1333424 1313982 1291934 1267835 1243566 1220243 1197566 1175207 1153518 1132588
53446 1132588 1111751 1090586 1069581 1049452 1030508 1013132 998162 986255 977168 970068 964347 959964
53434 959964 957150 955889 955675 955921 956693 958739 962616 968155 974987 983083 992409 1002593 1013532 1025856
53420 1025856 1040270 1056776 1075051 1095051 1116645 1139208 1162379 1186820 1213424 1242131 1272324
53409 1272324 1304005 1337602 1372838 1408849 1445504 1483771 1524604 1568043 1613571 1660889 1710226
53398 1710226 1762124 1816767 1873295 1930159 1986614 2043444 2101748 2161381 2221235 2280616 2339596
53387 2339596 2398170 2455760 2511511 2564594 2614444 2661127 2705231 2746955 2785645 2820567 2851612
53376 2851612 2878772 2901542 2919516 2933055 2942597 2947807 2948072 2943194 2932692 2914940 2888148 2852096
53364B852096m3931n0163n4958n8139n9855o1030o2292o3229o3312o2697o1588
53353B210902n9752n7164n4264n1215m7895m4937m3603m4159m5471m6529m7197
53342A668716m7111m5405m2205l8999l6689l4553l1917k9473k7967k6719k4548
53331A283130k1282j7557j4014j1373j0252j0222j0140r877j0412j1639j1798
53320A144564j0042p987p395p798p724o932n914m387j971N38K193L367M810O086
53306A101408O432O487P556R698J1955J3986J6089J8025J9272K0153K1485K3309
53294A275855K5086K6785K8719L0640L1961L2554L2491L1479K9489K7362K5794
53283A598215K4262K1932J9059J6414J3969J1196Q130N027J551k511o286q880
$$ plain form
53364 2852096 2808165 2758002 2703044 2644905 2585050 2524020 2461728 2398499 2335187 2272490 2210902
53353 2210902 2151150 2093986 2039722 1988507 1940612 1895675 1852072 1807913 1762442 1715913 1668716
53342 1668716 1621605 1576200 1533995 1494996 1458307 1423754 1391837 1362364 1334397 1307678 1283130
53331 1283130 1261848 1244291 1230277 1218904 1208652 1198430 1188290 1178413 1168001 1156362 1144564
53320 1144564 1134522 1126535 1119140 1111342 1103618 1096686 1090772 1086385 1084414 1084952 1087145 1090512 1095322 1101408
53306 1101408 1107840 1114327 1121883 1131581 1143536 1157522 1173611 1191636 1210908 1231061 1252546 1275855
53294 1275855 1300941 1327726 1356445 1387085 1419046 1451600 1484091 1515570 1545059 1572421 1598215
53283 1598215 1622477 1644409 1663468 1679882 1693851 1705047 1713177 1718204 1719755 1717244 1710958 1702078
53271A702078j0878j3496j6605j9017k0513k2132k4492k6973k8763k9707l0076
53260A459426l0321l0963l2041l2858l2942l2877l3362l3933l3609l2375l1010
53249A103135k9777k8357k6942k6237k6409k6909k7301k7485k7210k6222k4806
53238H05480k3513k2449k1412k0417j9452j8039j5774j3038j0597q771p556p032
53226F17430p001o857o478o699q054r728j0622j0861j1282j1950j2267j2095j1779
53213D91757j1398j0864j0364r879q847p217o165o649p830q081p084n773m730
53200C86876l974l833m663n837o309n969n419m768l857l285l788m791n004m354
53186C21025l953m172m157l400k504k040j796j453j085p77n06m66p51q87m64m4
$$ plain form
53271 1702078 1691200 1677704 1661099 1642082 1621569 1599437 1574945 1547972 1519209 1489502 1459426
53260 1459426 1429105 1398142 1366101 1333243 1300301 1267424 1234062 1200129 1166520 1134145 1103135
53249 1103135 1073358 1045001 1018059 991822 965413 938504 911203 883718 856508 830286 805480
53238 805480 781967 759518 738106 717689 698237 680198 664424 651386 640789 632018 624462 617430
53226 617430 610429 603572 597094 590395 582341 572613 561991 551130 539848 527898 515631 503536 491757
53213 491757 480359 469495 459131 449252 440405 433188 427023 420374 412544 404463 397379 391606 386876
53200 386876 382902 379069 374406 368569 362260 356291 350872 346104 342247 338962 335174 330383 325379 321025
53186 321025 317072 312900 308743 305343 302839 300799 299003 297550 296465 295688 295182 294716 293965 293078 292614 292570
53170B92570m57j435j996j957j917j891j250r8N78L20k99q01j329j887k030j660
53154B74461j207q38k90L44N49K95K17O26J109J210Q77J65p93j482j431r14n93
53137B72305n13k09L14N21K91N3O5J88L50N33M19j70p07n67%L38M57P51J009P89
53117B76217N02R93K138K988L135K863K150P78o49j085n83k65o71j275j699k221
53101B83316k877l256l345l523l610k981j764q08l30K17Q66R08K42l32l87l68
53085B61968m90l05K31M44R1j87rJ91J15J00L04L62K06K81N97N69J07j23J40L57
53065B64949K64K54L46l2q37j185q72q87j793k716k745k250j977j768j084p4Q18
53048B48411J612K399K731K188J129K11m25r68j410j640j700j552j037l08K45
$$ plain form
53170 292570 292113 290678 288682 286725 284808 282917 281667 281569 282147 282467 282168 281367 280038 278151 276121 274461
53154 274461 273254 272416 272126 272470 273019 273314 273531 274157 275266 276476 277353 277518 276725 275243 273812 272898 272305
53137 272305 271792 271583 271897 272418 272709 272762 272827 273015 273365 273898 274317 274147 273440 272873 272873 273211 273668 274419 275428 276217
53117 276217 276719 277712 279850 282838 285973 288836 290986 291764 291115 290030 289447 289182 288511 287236 285537 283316
53101 283316 280439 277183 273838 270315 266705 263724 261960 261152 260822 261039 261905 262813 263055 262723 262336 261968
53085 261968 261478 261173 261404 261848 261939 261752 261743 261934 262049 262149 262453 262815 263021 263302 263899 264468 264575 264452 264592 264949
53065 264949 265213 265467 265813 265781 264944 263759 262887 262000 260207 257491 254746 252496 250519 248751 247667 247593 248411
53048 248411 250023 252422 255153 257341 258470 258681 258256 257288 255878 254238 252538 250986 249949 249641 249886
53033B49886O31J139J454Q11o70j729j568q15l70j65K39O17M85rl00j84J57N12
53015B50121O38L51n9j7M18N28N1k81J80J111J804J991J699R87K72J96O90Q38
52997B61518K02n17n65k40k19n66r63j318j477r88J41J029J004N81O53J200J569
52980B61044J609J641J643J335R99J331K447L519L662K817J706J135J288J635
52966B87811J520Q65J37k60k53N8L76J32r19k110k486k058j720j851j918j603
52950B75721j421j720j967j615r89p03p82r29j173j591j783j297l42L55L43j95
52934B59912o86o69k69j54o81j242j005k28m7p96j492j233l30L67N82N30L83K37
52916B53179K02J53j36m29k39K59K98k89p00m39q0k43n95m51J99Q74J299J354
$$ plain form
53033 249886 250517 251656 253110 253921 253251 251522 249954 249139 248769 248604 248843 249460 249945 249936 249636 249452 249609 250121
53015 250121 250759 251110 251051 251034 251452 251980 252031 251750 251930 253041 254845 256836 258535 259522 259794 259990 260680 261518
52997 261518 261720 261203 260638 260398 260179 259613 258650 257332 255855 254867 255008 256037 257041 257622 258275 259475 261044
52980 261044 262653 264294 265937 267272 268271 269602 272049 275568 279230 282047 283753 284888 286176 287811
52966 287811 289331 290196 290333 290073 289820 289878 290254 290386 289467 287357 284871 282813 281093 279242 277324 275721
52950 275721 274300 272580 270613 268998 268009 267306 266524 265595 264422 262831 261048 259751 259409 259764 260107 259912
52934 259912 259226 258557 258288 258134 257453 256211 255206 254978 254931 254135 252643 251410 251080 251447 252029 252559 252942 253179
52916 253179 253381 253534 253398 252969 252730 252989 253287 252998 252298 251859 251779 251536 250941 250490 250689 251563 252862 254216
52898B54216Q98J57k52j06R7O8L06J193K126K230J557Q83O30N61L16k26r54j554
52880B62146j724j570j468j435j091l97J70M08O92J152J280Q21M46Q86J872K577
52864B64765K761K871L205L507L376K714J753P99J7o00j026j245j582k539l922
52849B74854m687m266l516l477l746l254k195j749k016j835q41j22m12j047j283
52834B40408j323j380j014j30N17N76P60J533K236K285K071J817P96j207k793
52819B45152k608j257k67O0M90J167J452J216J020J093J147J115J325J943K718
52804B55766L161K598O20k097m002m276l658l132k580j481k55J50l72j003j102
52789B38337p02j31K58K27o9j89p7j41m09l62J42N34N67P67J310J454Q23K64N79
$$ plain form
52898 254216 255114 255271 255019 254913 255010 255078 255384 256577 258703 260933 262490 263373 264003 264564 264880 264654 263700 262146
52880 262146 260422 258852 257384 255949 254858 254461 254631 255039 255731 256883 258163 258984 259430 260316 262188 264765
52864 264765 267526 270397 273602 277109 280485 283199 284952 285751 285768 285168 284142 282897 281315 278776 274854
52849 274854 270167 265901 262385 258908 255162 251908 249713 247964 245948 244113 243272 243150 242738 241691 240408
52834 240408 239085 237705 236691 236561 237078 237654 238414 239947 242183 244468 246539 248356 249152 247945 245152
52819 245152 242544 241287 241020 241080 241570 242737 244189 245405 246425 247518 248665 249780 251105 253048 255766
52804 255766 258927 261525 262145 260048 256046 251770 248112 244980 242400 240919 240664 240814 240442 239439 238337
52789 238337 237635 237504 237762 237989 237920 237731 237654 237513 237104 236742 236884 237418 237985 238752 240062 241516 242339 242603 243182
52770B43182J223J249P82N35N15K36k37m39l74m04o58j108j711j952j009Q89K114
52753B42833J493j38j153j136p58l95L6M98R88J780K642K582J338K60N74J552
52737B52996J650Q52M05P45J105R98P40O19O46J033J886K624K610K087J611J005
52721B73612r3j193j617j740k293k834k353j168o85j275j830j647j349j506j587
52706B50442r31Q0N04J8q59j381j221o18o4K26M02M99M00K89N31Q58N48k05j52
52687B49366J146K378K344J684J654K118K074J457R76O86R6o65r99r15p97n41
52671B62062l8P1o80j401r46K52Q43O01L56L46J48L2O75J681J899J231O50M65
52653B68247J70j7Q45K636L878L626K364Q54o37j697j764j149q60j123j216r48
$$ plain form
52770 243182 244405 245654 246436 246971 247486 247722 247485 247046 246672 246268 245610 244502 242791 240839 239830 240719 242833
52753 242833 244326 244188 243035 241899 241141 240746 240782 241280 242268 244048 246690 249272 250610 250870 251444 252996
52737 252996 254646 255498 255903 256648 257753 258751 259491 260110 260756 261789 263675 266299 268909 270996 272607 273612
52721 273612 273519 272326 270709 268969 266676 263842 261489 260321 259636 258361 256531 254884 253535 252029 250442
52706 250442 249511 249591 250095 250113 249254 247873 246652 246034 245970 246196 246598 247097 247497 247786 248317 249175 249723 249518 249366
52687 249366 250512 252890 255234 256918 258572 260690 262764 264221 265197 265883 265979 265314 264315 263400 262603 262062
52671 262062 262024 262095 261415 260014 259068 259320 260163 260764 261120 261466 261614 261646 262321 264002 265901 267132 267782 268247
52653 268247 268417 268400 269245 271881 275759 279385 281749 282603 281966 280269 278505 277356 276496 275373 274157 273209
52637B73209r23j117o36O58J623J536J033P61L45n56j197o97P39K170K865K398
52621B82211O46j676l128k921j793j012r27q94l60M03N75k24j228j136K70J647
52605B70453J744R96O17P45N60j54p56r55j055j039m83N04J254J528J585J415
52589B76959Q63L97O70J352J482R62O07P37Q51O73M90L62J07J2L94O48o5j206
52571B86295j374m56J61k51q05n58K18O79L08j007k697l293j806O20J695Q00n86
52554B77943j192j176q79j61N97M36n72j147p24j49P2N38J349J392J96r78r50
52537B74595k77m3k40l05k74l46k26K31N87P37J234K029K017P74m37l78L63M28
52519B80469k57o50j81P69J573J801J397R74J412K702L810M071L899L804L524
$$ plain form
52637 273209 272286 271169 270533 271191 272814 274350 275383 276144 276489 275933 274736 274039 274778 276948 279813 282211
52621 282211 282857 281181 278053 275132 273339 272327 271400 270506 270146 270549 271124 270900 269672 268536 268806 270453
52605 270453 272197 273193 273810 274555 275115 274961 274205 273250 272195 271156 270673 271177 272431 273959 275544 276959
52589 276959 277822 278219 278889 280241 281723 282685 283292 284029 284880 285553 286043 286405 286512 286524 286918 287566 287501 286295
52571 286295 284921 284465 284626 284375 283570 283012 283230 283909 284217 283210 280513 277220 275414 276034 277729 278529 277943
52554 277943 276751 275575 274696 274535 275132 275568 274996 273849 273125 272976 273048 273586 274935 276327 276523 275545 274595
52537 274595 274318 274275 274035 273730 273456 273110 272884 273115 273702 274439 275673 277702 279719 280493 280056 279678 280041 280469
52519 280469 280212 279562 279381 280150 281723 283524 284921 285895 287307 290009 293819 297890 301789 305593 309117
52504C09117K644J300k59j867k987l001k338k156k599k586j796j330j706j842
52490B88594r32Q0J36k06J3L72m5q56r49j82P49J542K186K203J227n1n60j49O16
52471B93788J388J917J682O04l46k21O40J313J734K522L755M747M834L791J854
52456C24002j84j462k127l187m822n800n198l766k685j982j103k08K29L28K86
52441B92321l54j798l095l217k487j843j348n51K69M34P7j47j74k99k40M47J333
52424B79328J552J098O59M88L52K93N18P57O72O32J156J908K172K063K301L033
52408B98982L799M503N470O756Q215J0091J2572J4824J5234J2785P745J288n023
52395C97241r666j1906j2097j0958q945o601m847m118l811l197k390j759j116
$$ plain form
52504 309117 311761 313061 312802 310935 307948 304947 302609 300453 297854 295268 293472 292142 290436 288594
52490 288594 287662 287742 287878 287672 287685 288057 288012 287156 286207 286025 286774 288316 290502 292705 293932 293881 293321 293172 293788
52471 293788 295176 297093 298775 299379 299033 298812 299452 300765 302499 305021 308776 313523 318357 322148 324002
52456 324002 323818 322356 320229 317042 312220 306420 301222 297456 294771 292789 291686 291478 291707 292035 292321
52441 292321 291967 290169 287074 283857 281370 279527 278179 277628 277897 278331 278408 278261 278087 277788 277548 277995 279328
52424 279328 280880 281978 282637 283125 283477 283770 284288 285045 285717 286349 287505 289413 291585 293648 295949 298982
52408 298982 302781 307284 312754 319510 327725 337816 350388 365212 380446 393231 400976 402264 397241
52395 397241 387575 375669 363572 352614 343669 337068 332221 328103 324292 321095 318705 316946 315830
52382C15830k71K58J05k9O37J667K147K257K850L822M238L989L999M742N574N777
52366C57592N279M214K554N11j310k404k620k046j047k97k40n29m97J6O50J106
52350C60932J269J045N89M21Q47J422J444Q01O4j04N64J660K346K279K304L419
52334C81302N212O315O486O905Q094R018Q922Q642R154J0170J1193J2622J4584
52321D98619J5910J5725J4999J5036J5371J4763J3366J2329J1945J1822J2251
52310F52136J3639J5093J5344J4789J4890J5853J6501J6320J5993J5913J5809
52299H22280J5783J6225J6549J5498J2907R847O926L804M99k159l747m757n646
52286I04009o321o717o887o540n481m429m337m921n012m269l357k472j079P26
$$ plain form
52382 315830 315559 315817 315922 315893 316530 318197 320344 322601 325451 329273 333511 337500 341499 346241 351815 357592
52366 357592 362871 367085 369639 370150 368840 366436 363816 361770 360723 360426 360186 359657 359160 359176 359826 360932
52350 360932 362201 363246 363835 364256 365103 366525 367969 368770 368834 368730 369294 370954 373300 375579 377883 381302
52334 381302 386514 392829 399315 406220 414314 423332 432254 440896 450050 460220 471413 484035 498619
52321 498619 514529 530254 545253 560289 575660 590423 603789 616118 628063 639885 652136
52310 652136 665775 680868 696212 711001 725891 741744 758245 774565 790558 806471 822280
52299 822280 838063 854288 870837 886335 899242 909089 916015 919819 920318 918159 914412 909655 904009
52286 904009 897688 890971 884084 877544 872063 867634 863297 858376 853364 849095 845738 843266 842187 842913
52272H42913J967K257K430L326M943O916Q860J0064R913Q891Q252Q540R220R879
52258I38371J0746J1884J2891J3638J4378J4991J5006J4462J3898J3316J2089
52247A085670J0006P513M901K241O3j008j462k589m678o501p007o575o232o448
52233A067894p093p846q315q240p836p509p276o960o759o901o940o228m955l934
52219I71102l456l169k849k444j587p0J415K006J961K239L028L752M322N128N948
52204I87326O057N419M673L998L165K503K613L210L583L987N235O973P859P520
52190A054121O877O424N717M707M015L606K599Q30q72k183l716n605p133q115
52176A061272r232j0510j0984j0300r315q529p356n491l687k528j750j161r26
$$ plain form
52272 842913 844880 847137 849567 852893 857836 864752 873612 883676 893589 902480 910732 919272 928492 938371
52258 938371 949117 961001 973892 987530 1001908 1016899 1031905 1046367 1060265 1073581 1085670
52247 1085670 1095676 1103189 1108090 1110331 1110394 1109386 1107924 1105335 1100657 1094156 1087149 1080574 1074342 1067894
52233 1067894 1060801 1052955 1044640 1036400 1028564 1021055 1013779 1006819 1000060 993159 986219 979991 975036 971102
52219 971102 967646 964477 961628 959184 957597 957527 958942 960948 962909 965148 968176 971928 976250 981378 987326
52204 987326 993383 998802 1003475 1007473 1010638 1013141 1015754 1018964 1022547 1026534 1031769 1038742 1046601 1054121
52190 1054121 1060998 1067422 1073139 1077846 1081861 1085467 1088066 1088896 1088024 1085841 1082125 1076520 1069387 1061272
52176 1061272 1052040 1041530 1030546 1020246 1010931 1002402 995046 989555 985868 983340 981590 980429 979503
52163I79503n20J068L510N065N010M521M458L931K122n5j358j904k260k104j105
52148I99882lN40J140K496L878M129L429K745K260J508N51j83p40j310j500r04
52132A017918N6P54J367K434L910N533P608J0547J4015J7275K0017K2225K3775
52119A147434K4770K5650K6364K6083K4504K2647K1531K0719J9190J7057J5293
52108A391242J4113J2738J0721Q626P310P148P936R099J0108J0865J1460J1509
$$ plain form
52163 979503 978983 980051 983561 988626 993636 998157 1002615 1006546 1008668 1008613 1007255 1005351 1003091 1000987 999882
52148 999882 999879 1000419 1001559 1004055 1007933 1012062 1015491 1018236 1020496 1022004 1022555 1022372 1021632 1020322 1018822 1017918
52132 1017918 1017974 1018728 1020095 1022529 1026439 1031972 1039580 1050127 1064142 1081417 1101434 1123659 1147434
52119 1147434 1172204 1197854 1224218 1250301 1274805 1297452 1318983 1339702 1358892 1375949 1391242
52108 1391242 1405355 1418093 1428814 1437440 1444750 1451898 1459834 1468933 1479041 1489906 1501366 1512875
$$ [...]
##END NTUPLES=NMR SPECTRUM
##END=
