
##TITLE=UV1224_M6_1234-1212_30_7231337_LlRSUDQFCa
##JCAMPDX= 6.0         $$ Bruker NMR JCAMP-DX V2.0
##DATA TYPE= NMR SPECTRUM
##DATA CLASS= NTUPLES
##ORIGIN= BRUKER
##OWNER= Administrator
$$ 1.72 TOPSPIN		Version 2.1
$$ 2013-01-18 04:18:02.308 -0500  Administrator@X
$$ Compression mode = diff/dup
##.OBSERVE FREQUENCY= 400.02188249412
##.OBSERVE NUCLEUS= ^1H
##.ACQUISITION MODE= SIMULTANEOUS (DQD)
##.ACQUISITION SCHEME= undefined
##.AVERAGES= 8
##.DIGITISER RES= 22
##SPECTROMETER/DATA SYSTEM= spect
##.PULSE SEQUENCE= zg30
##.SOLVENT NAME= COFFEE_meoh
##.SHIFT REFERENCE= INTERNAL, COFFEE_meoh, 1, 14.98509
##AUDIT TRAIL= $$ (NUMBER, WHEN, WHO, WHERE, PROCESS, VERSION, WHAT)
$$ ##TITLE= Audit trail, TOPSPIN		Version 2.1
$$ ##JCAMPDX= 5.01
$$ ##ORIGIN= Bruker BioSpin GmbH
$$ ##OWNER= Administrator
$$ $$ E:\/data/COFFEE/nmr/UV1224_M6_1234-1212_30_7231337_LlRSUDQFCa/20/pdata/1/auditp.txt
$$ ##AUDIT TRAIL=  $$ (NUMBER, WHEN, WHO, WHERE, PROCESS, VERSION, WHAT)
(   1,<2013-01-18 04:17:54.246 -0500>,<Administrator>,<X>,<go>,<TOPSPIN 2.1>,
      <created by zg
	started at 2013-01-18 04:16:48.246 -0500,
	POWCHK enabled, PULCHK disabled,
       configuration hash MD5:
       86 BA 57 50 F2 9D 5C 9B 26 00 A9 28 5F 66 2E 89
       data hash MD5: 64K
       55 FA DE 9C EB D8 B6 D1 7F 54 2C 54 F9 16 80 FE>)
(   2,<2013-01-18 04:17:57.308 -0500>,<Administrator>,<X>,<proc1d>,<TOPSPIN 2.1>,
      <Start of raw data processing
       efp LB = 0 FT_mod = 6 PKNL = 1 PHC0 = 0 PHC1 = 0 SI = 32K 
       data hash MD5: 32K
       DE 63 67 77 E1 5A 87 44 18 7E 49 8D 86 B7 A4 25>)
(   3,<2013-01-18 04:17:57.777 -0500>,<Administrator>,<X>,<proc1d>,<TOPSPIN 2.1>,
      <pk PHC0 = 96.54236 PHC1 = 0 
       data hash MD5: 32K
       EF AF 89 7A C9 44 B2 84 D5 AF 2E 13 F2 27 14 57>)
(   4,<2013-01-18 04:17:57.996 -0500>,<Administrator>,<X>,<proc1d>,<TOPSPIN 2.1>,
      <abs ABSG = 1 
       data hash MD5: 32K
       EE F7 A6 10 00 AB 17 12 B4 0E 83 BF 85 11 4A F8>)
(   5,<2013-01-18 04:17:58.152 -0500>,<Administrator>,<X>,<proc1d>,<TOPSPIN 2.1>,
      <abs ABSG = 2 
       data hash MD5: 32K
       71 3A FE 7B 10 11 37 06 94 15 79 0B 27 13 78 A7>)
(   6,<2013-01-18 04:17:58.293 -0500>,<Administrator>,<X>,<proc1d>,<TOPSPIN 2.1>,
      <abs ABSG = 3 
       data hash MD5: 32K
       B8 86 C3 4C 4D BF 3B 12 FF 83 4C 16 63 F2 37 F2>)
(   7,<2013-01-18 04:17:58.433 -0500>,<Administrator>,<X>,<proc1d>,<TOPSPIN 2.1>,
      <abs ABSG = 4 
       data hash MD5: 32K
       9A 5B 68 81 1B 8F CC 2D 83 50 75 80 28 A0 AC A7>)
(   8,<2013-01-18 04:17:58.590 -0500>,<Administrator>,<X>,<proc1d>,<TOPSPIN 2.1>,
      <abs ABSG = 5 
       data hash MD5: 32K
       B0 88 04 F7 88 4C F3 2C CE 32 ED 18 A6 D2 00 66>)
$$ ##END=
$$ 
$$ $$ hash MD5
$$ $$ DD C3 65 B4 EE 36 29 0E 2F D5 3E 89 E2 92 F7 9B
##$RELAX= 
##$RELAX= 
##$RELAX= 
##$RELAX= 
##$RELAX= 
##$RELAX= 
##$RELAX= 
$$ Bruker specific parameters
$$ --------------------------
##$DU= <E:\>
##$EXPNO= 20
$$ [...]
##$TP= (0..7)
150 150 150 150 150 150 150 150
##$TP07= 0
##$TPNAME0= <>
##$TPNAME1= <>
##$TPNAME2= <>
##$TPNAME3= <>
##$TPNAME4= <>
##$TPNAME5= <>
##$TPNAME6= <>
##$TPNAME7= <>
##$TPOAL= (0..7)
0.5 0.5 0.5 0.5 0.5 0.5 0.5 0.5
##$TPOFFS= (0..7)
0 0 0 0 0 0 0 0
##$TUNHIN= 0
##$TUNHOUT= 0
##$TUNXOUT= 0
##$USERA1= <user>
##$USERA2= <user>
##$USERA3= <user>
##$USERA4= <user>
##$USERA5= <user>
##$V9= 5
##$VALIST= <valist>
##$VCLIST= <CCCCCCCCCCCCCCC>
##$VD= 0
##$VDLIST= <DDDDDDDDDDDDDDD>
##$VPLIST= <PPPPPPPPPPPPPPP>
##$VTLIST= <TTTTTTTTTTTTTTT>
##$WBST= 1024
##$WBSW= 4
##$XGAIN= (0..3)
0 0 0 0
##$XL= 0
##$YL= 0
##$YMAX_a= 694289
##$YMIN_a= -590292
##$ZGOPTNS= <>
##$ZL1= 120
##$ZL2= 120
##$ZL3= 120
##$ZL4= 120
##$ABSF1= 14.98509
##$ABSF2= -5.573092
##$ABSG= 5
##$ABSL= 3
##$ALPHA= 0
##$AQORDER= 0
##$ASSFAC= 0
##$ASSFACI= 0
##$ASSFACX= 0
##$ASSWID= 0
##$AUNMP= <proc_prof1d_extract_pilot.lims>
##$AXLEFT= 0
##$AXNAME= <>
##$AXNUC= <1H>
##$AXRIGHT= 0
##$AXTYPE= 0
##$AXUNIT= <>
##$AZFE= 0.1
##$AZFW= 0.1
##$BCFW= 0
##$BC_mod= 0
##$BYTORDP= 0
##$COROFFS= 0
##$CY= 15
##$DATMOD= 1
##$DC= 0
##$DFILT= <>
##$DTYPP= 0
##$F1P= 0
##$F2P= 0
##$FCOR= 0.5
##$FTSIZE= 32768
##$FT_mod= 6
##$GAMMA= 0
##$GB= 0
##$INTBC= 1
##$INTSCL= 1
##$ISEN= 128
##$LB= 0
##$LEV0= 0
##$LPBIN= 0
##$MAXI= 10000
##$MC2= 0
##$MEAN= 0
##$ME_mod= 0
##$MI= 0
##$NCOEF= 0
##$NC_proc= -8
##$NLEV= 6
##$NOISF1= 0
##$NOISF2= 0
##$NSP= 0
##$NTH_PI= 0
##$NZP= 0
##$OFFSET= 14.98509
##$PC= 1
##$PHC0= 96.54236
##$PHC1= 0
##$PH_mod= 1
##$PKNL= yes
##$PPARMOD= 0
##$PPDIAG= 0
##$PPIPTYP= 0
##$PPMPNUM= 2147483647
##$PPRESOL= 1
##$PSCAL= 4
##$PSIGN= 0
##$PYNMP= <proc.py>
##$REVERSE= no
##$SF= 400.02
##$SI= 32768
##$SIGF1= 0
##$SIGF2= 0
##$SINO= 400
##$SIOLD= 32768
##$SPECTYP= <>
##$SREGLST= <1H.CDCl3>
##$SSB= 0
##$STSI= 32768
##$STSR= 0
##$SW_p= 8223.68421052631
##$SYMM= 0
##$S_DEV= 0
##$TDeff= 65536
##$TDoff= 0
##$TI= <>
##$TILT= no
##$TM1= 0
##$TM2= 0
##$TOPLEV= 0
##$USERP1= <user>
##$USERP2= <user>
##$USERP3= <user>
##$USERP4= <user>
##$USERP5= <user>
##$WDW= 1
##$XDIM= 32768
##$YMAX_p= 476005930
##$YMIN_p= -749356
##$CURPLOT= <Network HP LaserJet P1505>
##$CURPRIN= <$Network HP LaserJet P1505>
##$DFORMAT= <normdp>
##$LAYOUT= <+/1D_H.xwp>
##$LFORMAT= <normlp>
##$PFORMAT= <normpl>
##$SURQMSG= 1
$$ End of Bruker specific parameters
$$ ---------------------------------
##NTUPLES= NMR SPECTRUM
##VAR_NAME=  FREQUENCY,     SPECTRUM/REAL,   SPECTRUM/IMAG
##SYMBOL=    X,             R,               I
##VAR_TYPE=  INDEPENDENT,   DEPENDENT,       DEPENDENT
##VAR_FORM=  AFFN,          ASDF,            ASDF
##VAR_DIM=   32768,         32768,           32768
##UNITS=     HZ,            ARBITRARY UNITS, ARBITRARY UNITS
##FACTOR=    0.250966925370066, 1,           1
##FIRST=     8223.43324360094, -77109,       -93338
##LAST=      0,             -132502,         20245
##MIN=       0,             -749356,         0
##MAX=       8223.43324360094, 476005930,    0
$$ Real data points
##PAGE= N=1
##DATA TABLE= (X++(R..R)), XYDATA
$$ [...]
23840 11500 -143355 -333784 -7052 64201 136734 144706 431419 -258298 -153210 147343 -107277
23828 94164 -74549 -291639 -200175 41144 -345400 160634 185899 163139 78360 -201568 113714
23816 133373 7676 73402 -194618 -131556 -182424 -26745 18722 -183882 -148567 243143 373714
23805 373714 -140765 133456 -234780 -188176 -62846 -96051 -103708 -60584 266204 112906 222201
23794 222201 247375 154770 -277833 99154 -132132 300483 -135265 -54652 -156123 116976
23783 35091 -87944 15649 193441 -20497 98259 100424 55212 92954 265137 -54907 -139891
23772 -139891 -150504 48667 -238020 2447 610396 67080 148643 245241 82942 18602 97285
23761 97285 -32924 87392 -101736 -199485 253365 126762 -67191 -332515 -98489 142698 35947
23749 251888 12042 -119412 128663 322263 -275580 -34205 226903 -144804 -9383 116948
23738 267248 -209717 -159466 214206 63107 116418 -39711 -204872 77979 85904 -205700 -21062
23726 -363907 -154293 -138527 32802 173011 360704 7822 48218 105442 47148 209954 211011
23715 211011 -98159 34266 40518 68020 -504 211034 -28117 -6288 202469 -14095 74930 -397086
23702 -220824 -190053 99053 61350 -88599 -18978 239836 165038 -234532 72179 -429586 -43568
23690 112146 -258811 205581 122993 -443537 -290566 343562 39940 363650 121922 109575
23680 109575 -104964 254407 186372 188829 308208 -248513 179744 208707 -209527 -375973
23670 -375973 45886 27122 215096 -100843 28458 116286 311564 175555 45283 80396 -41839
23658 -120060 -130752 44049 198304 -18251 -81073 4828 212544 96498 305478 87262 4767
23646 -98845 188212 -172024 -123334 31356 -469427 85069 -18813 24599 48901 -308653 269278
23634 266559 310937 -247603 86178 -86474 -172373 -99317 -63877 -306959 48261 107867 -88255
23622 144569 -1593 -156019 -435908 -330525 304678 36106 -16468 -421843 54487 -16318 131770
23610 -93429 -233184 62211 -52867 -134998 -293793 108548 -140502 -151225 15658 -315475 -44264
23598 -36207 -5607 102458 108581 -157747 -93042 -34626 -239621 -11739 -67757 -486842 -247998
23587 -247998 144128 370367 -152011 -156021 -378000 44097 -184076 -111232 -51896 -27989 97308
23575 99403 63703 -274961 -155181 -170455 84963 -95052 -49399 242322 71592 262282 -119733
23563 82132 -219629 -157998 -184522 158001 15324 -90048 86811 248124 -37946 -227234 -53524
23551 -118008 124291 -212244 -72545 -93158 -103203 -145833 -199305 228742 10718 -187350 11115
23539 -18572 69637 -334631 63709 -159060 -18099 -172112 -172736 -50057 -39708 189664 130842
23528 130842 8061 73584 168783 -83321 -4824 -22874 33658 -218715 -84485 -1790 347317 141921
23515 -112969 -38511 102286 -283055 -120074 -28295 308009 30108 -152859 -251698 -96991
23504 -252965 38052 33724 -144674 -70149 -229706 -49476 352572 -125937 -305280 -107788
23493 107358 -288346 -211097 112297 8181 176070 56497 61437 -371167 -202445 -11192 6412
23481 72203 -20795 70714 86224 -70434 -73315 419792 -41841 -187617 -80128 349391 -8348
23469 91062 172987 -37580 124859 44410 90045 49457 -163673 -153671 -198833 64853 8722
23457 234984 65825 -67540 -263609 81396 -106640 -58488 -52114 -175806 -89567 278896 -137445
23445 -45191 336292 -16317 -147122 72528 -48116 -43948 -79057 47873 -528150 -12635 -143570
23434 -143570 88227 -39529 -137597 -305834 353898 129862 -124023 304373 -366272 8371
23423 -36335 -264388 95746 116153 50487 22047 4684 14125 61607 -92181 -7210 196210 -53658
23410 81658 63275 -33367 -88767 -78587 1232 -217922 -89957 -178341 -240488 -350015 126800
23398 -313398 -245499 172770 11848 384793 -122983 -87963 -249676 192799 -297719 132507
23387 -73173 -116742 -255195 94157 328070 119914 -157165 61481 161191 13397 -167440 78185
23375 -101451 -290753 -227147 -64892 213871 -113596 253991 -1985 42165 -38560 206071 -336324
23363 133045 -81248 295375 -254724 -158093 177689 -175800 83906 -143929 175686 21048
23352 -21894 14092 9170 81097 70471 142370 48252 175516 204180 -165140 -206842 39984
23340 -17485 -76645 13515 -48891 57660 -77372 51777 51525 97792 17358 -55659 -67833 8956
23327 56154 -7448 -27497 426312 5983 -236585 -3620 -15581 -113470 172544 -296306 197850
23315 203748 -46219 -58369 -203411 192192 -198114 233901 141967 -409656 -157147 -58842
23304 73881 113356 41171 -30410 -168863 194647 4927 -110991 -49544 -72111 121303 92129
23293 92129 138633 167855 -222751 -90924 -57073 -144978 -29083 -38509 326826 -328473 89756
23281 -43064 -159745 124418 124595 160052 -178777 80127 158958 -243838 -88269 -25207 107078
23269 15503 -98701 -119754 -317442 294896 -253956 -149253 -378923 -127331 -376972 48145
23258 -23026 37909 -386591 -246295 -237323 141325 -283194 148748 -427272 99116 36259 -388519
23246 85067 48995 -16791 -177120 -224017 275305 -176930 -111342 122093 -72445 176336 72788
23234 -65308 5870 2471 -144994 -1748 -308093 -26625 -135720 -17060 64770 -13808 -211309
23223 -211309 -208531 297727 -126305 55461 -330889 113807 -270818 -73052 -142037 393611
23212 24815 -152101 44199 -11903 -106186 -177587 -133465 108677 -54575 -128486 260786 19266
23200 421626 -166567 -204131 117617 -80272 -55942 -170686 426265 200133 -290160 -3660
23189 -199826 -210634 118249 303707 -227421 108454 -118864 5428 -5722 319789 169448
23179 169448 190662 -137263 9367 -286469 -170353 -33973 -175746 -17842 -69231 -385678 68346
23167 273434 144857 187144 48566 -166117 -215404 -84112 9411 291428 -238689 218168 -240897
23155 -10999 -41793 96685 -456583 665 -98601 -8110 -201392 -45059 62468 -98040 -116158 -114586
23143 -114586 -93180 -118331 105387 -185168 66478 -126077 -305029 -204684 113625 -71961
23132 260248 -45376 -182827 -440365 278549 -371375 381571 189401 144668 -261738 59980
23121 -7461 30380 -69975 308141 -108037 -113075 -61987 -18232 -88262 -217948 93868 -538978
23109 15854 48031 275711 346912 -213474 -69920 -171549 53838 313802 48092 -115143 177857
23097 38512 185409 285480 59953 -79272 157846 127396 37191 -110257 134557 -135715
23086 39199 127921 16337 -34953 102933 -201247 -123628 -86035 -372048 3143 -213331 83852
23074 -175903 -192133 -74644 -125921 213243 -365658 -124335 -215998 -8930 -154801 -106535 45628
23062 42295 249228 -115537 -165624 -83288 49537 -121932 -21938 -223364 299290 -27237 -146570
23051 -146570 260625 25261 166006 91161 136634 18528 -134877 -48364 -174062 -196178 -125287
23040 -125287 367618 95667 54431 -109597 -67356 -78563 68685 -173014 150945 -11696 25154
23028 -45705 65936 35492 90217 83872 70241 11978 140444 -189019 225932 -212207 -188298
23017 -188298 -79483 103 37524 -50625 -160169 -87699 -55141 -138059 147877 -125389 -45901
23005 256992 -346578 245469 -125228 -408163 -70918 -69516 45362 -158153 -43797 -439869
22995 -439869 -106844 112348 -65291 232319 -85662 -264326 96269 98806 -26255 71897 85752
22984 85752 -103907 35544 -146440 239155 -119155 -20563 -241015 -104023 50138 527855
22974 527855 360206 -16567 -45940 -282828 -132960 133369 -23710 6459 178869 -100485
22963 353269 -210741 -17743 -248681 -76347 -265181 -79119 -198821 95913 -37373 225528
22952 -40422 69441 115923 -146642 -272375 -39414 129407 -749356 -102056 214103 -251990
22941 28128 -111322 -23034 -173964 21086 445825 -342196 126941 34648 338879 -176867
22930 -267641 -206763 112825 34263 -28615 -32308 -275193 123103 164380 -42002 -90481 -76359
22919 -76359 -151058 -284400 -124669 -196970 -169066 230848 196063 118523 86543 -380416 2940
22907 48444 -75559 146435 -157526 -2627 34866 -141946 383705 97489 -173576 -66344 289291
22895 -324334 -490896 -298598 -62241 -51590 -231998 157637 11421 43312 -130837 251491
22884 19691 -47641 -242935 137705 -34653 -203559 -102140 134087 -158986 -25304 397881
22873 -57005 -248148 -134917 -56220 266629 -221927 -38744 166850 -106432 -188274 -188486 -184167
22862 -184167 -58185 2342 27609 -122808 -163228 -178969 -174091 152848 136601 -213965 129262
22850 -73365 284845 -118844 -147094 -151645 -198909 -52458 144354 160123 -207821 -130442 63887
22838 -45856 -3904 -184145 -104405 -81025 47090 -264896 154621 -283515 -64417 362936 218332
22827 218332 164195 -6529 -99879 179085 -163514 39813 -245496 -54050 -126804 110102 -30318
22815 -237157 -156189 -42749 -95076 -116906 -56675 280246 -207589 -2880 135437 -227855 -159328
22804 -159328 -103446 -294266 -156605 89265 -132924 -332716 -27950 43862 38063 10138 -82374
22792 108248 219832 203744 90857 -79177 187184 -247640 245593 -320550 -334582 33129
22781 -408940 -62945 256306 115408 -169479 232800 -284444 -305611 225046 -226708 -43480
22770 186693 -23899 -12318 -440125 -256291 -371974 -73298 177511 -38461 -306476 -24217
22759 139486 -90554 -442744 439176 -227106 54781 -20833 101931 -142148 24924 -149005
22748 -107565 -170711 182802 -69535 -16197 -117956 368713 80655 -297208 -153765 -74854
22737 145363 140232 132671 -128897 -38239 203732 -182032 -304979 363750 -238500 42864 -15789
22725 -37948 7236 -103183 7394 -338143 -141026 114140 -58036 108659 83215 -157099 -314187
22714 -314187 -179231 -92278 360226 -215870 64266 68728 379902 -101847 -212918 -40566
22703 -126969 116538 103411 56887 -180021 189799 22550 53884 -110465 -16404 308004
22692 118510 -163747 -113025 -56250 -67801 -104676 -207210 -222510 60802 -107449 -58237 -152124
22681 -152124 -163007 -50485 -88166 -154116 122007 377727 -164781 -75213 -93047 -172049 106524
22669 111504 -50358 38889 -16816 23224 23602 -146337 -179076 -106727 93401 -88180 -146853 -176101
22657 -176101 -81385 -159635 -183927 -49990 -218036 44616 -180364 -72030 136609 -183211 174603
22645 103388 -63330 114777 -135508 284709 -7989 -34824 -383062 -145949 -22431 94015 -212043
22633 152068 -110017 -3727 114913 -162400 -251155 110119 75776 -46086 319662 -92077 52986
22621 75621 -32463 9043 230381 -101261 -141370 288815 152871 -99136 -133138 -144487 -144660
22610 -144660 -184476 223460 -74132 -124593 1107 185736 9481 167226 -135306 -209194 -49459
22598 3190 40706 -106268 33168 19422 -49441 289155 -68595 41217 288375 222828 -180238
22586 281195 -57662 -174743 -316372 -211357 41046 87593 -23475 -23245 -188485 73637 282720
22575 282720 -337122 -403870 57934 387786 20668 -187469 -83748 318554 186309 32656
22564 -60466 -23526 -4340 -19951 -156500 48144 24996 -267203 7956 -241221 25945 -160798
22552 535148 -239231 -3987 284139 -113538 -355219 -244511 52698 76381 -60559 24344 -186952
22540 166339 253093 43067 -286202 -32471 39827 91778 165614 202209 -249348 33595 -319204
22528 32806 -9549 9912 54743 -73743 165439 -72796 -12657 96780 -59459 49092 17231 -280255
22515 -147760 10725 -324031 318461 79304 -447696 55104 134772 -135637 -130002 65529 -189450
22503 13847 14451 -138945 74467 -161272 -191365 9679 -195208 -168974 -236338 -86331 -311439
22492 -311439 79452 190521 207790 -254547 -398063 -332669 -138021 84632 -168428 -74595
22481 13215 176191 194312 272896 -229359 -101090 -163886 107274 -147471 -59858 -3273 -518338
22470 -518338 186694 -84266 -157961 132333 -296903 -104725 -46569 -79861 -56472 -127439 -303778
22459 -303778 -215940 -222824 46323 178018 -294058 -24316 11590 40925 -319190 -392345 40288
22447 -66754 -161233 74197 402222 -281619 -270555 -180614 -64261 -172860 -31895 70035 57584
22436 57584 -157789 -74158 443157 -181325 -133616 -142739 -62257 171890 20331 337728 -105151
22424 198689 8707 89514 62238 -261660 9438 -178823 -350369 163988 -215247 216279 72925
22412 -15511 -15787 165287 84470 -135365 -345689 16314 -313231 146090 -336787 189079 360508
22401 360508 -307248 7082 26554 -13810 -179333 -103025 9835 -179623 -147770 -45070 134073
22389 -242639 -258368 175478 -42988 55285 -230069 -228030 -86860 -137427 -38497 158453 -18406
22377 -467231 -112594 105557 -207415 -126430 22900 -238436 -131928 -336316 130303 23075
22366 304580 -133072 327120 383428 171541 133506 102033 -6857 194054 -49490 185112 288018
22355 288018 219443 63667 -41347 203160 56970 194235 -71026 176244 14013 -33894 -2233
22343 134137 -315760 -62163 -203053 60674 130119 -217547 -3780 -154912 -298077 -211377 -173331
22332 -173331 -300034 257765 -50961 -25242 -63896 126987 -73671 -371463 163989 310294
22322 310294 -85473 -62575 12063 -223337 74174 125693 -96230 -156919 -219190 -108271 -97897
22311 -97897 224404 -355085 314322 -147628 50920 -112455 -362216 -150607 -82881 -28678
22300 -182450 -40842 28641 -21923 167924 -66199 165251 -176600 118662 -169700 32515
22289 274804 93804 -57809 -168311 -203175 113921 -356341 -280252 -254539 -126677 299333
22278 -404755 28994 55565 -289359 220312 -91689 278103 -8652 -289628 30464 -502917 -64009
22266 -212823 90997 -26681 -11310 -106044 -358965 -41925 -56792 -201342 -330859 -159368 -227163
22255 -227163 15768 -92761 51818 -307759 20075 -24517 -149475 -138802 78485 -215291 -146787
22244 -146787 -49063 -170945 68115 62895 -29381 -205915 -214102 74097 -37506 235314 -101316
22232 -115266 105980 200031 223094 134416 -34248 2520 -38407 -308512 -133193 -436544 -462153
22221 -462153 -37168 270707 -195501 -66169 -165658 -174280 147289 132883 -196412 -112412 -36424
22209 -137332 -62913 31118 -288347 99758 -421761 132979 106145 -258530 -46425 -437577
22199 -437577 8017 -43352 275230 -31935 -205275 70570 -203221 -12413 -12675 -191448 -75476
22187 -125325 -140203 -228736 -3628 298558 98794 -22592 157317 106896 -4526 -90305 -93763 -180694
22175 -180694 76479 288959 -10107 -162371 -112290 -179859 -39857 -53441 7272 26510 116223
22164 116223 -317623 -62211 22918 -284028 -161111 -16175 -494333 -2801 -55265 189917 -276626
22152 -362728 -226008 -162391 144140 -115186 -215187 50284 -110867 -75590 116906 -98164
22141 6721 88448 279972 124819 356929 44624 68345 -33533 107123 103560 -246123 74300
22129 -419955 -133456 69911 287515 23980 -60811 177383 142159 106 217404 17079 27680
22118 27680 -153683 254717 -58654 85868 -171734 125136 179173 -225395 12679 -139024
22107 96783 -51986 96416 -197532 -93856 -8611 -31206 -177097 430203 1953 152003 -181751
22095 138525 76151 -364512 -138662 -182093 -139351 -161870 11191 -199389 -29520 79504 34676
22083 -198448 -235999 -259285 227881 269388 -53614 306276 -237858 162611 -246322 -234926
22073 -234926 -144156 -44529 56589 -24667 -36185 -98342 -40744 -491417 -63214 -444509 167924
22061 95446 -160735 76047 -91696 -43871 32953 4425 10287 -250278 -90440 -65726 -81360 -180000
22049 -180000 109587 145573 -87398 22522 58250 59115 -200747 90240 198458 -190542 -104584
22038 -104584 36383 -50561 -127906 -292182 245348 1062 -156256 -152525 -65056 50113 -21004
22026 346371 -48057 -184887 123795 266792 83961 -157220 -23507 -166035 -79949 -103859
22016 -103859 -154458 -394109 112788 54813 240035 23157 289324 -275183 -88842 -304384
22006 -304384 -90152 -82696 -54948 -107820 42223 -185284 -11316 -333618 67692 -78242 -125249
21995 -125249 94124 -71670 186625 -86239 42838 -251523 -207875 2856 -210364 2942 -154707
21983 -1042 61433 -68065 126912 60787 -385248 26693 -62752 26990 -21483 7341 -66449 126983
21970 -118697 -87564 -112563 464562 -62680 -115708 -95672 -127896 268871 57623 -47656 276820
21958 -91467 -239577 -174845 -107751 218800 136459 58230 -45753 47217 -267482 93729 104109
21947 104109 80467 -193819 -119240 105384 -59442 -81192 312144 -264754 91390 -82672 -142506
21936 -142506 -54055 -615176 14238 -172982 -173122 -78035 -275568 -331698 214693 164495 -145822
21924 -23321 -120337 130716 -104226 257558 62679 -260501 41671 -92776 331156 -416769
21913 18905 130332 223463 -43510 -44473 30469 -165063 -89823 -218354 2368 -35940 -320137
21902 -320137 -79356 48716 -156103 -124287 104256 -126873 304059 172401 -59436 -29941
21892 -29941 -7295 329784 -98460 -343769 173388 12514 36288 -136666 -89039 107667 -14300
21880 -148119 56389 -168293 -8002 -199282 -255245 72689 -107281 232074 -385768 -108521
21869 59459 71325 181572 -244000 52687 -311881 167686 -39113 142462 55880 -32681 206460
21857 342321 -181982 -26793 1700 -128837 24689 60451 263587 30739 58278 373358 47149
21845 -141538 -60607 91226 -294920 217530 -114790 -272681 183329 -320257 173296 -300376
21834 42197 207964 -80905 -326973 86645 -89774 -194149 -209470 -148924 -252979 -392079 237847
21822 120842 13716 -173091 -183307 -107444 128889 -265405 -38174 224935 443196 96760
21811 -10917 -241973 70620 -324743 -127158 81937 -161233 120593 45045 47671 -224465 198385
21799 -96117 236167 -144810 -96547 -73921 -129149 -138460 56290 223866 194634 -154218 -127221
21788 -127221 8165 -204604 -240992 -22183 -20051 245869 -167500 63372 246228 -36699 4426
21776 116625 79685 -27617 71623 171358 79071 -148862 45443 46976 -161127 329598 44032
21764 -18995 116798 -308450 -715096 -47327 -170522 302325 -55447 -140037 -108545 199425
21753 -13123 -416446 219019 294944 -168758 53604 -23806 -168650 -185634 19350 130038 -402917
21741 -137671 -229833 206665 48696 365489 -221842 -63714 63243 -240161 94405 -337835
21730 80365 55229 214912 -279202 174673 23179 -385038 59477 -97763 -3326 166976 -82951
21718 -170259 53825 -133570 -69536 -79646 -85230 147588 160130 31247 74871 -68274 -36508
21707 -36508 -108847 -61674 9076 87611 -564631 108742 -79457 -147085 108421 134933 169095
21696 169095 -456849 9701 87690 87586 9262 -305446 -482922 -402507 190329 -283081 -63509
21684 -61897 138451 167154 -74628 33849 11509 -233339 259896 143445 -39215 -160523 -225037
21673 -225037 -210647 -2742 253597 -67873 354690 26343 189253 6253 -424085 71048 -174817
21661 -277947 246037 -110162 -19886 106451 -385450 -371895 90785 -7640 -217464 -145631 -13816
21649 333229 -241597 23820 71273 -99487 -247647 -141360 -136591 -286784 -26343 -102309 -55772
21638 -55772 80831 -368641 -266366 -57909 72013 -263734 -46043 66977 -92371 -125621 419751
21626 45531 310649 -115641 -138003 -83694 -677 -178292 247554 198325 -68463 26677 31375
21615 31375 -277691 -277928 187825 197960 -231394 -89027 155168 -261754 116518 -140736 -62361
21603 -136423 -10779 134758 -109205 143366 143654 -19661 -307233 -21136 -182953 309247 47119
21591 56870 -122023 198579 -46780 172110 -90717 -45823 217057 -137026 440666 -276087
21580 -139596 -101390 172719 -48412 -119562 117691 234321 -68086 31972 106122 -60339 139556
21568 -500777 -143681 -190814 -71592 -112859 -88118 125711 -214651 -40853 -439209 250824
21557 5808 -130637 66913 -46523 24221 185724 -100334 72624 -210473 128256 -194553 -247463
21546 -247463 -266240 89332 72647 193844 151003 15772 144496 148829 -35803 -390847 103501
21534 -75367 -60178 158545 -59247 7847 -311375 38238 -44771 -377695 248670 -203813 -606177
21523 -606177 -180304 6907 -70985 -151147 -188947 -4410 65102 -43162 134491 -111274 -212477
21512 -212477 214138 83602 -98398 -136400 -107835 388756 -85319 -227638 -133284 -150077 -198652
21501 -198652 -100513 274339 141183 -87970 15507 -47634 -17438 -9472 -63561 -25573 141674
21489 -347931 -221509 187266 -268305 13845 -108314 -141952 -112504 -154639 -381306 111804
21478 70694 -168336 -179975 -194144 -222820 -211120 -97986 -82747 -61175 -82172 21929 -250395
21466 -289772 267604 -76672 -246763 -51109 214050 134403 -268256 23467 44959 148213
21456 148213 -194481 74265 -214823 -47852 -202319 111896 -346362 -226460 236953 194212
21446 194212 -410924 15560 151794 260458 24204 258690 202803 171251 9097 -88006 384855
21434 87846 172363 289808 247733 83186 -59212 225598 -109560 -293706 24210 95704 -15859
21422 -190633 -151028 -171157 12007 54498 -108159 -507806 200264 -27901 -217619 27502 188003
21411 188003 -63418 116712 15877 -83312 -119238 -87774 129564 -147956 259474 -100778
21400 -94549 54893 -178712 279382 -4380 -48244 86499 -13070 -268206 -26221 53516 130796
21389 130796 -103028 -210971 -187384 -399755 -495313 -89355 24183 52870 149344 289886 -114250
21377 -204160 -153896 -147513 208612 -57240 -75545 -75990 10406 128242 -180266 19004 48541
21366 48541 -274210 53692 -91864 -134420 -169513 -71349 -115898 -52064 -57964 46484 -132994
21354 207416 -146928 206796 -293660 80096 -170619 190025 -32111 -6089 -55101 52221 -142093
21342 -272622 -175719 -54562 51195 34141 106877 -34009 -190668 -56513 27093 -173398 -91507
21331 -91507 49722 -200879 -9537 36444 124462 -88505 -218654 -206245 -263493 -46719 -48698 -123131
21319 -123131 -118985 -133612 99110 258776 -11420 148836 50492 42790 -168483 52044 -327104
21307 93098 -358270 -136883 -28308 55253 76192 80860 71090 164192 2296 -219592 -358258
21296 -358258 -269871 -61968 168638 -194376 -168449 -130073 18550 -277641 108370 8163 -189288
21284 -266111 124790 -11785 -36238 -201220 -222659 -122555 -39133 -168356 -171478 -20179 -156060
21273 -156060 -123831 -43261 -31744 -84165 -174032 110497 182105 -51017 158499 -72530 -65574
21262 -65574 156113 57290 78733 352624 -240136 -182721 -139531 -255600 -118903 -39464 -18330
21250 -104504 131105 288142 -52605 -267576 -123798 -225963 57102 -126225 52399 -132249
21239 -399262 -226681 -25655 85715 158996 7713 26739 -36185 -308073 -192737 -227945 50994
21227 30476 -240922 50385 -77542 84649 299318 26764 20764 261910 219190 180138 254630
21216 254630 19580 -203305 -189556 -350969 -170469 82887 -144022 118603 -57203 135418
21205 -1482 -112474 -183159 61838 -87372 -53989 -276391 -159801 -309116 190162 -336962 -31584
21193 -193091 33155 -291701 45823 -439473 -250314 -13648 -242640 -80493 -115217 173227
21182 27194 9247 -6292 -38468 147679 73359 -201509 802 -121421 -333982 -168701 82487
21170 123711 -46170 -131678 -94352 -173132 54456 -125611 45768 -167240 -185488 71385 -237160
21158 -42520 -35570 75326 65844 -228377 -157671 -26204 18762 -21085 -46607 180928 271971 -43993
21145 -158996 153815 -108758 -341010 -108098 104308 12254 6696 -105235 -103957 -46271 74030
21133 -72127 -38138 178034 337420 -10570 -30564 -113168 -311567 79706 90527 332968 -113819
21121 17473 -62987 -74591 -143017 -306728 -190025 -123945 125339 -187405 -183391 -158760 27450
21109 307192 177903 145207 53291 -52022 -68774 -144994 20126 -172016 254214 -160843 -5800
21097 -165291 98584 -41212 -134635 15134 113364 85979 -97932 -343091 -15753 -86657 -205346
21086 -205346 -100086 -28174 65793 -309510 -1881 97798 -87498 -242621 55701 -280838 -172454
21075 -172454 -20747 -180410 -63335 -250624 57252 67268 -263933 -7171 -131414 -222863 -213604
21064 -213604 315308 -141467 99804 249221 -13173 139445 -216100 -63139 -407337 -161929
21053 -87062 107706 -194501 47687 -67734 168980 -165164 -207891 -93671 -45592 -43780 139405
21041 -40489 35748 -85047 141193 139404 91551 89725 -130706 -1743 72874 -328424 8204 -18434
21028 -208431 126844 -144140 183296 -176464 200427 -78663 -79650 -212864 -103038 -27185
21017 172617 -62142 102723 -50156 17496 33785 -238225 197989 -206180 24865 37089 -291884
21005 -59529 -132407 -165635 68641 -62037 108707 162691 -161868 -118201 24147 255747 -254758
20993 -458559 143526 185079 -46916 -43408 -261251 118119 -313307 -169016 -30548 294792
20982 148577 504437 29321 -71992 41563 -150 -382597 131842 -47851 449979 2358 17492
20971 17492 -331455 -263088 -6354 -17987 246149 -183039 -149454 -39228 611282 187651 -22429
20959 -69114 -6457 205057 93853 18259 -480496 -36464 263628 1283 231037 -124422 -165469
20948 -165469 -1366 -425826 -165220 -214213 -228470 -210905 81369 157313 43970 -116162 -240642
20937 -240642 -52863 76027 181846 28869 -83950 225781 -148358 -316864 61948 161131 -182071
20925 333368 146043 -321632 -65296 -121855 -323881 -62359 -45216 263680 -241355 147169
20914 -286486 246946 -22779 -525512 -264976 79595 85986 16723 -33228 -93086 116755 174117
20903 174117 -164625 -12306 -102933 -86222 47492 58366 -84934 138819 -265236 180187 -83747
20891 34317 47361 89057 -119947 -69182 317480 -254185 -134349 47845 -143099 -118523 -301953
20880 -301953 66751 -328815 -182951 210638 -189655 -208344 -244033 -234921 167364 -177776
20869 -8439 -90025 29777 -78242 -217242 163688 89277 124328 -25639 -43382 -353006 -201050
20858 -201050 -280221 -205105 -161817 16664 -65133 79763 -166067 -124956 -231998 -3206 -287952
20847 -287952 -130903 115852 -65673 134183 86992 46496 -284035 -122782 -325697 -133331
20836 -248639 -31287 -164576 -172354 92787 -286839 259884 -255099 -79205 14164 20102 -240391
20824 153346 -422819 -43479 176315 90120 -237497 157772 -282983 129546 -97504 -47366
20813 36085 -137604 -234598 -98280 84169 -101537 -110527 55322 -216279 -123852 162382 -51825
20801 38919 152115 109357 -170776 -9012 -231092 -23976 -316759 264256 152650 -7303 104891
20789 -135029 33340 207098 -333892 -244586 -68443 115013 200392 -49138 110191 -134885
20778 12266 30487 274206 -204660 -171090 -24655 -315642 -16478 -112951 339237 66195 8990
20766 178211 -175812 -339787 -57819 25480 -247534 -231895 -16818 32331 118304 53825 4232
20754 -65967 -115639 -98620 59287 -211218 -92875 -12383 -140849 9966 -340015 -307601 -139297
20742 136398 240463 -300152 -16024 -133604 -150144 149673 -8392 -51481 -211140 -280979 -143148
20731 -143148 67400 -99487 -153792 -30349 235247 -116017 12750 -41460 -13984 52173 -222827
20719 -107085 88086 -195155 -127838 -124797 -188601 92252 -119626 214204 119604 -126779 -108699
20708 -108699 -115879 -11093 -193553 -191741 -482814 -268390 86488 43597 -48362 206188 152545
20697 152545 66815 -89538 -140585 19861 -58583 -290135 -94400 47442 -110985 1521 -121343
20685 -48348 -190810 109430 -337799 -296714 -185491 49821 -21104 -23770 74515 -148132 -45400
20673 -152627 10828 77281 -25680 24240 -228133 -166936 -67363 -244090 -197832 -360301 132395
20661 176578 -139936 180993 -207392 -48850 53050 -193515 -193803 235136 -240228 216625
20650 -153157 -90507 -262195 22515 -220874 97166 272199 -77827 -377849 -101778 -145453
20640 -145453 -505740 -40122 143636 -117390 -162305 -74419 210612 -72366 110023 -113312
20629 -123259 69634 53370 14204 115553 -364386 9040 137425 -155032 -66638 -59868 18794
20617 -74420 321265 140516 -41760 199992 -44085 -408272 86421 -66784 -474210 -161400
20606 55747 -198092 -127049 -67287 -531 -358801 -156282 43119 -56456 -313828 546910 96266
20594 -3632 -98809 -358001 25003 138613 98827 -280462 -186336 71908 -8833 -76388 148114
20582 -103069 117272 -280508 -266440 -37687 200372 155618 334195 78617 144451 -129572
20571 -116410 -104570 -148568 51652 -273756 170386 -170486 47601 -66344 -152323 168753 -380202
20559 -120543 -290759 -228221 -258315 -226848 -122 -130880 -784 -19708 -236327 -86212 365244
20547 -18581 -133316 120262 -323111 -79545 165621 -322135 -34892 178350 -32711 -37491 -378624
20536 -378624 -94157 -94990 -225758 -73955 -113193 -80426 -440444 -91097 264472 -73723 -88453
20525 -88453 215412 -142415 -217731 73741 -49589 162361 -248742 6464 -429348 -507127 382879
20513 -50816 -152929 -267304 -109630 62982 143201 59003 -256374 -239348 -404253 131842
20502 -9141 149755 -242154 -208121 -41130 -260424 147523 32235 -75070 159804 260708 97400
20490 93509 -54959 159611 -260646 -232017 -291638 -2527 -204608 -97962 -328123 -18415 -241049
20479 -241049 -156244 -31012 -74488 185622 -316937 -115546 -310569 304869 -92044 36612
20468 -9361 -182082 52635 -95860 283455 208813 -209168 335508 -81036 132908 -168955 -498001
20457 -498001 -231351 83860 251757 -64744 -7000 -157519 209410 348989 12571 17785 21122
20446 21122 295173 4816 -241549 -208823 -57232 -150307 20814 -149459 -105866 -274268 158810
20434 -129591 -172638 -113367 -179518 67775 -105559 -294061 -89493 -178121 -267707 122050 71691
20423 71691 -19482 39397 -24932 308249 -34218 -9802 52089 59626 32564 254062 143496
20412 143496 163669 -86127 -59918 -236731 -162738 -159070 -171830 -18516 -390419 39676 -52398
20400 80155 46505 122914 26161 109653 -116520 -450557 -140515 -91999 34572 56855 -191109
20388 95916 12604 -51470 -113357 24861 75469 41982 -412689 -72422 -68525 -32592 15072 15090
20376 15090 -289027 -83854 1469 -60314 239515 -246573 -327915 56439 71932 -10533 320716
20364 35596 -198381 -287285 42089 -144032 3737 234292 -230101 -219608 52457 -75532 -144369
20353 -144369 -467778 161356 199140 -569971 102948 -110734 35681 -183532 -147659 166888
20342 -295 -137956 -66310 80382 -90266 22868 -37204 -127970 -100056 35464 -20363 -138435 79344
20329 20910 275281 15286 153386 -84172 -156121 40786 -57575 -20394 -124453 -8851 -45819
20318 -45819 -126236 -60990 111066 79688 -83158 -52277 -51466 -36966 -191333 -378286 -29820
20306 164352 -67075 -88901 -413961 -246762 182381 -464013 -6548 139828 -60085 174759
20295 -9177 238446 -109846 -147929 108315 38520 -101751 60431 -45535 391409 22928 -88213
20283 -201912 -123236 160076 209862 52833 115404 96285 -183904 -251679 247589 -298948 104390
20271 -207940 -87 -68811 90630 142533 125742 -231959 -228454 -351194 -168436 44976 -107315
20259 31762 45040 -35521 -234123 -92558 -142213 192658 -3443 91962 172253 -154078 -182910
20248 -182910 -86538 -166878 -123917 79682 342873 32800 128445 -187390 -470236 -226355 99546
20236 -277755 120698 9328 -158558 -465500 239917 -84073 -229980 -60314 -174319 -161188
20226 -161188 219623 -470876 -114743 -78341 121881 -4006 -218859 232137 -70214 72035
20215 -116675 5392 23897 -430941 -49855 -257285 -106738 -309384 4794 -153 27676 326112
20204 326112 -143848 21368 -225400 -32438 -185745 7229 85636 171595 110695 -202351 -61850
20192 -57002 -386603 -112888 122521 36523 391269 152957 -154168 285134 49145 -177971
20181 3765 163907 -260987 21529 -117644 -176547 -98588 202613 223617 74445 -127688 -274733
20170 -274733 -179221 -82755 -11288 -50815 261323 -106243 -74900 -53975 337191 475359 -23659
20158 131981 -94048 209349 -216133 -344103 -89044 -9488 -54258 -92263 -64216 -182654 -354518
20147 -354518 -128288 -60357 -71285 -52921 -18829 -108124 -140413 -19064 84313 175422 -123365
20135 -44983 -77062 -103578 -29391 -104578 -59178 -244244 -20852 40523 -445329 -15357 78054
20123 -103498 99529 68697 57304 104608 -103056 9683 -87700 103107 -2813 -88155 -251350
20112 -251350 -11941 -82426 25086 -246241 -68273 -511815 163237 -223611 162949 -262379
20101 -74026 109810 159681 -241174 30302 219009 -69548 -172269 94500 33361 -112896 -223501
20090 -223501 -60652 96928 -51745 -110215 -28546 -401781 157379 -116018 181568 -409712
20079 360845 -162320 -107506 -82466 34816 -427993 305614 -314156 97069 -12973 315911
20068 214762 -63393 301226 92497 -210274 -270020 176048 -212851 -58138 -193672 204313
20057 -126839 -204526 -355423 -177746 -34946 -160013 -242576 82762 136410 60383 -198947 -347789
20046 -347789 -92987 -60291 -89302 -11632 120068 92143 -218193 -28643 -28990 -327382 -464424
20035 -464424 -204996 -318798 -198764 250824 224457 11153 105990 33124 -244640 8241 -128877
20023 -74668 -171525 -89379 234779 23035 -184899 -146532 62666 59142 -77427 31806 22544 -240692
20010 -178866 112651 46390 -5460 -28643 35402 -202025 93888 -132771 -109079 149213 14758
19998 14066 25028 106994 -61852 137617 56190 466119 32814 -236089 43276 -137190 -361637
19987 -361637 -48884 -63021 6985 -473126 108255 118996 -391714 -151134 162226 -34453 -77558
19976 -77558 110340 85930 -158335 -228059 -126114 77790 -275313 -15528 -205500 -105990 -126198
19965 -126198 -163387 143740 87692 -285416 333663 -178032 -197686 61361 -431008 42903
19954 27954 -3534 -360531 -224598 75916 -8112 37014 267036 10000 121694 99260 -39568
19942 98031 -345300 -256190 -361282 -15057 250867 136458 175814 267367 -103138 201314
19931 -154697 -148683 140288 96792 -395911 11563 71179 183425 67268 89304 93187 -154711
19919 -95638 217787 -123914 593672 -169501 -256467 59023 -225528 -13682 -296566 -252815
19909 -252815 -220061 -183311 -21781 -51183 -198604 -88993 80223 -303612 -27062 -7647 14335
19897 219137 -137155 93028 -110341 181364 -129799 67334 52868 -138304 213682 -350878
19886 134467 983 -20013 -244086 367977 191696 202593 147778 -222049 211082 -232494 151615
19874 -68736 57145 -178297 105162 -254732 58407 -97130 9705 -323506 -8129 -290951 -12363
19862 -222747 13143 -151225 -114334 -239981 86170 -220311 -274835 -13764 -304102 -51040 85138
19850 -240776 -46431 -157456 -126159 -183809 -59734 14212 -586294 218679 -69492 -516627 -373151
19839 -373151 -255292 197125 -145166 -144793 -114396 -240044 -155152 -57521 -108389 108592 -404846
19827 51860 -251545 -233810 -271677 -35676 -111304 116241 90147 13576 180128 -259355 85024
19815 -126571 102300 -207375 26348 73573 32931 -105641 75533 -242655 -6726 -85511 21781
19803 -6338 497 109596 -218916 153289 -134599 -449704 -80720 -217933 157860 35566 198184
19792 198184 263459 785 -185760 81769 -250892 24795 -589724 -162788 -184277 -118562 -44115
19780 -206331 120075 -382895 -285573 -2883 -197508 99920 29188 96175 270274 178540 -72128
19768 13362 139281 57466 -168421 1986 -339626 -97432 -37877 158187 -13200 -8677 -100637
19757 -100637 6520 -223895 -95508 157291 121821 1088 149688 -28162 -59449 -156185 -142113
19746 -142113 58105 55594 -224566 -95331 -167444 116584 -162926 -4879 310631 8618 -500266
19734 -236612 -187581 -18332 152392 48047 -147999 181638 6615 -49660 -254051 -393824 91990
19722 -12961 -34977 154173 -289330 -164676 -382126 -50996 -71897 -232832 13678 -30110 -211331
19711 -211331 -49941 -213590 133169 -66036 15876 -27416 54554 -23070 197300 3248 -233073
19699 266172 100461 -246860 -176269 -51538 13397 109927 -204846 193926 181392 -53757 -218492
19688 -218492 -69783 76021 -371568 117528 -350273 43649 234029 145833 -569041 -271388
19677 -280611 35624 -201479 -52701 -166765 40147 -68943 -152577 -106052 131499 141922 -367104
19665 -8487 -90640 -255865 -108346 309941 16900 77595 98474 -72464 -152307 217532 8352
19653 -173425 94898 304806 -32014 -111007 10092 138814 182981 305822 -267020 -179993 259271
19641 -174703 -25632 64034 127374 11965 -30694 96630 -14528 -7476 113847 -182515 -201212
19630 -201212 210426 -19692 -111135 112546 -48369 -101177 -243316 -238882 198751 -119190 -8134
19618 -299785 414870 -200055 -377650 235695 -45858 324976 -242729 -19 -74201 -163176 93559
19606 -108831 18005 -176762 -122997 68270 90584 -298533 -39999 2190 -23884 7072 -194579
19594 -286383 -224425 -125362 145629 -118842 299628 -129693 -122578 -141210 165962 -26676 -240460
19583 -240460 139634 -19323 -75084 -215155 -311294 -62189 138968 267489 216838 -25553 -158521
19572 -158521 -408427 -345508 76782 190685 43986 -53422 475838 -184890 54490 135815 -177677
19560 9574 117774 -35710 100873 -305172 -130959 -141274 -430165 -161177 235916 50857
19549 -158962 -43925 -251128 345970 58131 -94608 62943 -181233 -50399 97388 24842 -269101
19537 -191944 77974 -34585 98589 -252950 45119 -57730 83455 -65888 -345469 -72498 -116326
19526 -116326 -33037 -95675 -470 -325814 -327763 -7487 -57997 -29596 -201533 -335502 -11793 -363649
19514 -363649 84533 11781 69797 -144983 -264957 300761 -221061 -119816 -151042 -146908 -97340
19503 -97340 -330579 223039 196864 71143 -156720 67543 2164 -5636 -252922 -32729 78329
19491 -502065 167749 68504 144122 29900 196536 -323633 -340891 -140608 -78779 -28043 -220233
19480 -220233 -44752 -198578 72891 -244219 39320 21927 -143384 -244602 -230574 -93386 313012
19468 -231694 -14186 -15654 -87386 96822 2025 -52585 70018 -44183 -19395 -105292 -190117 -30297
19455 196219 -90666 79041 141297 -127789 -296949 -338852 -192256 -44327 -268302 420020
19444 -160666 169402 136742 131405 -256023 332179 -277410 -311317 172289 -265516 84931
19433 -11652 -122681 30858 49556 -147103 -112439 286884 -117526 -277660 -320741 -631785
19423 -631785 54163 -99788 -446043 -298418 95835 -414104 -320368 -158464 78444 -93568 -224106
19412 -224106 182116 156635 -271950 -70854 156564 -174203 220900 -35657 27290 163994
19402 163994 -269435 -43896 67109 -219663 -34085 -239865 109521 -14025 -236973 -223333
19392 -223333 -196674 68464 192146 -255937 -215105 22753 49010 174533 -164444 -242988 39807
19380 -105133 283411 -103333 111594 -176210 -256247 -81210 -259638 -86389 210126 196982
19370 196982 -401316 -42915 -195499 -246146 -287414 -14809 -209330 116707 -493918 91012
19359 27342 5016 60897 213385 -251175 -142445 144946 -8218 -277395 -411244 -165257 -385295
19348 -385295 27223 -118239 176193 220321 85466 -148658 62697 -373641 -96312 -184851 -93362
19337 -93362 20633 95271 28874 70429 172581 66606 72498 -382017 -115268 -22861 -140385
19326 -140385 -58484 105250 373103 -121388 55443 -102316 -366746 -94434 -195746 91150
19315 260453 -91524 145325 8139 125384 9357 17504 -242637 225715 60292 46321 72151
19304 72151 -51971 -154730 264952 -74983 -69220 -129867 -224999 223219 -228612 -179717 -70075
19292 -143677 -81865 -71362 217215 -74636 -220546 -257527 -86773 -2342 -293877 199087 -16784
19280 -20965 205710 -303166 927 -98879 -138715 -17869 -67417 -147509 46762 -5443 -143147 -115292
19268 -115292 256850 -9841 206646 -15205 -87482 68900 -194396 -35757 -267523 216399 144757
19257 144757 139138 42063 -201373 121636 204683 -266636 -312921 -331143 32230 84672 -144622
19245 -118802 84782 40292 -160730 -326117 187318 163288 -110374 93711 -179705 -117269
19235 -117269 -123417 220725 -83736 -198270 -315242 -129839 -74376 -26681 -126829 -33182 -263336
19224 -263336 -180410 -89596 -82792 -210342 -49213 -110109 -229206 24958 -153608 83348 127215
19213 127215 163019 -47472 -241121 20064 -233043 222775 142171 -131412 -255872 382668
19202 74058 37132 92579 -116169 -172790 -347935 287829 356383 88943 121738 38165 48879
19191 48879 -230422 162971 -337500 -157000 -110837 172947 193595 -135739 -208584 201787
19180 7561 -199512 97085 -333645 -178136 -33495 -124734 336907 -60206 -82887 -60496 -197064
19169 -197064 -322240 203587 -74644 441054 -88311 172942 -268609 -107604 -2454 -253445
19159 -253445 -180739 60896 41674 111272 145106 -53095 39964 35819 308490 228330 -203454
19147 -317515 -279224 14958 11978 3107 -29288 -185300 -126514 -93511 -97562 -130143 -239370 -43331
19134 -99494 -82040 34064 169356 55118 303277 -413649 152865 -108587 232158 -149032
19123 150648 30129 -79051 -218463 -44658 -364761 -293612 -79069 -163423 -201448 235221 201354
19112 201354 -121782 81989 -227247 -2537 -297012 -281859 -80797 204905 -409161 84331 -437248
19100 -159624 -341105 -386329 -493029 -294682 111848 119685 153143 -338805 54637 -134485
19089 113176 -64971 -375081 214910 -194366 226067 80150 -67939 3023 -123412 -26848 -181868
19078 -181868 -364376 166118 -104290 114311 -98551 -54292 -170615 115626 -197256 -306027
19068 -306027 -158709 103346 -53945 203107 148171 -41781 98707 -24975 135083 -30594 11513
19056 117466 -137900 -166071 -74016 47547 46113 -215122 -210576 25065 -67987 -372468 238533
19044 -230681 -183869 -185493 49639 -221646 -43223 134203 -67493 173859 80176 28219 -10667
19032 -25395 7391 266635 237493 -85820 -35585 -73974 371216 -47616 5780 -168845 -204639
19021 -204639 284195 103602 82270 178851 221042 -139507 36712 166144 -246621 -258432
19011 -258432 323317 89302 75029 -102456 49588 -147216 155191 71094 -18643 -6323 -270527
19000 -270527 76035 67089 95954 -264046 -269415 -228965 -313772 -138301 -238565 -216155 -200334
18989 -200334 9416 -258771 -327469 -170333 251728 -339742 -22334 -114809 4703 65789 -271902
18977 -56000 90145 -262214 197222 -81658 -88858 234771 -2941 -207044 -9138 71995 -13050
18965 95007 11769 -202909 109038 -33456 54638 115592 -171448 -41322 -207080 -51802 12811
18953 -39777 31580 -140318 139804 97849 -124417 219841 46509 105235 61389 -40246 -121952
18942 -121952 -49141 123661 -53181 54383 -269980 -371062 -262243 240091 -2861 -147799
18932 -147799 -85332 31609 423044 -98051 -46998 -20925 -287432 -94782 -21523 153299 -23477
18920 -71927 197998 144830 -142045 -437796 -190709 -152911 -96916 -23120 -84589 -170708 83322
18908 407012 -99841 231246 -183560 353045 43947 -38506 171747 -63745 -69021 -288986 136877
18896 -174970 -32904 -122951 -184992 -20033 70273 -58381 -320581 67853 147385 -238496 -86539
18884 -80894 -3219 -102700 -466985 -157982 291549 -50136 -426951 -337823 -86738 -104408 2315
18872 -83577 -152512 -46478 54173 105049 -120779 67651 -99897 146063 -80196 58625 -128000
18860 -253240 199362 -43309 -159937 190812 -72878 142687 301329 -109864 14946 -216120
18849 161516 -231024 124828 301357 88168 -326835 81728 -108751 18419 -116580 -80290
18839 -80290 -157142 -96134 255460 17147 -195383 -62063 -210568 -20570 -41472 21408 -81475
18827 231616 -202733 80033 -207449 128606 -110933 3042 -7614 -42629 -256571 203527 -57764
18815 222477 -125352 386373 -86778 114261 -63262 -29942 -441052 183043 287734 159063
18805 159063 -142632 -70037 -46939 75118 105490 -119941 73953 -311181 -100878 -55424 -83331
18794 -83331 -376622 -163454 126005 -71990 -443347 -228424 -308131 -122179 -140397 -460942
18784 -460942 -171734 -502412 -200314 -3237 -219853 5189 -214001 18689 -18998 85601 -106942
18772 86946 -113200 -279241 -364625 50575 -272605 65464 -188671 -427295 -262842 -81689
18761 -49224 -132863 -232729 -209126 2875 93901 -103713 180449 -431847 -233495 -69429 -83176
18750 -83176 76440 8504 -280937 -12579 -12295 -66233 -170905 55085 45560 382875 78025 210579
18738 210579 86175 -208296 170839 148921 -136857 -53363 12915 -26718 205594 -177900
18727 -83840 -89214 -126850 -121270 -51997 21679 225514 9645 259122 -295776 14893 -107849
18715 -362809 -171694 68281 -34348 240187 -86062 -197492 155405 -87676 -103976 -169787 -90366
18704 -90366 -134866 251944 47135 -16636 43109 -259835 228508 -96463 -179021 148465 -110235
18692 -193268 561359 -47063 30949 -164960 37151 -320159 329717 21608 118737 -35189 -330541
18681 -330541 23079 -168682 -76613 48766 -151796 -206540 -231297 -118718 29791 -154774 18676
18669 -88762 -218773 -17941 -8191 23790 -31612 -215705 -100469 -273606 58509 -19585 132305
18657 -196182 510885 -142324 -160407 -95670 -66629 36729 -51947 -175339 158573 280331
18647 280331 -197646 47789 -180903 -136212 124901 33048 -231607 -323482 146869 -173375
18636 -76001 -368988 -100646 -158260 -168903 -234845 155231 -115663 77445 -115517 213804
18625 172033 -72604 173158 228316 -223188 281630 92079 -134323 -340117 -67252 203398
18614 -91933 -342994 87854 29118 -190701 31084 203938 -43185 100754 56320 -102388 -241180
18603 -241180 17786 -81936 -51995 -132287 -27320 -37088 -164635 -97195 -234580 -131267 116650
18591 -366246 -64835 -56481 -128582 -129088 -1846 37417 -111908 149776 60281 -75992 -248170 172949
18578 53323 74039 -196743 -102443 12535 -154977 -381697 33439 53652 55033 15635 50234
18567 50234 -222741 113957 -37327 -87909 -258062 47276 -188203 -77184 -305334 71633 6859
18555 -230217 70499 96962 -17914 60679 -87016 -439309 29430 -81326 -282694 -104308 37757
18543 -62098 -74175 -363774 91527 46357 -131388 -262209 -53003 114624 -261435 -233171 -127634
18532 -127634 -34342 -188589 -360051 -17154 92418 183705 -167970 -375176 -75228 -27260 243289
18520 -35470 -58139 -186052 -448385 55318 -236628 -483338 368967 126524 192984 -32821
18509 -149806 -183231 -17907 -226540 -79501 26845 -39054 -193897 187014 -205881 -9873 15332
18497 -118724 -203503 -249521 -111893 -132086 87448 -260001 -102337 121912 -178990 -107273
18487 -107273 -195611 -197578 -40318 -206722 -78592 -146245 -190959 193741 24847 -552750 -70281
18475 -112932 -61456 -310195 3861 -408558 -112727 -261108 -16056 -34158 166976 -284835
18464 -232162 -63397 82431 134790 175100 -366994 6280 157640 87121 -133938 -13198 184612
18452 70583 -180869 -66268 -68157 -10375 143918 -138315 -193713 -97618 -2851 -174274 -258972
18441 -258972 -262267 59682 70998 -128296 112394 -175339 51213 151052 -104666 82213 -73102
18429 380956 -74799 -160687 23490 -60563 -68375 42708 -237075 -58873 -38027 -285525 77197
18417 -145766 -104639 -6654 -136730 24477 -144441 166785 176602 43902 -110834 -119567 -24174
18405 -80693 10997 -2036 -210911 -177698 246290 -178185 -69046 -321587 15888 194250 94968
18393 -105528 -227405 -175668 65189 -137283 -133446 -333794 72788 257538 34345 -224173 -309867
18382 -309867 -263188 121504 -235652 -63425 140481 -280032 -343634 -85697 -191401 -166779
18372 -166779 -294267 -114911 224378 -124795 -196731 69171 21564 405077 -377744 -511734
18362 -511734 -122564 112242 25929 -104633 -96516 -240352 -251610 -41784 18938 -208242 156321
18350 6531 -102076 30727 108918 -180732 -81596 55589 91279 -305369 -14408 -88727 -92202
18339 -92202 131768 126715 -100701 -50184 -98857 -203741 -165055 85608 172357 -138947 -303904
18328 -303904 -53466 80814 24511 -196041 -97184 64813 285562 16137 25337 170689 -85690
18316 -192533 152168 119412 -335738 44621 -150609 436740 25152 -304860 -155928 9761
18305 -141912 -271959 -259200 -65740 88255 -453584 -123517 68130 -48570 -10037 -14007 223044
18293 -31889 -22335 176057 -49805 160225 39747 3882 188356 -128363 17047 554491 209322
18281 239239 -107138 99591 314778 36500 125397 -227652 -195516 13115 -161713 -126200 29447
18269 -242993 -3311 -114180 38650 -384662 -127621 211892 -136405 -141012 524641 75471 -10427
18257 23116 -180524 -267107 -4694 -49799 193606 2148 44163 -81537 206867 -172739 34165
18245 62430 31390 -129177 68490 -381960 197488 -103155 148625 109871 -178997 30554
18234 191138 272910 404484 -12849 -10883 -19218 137921 -2293 -24068 58507 34525 -287134
18222 146293 -299212 214209 -278691 157208 -207099 322158 101131 -168031 -105022 -205966
18212 -205966 -72495 -29706 66891 107419 -277428 -26502 -162349 -1344 115936 -132959 -418404
18201 -418404 -157014 -83631 -793 -187762 253888 303136 -144830 -143667 -73514 123113 -23213
18189 -42110 -49095 -433609 34739 -6522 63519 -180126 52388 -36355 26631 172381 -219529
18177 301932 -472933 91728 -24579 -318986 -229931 -11123 42998 180552 -128752 -184906 -169402
18166 -169402 -307619 61525 9271 53185 13583 -422285 -52037 -58524 121046 -174778 113980
18154 170033 -284604 -168658 82975 148625 39786 219077 -220429 -443726 -150745 -19404
18143 -209341 5439 35247 455323 -73652 160370 -108959 74533 -215889 248835 -280657
18132 181244 -159616 34108 90029 246415 243422 -180051 -114076 -53130 -357350 -253918 207965
18120 -128619 252811 -39120 119137 -154572 -162085 246946 -227701 -209970 -19658 -9491 -121730
18109 -121730 6895 42442 -87442 -37923 33251 -331168 -8189 -104691 -33666 -116092 60688 -178976
18096 -319661 -248908 -24420 283933 -173961 -210042 -46433 -158511 149793 223451 8365 -29362
18084 -57677 -164162 114762 -122543 -425476 112446 -67841 -77558 -14762 -31212 -6582 -35172
18073 -35172 -207334 120562 -173415 -106019 6020 102595 -217602 -270457 -24360 182593 -48916
18061 50709 200262 205110 41596 55854 -354612 -61772 -102104 -65997 104889 236445 -350182
18049 -164839 96219 -57829 196411 -36363 698 137449 32835 227936 -87931 108685 103212
18038 103212 -66086 83904 -175717 106208 239877 157290 135579 -235208 69633 127273 -166669
18026 -77051 -25242 -36761 -49172 -103164 -127208 -173067 -275424 339963 -237638 -13528 351050
18014 -47080 -143109 -165742 -163238 -152022 -217941 -207732 543379 -143405 -190140 -135453 -417191
18003 -417191 -117432 -59869 -84686 -432089 -92576 -164090 66987 203476 220877 -138596 289297
17991 -214299 -30772 -96319 73271 67702 300661 -170902 128262 197125 -180656 -43798 -10671
17979 -102363 101192 242071 26976 82658 -91703 -286589 202338 -68144 16512 57822 -56598
17967 128962 154368 230828 -76870 166183 159965 -141446 -56215 182962 121808 -103972 -89421
17956 -89421 155576 57169 -5352 -151295 -191269 -207715 -130585 87587 -75442 73850 -109595
17944 -21410 126384 -325455 -147252 310256 -83721 75394 -20960 66111 27042 -271944 78660
17932 -273977 -131013 9835 -174745 14964 -26517 -125310 -64834 182002 -25764 161437 15887
17920 9183 -373620 -147090 -269787 -69011 68566 84694 -105226 164510 120977 213004 167983
17909 167983 194144 254700 -67247 -281275 263880 35756 49702 -12488 210942 -11262 301657
17897 124810 -1787 -193416 393291 7576 115675 -162512 82650 2283 -8665 -21866 37606
17885 -14046 -79675 222319 112821 60042 58142 -5442 -189717 103014 -162573 236181 31060
17873 -216576 86307 224335 -31125 244939 -80709 30429 -215314 262013 -95579 130451
17862 358460 35050 -282372 350112 102687 -32030 8486 -184698 -345123 152053 -257160
17851 -87639 22728 -28372 -26707 -385113 198138 -169720 243000 158431 -139714 98193 241737
17840 241737 -405600 344923 -164766 -294897 -136373 -171512 -48811 4915 183167 53213
17829 152387 -240122 15205 238591 -86694 -226433 -74347 172728 -221358 186255 5239
17818 6672 -155041 110985 468055 -46010 305093 28490 109532 -157433 -269670 23367 196138
17807 196138 -193622 27638 -300355 -28123 -216855 -150986 155174 -265375 143376 131158
17797 131158 117495 -131957 110007 -123112 194766 -86617 82598 -50536 -75904 102207
17786 -211294 -198457 5569 -683098 -3948 133025 -3483 -16269 -183017 237536 -14036 -84978
17775 -84978 133692 -457970 -76994 285001 142134 40998 -131667 171721 -315627 69771
17764 -232810 148090 139226 199568 -381411 116964 391067 299470 -69956 156220 230901 282519
17753 282519 231514 123131 -148620 382014 -51219 -361757 1055 -33349 -243283 244264
17742 -168645 -47050 65321 146357 -282920 106308 -18136 -80391 18173 45230 -111860 224090
17730 -24838 269905 -12826 -98668 163460 -3755 180052 22947 56491 17360 89046 16353
17718 -48432 -22881 165239 10515 -300571 328143 -65385 29770 -154851 79973 10431 306499
17707 306499 -9530 -68673 -302045 43835 95611 92563 -163724 -115212 201241 355339 -289769
17695 240979 -48424 13566 -368013 194157 258027 366664 -93890 -307850 124820 229860
17685 229860 36053 84633 12447 161841 145492 -72127 277385 -254109 -335416 113054 -45942
17673 51895 155869 294318 2640 118445 -28765 -155955 451200 51746 47966 52075 -285043
17661 -58425 27623 -12260 116060 -267724 -43040 -53768 207753 -51338 245774 81397 103884
17650 103884 -191631 152080 -106934 -246439 -151481 -261056 50108 27024 -290695 -114936
17639 152836 -114519 210565 55937 225316 138870 259971 -16988 329083 169409 5052
17628 -106823 -17063 -83628 -1967 142756 91457 -60576 -199532 242870 185949 -291055 -115777
17616 -202527 113668 22136 -17710 11711 -4835 123545 111296 -230298 87495 202625 291005
17605 291005 100964 226443 48919 -237081 -123654 -23423 -108367 161417 -83729 -8576 188223
17593 -99622 360645 -154061 130728 45297 95707 -18421 -297567 154676 -327281 75061
17582 487871 156980 196344 195887 188278 220786 59107 -194627 -81064 -67494 50669 78066 38695
17569 -129925 -221789 -19413 27157 -21594 -353817 77170 194893 329997 -150825 -50246 175966
17557 12600 10559 39027 -64113 293468 -11098 70548 73124 387814 -87467 154952 -337042
17545 -75805 -269876 -270137 235580 340283 -59927 259829 107439 43338 38525 249237 -126021
17533 123087 62456 20231 -10896 203882 -259022 160220 48847 305988 81573 -2634 177599
17521 -99042 78788 198260 370991 210371 -55508 132818 2678 355255 207516 87869 161708
17510 161708 -61629 -410022 -30321 -195981 -119684 129529 279363 48637 126172 -172544
17499 96660 319018 285164 -75353 349273 100062 98896 21709 14811 -156676 154623 53884
17487 57742 219329 190109 375180 474906 42980 134928 227818 207660 -263343 92441 182905
17476 182905 186458 181900 116821 348331 136633 236609 1215 77733 -209359 257693 108162
17464 88317 124627 168082 -247174 -254565 25658 -128638 339575 77420 184838 192483 204392
17453 204392 -67898 323104 232614 316382 532134 246340 -30292 246830 334951 398683 385146
17442 385146 -129862 364742 -238823 367874 312599 196827 377606 416874 207517 268518
17432 268518 498119 -79176 143447 5680 269918 41343 89194 414715 45944 444269 280005
17421 280005 446648 217622 539819 144346 258580 432032 579061 167685 549709 73423
17410 301877 279824 267863 -98637 287296 322606 401165 192764 126218 220311 601882 147181
17398 92464 240927 192703 318013 220261 82752 564704 279953 103119 84150 -67471 114337
17386 64665 39563 395703 215874 191191 -57115 387491 209679 252814 -114951 -109364 -37075
17374 29993 158844 -123199 113960 205491 -140740 329045 212226 324947 24744 37598
17364 37598 80919 -6794 307130 -98973 -158638 83543 71499 -48875 75334 132080 9176 109600
17352 109600 -285652 167453 136961 361267 -30990 106608 157354 361702 271258 -192365
17341 369373 272650 112279 264321 170335 137296 152618 270562 337488 22455 154673 48147
17329 6926 39323 1389 177566 207391 173192 175918 433691 332690 412203 213786 68857
17317 301899 161021 214568 64370 364891 290080 398266 49235 151019 214049 -55687 157959
17305 133301 273226 163564 86712 105213 -32153 84091 50450 404430 -300680 319867
17294 308332 170501 288595 538938 342991 279280 149185 -235358 28661 109607 118610
17284 118610 113050 152775 120611 45518 147123 512626 -69041 466291 64017 397157 113261
17272 75848 7734 219176 391043 122393 191091 271758 162001 221611 29193 -16354 181789
17260 262168 181957 43785 103846 -49920 264014 415893 173969 61351 354974 135623
17249 329791 140847 128479 -18146 428444 178898 159286 -66310 -88941 412918 37961 167100
17238 167100 329849 127766 48232 321956 474188 93038 -81343 267583 146110 -31576
17227 -146133 424143 224321 -7197 217890 96082 509224 403484 215171 506950 143975
17216 104175 178862 272995 136029 253111 329322 116062 220960 311528 445005 275846
17206 275846 400572 405199 183922 317010 162375 332633 280690 -91601 48787 357419
17196 357419 227919 149375 286790 107093 179478 272072 263367 519876 250559 -22481 -193926
17185 -193926 249673 207563 415804 593980 241181 717148 159667 414343 443010 5209
17174 247881 538705 610708 132527 208392 198545 221782 -102682 -6061 598751 136555 422336
17163 422336 389378 221092 35329 133353 -16334 472861 297800 265997 391717 373658 292998
17152 292998 569165 280777 290561 252648 286822 358367 352721 209207 450562 159314 805823
17141 805823 394374 13479 -61188 251540 417593 163446 289784 246784 228443 -103337
17130 459499 607712 621455 513933 521353 237406 518890 -64244 517248 676137 535940
17120 535940 365449 424316 141039 620260 468501 505100 372906 586646 344436 529751
17110 529751 445129 267496 515758 528744 478156 183901 114206 619054 308091 215097
17100 215097 472335 543409 333502 733038 602355 142841 232757 511654 564755 568431
17090 568431 593844 387203 543861 522407 391208 418086 950538 102006 599931 418622
17080 418622 99826 426591 324672 245095 541077 396916 436986 428649 383751 736499 817568
17069 817568 723583 420358 85895 737011 532952 613657 741915 368360 370210 583640
17059 583640 308400 685917 646602 523673 262826 391700 556324 532215 391709 495870
17049 495870 541480 328066 522126 1066156 403450 607836 672164 404150 481546 686324
17039 686324 581806 451002 294018 433480 490896 397584 861458 690484 810002 412565
17029 412565 891849 486873 644405 443107 513575 696809 551025 406733 842891 493134
17019 493134 594482 836541 1038662 823160 784639 890323 795027 678455 640238 820689
17009 820689 593433 834719 855770 636776 979689 945726 888973 900627 560713 841286
16999 841286 877411 818156 623328 679941 735576 838908 688132 936640 661399 857787
16989 857787 797983 1012443 951209 1256118 657498 1084787 785037 878704 780037 959036
16979 959036 866929 1040145 1062642 819043 1001038 1276627 831365 1062753 868211 1130221
16969 1130221 1039799 866093 820346 967996 994744 796232 1331155 1319944 1316848 973675
16959 973675 1136833 1383567 1292196 965806 1137946 1047505 1193989 1070125 902456 926332
16949 926332 977772 1040638 1110598 856695 1166612 1092584 1013712 1207519 1470759 1127577
16939 1127577 1528921 1077171 1209593 1121243 1374492 1448749 1308245 898868 1408148 1530140
16929 1530140 1432957 1190518 1547112 1073093 1611256 1678642 1453056 1475448 1355454 1412975
16919 1412975 1841259 1187798 1462997 1504206 1311576 1758486 1656303 1890981 1700652 1606794
16909 1606794 1861426 1762017 1463592 1832095 1391958 1539127 2145065 2043992 1949041 1537953
16899 1537953 2155411 1949141 2354441 2147841 1961949 2123043 2183113 2324103 2264796 2066934
16889 2066934 2479825 2089162 2381053 2181111 2221327 2344601 2369180 2468081 2153435 2268598
16879 2268598 2590341 2349743 2205520 2428493 2481549 2784721 2242919 2084539 2567290 2711411
16869 2711411 2785135 2579370 2817060 2798509 3082457 2810620 2836004 3059079 2772934 2966099
16859 2966099 3173294 2990644 3349969 2895832 3214628 3097799 3434347 3388904 3613299 3663018
16849 3663018 3558108 3639509 3508024 3805617 3835150 3951347 3830988 4230118 4349364 4128579
16839 4128579 4078720 4142802 4468316 4503069 4627563 4485578 4833704 4587868 4920654 4730030
16829 4730030 5100607 4788206 5129005 5019493 5363478 5452012 5320687 5752335 5714899 5944978
16819 5944978 6183238 6008277 6023702 6016506 6301729 6685814 6552764 6509811 6995176 7168451
16809 7168451 7012037 7524002 7472828 7669069 8032507 8220677 8148829 8277775 8795064 8803707
16799 8803707 9008746 8924656 9355385 9575354 9870441 10510379 10319568 10684769 10729113 11298185
16789 11298185 11757925 11686636 11855691 12708547 12997919 13133930 13528609 13745992 14839736
16780 14839736 14724312 15102599 15647606 16258410 16834310 17363088 17495732 18532737 19112678
16771 19112678 19924380 20253975 20829417 21687462 22802431 23541740 24287089 25386003 26183113
16762 26183113 27599393 28433099 29660408 30836166 32213896 33666663 35079485 36554308
16754 36554308 38090762 40096531 41946336 43374525 46162929 48373595 50581984 53197345
16746 53197345 56282929 58851154 62069877 65638078 68829475 73023572 77411307 81859890
16738 81859890 86340551 90976015 96729136 102358164 108601701 114532552 121416779 128439567
16730 128439567 135191759 142548082 149718489 157156482 163797194 170394172 176530955 182431871
16722 182431871 186833672 190737159 193772574 195416914 196627636 196482411 195401496 193356393
16714 193356393 190676635 187369028 183001632 178148935 172395245 166179079 159378442 152307902
16706 152307902 145638388 138701400 131595839 124552646 117296640 110914005 104387635 98398368
16698 98398368 92815936 87508420 82384905 78008734 73146407 69412897 65623741 61738959
16690 61738959 57981792 55564311 52489308 49650205 46824363 44742281 42853168 40447924
16682 40447924 38494995 36929405 35246745 33738407 32103202 30902570 29048188 28016952
16674 28016952 26654320 25857115 25133301 23950207 22979897 22195012 21159449 20383180 19889146
16665 19889146 19160470 18570552 17690592 17600757 16246964 15830765 15880275 14862990 14321735
16656 14321735 13972226 13495885 13200104 13223059 12413601 12155025 12015409 11464206 11275797
16647 11275797 10669831 10488309 10153680 9921288 9815397 9310103 9265657 8622443 8813586
16638 8813586 8442657 8198788 8004074 7830525 7601117 7446118 7505591 7367498 7006742 6896050
16628 6896050 6585509 6823659 6416069 5921065 6105199 5809143 5719412 5672578 5591388 5216664
16618 5216664 5167927 5076135 5232147 4825211 4727809 5086715 4947393 4553445 4482563 4412588
16608 4412588 4431135 3877325 4113311 3799304 4071859 4089931 3754036 3516714 3727793 4062188
16598 4062188 3593130 3572465 3578287 3399796 3359238 3148561 3408657 3217732 3099993 3142941
16588 3142941 3299913 3298589 2886145 2844112 3004293 2874677 2917372 2487832 2719613 3004003
16578 3004003 2940690 2666568 2567006 2492483 2473479 2546775 2477503 2462715 2650844 2565847 2175142
16567 2175142 2096140 2503750 2304817 2142440 2020021 2150854 2042599 2144465 1846921 2091392
16557 2091392 1835362 1987349 2261706 1976349 2155433 1973064 1794835 1883556 1571420 2147205
16547 2147205 1770601 1649993 1657947 1641862 1480172 1396343 1555583 1437631 1642167 1401555
16537 1401555 1403382 1629526 1504299 1473655 1727320 1356163 1366178 1314025 1487529 1285985
16527 1285985 1337038 1269328 1188606 1081667 1413641 1413728 1233942 1109810 1257268 1025642 1244112
16516 1244112 887259 1088383 1238581 1315762 992944 1134886 1068863 1175497 988747 893373
16506 893373 1009651 748467 910747 781277 1241365 995847 958139 961524 1064535 1143801
16496 1143801 770544 1104149 873622 1238502 803068 1045505 755960 995265 712672
16487 712672 729114 1005594 802679 949756 1215116 881756 818056 540213 938427 949116
16477 949116 953576 857303 792744 813841 903627 655779 870042 663292 518613 632523 506069
16466 506069 496294 916822 874757 672556 954806 555962 692713 405939 751248 712262
16456 712262 674179 408265 402098 672546 671991 500434 710499 518907 454324 537469 526451
16445 526451 540987 478480 358390 547056 583801 454665 653646 333733 372033 596053
16435 596053 304143 512299 368502 669921 657258 439260 617463 565368 812362 345720
16424 627324 445877 704957 761621 669029 625006 424505 411166 854566 338064 326962
16414 326962 429279 660769 441503 121903 142871 384010 253492 607012 79059 451434
16404 451434 573919 632450 498836 604161 334625 477007 32617 507842 731064 544769
16394 544769 330422 347112 155851 519198 345988 249525 246710 364196 -63841 164430
16383 546872 182530 808121 188472 46726 328350 261213 506592 178614 631949 326092
16373 326092 469156 546742 488823 279298 270526 -30895 75358 112555 -108295 251866 -9519
16361 382238 169685 13055 201137 -72208 185372 385496 -76422 315395 330819 50286
16350 292602 269443 -87910 163861 229253 528341 443271 -576 282645 220763 454297 -121991
16338 109535 220668 165549 169864 401349 -111499 120381 -25102 -97825 -50301 240064 -59585
16326 204963 290165 360390 502320 348833 -56434 -235561 305229 277177 -374418 264207
16315 90684 183314 93825 -190244 142440 326005 210699 354178 181708 31540 -11296
16304 299873 373474 297125 -60164 44403 208660 34506 474575 162548 183834 198614 -243524
16292 217171 187329 19426 -113428 290739 118553 205115 -67775 176302 138468 274921
16282 274921 146066 242382 172444 -47466 269107 24429 24678 351424 359233 -57047 364574
16270 -14525 -12379 276270 187918 210906 356607 163334 217258 -36575 -338027 -121786 -195784
16259 -195784 99290 92628 -59341 32371 -138724 150022 -151444 102971 61605 132038 231777
16248 231777 49068 115932 79394 492222 238262 329347 162253 71074 -154310 13857 415800
16237 415800 50008 126236 131735 -58723 -244918 -194240 -5440 168962 273960 377053 94411
16225 256882 -96252 -54165 170364 -358115 -91910 109407 215409 -130050 34740 7526 -192221
16213 -173713 -99927 -13777 -249066 -276289 419613 261259 -83961 258579 49223 228130
16203 228130 -72778 74954 42529 -154364 212505 29973 55218 -127646 141751 -104902
16192 196319 -45424 -53373 361501 -209711 120650 195127 -49475 -133283 52508 -154316 -8357
16180 -56384 -69625 -15648 430706 220715 235741 -6023 -35273 181821 188802 -61809 221088
16168 -128339 -7780 3099 67796 31326 34138 96063 -131895 -95334 -222000 151513 180526
16157 180526 -261188 239079 83543 98263 194635 -22650 152147 -182873 292149 143417
16146 -236203 148113 112627 253719 -135842 -170007 14418 -75704 123012 -118230 -184760
16136 -184760 81732 217973 -77716 86250 72085 119489 -113501 -101554 -124761 175773 -256663
16124 -50446 19776 -62129 -233473 34643 -372927 71133 133464 -330386 -57279 148655 -290953
16112 237800 368014 56884 19447 -322935 -165287 -2907 -28538 -304789 -164827 41474 166634
16101 166634 -17971 -116010 45966 160358 78459 420395 74653 -115228 150982 -442118
16090 -51946 -237035 -72164 10511 -127111 130676 -104139 300520 -93809 21186 409003
16080 409003 -61205 94594 97544 39718 -85465 221154 236924 401066 139327 225904 247941
16069 247941 95234 -150745 183907 -94467 -172448 -172677 -155707 -121481 -85188 -130089 193331
16057 -58460 -316439 73621 -229587 46927 63143 162492 -50897 -96941 -42652 -82059 -33969
16045 -200527 91603 182928 -55823 23745 35680 289216 -73136 -235046 -122726 165891 125964
16034 125964 51604 -489390 60052 4104 -305736 -49670 29725 -113333 -159814 -61421 120047
16022 -83115 -97489 -382 33176 -56748 -103734 113966 -31367 206122 -41644 -125062 -259353
16011 -259353 157501 -278894 -106049 -258691 14527 -93479 -293915 -195915 -27378 -98140
16001 -98140 -47661 234136 158544 339886 -160472 -231093 -103379 31387 188461 -191211
15990 296180 -9450 -15046 91956 64653 -61437 1164 498384 35940 393346 281426 452059
15979 452059 113542 125005 61540 39542 236307 -90419 -46015 349966 345101 439683 55335
15967 49074 -63520 -67804 -172913 186314 244569 218648 168891 20535 -39342 95958 89846 -128859
15954 -372526 -346856 230008 45956 -16730 -306141 -80712 -268293 -286770 -277535 -60683 -68680
15943 -68680 33271 -197793 166878 -83647 -144699 -375029 -151989 11166 -187456 58921 77941
15932 77941 -313677 -18234 -70405 61277 13436 -251187 69960 -81447 -143325 154302 190088
15921 190088 44648 400374 181405 -237119 -180753 -282689 -86771 74347 -254581 -17549
15910 2563 99240 -114904 -361325 9381 -129022 -38603 205674 330896 244939 397705 -169813
15898 72703 -52471 38347 -83106 31071 12813 -361793 -278053 17565 -234308 -120927 48677
15886 -232589 36166 34287 49873 111226 -1309 -62234 -225123 5538 -77648 -40825 -67105 79177
15873 163776 -26569 -170430 -29973 -64542 311004 -225361 -39440 165200 -41386 102945
15862 750 33213 -125512 -567262 -199210 -60187 -229317 -238631 9712 -221539 -159094 141955
15850 224708 70923 -26467 -225806 -88284 -76636 -6817 -273462 89608 170253 19944 10886
15839 10886 30745 -197262 -160293 -28574 199437 -151024 -74040 63056 -119399 -241282 -112788
15827 69134 -143588 38139 -8694 -146870 -76684 75781 -112392 -307811 -430195 247578 78320
15815 -163421 -3054 -82616 -99295 -73580 -134609 -78244 -149247 -174603 -91441 -179466 78626 -115859
15802 -132982 -460893 -257889 -16089 -110194 -108943 91397 -25461 -156953 -112674 -15179 -135120
15791 -135120 411762 -354100 -112566 -31703 29141 91389 -65528 -272108 -158957 -185030
15781 -185030 33914 289278 -386928 -101668 360095 122333 -216254 98964 42056 72530
15771 72530 -139225 -32466 6833 168426 -84666 149417 -10997 -69102 114501 -7562 -120735
15760 -120735 -47530 91121 176884 283566 229146 15353 -118377 -72932 120470 33717 78390
15749 78390 -280828 -30468 -239120 184802 143058 -57690 -162927 246591 -160919 106199
15738 214284 87420 -38833 112316 -200670 -138392 -7226 107406 191290 -43909 21792 -250181
15726 -146090 -97021 -58103 18644 44743 114845 -156390 -151944 65659 97636 -254245 -319900
15715 -319900 91548 153152 -166284 -126879 -61679 123357 164542 -76826 36283 -140295 122916
15703 59573 -59716 -48029 21218 22896 -281751 -102692 131669 -18002 -214662 -130309 -168201
15692 -168201 -400328 195416 -132923 178251 102415 -174834 -40327 65117 82965 63245
15682 63245 -33447 32514 -156498 -162849 111438 127629 -166127 -31701 -293260 -40267 449923
15670 154920 18814 122268 79165 -151179 332391 -19725 49860 -116912 -192017 120954
15659 -27070 128912 139093 -42332 54790 -141216 -22161 -17842 -208343 -82414 7194 -250493
15647 -298418 196649 -113914 -12124 -55876 34994 145036 -22565 -66750 -22778 -346511 33731
15635 -222750 111110 -133234 92939 27101 165781 -386 148416 -273878 30239 -15916 356335
15623 124538 -158621 120866 167037 167794 413889 -3849 206774 68274 -8833 -471833 -40614
15611 256812 -10964 -24514 131702 336880 105154 -178922 -42995 -338806 -217179 13771
15600 929 222713 -142155 96516 107922 -42725 -143447 57051 -164700 82842 -89892 -20955
15588 208485 49113 -101376 -177228 157031 -146918 -65133 -8476 -6612 -162169 -24193 -495517
15577 -495517 -61554 -278686 -275882 69741 43747 -92642 50276 -17684 23192 73258 107953
15566 107953 -115508 -68585 -18542 180663 33542 -17165 64907 -10365 29325 -63396 -282522
15555 -282522 -63858 133933 -104860 -36143 42496 257462 247676 15809 93128 -81841 154484
15543 153618 223777 246916 -140385 -228060 -6970 203572 187390 209294 -283531 97332 -82119
15531 -112037 -21405 -221506 11890 -422868 -80692 245676 -287394 134028 154828 -303338
15520 -155219 87432 235992 -170191 -198491 -86432 -65919 124015 -150691 -203296 151354
15509 364948 -85390 105784 -77108 102850 -321671 -34240 -56219 77892 -328115 61604 -294654
15497 144513 8310 -159765 -235455 102321 -229772 533 291898 270120 345053 -17323 -110675
15486 -110675 240103 -257829 49848 30848 -305014 -69344 -96673 75223 217063 295090 -292045
15474 205590 -88677 -307319 -58931 -161485 223409 196844 -244590 -154698 244462 -10920
15463 -38994 66635 72063 -94253 144192 -340896 240774 -16715 198928 124479 48596 95166
15452 95166 -41056 347003 -58907 -330035 -64013 -232329 -164736 -104309 17326 140975 95555
15441 95555 -228566 109343 -107531 -109764 23809 -87172 -125397 -264112 -206272 284745 -279270
15429 -462452 -341061 -67571 3745 179187 -5817 -98583 443340 -25116 -169968 -42712 -145884
15418 -145884 255167 -22498 -7940 91185 4296 -120317 -173414 34350 -179442 -32530 -45528
15407 -45528 145064 40811 -168836 137623 178439 -32944 159291 833 -362756 46823 -134610
15395 -280620 85423 178323 -123906 126384 -5223 40698 58940 110232 12724 -51381 194983
15383 -33778 -4520 207511 -86574 21093 -257277 115518 -245620 134052 -327277 -17137 378524
15371 32818 128419 -158240 99099 -214269 54487 -216042 117211 48732 -15036 260953 150510
15360 150510 -60104 -26544 160694 -123664 -117476 4050 186398 -360771 297801 -79015 420561
15348 -104747 -34640 -280694 46177 -91324 134756 309056 46992 10871 -151723 -14802 -188086
15337 -188086 -249487 158576 323765 147579 -42377 277436 -25453 378 -389359 -25329 7811
15325 84237 41432 -146917 363370 -106703 2285 459696 -49564 -67237 -13340 -130072 90140
15313 26625 -127381 51940 273811 46317 -91375 14977 -30790 134341 118297 211852 757
15301 13191 -81144 73108 -295670 51618 263900 286010 350009 138932 -177883 186571 248391
15290 248391 101561 288872 88687 -68833 265835 373606 -25550 -71226 -144901 534724
15279 -98556 -198129 162616 144220 330739 417912 -95419 -103573 139869 -275029 -72842 196224
15267 -10420 251972 235908 -97233 -100734 354254 -193744 383040 212359 62158 -29652 230506
15255 -159726 156578 178002 148096 -70239 54653 243503 124503 323020 854212 1206297
15245 1206297 1120172 2130108 1330866 1248408 1362542 960044 296786 -165810 62906 -199299
15234 225430 -168328 16582 66342 90150 -95361 444578 -112386 78572 -142559 311633
15223 -104493 108035 77865 241149 111964 229630 111566 46483 8377 135059 -152191
15212 31982 -206919 143071 -63425 295511 36655 -107639 -31357 70831 243223 172849 73007
15200 153517 256456 114589 68056 282669 258402 130906 190760 290425 -5044 361852 72079
15188 85592 14241 -13591 28388 -151935 -35354 77152 -131548 223390 245378 -63093 194280
15176 164573 175160 48428 106872 155239 -175557 -13029 57488 -154389 63849 116338 30004
15164 253661 62497 -71373 -35144 457638 -1121 -152766 34085 585790 241886 375427 -16141
15152 9023 107621 136725 33780 96849 144168 62988 137168 213743 271603 63797 20647 21471
15140 21471 289756 14573 -17895 323940 205363 286330 210393 -22859 30775 -131222 394467
15128 102106 152363 328067 -169360 60706 -34501 -99572 141555 312131 -77929 97942 185649
15117 185649 196833 123154 -309264 -42297 63978 325193 -183344 265647 265861 9899 38134
15106 38134 149342 246013 217057 -123004 484189 97879 369174 225723 104298 -157506
15095 -53367 122746 350033 105751 171669 24981 84331 79363 -3228 259638 338146 332632
15084 332632 308608 256077 220069 163256 171042 -51646 186888 43995 466905 181230 280122
15073 280122 31127 142473 -243114 330172 84880 319480 285722 151669 89962 -61472
15062 1665 116413 306104 138969 -82362 210643 358020 19661 157171 199138 203907 42689
15050 -21741 155964 117957 309779 -8142 173972 -210562 -82076 209547 15415 -115374 199324
15038 86003 114874 149982 317147 67586 428478 498018 59809 173915 133232 132831 60397
15026 12044 129582 65209 276981 518961 117912 326547 -31305 53535 500992 -4406 174118
15014 -66474 335153 275391 342655 144232 90796 75800 237172 19445 103675 100281 -146642
15002 312608 509087 -35060 -187122 44261 197905 126861 340553 502692 389607 148895
14991 252161 11336 95410 48030 -196831 -53099 361038 350127 56665 -13031 322055 114793
14979 17625 522228 480435 198631 197018 496320 149958 448210 306030 509021 521428
14969 521428 763567 60569 170251 199416 66085 77295 240995 130689 125039 210273 160509
14958 160509 135036 235289 222732 133580 98001 763949 374121 249087 -55870 470120
14947 314933 167225 342765 248984 247153 -6089 365771 158155 404772 270991 427412
14937 427412 286716 393744 343902 177259 140406 347305 483787 388037 770990 185204
14926 336656 422432 453799 67062 432981 138350 376394 268923 316394 182494 174498 500740
14915 500740 244885 86205 454114 269960 279958 373271 321315 387821 495887 375551 519446
14904 519446 555194 196251 202452 -50461 432452 446245 340804 314390 50621 340278 503366
14893 503366 458767 77331 14595 328735 484360 220061 274840 145003 257789 264192 313829
14882 313829 476971 465484 191941 335644 400305 380882 502501 299838 238095 239042 114430
14870 277355 422243 379043 585844 372054 334041 175704 653823 539985 181313 593215
14860 593215 681245 500549 429923 413733 396631 444046 839799 480862 495210 271729 144465
14849 144465 276684 107127 512390 519618 667365 255115 269525 202645 367240 205123
14839 205123 590511 375627 404529 499249 626064 258817 492539 496741 522153 508558 654490
14828 654490 664659 234837 777072 238564 659603 471010 475363 662541 482836 387729
14818 387729 465187 370801 474981 151261 598178 425865 879369 382309 184565 302524
14808 302524 278269 595715 388789 538812 458561 395325 587702 518061 607090 545253 324662
14797 324662 680301 664219 500541 714400 487236 462708 378447 449773 573571 735820
14787 735820 425042 835253 549511 576160 316535 599871 397404 725329 382800 637283
14777 637283 514124 273198 493340 371211 669592 526128 547314 883168 723632 514072
14767 514072 534736 712596 954772 824368 882834 378421 577245 819869 635454 601791
14757 601791 814393 713435 773914 837047 463789 921304 617840 1036517 694297 725449
14747 725449 506248 760770 552133 829480 893073 612212 835272 739624 789888 815571
14737 815571 679971 886789 854371 1139709 820245 960906 853575 771412 707969 862450
14727 862450 1059731 1124964 843620 763632 916640 646632 873673 867174 1177267 1095048
14717 1095048 824746 1095513 760407 989871 542258 904844 1166480 1008027 819515
14708 819515 838039 986838 915672 1008374 1150099 1107692 645423 576981 929802 707297
14698 707297 1046434 778121 1037792 838433 807230 943593 1256357 989966 947327 947492
14688 947492 988292 1038793 1233925 624110 1070367 976630 1053763 1028896 1094189 1113125 1185495
14677 1185495 1197175 1315131 1123930 1058747 1058776 1145534 970300 893163 1187483 968666 1289964
14666 1289964 997424 1241043 779201 927066 1030433 1186753 1200018 976785 1237975 1366627
14656 1366627 1157167 849336 1356127 1295098 1335753 942727 1595118 1282694 1303094 1157647
14646 1157647 1387314 1724653 1168481 1238761 1588906 1362543 1181173 1239853 1502244 1339561
14636 1339561 1496863 1273963 1695630 1252046 1286366 1504044 1565122 1234913 1549568 1727427
14626 1727427 1469960 1207088 1613825 1592196 1567014 1529861 1621902 1357886 1561372 1130263
14616 1130263 1373903 1653637 1723599 1904510 1763197 1716227 1957096 1712604 1584104 1817364
14606 1817364 1721968 1693573 1709955 1829523 1957724 1902087 1838288 1890997 1656650 1895629
14596 1895629 1847880 1922977 1873198 1934821 1842251 2008016 1778653 1800947 1924732 1666518
14586 1666518 1922885 1987114 2080004 2289941 2141015 1975510 2320015 2331364 2372627 1918361
14576 1918361 2118912 2476676 2534993 2142158 2483721 2221650 2392122 2413303 2552597 2373435
14566 2373435 2797137 2501962 2666248 2883717 2958140 2641974 3029926 3219318 2990260 3336964
14556 3336964 3420660 3555545 3598749 4399363 4045527 4984239 5876286 6970328 10910708
14547 10910708 17869516 34230996 56898026 29399662 11556408 6396805 4487866
14540 4487866 4690422 3479926 2496584 2376389 2261454 2021249 1979661 2196222 2071885
14531 2071885 2414391 2217098 2192236 2327252 2423647 2919611 2499006 2733715 2682899 2583511
14521 2583511 2261935 2784867 2733204 2702077 2712328 2749209 2431789 2754097 2910289 2904722
14511 2904722 3245954 3083318 2970666 3383348 2862191 2792040 3389976 3029917 3520911 3593841
14501 3593841 3348216 3138435 3681375 3577370 3633592 3565853 3672346 3839880 3591688 3729123
14491 3729123 3625758 3729564 4076812 3894279 3705849 3994730 3759075 4113387 4419579
14482 4419579 4113996 4140567 4291568 4237353 4252494 4372290 4424158 4600520 4357520 4473304
14472 4473304 4489461 4709804 4606903 4393618 4457528 4756750 4747258 4855198 4981927 5041592
14462 5041592 5203795 5255937 5113930 5626986 5510370 5534353 5543549 5537882 6023565 5738889
14452 5738889 5489257 5996742 6003126 6055440 6362053 6326745 5782738 6233761 6443917 6609422
14442 6609422 6573970 6639837 6495702 6556525 6792496 7062071 7354362 7471371 7008553 6905587
14432 6905587 7237968 7366430 7295790 7862008 7730225 7729525 8255735 8233637 8046993 8323012
14422 8323012 8341595 8429045 8609060 8956499 9006983 9008921 9299123 9452754 9581145 9451583
14412 9451583 9778135 10101031 10113569 10139947 10426803 10654695 10862841 11171761 11050111 11363014
14402 11363014 11182588 11752372 11968062 12207057 12203425 12174166 12552919 12408544 13046370 13054325
14392 13054325 13479591 13715695 13997216 14031145 14505388 14287113 15005361 14933864 15491571 15584038
14382 15584038 16053569 16151434 16482469 16514737 16716410 17480017 17825699 18178216 18193944 18828828
14372 18828828 19440592 19555318 19640173 20612123 20433534 21156772 21707946 21989763 22473183
14363 22473183 23192921 23647122 24214595 24547779 24916884 25858340 26158457 26889975 27488168
14354 27488168 28123273 28619823 29204448 30001084 30562721 31646837 32391851 32695565 33858101
14345 33858101 34964477 35843736 36550960 37738868 38759629 39796713 40969903 42068143
14337 42068143 42829739 44330286 45726258 47140839 48315036 49669068 51264943 52907565
14329 52907565 54700742 56432326 58267211 59944196 62054857 63712502 65982362 68502529
14321 68502529 70643013 73106579 75811707 78741815 81332681 84558030 87746659 91130846
14313 91130846 94894077 98378846 102310029 106496804 110783325 115469743 120611002 125568512
14305 125568512 131082556 136579299 143010323 149202000 156187486 163326409 171194330 179024162
14297 179024162 187501971 196357662 205748631 215517143 226571017 236874415 248867558
14290 248867558 260512532 273193260 286344812 299959634 313780374 328087845 342326335
14283 342326335 356929661 371743943 386153733 400770617 414482149 427546921 439591897
14276 439591897 450654708 460417507 468425375 473726401 475900525 476005930 475547884 474026763
14268 474026763 471731068 467350976 460404804 451329048 440501078 428242799 415131355
14261 415131355 401046434 386229022 370697014 355362249 340191270 324643067 310066112
14254 310066112 295771259 281758411 268885494 256604963 244761827 232805126 221808309
14247 221808309 211078748 201209667 191697345 183480038 175458817 167211360 159371500 152373786
14239 152373786 145740547 139391218 133932210 128411606 122670687 117376836 112836358 108025985
14231 108025985 104579280 100441392 96687881 92889584 89521788 86064702 82965058 79817446
14223 79817446 76965026 74630151 71875498 69699358 67470378 64956342 62728201 61071575
14215 61071575 59027388 57415585 56142331 54280348 52400959 50979213 49277301 47819255
14207 47819255 47036187 46047186 44353555 42802329 41863181 40743208 39590964 39061547 37736837
14198 37736837 36741433 35604659 34822920 33847115 32928894 32596525 31815440 30566843 30045616
14189 30045616 29490685 28773547 28025079 27545968 26747245 26185249 25696029 25148627 24535230
14180 24535230 24227479 23724530 22820654 22682547 22155032 21623632 21246908 20628997 20526747
14171 20526747 20246340 19952124 19525161 19050196 18395896 18355829 18164683 17621503 17286273
14162 17286273 17050198 16744676 16539155 16145088 15768816 15499344 15162781 14871874 14693485
14153 14693485 14499330 13916979 14229196 13695148 13502914 13134635 12809039 13160073 12898834
14144 12898834 12643791 12891382 11972911 12023598 11755885 11762280 11290544 11387109 11489242 10901841
14134 10901841 10695645 10760666 10712657 10524150 10506291 10080886 9845874 10135047 9801308 9691567
14124 9691567 9607023 9564816 9182793 8939607 8650071 9002271 8610396 8576850 8516216 8402174
14114 8402174 8386125 8390306 8112457 8152752 7799364 7996114 7449923 7769095 7572342 7546196
14104 7546196 7477947 7432458 7249603 7076898 7209960 6929885 6831944 6742300 6777841 6588638
14094 6588638 6550765 6416109 6218374 6204067 6177000 6476722 6213564 6135108 5693332 5861094
14084 5861094 5838381 5863954 6204429 5569860 5718496 5585045 5282974 5583834 5029342 5280952
14074 5280952 5212069 5200128 5205345 5109105 4769120 4977885 5214187 4776181 5090679 4831184
14064 4831184 5149423 4673291 4812280 4735016 4768295 4661969 4491011 4654569 4566505 4692300
14054 4692300 4244687 4476653 4578283 4358345 3989431 3892457 3888921 4042327 4067161 3984055
14044 3984055 4042493 4080764 3793089 4050974 3986186 3979753 3615293 3697090 3801517 3642079
14034 3642079 3724731 3854338 3406688 3772451 3362558 3541541 3490446 3704946 3377309 3548591
14024 3548591 3407020 2953616 3168168 3176728 3098521 3139438 3244632 2927938 2923704 2738721
14014 2738721 2657034 2829656 2782883 2958245 3004791 2753762 2864265 3036083 2554334 2406677
14004 2406677 2877580 2562384 2661019 2740578 2693343 2715979 2799239 2458344 2499655 2366421
13994 2366421 2199063 2319567 2694630 2708967 2652653 3386567 5535733 10572156 24915604
13985 24915604 54321423 37305318 17681140 10001680 7201829 5426199 4629044 4313255
13977 4313255 3701085 3708954 3220542 3481554 2975454 2787454 2794092 2713170 2973557 2866517
13967 2866517 2768958 2608395 2789970 2782794 2599039 2511161 2602068 2807019 2692143 2380283
13957 2380283 2300977 2448020 2261456 2229797 2106860 2112361 2287697 2442269 2114303 2269975
13947 2269975 2303693 2015699 2366514 2207592 1997428 2198016 2022094 1982274 2132292 1815789
13937 1815789 2167079 1950201 1805243 1880850 2019005 1848783 2059107 1973003 2017769 1950151
13927 1950151 1889755 1465352 1965793 2221260 2004326 1841443 2099246 1614838 1789751 1988666
13917 1988666 1704617 1927629 1490752 1644996 1845611 1639171 1813155 1740148 1971466 1811917
13907 1811917 1422952 1499171 1833989 1628149 1762861 1518869 1626012 1870503 1655949 1562820
13897 1562820 1499357 1471480 1446348 1745440 1727366 1927373 1209031 1340288 1266113 1665108
13887 1665108 1048286 1339102 1427965 1552193 1614743 1293705 1721887 1605727 1498894 1296366
13877 1296366 1451747 1450404 812183 981115 1531770 985394 1258056 1407258 1572665 1294619
13867 1294619 1165755 1752412 1275753 1237255 1292347 1149851 1284309 1241568 1084136 1254742
13857 1254742 1436812 1285291 1059717 1194298 1450554 1457933 1351949 914234 1246490 1236556
13847 1236556 906266 1202028 989891 1244788 1292127 1207691 1114087 804418 1330897 1171630
13837 1171630 971407 1181685 1155433 1065923 1400769 1018053 1161483 758727 1166852 1320429
13827 1320429 864190 1183375 873339 1097706 1480850 942158 949555 1312353 1011396 1138679
13817 1138679 997986 733147 1190968 1286630 1154713 820736 1123080 831616 913161 879374
13807 879374 1250349 1038733 1083351 1058964 810266 1021117 1215053 901633 1015904 790716
13797 790716 1259909 1026448 943559 841385 1092648 1211268 566241 921509 831628 737973
13787 737973 555908 1043492 1145680 1034107 901081 836513 1347081 1012555 1244628 1100821
13777 1100821 808243 724464 896520 819279 847087 832185 449461 914824 925136 812064
13767 812064 835479 769210 1101938 895262 566736 923441 851511 766690 833404 755308 854606
13756 854606 891258 896241 454175 807053 641603 807491 828843 646317 619523 707138 567387
13745 567387 877427 974299 798008 852610 497350 1062264 894509 754435 721947 474836
13735 474836 1145547 528375 978942 520526 280930 646827 719581 635647 961338 910741
13725 910741 931457 941568 931929 1021927 702927 655744 683017 953865 831330 934371 486045
13714 486045 805547 557374 963929 590417 530355 731131 892276 409218 792793 596335
13704 596335 879155 920933 746525 522550 586537 914763 734304 425557 652154 401030
13694 401030 788650 245927 615505 780976 418199 448871 568732 828265 767134 423064
13684 423064 369990 617434 417515 453666 708823 1035871 767730 624190 712682 385328
13674 385328 886701 687683 550384 659204 748394 645637 355513 635578 503422 645734
13664 645734 699968 383552 281765 749243 559159 380570 632379 552801 323303 520770
13654 520770 479955 399835 394537 389265 292039 592022 206459 350926 627690 602595 374807
13643 374807 535327 401590 366069 675282 256499 279157 443738 253529 364321 562931
13633 562931 357183 427834 782318 745842 571613 552420 528874 665390 604564 434191
13623 434191 479881 582401 360462 549614 311569 455434 161125 703791 509541 483884
13613 483884 263480 577020 808682 538845 488241 699151 700223 372335 761847 787163
13603 787163 376596 562922 413124 -34581 726727 220379 447589 652610 269829 336879
13593 336879 478019 511878 308718 550392 619922 296593 143230 638628 473716 405292
13583 405292 269456 530645 434093 216395 535662 548080 460645 445994 621568 274239
13572 648250 640335 197859 29685 234337 366168 280082 309998 357489 400882 484673 278619
13561 278619 403819 173702 403389 470072 633148 388015 238509 258868 563288 873363
13551 873363 437662 233315 370517 520391 310793 369878 236013 84602 253906 378259
13541 378259 478615 25801 556934 99092 278136 572988 287615 208026 355522 459946
13531 459946 452264 670768 334955 362775 584268 365168 159367 152970 593226 696703
13521 696703 376504 496090 330747 524482 591782 174346 22834 297783 279774 485201
13511 485201 181259 441467 121582 465387 323468 71238 58296 539096 346144 497508
13501 497508 316611 303976 323883 184796 71332 398946 373259 326908 462530 457248 343100
13490 343100 223148 293560 487269 351709 46346 295061 482374 428175 172643 403602
13480 403602 386577 499900 395243 307942 555778 -104767 495090 110538 153661 468466
13470 468466 353691 218632 659994 346888 545986 421352 165272 332200 336368 252318
13460 252318 446564 -98929 569146 363543 116689 160787 381276 397667 147643 332541
13450 332541 162963 244271 290094 380980 406868 364070 450693 501305 108568 504870 442194
13439 442194 192431 197956 294062 602105 450222 382270 49099 152654 380362 420878 182928
13427 521669 285910 175453 121739 147422 279490 237677 165376 205916 -59936 46539 304822
13416 304822 329584 234809 247382 25269 310455 120355 -225565 114225 302631 262152
13406 262152 62001 580498 -169298 481418 143807 347534 -6905 39881 161337 583160
13396 583160 26695 -5695 148446 482310 307448 259710 422622 203634 82582 55686 483688
13385 483688 93833 140785 -4484 100376 55011 149240 70604 494940 323291 142680 313552
13374 313552 319322 387925 217605 195721 280411 533891 333594 163379 196877 239798 505122
13363 505122 292025 287079 111037 289598 254862 491620 253579 11499 268870 318673
13353 318673 359035 420644 122396 533879 247192 7887 87755 190313 55905 363022 239390
13342 239390 -11648 420980 225284 251839 525848 198879 215211 616778 553949 186277
13331 291937 -46089 135922 27639 393874 76566 302510 242479 280026 217384 259947 134550
13320 134550 228136 289869 423166 280331 80657 157165 204475 212970 242908 206639 250906
13309 250906 253375 257369 391196 273132 181080 309196 123302 -3549 -84192 96262 -37715
13297 -67407 261736 189995 367052 160415 48534 143900 115706 246806 84148 189650 -262395
13285 -78198 331749 -146812 21070 -259764 -60340 236921 213154 133801 130219 469820 -31704
13273 284531 139815 279706 281025 99365 79626 -99735 405807 15600 -11529 60630 340038
13262 340038 80837 303201 198543 166442 244796 167067 137496 123243 108148 124224 51084
13250 220471 172065 459378 44555 20077 525170 285501 -64500 277479 10494 -33469 -42758
13239 -42758 43639 579898 191772 58745 357728 228949 88676 227239 221457 -32713 326888
13227 106874 -36843 183123 157125 441404 195091 189609 -114780 -26939 217420 -112603
13216 499267 -71857 49388 60907 -69661 -96468 238617 -40071 -114420 43187 -38011 354298
13204 311531 -48896 -44062 338703 66902 -135876 96927 31865 -182348 294817 397901 -55609
13192 359612 104779 -3861 10691 -235397 -144264 224532 410362 292009 298678 325939 34392
13180 165994 -91328 25281 -45820 -22315 -5951 377473 371399 -18103 142307 210786 48173
13168 69291 -153285 311530 48418 20376 158581 121260 193523 34286 -160920 -179136 221603
13156 189810 -84138 -24595 -6502 35018 223735 -73559 -106041 -108263 288655 265943 -1083 3852
13143 274001 342140 88917 -96717 18627 246518 281325 166484 161776 282119 -116298 299951
13131 125351 -133175 425356 83006 29793 -65352 -45924 -74153 -114000 70355 177069 12642
13119 -72101 -127279 256804 -34004 202866 8442 31677 380264 157344 -80479 324906 95348
13107 205560 231325 308228 143475 336142 135770 212210 389532 275064 342493 93936
13096 249767 255964 248158 109050 -209684 395457 145827 311264 12186 27328 57537 143136
13085 143136 337437 -103924 179994 134822 -114391 75584 125938 -59653 291878 197651
13075 197651 463166 -142768 -42686 263236 232101 578050 314221 67442 188331 171678
13065 171678 -95416 -61114 -52795 -371180 42961 68976 133569 283192 459446 250443 212238
13054 212238 514863 141176 21858 367190 55274 8069 140763 42358 163934 -180231
13043 -62247 61988 179666 114349 -99250 335851 -364094 -153908 149874 27979 -169601
13032 118698 5663 90046 24481 214108 19518 123850 70292 179553 461134 -106831 91291
13020 316288 194048 -139843 148015 245234 162414 110364 -81814 113546 137733 246923
13010 246923 386700 -222534 210712 46542 212249 235360 33285 37140 328378 226741
13000 226741 -301824 174710 356704 236508 51268 -4671 161072 475457 -119845 192074
12989 -488808 -842 -39434 109585 107164 -50376 326159 312319 290426 -12079 -1007 16005 26483
12977 26483 -39364 -99136 210860 -91214 36827 396683 360483 299876 274863 205854 181238
12966 181238 99216 -249425 83292 290930 136637 -23772 -28709 18967 2665 169873 377786
12955 377786 57003 265189 213178 -40155 247051 48882 -49019 -137644 16506 74928 45200
12944 45200 -4075 368495 195200 344819 -23783 -212481 -185801 -202909 191016 -178108 -42091
12932 313079 -227207 21624 -62783 143268 -32143 326884 92027 -104726 154476 130092
12922 130092 195124 -53530 -298861 -40403 38984 138957 180950 313207 245142 14549 -124522
12910 -270188 491102 -214782 -148709 345175 389136 -298582 251931 139345 32543 219099
12900 219099 -93974 21496 -37172 257903 -119428 419013 13667 -45188 157706 -93406 -280951
12889 -280951 88502 49322 -123793 -140545 11690 18271 199992 5472 348844 244351 95954
12877 -235876 126090 -56667 -175919 132075 144357 -205310 195683 2069 100177 31696 -57118
12865 -176341 99874 89335 -165827 43050 37060 213047 343305 -23703 266791 284719 24045
12853 82573 237744 224177 198055 -163119 -140137 -25414 211529 -6122 145406 31963 43060
12842 43060 -137507 160202 98602 -81036 274562 -246091 -17739 187438 116835 -80607 -276109
12831 -276109 264831 213196 47723 184021 14102 231395 -33006 -115908 -49267 197313 -48482
12819 7356 -172861 277387 -157845 297672 253112 320312 147379 -9251 146587 -138310 264270
12807 101953 154961 -411126 19754 55215 -12188 495352 52143 226317 36366 294529 -114774
12795 367302 492406 -85582 156113 115635 60958 115212 -137008 269555 198269 -217088
12784 227444 182020 -13937 -49483 -122456 29114 31333 136007 191059 18588 425127 88808
12772 -58788 180382 -66584 142135 20661 218363 24896 -14445 46812 27422 -301626 54445
12760 259113 299189 -60951 293533 25372 -11525 -88127 -169961 -223140 -154284 31875 61754
12749 61754 -51410 -3220 75042 -80155 120920 265832 81874 -156060 -66846 36923 112260
12738 112260 154471 259485 304120 80544 174267 44146 111605 -37769 -104103 188465 429202
12727 429202 27437 -239335 178605 96218 78427 70801 -77772 -145349 212387 298359 29493
12715 293734 165868 -162562 61461 164022 160969 245056 3322 -194107 188561 285031 113672
12703 180336 227170 272040 392904 -120862 -290228 195435 -76726 -170720 172901 186795
12693 186795 24432 -411760 116906 343960 341671 233122 241602 -163143 -185030 84082 391883
12682 391883 -4826 249797 151845 699120 370109 58688 323152 187928 640317 115355
12671 105295 349402 322064 -58705 315665 -231009 130142 125243 293627 -19571 -137546
12661 -137546 -93943 -118761 38911 -248271 36507 60421 -20052 -239324 24137 380397 418083
12650 418083 -16543 553163 -87548 -27718 41917 219848 265583 390023 -261841 56827 -331123
12638 120314 138953 -202973 98865 295494 83367 212902 -31810 139505 80042 221727
12628 221727 588951 342127 351166 -123302 164677 155149 316589 92663 256798 92579 140523
12617 140523 157158 338324 25006 294769 -267569 258654 123302 213992 77257 161819
12607 161819 111150 12128 -50938 330557 120767 305370 -228451 -45664 408932 104699
12596 51523 156314 182645 290510 127915 134893 78338 -130535 241532 77720 261170 70360
12584 -312070 -261881 211499 -23773 219265 124440 31163 -177414 677 -56548 -92926 143345
12572 159378 -131336 -400169 202814 14168 -203742 -235755 67539 199665 63418 -103260
12561 -72041 25803 323103 30634 -284537 -141509 -259356 -68015 71861 -32136 -135679 -138828
12550 -138828 -113332 -366564 -138492 136977 134676 30379 204967 -165156 298342 79466
12539 -179313 214616 -175072 11850 112371 -66016 6340 214440 -239459 52656 13455 321249
12528 321249 -139283 104547 66889 179734 188720 91424 -25851 -71154 20558 369438 -1838
12516 26885 176577 -122622 -130709 23362 4837 -124405 -98268 164876 -76399 205299 384637
12505 384637 173668 423501 -127760 47323 188406 46316 146565 -6525 -210403 155398
12494 150030 -184495 161319 129696 51718 188008 -248318 -3368 -39195 444086 -74294 180990
12482 11046 61877 -57191 660 -148639 73797 -83225 202069 229556 -80704 56606 -185531
12470 152853 92226 -195729 -80326 -369 -169923 -305885 -69701 -56054 -324286 -84926 150220
12458 -86322 114869 151997 -107013 214566 -89279 33297 122070 362221 145766 -126126
12447 -164621 -252078 -46928 -11101 449127 -147892 36998 148894 -20502 133474 321928
12437 321928 -1616 124730 5463 -253396 -149836 -158594 5269 49510 -339311 -46731 126593
12425 157552 84144 91806 -7189 13477 -61053 -28912 -9596 -95104 142824 323162 -123100
12413 200045 -71521 28254 -355333 46706 60865 108784 31807 -50397 -112922 323690 242656
12402 242656 -10222 -408581 -5819 -223713 -34216 112318 -29503 177953 64851 161054 -41022
12390 -168737 -131178 78856 193108 74093 43574 -55943 -316242 -232468 277239 151753 -203866
12378 4284 -92770 -24126 118258 98398 89827 58461 -30676 208113 89069 -183321 -186473 -22244
12365 102330 -262869 -500419 165588 -172835 149064 322737 -216777 430721 31722 -21715
12354 2814 -14880 -41523 -86842 -83852 -35362 6114 -101181 -62240 -53654 68539 49070 24141
12341 41653 -87601 -366620 394671 -205168 -67033 134853 -232904 -311693 331810 204755
12331 204755 102253 -58329 -264537 -102736 124414 58680 235429 152984 -248761 -46933
12320 9009 -61040 -5757 216998 206678 146066 -292680 -182049 -162003 110523 19478 178067
12309 178067 -42913 -285662 320085 240294 273533 -306609 -256845 240033 245445 204936 -206348
12297 260183 411082 244423 225254 -132818 147652 -32206 45233 252889 73858 -272856
12286 -4638 -148569 -78299 320778 112571 180220 112860 21233 170438 455247 119885 104956
12275 104956 40134 301197 -129186 289169 392575 109684 393491 -77742 -43080 22132
12264 106227 -11359 172466 197942 313583 185559 95801 192790 239538 -44815 302927 140149
12252 296826 568853 81101 -141243 226299 142414 222824 334526 146943 8725 61597 151126
12241 151126 -132147 248967 -308217 23216 -13083 -104409 222906 136291 -80795 -33438 -150819
12230 -150819 -164102 -2733 -99601 187585 192483 52377 316334 361933 -64755 193291 425993
12219 425993 205236 327860 157046 229330 -115589 288369 168181 265048 159866 122923
12209 122923 -138573 280953 250618 146483 -58222 17927 273593 86368 -77679 277042
12198 -55803 243264 322194 196544 161069 298962 -68627 200538 50952 279602 451168
12188 451168 87033 145388 122768 69664 313168 91641 219504 88671 -369498 -9435 386201
12176 336409 284570 -64109 -91804 64214 283398 214254 149981 -298475 -202035 121497 91559
12165 91559 150203 269520 35279 309176 -17708 373444 161414 119093 184757 163768 36927
12153 281650 -108355 111414 57090 16181 -3029 74905 194395 105440 123708 172899 305358
12142 305358 247302 -148187 144473 20380 17631 -12376 51655 77115 111413 -119478 52255
12130 303424 -52901 45574 -180813 52732 -48861 22431 177406 98348 99848 -144122 -1104
12118 -428397 98041 -92817 -209684 -71578 -67973 -17884 226908 -250462 -24267 -59477 -130088
12107 -130088 8109 -140042 -144102 106868 306017 -248391 180340 451861 125088 -37161
12096 406693 124484 115508 -218857 -30992 13979 -73530 -231976 106641 471139 -59077 154919
12084 -168260 28125 -60127 -377105 76244 263210 -8434 -151701 -25691 53104 272746 -218683
12072 -228412 14871 66177 273418 793038 1590913 1715329 595339 281608 183740 104594
12062 104594 -12352 -69673 -259640 125036 34670 59950 187744 -112198 -110877 54148 -66923
12050 152975 196629 128450 283617 26188 -68686 31773 84977 344848 78414 142220 -46224
12038 -43803 -245758 -368625 48204 443109 48474 437553 -167959 30866 53501 23692 -98111
12026 8467 250943 307000 -148260 -44338 -164267 -93625 362881 16446 201653 201741 73901
12014 -40291 71060 40531 195041 -177001 165570 74109 -105176 -249703 121604 -194603
12003 452393 -4653 32481 -194989 -8416 -61785 445230 -192411 -94227 486042 30790 89241
11992 89241 25979 114296 -4811 172182 -96170 -14771 -178459 -32384 -310810 -215993 -127281
11981 -127281 -117503 86742 -445501 -12711 11309 107635 279690 -149889 -208799 -53063 -144596
11970 -144596 424858 -18127 18402 -237365 -92794 204688 -239309 -248500 170332 66957 77507
11959 77507 -184767 91056 81295 51334 -158507 -344885 -51155 -92976 239879 -50106 -63193
11948 -63193 -50930 402002 -61366 34434 -89695 -321044 -130887 177082 -173170 268787
11937 -23326 -128483 -94815 -244618 -211688 -20397 -67852 -21734 -33043 331730 159389 60200
11925 38884 259844 -320832 -176399 -220723 101154 62758 146856 268043 105558 -235184
11914 -82702 264992 -206221 -90473 -292227 30783 1313 291183 213091 185778 34709 91477
11903 91477 -225112 77324 -32645 -266796 111423 -76255 120685 -85490 -325097 -58555 112460
11891 -165151 114029 -33535 -45376 61167 198599 65985 172696 73803 -110033 215659
11880 -34359 -103894 45191 -129661 -37455 -162945 -36507 -234651 94423 147708 -76661 -153203
11869 -153203 -191407 -172773 231421 104748 -135068 -261723 -117650 163833 184025 -38740
11858 -257696 -175329 122143 126236 149874 -142339 66974 -200553 38490 218665 -96510 75091
11846 -77548 -356 30583 -90050 289050 203880 154382 163889 -255707 -86432 -255886 -178241 252207
11833 -126745 -71850 -10868 -258192 260175 122498 321138 102856 144203 -186942 -145543
11823 -145543 122869 371649 282741 -27864 -36140 53218 53680 136870 -228560 -273019 31829
11811 -273454 112932 -288747 -232713 -305414 -69917 -191824 155981 -366371 166033 -104285
11800 -200209 230969 -133966 -205567 11581 59834 130239 160992 72561 237414 110781 -23869
11788 -139567 79088 -172527 51156 177545 105941 178890 -151716 -103517 -185489 -144454 -80826
11777 -80826 -122650 -170681 40619 -25406 -64126 103570 -107901 228459 -238060 -135280 201925
11765 -66621 -46648 -404331 270208 147526 23321 15717 62604 -70058 -32171 -214312 19872
11753 -246963 -313831 60893 53452 -64156 97915 -124193 225721 34150 2928 -334775 -168111
11742 -168111 -55043 159403 82012 -19864 -210193 -54578 -283400 -268495 34170 -253124 229635
11730 311696 99879 -96125 117915 -94144 150087 218362 199169 93611 19415 70907 -140713
11718 8277 -95092 -108828 248093 318346 234019 -27195 -222936 -112861 -212316 -30791 57944
11706 145250 18859 142253 211139 -119017 33983 -28414 241173 188347 25532 -274433 -190843
11695 -190843 50559 239539 232565 202398 185657 127455 81187 279679 -130360 83734 -125688
11683 200332 83258 248559 49739 -153468 -55706 250396 -134504 205585 170220 161130 -466255
11671 194805 -100593 -307223 42259 -4139 141178 -207717 -233190 -52521 25101 -69318 -131327
11660 -131327 -92908 -28356 -209564 -124384 -163479 -147799 114619 131756 -122438 -55400 34586
11648 25106 -134041 -261784 16891 108345 337122 55917 352619 259968 22251 -5535 39628
11636 -301889 -44304 -88355 37292 142358 61322 -237776 165467 -106696 43261 536273
11626 536273 65869 -105352 363564 229494 -83427 116483 -130802 -79679 77647 73574 125229
11615 125229 91264 262622 109388 117463 -112458 174444 -251349 -52842 135653 43063
11604 -120430 40136 77093 -198674 -244177 -18590 -1927 120649 -299532 67945 -12348 93238
11592 335202 -91549 -234639 151527 -132825 -7162 188040 -116441 112744 -81868 46844
11581 449379 269705 51664 -16075 -147438 -178836 9760 -169205 48661 145872 55882 -236982
11569 337560 14829 -252351 448050 290665 306388 129206 71351 119397 -101134 -142067
11559 -142067 31049 214428 308492 30096 280995 -119556 14896 103869 31031 88381 -7584
11547 -123304 201806 -50322 313637 -85711 -87346 4045 211802 200090 258005 182478 170644
11536 170644 473720 229068 -79032 -194633 282469 217260 48270 184984 261086 217583
11526 217583 -63052 32004 -176539 154037 123232 246849 196381 -8936 -47194 -25367 103374
11514 85890 2025 -153007 369185 -64023 41771 115826 246484 -12535 -39478 147190 19963
11502 690425 -115749 -73290 -153049 -149560 282092 356552 432571 302934 302140 373860 46034
11490 108912 127509 433150 -63291 169081 -28208 335397 87920 260863 27142 284604
11480 284604 300953 -216618 11538 -30 -136830 19821 -61680 -114381 -1535 -132006 177978
11468 34817 294533 187973 -222079 361391 63910 153528 102686 28426 125791 46414 155904
11457 155904 52228 -39015 -133745 47990 403421 130607 -37973 97285 41299 -107326 132314
11445 234885 -188681 57184 -377024 121 -56390 92276 281124 -55527 145080 78509 -203804
11433 109600 351850 -129559 549681 85161 -112426 249989 53078 326684 -225709 64513
11422 325803 235191 -143990 -57494 220568 200851 -174781 -91898 132113 -108436 8154 -240830
11410 -127766 -106218 37755 19970 -63038 236638 59706 135652 -40325 -94915 323824 249303
11399 249303 -74884 301299 84358 -6140 71571 -25171 105838 -121403 23770 305117 326761
11388 326761 160381 90692 243429 -297000 133501 -21204 120707 -206948 -30125 -187182
11378 -187182 62742 143043 162409 245856 452 -172710 27471 -252485 96457 163069 29988
11366 97121 53821 -270366 163336 7265 211920 -59412 115813 -8202 174372 -215566 -81349
11354 -141379 -460179 30092 108771 -118568 132086 -260258 -27899 50211 -162583 -84070
11344 -84070 289152 36279 9161 -146165 103127 -12964 625771 260088 -130979 150106
11333 -10987 226436 -59230 236175 -44409 -86573 -31447 -89231 220210 -265507 -89459 28893
11321 -121874 28143 -29792 291099 -326188 -193071 -190026 -55784 -110917 201339 -182777 -443534
11310 -443534 -94596 -128927 142182 -57322 -108429 264836 91387 57430 -76305 -21386 -115887
11299 -115887 218248 -2214 -170325 24667 198725 27049 -134855 -41206 59830 -48558 -43216
11288 -43216 -121104 -229274 129694 -238385 -228265 190939 -39062 -243960 70206 -52512 87316
11276 -58200 -204574 -26261 -143785 -37820 295216 -45440 -15243 -199829 369336 -25911 80626
11264 46737 -198048 10889 -16380 -345731 10192 -82740 283474 59483 378704 -152048 -66331
11252 -49726 -10520 -237193 -586084 -128453 -240739 -72855 61498 107767 -48905 -64422 -104515
11241 -104515 266767 -465656 -23984 -65342 -126359 -82979 114639 -512360 -521976 -59462 23331
11229 29052 -99533 38186 -6475 -62033 73481 -328716 152651 145927 -107339 -39601 -238050
11218 -238050 -51078 -177138 11066 -255946 191106 -97424 -36658 -63072 -35885 263797 270388
11207 270388 -176527 -363745 137707 94842 30425 -418052 -122282 -403058 99327 -80498
11196 -42087 99863 -63591 154050 17680 279067 136885 232058 179559 50284 9348 27908
11185 27908 -82144 -202296 -36656 159243 -34958 466858 -329319 71134 159621 -161366 8043
11173 33433 22401 -107933 -211739 -121281 -161050 -253867 -79124 329721 264743 -16271 -154355
11162 -154355 19430 -66704 57741 46796 54129 59366 151498 -9431 -279452 201377 -119672
11150 -138028 -220949 -226756 -40515 -147827 151235 -431668 -103426 264368 143341 136756 -56492
11138 104959 -55078 86090 327853 -156577 99128 76519 140822 70390 221033 1799 -212591
11126 -33744 -60632 165567 167139 51911 51126 7030 -142772 170422 -79431 146215 -57715 5755
11113 99547 -94547 115340 146760 -164990 -161055 126995 169872 552703 128759 50350 183087
11102 183087 476383 -9756 307260 104008 -68245 24279 46924 -14761 221968 328761 221178
11091 221178 336228 186006 604430 493487 189128 174195 401362 -38727 60187 188002
11081 188002 251203 5972 203876 318082 65629 424237 324498 281087 -75559 277529 505331
11070 505331 466472 613400 314626 470039 176217 636721 387213 216759 269126 -16788
11059 505820 632318 653976 399638 475901 535942 504051 360881 490874 941745 572079
11049 572079 915954 913159 747803 735134 734885 990663 840371 475838 694286 668142 933890
11038 933890 1254218 986607 578606 592243 1105763 610474 774566 865441 556519 647221
11028 647221 635937 726756 820918 684523 956114 1110729 663947 811731 827695 733744
11018 733744 666032 525314 741925 393617 576782 791488 623704 421514 551480 573870
11008 573870 597877 511867 523548 383471 646420 903817 522823 854256 814764 712379
10998 712379 540999 611426 765855 708283 627296 1021169 728745 722441 455302 763032
10988 763032 827458 869734 1071603 661157 759802 963122 1565499 1107445 1097383 1724325
10978 1724325 1499141 1398747 1448761 2230028 2228026 2205168 2563312 2769511 3149582 3092972
10968 3092972 2828032 3023255 2586941 2666133 1698766 1791642 1679344 1473980 1890589 1553431
10958 1553431 1700889 1690986 1420050 1522139 1605113 1581165 1387663 1312270 783738 592008
10948 592008 549337 468705 471976 498086 401647 -43086 -60442 305164 255850 -43271 167035
10936 195366 55247 179033 -31638 -1361 -230810 -160407 231708 165530 -33203 -33685 28006
10924 -39980 267409 -39823 130749 230466 -90685 192182 -142941 164725 -46737 -115728 243344
10912 -4803 -91281 282285 -169384 -155162 84003 60419 188581 245136 32440 408370 -173929
10900 171985 -149556 -106913 -35528 -55456 320971 78746 356665 217 -91116 -151689 -244715
10889 -244715 68701 -188668 -6488 -364541 -282399 -26631 63759 -84324 -81510 103450 19238
10877 345835 -203558 99350 -237012 -83255 189240 156437 25799 194498 -165150 -131218
10867 -131218 -3558 44376 18113 90920 -28277 -233572 35625 40529 5702 116191 28811 41404
10855 41404 -306837 268962 154715 -66263 65015 -179626 -223812 -248837 426075 -9868 -41031
10844 -41031 -29051 -276276 -140618 -132631 -28711 -167196 -87706 46279 -287782 -107362 99610
10832 53118 -56906 -26986 64616 -159504 -98555 -208939 -355378 107156 -227566 -205076 -193017
10821 -193017 112860 -331635 2479 -90388 -147966 -172405 248691 -126281 5063 -283569 10574
10809 46709 -46998 -174450 226888 -78608 26829 158630 3268 147706 -151110 179210 -264826
10797 345959 260058 -120476 225199 -73340 -225031 -619 19123 120528 -111998 -282508 -137094
10785 120296 120967 -2316 -94785 -312137 -113953 15045 -141564 -117959 -17865 103622 -68861
10773 -63703 375525 130767 -311894 77065 277115 -582879 -254750 -6494 -7063 -279584 -178354
10762 -178354 140164 217230 -61196 13683 114584 -54117 -143276 -81274 142881 410193 -171964
10750 -95295 28234 127390 -252225 -217108 -276169 -438451 69490 285812 -90156 207380 -270214
10738 203090 -20502 -117620 -167466 -290506 91774 181151 -30635 146248 198786 1720 -3710
10726 -211592 -55717 -37208 77052 -208647 -212333 -271271 101295 -214866 -29524 36114 -51977
10714 208391 -4179 -159935 -35979 -59830 164402 -29159 -333081 -281771 -78438 30317 -42649
10702 -83677 -69456 -57972 27792 -53623 135025 -25712 -51311 -85159 -172724 43346 -47945
10690 102769 82183 -18303 139703 234705 57131 167155 219877 5766 -270855 161723 -145263
10678 -138946 -243130 -229941 -168790 26268 -377758 -202906 -198321 95079 137576 -22499 146831
10666 -65930 -82002 -103505 35690 -127647 -58903 -115275 14889 63102 -120762 100571 -65123
10654 -87580 -83921 156402 -128427 -20256 -277951 -128718 102992 -282987 -20464 -105718 -55029
10643 -55029 80177 -146054 24312 -32889 125503 -237345 -170301 -198961 -350926 -102854 -11250
10631 1771 230524 -45019 262438 198626 139919 -414470 -103501 -28476 -27753 229074 -97194
10619 78384 24499 -265370 -89075 -322102 141492 236716 170873 -305510 -68742 285276 177952
10608 177952 -3829 -38333 -141274 245355 -227059 -245431 70171 58240 -227520 51254 84820
10597 84820 70048 -217235 -60571 83426 -176117 -105124 -39935 -37431 145447 -136484 214166
10585 -58203 190204 82974 -37493 140498 -34138 -338746 -244086 53728 115358 -43779 334633
10573 164044 -150328 -149982 145483 -34116 -89496 -199909 -103956 164402 -74084 -274115 63625
10561 -273300 -203806 16112 -96193 335727 -275247 211220 -100253 -105865 -224710 58636 -94929
10549 -170748 -391790 -306494 89423 -174980 -51729 -250797 -142493 63338 -135045 -104536
10539 -104536 -21206 6315 32478 -324969 162898 -280228 10568 85958 -15496 -50961 -295957
10528 -295957 15447 -35110 -62896 72864 231946 -262720 -139821 196487 -183081 5806 94416
10517 94416 -167385 -57302 -56021 -163379 -49077 -246641 8807 1711 -172089 -15597 77430
10505 12374 137774 353139 -172783 -30552 196226 -236267 -122556 -3222 97257 -250369
10494 143839 109702 362215 -36744 176126 68488 112297 -167426 -137433 -84867 -67988 77146
10482 -41701 412745 168350 46045 130733 407378 445003 190749 44823 -132292 -76242 -132975
10471 -132975 258174 -20395 -143010 -32471 -101596 106194 -43258 155191 -224457 295795
10460 88235 -130964 -130797 514066 -55489 8601 -14402 -176347 -338235 102750 -136785 91942
10448 97570 59860 192056 -197268 -53023 60808 -112084 228955 113383 162102 -345510
10437 -120762 202789 -14735 -29295 -339647 147922 -218383 -68366 -15789 -53809 19647 628
10425 108737 -140420 -75516 -184654 106620 33912 -38334 55554 63542 -79116 22612 69197
10414 69197 175583 -96363 -183701 -102851 -201427 357 295351 250055 -298880 38483 173873
10403 173873 189185 -157383 -240486 -79026 160657 -123757 -60113 -184906 129620 -21091
10392 609698 125538 -38912 -43963 84810 -257445 19580 105817 -233341 9015 -249326 181329
10380 352404 61245 -2299 290671 117865 478040 -48075 261598 59223 50786 52690 627500
10369 627500 302045 265905 242633 356979 752983 319947 513305 298915 314982 543519
10359 543519 316880 -24766 223931 304178 301297 -123364 268501 386862 141854 682214
10349 682214 520955 485823 546430 122749 244416 306575 240546 284859 597543 305018
10339 305018 -55303 228701 243638 77390 38795 354653 217757 -14975 -59486 -41612 -17490
10327 -1119 -54509 189662 513399 237693 143683 451641 272629 176384 352205 113140
10316 -34917 255561 199343 250950 162591 176363 -46456 83293 70269 -270987 164855 -40717
10304 146795 20859 9567 -6393 -130493 -1098 155889 87495 -144408 67029 -213714 104830
10292 -118223 -48852 -7110 80571 111262 74116 109140 -317282 -5851 -332447 255743 15027
10280 -190955 18749 198892 20498 70556 -419991 -278708 39174 -41725 -164921 -162295 137939
10268 70815 53521 51795 358684 -29886 182139 -36930 89417 45923 147417 157521 49515
10256 227864 191463 423406 46727 312224 159948 202493 15994 277094 -6336 -180780 -27161
10244 111233 -171780 57473 -289374 -52311 -27817 -43491 -186945 -218687 -7644 -300093 45846
10232 -133942 -390196 365332 -235139 45779 170868 136035 -429736 -135037 -196291 -184725
10222 -184725 159399 -55193 -55633 -75597 292524 -111223 -128041 -13512 164131 104063 -127357
10210 -82648 -456588 -112180 -1002 67613 -187832 -14128 117699 894 -396707 64932 -222114
10198 189453 -7864 -92163 -253010 -110770 37274 69948 -12569 -13413 -133872 27898 -37554
10186 285611 -179548 -334861 -327763 -237602 -397874 90908 -3739 -128366 -45074 -28028 -166615
10175 -166615 -362279 -123463 -5290 -251944 62885 -80243 101167 -182639 -151435 -137848 78380
10163 68847 -2098 156357 161327 111803 -144024 -95665 -164745 43489 -184503 -353797 -46783
10151 -296954 -35953 -223659 -236617 -55696 -31400 41519 55281 -868 -116920 247083 -82422
10139 90004 42459 -148148 -151424 -138193 -44945 49992 125630 224899 50132 -83057 -130700 -89890
10127 -89890 -11457 -197247 6899 44547 -399129 -44544 -90107 251568 41808 -177827 45911
10115 201559 -63689 -145656 55203 -150722 154050 73481 -255634 -200351 -182928 -94786 -25476
10103 -193082 -220757 -105525 -100880 -9584 -187498 -242139 -21460 -157152 -370333 -231275 -71964
10091 -256448 -55074 -15558 166918 -161272 -324751 239729 -605698 -140001 -88586 -207140
10081 -207140 48920 53257 55669 -64383 -106842 26012 132150 -130103 48054 -68827 271354
10069 159471 -321159 -208681 206671 -18679 -87494 364736 141547 155561 -33686 -254630
10059 -254630 -11314 -229910 -226269 112484 27038 -39939 212172 453839 -8932 143739 31511
10047 -119775 -2927 -94980 -33094 -104276 -54827 -490840 -301212 347624 -207824 301542 7401
10035 68279 -213197 3475 -356721 294154 -286826 -221581 40229 -139115 -266444 -91071 270708
10023 -192220 -209364 -100156 99141 -162210 67783 -173956 -156210 -270329 276974 -206419
10012 131393 -328912 81749 -304658 94368 187464 -86380 31934 -175353 -23838 191668 -132342
10000 -259861 -200416 -142431 99946 -78373 -217032 -281036 -229544 -284107 -277478 -32439 -80058
9989 -80058 -174288 -64155 -139453 -128432 -198031 -134164 -340536 98255 -162371 -12776 -212099
9978 -212099 -319781 -211106 332372 -103299 -175742 -80795 -279526 177420 14309 -318157
9967 -261523 24840 -94508 -15590 -335301 64768 154897 -298672 312022 220927 -206856 97035
9955 -320242 6710 -397912 14380 -2791 -98524 -331377 -52442 4794 -150041 104994 -224477
9943 -269604 185263 6500 -248760 3864 -54657 231459 173763 50549 86350 -118858 -292183
9932 -292183 -305863 -86582 -113595 -37373 -384431 -63929 103160 -114527 -218656 214180 -407870
9920 -57123 1651 -29971 -90450 25226 183189 94405 -119257 -547195 329723 194920 61993
9908 -134135 -20064 7717 568092 -25408 53859 -32487 286491 -161608 140398 -275861 122630
9896 7115 -258597 -306047 44681 -45310 192981 -246311 -101130 -154071 -183539 -160915 -363401
9885 -363401 -4300 -234377 -137610 -36599 -96438 -52720 -91889 23780 -55565 -79455 -83761 204084
9872 138210 -102532 -121743 -506579 184308 -113025 -249806 -105856 -387390 266519 -63072
9861 -209416 -11603 28818 -35156 -103278 -202144 -162913 -119671 40681 -226570 -204043 -4033 155660
9848 -275443 -38800 2555 39598 94947 -71022 -44564 -202378 -77712 -109203 -78938 -73625 -148066
9836 -148066 92194 -143809 73936 -110833 -17486 -271278 172649 -51176 -134339 141149 -243972
9824 -208224 -4302 -99714 208900 -73609 -99091 -397851 71994 67117 -5570 277962 -523532
9812 189966 -101765 -375568 104059 26591 -70083 -299096 -246950 -20549 1939 75950 149039
9801 149039 -182501 -376641 3117 -65317 117996 264178 32050 -119812 -396218 -99880 -153244
9790 -153244 -143555 -39151 394764 306711 224266 56522 -396259 88916 138 52705 -5564 -291848
9778 -291848 118958 -45148 -278042 -96195 -30132 -295548 -234620 -202988 -133020 -80440 -62981
9767 -62981 -402351 -4414 -279600 -76269 126971 -91741 125912 27518 1905 -15298 40203
9755 500 -99748 -96494 -324666 -303149 -550720 147615 -339482 312667 273880 330048 52637
9743 62513 -429325 -135639 -209788 -96658 110579 -292294 62945 185564 -157996 -98632 -190999
9732 -190999 -32393 91046 8251 -296051 65885 -99595 -44107 -285797 35715 20242 -42038
9720 -93021 -55655 21008 -84503 -14805 -138802 73070 -14194 -211100 -108318 -5739 -97756
9709 -97756 380581 -150322 -331541 29521 -64325 -153570 -222302 137693 -33718 57259 -309387
9697 -228463 -171054 541116 10737 -130658 -184660 22832 -423925 97567 41765 -71955 -34387
9685 8876 125122 285814 -306223 42823 229424 -51761 -117640 175695 -383329 -277941 -389119
9674 -389119 -24537 1717 -110094 88496 102010 -138493 -99974 -144418 -8890 391392 -192712
9662 -61565 80317 -139833 247784 -149139 -146315 -211470 17728 -3260 55990 -180379 51972
9650 334530 -183735 -548829 -9708 -180571 -383874 -39688 -99808 -141137 -316786 117403 -219355
9638 52142 -194893 -409892 -122083 -182769 -241677 -488485 -79521 165088 156518 -137154 -175318
9627 -175318 126431 -315749 44471 -98360 -190568 97427 -49733 -122729 -126475 6724 -221471
9615 -99042 -150570 27056 9866 -374739 -266783 -144102 -84976 -70627 8619 204342 116043
9604 116043 -16254 -162105 -96851 -67538 -9089 228099 -225818 206500 -180425 -66497 -28558
9592 223215 -240916 261403 -52564 -209438 -425879 240663 -10500 105854 -137502 132008
9581 312593 177363 187699 -92666 -317020 90758 -151182 190167 -268469 -25880 -326597
9571 -326597 20465 -428447 187892 -71771 -21164 153575 -166249 -213586 83086 1551 -149080
9559 174688 15295 -2729 -90100 -457376 -112490 -291969 -268419 -40277 -10488 -114658 84940
9547 -70616 103242 -101755 -108078 68920 -354739 -143875 -185404 -54781 -105340 -249258 53012
9535 -348831 229404 -278169 -381884 -212570 -78761 -222488 -8127 98095 -29549 -120952 89778
9523 -589915 156547 -157191 28251 -86648 189 -289946 -68740 44394 46937 -276963 -207521
9512 -207521 215751 -170756 101668 -145874 -47788 176784 -77219 20290 52563 84856 -236086
9500 -112753 280508 220383 -99004 338198 49284 -405643 268584 -350943 -328654 -19490 246868
9488 -54446 292974 -387984 -309767 -142488 -1584 66872 -307385 150276 75748 -300180 112864
9476 106768 -107338 23118 -122251 -98238 281115 -69640 -349996 -44763 124710 -174741
9465 -80289 -199822 1288 190723 193358 -203226 81087 178402 -216191 -35264 -411094 -63370
9453 -71148 -123645 -135959 311321 163947 -121947 39763 -262293 193121 -24512 -336789 139769
9441 -251176 -258727 -247400 -189983 263939 -216868 -120458 -260015 -425414 103826 -23215 -209614
9430 -209614 -33988 320037 -421502 -56698 -109640 -214598 -180421 247112 -387123 161003
9419 61169 -139506 21577 -289052 -542207 -117695 -6148 -56746 -50771 101617 -88167 -242198
9408 -242198 -97464 -57074 -35635 189215 100633 -212905 196560 299370 -459461 126905
9397 295306 -291955 25354 -30736 -391432 744 -156118 -74396 58577 118856 -119825 162770
9385 263157 -109107 -149259 -22167 14938 211378 -155218 122643 162861 -74389 12904 -256144
9373 -148533 473769 -394703 -288976 -88127 195566 -341751 -180343 -448653 -100499 -114006
9363 -114006 126710 219594 184409 -2148 301506 126538 -45763 -115737 -278096 -157683 -52991
9351 173069 -147091 -293624 162527 64318 -126787 -86726 -40020 -195928 241741 -53935
9340 -73210 -219877 -397372 80367 -17022 -289047 -41014 121168 34949 -255114 -149568 189378
9328 -642 -95417 81408 -34558 -437143 -47257 -100424 121359 -347499 260717 44548 95009
9317 95009 -270774 86592 1307 -135150 -233428 -297437 75696 -180828 -350645 -158402 -5357
9305 -123778 181726 76499 7413 -113390 -102268 139587 -233880 -101358 -88522 114138 112887
9294 112887 -289222 13966 120257 148547 9145 -32064 -242883 -435275 -55449 -32054 -9664
9282 91443 79879 19395 5591 -5971 -47150 -230955 -254362 54934 -366445 -12623 -206939 118056
9269 493534 265577 -162251 -178186 -140049 269340 4369 88044 -125352 26987 80153 36674
9257 304438 -282573 145397 -59587 -116940 -296501 -106836 172536 199325 111435 -37621 -114109
9246 -114109 -194737 -60975 128294 -71224 182384 -325641 -316746 -189688 -249676 -152705 -163925
9235 -163925 229897 -69991 -329504 -252674 155912 59740 -420123 -32525 -222083 4093 -246541
9223 3520 -366362 52720 -398643 -244872 -60119 -20307 -75849 -29645 -295964 4992 -50010
9211 12195 -124435 -508425 -284736 51776 -285878 -136345 341447 141455 -136461 184205
9200 -288389 214309 -151465 -27917 -204412 123010 -86906 -257476 -246508 55339 -108838
9189 -100346 -40576 -185442 -96460 -190610 -267729 -289503 15086 -312874 19644 -188598 -283794
9178 -283794 -21834 -30497 -46631 40144 -61527 53727 -61698 75854 -364196 -29107 220533
9166 -85438 206822 250504 -83893 -210997 17486 141374 118020 97185 61095 268439 -222046
9154 -213148 10355 91733 203070 -105039 14758 -77198 197034 -158667 24999 131854 53400
9142 -146827 148448 -200968 -9480 -152906 264875 258329 179120 -114540 35761 -93036 82314
9130 51076 -88033 -19531 -355635 -14209 -48123 -60744 -60620 -140536 -269446 110585 -339617
9118 -266641 -190849 -366295 6357 124970 -16071 -371268 -21145 -122847 44818 -354662 -310440
9107 -310440 -43755 -132292 -189506 84339 -324982 54912 174537 -171010 -182612 9904 10325 99218
9095 99218 247251 92036 26073 110399 53237 -186752 -249282 -353836 26764 93421 605057
9084 605057 -231103 -307795 -7473 275745 -193432 -262795 -104573 181390 -7875 -293290 -23242
9072 -127448 -78757 103812 -47296 -362920 89271 -188906 -18412 1382 -146644 160398 240317
9061 240317 -301855 -410095 51000 -21667 -60210 -77711 -136388 180062 42630 94463 -17815
9049 212996 48176 -57302 -216455 226329 30482 -102552 -89238 -72330 84875 -97620 -218332
9038 -218332 -242388 -2078 18069 -98313 248164 102340 -232336 -290291 -43852 329781 -108027
9026 -183040 -106114 -200506 -49512 52303 70769 -329319 -147752 7347 230839 122429 -183398
9014 -98360 -272132 48923 -49407 174267 12776 -59695 -219366 -149865 201217 -120550 -271259
9003 -271259 13919 -18356 -254362 -178724 -136039 -113859 -45391 -151405 164970 -482066 12907
8991 -225707 -104036 -171117 163292 -88451 -359452 -163684 -46416 -29362 -5158 -181943 -66732
8979 -116012 -194991 -161950 -2332 -295234 257525 -201979 23320 -48340 4240 287333 -270757
8967 -32382 190953 36520 55239 37221 259289 237666 244463 -268212 -319276 -192518 -63904
8955 -274196 -101988 59565 -363633 136601 -198747 -109344 -213281 -154476 -76958 56517 143643
8944 143643 335415 -84303 148811 -1844 -148774 125165 181732 -55903 -170961 131695 60153
8932 218223 105768 -7266 -114562 143054 -268886 -59129 570163 242972 660252 2871069
8922 2871069 9424562 10946825 11855460 6792963 1537408 953412 343376 283542 324648
8913 324648 174646 -322943 264299 -333062 132369 284864 453439 -30975 89205 99791
8903 99791 -62158 -527932 145558 -79122 136464 142821 -184355 -284591 65973 -136216 -205304
8892 -205304 -160639 -291222 133512 -129532 -127853 -281334 134509 -271432 -48052 -219103
8882 -219103 -172193 -94432 76738 76415 206808 99797 135253 -101533 -107272 -84717 1563 267531
8870 267531 -169730 202045 65568 -53880 -306828 -247747 -259253 40772 93688 -202805 -66669
8858 -108212 -39968 142751 90365 149373 -38403 32275 57661 -284511 -124670 -11621 -238375
8847 -238375 146783 89865 -122416 138594 277588 -242079 -39765 -175828 158029 -136543
8836 -131259 -122809 -85965 22884 495250 118105 15133 17356 169931 -239385 -227411 291054
8824 31499 -307036 225049 -268833 -76227 -216475 -181462 -375767 -140901 -146674 166531 -191106
8812 -66204 -62917 -271286 -179675 -254201 -181020 44578 -88393 155998 265857 296593 84672
8800 -258893 -206965 20000 74001 201023 -340829 -434883 -334448 -54657 545936 -348986 -208809
8789 -208809 157150 -64979 -315496 222313 106813 103080 -303887 -166137 -310396 154391
8778 -45451 -135108 -323199 164741 39068 36461 308 67704 -94971 -364716 -42462 -173289 6120
8765 -88012 -200995 -156321 -218338 -246297 144784 62834 -23729 119286 -197686 -399100 149751
8753 -48115 18734 -55090 -185357 7629 215087 -237974 -142923 23405 104249 192519 -28969
8741 99787 -149516 29333 -145220 -262603 404724 267369 -43501 -161203 -108352 -200617 42283
8729 48294 -183752 -33601 -394429 77846 -482307 15353 -397703 136604 106125 -301349 -137296
8717 -217963 17077 6869 161130 -186462 -17519 87862 95321 13927 -51763 -4191 -89660 -310256
8705 -310256 65638 -87787 -74240 151789 138090 119913 -102140 -91260 147875 322329 -66823
8693 -88647 165978 -170395 -55962 -131564 -256646 336964 -165481 -126352 -406214 123164
8682 -35683 209101 -139088 26049 327196 -313089 -15725 -170724 -411789 93320 -311910
8671 91593 -248473 56648 349248 -21690 -188808 257602 -157554 101351 -106897 126396
8660 369300 -27383 47365 309547 -175915 -100227 -213195 -120747 273316 27790 -24244 111780
8648 -394725 41977 159647 2557 12581 -76605 -83923 -315303 -437255 19298 -295651 -223902
8637 -223902 -25118 -12618 106345 -6817 112037 -186207 -122220 96289 -110977 65903 -74575
8625 124367 -189414 90897 -219135 63127 209340 -309022 79089 183840 -115306 162356
8614 61175 163032 48600 -2147 -145062 -167835 462640 -142185 -383956 -203146 118604 -8217
8602 -110785 152815 135583 -18220 322505 45119 4216 -54904 55599 79788 -268864 -50898
8590 -343603 174454 38022 -19235 -28404 -36500 -11945 -299538 -158287 -73842 -203963 -93457
8578 -24327 197600 -60139 -461270 -328626 -170386 -259659 -235366 39282 319639 -28303 -73511
8567 -73511 -77291 -123302 23669 82943 -43746 -173940 -145619 -121077 -194110 -76064 -126909 -166676
8555 -166676 -213807 -136498 44296 -4891 245753 -41715 -30304 192816 -73773 87256 -111815
8543 49768 -8126 -95942 -113036 -96000 25194 -5343 -149668 -191953 -92227 -275883 -144927 152021
8530 50651 -23751 -55555 154560 -135786 144439 -403836 -117508 -37246 -127684 -197359 -3138
8518 -240694 -135552 -202776 108566 -116413 -25401 -168383 37459 -231693 -400818 384962
8507 89339 2733 -40352 -80779 -459692 -16472 109466 73516 -238168 -418593 -82485 122371
8495 -82072 -64946 -97319 117493 -121177 238492 61750 -123128 -202036 135524 88146 -207943
8483 33085 -476132 -52229 134657 317697 -93774 -223648 -59918 -128879 -340638 -155992 -142318
8472 -142318 31816 -162523 -302525 106368 -124693 -145779 -210886 99603 -386066 -259036
8462 -259036 52806 140159 -282660 -36943 -61586 -184122 160570 31142 -95624 145423 -318358
8450 -152536 78607 -155130 -187510 -3052 -26509 -29505 -30140 -157903 1543 -133079 -184826 38905
8437 202493 -14170 -166067 -40043 -113091 -59882 -103296 132059 51963 -82584 -144165 56354
8425 65262 -364843 405246 73641 -440281 -63396 -227674 -20825 77860 -15582 -121245 444403
8413 281548 -307737 250580 -48686 -313833 105801 197087 63616 198812 63488 -58186 240307
8401 23017 -295960 -277253 -61783 -37446 -57501 -177309 -69771 5633 -44308 -26586 -35038 70268
8388 319292 -132762 -73054 214730 198647 -106728 -59954 -42415 -87133 -229627 351027 -4591
8376 -155857 -162947 20562 -209751 -17266 183017 185443 -25986 -317236 108384 -113263 -29163
8364 107632 103915 215180 -153179 -76911 -71780 42531 -258265 81022 239658 99670 249489
8353 249489 150319 96408 70510 -83869 -428107 95740 10411 -15608 -29146 -94483 86615
8341 -398465 93990 -182580 -133319 -96395 -84139 -202240 -50032 -111262 -8498 -58156 -111865
8330 -111865 -255634 -25441 335303 -59921 -204596 -288837 -167151 -176685 -307412 105696 -94753
8318 -78616 -81890 -372400 139932 147429 -919 -106966 -12118 116128 -64416 -45942 -62400 -64890
8306 -64890 67347 -61172 40781 -95908 238103 -238835 154448 -207123 -273858 -101439 -117622
8295 -117622 173517 -390960 -34437 -117571 -310797 -204063 360296 -140235 268003 -189935
8284 -27913 245313 -177242 -5427 82718 -199630 40101 -148494 -556117 -241764 308236 -62861
8272 130787 -252273 117479 -73998 26880 -95545 -15060 -24679 79050 -35261 7550 -8378 -112530
8260 -112530 -199564 -236439 -1806 -77351 -57594 192213 132553 201757 -327904 -238294 10593
8248 67743 254427 -60672 -215705 -294801 143995 6693 -136853 -103017 178127 -103671 333588
8236 28274 -234888 -220269 296965 -167422 -171286 -423495 -112052 -257556 -28156 226598 -143154
8224 -33432 -46655 -239814 -49429 118474 -488661 -361643 -186280 -39212 -332590 -426384 -172490
8212 81664 -100154 -230024 -200539 -49372 87234 -107225 -104502 25251 -384201 -151396 -239501
8201 -239501 -78511 67552 -174865 117043 55249 -260790 -66275 -131066 -127125 45720 -247281
8189 -117834 -191813 -85376 -316941 -218451 -178183 223385 106100 -150147 50027 -51360 162709
8177 -160578 241180 -48056 29116 -123139 -8338 366173 -65069 -128482 -39603 -55222 -137315
8166 -137315 -24358 -16903 194440 -181396 -87206 112643 4537 31053 -157442 81050 -205063
8154 -105205 313102 123075 -275632 -158723 267395 45624 -105681 151872 196764 -124955
8143 -185048 13080 -220639 -330616 -77798 30007 221428 -249216 -61180 -220670 220765
8132 -86750 -168359 49007 -144952 -65257 -9967 -441592 469808 -147139 51130 -97098 -84066
8121 -84066 -87421 83712 215701 241476 -88173 -40160 -100764 110371 -393986 229282 115186
8110 115186 -111516 -51533 51136 149688 -139472 -78668 323372 -366799 11684 -339125 -119141
8098 -123472 -344558 -455415 -184639 46474 -23151 29979 -234749 -161687 57068 -76311 82757
8086 84239 31687 12602 -153218 25542 -248780 -125483 -136918 -232366 69166 -14966 -400054
8075 -400054 299075 -80526 156373 301922 -161906 -60280 245597 73655 -42029 187600
8064 30196 -91970 -333799 156357 298465 -115827 36015 5488 48620 -104186 -126010 21450
8052 -164623 120280 -78879 35666 -149598 200445 -22091 243476 -401148 -202650 -63257
8041 58301 -153679 -52220 -188864 -159112 106608 -236047 9341 -28176 -180639 -2949 13277
8029 12929 186362 -36993 13332 -183894 -105325 70844 122284 216282 -151968 -5884 -49392
8018 -49392 146377 55848 -157059 -230129 -245948 290269 5490 -58673 67249 -15336 63990
8006 -98013 -221915 -215155 -401243 -261932 -145040 -128290 24825 143311 74464 -10130 75250
7994 -81021 96729 -231908 -36309 122435 381792 -315146 -127117 85731 -159033 310706
7983 -212177 -308208 -139381 -15677 -133377 -45399 -221559 -135121 -118518 491995 94867 -66782
7971 380965 -368600 -184559 -12688 100676 430131 66746 -9086 87261 -11346 23893 -294875
7959 92274 60923 -277545 129832 -283331 -69788 63823 82898 -64860 -193320 -74472 -247452
7948 -247452 -210926 -168517 -74016 -379369 -291501 29814 -269820 257855 -295466 -46193 76186
7936 72771 333983 59956 -396214 -92639 353702 10526 -77800 -262143 -139623 85352 24077
7924 3334 -52124 -438161 -16446 -148184 101089 228866 34398 -12459 -257886 43359 5742
7912 105627 -108361 -263420 -390296 -331746 126130 -158701 233576 -367654 279277 161938
7902 161938 -198294 382295 241840 53121 -171211 -250824 -363167 206902 92086 -41007
7891 -243953 -89822 -63942 -67491 -156788 -332693 -384588 6971 167386 -69180 -170804 -251918
7880 -251918 -119155 315116 -90419 84170 -206024 88168 5428 -146164 60003 -50295 220209
7868 -101586 7788 -112659 10589 -46500 168134 -197781 -207940 -302873 -34989 -318369 -55417
7856 -121896 358241 -41221 -102767 133302 -266701 -330231 72821 -16789 -102134 156529 -85066
7844 85600 -305952 -202791 -262806 34106 312822 -86606 28243 5865 130559 322418 -31565
7832 126570 114377 -99444 25968 -112762 -215471 -195688 -96118 -100399 -242632 -146716 -119499
7821 -119499 181340 111823 -73618 302735 244255 -135165 -192627 16392 -294716 25108 -65956
7809 -130789 -38239 62800 -382180 -335218 141622 -12962 -24881 -38473 -141460 -113923 -88545
7798 -88545 -123450 373539 -148842 -205194 -268771 -156830 -272906 -270136 62246 124502 16184
7786 -20010 -52246 17105 176853 -235521 -325279 182144 -122413 -310668 52508 -118461 84911
7774 -189876 -331004 -129240 -93082 109402 -78018 -102540 188553 41529 -155096 -123175 23681
7762 13155 -6884 181727 45297 201531 76404 -268263 114975 230431 -65798 -44729 -292440
7751 -292440 -150578 22181 47365 -70691 16565 -143378 221221 -280459 -42154 121598 20564
7739 -136548 -233451 -402728 -165849 29370 4087 -165569 166061 -28771 -67602 -113363 -41993
7727 103713 132716 -184827 65735 76665 -43358 4356 7082 10193 62193 57983 -77647 21263
7714 54305 15334 33006 110690 130151 173139 -30002 95172 -172914 -141696 141647 -80704
7702 -128944 -150089 48775 -295174 -134823 85757 83951 34323 277431 -56618 -57356 57540 -37467
7689 -34018 -163929 294216 11194 -99656 -258028 -156563 -364773 -124847 149975 48728
7678 -203355 37066 256549 -63275 89531 154925 80003 -36448 -296395 122528 -182219 -158049
7667 -158049 -77603 128389 -74213 -8057 39345 -309667 20836 -211238 -267277 -233447 211298
7655 -258218 -132480 -8467 -534664 -262666 133267 19948 79803 -502497 10380 -6299 -85711
7644 -85711 52096 295812 -419026 -123938 -14594 -186091 -212124 115109 -261385 212613
7633 -49137 69902 217477 -317897 103446 -301559 -53943 -43947 50268 -280427 200258 -1091
7621 -311000 -88539 59409 -239910 38790 -331093 -186771 -375612 -18670 -209774 275315
7610 -260825 -438352 181764 -853 -1086 -26062 -360603 -273559 -64927 52383 -24294 210593 -227918
7597 93617 58021 -243057 -142910 62140 156660 84662 -99681 217068 21008 53289 12897
7585 222715 -152507 -55644 -155045 -296091 176376 11124 -33267 506717 13393 -157701 -76832
7573 -236933 -188749 -176331 -70922 -3906 289601 -262201 307936 75242 24895 -181680 -229100
7562 -229100 91394 21956 52967 74809 -66866 -283496 -100044 -160343 -109298 -4836 -78771
7551 -78771 20890 159276 141567 340917 336340 -166504 -139861 -62535 -123790 62489 -249266
7539 -57271 -152857 -22248 -32329 75624 27272 -405830 119188 24768 -439565 -463627 -1050
7527 32835 40432 -266165 119732 -35392 294123 62406 -143699 227916 -18518 -136658 -135
7515 -114192 114975 14877 42416 428107 132230 -18816 -187938 -119167 -233695 168629
7504 68561 153242 -127178 12072 -140635 -123549 119178 -191924 116798 -31319 101030 15415
7492 -400284 -33897 -95820 -6349 -22835 -151381 -23517 58128 55609 92420 200628 -116006
7480 -270354 -223108 -207631 70384 -128934 -297750 -10119 142357 65749 101273 144216 -55738
7468 -187583 -162995 -9147 203726 -72227 -131457 28538 -117730 -105042 -219260 -91680 299587
7456 -221024 -180283 -106783 -171911 -181741 -130407 -67705 -163619 -67590 -18184 -105781 -335628 -55668
7443 -376796 -211576 -160446 13588 -296952 35971 -142137 -33107 309725 -426185 311380
7432 154391 96698 -16515 -303753 -156705 -76578 -49851 -51524 218976 -46956 -151852 -61010
7420 -589573 95093 103130 -122392 -174244 -384028 -140804 144753 -298653 -57922 -31591 286025
7408 -40144 391290 -219083 -383086 -79084 -40811 227498 -233039 147607 -98933 45775 113388
7397 113388 28750 -133295 -110887 127065 -124833 -309165 -220397 -262527 -92524 -223087 -199178
7386 -199178 64264 233700 -30133 115557 61081 120657 -274198 7108 106046 -164033 -144809
7375 -144809 22467 182649 114111 -17903 -11243 -266741 82954 83019 -147857 -205690 -26944 214698
7362 -47614 -69685 101236 -357465 -149775 -38440 120012 18614 276009 41770 -116507 -136155
7351 -136155 76060 -417875 -203049 116694 -112840 183566 -3583 -532254 -229556 -294816
7341 -294816 -223297 -178268 -323040 -14120 28717 -65877 -45446 138175 -256156 -26272 -147198
7330 -147198 124459 -13555 -88194 -200536 135412 37720 -142888 2394 -89095 -177443 -112642
7319 -112642 67253 -18785 48357 -39639 -146182 -190411 -63099 109050 157443 132233 65505
7307 64805 65819 -82420 62113 201923 169811 -61582 9496 -160368 -104773 -139903 33108 -128475
7294 29530 -328873 -117419 -144104 -310671 -139095 364114 -63120 -123119 -45152 -9625 -309843
7283 -309843 209401 -239441 -1395 -188083 -247829 -155842 -50360 -175784 66474 241813 -38215
7271 61149 202082 -202940 -120568 121246 -13090 89814 -78006 -125140 -120564 249837 60043
7259 343424 -16467 -120387 -105919 -310980 -202264 -4129 -25660 71471 110816 56681 206575
7248 206575 195484 30783 -107047 145931 158432 185271 296786 8801 144345 196159 173468
7237 173468 156369 -108865 53369 -278603 -308298 -316076 -211512 13842 24988 172046 -141658
7225 79363 -16851 153396 -669 322195 -372570 -22593 32399 -41274 -194819 -68110 -238723
7214 -238723 24829 134210 205424 36725 -41591 -28320 -157257 74689 223430 -39986 126039
7202 -20206 277530 198664 47974 -73894 87898 -122362 -332218 68695 106705 -60817 -5025
7190 260992 -145804 -115995 -233068 240106 -108108 70381 -221999 -320663 76725 -169246
7179 -28683 -225604 3754 36684 122320 -109969 15464 -45305 -176005 6880 219305 -59533
7167 -185441 149323 59099 16526 -3106 -273584 66235 18997 -142759 -123325 110900 31081
7155 -253742 -32314 11235 -52815 -79177 201 -178474 -214653 74446 -149442 -154946 76063 245524
7143 245524 246937 -58706 -65650 -128139 -67305 -154441 -200475 -227503 -39393 40616 -28419 25446
7130 -148167 -72219 -17565 118589 -138774 -43766 265403 -53750 -137537 -211236 281646 101371
7118 69415 -360379 113262 -125710 -225748 -141034 181750 -30096 -131161 47541 -167092
7107 -198469 220459 141713 -368030 -86219 -380070 232488 59583 -296698 -166562 -160766 69111
7095 338560 24959 -292548 -30417 254681 -132515 -196316 -179831 135830 64206 -24418 -109442
7084 -109442 -11627 -168331 152836 138730 180868 101151 453030 338616 191019 45452 33613
7073 33613 -312634 115416 -294268 -54457 28770 -14451 13223 -186892 -382215 176466 -272346
7061 -434031 -234369 -136100 146495 -210454 434645 60657 223382 -67812 283427 9102 46509
7050 46509 -146255 -27282 -144425 -67470 22222 -75753 -55211 4391 -368473 70519 -69529
7038 29923 8571 118269 246181 -370230 -30244 -153698 -134887 92665 -278081 -261920 180248
7026 -103804 -124135 -182955 -25068 236217 154791 26231 -39608 -135708 17378 231681 -114901
7014 132215 -88507 -343878 211390 19876 -445124 238957 -145744 -224963 13414 140007
7004 140007 -84238 120639 -61079 -162252 -178197 -64496 297459 -143410 -88258 -320406 -49371
6992 -235034 -44445 -359817 -22929 376278 -157363 340303 -34886 -227415 -3975 -73053 208421
6980 278403 105996 79910 -1152 86981 -182838 72658 88177 13330 113744 -182126 -92264
6969 -92264 64914 91171 -87663 145198 99248 31849 -517237 84387 -220356 -315024 -8756
6957 -108069 89409 -338770 -100462 6939 13340 -45044 -190991 204502 -160521 492559 52623
6945 199735 391862 21646 253338 -186639 -126314 -210989 -294166 23447 -232789 -140542 -122996
6934 -122996 -271515 185768 -51915 -198529 66205 265 -234298 -82350 -269776 -182431 -263527
6923 -263527 21983 137301 -35759 -261690 241619 69950 -420048 123746 -137891 16334
6912 35538 -208311 306552 11953 -85192 54408 94434 38850 -142273 -458296 265305 32320
6900 -169053 200815 301840 -379718 144381 162603 134906 90024 9585 -61289 -506584 162474
6888 17661 137014 -48871 -62511 -390645 204256 121676 72733 -138636 -114062 35755 237456
6877 237456 49236 83495 -27060 -97247 83864 -234877 -145772 -96067 74279 -113482 -86872
6866 -86872 -88713 13873 -43306 85017 -43193 -38191 -118019 -34504 124500 -361638 152613 -84887
6853 -253460 -315015 -79829 -6121 -34616 -74983 106185 -177792 -167375 140050 -89357 -349147
6842 -349147 260503 114554 82142 -85220 -162588 4703 -232425 -32990 -330820 71183 -3071
6830 -135884 247868 39344 -317169 -118620 316506 132588 86160 290994 264284 412105
6820 412105 -148844 -60348 -373229 -14960 162404 34134 78771 -10721 11705 12506 34276
6809 34276 236384 86005 -427125 -258846 -201407 -226873 -147244 -64501 101892 -384762 252957
6797 52619 383297 -43520 -115523 -162275 -90304 -112818 73336 -1306 -362968 -115709 237737
6785 -431325 80826 279045 -45103 -137220 -138783 -14738 -174596 135289 -100450 -164329 -285533
6774 -285533 53777 -111334 112301 -103582 71529 85170 93308 101651 -80556 94125 384301
6763 384301 134590 -183909 -6965 99708 45051 -167205 -76565 164909 28283 -67767 135835
6751 55397 273880 -135009 94462 71742 -359310 43686 -983 -45361 220815 46389 127718
6740 127718 77221 -114126 -385010 73972 73536 25817 29671 -265460 74873 -496620 -9450 -44699
6728 -44699 74318 210501 -171406 -153666 149629 -142742 -125678 57567 -58726 185368 -285474
6716 -374629 -151079 -213036 -51049 98508 -139251 154829 63962 75899 -104777 -304489 -232852
6705 -232852 -52140 -37699 -50831 -7937 91700 123347 -49278 289053 -73550 -249005 184259
6693 19418 -104507 58336 -420849 18165 345898 -215966 -136980 56262 116621 123787 -10281
6681 56790 -92937 -225869 -63220 107963 71429 -41962 191834 -57469 -10386 113026 -84693
6669 140884 87556 -64218 10442 -78743 -117514 27945 -23657 24131 -448756 76843 23304
6657 -401453 342853 -371296 -283547 -144764 -59122 -281895 205637 -135119 119284 -115901
6646 -143031 -52465 -105958 -195479 428582 -117827 -72384 -223078 -262507 53509 336986 -136461
6634 175953 59759 -42481 87932 339086 -203820 -188187 112526 276788 82812 -257605 -110617
6622 182222 -92640 -48361 -24613 120611 175670 -144616 -370399 -43511 -234101 -291496 71478
6610 299353 57952 379573 149086 1800 -252690 30601 -207762 51187 -48483 -311633 335177
6598 -78916 57899 -18293 -415292 -248964 -356760 142339 39551 283855 -94012 47873 38762
6587 38762 -103652 -25249 14429 -106715 -78169 -150420 515996 -236513 -155118 -111092 555616
6575 166526 -240766 -20874 111426 -189261 134426 1116 154604 -272796 -11728 140564
6564 -52651 69513 -227986 161006 176640 -79094 -36654 -67214 -17469 90064 -79772 -282870
6553 -282870 -180149 -167975 24490 51269 -17792 145535 -316805 -109744 -66362 64906 -36536
6541 57013 247648 275269 -232970 -277158 122097 -232399 53208 -155536 140686 -244742
6530 187715 55720 -185244 209398 211235 -21030 -90932 -78392 -133923 45576 -48933 145938
6518 165232 -277738 -262301 -133448 170103 -15232 -211420 1161 113470 66280 -10659 238935
6506 -286273 -230377 -54388 12824 -271152 143436 -255043 104918 -328403 -124117 -104866
6496 -104866 80422 -78996 123084 -80821 -120261 58885 133180 -200822 64236 -172694 30502
6484 -188905 -174191 -107269 -43846 -263907 -128752 71038 -26322 -126144 23602 -238634 -159924
6473 -159924 -23417 80202 -32523 -81816 -157064 -36731 -61280 81854 -63759 -232921 91799
6461 -15261 78639 -85387 -34883 -131164 -179575 276812 191169 12171 -40800 -101348 461753
6449 211065 -316215 -73554 15302 -135162 265584 -142669 -110598 114689 37149 92184 -213133
6437 208268 -117995 92969 -177738 121892 17740 -206881 -316325 86952 202105 25208
6426 -179125 275993 268598 -227077 -493036 95715 159995 97588 -129526 239957 115611 137525
6415 137525 58516 -37250 -254944 118341 -374870 -315797 -124398 207273 191762 -133304
6404 138541 -65427 288264 2058 -68189 278224 44545 93142 -73030 343523 -80557 -107568
6393 -107568 -12916 -40847 -107228 219945 -265690 -162323 -238512 -255978 143837 -107943 -290172
6382 -290172 -11999 -93363 143190 1318 -302438 262179 -60028 178484 31893 176858 -15520
6370 -139945 16982 -88770 122723 -113561 13568 -355556 -125381 -157052 -71269 -110823 -221092
6359 -221092 -61242 -257328 -21507 -1505 -217023 -29288 91868 -163713 429547 182820 -36264
6347 148005 168212 -333428 423890 -88164 -139017 -212403 185247 251723 192090 -24284 165486
6335 -123964 -9875 -296691 -300157 217733 179245 -257085 111103 -221791 21607 276617 -263602
6323 -198052 -123817 -130554 -40525 12671 -263000 228032 92944 -42060 138446 87262 12132
6311 195278 -129516 -258026 37013 -214606 -139762 342859 -50791 -106961 212474 274330 -28509
6299 -139056 -563894 -147915 109574 132478 298186 245486 80114 -92558 78677 62465 1192
6287 -112195 -243505 -168562 158368 -105487 259039 -27038 -131925 -26875 39514 289531
6277 289531 -75497 184372 129600 37032 110753 26905 -114817 -212536 -27435 48906 48091 -108806
6264 -25093 22109 -355473 73419 -231112 -167264 -118600 3903 156271 -321289 -58408 -86144
6253 -86144 -431748 -95523 -20658 160191 205450 65045 66425 -90810 129466 49049 -63339
6241 37248 -207082 232232 36059 -193060 -39340 252043 -146302 304633 -22754 57347 44086
6230 44086 246954 191277 32538 216809 144132 -369021 251414 24570 -162505 -140881 110076
6218 20148 -132002 -282495 -16192 -66743 194186 1288 124712 106031 -8441 109982 22964
6206 -48352 17960 -86740 156996 -271078 136856 78406 56284 112802 103394 4962 -43995 -218051
6194 -218051 80341 -233808 -18851 -298548 127293 -70523 -83918 -177514 -214371 44127 47541
6183 47541 -309631 82696 96287 -34203 -92451 -358367 156889 114420 -199213 42375 122568
6172 122568 -277986 -166997 -450657 -45119 373765 -145237 17395 250338 66892 78286
6162 78286 173880 -459209 -156451 -141109 128002 -114414 37055 -3370 -247361 -155203 -196131
6151 -196131 -14003 -174950 167526 15233 232155 -59625 -65386 -122171 -5698 -15189 -105957 151164
6138 -146145 -3626 -61833 -203950 -504803 -178680 -187635 30708 358727 -65671 -283820 -207784
6127 -207784 304916 -851 146201 228315 -155885 -318954 381975 52116 -75141 -363083 -213290
6116 -213290 -26465 -143788 52148 43687 -75330 108554 -24605 -106372 -361155 -110871 119066
6104 -242840 -113710 -179824 239265 -411447 20793 121644 -47257 -3802 -194309 -145686 88054
6092 -58509 19635 132205 42254 -219977 188394 -399429 64410 -39043 -56770 98868 -48972
6080 192429 -52343 60134 -81653 -57169 -22583 392110 -479050 280619 -374873 -255559 -133229
6069 -133229 -270081 237976 -157601 67185 -20925 72503 -214058 -282715 372925 -403855
6058 -85281 -151379 -218142 -1041 238803 -83044 -65108 -287041 -173334 64110 122461 -155858
6046 -82259 127666 197140 -284396 150677 -161206 61689 207927 135743 169923 -36846 -5829
6034 49098 -136943 -24499 138430 125659 -179133 196812 73103 -64223 -53805 -37102 126880
6022 38305 -75209 176040 -113817 -242364 -217127 47264 54863 -128764 -116929 288161 235139
6011 235139 187009 -86777 100637 -283951 -19242 -124345 156207 -148237 -232344 375469
6000 -322159 -179411 -142057 355541 -195217 -14283 53992 289425 211322 172072 329889 155800
5988 -22661 178732 -389827 12612 232105 22752 10243 -137556 -287130 125672 179149 -203871
5976 -313315 -206391 -165507 -515499 -41823 -289955 112390 287862 413 -185528 124997 102253
5965 102253 -286069 109186 73827 -59085 6052 178204 -380935 121061 35794 -247240 42243
5953 61621 94778 72146 -127903 9241 106953 -88130 -161039 13067 121633 -346288 255242
5941 -86982 -215458 -42051 214422 131298 -131238 38347 39618 -29047 -256264 183494 32524
5929 50605 10003 -18756 -362826 148139 -64905 -379733 -157443 41910 23166 99281 -131778
5917 52926 118720 -126384 85227 284442 -101866 81230 -144719 -68058 29978 -159169 -139368
5906 -139368 77402 -85427 78443 300296 -3448 124214 90992 -165407 112325 -100741 234945
5894 258958 -232566 -201092 -400541 -62403 156496 59580 8785 176514 85134 11910 -275563
5882 -303714 282949 -255550 -13955 378716 -207667 -37172 474510 154863 -204963 -40101
5871 -163086 6702 -13020 -251376 90387 -158545 -296282 128829 -195134 -131378 -95259 115822
5859 -256179 123695 123169 -54026 158730 244719 -123315 282794 -4094 -317878 -84651 -246059
5848 -246059 -206368 157785 -469666 113004 -35373 62097 23179 211320 -123428 -155628 11158
5836 233286 -174633 229865 -417280 -8627 -167123 -265230 128119 57200 218546 380014
5826 380014 -43962 129349 203084 41922 310759 -33999 -75947 10288 -31409 33367 -249230
5814 -23396 63528 272997 301486 -39933 80835 113536 -88850 -387143 79724 80721 273971 -175419
5801 -48758 247630 181492 -165749 334062 -11685 -258213 -342564 -217395 -126060 -61703 -496179
5790 -496179 357522 -120040 68114 276755 -62654 -188486 -137005 83760 -170459 -194175 -204033
5779 -204033 215226 -345644 -41866 46764 129461 -156068 -110927 -45869 189052 48587 -33579
5767 245946 -52329 -270961 92598 -213943 -258958 12078 36993 29835 52098 -9577 223248
5755 -50312 -63450 91246 -53898 -37081 -57040 162641 -32005 237606 -325412 -393615 131733
5743 176088 -93116 -158473 126204 -77971 -69254 -53110 -181148 103545 -44846 -115156 170330
5731 -227955 -158376 -386855 -33848 -190373 -105246 -56406 219244 -31254 -260623 33721 -62970
5719 -33027 217745 -51411 -213476 208656 -34899 -224562 -308745 137903 12110 -31784 47864
5707 240368 234108 -180218 -239832 -85751 243914 37829 -195148 160747 -18387 -234007 -277756
5696 -277756 1188 -196250 163254 88300 -170671 -172728 -141467 -51745 152946 167593 -184384
5684 -328705 95390 -345240 153213 -281605 12579 255784 -97394 375634 -206984 -29152
5673 -133972 149819 -209908 17314 77768 19783 -137260 -260887 11032 -67448 55633 219910
5662 219910 -19677 -159129 250436 92504 45713 -58630 248192 36644 11933 -224376 -212388
5651 -212388 55780 230706 249698 327426 -85994 239712 8829 -88948 142856 296258 -148345
5639 127088 -186894 276794 107924 -319312 143248 -220662 -7332 -109565 195445 124836
5629 124836 -5392 34569 181669 97398 -47026 -161548 321334 -21116 -134915 123598 -242861
5617 -126352 49979 255414 349610 -409102 -204677 -306213 121142 216097 24984 -97255 239213
5605 494177 218985 184342 41416 40926 -122002 -274718 60726 -135051 -8446 96215 -155496
5593 -97572 -258005 -366329 -14336 -173165 -157509 136947 160901 -151928 94677 278846 53340
5581 -69484 -50573 64292 -46069 140905 47854 -299220 13761 -124370 -238739 -364481 127775
5569 -133042 -141751 -274720 -138597 126590 -289644 -370907 -55547 -218845 -127948 -181668 10881
5557 -211397 -22263 -9276 -15665 213653 -154274 220012 -3353 -179608 -141325 -94602 84714
5545 161958 -147558 165078 -13125 167066 -76458 102568 95482 122984 361694 99896 44977
5533 -95862 33369 337913 -273147 -75557 268741 108299 178335 -259806 -3362 18315 -74523
5521 398518 -44734 -230596 -196389 253821 -151421 -85962 201653 -121485 -27725 94065 118246
5510 118246 251414 -259661 -226986 -70414 -236325 -1324 79135 -30499 -143374 -135690 -31363
5498 -292522 86520 237465 26905 301114 -1510 124747 26209 -51194 -208680 -168339 45781
5486 -139626 337098 -89071 -12140 186354 130046 71708 -103083 -9671 73798 -283304 -7577
5474 -105388 11683 84957 241802 85240 71139 -66299 -74536 14846 142495 290510 -39555
5462 -84444 305525 -385925 -58950 156836 -207210 93443 163470 139679 -433025 211692 -88146
5450 -86488 87769 66563 -166771 -152964 -61719 -134726 -186175 55679 -170357 158701 -319540
5438 -120162 -269122 44888 166120 -163418 519183 92210 -39024 -89193 -147610 -140513 291764
5426 -253364 -85772 -138860 46750 17601 -162925 -302991 12162 -161368 -203614 -244670 -277192
5415 -277192 -51523 -105183 99348 -54411 186216 -29055 292703 -88587 153993 -242504 187981
5403 139650 51750 -11011 6598 39989 -224454 -69808 -111003 27190 -151315 -102608 -226797
5392 -226797 15332 207448 -77457 89143 -130604 -66913 85824 157691 167527 -80072 269282
5380 178754 23862 -92225 -214321 -191357 303812 462653 -176408 113876 -5533 439800 262102
5369 262102 192615 -4068 74583 126032 -248206 43758 -245633 66959 46457 138633 118654
5358 118654 -20365 386292 -163912 56784 114587 12821 212950 66982 -203773 -181929 -280689
5347 -280689 -193767 95170 -11119 191433 64444 -115633 -43774 19961 378905 608204 68685
5335 -99179 -60050 -26242 -353359 14621 -104105 -2539 163638 -211704 -135792 203815 -18477
5323 -184698 93091 -101272 185281 -37719 -128788 -170420 -32460 -296317 83688 112503 166135
5312 166135 184420 66826 156610 50886 86091 -123855 -62043 45896 -190296 -205027 159357
5300 -12635 -16804 -114185 28198 -10294 11263 -432239 -7968 -258423 403254 170511 25027
5288 87934 -330396 -26714 228822 164813 -38042 -198292 -113447 -11892 -238492 -96329 42671
5276 -89790 116375 35521 291565 183763 228141 129676 -46258 -242720 -105540 66430 -134869
5264 16623 -12917 -191068 -217739 9262 81338 -258 9597 -176750 -8115 329079 -129199 51528
5251 -84800 -299844 92195 -61323 37034 151615 -295510 322417 -58292 -80330 65855 -24715
5239 162906 -298222 60533 130312 41044 -100151 -47205 86764 17132 129281 54062 107125
5228 107125 61799 10714 220299 283901 -134337 -80621 -279774 -56129 -108778 -180552 89153
5216 126944 -14817 871 27336 23205 126865 -139741 71683 230395 -202313 -20782 -181230
5205 -181230 61974 -99290 -152374 77733 330963 -138993 -81040 79567 140813 -161448 -42186
5193 -80245 -377770 178580 43450 21892 -203654 -50453 -32115 -90440 169802 118672 -129851
5181 168937 310908 -261211 -101991 -352386 83173 -183511 52834 51854 -76097 -169085 -51454
5169 -177673 -178569 -164421 453249 295723 288030 245060 335499 -224668 2283 -2848 80431 159922
5157 159922 104368 -79712 185048 86235 266109 17545 263705 -90427 73338 17005 31062
5146 31062 64223 276846 -208476 200 141218 -88253 96005 -37821 91035 -323480 114119
5134 183076 -1868 -245970 147032 169430 -52129 100359 -181443 148173 -220476 171773
5123 391259 121737 331260 -54521 104916 114571 -40421 -225680 88272 239737 -69565 55608
5111 225804 401043 -91587 13993 -102959 -287125 -124978 193450 124332 -52746 85948 -115063
5099 17271 189441 286868 20737 381770 -276415 -141878 -451513 13777 46426 54411 20803
5087 -17073 102754 -268708 84356 -12286 85972 -52818 154930 62415 -53227 66849 177515
5076 177515 31265 191830 34371 82427 -191062 67157 163342 308837 -243572 291165 51804
5064 -15341 -199790 214560 35926 -63720 73645 180378 -34864 -345563 238249 -42507 206725
5052 -61218 -131704 -456082 -51279 -97973 57662 -98494 4006 10757 -253115 435718 -107369
5040 -321003 -49695 117037 48410 181065 14969 30226 -2487 -272169 -219135 -87814 -371531
5029 -371531 71827 -149892 178620 165914 228128 67046 -36276 167721 297310 25040 -387936
5017 148754 -17646 -101525 48387 49210 74290 29887 124112 75350 -32925 -206983 -14224 174347
5004 -5875 -60298 -102969 79099 -56359 8408 10008 -174308 95307 -42230 52609 -22345 -13177
4992 -13177 192394 109127 -189763 -113565 -251715 111217 258743 93893 58146 -154990 56718
4980 32417 158985 -155245 440752 -59295 -4092 127477 -2762 101126 188718 -100140 50415
4968 240429 -211928 -221887 191827 8093 108303 101147 -197988 49638 -123108 58056 51931
4957 51931 -118949 -175630 118859 295568 -30384 351567 -157982 108907 -370318 51693
4946 217024 -121526 97552 24706 12725 -46794 -395 -132202 101219 96330 -8750 -202224 221858
4933 -58474 -289393 -149505 111835 38969 -208023 198237 182458 88150 106008 54654 113550
4922 113550 -170187 286339 -33107 112769 160004 -80234 179699 9013 123276 34524 -269792
4910 421600 315161 227665 172398 -66077 301145 -242203 45187 77963 -196446 60340 4694
4898 80330 178457 239028 160363 79466 -170215 220094 51224 -108949 -262862 -74796 8011
4886 12764 4824 -19221 34071 -165782 -40902 177254 -52334 -51317 130770 36127 354830
4875 354830 -324423 173188 223382 -153102 210432 16459 25156 113515 -21305 149339 -110468
4863 70077 86261 -237554 -163343 -67581 72607 -315675 27221 50991 60708 13980 -96243 -95386
4851 -95386 135923 -304139 -172257 94406 -9372 67092 -326788 316797 8105 -242363 -400032
4840 -400032 -32417 -61458 -128972 -235643 178253 223394 -102366 342930 -221406 60696 176052
4829 176052 144818 -8753 -183464 -258446 70083 233364 303604 36269 337190 -26577 -254088
4818 -254088 30819 457921 498799 201766 -77918 44783 118525 102491 -23932 21337 -24561
4806 -93002 -257262 -464069 3783 337588 -177042 296189 2724 290956 124837 -396528 111634
4794 -45551 -152019 326479 -118173 207312 -253824 36663 55298 -112456 -37991 -218709
4784 -218709 -194793 -21309 139498 176651 -49385 68625 -178295 17757 -125416 -154969 179624
4772 155778 -103744 -167322 2040 -76423 119389 8661 97426 -128284 32933 -283042 -9612
4760 -225505 248634 -122132 -125643 50746 65165 -203384 159895 87266 -62275 199536 -184009
4748 -291252 67211 350545 -103689 300918 45345 80808 183934 197291 275256 127780 -218576
4736 -57644 -481839 -102467 273202 -86992 43972 -241598 -30413 137628 -70049 296280 80089
4724 -138196 -155705 438561 -226380 270384 32676 -83983 99702 -5896 -25481 160133 -89039
4712 66689 195090 134921 298739 -100164 -275487 -250557 -70575 -220178 61213 -205212 -206712
4701 -206712 -138462 -94883 -16003 269046 -135504 176614 121927 392654 -121220 72027 85111
4690 85111 -6299 -285448 -306892 157780 25292 276122 -50488 -102495 -14444 -108024 43692
4678 -231185 190646 37844 145463 103527 46636 -111854 -120117 -109967 404520 65842 196178
4667 196178 115042 152721 -237115 215319 -208214 6762 -8367 -165836 -216373 -290538 -256665
4656 -256665 -139155 35668 160227 20552 -38484 17147 129115 -40057 -99853 -166088 -19591
4644 16910 313871 271340 255925 71604 165300 262167 -36032 112287 245476 -471283 55679
4632 -196059 62236 368728 102356 271703 -177944 -69102 -162283 -69609 10737 98352 77059
4621 77059 17641 260740 104667 -202567 196693 -141762 -37856 -23084 -64570 -175151 203396
4609 -52440 -68440 -48411 172180 -296661 12573 174336 152465 319404 -166474 249310 -189171
4597 176884 58199 12092 -74199 -47052 -95831 -120704 -347301 155607 115907 55739 139118
4586 139118 -145390 -110509 -208911 -241876 112340 158397 -90925 -332765 -311395 13518 26189
4575 26189 -7826 19577 -347194 263046 -21260 42372 48649 98125 -179889 11726 -60288 -25779
4562 -171974 165410 -70714 -176083 69916 -84423 -232510 157052 -97117 191655 -268177
4551 -196174 -236007 -204793 101247 326014 74471 47409 -92580 13460 41830 -106457 10740
4539 -101762 45396 261969 187962 41609 217809 330279 47759 -135746 -35171 57030 -155768
4527 11381 -170537 46709 -79085 263870 -254716 174644 -223599 -207093 132495 131449 68373
4516 68373 67104 -253037 -215940 -262411 -8753 213334 261498 -244315 -29854 167010 -26045
4504 -8326 -46425 -128121 -112995 -149825 -3404 237367 -92239 -198244 -119421 217791 256097 162499
$$ [...]
##END NTUPLES=NMR SPECTRUM
##END=
