
##TITLE=UV1225_M6_1234-1212_50_7231073_4BOEm63b0W
##JCAMPDX= 6.0         $$ Bruker NMR JCAMP-DX V2.0
##DATA TYPE= NMR SPECTRUM
##DATA CLASS= NTUPLES
##ORIGIN= BRUKER
##OWNER= Administrator
$$ 1.72 TOPSPIN		Version 2.1
$$ 2013-01-24 02:24:00.143 -0500  Administrator@X
$$ Compression mode = diff/dup
##.OBSERVE FREQUENCY= 400.02188249412
##.OBSERVE NUCLEUS= ^1H
##.ACQUISITION MODE= SIMULTANEOUS (DQD)
##.ACQUISITION SCHEME= undefined
##.AVERAGES= 8
##.DIGITISER RES= 22
##SPECTROMETER/DATA SYSTEM= spect
##.PULSE SEQUENCE= zg30
##.SOLVENT NAME= COFFEE_meoh
##.SHIFT REFERENCE= INTERNAL, COFFEE_meoh, 1, 14.98509
##AUDIT TRAIL= $$ (NUMBER, WHEN, WHO, WHERE, PROCESS, VERSION, WHAT)
$$ ##TITLE= Audit trail, TOPSPIN		Version 2.1
$$ ##JCAMPDX= 5.01
$$ ##ORIGIN= Bruker BioSpin GmbH
$$ ##OWNER= Administrator
$$ $$ E:\/data/COFFEE/nmr/UV1225_M6_1234-1212_50_7231073_4BOEm63b0W/30/pdata/1/auditp.txt
$$ ##AUDIT TRAIL=  $$ (NUMBER, WHEN, WHO, WHERE, PROCESS, VERSION, WHAT)
(   1,<2013-01-24 02:23:51.955 -0500>,<Administrator>,<X>,<go>,<TOPSPIN 2.1>,
      <created by zg
	started at 2013-01-24 02:22:45.690 -0500,
	POWCHK enabled, PULCHK disabled,
       configuration hash MD5:
       86 BA 57 50 F2 9D 5C 9B 26 00 A9 28 5F 66 2E 89
       data hash MD5: 64K
       99 E3 11 2D CB 2B F0 D9 DE AE 7F E2 F3 2B A7 38>)
(   2,<2013-01-24 02:23:55.096 -0500>,<Administrator>,<X>,<proc1d>,<TOPSPIN 2.1>,
      <Start of raw data processing
       efp LB = 0 FT_mod = 6 PKNL = 1 PHC0 = 0 PHC1 = 0 SI = 32K 
       data hash MD5: 32K
       16 C4 31 64 BC 01 F6 B2 C7 38 53 F2 A4 24 85 43>)
(   3,<2013-01-24 02:23:55.565 -0500>,<Administrator>,<X>,<proc1d>,<TOPSPIN 2.1>,
      <pk PHC0 = 100.2118 PHC1 = 0 
       data hash MD5: 32K
       42 6D 38 33 87 4A F0 DF E1 24 F8 CB B6 E5 FE 71>)
(   4,<2013-01-24 02:23:55.799 -0500>,<Administrator>,<X>,<proc1d>,<TOPSPIN 2.1>,
      <abs ABSG = 1 
       data hash MD5: 32K
       9C 85 D3 8F 94 32 3D 6F A6 6D E1 A1 AA CA 89 A7>)
(   5,<2013-01-24 02:23:55.940 -0500>,<Administrator>,<X>,<proc1d>,<TOPSPIN 2.1>,
      <abs ABSG = 2 
       data hash MD5: 32K
       41 CE DA 06 62 9E 2E 3E 5B AA 3A 27 B7 06 A7 E0>)
(   6,<2013-01-24 02:23:56.080 -0500>,<Administrator>,<X>,<proc1d>,<TOPSPIN 2.1>,
      <abs ABSG = 3 
       data hash MD5: 32K
       BB 65 54 A2 F1 22 AE 68 38 E6 E5 49 41 AB 30 A6>)
(   7,<2013-01-24 02:23:56.221 -0500>,<Administrator>,<X>,<proc1d>,<TOPSPIN 2.1>,
      <abs ABSG = 4 
       data hash MD5: 32K
       BB DB F3 BE 3D F0 CE 6E 00 D0 B2 1E 32 0D BD 3A>)
(   8,<2013-01-24 02:23:56.377 -0500>,<Administrator>,<X>,<proc1d>,<TOPSPIN 2.1>,
      <abs ABSG = 5 
       data hash MD5: 32K
       7A C5 4C 32 85 C4 DB 08 02 B8 48 F8 42 F9 09 28>)
$$ ##END=
$$ 
$$ $$ hash MD5
$$ $$ A4 68 BD C5 03 31 7A 7B A6 77 81 65 3D A8 49 67
##$RELAX= 
##$RELAX= 
##$RELAX= 
##$RELAX= 
##$RELAX= 
##$RELAX= 
##$RELAX= 
$$ Bruker specific parameters
$$ --------------------------
##$DU= <E:\>
##$EXPNO= 30
$$ [...]
150 150 150 150 150 150 150 150
##$TP07= 0
##$TPNAME0= <>
##$TPNAME1= <>
##$TPNAME2= <>
##$TPNAME3= <>
##$TPNAME4= <>
##$TPNAME5= <>
##$TPNAME6= <>
##$TPNAME7= <>
##$TPOAL= (0..7)
0.5 0.5 0.5 0.5 0.5 0.5 0.5 0.5
##$TPOFFS= (0..7)
0 0 0 0 0 0 0 0
##$TUNHIN= 0
##$TUNHOUT= 0
##$TUNXOUT= 0
##$USERA1= <user>
##$USERA2= <user>
##$USERA3= <user>
##$USERA4= <user>
##$USERA5= <user>
##$V9= 5
##$VALIST= <valist>
##$VCLIST= <CCCCCCCCCCCCCCC>
##$VD= 0
##$VDLIST= <DDDDDDDDDDDDDDD>
##$VPLIST= <PPPPPPPPPPPPPPP>
##$VTLIST= <TTTTTTTTTTTTTTT>
##$WBST= 1024
##$WBSW= 4
##$XGAIN= (0..3)
0 0 0 0
##$XL= 0
##$YL= 0
##$YMAX_a= 656261
##$YMIN_a= -559989
##$ZGOPTNS= <>
##$ZL1= 120
##$ZL2= 120
##$ZL3= 120
##$ZL4= 120
##$ABSF1= 14.98509
##$ABSF2= -5.573092
##$ABSG= 5
##$ABSL= 3
##$ALPHA= 0
##$AQORDER= 0
##$ASSFAC= 0
##$ASSFACI= 0
##$ASSFACX= 0
##$ASSWID= 0
##$AUNMP= <proc_prof1d_extract_pilot.lims>
##$AXLEFT= 0
##$AXNAME= <>
##$AXNUC= <1H>
##$AXRIGHT= 0
##$AXTYPE= 0
##$AXUNIT= <>
##$AZFE= 0.1
##$AZFW= 0.1
##$BCFW= 0
##$BC_mod= 0
##$BYTORDP= 0
##$COROFFS= 0
##$CY= 15
##$DATMOD= 1
##$DC= 0
##$DFILT= <>
##$DTYPP= 0
##$F1P= 0
##$F2P= 0
##$FCOR= 0.5
##$FTSIZE= 32768
##$FT_mod= 6
##$GAMMA= 0
##$GB= 0
##$INTBC= 1
##$INTSCL= 1
##$ISEN= 128
##$LB= 0
##$LEV0= 0
##$LPBIN= 0
##$MAXI= 10000
##$MC2= 0
##$MEAN= 0
##$ME_mod= 0
##$MI= 0
##$NCOEF= 0
##$NC_proc= -8
##$NLEV= 6
##$NOISF1= 0
##$NOISF2= 0
##$NSP= 0
##$NTH_PI= 0
##$NZP= 0
##$OFFSET= 14.98509
##$PC= 1
##$PHC0= 100.2118
##$PHC1= 0
##$PH_mod= 1
##$PKNL= yes
##$PPARMOD= 0
##$PPDIAG= 0
##$PPIPTYP= 0
##$PPMPNUM= 2147483647
##$PPRESOL= 1
##$PSCAL= 4
##$PSIGN= 0
##$PYNMP= <proc.py>
##$REVERSE= no
##$SF= 400.02
##$SI= 32768
##$SIGF1= 0
##$SIGF2= 0
##$SINO= 400
##$SIOLD= 32768
##$SPECTYP= <>
##$SREGLST= <1H.CDCl3>
##$SSB= 0
##$STSI= 32768
##$STSR= 0
##$SW_p= 8223.68421052631
##$SYMM= 0
##$S_DEV= 0
##$TDeff= 65536
##$TDoff= 0
##$TI= <>
##$TILT= no
##$TM1= 0
##$TM2= 0
##$TOPLEV= 0
##$USERP1= <user>
##$USERP2= <user>
##$USERP3= <user>
##$USERP4= <user>
##$USERP5= <user>
##$WDW= 1
##$XDIM= 32768
##$YMAX_p= 468993096
##$YMIN_p= -795593
##$CURPLOT= <Network HP LaserJet P1505>
##$CURPRIN= <$Network HP LaserJet P1505>
##$DFORMAT= <normdp>
##$LAYOUT= <+/1D_H.xwp>
##$LFORMAT= <normlp>
##$PFORMAT= <normpl>
##$SURQMSG= 1
$$ End of Bruker specific parameters
$$ ---------------------------------
##NTUPLES= NMR SPECTRUM
##VAR_NAME=  FREQUENCY,     SPECTRUM/REAL,   SPECTRUM/IMAG
##SYMBOL=    X,             R,               I
##VAR_TYPE=  INDEPENDENT,   DEPENDENT,       DEPENDENT
##VAR_FORM=  AFFN,          ASDF,            ASDF
##VAR_DIM=   32768,         32768,           32768
##UNITS=     HZ,            ARBITRARY UNITS, ARBITRARY UNITS
##FACTOR=    0.250966925370066, 1,           1
##FIRST=     8223.43324360094, 112278,       -63932
##LAST=      0,             233133,          -180970
##MIN=       0,             -795593,         0
##MAX=       8223.43324360094, 468993096,    0
$$ Real data points
##PAGE= N=1
##DATA TABLE= (X++(R..R)), XYDATA
$$ [...]
19536d8131m610B54659g2642K5748I9392c333A51494c29623B39906d6534B23004
19524a87466D0529b63951m8757C7012F79g7760j51640m1464r366A91395M3512
19513B34907F4457K21526p4091a51385N1158G9531h7255K9231j24893j0220A21083
19501B5492N5735c87447J15878f1234A90524b19105b6783B915i3508F2714c67642
19489d2397q5301F6184b41960B54608a33046F674a39730o9631j5688D6856d0426
19477d9092q6912j39159P4712I3066b32508d5444k53479i083j40269B42992J01976
19466C44968b28494B67266a0544j10448k0656G4910M0532D892Q1422c18774O1596
19455b57178G8645a80189E2026e02458b4117B2797b55281j9488J29095A4610b14825
$$ y = [-48131, -52741, 254659, -72642, -46894, 99392, -3333, 151494, -329623, 239906, -46534, 223004, -187466, 40529, -263951, -312708, 37012, 679, -77760, -229400, -270864, -280230, 191395, 234907, 64457, 285983, 211892, -151385, -100227, 79531, -87255, -58024, -182917, -193137, 121083, 25492, 81227, -387447, -271569, -61234, 190524, -219105, -26783, 2915, -93508, 62714, -367642, -42397, -127698, 66184, -241960, 254608, -133046, 6674, -139730, -209361, -225049, 46856, -40426, -49092, -136004, -275163, -200451, 93066, -232508, -45444, -298923, -9083, -149352, 242992, 344968, -228494, 267266, -10544, -120992, -141648, 74910, 115442, 4892, 86314, -318774, -257178, 78645, -180189, 52026, -502458, -24117, 22797, -255281, -274769, -145674, 14610, -214825]
19443a91158Q8330j38677A05097b67325C75123H5719j2773c0314C3060a05831
19432b14024d7195p3286c7051j2008p0430I9176a20013l8291b4395o6359C20106
19420A41865L419b36096F431J20038b15970F9803a11490M3522k76693i1896d3974
19408A46855p0661b26856A51910b51678A98243J2130j119a33046k63215B13069
19397f5633D5837c55328h591k57211q9131d5467D7459a09963A65161C2144b71601
19385B11916l1225a08006A25453L1097b59125m7440k4162E1368h2842p532H0072
19373A33386a56916g4409l66456A41591d65001J73876a30582f2817p4987B17555
19362G6953a01061p1562r7013a5999m8893B567b60507k24123i8986A70077b3235
$$ y = [-191158, -102828, -241505, 105097, -267325, 375123, 85719, 72946, -30314, 33060, -105831, -214024, -47195, -120481, -37051, -49059, -119489, 99176, -120013, -158304, -24395, -90754, 320106, 141865, 145284, -236096, 6431, 126469, -215970, 69803, -111490, -67968, -344661, -91896, -43974, 146855, 76194, -226856, 151910, -251678, 198243, 210373, 209254, -133046, -396261, 213069, -65633, 45837, -355328, -8591, -265802, -354933, -45467, 47459, -109963, 165161, 32144, -271601, 211916, 180691, -108006, 125453, 156550, -259125, -306565, -330727, 51368, -82842, -90374, 80072, 133386, -156916, -74409, -440865, 141591, -465001, -291125, -130582, -62817, -137804, 217555, 76953, -101061, -172623, -269636, -15999, -64892, 2567, -260507, -484630, -98986, 170077, -23235]
19350a27179I4771a51693N9329f15j98242B26980j04194M5490c73303a14130b0397
19338d47997J87153A37378a2613B04937i5290m9787O9604J6493D03439A31965
19327B86350a24067q8862f9101G951N61992b22551g5514k50116E580g4235C8800
19315a09068G6878a21160J3176B69254c2820o3814m2346j80229J55273l6939J550
19304a99325E4168c30391B27485a95525A34520a2571j94171D8085K13744a2878
19293c15465a25111O39k4412F5764J43540r8778b92253J16682f5371b9312B87546
19281a41975k54595a93042q4067C50858a75248l1319p8353r5748H9285j1314J89595
19270B67566H8107B532a19575e6138j58172q9944p0500E6758L9915k7357b60347
$$ y = [-127179, 94771, -151693, -92364, -615, -198857, 226980, 122786, 168276, -373303, -114130, -20397, -447997, -260844, 137378, -12613, 204937, -95290, -145077, -75473, -58980, 403439, 131965, 286350, -124067, -212929, -69101, 7951, 569943, -222551, -75514, -325630, 5580, -74235, 38800, -109068, 76878, -121160, -107984, 269254, -32820, -96634, -138980, -319209, -163936, -200875, -199325, 54168, -330391, 227485, -195525, 134520, -12571, -206742, 48085, 261829, -12878, -315465, -125111, -124472, -148884, 65764, 209304, 110526, -292253, -175571, -65371, -29312, 287546, -141975, -396570, -193042, -277109, 350858, -175248, -206567, -284920, -380668, 89285, 77971, 267566, 88107, 2532, -119575, -56138, -214310, -304254, -374754, 56758, 96673, 69316, -260347]
19258a71444A28939a47872d3802j65698C86798A64825d3083B04044b17783p6879
19248b94662J01819a2775L268B38504d59866a92185j43816J23303H4985b75545
19237D2967a00953B07878F1002i0797g285E942Q6400A6002b10280H8398c5773
19225A98806c50940A23514a71798G9994g1549A73422a39721D8221i9533p3761
19215a73294k40868A21167c9378m2284j07809e9539F1807a37536N1738E4672j0677
19204D3995d7053D1706i6124d7849B07768b19460I711J5508a06548B95865b10221
19192h7583L4448j45260d2914h988B3075b5521I9066j8837a06710j432d3694k2889
19180f6583j07919D3912b63088j60415K04302N8350A526L5036b837o5086a0621
$$ y = [-171444, 128939, -147872, -43802, -209500, 386798, 164825, -43083, 204044, -217783, -294662, -192843, -12775, -9507, 238504, -459866, -192185, -336001, -212698, 84985, -275545, 42967, -100953, 207878, 61002, -90797, -7285, 5942, 92342, 16002, -210280, 88398, -35773, 198806, -350940, 123514, -171798, 79994, -71549, 173422, -139721, 48221, -99533, -173294, -414162, 121167, -39378, -81662, -189471, -59539, 61807, -137536, -85798, 54672, 43995, -47053, 41706, -96124, -47849, 207768, -219460, 9711, 25219, -106548, 295865, -210221, -87583, -53135, -198395, -42914, -8988, 23075, -25521, 99066, 80229, -106710, -108142, -43694, -66583, -174502, 43912, -263088, -423503, -219201, -160851, 1526, 36562, -2837, -67923, -10621]
19168a45206p6530R8105j50706G9535c85889B81632A2412c47705G4960g211B07744
19156a79868c5730C0506M1170d0372k26844B07167K17004b52195B24607b4277
19145a37086Q439l6769c4944p0201N0220j38306j52743h2256A25298c70945P5347
19134b95598J18386c6230B45947b22570C2664f5450k04209o8042D2742d6310l483
19123d9793B42395c05672a12334b2513A88871C3541K3370f7277G7301g4527L1858
19112d2669k08897I2096b25309j37352B1066e6357A2761b06613G3804d229F2939
19100A83564b80873a36797C6616a3024j05485A29263e5602j61271j9911H9956
19089D43479F4706b30384A52337a96335c8415a0258A03127a62194A00906B808
$$ y = [-145206, -221736, -123631, -274337, 79535, -385889, 281632, 12412, -347705, 74960, -7211, 207744, -179868, -35730, 30506, 71676, -40372, -267216, 207167, 424171, -252195, 224607, -24277, -137086, -128647, -165416, -34944, -105145, -54925, -193231, -345974, -82256, 125298, -370945, -295598, -177212, -36230, 245947, -222570, 32664, -65450, -269659, -337701, 42742, -46310, -49793, 242395, -305672, -112334, -22513, 188871, 33541, 56911, -67277, 77301, -74527, -42669, -251566, 92096, -225309, -362661, 21066, -56357, 12761, -206613, 73804, -4229, 62939, 183564, -280873, -136797, 36616, -13024, -118509, 129263, -55602, -216873, -236784, 89956, 443479, 64706, -230384, 152337, -196335, -38415, -10258, 103127, -162194, 100906, 2808]
19078c02212i4545c3271a5143I0204m2303e3872q5495L2006j39840a6805m0685
19067e7490J5537C510c8750l35234J68830C32825C1449e7463k12309J9020J14713
19056a36039B25579c6530j33922f2675d116D08358h2932k6993j50337C26824i158
19044e9624p9179e2040k2015k0928a2019E8111c17769P9572a00305I2567a86899
19032A30463g5583A18751J69180d9232j8612B09918q6876m566n144O8560a87266
19020i9577a2713A40962b01601D60274j80299b69042i3429I398J00569f1514b1829
19008b93078J34339j5701A49231a80149P3759g329B08869a71908N5950f61B59698
18996A7050i5701k11854a26205A4465d9593k79151J42405J1666k12901F3993b6510
$$ y = [-302212, -94545, -33271, -15143, 90204, 47901, -53872, -139367, -107361, -247201, -16805, -57490, -41953, 3510, -38750, -373984, -205154, 332825, 31449, -57463, -269772, -250752, -136039, 225579, -36530, -170452, -62675, -4116, 408358, -82932, -109925, -260262, 326824, -9158, -59624, -138803, -52040, -74055, -94983, -12019, 58111, -317769, -238197, -100305, 92567, -186899, 130463, -75583, 118751, 287931, -49232, -67844, 209918, 123042, 118476, 113332, 181892, -187266, -99577, -12713, 140962, -201601, 460274, 279975, -269042, -93429, 9398, 109967, -61514, -21829, -293078, -158739, -174440, 149231, -180149, -106390, -7329, 208869, -171908, -115958, -661, 259698, 17050, -95701, -307555, -126205, 14465, -49593, -328744, -186339, -174673, -387574, 63993, -26510]
18984b23865B8614a73822p9708E2733a95869f54j71534G6226b96394G0249J42910
18973B13159a63900J7537B27704d69238B56394a71044A75597a07644j34080A76080
18962a14034A6629a25684H0888J2169a12172q1207r2477g4559P691j79590A18936
18950A6131J09486n9759c5750A60425c62309g4948A07358J9659a16417j58042
18940b74459C227L973J0323J33535a92960e9062p9776B6216J4038A6567J25908
18929A42475b68287J22828A67624a77431N7787j80157I4302i8340A2785j292e9656
18917F4270J91389A05562a78750F1491d81523J97781B4454c85033J42318j1279
18907b53994Q9183G9261h2403k624l0925r2648A37327C135a15647k01800r4305
$$ y = [-223865, 28614, -173822, -253530, 52733, -195869, -654, -172188, 76226, -296394, 70249, 213159, -163900, -146363, 227704, -469238, 256394, -171044, 175597, -107644, -241724, 176080, -114034, 16629, -125684, 80888, 93057, -112172, -193379, -285856, -74559, -66868, -246458, 118936, 16131, 125617, 65858, -35750, 160425, -362309, -74948, 107358, 127017, -116417, -274459, 3227, 7200, 17523, 151058, -192960, -59062, -138838, 26216, 40254, 16567, 142475, -268287, -145459, 167624, -177431, -119644, -299801, 94302, -98340, 12785, 11493, -59656, 64270, 255659, 105562, -178750, 61491, -481523, -283742, 24454, -385033, -242715, -253994, -164811, 79261, -82403, -85027, -115952, -208600, 137327, 3135, -115647, -317447, -411752]
18896d11752a97499R1749a5610j40978l78938b56548a7704B0382c0942C4753d3271
18884B65956A22412c58220a70847B29594a38130B00286a79581O7597r2550C13376
18873d8877j18285m9332e8164F041K32020G834J41980a37002o4654f3231o2707
18862a25938A1712a43638l9286L7337f0138A60203b51148j144g1562k4160m6593
18851a42315j40900B74140G2360b43023h3914j7617k42231J00106B13590j754
18841B11836H6430b77455f8815D18463E2263M5827a25481C10143b34119A65158
18830f99095G4963a43445B18115K031J0862g2471j35123a01394A1364c08828d9844
18818a74895B33748i1047B64024a56816d3968A67480b08480B0517a18548p8391
$$ y = [-411752, -197499, -105750, -15610, -156588, -535526, -256548, -17704, 20382, -30942, 34753, -43271, 265956, 122412, -358220, -170847, 229594, -138130, 200286, -179581, -111984, -204534, 313376, -48877, -167162, -216494, -58164, 6041, 238061, 7834, 149814, -137002, -201656, -63231, -125938, 11712, -143638, -182924, -145587, -60138, 160203, -251148, -252292, -71562, -95722, -142315, -283215, 274140, 72360, -243023, -83914, -101531, -343762, -243656, 213590, 211836, 86430, -277455, -68815, 418463, 52263, 98090, -125481, 310143, -234119, 165158, -699095, 74963, -143445, 218115, 220146, 231008, -72471, -207594, -101394, 11364, -308828, -49844, -174895, 233748, -91047, 264024, -156816, -43968, 167480, -208480, 20517, -118548, -196939]
18808a96939l8568A62173b63857A5803a71852J4073A88932f287j31465A1387b9940
18796G2838c52475a34918O724G9742L3485a90352N4238C75738c42121a0318l79467
18785c89785K7852a00393A12773A6264b08586D7044a04529j14081L9757J2917
18775a65936A49651c31855M7774a35536B03621b61522A94807b16130g7777j9115
18765i6892b592k41543a12929e2578j45020e5487n03423B1997g344B33179j06483
18754A26696J08073b31767J08511A12035k4812e08939g9987r3609B603Q2197l3054
18743E1746a49584F1570a54124P3398k60182H1547d27548h2620D27018A41380
18732d42174J40180A10669L45996g4863A19227B8402c1110G9160i8260o3032j50192
$$ y = [-196939, -235507, 162173, -263857, 15803, -171852, -157779, 188932, -6287, -137752, 11387, -29940, 72838, -352475, -134918, -128194, 79742, 113227, -190352, -136114, 375738, -342121, -10318, -389785, -361933, -100393, 112773, 16264, -208586, 47044, -104529, -218610, -178853, -165936, 149651, -331855, -284081, -135536, 203621, -261522, 194807, -216130, -77777, -96892, -2592, -244135, -112929, -52578, -197598, -55487, -558910, 21997, -7344, 233179, 126696, 234769, -231767, -123256, 112035, 87223, -508939, -79987, -173596, 2603, 84800, 51746, -149584, 61570, -154124, -80726, -340908, 81547, -427548, -82620, 427018, 141380, -442174, -301994, 110669, 456665, -74863, 119227, 28402, -31110, 79160, -98260, -161292, -311484]
18721c11484d2049k13543k5408J29571j5761B83964j24473a46916J5014j2185
18711a44087j6744a8214B46562E2682a25401E8725O0745E710a6533j7465B22383
18699a01004o877A94375c23068a01115p841K6273K8690p2115k9619P5179P51k0344
18687a00141j65354G4988a69932L5306m6951P9087j23031P0425j01043I3429D6621
18675c9856A29507g8117A93386h9479l01305f1981j94943A23825J55963j33300
18665A46488a9030j86243k4572b7263j65254c7584B32774A14324J735h8789m6731
18654a35520B20191g2369B86811a99454a4176j72999A44967F0102a3541k78569
18644b92110l4731A80758c61413f8116D3936J00734d07740B37036j04468a01807
$$ y = [-311484, -42049, -255592, -281000, -151429, -167190, 283964, 159491, -146916, -131902, -144087, -160831, -18214, 246562, 52682, -125401, 58725, 119470, 5710, -16533, -33998, 222383, -101004, -107881, 194375, -323068, -101115, -108956, -82683, -53993, -126108, -155727, -80548, -79797, -100141, -265495, 74988, -169932, -134626, -181577, -102490, -225521, -155096, -256139, 93429, 46621, -39856, 129507, -78117, 193386, -89479, -390784, -61981, -256924, 123825, 279788, 146488, -19030, -205273, -229845, -27263, -192517, -37584, 232774, 114324, 116059, -88789, -135520, 220191, -72369, 286811, -199454, -14176, -187175, 144967, 60102, -13541, -292110, -326841, 180758, -361413, -68116, 43936, 144670, -407740, 237036, 132568, -101807]
18633A8118c4158A151a37972B15085F3148a31737c1541l90855A88760b54381E841
18621a27748B47879b44202j09064A35641b43900k7289j19923b0329l3448I6518
18610a02714M0160n2915C68917q6777A21707K9339i4715B12339R8856i984H8923
18598a60389f4097b4515j692j72717k0698b2089j75128i4979j10646r93D4782
18586a06981I1098d0552n649D8008f3121l14876J85479I4778c8082q4489q6852
18575b09423a153C0148a04386l8713e3652m01311A56449G3719e04390i4612k51385
18564c45997A09619c6557r1435m3232k2841O3833A39276b75935a31105b3507a0369
18552a00487n1170k10125a16126j10845H0831g3952k2919K5526J2451C43889I085
$$ y = [18118, -34158, 1151, -137972, 215085, 63148, -131737, -31541, -422396, 188760, -254381, 5841, -127748, 247879, -244202, -353266, 135641, -243900, -271189, -391112, -20329, -53777, 96518, -102714, -62554, -115469, 368917, 282140, 121707, 151046, -94715, 212339, 311195, -9984, 88923, -160389, -64097, -24515, -26207, -198924, -219622, -22089, -197217, -94979, -205625, -206618, 44782, -106981, 91098, -40552, -46201, 48008, -63121, -377997, -192518, 94778, -38082, -122571, -209423, -1153, 30148, -104386, -143099, -53652, -454963, 156449, 73719, -504390, -94612, -345997, 109619, -36557, -127992, -171224, -194065, -130232, 139276, -275935, -131105, -23507, -10369, -100487, -151657, -361782, -116126, -226971, 80831, -73952, -96871, -71345, -58894, 343889, 9085]
18540e4205A46492b8813A073J16502D3598b13874c254I0957b92520C30239a48622
18528g1921C11648a05081A18605g4277k04068B61076A4797n909h2799L2995A92239
18516h6702B84831a64400a220B68901a01967B906c14289a37038b1907k86035E8972
18504a51046E1166a16128b0705j40528m018A49887b36549f8375j70646G7391P153
18493H4544a75822B89955d1466j83085C466d9825B45853B3513a01214k99883A25757
18481e988F1706a01871j73206n7470O4876i7220j142a9668k62255d3401I1123
18469A61451a1141A43903c2635m26123a97114B1677b42766B76032c41420L6425
18459c04995j90855J73851J02956O1873g1871D7608e4287j49791A15390O29J46029
$$ y = [-54205, 146492, -28813, 1073, 117575, 43598, -213874, -3254, 90957, -292520, 330239, -148622, -71921, 311648, -105081, 118605, -74277, -278345, 261076, 14797, 8888, -82799, -49804, 192239, -86702, 284831, -164400, -1220, 268901, -101967, 2906, -314289, -137038, -21907, -307942, 58972, -151046, 51166, -116128, -20705, -161233, -165251, 149887, -236549, -68375, -239021, 77391, 84544, -175822, 289955, -41466, -224551, 3466, -49825, 245853, 23513, -101214, -401097, 125757, -5988, 61706, -101871, -275077, -332547, -267671, -97220, -98362, -19668, -281923, -43401, 91123, 161451, -11141, 143903, -32635, -458758, -197114, 21677, -242766, 276032, -341420, -304995, -495850, -321999, -219043, -157170, -71871, 47608, -54287, -204078, 115390, 116019, 262048]
18448B62048b06054C00434g8805A34026a01163m6284j94628B34063f5029P92B52272
18436c20618c501k22780I5806d0830k58039I3107c34080J37697A53493a49937
18425A53346a87648r0401A6550b6910j22422k65421c7982k31028A00587b2121
18414b29977A77767n2804c99751F6242K36679a70468e6396K6216l03679J34286
18404a99573a1841o1883a9100A70182e2843b3880I5644a25568j98772H2395b66869
18392c04219A45272F1203a80358A15138a82698C0730e9682k13930G1427e9503
18381a06074L5716p1148m9065C4833L9230K62280j46719d03339P3678A60387p8932
18370H1455b52675f3967l2890M5347a6182C45354q7495b23699g2642b25B86755
$$ y = [262048, -206054, 300434, -78805, 134026, -101163, -147447, -342075, 234063, -65029, -64237, 252272, -320618, -3501, -226281, 95806, -40830, -298869, 93107, -334080, -196383, 153493, -149937, 153346, -187648, -278049, 16550, -26910, -149332, -414753, -37982, -269010, 100587, -22121, -229977, 177767, 124963, -399751, 66242, 302921, -170468, -56396, -30180, -333859, -199573, -11841, -73724, -19100, 170182, -52843, -23880, 95644, -125568, -324340, 82395, -266869, -304219, 145272, 61203, -180358, 115138, -182698, 30730, -59682, -273612, 71427, -59503, -106074, -70358, -141506, -190571, 34833, 74063, 336343, 189624, -403339, -329661, 160387, 81455, -252675, -63967, -96857, -51510, -16182, 345354, 257859, -223699, -72642, -225, 286755]
18358b04480A01296Q6273b79925i010l1656E12054f3816A17925D7491i9377A41881
18346F1380a79658Q3624B6654J60262a04638A99850h1484B43489a41648A45135
18335H2312a60509k22809i2886n5430p3064H5425P3961a61386A35509f7262k01964
18324b69226M1560a03977C90192f099k1906k1421o8177B27319a49203f6606I7516
18312D6880a08867c7615J2071l4647o6078G9206J19413I8454d9868a6616k06580
18301b23196a10881D17612a24657C38259j52023i2439j44578I0102c1202A60a67925
18289a81853C932P5953J06716p6475a46688d4728I2736B7469i9228k2833B3312
18277A12307b50652I9529K48632C374a30664C30264A7781b35508M809P6204P4283
$$ y = [-204480, 101296, 187569, -279925, -9010, -40666, 512054, -63816, 117925, 47491, -99377, 141881, 61380, -179658, -96034, 26654, 186916, -104638, 199850, -81484, 243489, -141648, 145135, 82312, -160509, -383318, -92886, -148316, -221380, 85425, 159386, -161386, 135509, -67262, -269226, -227666, -103977, 390192, -6099, -28005, -49426, -117603, 227319, -149203, -66606, 97516, 46880, -108867, -37615, -25544, -60191, -126269, 79206, 198619, 98454, -49868, -16616, -223196, -110881, 417612, -124657, 338259, 186236, -92439, -237017, 90102, -31202, 160, -167925, -181853, 3932, 79885, 186601, 110126, -146688, -44728, 92736, 27469, -99228, -122061, 23312, 112307, -250652, 99529, 348161, 3374, -130664, 330264, 17781, -235508, -230699, -154495, -80212]
18266h0212E6369a37653I8513g1613j28236i0069m9642M8898C571b76348D9009
18254E3227c46616C61109g7692J3619k0475d0688C9880g6842m7793L1228A74121
18242e2916J4296h012l8406r1184A49539b80178C20279a63731k21131A39289c2110
18230I6016f5404A0367P7905b35288n8574A4839N2294a42516F6490a05611B9827
18218E30442A65701D055J26497q682O4552R8549F3249a01274c3592B29543A8015
18206A0248a05152K4966j64417a01892B8993d2574q0009k27500g6117a5414M792
18195a0622A04832k9463a47222M2068n2444I1530L3636B2919c5100A59808a68553
18183a08241j28000A69588c2195r9145O4919A58016c5907J0599r4102A26063m4146
$$ y = [-80212, 56369, -137653, 98513, -71613, -199849, -90069, -139711, -90813, 3571, -276348, 49009, 53227, -346616, 361109, -77692, -64073, -84548, -40688, 39880, -76842, -124635, -93407, 174121, -52916, -38620, -8012, -46418, -137602, 149539, -280178, 320279, -163731, -384862, 139289, -32110, 96016, -65404, 10367, 88272, -235288, -293862, 14839, 67133, -142516, 66490, -105611, 29827, 530442, 165701, 4055, 130552, 121870, 186422, 284971, 63249, -101274, -33592, 229543, 18015, 10248, -105152, -80186, -244603, -101892, 28993, -42574, -122583, -350083, -76117, -15414, -10622, 104832, 75369, -147222, -105154, -157598, 91530, 125166, 22919, -35100, 159808, -168553, -108241, -236241, 169588, -32195, -131340, -66421, 158016, -35907, -25308, -119410, 126063, 81917]
18172H1917A2940b64932A69081i3404J2694j50197f3997H0096K87030b98731p1818
18161c70549e8875B29016F788c01886A02106b62586i2001k52953P0366A40274
18150c0293j9683k62B03942f1536B23095d607B17154a90075a168B04908g8587
18138A88358a58620E5698d388B31864J29840A20838E4854a63821A24722A0185
18127B19425A2994d53393a87135j0669C64034b36978h309j15050B20786b33308
18116a021F3280a42114c0394k04192A94023b64846a30686d8794K1279B04850h5643
18104a55854K4662K1854A72950A9166J8170h1994D0068J6507A0084M0463I263
18092b79122c9169k1349A31394a63811e9079r8166b6411I3284a59256q7194J11424
$$ y = [81917, 12940, -264932, 169081, -93404, -80710, -230907, -63997, 80096, 367126, -298731, -370549, -58875, 229016, 6788, -301886, 102106, -262586, -92001, -344954, -274588, 140274, -30293, -49976, -50238, 203942, -61536, 223095, -4607, 217154, -190075, -1168, 204908, -78587, 188358, -158620, 55698, -4388, 231864, 361704, 120838, 54854, -163821, 124722, 10185, 219425, 12994, -453393, -187135, -197804, 364034, -236978, -8309, -123359, 220786, -233308, -1021, 63280, -142114, -30394, -234586, 194023, -264846, -130686, -48794, -27515, 204850, -85643, -155854, -131192, -109338, 172950, 19166, 37336, -81994, 40068, 56575, 10084, 50547, 9263, -279122, -39169, -60518, 131394, -163811, -59079, -157245, -26411, 93284, -159256, -246450, -135026]
18081a35026A86936P1973a84113A04074K05714j20105j0895F5531c57692J50239
18071b07453j91811F5725k5663d96073J60759c0461C05J16015O1054c75921a0218
18059c93220J73470a6774A95230b80164q4426h0913D1351h6479B1594a08956q5869
18048a94825H2047b1830A18515a21584m5574A11980a70466A74439a27247e2565
18037b41117l94675b27186A77967q061c09294b4968o9708D427a96827l1155f5799
18025A92464d9985n3211A73845f9380A80825H2310J15084p6197C1210f6266B78236
18013A85209d17346c9784A12571K27887b44148Q6854B11182d60015f9113m359
18003g3472D7803j2744i8669L8486H4675a97065A19383M13414F274a68756A18486
$$ y = [-135026, 186936, 258909, -184113, 104074, 309788, 189683, 178788, 65531, -357692, -207453, -399264, 65725, 40062, -496073, -335314, -30461, 305, 116320, 177374, -375921, -10218, -393220, -219750, -16774, 195230, -280164, -364590, -80913, 41351, -86479, 21594, -108956, -194825, 82047, -21830, 118515, -121584, -167158, 111980, -170466, 174439, -127247, -52565, -241117, -635792, -227186, 177967, 169906, -309294, -24968, -94676, 4427, -196827, -227982, -65799, 192464, -49985, -103196, 173845, -69380, 180825, 82310, 197394, 121197, 31210, -66266, 278236, 185209, -417346, -39784, 112571, 340458, -244148, -157294, 211182, -460015, -69113, -73472, 47803, 35059, -98669, -60183, 84675, -197065, 119383, 532797, 6274, -168756, 118486]
17991B04544I6082a06023A95919f860C5985a41709A26432b99264N4616g4473I1393
17979a0100j02096j33167e8670o6953p1266h137A13320b86081a15796L5623l0761
17968a10934B18998J4800a96901H4146J54256d046I7655a5152r8777n9710H5584
17956F8088b7619B52282B9061R3432n7913K45311e1306Q971a7066I7680m4765
17945E2915a37631O7543m6495M3430p5174B92627a92486f4938A16680D0889j4708
17934B6181K11008c72357f9030F0049a63748C5852a37671n7265A06411a75435
17923A7811N5448B3441b839G0936O0486d2129k7259B0787c53996a27627b242B6678
17910c84145J02333b2385j61671P9325K726a9497r9190B46046e5172C14576q6256
$$ y = [204544, 96082, -106023, 195919, -6860, 35985, -141709, 126432, -299264, -244648, -74473, 91393, -10100, -112196, -245363, -58670, -125623, -196889, -8137, 113320, -286081, -115796, -80173, -110934, 218998, 233798, -196901, 84146, 238402, -4046, 97655, -15152, -113929, -173639, 85584, 68088, -27619, 252282, 29061, 122493, 64580, 309891, -51306, -42335, -17066, 97680, 52915, -137631, -70088, -116583, -73153, -148327, 292627, -192486, -64938, 116680, 40889, 26181, 237189, -372357, -69030, 60049, -163748, 35852, -137671, -194936, 106411, -175435, 17811, 73259, 23441, -2839, 70936, 131422, -42129, -69388, 20787, -353996, -127627, -2242, 26678, -384145, -281812, -22385, -184056, -104731, -102005, -19497, -118687, 246046, -55172, 314576, 228320]
17899B28320b4786C7046R733e9424j54761P4769B27835b17368L3390A56318j7471
17888A38847h7291j06600R3224k5673J0308b76H4451a09687B75929d7072G4315
17876a73948c4117f965B43367m0042B2123L20612A12743d2130G4919b38126B0650
17864a71285A47845K95591b24459G336a37766j94978C2651o234J3905a51385B68351
17852A22483a63476c3426B73303r8073a06385B60539c1655B81953f2330k07A91674
17840g1044G527J86172a30075A2785c21359C8896c9816a2778k38818C8100J1502
17829D9602a28116F2455N3539L2389O1028B5871J2879g7758r068M1167k75710
17818c21369B68031P7365b0888A97563b16093I400b64427J07611q0610h8167A2564
$$ y = [228320, -24786, 37046, 46779, -59424, -214185, -139416, 227835, -217368, -183978, 156318, 138847, -87291, -193891, -100667, -126340, -116032, -276, 84451, -109687, 275929, -47072, 74315, -173948, -34117, -6965, 243367, 203325, 22123, 342735, 112743, -42130, 74919, -238126, 20650, -171285, 147845, 443436, -224459, 7336, -137766, -332744, 32651, 26417, 40322, -151385, 268351, 122483, -163476, -33426, 273303, 175230, -106385, 260539, -31655, 281953, -62330, -62537, 191674, -71044, 7527, 193699, -130075, 12785, -321359, 38896, -39816, -12778, -251596, 38100, 49602, -128116, 62455, 115994, 148383, 209411, 25871, 38750, -77758, -86826, -45659, -321369, 268031, 345396, -20888, 197563, -216093, 9400, -264427, -156816, -237426, -88167, 12564]
17806B70101g1663K9542E1864K2735h5476J8230b9416B28312a80101D6347a60626
17794b87692B31537J77215L014b58931B56435A01830c11281e5223C22051a0457
17783a94800Q2474j19614G3256a7541B00508f4306p6844E3535J02402a21182I8578
17771b06802A8396a35649L7569F0360b66062m8827B1280c0433o2814c5935o7431
17760a03366E4801a56900C34406a31055A97318o3057Q0905c8644l9092a3324q7412
17749a00736L8972a541A82867n3964d94759a87532j70488D94608b0041A22228
17738a63920N1543k14340O2258K9293A76051P3087A0300O0459b16828B95788G9216
17726a64513A99529f7350p3155e9687B39166q7149K3844n9533k6558n264a32284
$$ y = [270101, -71663, -42121, 51864, 74599, -85476, -67246, -29416, 228312, -180101, 46347, -160626, -287692, 231537, 408752, 411766, -258931, 256435, 101830, -311281, -55223, 322051, -10457, -194800, -112326, -231940, 73256, -17541, 200508, -64306, -141150, 53535, 155937, -121182, 98578, -206802, 18396, -135649, -98080, 60360, -266062, -314889, 21280, -30433, -93247, -35935, -103366, 54801, -156900, 334406, -131055, 197318, 134261, 215166, -38644, -77736, -13324, -100736, -61764, -1541, 182867, 128903, -494759, -187532, -358020, 494608, -20041, 122228, -163920, -112377, -326717, -264459, -235166, 176051, 249138, 10300, 70759, -216828, 295788, 79216, -164513, 199529, -67350, -140505, -59687, 239166, 152017, 175861, 116328, 89770, 84506, -132284]
17714A85348a05873A59016P3509a95937a3803A93620M8731c4620r2260C0225A1206
17702F4103K04709c75438d1757J9084j12996H7669k4299J38602p1933k0463b31322
17690e69046A28744a14064B2128c0116B45012A14424J41873d67391D8258K06806
17680B55064A13629a57267M3701m9469D3196RO3967d2770A09991a66456D0081
17668A41399E9965k764J07685a73937l4342i4843B95902B3612K63102f3306j6619
17657g9925j2531E9242d8874a3257p0134F2370K93253a0577G6908a92911F9371
17645C880b1918B13722e8796I3454j0195a36463D3014g9993j69039C17311A8550
17633C11448j02823G0846h4657A30169D2429K95136h7788M157m3599A5716M8401
$$ y = [185348, -105873, 159016, 232525, -195937, -13803, 193620, 242351, -34620, -126880, 30225, 11206, 64103, 268812, -375438, -41757, -22673, -135669, 87669, 63370, 201972, 130039, 109576, -231322, -569046, 128744, -114064, 22128, -30116, 245012, 114424, 256297, -467391, 48258, 255064, 113629, -157267, -113566, -163035, 43196, 43205, 107172, -42770, 109991, -166456, 40081, 141399, 59965, 57201, 164886, -173937, -208279, -94843, 295902, 23612, 286714, -63306, -79925, -92456, 59242, -48874, -13257, -83391, 62370, 355623, -10577, 76908, -192911, 69371, 3880, -21918, 213722, -58796, 93454, 83259, -136463, 43014, -79993, -249032, 317311, 18550, 311448, 208625, 70846, -84657, 130169, 42429, 337565, -87788, -83631, -127230, 15716, 64117]
17622F4117B1117a74215C34066I8955d2812A0794b02821F8769a84654n534h3770
17610A95544A4481b15069C60996A62314e0346A38755L8064G3250f8696k85488
17600c54184a31546G0252j0796a04738A69400i9263A1026J24014b63446A70007
17589C0049K00829a00967H802K27277b5263n2407A53099k1565a0278j99865Q5226
17578a24917A23272f7698F6504a11593A33241b01349m0846C96846j59539j4139
17568B23168j10592a39544J7923N0689A04231M2671D1562g537C959O9016e5653
17556h677B22762l5882K07973E7810d2720R935C7222p075d5120B24143K9861J56976
17544D10980l1270j78808e647j17248B40544a10909A88502b19912h3620A19339
$$ y = [64117, 21117, -174215, 334066, 98955, -42812, 10794, -202821, 68769, -184654, -190188, -83770, 195544, 14481, -215069, 360996, 162314, -50346, 138755, 176819, 73250, -68696, -354184, -131546, 70252, 59456, -104738, 169400, -99263, 11026, 135040, -263446, 170007, 30049, 230878, -100967, 8802, 236079, -25263, -77670, 153099, 131534, -10278, -210143, -124917, 123272, -67698, 66504, -111593, 133241, -201349, -242195, 396846, 237307, 223168, 112576, -139544, -121621, -70932, 104231, 146902, 41562, -7537, 3959, 72975, -55653, -8677, 222762, 186880, 394853, 57810, -42720, -32785, 37222, 30147, -45120, 224143, 254004, 410980, 379710, 200902, -5647, -122895, 240544, -110909, 188502, -219912, -83620, 119339]
17533h4422B58250a8037D1975j7719Q9804M2193i8104B84589j6612B6985J73582
17522B00567o4133a50053B30185O9316g6599B17127O2419a47438D9090J19180
17512A68270E7049J9050k5102J98701e0487F1056e9077B2715R8720f3556j98074
17501b61630I9208K26693G7512g1074D27320o6446h6699n6273c8176N625B06626
17489a57744N3512F2194a06238H3057N8023N0269G5433l525L29690F9508e840
17477I1600R0771H461J18346B9683J0645i8764B65484n905C1519f4108C97602
17465d2384A86941b7139j11943f8740B15254K15545I4575J54939c0159E9149J43767
17454B02916a17128A61771K21244A55460J30625r384r2771D4063K28545G8504
$$ y = [-84422, 258250, -18037, 41975, 24256, 114060, 156253, -98104, 284589, 267977, 26985, 200567, 136434, -150053, 230185, 299501, -76599, 217127, 279546, -147438, 49090, 168270, 57049, 76099, 50997, 249698, -50487, 61056, -59077, 22715, 121435, -63556, -261630, 99208, 325901, 77512, -71074, 427320, 360874, -86699, -142972, -38176, -32551, 206626, -157744, -104232, 62194, -106238, 83057, 141080, 191349, 75433, 71908, 401598, 69508, -5840, 91600, 182371, 8461, 126807, 29683, 40328, -98764, 265484, 259579, 31519, -64108, 397602, -42384, 186941, -27139, -139082, -68740, 215254, 430799, 94575, 249514, -30159, 59149, 202916, -117128, 161771, 383015, 155460, 286085, 276701, 183930, 44063, 272608, 78504]
17443A48081Q7093l9463d1014C20482Q3989A18976m2628h1371B04274M80067D0183
17431c1878H0685J60926O5855j2417e2065B97292I9486D8449L5051K43522k1682
17420C05340A31225L01403J75110j14537A65608M2691R3097j07854D1942a01941
17409B13540r1581K37544i9912o1136B19913G7755K78998f6919E50151c3469k17972
17398b51441C78848a5202A68239L9355h0749A57598K61992G0629k4979K4754K58011
17387C28415A33853R6889p2400o2586D3442P268L20881j41641F9051n785a18669
17375b94699D16635f235C1851a09876b255B25750B3452M26232G4985L6382a81307
17363D5156J31945M915E9055a78342A82045L1000a78035C72461a55215A21988
$$ y = [148081, 235174, 195711, -41014, 320482, 404471, 118976, 76348, -81371, 204274, 684341, 40183, -31878, 80685, 241611, 307466, 295049, -52065, 297292, 99486, 48449, 83500, 327022, 305340, 131225, 432628, 607738, 493201, 165608, 208299, 301396, 193542, 41942, -101941, 213540, 121959, 359503, -99912, -161048, 219913, 77755, 356753, -66919, 550151, -33469, -251441, 378848, -15202, 168239, 207594, -80749, 157598, 419590, 70629, 45650, 70404, 328415, 133853, 230742, 158342, 95756, 43442, 50710, 371591, 229950, 69051, 63266, -118669, -294699, 416635, -6235, 31851, -109876, -2255, 225750, 23452, 449684, 74985, 111367, -181307, 45156, 177101, 182016, 59055, -178342, 182045, 213045, -178035, 372461, -155215, 121988]
17352b0555C2188d1371C65967j57772J81006A42665g8884B06110L9808H042J36751
17341A44793J38240j14914J02210h3576G5805A928M11471b59192B82156A1413
17330B35114K8494J19190m2392M4230A34998b30934K1686B17375e5904C537L39876
17319C43413p2756J59002A60317p1758C627K03985K53741B27214C6588M97809
17309E34397a31506A48505a7597B90631n7513G1042J11860M536F5714K11217j9716
17298B57215E8823L5498L56842c09022B377P7114B7160L25910G5390K24630L2341
17287C32361D4978K38204k6199R387n121j16750d700A08601c2332C96135K8342
17276D24477j03892A50581M4802J37223e4835C19454G4718b4670o8104d4915C02843
$$ y = [-20555, 32188, -41371, 365967, 208195, 389201, 142665, -78884, 206110, 245918, 8042, 144793, 283033, 168119, 270329, -83576, 75805, 1928, 413399, -259192, 282156, 11413, 235114, 263608, 382798, 340406, 384636, 134998, -230934, -209248, 217375, -55904, 3537, 343413, 270657, 429659, 160317, 88559, 3627, 207612, 461353, 227214, 36588, 534397, -131506, 148505, -17597, 290631, 233118, 71042, 182902, 187438, 65714, 276931, 257215, 58823, 94321, 451163, -309022, 2377, 79491, 27160, 353070, 75390, 300020, 332361, 44978, 283182, 256983, 266370, 261249, 144499, -4700, 108601, -32332, 396135, 424477, 320585, 150581, 195383, 332606, -54835, 319454, 74718, -24670, -92774, -44915, 302843]
17264I9155J27929L7616O0899C4855r517L81262j7194L1700d2861C7744a96330
17252F061O4234P0548C5505a06956C20126j15806d9461j9609C86269j92900J27458
17241C20827J01364j29159b08214C51526E4512i6798C66695L444f5029G693R8964
17230A06657J2043Q9818J85429j46563q7796J43793B5103J02367L9824L79022
17220E46316B04585R9775l9714J70016b0460B72886A18869b9560C53992l8009
17210C15983p985j17827J65457G4835K74840A72731R5938j11371K2675F695B071
17198D33520q4334j15473L827D0321K00183N0724J89455A92230N9046Q3818A45473
17186A12409J36207r6132G2636K05575n4684J09443N7500J53203B34465J06943
$$ y = [99155, 227084, 264700, 325599, 34855, 25338, 406600, 389406, 421106, -42861, 37744, -196330, 6061, 70295, 140843, 35505, -106956, 320126, 204320, -49461, -69070, 386269, 193369, 320827, 422191, 293032, -208214, 351526, 54512, -96798, 366695, 370139, -65029, 7693, 106657, 118700, 208518, 393947, 247384, 159588, 303381, 25103, 127470, 167294, 546316, 204585, 304360, 264646, 434662, -20460, 272886, 118869, -29560, 353992, 315983, 307998, 190171, 355628, 74835, 349675, 172731, 268669, 157298, 179973, 6695, 2071, 433520, 349186, 233713, 237540, 40321, 240504, 291228, 480683, 192230, 251276, 335094, 145473, 112409, 248616, 152484, 72636, 278211, 223527, 332970, 390470, 543673, 234465, 341408]
17176C41408J03280A70380c7015B1778M9979j0351p494J36023J15608K80888k77594
17165C08837O7710J10099j24424A41807L42999j52639q3180J58586p9805b6903
17154b4502D76256I3658J53940r4991M21635k61179O4190j28534O6037l2449L02522
17143E84829G2771K26050j30850O08863l77699p8804L41772B11899p416K38955
17133D43438L9730A1127P23876k70901n8068L9056j09331J04297J32010l9094
17123E32972o0054A90567P8742J25230K58542C17796O9951q6088J11827k3444
17113C90042J62623k38012J08827J3504k05233J50121K80017A24559J79542J31729
17103D35830j86117k4082A07443N3802c5252C48282k1750O6901d3724C80913A78882
$$ y = [341408, 444688, 170380, -37015, 21778, 71757, 61406, 53912, 189935, 305543, 586431, 308837, 376547, 486646, 362222, 141807, 484806, 332167, 248987, 407573, 327768, -26903, -24502, 476256, 93658, 247598, 152607, 574242, 313063, 377253, 248719, 314756, 282307, 584829, 72771, 298821, 167971, 776834, 399135, 320331, 662103, 211899, 204483, 443438, 483168, 11127, 735003, 464102, 406034, 445090, 335759, 440056, 572066, 532972, 472918, 190567, 269309, 394539, 653081, 317796, 387747, 301659, 413486, 390042, 552665, 314653, 423480, 436984, 231751, 381872, 661889, 124559, 304101, 435830, 249713, 225631, 107443, 161245, -35252, 348282, 326532, 393433, -43724, 380913, 178882]
17091D71790A93848J6764L09454J34034j99642F7824K55112K20742k20899L4260
17081C57039R9814K14743o6048P8967n951B43443J39875K25528B31902J09843
17071C41745L28022j82136K78766N9893k78758B39860J73404j24337I1485J66863
17061B58348K11056J76061A91015K44463L16438l50647P0681p8602M4968K62162
17051G00478J4194l15264L44976k70646q02L7348j43566R7599L57718q5595K49838
17040I86278m01991j4024K24577n7461k63062n0582K13084p1086k19086M87953
17030H34600j10804r5448j28082L20187j45176m7127n538q2462J70617n2011j43689
17019E15067l3050J83520k68886M78835K436B97471L45464j34546m7563M52123
$$ y = [471790, 193848, 210612, 520066, 654100, 454458, 67824, 322936, 543678, 322779, 357039, 456853, 671596, 605548, 684515, 678564, 243443, 383318, 608846, 231902, 341745, 669767, 487631, 766397, 826290, 547532, 239860, 413264, 288927, 91485, 258348, 469404, 645465, 191015, 435478, 751916, 401269, 471950, 393348, 438316, 700478, 714672, 399408, 744384, 473738, 472936, 510284, 366718, 464317, 822035, 736440, 986278, 584287, 570263, 794840, 737379, 474317, 423735, 636819, 565733, 346647, 834600, 723796, 628348, 500266, 820453, 675277, 628150, 622612, 540150, 710767, 658756, 515067, 482017, 665537, 396651, 875486, 877922, 297471, 642935, 508389, 460826, 912949]
17009I12949C66838N04138J44793k66383k16835L03224J719j77497j8980p7947
16999E63070p8205K94988L1453l15708J86822J86772k19385J5963J49227J52391
16989I67388K8928o6764j86029j11643K80499j94171L98263m44736Q1824K08261
16979I61820k22313P7989K6734L49470l65805l0043L83589J19809n33707R694
16969G77237J54761J3100L6629P3254J45245j59617P9741J2052k37584L57461
16959A252279E61741L57765M70869k36021o4267k837J70389m9333l0172J18630
16949A296764m41948K79178k04237L17978P2284j51661J24322k3925o1528J79794
16939A387021j14192j30972P5597L25276m03907K38735O8320n2745J46456k89534
$$ y = [912949, 366838, 870976, 1015769, 749386, 532551, 835775, 837494, 659997, 641017, 563070, 484865, 779853, 811306, 495598, 682420, 869192, 649807, 665770, 814997, 967388, 996316, 929552, 743523, 631880, 912379, 718208, 1116471, 671735, 753559, 961820, 739507, 817496, 844230, 1193700, 827895, 797852, 1181441, 1301250, 767543, 777237, 931998, 945098, 981727, 1054981, 1200226, 1040609, 1120350, 1132402, 894818, 1252279, 561741, 919506, 1390375, 1154354, 1090087, 1087250, 1257639, 1208306, 1178134, 1296764, 854816, 1133994, 929757, 1247735, 1320019, 1168358, 1292680, 1268755, 1207227, 1387021, 1272829, 1141857, 1217454, 1542730, 1138823, 1377558, 1445878, 1393133, 1539589, 1250055]
16929A250055j78866L37753L17429m99466J9986L01479R3354j26966l24949N11449
16919A701258j38296R9900k88526J15426O64757o63436J68767J97108P0043k93952
16909A633049L33230l60221J97513k9832R4395j9288l09814M22691q0079n7155
16899A824489k92523O34934k85253J53662J48902k97741L18589l14981J05941
16890A996019J31301N0793j84736n751L30240j73230l01257N99067q2781O3571
16880B423236K36724j08079l5970k93703J5077J40014N36572m70800K39464o4956
16870B617579J21524j34423K17235l86534M21993K258l33747O77025j46510R3222
16860C149622k47760K48594J49167j50828k8098R9830m6153K56805l16888K38770
$$ y = [1250055, 1071189, 1408942, 1726371, 1226905, 1246891, 1548370, 1641724, 1514758, 1189809, 1701258, 1562962, 1662862, 1374336, 1489762, 2154519, 1491083, 1659850, 1856958, 1927001, 1633049, 1966279, 1606058, 1803571, 1773739, 1868134, 1848846, 1539032, 1961723, 1881644, 1824489, 1531966, 2166900, 1881647, 2035309, 2184211, 1886470, 2205059, 1890078, 1996019, 2127320, 2178113, 1993377, 1987626, 2317866, 2144636, 1843379, 2442446, 2359665, 2423236, 2659960, 2551881, 2515911, 2222208, 2237285, 2377299, 2913871, 2443071, 2682535, 2617579, 2739103, 2604680, 2821915, 2435381, 2857374, 2859632, 2525885, 3202910, 3056400, 3149622, 2901862, 3150456, 3299623, 3148795, 3120697, 3220527, 3174374, 3431179, 3114291, 3353061]
16850C353061j19783L58129M0048J0006J18069R6014n0208J93749j62820J67210
16840D003475n8918J90153L34693j19601J60439k01373K51915k62436L66212l04013
16830D360546J77728N76515l98965R3556j05619O70594l36118L50398K91573q4134
16820E596074K34940k22290L5884K29153K94763n62262Q20248k22306O20294j80010
16810F644488J44638J56378M13610Q6098m621M27973k48626K01523M05911K97437
16800H524809l24894M46993L62360K45615K4110K4058J63740L37056O03174k29731
16790A0177290O12335L27627J3142L12217M74904M95390M70171P4433K37090J90751
16780A3385350N01871P42015k18303O72657Q09057L20292M07015O98978N37712
$$ y = [3353061, 3233278, 3591407, 3631455, 3641461, 3759530, 3855544, 3805336, 3999085, 3836265, 4003475, 3944557, 4134710, 4469403, 4349802, 4510241, 4308868, 4560783, 4298347, 4664559, 4360546, 4538274, 5114789, 4715824, 4809380, 4703761, 5374355, 5038237, 5388635, 5680208, 5596074, 5831014, 5608724, 5644608, 5873761, 6168524, 5606262, 6426510, 6204204, 6824498, 6644488, 6789126, 6945504, 7359114, 7445212, 7440591, 7868564, 7619938, 7821461, 8227372, 8524809, 8199915, 8646908, 9009268, 9254883, 9278993, 9303051, 9466791, 9803847, 10407021, 10177290, 10789625, 11117252, 11130394, 11442611, 11917515, 12412905, 12883076, 12957509, 13194599, 13385350, 13887221, 14629236, 14410933, 15083590, 15892647, 16212939, 16619954, 17318932, 17856644]
16771A7856644O42171M97358O25262P51041O13396Q56495P60644R92010L96815
16762B3991836J437941P25181J403792L98557J496962J089390J182915J591334
16754C3317908J401751J286275J667197J708340J816159K002907J984536K111176
16746D7296249K305147K410668K517191K791818L221422K908092L480665L876125
16738G0807377L404806M450911M339473M509003M842338N179002N561054N988342
16730A09082306O222032O158527O405640P082601O593571P016867O428774O654095
16722A61644413N880895N278667M509326M229772K971313J682442O59633p02377
16714A86154084j523741k911241m024883m808445n566958o105701o360686o936840
$$ y = [17856644, 18498815, 18996173, 19621435, 20372476, 20985872, 21842367, 22603011, 23595021, 23991836, 25429777, 26154958, 27558750, 27957307, 29454269, 30543659, 31726574, 33317908, 34719659, 36005934, 37673131, 39381471, 41197630, 43200537, 45185073, 47296249, 49601396, 52012064, 54529255, 57321073, 60542495, 63450587, 66931252, 70807377, 74212183, 78663094, 83002567, 87511570, 92353908, 97532910, 103093964, 109082306, 115304338, 121462865, 127868505, 134951106, 141544677, 148561544, 154990318, 161644413, 167525308, 172803975, 177313301, 181543073, 184514386, 186196828, 186856461, 186154084, 184630343, 181719102, 177694219, 172885774, 167318816, 161213115, 154852429, 147915589]
16706A47915589o403816p151725o963272o844977o466841o589751n784081n969269
16698I5741857n445951m794170n026449m645650m059603m158084l492433l672625
16690F0446892l005001k950177l296776k272364k445524k338431k326873j850186
16682C9961560k272002j485693j596974j298629j756564j441070j337737q67640
16674B7905251j340206o11186j600338r22150p55575p55537q40439p04461q46825
16665A9528534p60245m50263o87930k56739j067938m04915o82709j45300n42675
16656A4529820o70906o10788j04870l91717p65688K1508l78065k63714m51050
16647A0914530m26331O5042l58345m85693l62367J34889l51434l77209k19972
$$ y = [147915589, 141511773, 134360048, 127396776, 120551799, 114084958, 107495207, 101711126, 95741857, 90295906, 85501736, 80475287, 75829637, 71770034, 67611950, 64119517, 60446892, 57441891, 54491714, 51194938, 48922574, 46477050, 44138619, 41811746, 39961560, 37689558, 36203865, 34606891, 33308262, 31551698, 30110628, 28772891, 27905251, 26565045, 25953859, 24353521, 23431371, 22675796, 21920259, 21079820, 20375359, 19528534, 18768289, 18318026, 17630096, 17373357, 16305419, 15900504, 15217795, 15072495, 14529820, 13858914, 13248126, 13143256, 12751539, 11985851, 12007359, 11629294, 11365580, 10914530, 10488199, 10553241, 10194896, 9709203, 9346836, 9481725, 9130291, 8753082, 8533110]
16638H533110l13690N0402n5477k10264n32707j28588J5848m12693l11032Q4386
16628F719295r1559j87780k37941k98205M79113p58569j28808M48933n68595l90052
16618D985832N61212j00658l27963j39366Q1769k57804K05616k49367j54217m33974
16608D171080J1446l2413m33683J76563K20967j92648n4314k00608L8707J15600
16598C820697j75723j37542R2294J03211r18496N21461O0097M9332l06264k50692
16588B858375J22317l1064N4405l7927n169k2830j8741K23379m00229P8946k48249
16577B573213J19389k30536J82395J7043l08439K94093l88466k28161L69990j39769
16567B260752J00027J3350k76295K17529m30685J3752K65920k0934j6617l97207
$$ y = [8533110, 8219420, 8269822, 8214345, 8004081, 7471374, 7342786, 7358634, 6945941, 6634909, 6719295, 6627736, 6439956, 6202015, 5903810, 6382923, 5624354, 5495546, 5944479, 5375884, 4985832, 5547044, 5446386, 5118423, 4979057, 5060826, 4803022, 5008638, 4759271, 4605054, 4171080, 4182526, 4150113, 3716430, 3892993, 4113960, 3921312, 3866998, 3666390, 3705097, 3820697, 3644974, 3507432, 3599726, 3702937, 2784441, 3305902, 3365999, 3415331, 3109067, 2858375, 2980692, 2949628, 3004033, 2966106, 2960937, 2938107, 2919366, 3142745, 2742516, 2821462, 2573213, 2692602, 2462066, 2644461, 2661504, 2353065, 2647158, 2258692, 2030531, 2400521, 2260752, 2360779, 2374129, 2097834, 2315363, 1884678, 1898430, 2164350, 2143416, 2126799, 1729592]
16557A729592M05966k12970R631K81169n14837L22142m11456L85313n32622J06763
16547A568691n23k4937K62056l5458j22987k0716J53738J48661n94340P9295M05945
16536A819425r3072P8659k66922L3257q1081j62591P4075j464O7596k13529n4074
16525A200279N42980p59182K84215J63003k11369M3761m2766O8769N7076J39872
16515A486638n17357K89290P2794j68169Q290k5780m42016M35952J13089M6641
16505A299372j70127j7182k06770K35103K57454l88327L50899k60195j72356n4415
16495H73456K9329J80393N9436L1694l37779J43357L516k63073K67231r5170L1063
16484I23453n6670j4280j47876L07483l89896J05651J56246J74602l64217Q9619
$$ y = [1729592, 2135558, 1922588, 1932219, 2213388, 1698551, 2020693, 1609237, 1994550, 1461928, 1568691, 1568168, 1543231, 1805287, 1769829, 1646842, 1626126, 1779864, 1928525, 1334185, 1413480, 1819425, 1726353, 1805012, 1538090, 1571347, 1490266, 1327675, 1401750, 1400286, 1467882, 1254353, 1200279, 1743259, 984077, 1268292, 1431295, 1219926, 1263687, 1220921, 1289690, 1346766, 1486638, 969281, 1258571, 1331365, 1163196, 1171486, 1145706, 703690, 1139642, 1252731, 1299372, 1129245, 1112063, 905293, 1140396, 1397850, 1009523, 1360422, 1100227, 927871, 873456, 902785, 1083178, 1142614, 1174308, 836529, 979886, 983402, 720329, 987560, 892390, 923453, 866783, 852503, 704627, 1012110, 622214, 727865, 884111, 1058713, 694496, 784115]
16474G84115J28194j59324k8872J76762l03464J33236J02375l2806k95513A79166
16463G73562j33139J7813k21296Q8522J46359N1198N7603J27935m02711L60138
16453H65984j0666D23634l7617M4874L21590j99875j31173K61656B43501M93300
16443G36801k98971K27494p7808J53616J67249B92879L79720J65815l26778p6409
16433D35227j70696K18623K76880j52798j6224J6448J72845l71014K1238L41246
16423G71775l05839L13967C38917K8410J31935K29449k13489j74675r998K06612
16413E37161J99502H0504K45865J14549K5505L09525k36166A74295K00578K76911
16403F51784k11665R0253j55190K14477A46946J70870M02819B70563C2013a0328
$$ y = [784115, 912309, 752985, 724113, 900875, 597411, 730647, 833022, 800216, 504703, 179166, 773562, 640423, 658236, 436940, 525462, 671821, 723019, 780622, 908557, 505846, 865984, 855318, 423634, 386017, 430891, 752481, 552606, 421433, 683089, 243501, 736801, 437830, 665324, 587516, 741132, 908381, 292879, 672599, 838414, 511636, 435227, 264531, 483154, 760034, 607236, 591012, 607460, 780305, 409291, 430529, 771775, 465936, 779903, 338917, 367327, 499262, 728711, 515222, 340547, 330549, 537161, 736663, 80504, 326369, 440918, 466423, 775948, 539782, 174295, 374873, 651784, 440119, 530372, 375182, 589659, 146946, 317816, 720635, 270563, 32013, -10328]
16392D62717k21590L63890j5222k32881K23063D1303J65376k1257n983Q3445K79619
16381E42503L6491r2431R2207r9631o7042j72098J80687J63939j12070j25418
16371C47137J06897o2883r8871n5681J81803J71275f7426B35561L52321A92070
16360A42451L78236a11376B82666j8914M56839k18450L199j59404K8891j10875
16350B63952J03719j12804p2906F5081O2726K36552A36788K09312n2196J81741
16340D75645B11511O1286J01161K9638m5107j30627j12248f3108A15437L61198
16330D76635H0087O3902k8163L35347A26872L39221K02735A97952l1875a8264
16319B99304o3773p6501J09171k3236r4044J27884o9096L80155j1350B40096J55571
$$ y = [462717, 241127, 605017, 589795, 356914, 579977, 41303, 206679, 185422, 179439, 262884, 542503, 578994, 486563, 578770, 479139, 412097, 239999, 420686, 584625, 472555, 347137, 454034, 391151, 292280, 236599, 418402, 589677, -67426, 235561, 587882, 192070, 142451, 520687, -111376, 282666, 263752, 720591, 502141, 505340, 345936, 374827, 263952, 367671, 254867, 181961, 65081, 127807, 364359, 136788, 346100, 293904, 475645, 211511, 272797, 373958, 403596, 358489, 227862, 115614, -63108, 115437, 476635, 80087, 143989, 115826, 451173, 126872, 466093, 668828, 197952, 166077, -18264, 299304, 235531, 159030, 268201, 244965, 150921, 278805, 209709, 589864, 578514, 240096, 395667]
16308C95667d9720D15868j40500j04128J59217j02240G3152J79178j3865q9635
16298A48830J31736k8939B4726P5433N6223a9930H5408K22586J15929o6256j64335
16287A93332J08360p5769j9685I0437B7292M10005A81427J79074l3552f3603b7862
16275F29762B27434a40112a1941D12247A11879D8553K00294M1112j6801a16399
16264E5235K4778K10567J3052A27626A1621M49371A93586k4616L38428I3830M5762
16253A39592a228k2519C93881b5898k2551A59423J24259Q0879H6910P717d08B81060
16240B18882b02682E7864L1939K00167A6031b6551A90453p0387K66430B5658J32471
16229A58129l56F7145L07481a42803f1250k29353b3193m11582a17637B10311g1798
$$ y = [395667, -49720, 415868, 275368, 171240, 330457, 228217, 73152, 252330, 238465, 148830, 280566, 251627, 24726, 100159, 156382, -19930, 85408, 307994, 423923, 357667, 193332, 301692, 225923, 206238, 90437, 27292, 437297, 181427, 360501, 326949, -63603, -27862, 629762, 227434, -140112, -11941, 412247, 111879, 48553, 248847, 289959, 273158, -116399, 55235, 80013, 290580, 303632, 127626, 11621, 460992, 193586, 168970, 507398, 93830, 139592, -1228, -23747, 393881, -25898, -48449, 159423, 283682, 364561, 86910, 94627, -408, 281060, 218882, -202682, 57864, 89803, 289970, 16031, -26551, 190453, 120066, 386496, 25658, 158129, 157773, 67145, 374626, -142803, -61250, -290603, -23193, -434775, -117637, 210311, -71798]
16217i3217D73017A98443H1860b48459A7712e7418B91865M6369r4736F1504k0897
16206D0607E257J5555c9816A86494b5731j17833j85096B2938K03713I7475a91027
16194b07005K2155C16664A36210a8590j10134A98637F7656J49424j3249A963d9370
16182B64605J92247a13873I6595h0359D47309j81512o9614p7703J48877A05557
16171A63428J45393F9093e6340B41220b5076E8928M9308b88958I6620f3291A4144
16159B20133D5458d0870l1329B04347o8602A9806E265Q3962e8708C06055f3698
16147B96933l4499F6234b0466B18763M268c3601E36606B46346a8031D08042G6868
16135f9201r7042F8329d2331G7376b08086A56214c1737C01484e6495F0565a57547
$$ y = [-93217, 473017, 198443, 81860, -248459, 17712, -57418, 291865, 338234, 243498, 61504, 40607, 5257, 20812, -39816, 186494, -25731, -143564, -328660, 22938, 226651, 97475, -191027, -207005, -184850, 316664, 136210, -18590, -128724, 198637, 67656, 217080, 203831, 1963, -49370, 264605, 456852, -113873, 96595, -80359, 447309, 265797, 196183, 118480, 267357, 105557, 163428, 308821, 69093, -56340, 241220, -25076, 58928, 108236, -288958, 96620, -63291, 14144, 220133, 45458, -40870, -72199, 204347, 135745, 19806, 5265, 89227, -58708, 306055, -63698, 296933, 262434, 66234, -20466, 218763, 223031, -33601, 536606, 246346, -18031, 408042, 76868, -69201, -166243, 68329, -42331, 77376, -208086, 156214, -31737, 301484, -56495, 60565, -157547]
16123H5466A6387h1973A8200J89279A01141D8729N3625b04265A56540c5044B51218
16111A27022a96562P0094G4260j4935Q7519A4809P0824J39875N8795a16759A23831
16099D1915K9885M1989A4523L59101r4918c10411A26098J50602j22220A8747a74634
16087h0006G6636C7143L9683b84694B88487a44120C8034a55396m5789P8826A9962
16075B4269e744A39359J75700D1618R5943J0543J33198N6527d13186C26052A62012
16063G5431O1455g6612r9281f8721A57822B1344d02297D9338J96851j7691F5880
16051f541j65512G2211J65606B9325M553F857b13188A23024a80750k43477e3428
16039A8712c43844a18105h173j81615G8185b97980A72175c76440B32116p1639
$$ y = [85466, 16387, -81973, 18200, 207479, 101141, 48729, 102354, -204265, 156540, -35044, 251218, 127022, -196562, -126468, 74260, 59325, 146844, 14809, 85633, 225508, 284303, -116759, 123831, 41915, 71800, 113789, 14523, 373624, 278706, -310411, 126098, 276700, 154480, 18747, -174634, -80006, 76636, 37143, 76826, -284694, 288487, -144120, 38034, -155396, -201185, -122359, 19962, 24269, -5744, 139359, 315059, 41618, 137561, 148104, 281302, 337829, -413186, 326052, 162012, 75431, 136886, -76612, -175893, -68721, 157822, 21344, -402297, 49338, 246189, 228498, 65880, -6541, -172053, 72211, 237817, 29325, 33878, 6857, -213188, 123024, -180750, -424227, -53428, 18712, -343844, -118105, -8173, -189788, 78185, -297980, 172175, -376440, 232116, 160477]
16029A60477b88025A8992c98404h5623m3625B71988c1927m39077c2574A46765
16018G0813i8630M5828j7789G0612J49149h7285E6742K15523q9720a52420D1610
16006C34684H4503k4360a77951A3044d50730C6248i9915p2485G7692c5883A52751
15994g8060k6478A46520L3986J76362b13201F8181N5781b06964G731a57216k7283
15983a84499A47604J02493j14665g687k5285A0568g9707A95290H0198D551J62625
15972A67176d0714m62647a92992d1745c833k54335D629a80201E953K02166i8598
15960b56588C59435K0495D7837r104a80183f5643k3898k48264g157m5789H376
15948g8111A08326a61509e1910k49337E7026b27974H8786e1991k7566A20482C1727
$$ y = [160477, -288025, 18992, -398404, -85623, -129248, 271988, -31927, -471004, -32574, 146765, 70813, -98630, -52802, -70591, 70612, 219761, -87285, 56742, 272265, 182545, -152420, 41610, 334684, 84503, 60143, -177951, 13044, -450730, 36248, -99915, -172400, 77692, -35883, 152751, -78060, -104538, 146520, 180506, 356868, -213201, 68181, 123962, -206964, 7731, -157216, -184499, 147604, 250097, 135432, -7687, -32972, 10568, -79707, 195290, 80198, 4551, 167176, -40714, -503361, -192992, -41745, -3833, -258168, 4629, -180201, 5953, 208119, -98598, -256588, 359435, 379930, 47837, 38733, -180183, -65643, -89541, -337805, -7157, -52946, 8376, -78111, 108326, -161509, -51910, -301247, 57026, -227974, 88786, -51991, -79557, 120482, 31727]
15936E169c21976d8147o9464F1425O4032k1630D060J46921a03841F6590R6314
15925A62904a62931A45422D891f9163q5364k81965a48942B54441d5362j09302
15915a54664c7177k308k2414j83518B08858b47931B55271p8928e1124p075j26537
15904a84736j11716m1389b2187j92533B3825g6589I362c76320J16280P0776M2586
15893a46678f6490C38194a11073I1641A485c44858a11607j7024F1990b57125I7705
15881h3090m18634B6342b24620A97219b18068B23630f1888k76276d8105j6906
15871f5011A47179c14378G6942J6217e5437m1197l57690a18143k9193A01193J18711
15860B19904C2403b8203j31251j22325B6067b61663a22142A64907C6118a06841
$$ y = [5169, -321976, -48147, -117611, 61425, 125457, 103827, 4060, 150981, -103841, 66590, 162904, -162931, 145422, 4891, -69163, -154527, -436492, -148942, 254441, -45362, -154664, -37177, -39485, -61899, -245417, 208858, -247931, 255271, 176343, -51124, -58199, -184736, -296452, -337841, -22187, -214720, 23825, -76589, 9362, -376320, -260040, -189264, -146678, -66490, 338194, -111073, 91641, 1485, -344858, -111607, -128631, 61990, -257125, 97705, -83090, -501724, 26342, -224620, 197219, -218068, 223630, -61888, -338164, -48105, -65011, 147179, -314378, 76942, 93159, -55437, -96634, -454324, -118143, -147336, 101193, 219904, 32403, -28203, -159454, -281779, 26067, -261663, -122142, 164907, 36118, -106841]
15849A83418l0657a72852G013b46696G2832B626a62190e2852P39j61948B72339
15837A59885n3969d1355H1001A2994N0812a01652m1197d7910p4694B20898D9992
15825f4267j84287J07314q240L1576j10259A18660R8157b27589I0262R0118n2265
15814A28115A4221a31444E7064F700L31695f619j4012D03519f53899b84291f039
15802A04172c12095B3981J16996K72332a68705h0143o3964B19301f1263j4444
15792g5707A89278b0837k67418P1650k1501B66297j25311Q603E1911a31897j2235
15781a44132q8733a6680n5883r0369H5825m763J8543b4959F0647b00691d702k9172
15769c3874j19467c9792a3050G9204J68372c1803j55481h6565B69238b6033j79814
$$ y = [183418, 152761, -172852, 7013, -246696, 72832, 2626, -162190, -52852, -52113, -214061, 272339, 159885, 105916, -41355, 81001, 12994, 63806, -101652, -142849, -47910, -122604, 220898, 49992, -64267, -248554, -141240, -149480, -117904, -228163, 118660, 216817, -227589, 90262, 180380, 128115, 14221, -131444, 57064, 6700, 338395, -6619, -20631, 403519, -653899, -284291, -6039, 104172, -312095, 23981, 140977, 413309, -168705, -80143, -144107, 219301, -61263, -75707, 189278, -20837, -288255, -216605, -238106, 266297, 140986, 149589, 51911, -131897, -144132, -232865, -16680, -72563, -162932, 85825, 81062, 99605, -24959, 60647, -200691, -4702, -33874, -153341, -39792, -13050, 79204, 247576, -31803, -187284, -86565, 269238, -26033, -205847]
15758b05847G649P6704a75491a6906m4157B3005J68769G518M9394h6060o4058
15747a50118A25051i8342A61658J83655J00476B17905b27188m4024d6420A32811
15736b63211i1571B2753J22442b13009j24967A91140a23637d2709A5366b10645
15725A6306K22649j2635h0863j0172k41899a09939A3300O0700Q3032c42086A40619
15713b04011A0982a06155l7329B20246b61232N9662D4756A4128a76624A96520
15702B09904b28566d0255j26001l816o2528b7329A73104E203a55261B2878O2919
15691H5797C7724f0619q5378A11128c33108A85903J6752a15452a3466k0935F0228
15679b36450c6830A04745l637K599a09932p3963E2784a16939R944M3193B76447
$$ y = [-205847, 7649, 84353, -175491, -16906, -61063, 23005, 191774, 7518, 56912, -86060, -150118, 125051, -98342, 161658, 345313, 445789, 217905, -227188, -271212, -46420, 132811, -263211, -91571, 22753, 145195, -213009, -337976, 191140, -123637, -42709, 15366, -210645, 16306, 238955, 226320, -80863, -91035, -332934, -109939, 13300, 74000, 157032, -342086, 140619, -204011, 10982, -106155, -143484, 220246, -261232, -201570, 44756, 14128, -176624, 196520, 209904, -228566, -40255, -166256, -170072, -232600, -27329, 173104, 5203, -155261, 22878, 85797, 37724, -60619, -145997, 111128, -333108, 185903, 202655, -115452, -13466, -34401, 60228, -236450, -36830, 104745, 101108, 103707, -109932, -183895, 52784, -116939, -106995, -63802, 276447]
15667B81387A31436n1887B1170b51996F881J2107h9456G0152c28235J04459a10949
15655A69319a8030A71009F3369J78952a9795A84822e3691j34840c5502j08254
15645a43756C015b2991A21842i5770m5798A69010M8671f8826A39218b98024I0196
15633C2608a16119H5351c55229A71442B7903J85427F9382J60507I8375a6331A73587
15621E1446M4453a8240A72233E9368J47001a0262j924l49784F2674d795j25337
15610a30132k6010l5592A26844a10092j04838b4028E9982J43011c59831l4953
15600c94784C2362L7445J96497a19672G2308e4734K7220j62277B77557a69300
15589a86417p6502j59471c1284A19227J42996I1969Q0661b34144f8108D46123
$$ y = [281387, 131436, 79549, 21170, -251996, 6881, 18988, -89456, 70152, -328235, -223776, -110949, 169319, -18030, 171009, 63369, 242321, -19795, 184822, -53691, -188531, -35502, -143756, 3015, -22991, 121842, -95770, -141568, 169010, 217681, -68826, 139218, -298024, 90196, 32608, -116119, 85351, -355229, 171442, 27903, 213330, 69382, 229889, 98375, -16331, 173587, 51446, 95899, -18240, 172233, 59368, 206369, -10262, -12186, -361970, 62674, -4795, -130132, -156142, -191734, 126844, -110092, -214930, -24028, 59982, 202993, -359831, -394784, 32362, 69807, 266304, -119672, 72308, -54734, -27514, -189791, 277557, -169300, -186417, -262919, -422390, -31284, 119227, 262223, 91969, 172630, -234144, -68108, 446123]
15578A33878b7467j66334C8330f8349C37229a77084l6065B8024A3637a7850B5828
15566a76314D1686c3130A80794i6251K1742j15108G3256J16022m7492b5636B7043
15554h5803r0084l20197K35480F2771L8582c49754J57301h9554A12680m781b16775
15542a0068N67j67129B76981b2057A17087n5356A884M0361i2313k49320I9901
15530F8274L9292O8582p4403J8405f7753j53670d2387A33611b07104O6558r1148
15519b31694l1361g7624g350A26083k4260C4772A0688a62345C0893L2717L2873
15508I6483a13520I8756n811g5741m18053J90458A63479a88277j62785a45362
15497A12831R1297b06420I8528B7414c52768B08402E4754i3153j86735J08424
$$ y = [133878, -27467, -193801, 38330, -68349, 337229, -177084, -213149, 28024, 13637, -17850, 25828, -176314, 41686, -33130, 180794, -96251, -74509, -189617, 73256, 189278, 141786, -25636, 27043, -85803, -175887, -496084, -260604, 62771, 101353, -349754, -192453, -89554, 112680, 107899, -216775, -10068, -9501, -176630, 276981, -22057, 117087, 61731, 1884, 42245, -92313, -341633, 99901, 68274, 107566, 176148, 101745, 120150, -67753, -221423, -42387, 133611, -207104, -140546, -231694, -263055, -77624, -7350, 126083, 101823, 34772, 10688, -162345, 30893, 63610, 96483, -113520, 98756, 92945, -75741, -493794, -303336, 163479, -188277, -351062, -145362, 112831, 204128, -206420, 98528, 27414, -352768, 208402, 54754, -93153, -279888, -171464]
15487a71464B11395J20564c41427b1864A7316a77041F4089J43378i9634k30788
15477c30422b9350G4053b83135a5344E2583f0351B5107J28581c13050g9504o372
15466h5876M0265m2149j59097g8241a2699I0865a01346p8449f5573k7932J1231
15455h2274K9944E2442c0276A7148K11478J617a71699B13011R1197i4644g767
15443d2385l3745F7944M3155c3888A49780l4215b01208B667e9583k72103A98230
15431B84159d8098B13045k0849c7562B91822I5376b73280b449I3778K99858a991
15419C06059A502c0298k50192F862c33506C4125i7114E2945b5521j18220A28170
15407F0957L8016a52545a9389j89639B04904F3056J84661b66192B87847a70961
$$ y = [-171464, 211395, 331959, -341427, -21864, 17316, -177041, 64089, 207467, -99634, -330422, -29350, 74053, -283135, -15344, 52583, -60351, 25107, 153688, -313050, -79504, -85876, -45611, -87760, -246857, -78241, -12699, 90865, -101346, -179795, -65573, -93505, -82274, -52330, 52442, -30276, 17148, 228626, 230243, -171699, 213011, 304208, -94644, -7767, -42385, -76130, 67944, 111099, -33888, 149780, 115565, -201208, 2667, -59583, -331686, 198230, 284159, -48098, 213045, 192196, -37562, 291822, 95376, -273280, -2449, 93778, 393636, -1991, 306059, 1502, -30298, -280490, 6862, -333506, 34125, -97114, 52945, -25521, -143741, 128170, 60957, 98973, -152545, -19389, -209028, 204904, 63056, 247717, -266192, 287847, -170961]
15396A24096f1357E9145a37564B38674b2297o3839j48740E8445d12359A18926
15385b91699A19459c8411E2012R079b45328j7363d1613B26424n1800b64413A63019
15373a72532n3970A08271j8970J5064M5704b10917A22037b91570O4667B26247
15362b7800B78700A1894L04688G4613h7893j16961A15350j036J98341h457I1356
15350a55062A94269c49686B21003E2383J73953g9665B28631n3284a1069q4625
15340i5694H9089K65352A3235b51591B19340A1629J4237a17385A94386p2482M32512
15329E54416a16942j23277Q3743l60168b32378A94405d6369A07544J19758o9525
15319A57777d3358B05560a44332A18792a83041F0311M3047j9447B5310e4755B26445
$$ y = [124096, -61357, 59145, -137564, 238674, -22297, -86136, -234876, 58445, -412359, 118926, -291699, 119459, -38411, 52012, 61091, -245328, -262691, -41613, 226424, 174624, -264413, 163019, -172532, -226502, 108271, 89301, 104365, 150069, -210917, 122037, -291570, -226903, 226247, -27800, 278700, 11894, 316582, 74613, -87893, -204854, 115350, 114314, 312655, -8457, 91356, -155062, 194269, -349686, 221003, 52383, 226336, -79665, 228631, 175347, -11069, -95694, 89089, 354441, 13235, -251591, 219340, 11629, 25866, -117385, 194386, 121904, 554416, -116942, -240219, -156476, -516644, -232378, 194405, -46369, 107544, 227302, 157777, -43358, 205560, -144332, 118792, -183041, 60311, 103358, 83911, 25310, -54755, 226445]
15307B74141A29335J59322o752j3870A25092a5504n5005C08323A27106F098i7888
15295D1038b20141O4340F8274a3862A26591b22919B4713a48835B83373O3434a34409
15283b6856A44067E922L34844A64307G6407b8499A5116R2324C3230a45613A73874
15271b2876A2220g1936r8487B40826Q6915F0784K4577c1636l5567B87919F2110
15259B40699a66857K1359c6796C47854A39929E3891L6917J2902K7546O9257L72846
15248E73359K54814J003000q8002j64744O1496k84330D87205p8196I7795M24792
15238E22587j41527G9204J61062a62407A36077h7322k74582A90081g3741A04296
15227B82148B5505c91435C69556j52379k3417Q2542j23142b31148G4153J14649
$$ y = [274141, 129335, 288657, 281905, 268035, 125092, -15504, -70509, 308323, 127106, 6098, -97888, 41038, -220141, -155801, 68274, -13862, 126591, -222919, 24713, -148835, 283373, 346807, -134409, -26856, 144067, 5922, 340766, 164307, 76407, -28499, 15116, 107440, 33230, -145613, 173874, -22876, 12220, -71936, -170423, 240826, 327741, 60784, 85361, -31636, -67203, 287919, 62110, 240699, -166857, -145498, -36796, 347854, 139929, 53891, 90808, 103710, 131256, 200513, 573359, 828173, 1831173, 1743171, 1578427, 1639923, 1355593, 487205, 409009, 97795, 522587, 381060, 79204, 240266, -162407, 136077, -87322, -361904, 190081, -73741, 104296, 282148, 25505, -391435, 369556, 217177, 193760, 276302, 153160, -231148, 74153, 188802]
15217A88802K8238c667G7883l6384L59230d7002A19055a49633F7313J52614D9470
15205I2640J1624J49072p5344m0954F4521P1971a26583g19H1028d5277B45274
15193d128I3988N5810L1922E7168K34338a48382F4349a68285Q1428A06574E536
15181F3761i0359q5774g1388G0266c2899C26625j26213i3869j2144A24450J51164
15170B75614n4768k6073M1382a95796H4551K85178j36792A15800M16227f1387
15159A18602Q011K97569G3987J56484k9670f2874K7121A75990a74322A37333l4737
15148A02596N6131K86594B21947J48847A23846a46917j81144C52513H1102h848
15137h6956b6556B86492a72322B55576r2678d5503A58345N4084G1465K22982A25944
$$ y = [188802, 217040, -3667, 77883, 41499, 400729, -47002, 119055, -149633, 67313, 219927, 49470, 92640, 104264, 253336, 177992, 137038, 64521, 136492, -126583, -719, 81028, -45277, 245274, -4128, 93988, 149798, 181720, 57168, 291506, -148382, 64349, -168285, -86857, 106574, 5536, 63761, -90359, -176133, -71388, 70266, -32899, 326625, 200412, -93869, -106013, 124450, 275614, 220846, 194773, 236155, -195796, 84551, 369729, 232937, 115800, 532027, -61387, 118602, 126613, 424182, 73987, 230471, 200801, -62874, -35753, 175990, -174322, 137333, 102596, 158727, 445321, 221947, 370794, 123846, -146917, -328061, 352513, 81102, -8848, -86956, -26556, 286492, -172322, 255576, 162898, -45503, 158345, 212429, 71465, 294447, 125944]
15125B92177k318j4732l7424o207K6292j13079f3615B54725J94617A74210A2508
15113G1417h9882j48005B84062b18281A44800J47294E1558k3135J31081O9333
15103B28837k7208m2251G3795g6026C09921E9338R8280K55877p2008J88450A63593
15091E2180K71590A36832J10760j11508a63127B13958q8364M7159a02413A88499
15080B4398J80075a72275C58241C5993a05712D5398K38730K3069j22425L71577
15070E56349A28743f5427A99780R7672a18369A19765a63506e8986B53737H8610
15059a46903B43049A04396M89903D7249B0252K65800j12808p8321a1419B31986
15048b3845B78889A16699J55510K34696j12767j70776M5507d6705A44109M99177
$$ y = [292177, 289859, 275127, 237703, 231496, 257788, 144709, -63615, 254725, 449342, 174210, 12508, 71417, -89882, -237887, 284062, -218281, 144800, 292094, 51558, 28423, 159504, 228837, 201629, 159378, 73795, -76026, 309921, 59338, 157618, 413495, 341487, 529937, 163593, 52180, 323770, 136832, 247592, 136084, -163127, 213958, 125594, 172753, -102413, 188499, 24398, 204473, -172275, 358241, 35993, -105712, 45398, 284128, 307197, 184772, 556349, 128743, -65427, 199780, 297452, -118369, 119765, -163506, -58986, 253737, 88610, -146903, 243049, 104396, 594299, 47249, 20252, 286052, 173244, 94923, -11419, 231986, -23845, 278889, 116699, 272209, 506905, 394138, 223362, 268869, -46705, 144109, 643286]
15038F43286f6733B81174J14274b05813A8347L20525F0482b645B47552N4427A28728
15026A20937O6588J769I2577J04417e0564A26705L9599M62540A00032O6885J94715
15015C61632C2703N40401B0052L16416A66053n4021n1881J80090h1272A75505
15004C02J83539A1271K31723b6829B9183a0656C17065a46595D27850d8482A44878
14992A97060e9562I6977O2926b1080l4092E64127i5685a7588B27498N0443p9795
14981A98146Q9636F6731Q3647J08196l4279L88308B24653K66116j62291j61828
14971A66650J15388M00060H1935L44979p9350p3938L0250J92651j11865D6927
14960A81064O5593F0120K84514I759N56197j53266j84364J04860O1598J90a2095
$$ y = [643286, -66733, 281174, 395448, -205813, 18347, 338872, 60482, -2645, 247552, 301979, 128728, 120937, 187525, 189294, 92577, 196994, -50564, 126705, 166304, 628844, 100032, 166917, 361632, 32703, 573104, 20052, 336468, 166053, 112032, 60151, 240241, -81272, 175505, 302, 183841, 11271, 242994, -26829, 29183, -10656, 317065, -146595, 427850, -48482, 144878, 197060, -59562, 96977, 159903, -21080, -55172, 564127, -95685, -17588, 227498, 277941, 198146, 287782, 66731, 150378, 258574, 224295, 612603, 224653, 490769, 328478, 166650, 282038, 682098, 81935, 426914, 347564, 273626, 303876, 496527, 384662, 46927, 181064, 246657, 60120, 344634, 9759, 565956, 412690, 228326, 333186, 394784, 394974, -12095]
14948B27139A02305g5458B24652P4374p584k9858J10605J48143B43780K26454
14938D70234P8596k00467j62936N1195k8123M51018F5163L67061j37656j22962
14928A71606J93077J56619k43955M3405J10739b7341B2163K70665A26258K3510
14918A49768K03747A73856J43185L4926J7851M65538B17436p6481k166K41331
14908C80120E862L43091J02919l1049j01519n8998L8172J41114J39505A94326
14897B36682E7609M45319E0358J07201F8697J29982J71439l9387j22496K25574
14887D33809q7783A67586L46015j87297j18442D157O03833k61709K04778A64184
14876G26013B10011E8688k5650M50643J7175A54181K44413k3521R3486p9091j47734
$$ y = [227139, 102305, -75458, 224652, 299026, 291442, 261584, 372189, 520332, 243780, 470234, 548830, 348363, 185427, 236622, 208499, 659517, 65163, 432224, 294568, 171606, 364683, 521302, 277347, 320752, 431491, -27341, 22163, 292828, 126258, 149768, 353515, 173856, 317041, 351967, 369818, 835356, 217436, 140955, 138789, 380120, 5862, 348953, 451872, 420823, 319304, 260306, 298478, 439592, 579097, 194326, 236682, 57609, 502928, 50358, 157559, 68697, 198679, 370118, 330731, 208235, 433809, 346026, 167586, 513601, 326304, 207862, 4157, 607990, 346281, 551059, 164184, 726013, 210011, 58688, 33038, 483681, 500856, 154181, 398594, 375073, 468559, 389468, 241734]
14865B41734L45746j47688P3977J68600C03042o7301L58415j73213j88650Q5695
14855C17988M24722J10830k27206P6487K4368A65462L30330k12110M24401k22645
14845D85438H6238L73481j81213K13092B04079L40709O0340j83847K05954C06587
14834B32277L66211m1401J1030m9714j43874Q7239J45236j38357p6746l890K35496
14823F23507k21112k4303L90271C51016J30821j10951J35102o1959N3057K574
14813D99660q0201L13942l27439L41417l09957o2314j19302K84409K14552l10037
14803D44730k2711k3301r7391K89703n715K05665C41311M92784j69558j6395j29140
14792E19002N6541j30391m0616j13669N30215j38230O6989j91549O3028J02794
$$ y = [241734, 587480, 439792, 513769, 682369, 303042, 235741, 594156, 420943, 232293, 317988, 742710, 853540, 626334, 702821, 727189, 165462, 495792, 283682, 708083, 485438, 86238, 459719, 278506, 491598, 204079, 544788, 605128, 421281, 627235, 306587, 232277, 598488, 557087, 568117, 518403, 374529, 461768, 607004, 468647, 391901, 388011, 623507, 402395, 378092, 768363, 351016, 481837, 370886, 505988, 444029, 497086, 499660, 419459, 733401, 405962, 747379, 437422, 375108, 255806, 540215, 754767, 444730, 422019, 398718, 301327, 591030, 585315, 790980, 341311, 834095, 664537, 648142, 519002, 575543, 445152, 404536, 290867, 821082, 682852, 749841, 558292, 621320, 724114]
14782G24114j72387j94833P28518n07390J38800J59041C79856L51354J74266j09097
14772G96379j26553j74463q8540L0671N39143k44366O7924J86566n5585j63881
14762G67295j40503J57130k89323J30702K29409k06883k01034J23449K5874r1382
14752E04734M44961l40680M81628l53705k01763j30970K89954K71113l73551J34550
14742G26271j76920K96633l6197j24279J44613q1798p9948p806K74915l1639k5196
14731H78649J2181j14210Q1171r8140j38481M06373k76542j01504L5879K1058
14721G06434J02292J99141r2482O2659j69382j18948O2400L87801k22599J68827
14711A086143j36365r4132J09909K05222n57756J75973J43760Q7899p8861K11249
$$ y = [724114, 551727, 356894, 1085412, 578022, 716822, 875863, 379856, 731210, 905476, 796379, 669826, 495363, 406823, 437494, 976637, 732271, 800195, 986761, 931176, 767295, 626792, 783922, 494599, 625301, 854710, 647827, 446793, 570242, 596116, 504734, 949695, 609015, 1090643, 736938, 535175, 404205, 694159, 965272, 591721, 726271, 549351, 845984, 809787, 685508, 830121, 748323, 668375, 660569, 935484, 903845, 878649, 890830, 776620, 857791, 759651, 621170, 1027543, 751001, 649497, 685376, 706434, 808726, 1007867, 915385, 978044, 808662, 689714, 752114, 1139915, 917316, 1086143, 949778, 855646, 965555, 1170777, 613021, 788994, 932754, 1020653, 941792, 1153041]
14701A153041l43789K12847l11576P5809J67823M7708J08015n10204L25331J36186
14691A061191j8086k48208K96712j4810k30221K31768k18528M00026F03230M51921
14681A055151o385Q1032M757j5260m5339n8703q7014J41749j02138Q9979L9042
14670A096871K23841l47069M51896o44818P36380m02328K0529Q7154m86663J24475
14660H60268L76449k74974M39988k11776k54412M78370k46770j23183L27469l40487
14650A030942j68367K79861K39584j77542k20393J55045O4321J5247K14341k68712
14640A164327K50419L05668j82263k23944m8254k78931J25977L21511r9625P1342
14630A406227L65663n13821O4706j43633L20025o6543J6924M46862l96240k5093
$$ y = [1153041, 809252, 1022099, 710523, 786332, 954155, 1001863, 1109878, 599674, 925005, 1061191, 1043105, 794897, 1091609, 1076799, 846578, 1078346, 859818, 1259844, 603230, 1055151, 1048766, 1129798, 1134555, 1119295, 1073956, 1015253, 928239, 1069988, 967850, 1057829, 1096871, 1320712, 973643, 1425539, 780721, 1517101, 1114773, 1135302, 1222456, 735793, 860268, 1236717, 961743, 1401731, 1189955, 935543, 1413913, 1167143, 1043960, 1371429, 1030942, 862575, 1142436, 1382020, 1204478, 984085, 1139130, 1203451, 1218698, 1433039, 1164327, 1414746, 1720414, 1538151, 1314207, 1265953, 987022, 1112999, 1434510, 1334885, 1406227, 1771890, 1258069, 1322775, 1179142, 1499167, 1432624, 1449548, 1896410, 1500170, 1475077]
14620A475077R742J78445q5937L3287n6850k4640J84700J77661l33278J48874
14610A707081l59332K56127J00479n18368M91419L70937j62044j47836J91922
14601A930385q195n9488J24267k61410K06587Q8170o958j14487R9583K0002m9780
14590A968676J52859j40645p6654l0610K78205m20415P8164k70985N61432J52109
14580B252136j22327J18988k0908j53879j58636K46820q9163K58523l02774J01281
14570B130061M47066k76886q2757L44279J61771m16435K03123K96924k25152N59000
14560C140994l26665L23003o6583r8317K93585J91952K27092O64753L00160J04787
14550D754761J229089J767592M191668P223368J6174726M940755j9072394q938926
$$ y = [1475077, 1484819, 1663264, 1577327, 1610614, 1553764, 1529124, 1713824, 1891485, 1558207, 1707081, 1347749, 1603876, 1704355, 1185987, 1677406, 2048343, 1886299, 1738463, 1930385, 1922190, 1862702, 1986969, 1725559, 1932146, 2020316, 2013358, 1898871, 1998454, 2018456, 1968676, 2121535, 1980890, 1904236, 1873626, 2151831, 1731416, 1809580, 1538595, 2100027, 2252136, 2129809, 2248797, 2227889, 2074010, 1915374, 2162194, 2073031, 2331554, 2028780, 2130061, 2577127, 2300241, 2217484, 2561763, 2723534, 2307099, 2510222, 2807146, 2581994, 3140994, 2814329, 3137332, 3070749, 2972432, 3266017, 3457969, 3685061, 4349814, 4649974, 4754761, 5983850, 7751442, 11943110, 19166478, 35341204, 40281959, 21209565, 12270639]
14542A2270639l664388l876858j389805n11528k8508k09671l15307M45675q3583
14533B636666l61010N4443k66731L20403J39200L3278K4985l41285M13337k21038
14523B432248K6632j9047K56877N2975O7844l5779p8565J5573L12894j03747j77773
14512B750132j35046J44741Q9811K20767j48226J52077J26722r6197J3812M45368
14502C563961j76736R9003j70225j59780L63112M0745k67501K42918k45511O37758
14492C927744o3413k86536Q9846J08024q7450J6865L10148j19708K19043l2607
14482D081956N5529j58951r9711M31399o4416J10612J18361R6462k36498K78340
14472D613083l94554p9282M54469k01815K90371o2036L15523j77626Q619J51511
$$ y = [12270639, 8606251, 4729393, 3339588, 2828060, 2799552, 2589881, 2274574, 2720249, 2636666, 2275656, 2330099, 2063368, 2383771, 2522971, 2556249, 2581234, 2239949, 2653286, 2432248, 2458880, 2439833, 2696710, 2749685, 2817529, 2781750, 2703185, 2718758, 3031652, 2927905, 2750132, 2615086, 2759827, 2849638, 3070405, 2922179, 3074256, 3200978, 3104781, 3118593, 3563961, 3387225, 3486228, 3316003, 3156223, 3519335, 3560080, 3292579, 3535497, 3289986, 3927744, 3864331, 3577795, 3667641, 3775665, 3688215, 3705080, 4015228, 3895520, 4114563, 4081956, 4137485, 3978534, 3878823, 4310222, 4245806, 4356418, 4474779, 4571241, 4334743, 4613083, 4218529, 4139247, 4593716, 4391901, 4682272, 4620236, 4935759, 4758133, 4766752, 4918263]
14462D918263k44989O04594l59028Q56801k95549j14000J36983j61951K60039
14453E601163k17847L65355J40275K48242n08626L83285J32371K1605K39534n8670
14443F346687m622J51344J12077J1446k07734J63866M04190K78582j5283j8780
14433G221773l54712N97917L60999l90750J45683J22780N1684Q950J29484L99203
14423H293011J19142m01102K75919J12326j02996J07025Q35888J03284l52342
14414H990155M43834k47791K72940K56801j5914K49719k6494N47048k0321o9011
14404A0380966M58540j62690J99869J69898J64179J8259L85021J16642K03899
14395A1934583M74187J11022N1124M6196j7945P10699m7593N12038k16787L21555
$$ y = [4918263, 4673274, 5277868, 4918840, 5775641, 5480092, 5366092, 5503075, 5341124, 5601163, 5383316, 5748671, 5888946, 6137188, 5628562, 6011847, 6144218, 6165823, 6405357, 6346687, 6342065, 6493409, 6605486, 6616932, 6409198, 6573064, 6977254, 7255836, 7240553, 7221773, 6867061, 7464978, 7825977, 7435227, 7580910, 7703690, 7755374, 7764324, 7893808, 8293011, 8412153, 8011051, 8286970, 8399296, 8296300, 8403325, 9239213, 9342497, 8990155, 9433989, 9186198, 9459138, 9715939, 9700025, 9949744, 9923250, 10470298, 10449977, 10380966, 10839506, 10676816, 10876685, 11046583, 11210762, 11229021, 11614042, 11730684, 11934583, 12408770, 12519792, 12570916, 12617112, 12599167, 13309866, 13262273, 13774311, 13557524, 13879079]
14385A3879079M12064M38609p3268K76823K75525P29935k87537L80915N04578
14376A6536723N2253K93201M89437M54544K22611J6821J035166K83288M4445P96337
14366B0224826J42123O62993J82949K10132M96542O91764K09206Q17438L58600
14357B3996573O60856M35560P38352P06944O05322L16641N64124R69843K80352
14348B9274567O21369J160954N98641Q83196J085567Q73925Q29142R08195O39259
14339C6874815J232872J256349Q34815Q51214J261913J709013J076433J437506
14331D6534930J001671J506734J643215J718683J292163J714376J607833K205882
14323E9225487J735935J780698K078748K276411K490224K535261K884004K184163
$$ y = [13879079, 14291143, 14729752, 14656484, 14933307, 15208832, 15938767, 15651230, 16032145, 16536723, 16588976, 16882177, 17371614, 17826158, 18048769, 18065590, 19100756, 19384044, 19428489, 20224826, 20366949, 21029942, 21212891, 21423023, 21919565, 22611329, 22820535, 23637973, 23996573, 24657429, 25092989, 25831341, 26538285, 27143607, 27460248, 28024372, 28994215, 29274567, 29895936, 31056890, 31655531, 32538727, 33624294, 34498219, 35327361, 36235556, 36874815, 38107687, 39364036, 40198851, 41050065, 42311978, 44020991, 45097424, 46534930, 47536601, 49043335, 50686550, 52405233, 53697396, 55411772, 57019605, 59225487, 60961422, 62742120, 64820868, 67097279, 69587503, 72122764, 75006768, 77190931]
14315G7190931K853667L550424L001748L014591L655118L755996L845649M130785
14307A04998909M104063M778140M686230N030419N688628N379487O168958O160638
14299A46995472O922974P037949P483494P849371Q284379R015351R474063R956237
14291B13019290J0314818J1000752J1600382J2106639J2278792J3197895J4012777
14284B97531345J4208579J4394645J5050947J5044845J5182299J5379655J4997647
14277D01789962J4331934J3442732J2583940J0597771Q511819M130375J963216
14270D67351749J641347k848825k505205l292816p144074j0148292j1008533j3003151
14262D19042200j3589780j3904437j3665187j4332966j4500745j4943598j5079364
$$ y = [77190931, 80044598, 83595022, 86596770, 89611361, 93266479, 97022475, 100868124, 104998909, 109102972, 113881112, 118567342, 123597761, 129286389, 134665876, 140834834, 146995472, 153918446, 160956395, 168439889, 176289260, 184573639, 193588990, 203063053, 213019290, 223334108, 234334860, 245935242, 258041881, 270320673, 283518568, 297531345, 311739924, 326134569, 341185516, 356230361, 371412660, 386792315, 401789962, 416121896, 429564628, 442148568, 452746339, 461258158, 465388533, 467351749, 468993096, 466144271, 463639066, 460346250, 453202176, 443053884, 432045351, 419042200, 405452420, 391547983, 377882796, 363549830, 349049085, 334105487, 319026123]
14255C19026123j5130369j4688433j3289161j4039816j3641329j2385646j2369756
14248B23481613j1411158j0800976r951877r608860q568841q402793p900485p782141
14240A49054482o861748o608813n786869n589797n596770n234945m864435m350782
14232A04160323m429023l659707l734191l366769m173404k951245l205390k753782
14224G5886812l064006k567106k809574k138307k241854j874205k193441j835370
14216E7162949k204022j304461j693457j179052j431644j745582j586108j446441
14208D4572182r55889r51265j158843j729559r87459j079658p74473j255782n59047
14199C5120207j092123j055567o53279o25401j313408l68630p65408n38002o33000
$$ y = [319026123, 303895754, 289207321, 275918160, 261878344, 248237015, 235851369, 223481613, 212070455, 201269479, 191317602, 181708742, 173139901, 164737108, 156836623, 149054482, 142192734, 135583921, 129797052, 124207255, 118610485, 113375540, 108511105, 104160323, 99731300, 96071593, 92337402, 88970633, 84797229, 81845984, 78640594, 75886812, 72822806, 70255700, 67446126, 65307819, 63065965, 61191760, 58998319, 57162949, 54958927, 53654466, 51961009, 50781957, 49350313, 47604731, 46018623, 44572182, 43616293, 42665028, 41506185, 39776626, 38789167, 37709509, 36935036, 35679254, 35120207, 34028084, 32972517, 32319238, 31693837, 30380429, 30011799, 29246391, 28708389, 28075389]
14190B8075389r25185q49188o95918n50871q02130k82894r1485q99128l87208
14181B2591382m95761p16503j70567o47944l38913j09292n78689n32790l44148
14172A8656775m57980l96086J0991m77256k49389m40839j95870k57056o68816
14163A5524474K49878q22770J92918o63859k49696L25467l42437n91241M946n29735
14153A3097945K91473n03473k07109n4761o86205K34000m21479j96654m40943
14144A1112794L3783j51759k99958l45454L24989k64178j30283k47173q5481k73969
14134I673311K02359j94964m88427j83916m0927J12107l70483l02264k55550M47713
14124H598959m36682j96662M19343m38464r4004o9844L4216k6964l61033r888
$$ y = [28075389, 27150204, 26301016, 25605098, 25054227, 24252097, 23969203, 23877718, 22978590, 22591382, 22095621, 21379118, 21208551, 20560607, 20221694, 20112402, 19533713, 19000923, 18656775, 18198795, 17802709, 17813700, 17336444, 17087055, 16646216, 16450346, 16193290, 15524474, 15774352, 14951582, 15144500, 14480641, 14230945, 14556412, 14213975, 13622734, 13627680, 13097945, 13389418, 12885945, 12678836, 12624075, 11937870, 12171870, 11750391, 11553737, 11112794, 11146577, 10994818, 10694860, 10349406, 10674395, 10410217, 10279934, 10032761, 9947280, 9673311, 9875670, 9680706, 9192279, 9008363, 8967436, 9079543, 8709060, 8406796, 8151246, 8598959, 8162277, 7965615, 8384958, 7946494, 7852490, 7782646, 7816862, 7789898, 7428865, 7418977]
14114G418977j06488r2856l56710M7955N929k24739Q2161j18194J68002k54142
14104F569895j99463J04996k98664p4161K2416o9875j75718O1619j31604J55398
14094E964839K07927l78396k15256j17638m5336J68218l26806r7637O0569p7006
14084E143478q1510K23325k89326L66308M3420m66991L0759L2664k01522j03137
14074D697468M7918k15988L3526j96613O2292J8329J90946m41890Q359J02657
14064D307004j34072J68512l4159n3592k14676J35865j68110j12744K73458o0363
14054D107123j86899j81185o687j48867J58189k75625K32738p0451k46791K66127
14044C647672k15039j1604n06003M02183L01535j10771j35782m85537M08510k98499
$$ y = [7418977, 7312489, 7219633, 6862923, 6910878, 6916807, 6692068, 6774229, 6656035, 6824037, 6569895, 6370432, 6475428, 6176764, 6102603, 6125019, 6055144, 5879426, 5941045, 5809441, 5964839, 6172766, 5794370, 5579114, 5461476, 5416140, 5584358, 5257552, 5159915, 5220484, 5143478, 5061968, 5285293, 4995967, 5362275, 5405695, 4938704, 4969463, 5002127, 4800605, 4697468, 4745386, 4529398, 4562924, 4366311, 4428603, 4446932, 4637878, 4195988, 4204347, 4307004, 4172932, 4341444, 4307285, 4253693, 4039017, 4174882, 4006772, 3894028, 4167486, 4107123, 3920224, 3739039, 3732352, 3583485, 3741674, 3466049, 3698787, 3628336, 3381545, 3647672, 3432633, 3421029, 2915026, 3317209, 3618744, 3507973, 3372191, 2886654, 3295164, 2996665]
14034B996665K05975j54025j8057q887L93192l02771r0670L62073j83014m15294
14024B785187J07321J00889k7105J13921k52166n2307o8262J78098l14552J27500
14014B698524L5616o12852N23523j21018n0126K66022j99551k80953J56850K69082
14004B685117n04968L18763j23188k929j9338K2647l3184o868J09492j19027M02120
13993B728637N530j35162J37238N45002Q80254K993132O290836J5804131J1420016
13984D0669614j4706498j1744346n469254k349107q01997j290006k99724l20301
13976C688381l39973M1135j76656r42k90480j53754m32530L18833l15358L66640
13966B705296l56841j39798J75784m6342K1926j62718l32941L95835j06515j11160
$$ y = [2996665, 3202640, 3048615, 3030558, 3021671, 3414863, 3112092, 3021422, 3383495, 3200481, 2785187, 2892508, 2993397, 2966292, 3080213, 2828047, 2775740, 2707478, 2885576, 2571024, 2698524, 2734140, 2121288, 2644811, 2523793, 2473667, 2739689, 2540138, 2259185, 2416035, 2685117, 2180149, 2498912, 2375724, 2372795, 2353457, 2376104, 2342920, 2336052, 2445544, 2326517, 2728637, 2734167, 2599005, 2736243, 3281245, 4161499, 7154631, 13445467, 29249598, 40669614, 25963116, 14218770, 8749516, 6400409, 5598412, 4308406, 4008682, 3688381, 3348408, 3389543, 3212887, 3211945, 2921465, 2767711, 2335181, 2654014, 2338656, 2705296, 2348455, 2208657, 2384441, 2338099, 2360025, 2197307, 1864366, 2260201, 2153686, 2042526]
13956B042526j47263K23035k03017J15046l87197L99728p1095n02510N59517m98500
13946A530270L77190J13335l12777q7430N9715J54717J1438P5868j01203k9428
13936A791695j25935J82802O471j30368K30571m04784J10482R0495N9054n13416
13926A297067K29846K16437o3572l41548O3151M92441m16721K06934j66945k03151
13916A313939O7606K00465j81214K32612m57079K43339o244l38692K49536Q4268
13906A408536R6308m1735q4199L1088k8206K05207j83331L2706j24679k10575
13896A101120M61994l40161R2571K33809k49036J05531j02734K95321j59364j21294
13886A317757J63495j00350j56399l9894L8924R5108j6787j00972j05397J35463
$$ y = [2042526, 1895263, 2118298, 1915281, 2030327, 1643130, 2042858, 1971763, 1469253, 2028770, 1530270, 1907460, 2020795, 1708018, 1620588, 1680303, 1835020, 1846458, 1922326, 1821123, 1791695, 1665760, 1848562, 1855033, 1724665, 1955236, 1550452, 1660934, 1751429, 1810483, 1297067, 1526913, 1743350, 1679778, 1338230, 1401381, 1893822, 1477101, 1684035, 1517090, 1313939, 1381545, 1582010, 1400796, 1633408, 1176329, 1419668, 1413424, 1074732, 1324268, 1408536, 1504844, 1463109, 1378910, 1409998, 1381792, 1586999, 1403668, 1436374, 1311695, 1101120, 1563114, 1222953, 1315524, 1549333, 1300297, 1405828, 1303094, 1598415, 1439051, 1317757, 1481252, 1380902, 1224503, 1184609, 1223533, 1318641, 1301854, 1200882, 1095485, 1230948]
13876A230948j69894K78617J5315K5702k49814K31766O4564r4769N3480k02129
13866A183786j08349M5676P1243j11617J62121m9753l53865M08448j61205M19729
13856A506214m47007o5372O4757j06699m5063K74869p304J36629j59649J32310
13846A283685j76079R3292j23583m2102J38996j82022k64605L11769K8608L4969
13836A102928j96072j21600L79877k35158q0307J44113r0927J49059l46090j40633
13826E65190L13959L03841l30005K40994k07207j39920o1910J87313p5013o4137
13816G33105K52870P1142r624N1961k87690o1138j38636J78427K8655n2912j19494
13805F46666K03965K12543R5288k19069K65709n46908M78319l91626K52094P5165
$$ y = [1230948, 1061054, 1339671, 1354986, 1380688, 1130874, 1362640, 1427204, 1332435, 1385915, 1183786, 1075437, 1121113, 1192356, 1080739, 1242860, 1193107, 839242, 1247690, 1086485, 1506214, 1059207, 993835, 1058592, 951893, 906830, 1181699, 1174395, 1311024, 1151375, 1283685, 1107606, 1200898, 1077315, 1035213, 1174209, 992187, 727582, 1039351, 1067959, 1102928, 906856, 785256, 1165133, 929975, 849668, 993781, 902854, 1051913, 705823, 565190, 879149, 1182990, 852985, 1093979, 886772, 746852, 684942, 872255, 797242, 733105, 985975, 1057117, 1047493, 1099454, 811764, 750626, 611990, 790417, 819072, 766160, 646666, 850631, 1063174, 1158462, 939393, 1205102, 658194, 1136513, 744887, 996981, 1072146]
13795A072146j22881J4328k54073J51901K77561j18264j32351r1283j27260k43888
13785D25936L01534O1175L66715l49731k30185K9797M42347m76655J41528R6421
13775H08882l41676L41963k16475J7572M9793k7258n6042j14581M00715k6354
13765H36539k63681K38684J57969k80727j55523J57491p5356M5956K50783k41998
13755F70137O0471C12241K78412I1653P52211k9531k98103A21154L59190N60152
13745A040496j00827j68162j84965N7019O9502J74151r7054k70283K45796j56668
13735F09005P4586C02784O32825B93423K56513L5986J63822j86655K56094k06060
13725F13123P6892r6082B45692M82499j16507j44182M82962j58631l49406O5095
$$ y = [1072146, 949265, 963593, 709520, 861421, 1138982, 1020718, 888367, 797084, 669824, 425936, 727470, 788645, 1155360, 805629, 575444, 605241, 1047588, 570933, 712461, 808882, 467206, 809169, 592694, 610266, 660059, 632801, 576759, 462178, 862893, 836539, 572858, 811542, 969511, 688784, 533261, 690752, 615396, 661352, 912135, 670137, 730608, 312241, 590653, 91653, 843864, 814333, 516230, 121154, 480344, 1040496, 939669, 771507, 586542, 643561, 713063, 887214, 790160, 519877, 765673, 609005, 683591, 302784, 935609, 293423, 549936, 585922, 749744, 563089, 819183, 613123, 690015, 593933, 245692, 728191, 611684, 467502, 950464, 791833, 442427, 507522]
13715E07522K1159n7596J60463j1751r222p6837K76442k18415J618k81464L29832
13704F41751K9671B97047Q1927K60006N4593L25590A33431K33336K59565p7419
13694E48913j09560K07775j47362k23606n9994N68148j72593j61063n5750J30203
13684E25111J98647j84474J83892k05964O282k45910J19623J89857Q1065B70492
13673C67541P5267o4183o9592O1336L16566C41918M14933l63102J03916J50721
13663F48386j06395J96587k98111N9699k4615j554j0947L7910j08633J31701A13934
13651E76298j40813K8684j16825J75906K39152k99105j05621A11850K23064l3966
13641C00948q1271L69244j64728j46836K37411j28980L80575j76437m0617j86045
$$ y = [507522, 528681, 471085, 631548, 619797, 610575, 533738, 810180, 591765, 593383, 311919, 641751, 671422, 297047, 378974, 638980, 693573, 1019163, 133431, 366767, 626332, 548913, 439353, 647128, 499766, 276160, 216166, 784314, 611721, 450658, 394908, 525111, 723758, 539284, 723176, 517212, 523494, 277584, 397207, 587064, 668129, 270492, 367541, 442808, 378625, 309033, 370369, 686935, 341918, 756851, 393749, 497665, 648386, 541991, 738578, 440467, 500166, 475551, 473997, 463050, 500960, 392327, 524028, 113934, 576298, 435485, 464169, 347344, 523250, 762402, 463297, 357676, 111850, 334914, 300948, 219677, 588921, 424193, 277357, 514768, 385788, 766363, 589926, 549309, 363264]
13631C63264l0384M22028E4550L5690N26082n4841B26888o0462J13210J98927
13621D78563C6949N06733A01666L46669R5309k14410m5899J47299J90976Q0942
13611G02552k67383K70271F3365K44844m7478K5326J47765j22939B7526K66176
13601B93702K1236K74552j14449n4810k4403m4888L795n9426J34408M7987p7639
13590D00065p2556J44038o8765A65281K53536J18999A43474J69046A55783L43830
13580D99613k06163L7796N6630j89897L16974A45598N14208k84095R5103p614
13570D63200l0632B0535L67711q583L11335l44530J85782A68641J6260R6674J9468
13559C01043K08075k1799j48543M730J45539H3616J18452J21327K92234B39331
$$ y = [363264, 332880, 754908, 54550, 90240, 616322, 561481, 226888, 166426, 279636, 478563, 36949, 543682, 101666, 448335, 543644, 329234, 283335, 430634, 621610, 702552, 435169, 705440, 63365, 308209, 260731, 286057, 433822, 310883, 27526, 293702, 314938, 589490, 475041, 420231, 395828, 350940, 354735, 295309, 429717, 477704, 400065, 327509, 471547, 402782, 165281, 418817, 537816, 143474, 312520, 155783, 499613, 293450, 331246, 387876, 197979, 514953, 145598, 659806, 375711, 470814, 463200, 432568, 20535, 388246, 379663, 690998, 346468, 532250, 168641, 184901, 281575, 301043, 509118, 487319, 338776, 343506, 489045, 83616, 202068, 323395, 615629, 239331]
13548E08909m045j39856M5673J63802J8754j28580j78063B3405L74299j30377
13538B67327A3600N21790m6643k23335k2619K53371I6855e502C50970A03090M34624
13527E37714b21424a09830C24223L02962B92040e2271E71177k60218j46654a06868
13516A78824O0258L51429k31421Q5329B6865J73801N1595B4934L26706P0332l3397
13505C88575k0161j67947J55531p7249J57289K17802B02910r3436P5823O4428
13495B49725o5302M0577k6594O41253e2526F41869A58765J69939F57K36876J26538
13484C64071K13501j14547q3041n297Q7082M4217A21603L05246j58989J51144
13474D19004A415K40698C2432J58251J19863p0497M1734a24195f852A82099b78870
$$ y = [508909, 504864, 365008, 410681, 574483, 593237, 464657, 286594, 23405, 397704, 267327, 13600, 535390, 488747, 265412, 242793, 496164, 96855, -5502, 350970, 103090, 537714, -221424, -109830, 324223, 627185, 292040, -52271, 571177, 310959, 164305, -106868, 178824, 239082, 590511, 359090, 444419, 26865, 200666, 252261, 24934, 351640, 421972, 388575, 368414, 200467, 355998, 278749, 436038, 653840, 202910, 109474, 185297, 249725, 184423, 225000, 198406, 839659, -52526, 641869, 158765, 328704, 657, 237533, 364071, 577572, 463025, 379984, 374687, 461769, 505986, 121603, 426849, 267860, 419004, 1415, 242113, 32432, 190683, 310546, 240049, 281783, -124195, -6852, 182099, -278870]
13462E33089j46534j09326B9396M4142R7473J43855h508k60789e0762c483B30676
13450C01550J33715K31718B64353k0812Q7556A24296j9629D6087M10290k27152
13440B29225a8280A91586K94625A42645L62602j50830m1161a61997B15213r6227
13430A18986n1382D686K90741p9414R7352J05749H1530K48180j48055O9832O8055
13419C19542q1750L62138A30514L94006D9931K36494a33597C83647h440A28482
13408A36221L17415J18987j59439A10353K56500c42476B93241A24731M11353A08230
13397C43114k03A64370M795q1442L87181E4841M09761j19577J32548B10991j1299
13386A99692r17I1892J07116J1754o4746J27280K33985A12570K07591J25109A02417
$$ y = [533089, 386555, 277229, 29396, 73538, 171011, 314866, -8508, -269297, -50762, -3483, 230676, 301550, 435265, 666983, 264353, 243541, 331097, 124296, 104667, 46087, 456377, 229225, -18280, 191586, 486211, 142645, 505247, 354417, 313256, -161997, 215213, 118986, 67604, 4686, 295427, 216013, 313365, 419114, 81530, 329710, 181655, 251487, 319542, 237792, 599930, 130514, 524520, 49931, 286425, -133597, 383647, -8440, 128482, 136221, 453636, 572623, 413184, 110353, 366853, -342476, 293241, 124731, 536084, 108230, 343114, 342911, 164370, 169165, 87723, 474904, 54841, 464602, 345025, 477573, 210991, 199692, 198775, 91892, 199008, 210762, 146016, 273296, 507281, 112570, 320161, 445270, 102417]
13374D43627C3713J90231a9425o5677A19524K28650A20089J17619J86109A47599
13363D14226A49868m8187J47260J17973B3760N45033A75771J89643j46365L5730
13353B54779B4900f7998A31323J73729K80703k58942j08470R597j5584M59822
13343F72178D9456K0747L36485J1299A74350R0067b89854C24513L509J08251A57570
13331E96597k31908j37204M5266J1285g3769C92645E653K2963b91451A02041L31214
13320D33255A4657M79622B06500J06037M115K5052j19393N107a05050K160D44308
13308A34516K31602c26157B47928J03375A10848a85187A12356J54177J92923A5358
13297D61086c424B95731H3606r060J92800N6258a05092A42952N5672J1452O3482
$$ y = [443627, 33713, 223944, -19425, -85102, 119524, 348174, 120089, 237708, 423817, 147599, 414226, 149868, 101681, 248941, 366914, 23760, 568793, 175771, 365414, 219049, 254779, 24900, -67998, 131323, 305052, 585755, 326813, 218343, 227940, 212356, 672178, 49456, 70203, 406688, 417987, 174350, 264417, -289854, 324513, 328022, 436273, 157570, 596597, 364689, 227485, 272751, 284036, -73769, 392645, 5653, 28616, -291451, 102041, 433255, 14657, 494279, 206500, 312537, 316652, 341704, 222311, 227418, -105050, -102890, 444308, 134516, 366118, -326157, 247928, 351303, 110848, -185187, 112356, 266533, 459456, 15358, 461086, -3424, 295731, 83606, 74546, 267346, 323604, -105092, 142952, 198624, 210076, 273558]
13286B73558j10266G9240J78282l4286J38459A55323K25104j25586A03999J20590
13276B24589c1913B43975J34410A05491K09912K668Q1492g6207A67302n7289a2256
13264C7989J66000K1804h8612C1220K32145A01486l7975b53741D41665h4585c8033
13252D7141J39714D1898g486G8096K00083M6821l6571a76369A43557a03986A3500
13240G4802a17999A34671J715J41939R8822G2274b48592A01775R367e3416J357
13229e2059B36634F1925d251E4062L70703a94336i2272l8772c5888A30174N8414
13218A88588J27919n3724j7495f8443b2104A23310d1219A32431L45267f1308o2115
13207a23423E2317K33521d2126A02853g4161B46639B3687J76917a84167B64839
$$ y = [273558, 163292, 79240, 257522, 223236, 361695, 155323, 380427, 254841, 103999, 224589, -31913, 243975, 378385, 105491, 315403, 318071, 399563, -76207, 167302, 110013, -12256, 37989, 203989, 225793, -88612, 31220, 263365, 101486, 63511, -253741, 441665, -84585, -38033, 47141, 186855, 41898, -7486, 78096, 278179, 325000, 288429, -176369, 143557, -103986, 13500, 74802, -117999, 134671, 136386, 278325, 377147, 72274, -248592, 101775, 111142, -53416, -52059, 236634, 61925, -4251, 54062, 424765, -194336, -92272, -131044, -35888, 130174, 188588, 316507, 262783, 245288, -68443, -22104, 123310, -41219, 132431, 477698, -61308, -123423, 52317, 285838, -42126, 102853, -74161, 246639, 23687, 200604, -184167, 264839]
13196C04907e7844A50446m3097Q8375o3456k4169O9380K84422C313i5199I5461
13184A02339J11898a9833E11894G481L65259E2882O077L9154L63729b07071J6650
13173a90421A28320d9739E1423K53829A0835J13860a33167d1821q1423j14651
13163b37895P7786B57240I3767E551K02305K3092a8970A07771B4036K01039h028
13151B95458C8669J59895j2747H387a27202C02989D1558b23679E15317B21734
13140b06209A60826L0250r3569p965J62149b90359A04579J3739b7131p3954K1826
13129g9259E7860A8837K67307H599M03306A85101e8794a4143j9706m9529m0234
13118a23612k8430F7660L92566h0989A85028K8230j6684G9243J67826B0609d4457
$$ y = [304907, -57844, 150446, 107349, 195724, 132268, 108099, 177479, 461901, 3313, -95199, 95461, 102339, 214237, -19833, 511894, 7481, 372740, 52882, 58959, 98113, 461842, -207071, -190421, 128320, -49739, 51423, 305252, 10835, 124695, -133167, -41821, -123244, -237895, -160109, 257240, 93767, 5551, 207856, 230948, -18970, 107771, 24036, 225075, -8028, 295458, 38669, 198564, 185817, 8387, -127202, 302989, 41558, -223679, 515317, 221734, -206209, 160826, 191076, 97507, 89542, 251691, -290359, 104579, 118318, -27131, -101085, -79259, 57860, 18837, 286144, 8599, 411905, 185101, -58794, -14143, -33849, -83378, -123612, -152042, 67660, 460226, -80989, 185028, 213258, 196574, 79243, 247069, 20609, -44457]
13106F8461J25612H9400k8567B1467J27341b06345C97679a49722H4108L72628
13096D56736C0751b9166A85897r1038b58031A30964C0776K97895j06218P8432
13086C00885d4193A18558a07330E28098k40339a43412A41757F8250Q7789O2459
13076B18498g5332l6225C3430K04227o3816J65375a04064g111j65816F7761M9281
13065A17042J49920j4053d298C38356H7424K7517c573j23441C00040k9863j5402
13054B54775C0007J60998o1684n4560J84985c70636G3194R9927C7534J5142R6060
13043A48736J1353l6617o469e1763J9740B42761D0182J70555i2214G1986L5961
13032A07947r00A3398K57015D0703M0131h1795q4178A23267A1853N0079M9793
$$ y = [68461, 194073, 89400, 60833, 21467, 148808, -206345, 397679, -149722, 84108, 456736, 30751, -29166, 185897, 94859, -258031, 130964, 30776, 328671, 222453, 300885, -44193, 118558, -107330, 528098, 287759, -143412, 141757, 68250, 156039, 218498, -75332, -111557, 33430, 237657, 173841, 339216, -104064, -7111, -172927, 67761, 117042, 266962, 252909, -4298, 338356, 87424, 114941, -3573, -127014, 300040, 270177, 254775, 30007, 191005, 129321, 74761, 259746, -370636, 73194, 173121, 37534, 52676, 148736, 160089, 123472, 117003, -51763, -32023, 242761, 40182, 210737, -92214, 71986, 107947, 107047, 13398, 270413, 40703, 80834, -81795, -165973, 123267, 11853, 61932, 111725]
13021A11725f6883C45567b9121A44K3599L91799c30j3828j19762K9133B52636
13009B61879b04727B01835D9433K71906j46543g5126K9226L07l7249B41894j16576
12998A25318N5557A2517d8458B8455a64122p5106C31333H1327a69718B89465A01827
12986b68972e3854B0297L4737a30458H6560e596B42215h3623A76759K18809I6807
12974D7352b70939a07793A44926J58109C6081K14502a2057j2071D9144f7132E4183
12962a78406A61693l3474a06490A62313K8908G5202N711R7600b14424c9397j31600
12951a70997D6657K1939L6026c6905C63656j32053d4171A4457n942J46582b2901
12939A05610d369C3761j5127h2722A52543D425d0832G0589k3059f5415M968B47315
$$ y = [111725, -66883, 345567, -29121, 144, 23743, 415542, -330, -14158, -133920, -104787, 252636, 261879, -204727, 201835, 49433, 321339, 174796, -75126, -45900, -45593, -82842, 241894, 125318, 180875, 12517, -48458, 28455, -164122, -239228, 331333, 81327, -169718, 289465, 101827, -268972, -53854, 20297, 55034, -130458, 86560, -5596, 242215, -83623, 176759, 395568, 96807, 47352, -270939, -107793, 144926, 303035, 36081, 250583, -12057, -24128, 49144, -67132, 54183, -178406, 161693, 128219, -106490, 162313, 191221, 75202, 80913, 178513, -214424, -39397, -170997, 46657, 68596, 104622, -36905, 363656, 231603, -44171, 14457, 8515, 155097, -22901, 105610, -4369, 33761, 18634, -82722, 152543, 4425, -40832, 70589, 47530, -65415, -60447, 247315]
12926a5260m0394H8072O6522b636D8216K62386D1598K63596G4768e2747l1782
12915h4529r6384C25867A61124i4410F0255a08578B0334J00794a06885B87489
12904B31111F262d31764C52997j30062c4242A69075f5863m2360B70371J22372
12894C92743j75641j01149a52344B95445K25931j52016c60474A15447O6346j052
12884A80741b26908H9731J46656e0641B49143A5361J34796n2403K09227a33487
12873B20296d7339B753b02153g1900C80412d4512B16640H5494g5812B8851b04476
12861C61513F7006A3087K30195d7928D00823A95573b4596j42360M1183a650j27907
12850a29557A13252h9185a0769o0634l4792C3862a25025N630D66458i72j94094
$$ y = [-15260, -55654, 88072, 154594, -2636, 48216, 310602, 41598, 305194, 74768, -52747, -84529, -180913, 325867, 161124, -94410, 60255, -108578, 20334, 121128, -106885, 287489, 231111, 6262, -431764, 352997, 222935, -34242, 169075, -65863, -108223, 270371, 392743, 217102, 115953, -152344, 295445, 521376, 369360, -360474, 115447, 181793, 180741, -226908, 89731, 236387, -50641, 249143, 15361, 150157, 97754, 306981, -133487, 220296, -47339, 2753, -202153, -71900, 380412, -44512, 216640, 85494, -75812, 28851, -204476, 361513, 67006, 13087, 243282, -47928, 400823, 195573, -24596, -166956, -125773, -1650, -129557, 113252, -89185, -10769, -71403, -106195, 33862, -125025, -119395, 466458, -972, -195066]
12839a95066h4361j56108D1187J86871g402D7391J60700I9407M235K42018l8007
12828C07653b34044h1311A03132a28489I3179b1841j93613L2817D7544b30310
12817E2517J78736n1552J81973g4745H2883A6809b29212Q6036M1173A29574o610
12806A22964b02165A25684B5804c70987i5400q964A91806G4149N5199K764J56957
12795B89069I4874a98107c8875m2340A21113n7418g0839l496H0102b20820B6210
12783d4759j77179O8052b7663A36656o2380K09128L5574m3354b84131j00064a73055
12771I4344e2548j38727P7719F8614C1459J53645p1962a31353M2746B51244c3810
12759c0697D1462e0353O673G6137O0297A5985K12814a96371b8035k66182e0085
$$ y = [-195066, -84361, -240469, 41187, 228058, -7402, 47391, 208091, 99407, 103642, 345660, 307653, -234044, -81311, 103132, -128489, 93179, -21841, -215454, -182637, 47544, -230310, 52517, 231253, 179701, 361674, -74745, 82883, 16809, -229212, -143176, -102003, 129574, 122964, -202165, 125684, 25804, -370987, -95400, -104364, 191806, 74149, 129348, 132112, 289069, 94874, -198107, -38875, -81215, 121113, 63695, -70839, -74335, 80102, -220820, 26210, -44759, -221938, -153886, -27663, 136656, 74276, 283404, 318978, 275624, -284131, -384195, -173055, 94344, -52548, -191275, -113556, 68614, 31459, 185104, 113142, -131353, -88607, 251244, -33810, -30697, 41462, -50353, -43680, 76137, 136434, 15985, 228799, -196371, -28035, -294217, -50085]
12747a72419D7195j0314Q4968a28890F7476M4815e3687C3293K31992e6812G9737
12735A12176k8488a4882A18875a48766B76767D056J8232r715c0509A18947e592
12723a66205A18900a61287a7041B49682p8191n6042L7296f7636H7598c9233k8899
12712f8132B07930b5264m4130B56975j01564e3081a803A05346a56250A48920J80605
12701C29525o3843F8159N9539a21173A51327O010L1492o1760e24G3503C6484J2540
12689D9024J05238b0674j30169A35930h4957A33366a47225C47733j34342D4070
12678h4047L6571o3245d2257j07218B32794D5175O6925p432J01235c62263B24959
12666a4462A84461J11781j3537I8292J82530c86954B38012R5518F3634J61383
$$ y = [-172419, 47195, 36881, 121849, -128890, 67476, 112291, -53687, 33293, 265285, -56812, 79737, 112176, 83688, -14882, 118875, -148766, 276767, 4056, 22288, 12573, -30509, 118947, -5592, -166205, 118900, -161287, -17041, 249682, 171491, 115449, 152745, -67636, 87598, -39233, -68132, 207930, -25264, -69394, 256975, 155411, -53081, -1803, 105346, -156250, 148920, 329525, 265682, 68159, 127698, -121173, 151327, 157337, 188829, 127069, -524, 73503, 36484, 49024, 154262, -20674, -150843, 135930, -84957, 133366, -147225, 347733, 213391, 44070, -84047, -47476, -110721, -42257, -149475, 232794, 45175, 112100, 104668, 205903, -362263, 224959, -14462, 184461, 296242, 282705, 98292, 280822, -386954, 238012, 333530, 63634, 225017]
12656B25017F9089b27643A35037a16829B48245K6131r7978C5660K7493K28362
12646B91515b17222f3897I1419h7777K2883J8532B73413d6831J4969A1595L42210
12635C53805A5879b49992a7793A21462N0102L1582H9964K04744M6032B7857K39487
12624B67344e041A85149K8101O78883A76420a20122l5672A460b2530C39048j49807
12613A89241I1321Q6463K60811a55843C21279j59417h0528A19437J13171a32683
12602A31220e0768A87169K53997A53149N2859R900Q903D280J49318L1377b19831
12590D55244E1707K21604A05771j0875a0675A77956d6404r5046A1357R0617d96032
12578H7495f0340F4380a69337a9274o071A4401i4260A05958O0269A4380J29430
$$ y = [225017, 69089, -227643, 135037, -116829, 248245, 274376, 176398, 35660, 63153, 291515, -217222, -63897, 91419, -87777, -64894, -46362, 273413, -46831, -31862, 11595, 353805, 15879, -249992, -17793, 121462, 171564, 203146, 89964, 294708, 340740, 27857, 267344, -5041, 185149, 213250, 892133, 176420, -120122, -155794, 1460, -22530, 339048, 189241, 91321, 177784, 438595, -155843, 321279, 161862, -80528, 119437, 232608, -132683, 131220, -50768, 187169, 441166, 153149, 206008, 215908, 224811, 4280, 153598, 184975, -219831, 455244, 51707, 273311, 105771, 94896, -10675, 177956, -46404, -141450, 11357, 101974, -496032, 87495, -60340, 64380, -169337, -19274, -25345, 14401, -94260, 105958, 166227, 14380, 143810]
12567A43810J62808f2557K9648a1057F5724N7308L2469C9780c56899a35850B76996
12555A58801J96843b87701A88792d317j366A40304B3361a81966A88403N6873c8001
12543b57241A6918J75193J9529b31205g0006k2910L803A91763p1789i1639A52776
12531b19079A00152d3707E9536Q9874D2556K22552j2048F8492b14340a4000j09779
12520a23779O0727C6256R9447a35529D9336i1266B83300p6433a17799B68011b18409
12508C1179M2092J01177a57001E864K5833b34534i4295j28886c8663C66235b515
12496c87508H2677Q9425M6014r0230J77776j20262m2354R93a08767A42390R1680
12485B34070h4174A05658p291f3786b9015j8241A77839c16976d2612B83975e9507
$$ y = [143810, 306618, -62557, -32909, -11057, 65724, 123032, 155501, 39780, -356899, -135850, 276996, 158801, 355644, -287701, 188792, -4317, -5683, 140304, 23361, -181966, 188403, 245276, -38001, -257241, 16918, 192111, 211640, -231205, -70006, -92916, -89113, 191763, 119974, -91639, 152776, -219079, 100152, -43707, 59536, 149410, 42556, 265108, 253060, 68492, -214340, -14000, -123779, -63052, 36256, 135703, -135529, 49336, -91266, 283300, 206867, -117799, 268011, -218409, 31179, 73271, 174448, -157001, 5864, 31697, -234534, -94295, -223181, -38663, 366235, -2515, -387508, 82677, 172102, 218116, 127886, 305662, 185400, 143046, 144039, -108767, 142390, 234070, -84174, 105658, 98367, -63786, -29015, -47256, 177839, -316976, -42612, 283975, -59507]
12473A10705a69673j61596B16910i0706A19154n0652a58687R334D42086i2517
12462c4884l71461B84868f4261I5543i5794l55416D0459H074e5453H5102i9038
12450a65805B07507i4817l76238c3653A01495J8929O6612b65144d9380k09499
12440b58879A35888a95938E4563a04736o5041H1818L4816k3060b50361B10131
12429d24491a59194I191b54359F8029a7689A01886a12005c1960n3075j58259G1336
12417c41387F8980a22448F2738f35410i3760k38801J28613A48980B413M6154L44644
12406C93211I545g5886B10611r0022a88964g7978C12758A18447J31554h1823a04
12394A67450d254A21040J61124B8122K57637a10677B3989K75327b24794h1423
$$ y = [110705, -169673, -331269, 216910, -90706, 119154, 68502, -158687, -149353, 442086, -92517, -34884, -406345, 284868, -64261, 95543, -95794, -451210, 40459, 8074, -55453, 85102, -99038, -165805, 207507, -94817, -471055, -33653, 101495, 120424, 187036, -265144, -49380, -258879, 135888, -195938, 54563, -104736, -169777, 81818, 116634, 93574, -250361, 210131, -424491, -159194, 9191, -254359, 68029, -17689, 101886, -112005, -31960, -85035, -243294, 71336, -341387, 68980, -122448, 62738, -635410, -93760, -332561, -203948, 148980, 2413, 48567, 393211, 9545, -75886, 210611, 120589, -188964, -77978, 312758, 118447, 250001, -81823, -104, 167450, -4254, 121040, 282164, 28122, 285759, -110677, 23989, 299316, -224794, -81423]
12383B83670g4059k0082m5880a2215o9863B89156i4795A62894o8492d7971N343
12372d2628B45691r1297e791k23450G8831K16516j06452B1799P4929b85769J40320
12361a45449A73717e8329A68389D2808a986C6841L6002b18898C37472A49990J29518
12350B79508e1440p6283j78427B3729K00063l2090d4568a291A53174A8454a85276
12338a12761j72600B05367m1601C2292Q0402a86014C3L02058A26827a25141B52228
12326d5585B49541J2092m5393a41984P0681B12778F1447e0104E6937K1304J23159
12315B01400a11322D6120N2364j1980l4884K84128D6876a41503E5880i0617A86444
12303A18940a2445n7470n011j36783r7409A56062h9735I8892d3428k33920J20093
$$ y = [283670, -74059, -94141, -140021, -12215, -82078, 289156, -94795, 162894, 94402, -47971, -42628, 245691, 154394, -5791, -229241, 78831, 295347, 188895, 21799, 96728, -285769, -145449, 173717, -58329, 168389, 42808, -1986, 36841, 72843, -218898, 337472, 149990, 279508, -51440, -127723, -306150, 23729, 223792, 191702, -44568, -1291, 153174, 18454, -185276, -112761, -285361, 205367, 163766, 32292, 112694, -186014, 33, 302091, 126827, -125141, 252228, -45585, 249541, 261633, 216240, -141984, -71303, 212778, 61447, -50104, 56937, 78241, 201400, -111322, 46120, 98484, 86504, 51620, 335748, 46876, -141503, 55880, -90617, 186444, 118940, -12445, -69915, -74926, -211709, -309118, 156062, -89735, 98892, -43428, -277348, -157255]
12292a57255G8878J34678K11762A06517M9716i3534o5832G5082i6336K4564A17116
12280A32996D2002L80910A20150e9341n3598B26903a51198I1155A3031P3160p127
12269G9064J29394f0448j03277J9456G7896a14935F620b45054J01715A70415a95450
12257A97561J15940C1437J99189l4501p5372J50898k3694A09881J49341m1934
12247B17288l3840B1564c5875A63490J04958J20276g6054A00028m4602k6166b35681
12235g5422G4846J3738l4865J14729A368f6669B60054j0285a11424B90137M28874
12224G19011C04210e7854A62564G1690J02102a38152F3395K26904J17833a97341
12213A62681b48729A33422R7094a79673C7217J15271J08698r2771G4R3014K20361
$$ y = [-157255, 78878, 213556, 425318, 106517, 156233, -93534, -159366, 75082, -96336, -71772, 117116, 132996, 42002, 422912, 120150, -59341, -112939, 226903, -151198, 91155, 13031, 86191, 79064, 208458, -60448, -163725, -144269, 77896, -114935, 6620, -245054, -143339, 170415, -195450, 197561, 313501, 31437, 230626, 196125, 120753, 271651, 247957, 109881, 259222, 217288, 183448, 21564, -35875, 163490, 268448, 388724, -76054, 100028, 55426, 29260, -235681, -75422, 74846, 88584, 53719, 168448, 1368, -66669, 260054, 249769, -111424, 290137, 719011, 304210, -57854, 162564, 71690, 173792, -138152, 63395, 290299, 408132, -197341, 162681, -248729, 133422, 230516, -179673, 37217, 152488, 261186, 168415, 74, 93088, 313449]
12202C13449o0220a87026D81897B1491a2169A28349m9209b7743m1758A11467K11855
12191C23322a24970C4277A5935O3718J39463A1015K17205l6220A1931J9265a17792
12179i2078G0679a1198j2363G6519b2080A94058J08328K52373c07573A42040M7632
12168A89672n65L68570D6032P3901L5524G0888O8413J63947h5065D6259e2003
12156A98174P2875B108J18170g3376j00184a749B40065F8817a25739Q821j7510
12145a34428B61161i4377o3401D0264J758N010a28311J7659A36533D4519a69969
12133A69272m3374K24758N3433A04138n1066K23990F8551L6990L9451a34236A23600
12121a56840B2168d4759A90428G6783b01733L5281O0439d555j9762F9072F559
$$ y = [313449, 253229, -187026, 481897, 21491, -12169, 128349, 79140, -27743, -69501, 111467, 323322, -124970, 34277, 15935, 79653, 219116, 11015, 228220, 192000, 11931, 31196, -117792, -92078, 70679, -11198, -23561, 76519, -22080, 194058, 302386, 554759, -307573, 142040, 189672, 189107, 557677, 46032, 119933, 155457, 70888, 139301, 303248, -85065, 46259, -52003, 198174, 271049, 2108, 120278, -73376, -173560, -1749, 240065, 68817, -125739, -116918, -134428, 261161, -94377, -157778, 40264, 42022, 47032, -128311, -110652, 136533, 44519, -169969, 169272, 125898, 350656, 404089, 104138, 53072, 277062, 68551, 105541, 144992, -134236, 123600, -156840, 22168, -44759, 190428, 76783, -201733, -166452, -106013, -4555, -24317, 69072, 6559]
12109b06506A68846n0538K11778F5289Q2861n5342O9312A2896J38350g0457c1888
12097E91590i259j18458k23964b5261C01230b42645a04673j18945R8670B7655
12086b08948L8011j17733a2179r585j44944B23542A06592d4059A98792c38432
12075g9780B32676J77485a9657j30318j4183A86705G095L86624M51167O33670
12065A478556F11207A59621J48881b29061f6495A50113h1751p0758N3101B49569
12054b23729A92064a83138L8904o1103q0893J09233c9982B7493c2797D0317P1253
12043A11570l5166b9827B03925a55675E2171g4474k1817d2596j194r8509e3616
12031a79851A32677N1721a12502r5360d3866n5187o1868A35568J38527r3803Q7791
$$ y = [-206506, 168846, 118308, 330086, 65289, 148150, 92808, 162120, 12896, 151246, -70457, -31888, 591590, -9259, -127717, -351681, -25261, 301230, -242645, -104673, -223618, -124948, 27655, -208948, -170937, -288670, -12179, -21764, -166708, 223542, 106592, -44059, 198792, -338432, -79780, 232676, 410161, -19657, -149975, -164158, 186705, 7095, 393719, 844886, 1478556, 611207, 159621, 308502, -229061, -66495, 150113, -81751, -152509, -99408, 249569, -223729, 192064, -183138, -144234, -205337, -286230, -176997, -39982, 27493, -32797, 40317, 111570, 76404, -29827, 203925, -155675, 52171, -74474, -96291, -42596, -43790, -142299, -53616, -179851, 132677, 184398, -112502, -207862, -43866, -99053, -160921, 135568, 274095, 180292, 268083]
12020B68083a82902C7298M6537K86148F206f3417C99979b21703b0144r6590M2232
12009g4502K0120J4190D5049a96769O4578A95675b69044c4923F3587a39908A0851
11997D9954i9362k68607a37829K4166m1208k9417P4726A25458a50316j92053A56571
11985B67955C6977b73616d0413m4752H4418e8882B26688A07635b61917A97651
11974B6792e4782F2583L75586a19680j39956A72892b16472h172A72545C6121K19647
11963B55768l7872H2519k6163a24732j73787E1129b24062R5421A0680J76767a41075
11951b00377I6341b61295e193q5275K625A11150b23645a7688C87642j0420d06221
11939a61643K3663E4141b45073h4971Q017A76619i4102j14394a02264M4293K1984
$$ y = [268083, -182902, 37298, 83835, 369983, 6206, -63417, 399979, -221703, -20144, -116734, -74502, -54382, -40192, 45049, -196769, -132191, 195675, -269044, -34923, 63587, -139908, 10851, 49954, -99362, -367969, -137829, -113663, -154871, -184288, -109562, 125458, -150316, -342369, 156571, 267955, 36977, -273616, -40413, -85165, 84418, -58882, 226688, 107635, -261917, 197651, 26792, -54782, 62583, 438169, -119680, -259636, 172892, -216472, -8172, 172545, 36121, 255768, 217896, 82519, 56356, -124732, -298519, 51129, -224062, -128641, 10680, 187447, -141075, -200377, 96341, -261295, -5193, -90468, -87843, 111150, -223645, -17688, 387642, 377222, -406221, -161643, -137980, 54141, -245073, -84971, -76954, 176619, -94102, -208496, -102264, -57971, -35987]
11928c5987k05304A01905b76560C9290c0485k55667A00145d382j61223H4632L4417
11917A19049f8570A25437b45809A46449b5730C39712a59503B5932b69996J28387
11907a41609L1236c0656A68007b54348i6280c653j65251A6271c84803A32066J93808
11896C25874a8422I6751e43808c1565B29637E5658I193J81967E3827a38114k3331
11885a61445A30154b33715D830O2475b2776j52463A89882q3888h3938c6212n5348
11874i1560o0396D8456L301J09324d5664j71194h5359k04252O4648J6011a0133
11862B56384j5462I3645j702A8778K54582I3310f7691C89933A71780q0876b9287
11850A06493J19099a38085A36125b39768G5603a387F7138k6482a02797b167F7149
$$ y = [-35987, -241291, 101905, -276560, 39290, -30485, -286152, 100145, -4382, -165605, 84632, 119049, -68570, 125437, -245809, 146449, -25730, 339712, -159503, 25932, -269996, -141609, -110373, -30656, 168007, -254348, -96280, -3653, -168904, 16271, -384803, 132066, 325874, -18422, 96751, -543808, -31565, 229637, 55658, 9193, 191160, 53827, -138114, -161445, 130154, -233715, 4830, 67305, -22776, -175239, 189882, 105994, -83938, -36212, -91560, -151956, 48456, 51757, 161081, -45664, -216858, -85359, -289611, -224963, -208952, -10133, 256384, 240922, 93645, 91943, 18778, 273360, 93310, -67691, 389933, 171780, 90904, -29287, 106493, 225592, -138085, 136125, -239768, 75603, -1387, 67138, 40656, -102797, -2167, 67149]
11838a31094a0055A4364l630b57949b6743j63738B9241c47809C7600b32214e6261
11826H7059a3615H5305a73161j46754R0513a01608j67528F744a77528b3619B19101
11814a76241P4709B13015f8384B72324D8839J11975B9167J97559a62267p8698
11804b40965H5831A8593J72525a29065B4320b57457b6943F0244a46423A56155
11793a90983g5201m05027a88820B72070a02395M8150C11471b76978d0514F5242
11782c58605g9901l1065k64106J01672L1962A81221R0690c7440j61183b2451j1428
11771c3879j14727k9400n6756g1868j89412A08002a32053B64124a53903j51539
11761c05442E9871L70419i2517j00831J1218M0292A39930n1672c23575a21579
$$ y = [-131094, -10055, 14364, 10734, -257949, -26743, -190481, 29241, -347809, 37600, -232214, -56261, 87059, -13615, 85305, -173161, -319915, -229402, -101608, -269136, 6744, -177528, -23619, 219101, -176241, -101532, 213015, -68384, 272324, 48839, 160814, 29167, 226726, -162267, -240965, 85831, 18593, 191118, -129065, 24320, -257457, -26943, 60244, -146423, 156155, -190983, -75201, -480228, -188820, 272070, -102395, -54245, 311471, -276978, -40514, 65242, -358605, -79901, -110966, -375072, -273400, -241438, 181221, 271911, -37440, -198623, -22451, -33879, -148606, -178006, -234762, -71868, -261280, 108002, -132053, 264124, -153903, -305442, 59871, 430290, -92517, -193348, -182130, -141838, 139930, 88258, -323575, -121579]
11750B70708g7007k23681e4704B6839f8146j26980a763j24886J5923E354R9780
11739A05134a35006q1641j60380B41254A15351b4851q3342j97515C5627b02688
11728i7318A36958K67819j4954A82369a94476A14141c30120Q5953B6192L09302
11718C35494A49727a83580P3262b8075m918i135j55967I8454j6892Q0439b82269
11706b27237A67217j2798b08517B89205i676n791C27075D8264K39545h9122A82479
11694b54013J00608P2539D1044b32947J15516e4007G6764d5616A20103C3397b4164
11682C71491b8809m2243k79155M7982B73946G9145b2022I9488C0449c01174h1945
11670a39179A81933q4979a8316l163G4941a88015H1167k7616L19227j52091D6268
$$ y = [270708, -77007, -300688, -54704, 26839, -68146, -195126, -1763, -126649, -110726, 5354, 105134, -135006, -216647, -377027, 241254, 115351, -24851, -108193, -305708, 35627, -202688, -97318, 136958, 404777, 389823, 182369, -194476, 114141, -330120, -244167, 26192, 335494, 149727, -183580, -110318, -28075, -32993, -9135, -165102, 98454, 81562, 162001, -282269, -227237, 167217, 154419, -208517, 289205, -9676, -15467, 327075, 48264, 287809, -89122, 182479, -254013, -153405, -80866, 41044, -232947, -117431, -54007, 76764, -45616, 120103, 33397, -24164, 371491, -28809, -71052, -350207, -302225, 273946, 79145, -22022, 99488, 30449, -301174, -81945, -139179, 181933, 96954, -18316, -21479, 74941, -188015, 81167, 53551, 372778, 220687, 46268]
11658B5497N9624R3980F1100J2524f2982A76821b74306A36080i9396j704R593
11647i1507j71676A15029c8461j70084a0140k14872c8266l5211k79474A89637
11636A19707L68298A39144N9063h0676r4201g4066b9099A8642J40249L1076c31571
11624d71285B6361K05804a01743F5493a29098B14682p9225i0007K0465c0496l39216
11613c69712H3165b01394H4876N9588a18408B8842J91785A4667a51251G6416b64718
11601D1947L6745c5898A48455o1682D216J660K21152a40799B53265b50144B6758
11589H5813A4495J32722o8342b1232G6816P9214R7032C2772e4038D0238c05249
11577a03027j45197A35522h1505A31113L73386b57438A3963K01824d8823J9350
$$ y = [25497, 85121, 179101, 61100, 73624, -62982, 176821, -274306, 136080, -99396, -101100, -91507, -263183, 115029, -38461, -208545, -10140, -225012, -38266, -73477, -352951, 189637, 119707, 488005, 139144, 198207, -80676, -174877, -74066, -29099, 18642, 158891, 189967, -331571, -471285, 26361, 232165, -101743, 65493, -129098, 214682, 135457, -90007, -69542, -30496, -369712, 83165, -201394, 84876, 144464, -118408, 28842, 220627, 14667, -151251, 76416, -264718, 41947, 78692, -35898, 148455, 86773, 4216, 5876, 227028, -140799, 253265, -250144, 26758, 85813, 14495, 147217, 78875, -21232, 76816, 156030, 253062, 32772, -54038, 40238, -305249, -103027, -248224, 135522, -81505, 131113, 504499, -257438, 13963, 215787, -48823, -29473]
11567b9473o4106C1744K2699K25264d89298J65003f5399b2351E7178c55734C41765
11555G1404a67213k34575d5138j41966B86768j14506o384G9486a46577j09596
11545b56173a01844B72857a44434a786B23719c61331C22196D1544K17933c5306
11534C05620j31245J65811b07092a9013A73344M4134A9750J44131K48863a10316
11523b07772A14971b31966A2351L03399A35095a95392e2346R557B61753A7334
11512E6874a74378A06385h48C39331j40952E8874L4744P2482D096J00175J21515
11501B25786B7468L5867a81559j7475A16376g7192a4554B28833Q452H1083C5055
11489D63164I6956e1560k71534C53661J55710j85220J35678J09324B39010h0113
$$ y = [-29473, -93579, 31744, 54443, 279707, -489298, -324295, -65399, -22351, 57178, -355734, 341765, 71404, -167213, -401788, -45138, -187104, 286768, 172262, 165878, 79486, -146577, -256173, -101844, 272857, -144434, -1786, 223719, -361331, 322196, 41544, 259477, -35306, 305620, 174375, 340186, -207092, -19013, 173344, 217478, 19750, 163881, 412744, -110316, -207772, 114971, -231966, 12351, 315750, 135095, -195392, -52346, -42789, 261753, 17334, 56874, -174378, 106385, -848, 339331, 198379, 58874, 93618, 166100, 4096, 104271, 225786, 27468, 63335, -181559, -199034, 116376, -77192, -14554, 228833, 237285, 81083, 35055, 463164, 96956, -51560, -323094, 353661, 509371, 324151, 459829, 569153, 239010, -80113]
11478a91951A52015i0325j15099A56543R4425J2479Q5910N6531b06222E9286K62184
11467C21470o2706e1026B99059A03207a62695d1566D0225b57749B43489O4967
11457C08456a38811L7899E0822J25245j6637G4537J09567O5842j12256a22089
11446a37428B64476f8056A52869a63053b6434j10339l3259H123d0286A69172J50075
11435C19247a9290l2684A4924e827F3825B208P267b661q1068B03815J935A7978
11422A49404d294E4405A5177J31615a53251I5872a01425b6820J45B09751a32469
11410b54308i7026c7121j65733B96646B8939a41150G871C036a10242K4471k16602
11399c02373A22878a3004F1514k0489a64367c1554J960H7196a70163n3870a4743
$$ y = [-191951, 152015, -90325, -205424, 156543, 250968, 263447, 349357, 405888, -206222, 59286, 321470, 258764, -51026, 299059, 103207, -162695, -41566, 40225, -257749, 243489, 308456, -138811, -100912, 50822, 176067, 159430, 74537, 184104, 249946, 137690, -122089, -137428, 264476, -68056, 152869, -163053, -26434, -136773, -170032, 8123, -40286, 169172, 319247, -19290, -51974, 14924, -5827, 63825, 2208, 9475, -2661, -83729, 203815, 205750, 17978, 149404, -4294, 54405, 15177, 146792, -153251, 95872, -101425, -26820, -26675, 209751, -132469, -254308, -97026, -37121, -202854, 296646, 28939, -141150, 7871, 3036, -110242, -85771, -302373, 122878, -13004, 61514, 41025, -164367, -31554, -29594, 87196, -170163, -224033, -14743]
11387f811j11127j89847B02511B5712b8569q6557I28R8194c97621a32693j374
11376a34067F2396a21844C27605a13697E0317c32153a25137A24132l0266g5078
11365A45540f0185A50747J23167l2826a52303r6665B21595I5655f4317j56400
11355b20717A77578i6047C41568p0189e1580j6555C25712p7604A10816b89343
11344a20008b109o7325j54214A37591q521N962L4885C4012J24200G6120b9900
11332B38745E1743b32475D1304e32149G4280a50459c4111A78627b58104a08031
11321C5888a76905B2725i8387l4992I2122l2933d93631E1043J9118c8443O02i417
11308b62785d7594l05543d4486G5301J93042E4491K57983c5247j1535k49457k7050
$$ y = [-6811, -117938, -307785, 202511, 25712, -28569, -115126, 928, 99122, -397621, -132693, -134067, 62396, -121844, 327605, -113697, 50317, -332153, -125137, 124132, 93866, -75078, 145540, -60185, 150747, 273914, 241088, -152303, -248968, 221595, 95655, -64317, -220717, 177578, -96047, 341568, 271379, -51580, -68135, 325712, 248108, 110816, -289343, -120008, -2109, -69434, -223648, 137591, 129070, 135032, 169917, 34012, 158212, 76120, -29900, 238745, 51743, -232475, 41304, -532149, 74280, -150459, -34111, 178627, -258104, -108031, 35888, -176905, 22725, -98387, -133379, 92122, 59189, -493631, 51043, 70161, -38443, -37841, -9417, -262785, -47594, -353137, -44486, 75301, 268343, 54491, 312474, -35247, -46782, -296239, -323289]
11297c23289a21212B84085f73695d4099A05086J8341l2215d07242b6389A17269
11286c47767k7288A14664a06156p752A67290M3858b71696a17692o5068A29838
11275i937C8317b40270E8017f9887m970m62594g0052A12733a71646h2542I9486
11263d93j03617n4369d0728R823F6915a16973J3189B35860b93872A91431a51485
11251B2025L761i5540D61008A37832F7077b52917g3529C4726f6899k7781C2050
11239e24215c0524A84059a09660H3948c5661a1505C0665a33764o61829f5289b1278
11227a91725F0132g3417c4514A63767h1056j28802A67790d0989j80177A20294
11216c33012G3265n196a79831A67972b31363D4273b03385L2920C0521J18195a7003
$$ y = [-323289, -121212, 284085, -673695, -44099, 105086, 123427, 91212, -407242, -26389, 117269, -347767, -375055, 114664, -106156, -113908, 167290, 211148, -271696, -117692, -182760, 129838, -9937, 38317, -240270, 58017, -69887, -74857, -537451, -70052, 112733, -171646, -82542, 99486, -493, -104110, -158479, -40728, -30905, 66915, -116973, -103784, 235860, -293872, 191431, -151485, 22025, 25786, -95540, 461008, 137832, 67077, -252917, -73529, 34726, -66899, -94680, 32050, -524215, -30524, 184059, -109660, 83948, -35661, -11505, 30665, -133764, -795593, -65289, -21278, -191725, 60132, -73417, -34514, 163767, -81056, -209858, 167790, -40989, -221166, 120294, -333012, 73265, 68069, -179831, 167972, -231363, 44273, -203385, -170465, 30521, 148716, -17003]
11204h4325R06j97546q3914g0568n3891D379i05H8372h2218O290p4293A05123
11191i918m2076H0493a46044f3007D9361a26227G4668h203j0183j40836i284D9632
11178a99750o0014A1951b51078a14008j77064A00051A4523J29383E7367k1005
11168C6362b17487J5193h2240A63584i645m1221j42540o6114B93930I9709b6669
11156a43689A7426M10565d18069G6597J35526F8455J90720r9136A1060d10331
11145b6336j80373P4238K5146A15450b32637B39344n2067m1742J05584o184J29574
11134C74509A24216a31891B26209F4863J31025c71060g0088C48613b23602b5253
11123A5186J7510P4407i492B18666a84104A01922A434M0159b6154D4999p867f8975
$$ y = [-84325, -83419, -280965, -364879, -70568, -124459, 4379, -905, 88372, -82218, -75928, -150221, 105123, -9918, -51994, 80493, -146044, -63007, 49361, -126227, 74668, -8203, -18386, -159222, -9284, 49632, -199750, -259764, 11951, -251078, -114008, -291072, 100051, 14523, 143906, 57367, 36362, -217487, -202294, -82240, 163584, -9645, -50866, -193406, -259520, 293930, 99709, -26669, -143689, 17426, 427991, -418069, 76597, 212123, 68455, 259175, 160039, 11060, -410331, -26336, -206709, -132471, -107325, 115450, -232637, 239344, 187277, 145535, 251119, 244935, 374509, 124216, -131891, 226209, 64863, 195888, -371060, -70088, 348613, -223602, -25253, 15186, 32696, 107103, -9492, 218666, -184104, 101922, 1434, 41593, -26154, 44999, 37132, -68975]
11110B800M23238G194L33721j32458k6815M6640J7780r7855l6460Q5199J24916
11099C21862j47515J51898P264j49635p0074a60077M7632A69851f0660I9686N9837
11088A59523K08167b76201F73702A47243m6381Q0859J48623J29962j62580A6219
11077B94962L30717A54105K86445A32267K53016r397q2841n1727K56382B29336
11066H3292K42921J49135P1j13840J91007k28759M33655j77117j36948k11479
11056B31938L91667J07323l0934j08980K03721J93871m31830J45093K49595j37651
11046H13813k42736J78220M8648j17018Q9241J7394j4506B97608K01034L29144
11036H27786J7530r7312r8164j27227j62969N49396k82650j21190L2906K15284
$$ y = [2800, 426038, 7194, 340915, 208457, 181642, 228282, 246062, 148207, 111747, 196946, 321862, 174347, 326245, 333509, 183874, 113800, -160077, -112445, 169851, -60660, 99686, 159523, 367690, -276201, 673702, 147243, 100862, 181721, 330344, 460306, 297726, 16219, 294962, 625679, 154105, 440550, 132267, 385283, 375886, 293045, 241318, 497700, 229336, 83292, 326213, 475348, 475419, 361579, 552586, 323827, 757482, 580365, 443417, 231938, 623605, 730928, 699994, 591014, 794735, 988606, 556776, 701869, 951464, 813813, 571077, 749297, 797945, 680927, 770168, 787562, 773056, 297608, 498642, 827786, 845316, 748004, 649840, 522613, 359644, 909040, 626390, 505200, 538106, 753390]
11026G53390J35355j68410n6861Q2204j21499k93109L00791j88797J22213j25128
11016D40149J96624N4663k71610L04389l14048B01291Q6986O08574l99736J92570
11006F89685j55479Q4255K63856C87197K84615n0341j66551L8626O9672p963j70811
10995C84444N09096P008k71735P6919n1366o3475m3541J91570j8439O09554j47988
10984A182047l27904L8725o608j78213Q72936l83120K72898m501J28359K16923
10974A811542N57850K70020r934p8482j12494L52842m20390q6134m44278j45327
10964A695215j86151k35025n3507j78359M73779n20376M38228l13784J17777o9194
10954A168603l5286N8628n21887j23745Q3397k0316j01208j93247r1741o7252
$$ y = [753390, 888745, 720335, 663474, 745678, 624179, 331070, 631861, 443064, 565277, 440149, 636773, 691436, 419826, 724215, 410167, 201291, 288277, 896851, 497115, 689685, 534206, 618461, 882317, 387197, 671812, 621471, 454920, 493546, 563218, 555255, 384444, 893540, 900548, 628813, 705732, 654366, 590891, 547350, 738920, 720481, 1330035, 1182047, 854143, 892868, 886260, 708047, 1580983, 1197863, 1470761, 1466260, 1594619, 1811542, 2369392, 2639412, 2629478, 2550996, 2438502, 2791344, 2370954, 2284820, 1840542, 1695215, 1509064, 1274039, 1220532, 1042173, 1515952, 995576, 1433804, 1120020, 1237797, 1168603, 1133317, 1191945, 670058, 546313, 629710, 609394, 508186, 314939, 223198, 155946]
10944A55946J19979H0534A8313J12739M34472A78205H1016E735K56324a25932
10933C19724K3466H2992c67835J44581c1547B98047j46130D0161g9106A36388
10922A32118K7493g7412A14129m5398b5130A36101L59122C888a12973A67242a98669
10910D8667i4732r084C88586D7061K0300A4950K37183e155H6429A3521a54311
10898B5819J52077j5951C6156b4009j85402C1013b50872A5133a85573A03298a41512
10886G0150N0336e4292J098A6058K26247O626L8470p4367D5047R5469D0761A811
10873A62206a61412j13415d5681e66j99446A08331J40610A12517l3945b0507r0739
10862a11246p42k04538A16799P377f5704n7988C7866C323d8005O622q2794m646
$$ y = [155946, 275925, 80534, 18313, 131052, 565524, 178205, 81016, 5735, 262059, -125932, 319724, 343190, 82992, -367835, -223254, -31547, 298047, 151917, 40161, -79106, 136388, 132118, 159611, -77412, 114129, 68731, -25130, 136101, 495223, 3888, -112973, 167242, -198669, 48667, -94732, -103816, 388586, 47061, 67361, 14950, 252133, -5155, 86429, 13521, -154311, 25819, 177896, 161945, 36156, -24009, -209411, 31013, -250872, 15133, -185573, 103298, -141512, 70150, 120486, -54292, -53194, 16058, 242305, 248931, 287401, 213034, 45047, 140516, 40761, 1811, 162206, -161412, -274827, -45681, -566, -200012, 108331, 248941, 112517, 78572, -20507, -111246, -111988, -316526, 116799, 124176, -65704, -123692, 37866, 3323, -48005, -41383, -124177, -128823]
10850a28823A74600J36027G7651A9795a50013J9271k1076g2773D8144e4041C49765
10838A33738L9787c0473j36073h0802A06661d54601G0287A842a09328C03449i8435
10826B41827E6891L4936d83705E616N293J12152b84808H2832a24041a8699n3852
10815g2551l20924A3724a83513J1658b7831p9065o2640k2765H1207e4839n2980
10804a07819B7578K14098i7664A0904b09035B1108L9641K07843f2257C1720a6722
10792A38955D8110J9115d301k5640k4607B41870a59799L7625A86981g2650k10123
10781b82773B12758I898g5221A08287A1878a6379F2281R3334b09348F7966P1822
10770A39788b41734O1296j00162A42557b48883f4099I7147A7871a44034A74267
$$ y = [-128823, 174600, 310627, 77651, 19795, -150013, -130742, -151818, -72773, 48144, -54041, 349765, 133738, 173525, -30473, -166546, -80802, 106661, -454601, 70287, 1842, -109328, 303449, -98435, 241827, 56891, 91827, -483705, 5616, 10909, 123061, -284808, 82832, -124041, -18699, -72551, -393475, 13724, -183513, -171855, -27831, -106896, -169536, -192301, 81207, -54839, -107819, 27578, 241676, -97664, 10904, -209035, 21108, 60749, 268592, -62257, 31720, -16722, 138955, 48110, 67225, -4301, -29941, -54548, 241870, -159799, -122174, 186981, -72650, -282773, 212758, 9898, -75221, 108287, 11878, -16379, 62281, 155615, -209348, 67966, 139788, -241734, -180438, -280600, 142557, -248883, -64099, 97147, 17871, -144034, 174267]
10759A56509a6667l9941p5033A66464a22495B42707a70863B08322b84252a14293
10748A89732b7367F8824P6258J1281o5632a08969M0878o3122E2075e4006A94030
10736a75031O2135k9082H4671a15963A22570b10305d8477H0910A1454b16450P3410
10725a43040B3664c19488g8953A07320J34038a21552A236K09287a77905b1472
10714A06762c978j41846a9684R682m40051g275B21176a56294m5984q1574C0190
10702g6846l7502A46210b49517E294J74172J60894a17201j0395J9288A38723j8828
10691A19895b49247p9840i3333H4674c08883M8381h7836D2449c45106H0059k5161
10680E4898J23587a16901l46795B45323b21671b0862j97054j89138a02747B0800
$$ y = [156509, -16667, -56608, -131641, 166464, -122495, 242707, -170863, 208322, -284252, -114293, 189732, -27367, 68824, 145082, 156363, 90731, -108969, -68091, -131213, 52075, -54006, 194030, -175031, -112896, -141978, 84671, -115963, 122570, -210305, -48477, 80910, 11454, -216450, -143040, 23664, -319488, -78953, 107320, 241358, -121552, 1236, 210523, -177905, -21472, 106762, -3978, -145824, -19684, -10002, -450053, -7275, 221176, -156294, -202278, -283852, 30190, -76846, -114348, 146210, -249517, 5294, 179466, 340360, -117201, -127596, -108308, 138723, 119895, -249247, -329087, -93333, 84674, -308883, -260502, -87836, 42449, -345106, 80059, 54898, 178485, -116901, -463696, 245323, -221671, -20862, -217916, -407054, -102747, 20800]
10669e3635j16405n1687f4551j91095B3258e2812k6582K5509j39650I4333d31889
10657a96974A99480b44688E5862J94533a21980b784k03494L1112p9545b6127k25044
10646b51171D10019j67280m7717E5189A6091a31532n9092n871j243C05422a44352
10634a05951j17100A11266b38037g219k0443m52002J92820J2136h1275k88666
10624c69941i6455E3498L6644M4745a3416B78880a43557L1954K0322C19869F3858
10612C29362R690D077c9379A47683K6831a39699B07630A0541L97363h4246o4768
10601a49014B00046l311a37834D2678M2995O3027a05835A4790c1776A07660a62994
10589a75415g5229A07213a02730H4599A4699d8238k22594B86561b8497j13004
$$ y = [-53635, -170040, -221727, -64551, -255646, 23258, -52812, -79394, -53885, -193535, 94333, -431889, -196974, 199480, -244688, 55862, 250395, -121980, -2784, -206278, -175166, -254711, -26127, -251171, 410019, 242739, 195022, 55189, 16091, -131532, -190624, -196495, -197738, 305422, -144352, -105951, -223051, 111266, -238037, -7219, -27662, -479664, -286844, -274708, -81275, -369941, -96455, 53498, 90142, 134887, -13416, 278880, -143557, -111603, -91281, 319869, 63858, 329362, 339052, 4077, -39379, 147683, 174514, -139699, 207630, 10541, 407904, -84246, -149014, 200046, 196735, -137834, 42678, 85673, 148700, -105835, 14790, -31776, 107660, -162994, -175415, -75229, 107213, -102730, 84599, 14699, -48238, -270832, 286561, -28497, -141501]
10579a41501C09531a76265h5690c8459A9720J18550b22582B55793f2233l3778
10569i6011j66700a28516G3066a37776j22841a15997A85690L7804N5449F614i9401
10557B5881K9965K32591A43181B8797a04713A97933d7066j15315e9556A09407
10546A11677C1558J350K43119g3910n9080E3653Q0835b25769B7942b41422A90778
10534A49803b23199N8525N4226I9010k2704L9388J83027c33926C7625L6029d96563
10522A28494a0226j82090P9350p0355q9757O4268i1909P929A67759f2990A16562
10510C6657i8326a9116A04328a38668H7082h4664j1006l9368N287b8064k66865
10499b94929h1381A60363k4970a40530L2817m7441l8650P7968p4215L1961j6031
$$ y = [-141501, 309531, -176265, -85690, -38459, 19720, 138270, -222582, 255793, -62233, -96011, -262711, -128516, 73066, -137776, -260617, -115997, 185690, 223494, 278943, 6614, -99401, 25881, 55846, 288437, 143181, 28797, -104713, 197933, -47066, -162381, -59556, 109407, 111677, 31558, 32908, 276027, -73910, -132990, 53653, 134488, -225769, 27942, -241422, 190778, 149803, -223199, -164674, -110448, 99010, 76306, 115694, 298721, -333926, 37625, 73654, -496563, 128494, -10226, -192316, -112966, -183321, -273078, -208810, -91909, -83980, 167759, -62990, 116562, 36657, -98326, -19116, 104328, -138668, 87082, -84664, -95670, -135038, -129751, -28064, -294929, -81381, 160363, 135393, -140530, -107713, -155154, -193804, -115836, -190051, -158090, -174121]
10488a74121e9108p9814L4890k6525d336m2260A56789J04960F0850K95286j50059
10477B06077N8309e9989A62405A4439K15327R9677H8508a27771n55B26144q7134
10466A39010a26425E8142f5442j38243g0638A00945I809a41790A6009n514L48209
10455C58704B7420g5866A96230a28989N1198Q41B37637n7892a15458H7261a67799
10443b42762e7994C25345a08986m654j07565n4841A1308a94861L2876g509A95821
10431b24665B02992a75108B42087J2839b23207a134C5127b68582B79644A32631
10420b08018A86263a09223j44722A58218a68444M0279B0181a54486C02129a08970
10409A28371a26320F5293a59285B09933A266J45175g4346C42931A23757D1815
$$ y = [-174121, -59108, -138922, -104032, -130557, -4336, -46596, 156789, 261749, 60850, 356136, 206077, 264386, -59989, 162405, 14439, 229766, 329443, 88508, -127771, -128326, 226144, 139010, -126425, 58142, -65442, -203685, -70638, 100945, 9809, -141790, 16009, 10495, 358704, 27420, -75866, 196230, -128989, -77791, -76950, 237637, 179745, -115458, 87261, -167799, -242762, -57994, 325345, -108986, -113640, -221205, -276046, 11308, -194861, -161985, -7509, 195821, -224665, 202992, -175108, 242087, 254926, -223207, -1134, 35127, -268582, 279644, 132631, -208018, 186263, -109223, -253945, 158218, -168444, -128165, 20181, -154486, 302129, -108970, 128371, -126320, 65293, -159285, 209933, 1266, 146441, -74346, 342931, 123757, 41815]
10398B2306a21313I8914D5338j250a74084f7803A501c62124a68245O2452k86I11
10385d759I3988L1649A8098J40229Q3024I3585d0642B62044k7297J72586h946
10373A72652H1224M59204g7490B20668J83430J36778n2535N2538A53224J41704
10363B94928m978A30519K51909k0646j80365o02O9103J07815F1635M74223B54400
10351F05880k83130r6742D9495n874K00377N4239j45928J02119Q353j19657P1824
10340B14948J20218C000A045K85316k9919c2658n6575H6045l9237K20693a04480
10328h4684B44289g1866C14518h4265D76055J7181A42021K0691A0246P8276k2812
10317F5710B5076p364a92915B41230E8426b52119J20474e0175B39396a32857C07763
$$ y = [22306, -121313, 98914, 45338, 44088, -174084, -67803, 1501, -362124, -168245, -105793, -106079, 911, -4759, 93988, 125637, 18098, 158327, 241351, 93585, -40642, 262044, 234747, 407333, -8946, 172652, 81224, 540428, -77490, 220668, 404098, 540876, 488341, 540879, 153224, 294928, 289950, 130519, 382428, 361782, 181417, 180815, 249918, 357733, 61635, 535858, 254400, 605880, 322750, 226008, 49495, 43621, 243998, 298237, 152309, 254428, 262781, 143124, 214948, 335166, 3000, 1045, 286361, 256442, -32658, -89233, 86045, 46808, 267501, -104480, -84684, 244289, -71866, 314518, -84265, 476055, 493236, 142021, 162712, 10246, 88522, 65710, 25076, 17712, -192915, 241230, 58426, -252119, -131645, -50175, 239396, -132857, 307763]
10305H7199e0002A11702e4973k6323k9993A90225E4664a41184K0787C0013a35529
10293A34620K01137b14914A26641K1855o6964b07067e2651b1825p7233n8262C6691
10281C17156A32989j3977i4539C04284b48886G8685k3501i520j41362f7831p1832
10270a39663E5761J97804c21490a37909B35247G554M0937d00401a49486f6609
10259B24934k7677A0680J52134L26484A53745C6569a16841E2592J77194q7246
10249A42540a53808A28953I526c34508a56566D04687f7894l207j73802A66780
10238A13141f2110B25809o6111d8014A97244A3240b38683e2840j11228j72080
10228c36148A13243A7039f5762B2591a82579r6434R1765c0592E3242J80552d84618
$$ y = [87199, -50002, 111702, -54973, -81296, -111289, 190225, 54664, -141184, -120397, 30013, -135529, 134620, 335757, -214914, 126641, 148496, 81532, -207067, -52651, -21825, -99058, -157320, 36691, 317156, 132989, 119012, -94539, 304284, -248886, 78685, 55184, -9520, -150882, -67831, -139663, 55761, 253565, -321490, -137909, 235247, 7554, 48491, -400401, -149486, -66609, 224934, 197257, 10680, 162814, 489298, 153745, 36569, -116841, 52592, 229786, 142540, -153808, 128953, 9526, -334508, -156566, 404687, -67894, -71101, -244903, 166780, 113141, -62110, 225809, 159698, -48014, 197244, 13240, -238683, -52840, -164068, -336148, 113243, 17039, -65762, 22591, -182579, -279013, -187248, -30592, 53242, 233794, -484618]
10216B4999b24516d1389A27293N8127c16575A54446b99771J37494B0615a9021
10205a6622r0003e2622l47496M7457i3508j07603r8574d0440k5080r4660L0681
10194a29499A47675g2393B59850j20684b980D3093O9305a85088C01291b35704
10183B46406D3109J08463c14051J09011Q2378m7155D27714f3909B98207j20916
10173A77291c9091A00938a7577j02925F6375a85741F9352K31178c18867F2640
10162b30188M1292A05286D6066a74551j4024N2963F9721b60360E9777J17186o0434
10151A16529C6043D338e6775k50286p6653J57670b9658H5711a98610M5230j78039
10140c31419A40076k4838B7976b93326I4146a48337A51033b79419o3160J14691
$$ y = [24999, -224516, -41389, 127293, 185420, -316575, 154446, -299771, -162277, 20615, -19021, -16622, -106625, -52622, -400118, -352661, -93508, -201111, -299685, -40440, -65520, -160180, -129499, 147675, -72393, 259850, 139166, -2980, 43093, 112398, -185088, 301291, -235704, 246406, 43109, 151572, -314051, -205040, -122662, -169817, 427714, -63909, 298207, 177291, -39091, 100938, -17577, -120502, 66375, -185741, 69352, 300530, -318867, 62640, -230188, -188896, 105286, 46066, -174551, -188575, -135612, 69721, -260360, 59777, 176963, 116529, 36043, 4338, -56775, -307061, -383714, -226044, -29658, 85711, -198610, -153380, -331419, 140076, 115238, 27976, -293326, 94146, -148337, 151033, -279419, -342579, -227888]
10130b27888a8855j06896e5178b1523H7289a24242G1353h4278L6519r1750j03269
10119b42778A46417a06874l1691I6413R4555C0283d31901G5363a43548A66741
10108G587K3808a18957q7103C0051b4874A5686K2995d4098D1889K23610e757A02509
10095A90363c56569L8788N6969F5616k1823a77686A11236B283e771B03527a52997
10083b35221g2371q8836R670j73425J03674L8243P0028a1055k09856h0304n3259
10072a33563j34288B5642J29902c41976h406B37293b23584o1609f8440k0856H2188
10060A0606P510J5500P2308a03305a7810j93899Q762j5308h859A89295g1992l85855
10048d57847B7510J5801b28235h1547j14832B05484b52871L2340E9094b89355
$$ y = [-227888, -18855, -125751, -55178, -21523, 87289, -124242, 71353, -84278, -47759, -139509, -242778, 146417, -106874, -138565, 96413, 190968, 30283, -431901, 75363, -143548, 166741, 7587, 31395, -118957, -206060, 30051, -24874, 15686, 38681, -44098, 41889, 265499, -5757, 102509, 190363, -356569, -317781, -260812, 65616, 43793, -177686, 111236, 2283, -5771, 203527, -152997, -235221, -72371, -161207, -151537, -324962, -221288, -183045, -113017, -11055, -220911, -80304, -133563, -267851, 25642, 155544, -341976, -8406, 237293, -223584, -285193, -68440, -89296, 82188, 10606, 18116, 33616, 105924, -103305, -17810, -211709, -202947, -218255, -8859, 189295, -71992, -457847, 27510, 43311, -228235, -81547, -196379, 205484, -252871, -220531, 59094, -289355]
10037B5551g5838E187a7158g198j5618A94409l5910b0012A80078B5382J50763
10026A76145b33750E5344d58855F7040a19218H8734k9274d4604A24302a24408
10015I6923f351l69178a47705j36799A98339r6586L56081A05908a84864b2754
10004e23231K16217A74831D401d6279a588j96662H9006a2920B5698J22291b10652
9992G983a68998A51509b18705e5905D24018a83617j4515k58691a5998j52438M547
9981a63889F3523i9530A32692i016q3892J1478n9064k3777K7422F0524A922c351
9968b92352A10935l0981h3076k4410c9383o1718j85877h9744m9210A83644b77972
9956c67429n1541H6629k0523b20857L9010b3084r8602A47583h3749A0183L5677
$$ y = [25551, -75838, 5187, -17158, -7198, -22816, 194409, 158499, -20012, 180078, 25382, 176145, -233750, 55344, -458855, 67040, -119218, 88734, 59460, -44604, 124302, -124408, 96923, -6351, -375529, -147705, -284504, 198339, 101753, 457834, 105908, -184864, -22754, -523231, -307014, 174831, 4401, -46279, -1588, -198250, 89006, -12920, 25698, 147989, -210652, 7983, -168998, 151509, -218705, -55905, 424018, -183617, -198132, -456823, -15998, -168436, -163889, 63523, -99530, 132692, -9016, -92908, -81430, -140494, -164271, -136849, 60524, 1922, -3351, -292352, 110935, 79954, -83076, -107486, -39383, -101101, -286978, -89744, -138954, 183644, -277972, -367429, -418970, 86629, 66106, -220857, -181847, -23084, -121686, 147583, -83749, 10183, 45860]
9945D5860K0951a20949a3375j46979L2152c7167A26458a75263q8522q883p5678
9934c48346L9421K3328k0424G919J14978b52505A25984d7382l4198H5506d89863
9922a64800M0923K5794l13563J81519N0016f3951J2700a7216J756B45352A8326
9910b47638J06828e6637n4624c0320D827b50389A5119K14580b91495b088B20217
9898B33709a55253H0506a38859j41592a27538d3068G8822i3420F0936M4293O9424
9887A74653G1333f2131A59559k5721b4646j42170a9209j47776a0293A95127b44661
9875a69174A14704a34797B16351a65135A53764a25433L3679A09556b89044b6916
9864c89448a35404r2828C4862j5276a49629N2472A71671J32652a7609m22192F8392
$$ y = [45860, 66811, -120949, -13375, -160354, -128202, -37167, 126458, -175263, -263785, -272668, -348346, -308925, -285597, -306021, 7919, 122897, -252505, 125984, -47382, -81580, 85506, -489863, -164800, -123877, -98083, -411646, -230127, -180111, -63951, -51251, -17216, -15460, 245352, 18326, -247638, -140810, -56637, -111261, -30320, 4827, -250389, 15119, 229699, -291495, -2088, 220217, 233709, -155253, 80506, -138859, -280451, -127538, -43068, 78822, -93420, 60936, 105229, 174653, 71333, -62131, 159559, 133838, -24646, -166816, -19209, -166985, -10293, 195127, -244661, -169174, 114704, -134797, 216351, -165135, 153764, -125433, -91754, 109556, -289044, -26916, -389448, -135404, -228232, 34862, 19586, -149629, -97157, 171671, 304323, -17609, -439801, 68392]
9852b12752A85038j0411b82939c4053j12203B2348M2144g4065Q112k51736E0236
9840E3081a04002b8962k30320h4294j4888d1613j022p8463A12635J7098a87359
9828i6608G3963B1686a61537j42171a39012K7218c5022n7338j51895q943c2863
9816A07260J09769H3217g9111m9391k15867B08763Q230A02689c59601q2836D8770
9804c39561a1244H1350B1273Q606O5390a02600r502j6096A42984B4880a77472
9792b86406P6246a4577A08054c71037M7115A15994a4409j97415i5184H2316J06080
9781A88396o6329b23468J7738j90731G0139L9341J54386a72273M6446r595K7394
9770a08028L9512k82715O7683g8643c8303j00879N2837j41293A06974K6731f6042
$$ y = [-212752, 185038, 174627, -282939, -34053, -146256, 22348, 64492, -74065, -65953, -317689, 50236, 53081, -104002, -28962, -259282, -84294, -99182, -41613, -42635, -121098, 112635, 129733, -187359, -96608, 73963, 21686, -161537, -303708, -139012, -111794, -35022, -92360, -244255, -253198, -32863, 107260, 217029, 83217, -79111, -128502, -344369, 208763, 216993, 102689, -359601, -442437, 48770, -339561, -11244, 81350, 21273, 29879, 95269, -102600, -112102, -128198, 142984, 24880, -177472, -286406, -210160, -14577, 108054, -371037, -323922, 115994, -14409, -211824, -95184, 82316, 188396, 122067, -223468, -205730, -396461, 70139, 109480, 263866, -172273, -125827, -135422, -108028, -68516, -351231, -283548, -78643, -38303, -139182, -86345, -227638, 106974, 133705, -66042]
9758A89290p0490b49217j84843K01273h1266l7240B42233j3798o8166n4944a06840
9746A73641d2799A0226c21294F0964b9783l3223A59118A5526P1835R5353H8396
9734a28963G9267c1469j924j71097B12775e0158m9009E2487A1991K7431a94559
9722a41367C1899f7062J7398A58257o6619f13902C8425L30013e405j10338A60522
9710c00066C3835Q4002c8400D1811b45146b3546E1108a95078K6537P511g5737
9698a82258D4162d92094D7352c9071k05763B21274a19041p4787B46757a17076
9687B6524L20363d9460E0324h6418j25653m084j73915a69817j31271A17207a85799
9675b80907a16201a2840G1672n400d65481b23750c8335A24811j3399A3508f7742
$$ y = [189290, 118800, -249217, -434060, -232787, -81266, -118506, 242233, 228435, 160269, 105325, -106840, 173641, -42799, 10226, -321294, 60964, -29783, -63006, 159118, 15526, 87361, 182714, 88396, -128963, 79267, -31469, -33393, -204490, 212775, -50158, -99167, 52487, 11991, 39422, -194559, -141367, 31899, -67062, -49664, 158257, 91638, -613902, 38425, 368438, -5405, -115743, 160522, -300066, 33835, 117837, -38400, 41811, -245146, -23546, 51108, -195078, -168541, -161030, -75737, -182258, 44162, -492094, 47352, -39071, -244834, 221274, -119041, -193828, 246757, -117076, 26524, 346887, -49460, 50324, -86418, -212071, -216155, -390070, -169817, -301088, 117207, -185799, -280907, -116201, -12840, 71672, 66272, -465481, -223750, -38335, 124811, 111412, 13508, -67742]
9663a99166R799f6081j50183B06144a04580p3211C48123o3576C4008A891a34169
9651b13731E1347a38055L6979r3504Q65B57457b82180H7174A0526a57058B3155
9639a47679L5479B35155f1437j80522Q6855d3152j71478P7716C16387m6063a80139
9627c323j06182d7987D9084a92518h0780k25340m5495a12887j7455M3153C48680
9615C5362h017j93642J0911G9911b30281j07481F2037a45413j2851l9419r183
9604b06866O0455I6528d2809l24978d6201K1227a0326j3122A97432a03960K0000
9593h3960j67711J20541C42356H2229J00485r537B3954d6056l04210B4797L4602
9582E9399e9107j8406L3384k20433e4991r5100j25460R9508B1875d03850A9354
$$ y = [-199166, -189367, -66081, -216264, 206144, -104580, -177791, 348123, 284547, 34008, 1891, -134169, -213731, 51347, -138055, -101076, -194580, -193715, 257457, -282180, 87174, 10526, -157058, 23155, -147679, -112200, 235155, -61437, -241959, -155104, -43152, -214630, -136914, 316387, 270324, -180139, -3323, -109505, -47987, 49084, -192518, -80780, -306120, -351615, -112887, -130342, -87189, 348680, 35362, -8017, -201659, -190748, 79911, -230281, -337762, 62037, -145413, -158264, -197683, -206866, -146411, 96528, -42809, -367787, -46201, -24974, -10326, -23448, 197432, -103960, -83960, -251671, -131130, 342356, 82229, 182714, 173177, 23954, -46056, -350266, 24797, 59399, -59107, -77513, -44129, -264562, -54991, -150091, -275551, -176043, 21875, -403850, 19354]
9570A43710a15380A61169d77498F767f6477j39141B38618F8217B1708b3459A42809
9558A61694f5455B64488E9775K79326b33946a06835I0628a98402l16487a07840
9547b01735a6194j50226E3640O516e68105b43960m8755D1379K62816h8137A27818
9535A25488C0869a68018j11457R0632E1052b5925k2472F0113b41117A16748f3442
9523a52208a2254A65680C1492R657a21740a4861q5393N960F1868J72121g9107
9511C47120I6965d9359o2646j70198k5191a50457j4502J7568O0195A47865E3098
9499a4227C9150b39909J02864M4524B0178i0212C5297Q0837b29891k51959A00154
9487a69342A96542H7307d9152B14676b52136g9509A62589a52258r1963L031A98413
$$ y = [143710, -115380, 161169, -477498, 6767, -66477, -205618, 238618, 68217, 21708, -23459, 142809, 161694, -65455, 264488, 59775, 339101, -233946, -106835, 90628, -198402, -514889, -107840, -201735, -16194, -166420, 53640, 60156, -568105, -243960, -292715, 41379, 304195, -88137, 127818, 125488, 30869, -168018, -279475, -188843, 51052, -25925, -48397, 60113, -241117, 116748, -63442, -152208, -12254, 165680, 31492, 41149, -121740, -14861, -100254, -94294, 61868, 233989, -79107, 347120, 96965, -49359, -112005, -282203, -307394, -150457, -164959, -147391, -87196, 147865, 53098, -14227, 39150, -239909, -137045, -92521, 20178, -90212, 35297, 116134, -229891, -481850, 100154, -169342, 196542, 87307, -49152, 214676, -252136, -79509, 162589, -152258, -244221, -241190, 198413]
9475F6392c157k75779J00524a8520m9522k09245a17186J288Q872J9337J6482j34913
9463b06120j5123A2255a3584A1947b18368B98171a94483C40161b12145K5695A44989
9451i0071k45941E718b92457L7022A22716b67242M6332d294A00947a17204G8815
9439a98982B387g1388n8364k96696a28472L6528d0158k14484d0619j53509C38744
9427A99829g6002k53298B7183e7470o3466A9221b27670k2070A14998h990k6907
9416c5897A74843b2362q426p5016F5311b30037A32222b45342b6194l73163B2093
9404b44575i6473A21176a87025M7754A08888c86884a30147M2787J1686L0587l0621
9393g5708k0034B79527b38074j30734a6271m2263A70043a5701l80647B65175a64752
$$ y = [66392, -3157, -278936, -178412, -18520, -68042, -277287, -117186, -115898, -107026, -87689, -71207, -206120, -221243, 12255, -13584, 11947, -218368, 298171, -194483, 340161, -212145, -186450, 144989, -90071, -336012, 5718, -292457, -255435, 122716, -267242, -220910, -4294, 100947, -117204, 78815, -198982, 2387, -71388, -129752, -426448, -128472, -91944, -40158, -254642, -40619, -194128, 338744, 199829, -76002, -329300, 27183, -57470, -120936, 19221, -227670, -249740, 114998, -8990, -35897, 174843, -22362, -30788, -105804, 65311, -230037, 132222, -245342, -26194, -399357, 22093, -244575, -96473, 121176, -187025, -139271, 108888, -386884, -130147, -87360, -75674, -45087, -75708, -95742, 279527, -238074, -368808, -16271, -58534, 170043, -15701, -396348, 265175, -164752]
9381B4606i3580q3122B74019A28803l1311c76406G3917C1156a78645A81079F507
9369a34376e9750b5429p8366K9663l19071a35550E8094a90800A20944B2489a9106
9357b27727L3742j6399O0224j63431B44387c69259D1719a44597j23906g6305k15044
9346b91349A05491l3684h148C80089d4751F8408e2329j46722P3053K4855A78473
9334a27888k03739J31995J2041P5579d1548r3602O4718o3594r609k63392d3446
9322b26982C2776d77375A65021D974P5664a14309A31951a62771A37135J05402
9312B42537A4355a77441j94015I2174a08613k37292A4430L52663j45669a39247
9301a42721n0858C0011a84761g8919J9355A86077i8581m7241a6982n2386m0623
$$ y = [24606, -93580, -176702, 274019, 128803, 97492, -376406, 73917, 31156, -178645, 181079, 6507, -134376, -59750, -25429, -103795, -74132, -393203, -135550, 58094, -190800, 120944, 22489, -19106, -227727, -193985, -210384, -150160, -313591, 244387, -369259, 41719, -144597, -268503, -76305, -291349, 105491, 71807, -8148, 380089, -44751, 68408, -52329, -199051, -125998, -101143, 178473, -127888, -331627, -199632, -187591, -112012, -41548, -135150, -70432, -134026, -143635, -407027, -43446, -226982, 32776, -477375, 165021, 4974, 80638, -114309, 131951, -162771, 137135, 242537, 14355, -177441, -371456, 92174, -108613, -345905, 14430, 367093, 221424, -139247, -142721, -193579, 30011, -184761, -78919, -59564, 186077, -98581, -145822, -16982, -69368, -109991]
9290a09991j25886J08287M0333M3516l9056I1260N7884a73550p6777a2030A41190
9278g7782A95277c7473B02478i13F9267J61473a38895O2959l0195c0768l79472
9267d10240Q0426f2056F6646K08724C4233R1322E2336B1363K8304c15817e4099
9255b96768D0281N5981O8055a25810A56293a71760e1152j27317O964j7958A60397
9243G9421b56440A70343J11020i8485M2547G1071a64876j6533J5245I988b06373
9231b98795M2674a8581j56787m3434B35088D2232L16620b1874j79248A41418G802
9219a27084k61391a43665k1015E0311a47172d5640C4928d8704B04872b94202A94947
9207a09347C2306J1882a32423e0012o3598a1240o2541j22371C5667K06209l0282
$$ y = [-109991, -235877, -127590, -87257, -43741, -82797, 91260, 149144, -173550, -250327, -12030, 141190, -77782, 195277, -37473, 202478, -913, 69267, 230740, -138895, -75936, -106131, -30768, -410240, -329814, -62056, 66646, 275370, 34233, 125555, 52336, 21363, 49667, -315817, -54099, -296768, 40281, 96262, 164317, -125810, 156293, -171760, -51152, -178469, -171505, -189463, 160397, 79421, -256440, 170343, 281363, -98485, -55938, 71071, -164876, -181409, -166164, 9988, -206373, -298795, -256121, -18581, -175368, -218802, 235088, 42232, 358852, -21874, -201122, 141418, 7802, -127084, -388475, -143665, -164680, 50311, -147172, -45640, 34928, -48704, 204872, -294202, 194947, -109347, 32306, 44188, -132423, -50012, -113610, -11240, -73781, -196152, 35667, 241876, 211594]
9196B11594A8103O3621a11371n9269P2215A01406k2474a21796j05706J08552j60409
9185b79359N8900d0195A50216d3738B13028a61847o366A11406c5895l14121a10574
9173a62446A85883q7497K0207b56273a24441a3904j5224m0674k25095A76044c31783
9161C49156F0199L7664b75810F3828a23038c4653j81896m7980a743l9218k521
9150d3482k4532D1542O8582b74728g7057K7896p7939C7654a51339A69030G5140
9138f571G624f7453A63549n0432b72380J18701J1686q0207d62A69677j3794b67784
9125F1372b67793j3193d4210j51959L1127k01779J20316l29472a32373D4707c89091
9113e7690A65902a67349C3499a22025A7658a94242A24829Q0944E7325Q7799g7494
$$ y = [211594, 18103, 81724, -111371, -170640, -98425, 101406, 78932, -121796, -227502, -118950, -279359, -220459, -40195, 150216, -43738, 213028, -161847, -168213, 111406, -35895, -350016, -110574, -162446, 185883, 98386, 118593, -256273, -124441, -13904, -29128, -69802, -294897, 176044, -331783, 349156, 60199, 97863, -275810, 63828, -123038, -34653, -216549, -264529, -1743, -40961, -43482, -68014, 41542, 110124, -274728, -77057, -49161, -127100, 37654, -151339, 169030, 75140, -6571, 7624, -67453, 163549, 113117, -272380, -153679, -141993, -222200, -462, 169677, 155883, -267784, 61372, -267793, -280986, -44210, -196169, -165042, -366821, -246505, -575977, -132373, 44707, -389091, -57690, 165902, -167349, 33499, -122025, 17658, -194242, 124829, 205773, 57325, 145124, -77494]
9101d7147K1128j15210d2628B63643j00424a9296o5696c1013q1440e2843k76634
9090c29477G32a08338E9953d54605A6068a37258k36397C21192i2607l52622a26102
9078e48701I52b76339d9664l31060a2417A183M4757L9114a12696k09958N5955
9067b66699D206J93284F2814a67661j11180g674B48408b18943a04038p1273N0255
9056a25056A98000c4724J5510l426B70217b91777C9410b75430J33828k27035g7850
9044b02788E4469b16457B65698j15027k5113b5362H4844m0889J8632B9252J75622
9033B04874c3268j90921e8526b6357l78093A44065b71551i190k45830R731H2015
9021d5938n14p1176B53831o670e10052b17004A16216M9894a99199C1104i2990
$$ y = [-47147, -26019, -141229, -42628, 263643, 163219, -19296, -84992, -31013, -112453, -52843, -329477, 732, -108338, 59953, -454605, 16068, -137258, -373655, 321192, -92607, -445229, -126102, -548701, 952, -276339, -49664, -380724, -12417, 1183, 45940, 85054, -112696, -322654, -266699, 4206, 197490, 62814, -167661, -278841, -7674, 248408, -218943, -104038, -175311, -125056, 198000, -34724, -19214, -22640, 270217, -291777, 39410, -275430, -141602, -368637, -77850, -202788, 54469, -216457, 265698, 150671, 125558, -25362, 84844, 43955, 62587, 29252, 204874, -33268, -224189, -58526, -26357, -404450, 144065, -271551, -9190, -255020, -245289, 82015, -45938, -46452, -117628, 253831, 247161, -510052, -217004, 116216, 166110, -199199, 31104, -92990]
9009a28134N5414b5105G0224e4689A8506c79133J20225f3927A51267a53474a4076
8997H2676f4674k69123j09275F8830b70074a18762A90713a11119A23664K47022
8987C70686a77227A87096m5864b01464j31180C08068b23070B08822b4967A79516
8976A43878F2292a07069A45339e25513F5784d50440a44488A07773J44667A03693
8965A7543i4522n3815A91185b244k30351A39276a48251K78k12425A39326n6406
8954H2920A3931a32196G5428J23008a692j24310G6816A6034R483d31836J42899
8943b88937B95333a47895n8177B46433k6984a19638b7916A08768R6012k0021b01316
8931A43483K41449C7489J94394p2158L25494J40073N46756J294928L910382J2314094
$$ y = [-128134, -72720, -25105, 70224, -54689, 18506, -379133, -258908, -63927, 151267, -153474, -14076, 82676, -64674, -333797, -443072, 68830, -270074, -118762, 190713, -111119, 123664, 370686, -177227, 187096, 141232, -201464, -332644, 308068, -223070, 208822, -24967, 179516, 143878, 62292, -107069, 145339, -525513, 65784, -450440, -144488, 107773, 252440, 103693, 17543, -94522, -148337, 191185, -2244, -232595, 139276, -148251, -147973, -360398, 139326, 82920, 13931, -132196, 75428, 198436, -1692, -126002, 76816, 16034, 25517, -431836, -288937, 295333, -147895, -206072, 246433, 219449, -119638, -27916, 108768, 204780, 184759, -201316, 143483, 384932, 37489, 231883, 159725, 485219, 625292, 1172048, 2466976, 6377358, 18691452]
8921A8691452o719768C935720A653012o56134j35820l64505j97623j8841J5621
8912B95710j00960G3176M49180J52484K5707A47886N822B8376a3420D2978K57238
8901C00216F9131c77730A49636j886i8996E5054R7845Q2746a15613E6441J31913
8890A88354i7033n6457f3304l33584F5437b49979i6529l7805r4461O8467B06581
8878d6721m52079e1332o7268N1400H868a93187I492a01075K3401L7170m8634j25130
$$ y = [18691452, 11971684, 3935720, 1653012, 996878, 861058, 496553, 298930, 280089, 295710, 194750, 73176, 522356, 674840, 700547, 147886, 153708, 28376, -13420, 42978, 300216, 69131, -377730, 149636, 147750, -98996, 55054, 152899, 235645, -115613, 56441, 188354, -97033, -153490, -63304, -396888, 65437, -249979, -96529, -134334, -228795, -160328, 206581, -46721, -498800, -51332, -118600, -67200, 8868, -193187, 9492, -101075, -77674, -40504, -89138, -214268]
$$ [...]
##END NTUPLES=NMR SPECTRUM
##END=
