
##TITLE=UV1225_M6_1234-1212_50_7231073_4BOEm63b0W
##JCAMPDX= 6.0         $$ Bruker NMR JCAMP-DX V2.0
##DATA TYPE= NMR SPECTRUM
##DATA CLASS= NTUPLES
##ORIGIN= BRUKER
##OWNER= Administrator
$$ 1.72 TOPSPIN		Version 2.1
$$ 2013-01-26 02:07:12.920 -0500  Administrator@X
$$ Compression mode = diff/dup
##.OBSERVE FREQUENCY= 400.02188249412
##.OBSERVE NUCLEUS= ^1H
##.ACQUISITION MODE= SIMULTANEOUS (DQD)
##.ACQUISITION SCHEME= undefined
##.AVERAGES= 8
##.DIGITISER RES= 22
##SPECTROMETER/DATA SYSTEM= spect
##.PULSE SEQUENCE= zg30
##.SOLVENT NAME= COFFEE_meoh
##.SHIFT REFERENCE= INTERNAL, COFFEE_meoh, 1, 14.98509
##AUDIT TRAIL= $$ (NUMBER, WHEN, WHO, WHERE, PROCESS, VERSION, WHAT)
$$ ##TITLE= Audit trail, TOPSPIN		Version 2.1
$$ ##JCAMPDX= 5.01
$$ ##ORIGIN= Bruker BioSpin GmbH
$$ ##OWNER= Administrator
$$ $$ E:\/data/COFFEE/nmr/UV1225_M6_1234-1212_50_7231073_4BOEm63b0W/40/pdata/1/auditp.txt
$$ ##AUDIT TRAIL=  $$ (NUMBER, WHEN, WHO, WHERE, PROCESS, VERSION, WHAT)
(   1,<2013-01-26 02:07:04.998 -0500>,<Administrator>,<X>,<go>,<TOPSPIN 2.1>,
      <created by zg
	started at 2013-01-26 02:05:59.032 -0500,
	POWCHK enabled, PULCHK disabled,
       configuration hash MD5:
       86 BA 57 50 F2 9D 5C 9B 26 00 A9 28 5F 66 2E 89
       data hash MD5: 64K
       34 DF 89 C1 40 85 31 47 D7 D2 F6 28 8A AE 18 12>)
(   2,<2013-01-26 02:07:07.936 -0500>,<Administrator>,<X>,<proc1d>,<TOPSPIN 2.1>,
      <Start of raw data processing
       efp LB = 0 FT_mod = 6 PKNL = 1 PHC0 = 0 PHC1 = 0 SI = 32K 
       data hash MD5: 32K
       F0 F0 1B CF 4E DC 9A BB 2E 2A DC 0E DD A0 CF F1>)
(   3,<2013-01-26 02:07:08.404 -0500>,<Administrator>,<X>,<proc1d>,<TOPSPIN 2.1>,
      <pk PHC0 = 98.72314 PHC1 = 0 
       data hash MD5: 32K
       5A C0 6E D5 A5 FB 89 22 34 76 00 92 EE 4C 71 E9>)
(   4,<2013-01-26 02:07:08.623 -0500>,<Administrator>,<X>,<proc1d>,<TOPSPIN 2.1>,
      <abs ABSG = 1 
       data hash MD5: 32K
       61 F5 EB 0C 05 CA 64 38 23 16 6A DB 83 22 08 6D>)
(   5,<2013-01-26 02:07:08.764 -0500>,<Administrator>,<X>,<proc1d>,<TOPSPIN 2.1>,
      <abs ABSG = 2 
       data hash MD5: 32K
       F6 93 12 03 FF D6 75 0B C2 60 CC 02 CB 0B 8A 95>)
(   6,<2013-01-26 02:07:08.904 -0500>,<Administrator>,<X>,<proc1d>,<TOPSPIN 2.1>,
      <abs ABSG = 3 
       data hash MD5: 32K
       E9 46 C0 56 C4 17 6D 5B 08 2C 67 F2 14 7B 28 B5>)
(   7,<2013-01-26 02:07:09.061 -0500>,<Administrator>,<X>,<proc1d>,<TOPSPIN 2.1>,
      <abs ABSG = 4 
       data hash MD5: 32K
       6A 9A 68 6A E1 C6 41 B7 3C 9D 91 BC 51 4E EF BF>)
(   8,<2013-01-26 02:07:09.201 -0500>,<Administrator>,<X>,<proc1d>,<TOPSPIN 2.1>,
      <abs ABSG = 5 
       data hash MD5: 32K
       EC F5 D9 19 A3 04 8B 40 2A A9 6A DC C7 E0 9D 55>)
$$ ##END=
$$ 
$$ $$ hash MD5
$$ $$ 4F 9A F4 50 20 5D 50 4E 1A 1A CB 74 D3 BC 77 91
##$RELAX= 
##$RELAX= 
##$RELAX= 
##$RELAX= 
##$RELAX= 
##$RELAX= 
##$RELAX= 
$$ Bruker specific parameters
$$ --------------------------
##$DU= <E:\>
##$EXPNO= 40
$$ [...]
##$TP= (0..7)
150 150 150 150 150 150 150 150
##$TP07= 0
##$TPNAME0= <>
##$TPNAME1= <>
##$TPNAME2= <>
##$TPNAME3= <>
##$TPNAME4= <>
##$TPNAME5= <>
##$TPNAME6= <>
##$TPNAME7= <>
##$TPOAL= (0..7)
0.5 0.5 0.5 0.5 0.5 0.5 0.5 0.5
##$TPOFFS= (0..7)
0 0 0 0 0 0 0 0
##$TUNHIN= 0
##$TUNHOUT= 0
##$TUNXOUT= 0
##$USERA1= <user>
##$USERA2= <user>
##$USERA3= <user>
##$USERA4= <user>
##$USERA5= <user>
##$V9= 5
##$VALIST= <valist>
##$VCLIST= <CCCCCCCCCCCCCCC>
##$VD= 0
##$VDLIST= <DDDDDDDDDDDDDDD>
##$VPLIST= <PPPPPPPPPPPPPPP>
##$VTLIST= <TTTTTTTTTTTTTTT>
##$WBST= 2048
##$WBSW= 25
##$XGAIN= (0..3)
0 0 0 0
##$XL= 0
##$YL= 0
##$YMAX_a= 669502
##$YMIN_a= -569963
##$ZGOPTNS= <>
##$ZL1= 120
##$ZL2= 120
##$ZL3= 120
##$ZL4= 120
##$ABSF1= 14.98509
##$ABSF2= -5.573092
##$ABSG= 5
##$ABSL= 3
##$ALPHA= 0
##$AQORDER= 0
##$ASSFAC= 0
##$ASSFACI= 0
##$ASSFACX= 0
##$ASSWID= 0
##$AUNMP= <proc_prof1d_extract_pilot.lims>
##$AXLEFT= 0
##$AXNAME= <>
##$AXNUC= <1H>
##$AXRIGHT= 0
##$AXTYPE= 0
##$AXUNIT= <>
##$AZFE= 0.1
##$AZFW= 0.1
##$BCFW= 0
##$BC_mod= 0
##$BYTORDP= 0
##$COROFFS= 0
##$CY= 15
##$DATMOD= 1
##$DC= 0
##$DFILT= <>
##$DTYPP= 0
##$F1P= 0
##$F2P= 0
##$FCOR= 0.5
##$FTSIZE= 32768
##$FT_mod= 6
##$GAMMA= 0
##$GB= 0
##$INTBC= 1
##$INTSCL= 1
##$ISEN= 128
##$LB= 0
##$LEV0= 0
##$LPBIN= 0
##$MAXI= 10000
##$MC2= 0
##$MEAN= 0
##$ME_mod= 0
##$MI= 0
##$NCOEF= 0
##$NC_proc= -8
##$NLEV= 6
##$NOISF1= 0
##$NOISF2= 0
##$NSP= 0
##$NTH_PI= 0
##$NZP= 0
##$OFFSET= 14.98509
##$PC= 1
##$PHC0= 98.72314
##$PHC1= 0
##$PH_mod= 1
##$PKNL= yes
##$PPARMOD= 0
##$PPDIAG= 0
##$PPIPTYP= 0
##$PPMPNUM= 2147483647
##$PPRESOL= 1
##$PSCAL= 4
##$PSIGN= 0
##$PYNMP= <proc.py>
##$REVERSE= no
##$SF= 400.02
##$SI= 32768
##$SIGF1= 0
##$SIGF2= 0
##$SINO= 400
##$SIOLD= 32768
##$SPECTYP= <>
##$SREGLST= <1H.CDCl3>
##$SSB= 0
##$STSI= 32768
##$STSR= 0
##$SW_p= 8223.68421052631
##$SYMM= 0
##$S_DEV= 0
##$TDeff= 65536
##$TDoff= 0
##$TI= <>
##$TILT= no
##$TM1= 0
##$TM2= 0
##$TOPLEV= 0
##$USERP1= <user>
##$USERP2= <user>
##$USERP3= <user>
##$USERP4= <user>
##$USERP5= <user>
##$WDW= 1
##$XDIM= 32768
##$YMAX_p= 468798638
##$YMIN_p= -692054
##$CURPLOT= <Network HP LaserJet P1505>
##$CURPRIN= <$Network HP LaserJet P1505>
##$DFORMAT= <normdp>
##$LAYOUT= <+/1D_H.xwp>
##$LFORMAT= <normlp>
##$PFORMAT= <normpl>
##$SURQMSG= 1
$$ End of Bruker specific parameters
$$ ---------------------------------
##NTUPLES= NMR SPECTRUM
##VAR_NAME=  FREQUENCY,     SPECTRUM/REAL,   SPECTRUM/IMAG
##SYMBOL=    X,             R,               I
##VAR_TYPE=  INDEPENDENT,   DEPENDENT,       DEPENDENT
##VAR_FORM=  AFFN,          ASDF,            ASDF
##VAR_DIM=   32768,         32768,           32768
##UNITS=     HZ,            ARBITRARY UNITS, ARBITRARY UNITS
##FACTOR=    0.250966925370066, 1,           1
##FIRST=     8223.43324360094, -75583,       13334
##LAST=      0,             -117813,         -18774
##MIN=       0,             -692054,         0
##MAX=       8223.43324360094, 468798638,    0
$$ Real data points
##PAGE= N=1
##DATA TABLE= (X++(R..R)), XYDATA
$$ [...]
19537a88315O1466B78112D4292a13415E712M2874J33906a7227I2376L1974c18124
19525A82707A579a3147j07864c8245l2943A2814Q9345j4733b57759A48252b61607
19513e2047A6456R3072m228c1854j95497G5426B6239M8688b05211Q5257a2949
19501A55352K8088c14984a55615j50935a15932j52925A64800b649F8162k2767
19491D5395b55618a12795P449J8501A85505A387O6625c07505m2233M2163j01733
19480d09308J09434F0962h2500K6431b8009q986b795A08696K9957L6167a08178
19468a08547C5037a92223b2563j96418A9882J14587a06846B06639a08392A1842
19457E1311a00679r4553B6690J7281b85006K4624B25870c55898F8992c0104k16437
$$ y = [-188315, -126849, 278112, 44292, -113415, 5712, 48586, 182492, -17227, 92376, 124350, -318124, 182707, 1579, -13147, -121011, -38245, -71188, 12814, 102159, 87426, -257759, 148252, -261607, -52047, 16456, 109528, 105300, -31854, -227351, 75426, 26239, 74927, -205211, -119954, -12949, 155352, 183440, -314984, -155615, -306550, -115932, -268857, 164800, -2649, 68162, 45395, -255618, -112795, -105346, -86845, 185505, 1387, 68012, -307505, -349738, -307575, -409308, -299874, 60962, -82500, -56069, -28009, -36995, -2795, 108696, 138653, 174820, -108178, -108547, 35037, -192223, -22563, -218981, 19882, 134469, -106846, 206639, -108392, 11842, 51311, -100679, -195232, 26690, 43971, -285006, -260382, 225870, -355898, 68992, -30104, -246541]
19446b46541j2495p8681M1037I6168b23208j28914h0829o6185I5197b162C00571
19434A80278b20557Q0321r8975D5305f4414a0246o8130D4889J03878B0038a36057
19422A01642K5192R1026o4753G5452K23503n6330K8359D3320N2478P3500d10970
19410a97517H8855N7521J0995a04881D7379M5982a91183A68850b78803C1957a53743
19398d3033p9422A35996h3791n4645K2021O926j06135A10272K3847d4961C6740
19386b53145B12610l6932d8442A66048b485G742I52P6395q186c71202K7023P7370
19374b66809L1391I1112a75128a1730j46217k16956C36871a29158L3405Q734j94839
19363b81858j2799A31119c74600d4130a6802k6353k05811l3293H9656e4536C02182
$$ y = [-246541, -259036, -337717, -296680, 96168, -223208, -352122, -80829, -147014, 95197, -2162, 300571, 180278, -220557, -140236, -239211, 45305, -64414, -10246, -78376, 44889, 148767, 20038, -136057, 101642, 126834, 217860, 153107, 75452, 298955, 242625, 270984, 43320, 95798, 169298, -410970, -197517, 88855, 146376, 157371, -104881, 47379, 93361, -191183, 168850, -278803, 31957, -153743, -43033, -122455, 135996, -83791, -138436, -116415, -109489, -215624, 110272, 134119, -44961, 36740, -253145, 212610, 175678, -48442, 166048, -2485, 7742, 952, 77347, 69161, -371202, -344179, -266809, -235418, 91112, -175128, -11730, -157947, -374903, 336871, -129158, -95753, -87019, -281858, -294657, 131119, -374600, -44130, -16802, -43155, -248966, -282259, 89656, -54536, 302182]
19351g3557o8463e1790F6446b50487M6758J7832B43109i2902j10176l3779n7900
19340b94757A21906M5609b50584O28G2825K9273N6666d7966j16515C235J02308
19329A05543b0376l26965E4287a27962p5529B8855J39995J8987b44394P3300f3593
19317a26112D4677J4404f9540k7370A37676C6020c2423j40258A53407h5802n3041
19306a38843O4381E4889a90742p4534b1710j53246k35802J80412e5839C38204
19295a84075m8908B91358a44479A5903c6707k43405I3425c03992A12084g8801
19284f966p0831q9997A41458a88088C934a86631C08170A5682i1659B1096i6719
19272A77444C2896a70247P6719j58898g7339J736j3967k06634e2337A97252a65558
$$ y = [-73557, -142020, -51790, 66446, -250487, -203729, -185897, 243109, -92902, -203078, -236857, -294757, 121906, 167515, -250584, -249956, 72825, 102098, 158764, -47966, -164481, 3235, 105543, -20376, -347341, 54287, -127962, -203491, 28855, 168850, 187837, -244394, -171094, -63593, -126112, 44677, 59081, -69540, -96910, 137676, 36020, -32423, -172681, 153407, -85802, -138843, -74462, 54889, -190742, -265276, -21710, -174956, -410758, -230346, -55839, 338204, -184075, -232983, 291358, -144479, 15903, -36707, -280112, 93425, -303992, 112084, -78801, -6966, -77797, -167794, 141458, -188088, 3934, -186631, 308170, 15682, -91659, 21096, -96719, 177444, 32896, -170247, -93528, -252426, -77339, -75603, -89570, -296204, -52337, 197252, -165558]
19260a39816e8580H1641a0016l82665h2613b605j44642I1620c91587I809b40788
19248a7879p7109A7025a83942k04455O5200A25836J0365o0757a35885f1605A82878
19236D3685b96295D3680d7021l5302k00121Q447i6664a5204j05091D4130A5693
19224B27185e3608B55299A07301d08330A4457a31946N9655l68451n5619H5758
19213B09164b3976A13814j1464a92249p8929d8930k35137f2998p7443n1311l4485
19202b26237i7340A73747b55608E4363g4532j92668o1937d0400k5173B36912e0439
19190A57822b85744H4120J26544b77396E7605b27582C28010a43918I2692A4226
19179b63875A48915l3469a36820j36659O2808R9562C7199b16346E9800b2145n9325
$$ y = [-139816, -58580, 81641, -10016, -392681, -82613, -2605, -147247, 91620, -391587, 9809, -240788, -17879, -94988, 17025, -183942, -388397, -323197, 125836, 136201, 75444, -135885, -61605, 182878, 43685, -296295, 43680, -47021, -82323, -282444, -273997, -96664, -15204, -120295, 44130, 15693, 227185, -53608, 255299, 107301, -408330, 14457, -131946, -72291, -440742, -496361, 85758, 209164, -23976, 113814, 102350, -192249, -271178, -48930, -284067, -62998, -140441, -191752, -226237, -97340, 173747, -255608, 54363, -74532, -267200, -329137, -40400, -65573, 236912, -50439, 157822, -285744, 84120, 210664, -277396, 57605, -227582, 328010, -143918, 92692, 14226, -263875, 148915, 115446, -136820, -273479, -210671, -111109, 37199, -216346, 59800, -22145, -81470]
19168h1470m2135D3971a13031E3901a46194N8247j63443P7629D50722b09389D6496
19156A00315i2745A44154o301a09125j56705j51046a30583K3716j77961A28320
19145h6609l48097b8810k62782B98637a17660k8889C2315Q2890d34701a92557
19134a3823A33073e8668A2915b82143r3057h7010B32739C0065b11601e0048j43162
19123a93210C1475j4387c48367A52107a59935A0691c47919J24893i7017m35462
19113e32479a83725d4639l70331G6791d4211k32599h2723J1167k56132d161F2143
19101H1578a6376o2001C650g3598I324g2005l3456A28152b24940f7454m6135G785
19088c08448J00532j3697O8162C312b47177h7736M2992H8870M8775C6846a75971
$$ y = [-81470, -123605, 43971, -113031, 53901, -146194, -87947, -251390, -173761, 450722, -209389, 46496, 100315, -92745, 144154, 137853, -109125, -265830, -416876, -130583, -106867, -284828, 128320, -86609, -434706, -28810, -291592, 298637, -117660, -146549, 32315, 115205, -434701, -192557, -13823, 133073, -58668, 12915, -282143, -375200, -87010, 232739, 30065, -211601, -50048, -193210, 31475, 17088, -348367, 152107, -159935, 10691, -347919, -223026, -97017, -532479, -183725, -44639, -414970, 76791, -44211, -276810, -82723, -71556, -327688, -4161, 62143, 81578, -16376, -78377, 3650, -73598, 9324, -72005, -105461, 128152, -224940, -67454, -113589, 7785, -308448, -207916, -221613, -153451, 3312, -247177, -87736, -44744, 88870, 137645, 36846, -175971]
19076a00658l04619b7481A72293o2292B0895b78548B3072b67j1891C9063i6212
19064G1874O3946d589A04657j8062c133h77m3824p2625j09773A57380e6671l5605
19052i2276k193A5073a25694M733A64291a091m04725C9614b69306E1849a08376
19040a37894P967A23299j1910b5373r1118d3216l1782B03919e51250A73911k8872
19029A45039j2563a68935f7458k22443I2327a13288c140j43245D71734A16251
19018A39444a83552h1719j42333M0773N5995j71298A41848g6117A59516e2832
19007F8394b75650J23266A20435A4296K7741c66980E0230a02064k16310J45787
18997a72587D26816a51793N1605D0429a5770m3240k53515c5693E8616h2399D49106
$$ y = [-100658, -405277, -27481, 172293, 110001, 20895, -278548, 23072, -267, -12158, 39063, -96212, 71874, 135820, -4589, 104657, 86595, -3133, -877, -44701, -117326, -227099, 157380, -56671, -92276, -94469, 15073, -125694, -120961, 164291, -1091, -405816, 39614, -269306, 51849, -108376, -137894, -129927, 123299, 111389, -25373, -116491, -43216, -74998, 203919, -551250, 173911, 145039, 132476, -168935, -67458, -289901, 92327, -113288, -3140, -146385, 471734, 116251, 139444, -183552, -81719, -224052, -183279, -127284, -298582, 141848, -76117, 159516, -52832, 68394, -275650, -152384, 120435, 14296, 42037, -366980, 50230, -102064, -318374, -172587, 426816, -151793, -100188, 40429, -15770, -59010, -312525, -35693, 58616, -82399, 449106]
18985d01390J72128a7621m33963f3844A70302k8165D7729c786j1489j3943A01821
18973a93043A28803k105g6107q5229C00677a47553f9103o88l4179j22499E0326
18961c535j12755B76894a99207D96736a69810B88332a51638F2285A5780J12096
18951A27876c51662I2979J04673a0608A7304a12576C10089g8051A58363D8728
18940A5861a13777M1574a7280j34073j69950h8700l4801n6724B97616I0885g1678
18928A41656m9817M6079c51210A93299l2019J76383g4274j15183k0437R9976M9171
18917f0747G6783J95861a01167j7210M409k44450a75229E1682J0862b96464d0462
18905A95171a95123g8200B33946c3285j0262C9198A8448c80167I8924J4073M8819
$$ y = [-401390, -229262, -17621, -451584, -63844, 170302, 142137, 47729, -3786, -15275, -29218, 101821, -193043, 128803, 126698, -76107, -161336, 300677, -147553, -69103, -69791, -103970, -226469, 50326, -3535, -116290, 276894, -199207, 496736, -169810, 288332, -151638, 62285, 15780, 127876, -351662, 92979, 197652, -10608, 17304, -112576, 310089, -78051, 158363, 48728, 15861, -113777, -72203, -17280, -151353, -321303, -88700, -123501, -180225, 297616, 90885, -71678, 141656, 91839, 137918, -351210, 193299, 161280, 337663, -74274, -189457, -209894, -109918, -60747, 76783, 272644, -101167, -118377, -113968, -358418, -175229, 51682, 62544, -296464, -40462, 195171, -195123, -78200, 233946, -33285, -43547, 39198, 18448, -380167, 98924, 112997, 161816]
18894A61816i9989J9997k70454i1375E2958h4231B3913a50267B50637a60045J7146
18883a42899k76250B2018c97731a75373B47526a23752F5849B8539R357a08689
18872c73574a83151B53939B205O2686e8959j26986j78003A77253G6274a9060h237
18860H2145c57229J5743l1714a36032B9822a42706j14450a3207j00821o6629k1740
18849b02397A71806R3721a62491j6964j65547d7100A59358b11945E743h113l6542
18838d4655k7619B6720b50579j58982A90935c01322r9269a93263C7205O6072a14445
18826B87450j06659i2138o5322P0003A5542a39536B4092b79055F6198a67150A78122
18814b32916A87490b09464G7789b61089P6154K9907C13337A02477r128c6040q2274
$$ y = [161816, -99989, -79992, -350446, -91375, 52958, -84231, 23913, -150267, 250637, -160045, -142899, -419149, 22018, -397731, -175373, 247526, -123752, 65849, 28539, 37896, -108689, -373574, -183151, 253939, 2205, 64891, -58959, -185945, -363948, 177253, 76274, -19060, -8237, 82145, -357229, -341486, -373200, -136032, 29822, -142706, -257156, -13207, -114028, -180657, -202397, 171806, 265527, -162491, -179455, -345002, -47100, 159358, -211945, 5743, -8113, -44655, -72274, 26720, -250579, -409561, 190935, -301322, -400591, -193263, 37205, 103277, -114445, 287450, 180791, -92138, -157460, -87457, 15542, -139536, 24092, -279055, 66198, -167150, 178122, -232916, 187490, -209464, 77789, -261089, -184935, -155028, 313337, 102477, 93349, -36040, -118314]
18803a18314A48718a71284h2316D4532a09292F1931h1037I1501g224E3745N5295
18792A09040M5422a13862j90583B26202b0163k76475C1392a21126F4362a19114
18781A36471b47492P7576A1083f946k6678n00635a80224F9990a1895m0424C9182
18769f4714k05784g715p4269I703b2864k49007j24445G9142b56571a1987l03803
18758c15790n9095H8050j1621d9257j54118A68329b02206j827A6191i0442A45630
18746b7539m3144H2663b06425J02224a9107O113j91529J6497C53110f1431G9902
18734c5465J6876b983n8374F205a63914L7437o1326j34051a23700B602d35614
18722d04628F8043b85208M3454Q4133B17887b48729K3281B4698a78895J4768J5773
$$ y = [-118314, 148718, -171284, -82316, 44532, -109292, 61931, -81037, 91501, -7224, 53745, 109040, 154462, -113862, -304445, 226202, -20163, -296638, 31392, -121126, 64362, -119114, 136471, -247492, -169916, 11083, -6946, -33624, -534259, -180224, 69990, -11895, -52319, 39182, -64714, -270498, -7715, -81984, 9703, -22864, -271871, -396316, 79142, -256571, -11987, -315790, -374885, 88050, 76429, -49257, -203375, 168329, -202206, -204033, 16191, -90442, 145630, -27539, -70683, 82663, -206425, -104201, -19107, -12994, -204523, -188026, 353110, -61431, 79902, -35465, -18589, -2983, -61357, 6205, -163914, -126477, -187803, -321854, -123700, 2602, -435614, -404628, 68043, -285208, -241754, -157621, 217887, -248729, -225448, 24698, -178895, -164127, -148354]
18711a48354K4777k16840A78264J44836e8420J5831C0402b53277g4459p2260A81631
18699a73131K8057o5098B2253b56250d2902C7408h3587b5885A60830J38110a22674
18687A5990h8070k00100i2765F0942b09007l9349A13696c984j49170e5412k77891
18676c33303i9780a3662o9705k2893j88760a14116A12643J47808F0272O1555b11784
18664h5631p136I7714a03868A63746h4163C3764b4998H1771b4011B5415b5408
18652F2834J7958j3975a00107j07518E577h7087p1803j13326g8658n9550B5044
18640h8184E1042e3199K4102B3258M9765a30160A34031O8582G2543P6749j8142
18629A31150e0582j80383C26934A3136a05687B7470e1771j94747j29453C9224
$$ y = [-148354, -123577, -340417, 178264, 323100, -58420, -42589, 30402, -253277, -74459, -146719, 181631, -173131, -145074, -210172, 22253, -256250, -42902, 37408, -83587, -25885, 160830, 298940, -122674, 15990, -88070, -288170, -92765, 60942, -209007, -248356, 113696, -3984, -153154, -55412, -333303, -99780, -13662, -83367, -106260, -295020, -114116, 112643, 260451, 60272, 121827, -211784, -85631, -92767, 97714, -103868, 163746, -84163, 33764, -24998, 81771, -24011, 25415, -25408, 62834, 80792, 66817, -100107, -207625, 5577, -87087, -158890, -272216, -78658, -138208, 25044, -88184, 51042, -53199, -29097, 23258, 73023, -130160, 134031, 202613, 72543, 149292, 131150, -50582, -230965, 326934, 13136, -105687, 27470, -51771, -246518, -375971, 39224]
18618I8391e4344A70597b60395L1141f3144j39970C7471b00033f9515m0363J6570
18607i3308B14143b1127k04673C9140a25540G5175c06081a51502A0836J6239b00171
18595a98549O8672k20622A52647M82504C2644e9811B81671j0086F8235j7652c08378
18583A77133i6725F7070J06306a87780A6245K1100M2289K7315M1652J41902h2692
18571a63274j14662a8240p9299l2282G0071b1030j97394B67968b5850j48914A90087
18559B0839a02863E7983b40280h8469D5614A2208J29622a31439K4636k19241h8201
18547A86403f3980j62578A60418c30095a55311f0467H9432B2357b50057N1781
18537a98276B42014b89361h0409k21078c5785r0132f1298C3309A3247J47692G6144
$$ y = [98391, -54344, 170597, -260395, -229254, -63144, -203114, 37471, -200033, -69515, -109878, -93308, 214143, -21127, -225800, 39140, -125540, 75175, -306081, -151502, 10836, 27075, -200171, -198549, -129877, -350499, 152647, 635151, 32644, -59811, 281671, 271585, 68235, 50583, -308378, 177133, -96725, 67070, 173376, -187780, 16245, 37345, 79634, 106949, 148601, 290503, -82692, -163274, -277936, -18240, -97539, -129821, 70071, -21030, -218424, 267968, -25850, -174764, 190087, 20839, -102863, 57983, -240280, -88469, 45614, 12208, 141830, -131439, -106803, -326044, -88201, 186403, -63980, -226558, 160418, -330095, -155311, -60467, 89432, 22357, -250057, -198276, 242014, -289361, -80409, -301487, -35785, -125917, -61298, 33309, 13247, 160939, 76144]
18525h515l45062a17256K8696j5397B69905i6233o0939B228b04445i6950l8888
18514a35838e9252A3670b62675B1006O6868d4705j06167b8610m52836i5261i872
18502e0072j40741A27867l4676c42004A73243M990A7794N7016J44322b01068Q1583
18491a19485N3816E0455J7312J34401B0816b87407P8587A26863o2946L58246b38005
18479c80144f1040l98703B039K46930a24182H0802a32544a1014o9162k87985A79905
18467C09696c49859a57416j66191A01474N8375C7207c36452J4266O3386M3883
18457b14917J06064D903a04814k16079B49755Q8158b7280n077B54923E5624j8230
18446C7394L354f4780l2768j31219A76729C3013d4675a2075j91638f9866F5543
$$ y = [-8515, -353577, -117256, -88560, -103957, 269905, -96233, -157172, 2228, -204445, -96950, -135838, -59252, 13670, -262675, 21006, 87874, -44705, -150872, -28610, -481446, -95261, -9872, -50072, -190813, 127867, 93191, -342004, 173243, 178233, 17794, 74810, 219132, -201068, -119485, -65669, 50455, 67767, 202168, 20816, -287407, -208820, 126863, 63917, 422163, -238005, -380144, -61040, -459743, 2039, 248969, -124182, 80802, -132544, -11014, -80176, -368161, 179905, 309696, -349859, -157416, -323607, 101474, 159849, 37207, -336452, -322186, -258800, -214917, -108853, 4903, -104814, -320893, 249755, 337913, -27280, -32357, 254923, 55624, 37394, 40748, -64780, -97548, -228767, 176729, 33013, -44675, -12075, -203713, -69866, 65543]
18434a76749j15194C17598d5990k28232a07141j36706R4027D3333Q8699f0331
18423b61272C07393b78303Q4939C16333D9638g4431B10761L0975a96569J9866
18413a76703L0624K4375O302E2935e2030C5327L5635b01733B2299b60472o5637
18402c26109A69523N616a6058j89268A45694f7043B16806E7529g5813G4227a61115
18390C48731b43652j2098l5726J10115I678L8947b86541C760c15090A71260f0435
18378C21153a66398E4222N2498e4457G2832c26680J31175Q4842A67824B4345K27112
18367B51457b27137A83533b1608j15098k8487e7414A94155G5897J08617l7759
18357A46755f7196o8832D0906c43129E4639f0329j92974e4768j29883C9555b07848
$$ y = [-176749, -291943, 317598, -45990, -274222, -107141, -243847, -149820, 43333, 132032, -60331, -261272, 307393, -278303, -193364, 316333, 49638, -74431, 210761, 241736, -196569, -176703, -146079, -121704, -115402, 52935, -52030, 35327, 70962, -201733, 22299, -260472, -326109, 169523, 175139, -16058, -205326, 145694, -67043, 216806, 57529, -75813, 74227, -161115, 348731, -243652, -255750, -291476, -181361, 9678, 48625, -286541, 3760, -315090, 171260, -60435, 321153, -166398, 54222, 106720, -54457, 72832, -326680, -195505, -110663, 167824, 24345, 251457, -227137, 183533, -21608, -136706, -165193, -57414, 194155, 75897, 184514, 146755, -67196, -136028, 40906, -343129, 54639, -60329, -253303, -54768, -184651, 39555, -207848]
18345a70287f5109e697j60107A91061g5548l19250a16443a1323r6282n5085j05238
18334b67928A51081a51802e7434j9242j83834B36848d1874l2257a8056j53067
18324a71123j13116B44773c73790f0102K8591a637k11186P5846j63719O8474B61727
18312A64482B5064J24568N9144b6453A36252b6569n2056j39947B99516a47251
18301f6920j12200e0371j68786A48615l3261n7382J7569b33915A62144n7333o636
18290I8175i0042r1380E21236a76641j51852B58932c5044j54655B67393C3413
18279E6663j5103K8166L40442A32440a47867E8628B5104Q1656N2515D0870J50849
18268A91719b96567B14553e8907m5852C85415b54172A51062g7555j31157C07648
$$ y = [-170287, -65109, -5697, -165804, 191061, -75548, -394798, -116443, -11323, -107605, -162690, -267928, 151081, -151802, -57434, -76676, -260510, 236848, -41874, -74131, -18056, -171123, -284239, 244773, -373790, -60102, -31511, -1637, -212823, -136977, -300696, -232222, 261727, 164482, 25064, 149632, 208776, -26453, 136252, -26569, -78625, -218572, 299516, -147251, -66920, -179120, -50371, -219157, 148615, 115354, 57972, 75541, -233915, 162144, 104811, 98175, -90042, -181422, 521236, -176641, -328493, 258932, -35044, -189699, 267393, 33413, 56663, 41560, 69726, 410168, 132440, -147867, 58628, 25104, 106760, 159275, 40870, 191719, -296567, 214553, -58907, -104759, 385415, -254172, 151062, -77555, -208712, 307648]
18257h3152a7245A77652d3059j86801i4452c8201j37155A84720b12064I078d9273
18245b32199a15961Q141l14676a23552D2533b74950o2038B5429K20863F7721L7802
18234A05523m4880c15245O5696a9313j02392K3072n1937n8306A20836O5343R1305
18223B77484a49831k68922h6650j16647F5738c46694J21095D6744j6139L1515
18213F2120j7567K78073a07165m18790A55731h4315A2196a15486r346q5371f579
18201G375f7696A80985b18270M3011A03926e7474A83801a60599A44724k7197b07100
18189a54195g1765A3101b73870F20094d69991J13691C11411a68983R64c6286G3061
18177B5114a59886D288R1698e266H9371a54119c0791J377C60045B2672a48778
$$ y = [-83152, -17245, 177652, -43059, -229860, -94452, -38201, -175356, 184720, -212064, 9078, -49273, -232199, -115961, -107820, -422496, -123552, 42533, -274950, -336988, 25429, 246292, 67721, 105523, 60643, -315245, -249549, -19313, -121705, -98633, -150570, -208876, 120836, 186179, 277484, -149831, -418753, -86650, -203297, 65738, -346694, -225599, 46744, 30605, 62120, 44553, 322626, -107165, -525955, 155731, -84315, 12196, -115486, -124832, -210203, -6579, 7375, -67696, 180985, -218270, -175259, 103926, -57474, 183801, -160599, 144724, 117527, -207100, -154195, -71765, 13101, -273870, 620094, -469991, -356300, 311411, -168983, -168019, -36286, 73061, 25114, -159886, 4288, 95986, -5266, 89371, -154119, -30791, -29414, 360045, 22672, -148778]
18165H034a14623B72899e3623A93312q4268e8667G725N1725F294J7835a20707
18153a07176k63139B86993E4127M716b4016j48611F3686k8159a50400P1698B49334
18141a70135A71566c04962a25532L7841A48279e8670C4315e64A82219a223j82496
18130a83719g9264c2292k08519d7263o375j17741A26721E8764a00581l31087F1036
18118E6523a39569j52510C59207A9169K31493a63035b9838n1281j24588e6655
18107C53639h7957k00609A40285J28811r3667i9713j74744A51255J09196b46568
18096b37931J18455m4353A80846b75510J37587C9247a38356o5615R7026E0192
18085B83027A21608a22425K1972B79660A9041b3428I0229l661a00823A71430a58208
$$ y = [8034, -114623, 272899, -53623, 193312, 109044, -58667, 7725, 59450, 6294, 24129, -120707, -107176, -370315, 286993, 54127, 58843, -24016, -172627, 63686, 35527, -150400, -78702, 249334, -170135, 171566, -304962, -125532, -87691, 148279, -58670, 34315, -564, 182219, -1223, -183719, -79264, -32292, -240811, -47263, -53638, -171379, 126721, 58764, -100581, -431668, 61036, 56523, -139569, -292079, 359207, 19169, 250662, -163035, -29838, -81119, -205707, -56655, 353639, -87957, -288566, 140285, 269096, 175429, -99713, -274457, 151255, 260451, -246568, -237931, -119476, -163829, 180846, -275510, -137923, 39247, -138356, -203971, -106945, 50192, 283027, 121608, -122425, -100453, 279660, 19041, -23428, 90229, 86568, -100823, 171430, -158208]
18073B53410j18588E0343b8750l50264b3320A32057d4648A11067R4835H0777a17928
18061B28195c02207B51794p459G6639A8880i7463k14231i0626A53165n7636a70661
18049b03003A27470g7034b0440j98046A8728K8637P7444B7472L1646a9170I760
18037a14899D161K992O7208a07783j52500a16431J3646A78390a5049k80480i2184
18025i398j65859b9257F0565J3265A843K0966K04853h8944b85A05188f4496j75257
18013b39753e8613B24626J34492r6272F898b4444l49182d2641B65556b73508C7603
18001I343J99785c13660b4083k9935I2384K27940a95566B34006D2545e6105B67869
17989E6904J04327J57469a21263j35408p7498i1670B3283H085M0863j9037b25240
$$ y = [253410, 134822, 50343, -28750, -379014, -23320, 132057, -44648, 111067, 205902, 80777, -117928, 228195, -302207, 251794, 244335, 76639, 18880, -97463, -311694, -90626, 153165, 95529, -170661, -203003, 127470, -77034, -20440, -218486, 18728, 47365, 124809, 27472, 59118, -19170, 9760, -114899, 4161, 7153, 74361, -107783, -260283, -116431, -102785, 178390, -15049, -295529, -92184, -9398, -175257, -29257, 60565, 73830, 1843, 22809, 227662, -88944, -285, 105188, -64496, -239753, -58613, 224626, 359118, 262846, 6898, -24444, -373626, -42641, 265556, -273508, 37603, 9343, 209128, -313660, -24083, -54018, 92384, 320324, -195566, 234006, 42545, -56105, 267869, 56904, 161231, 318700, -121263, -256671, -334169, -91670, 23283, 8085, 48948, 29911, -225240]
17977G2441M7967a7225k89363d5246m3697A97345b55179D5677b02250M6965A08429
17965b27455b3963B26976H5113a99646B14600J16456B5648c4584A40827A4544
17954b4616D6172g560l2896r6137q349N8558j5104A564b33803A24942E5421O0272
17942A15693J02568A1468c92728c951o3567G9557N5235a24845A6847a72993m2668
17931b15661G5437J33038c10031f1391a4994D4141b70587a28826A25018K7211
17921A52229l4364c42780J20702D0017P6707j5416K5726n884E688j42b48473C13500
17908D6238b54483e2353p0254f021k3861A23387B4263c9122c13B62441A7614M3504
17896F1118K11832d6758n2355q0293e5512G4634N8437b99557A99007a57540B88293
$$ y = [72441, 120408, -17225, -306588, -45246, -88943, 197345, -255179, 45677, -202250, -155285, 108429, -227455, -23963, 226976, 85113, -199646, 214600, 331056, 25648, -34584, 140827, 14544, -24616, 46172, -7560, -40456, -136593, -144942, -86384, -101488, 1564, -233803, 124942, 55421, 115693, 218261, 11468, -392728, -3951, -67518, 79557, 134792, -124845, 16847, -172993, -215661, 75437, 208475, -310031, -61391, -14994, 44141, -270587, -128826, 125018, 152229, 117865, -342780, -222078, 40017, 116724, 101308, 127034, 121150, 5688, 5546, -248473, 313500, 46238, -254483, -52353, -122607, -6021, -29882, 123387, 24263, -39122, -313, 262441, 17614, 61118, 272950, -46758, -99113, -179406, -55512, 74634, 133071, -299557, 199007, -157540, 288293]
17884c75386C1159f348C07747C1816i1311L0354B7005N67J10393A888b12093A58091
17871b49745a15758i581A242P3140Q7490a77884E6042J23848a67797j14713r04
17860b83414a4578l02830D6621K21725Q981a19187j50873a17680p950A10528a4140
17848H8536J81389o6943a08265G4758a00007D99213g3400J3979B38795a82203
17837A42050C7797b29863l9471A75759K15029A17904k8780c3203A45731a67656
17826b04856b3872H6211a01018r531A55889i6526d872j31838d6312b308C17477
17814A32832d53723f3473A07920b95414O8382A10711e6435b6499k37329Q3156
17804a80672A24478j5002E2850h3163j11689B33625p6709a9458l2034I296a1070
$$ y = [-375386, 31159, -6348, 307747, 31816, -91311, -60957, 27005, 27572, 137965, 1888, -212093, 158091, -249745, -115758, -9581, 1242, 74382, 161872, -177884, 56042, 179890, -167797, -282510, -283414, -14578, -317408, 46621, 268346, 277327, -119187, -270060, -117680, -125630, 110528, -14140, 88536, 269925, 202982, -108265, 74758, -100007, 499213, -73400, -59421, 238795, -182203, 142050, 37797, -229863, -269334, 175759, 390788, 117904, 89124, -33203, 145731, -167656, -204856, -23872, 86211, -101018, -110549, 155889, -96526, -4872, -136710, -46312, -2308, 317477, 132832, -453723, -63473, 107920, -295414, -227032, 110711, -56435, -26499, -263828, -180672, 124478, 109476, 52850, -83163, -194852, 233625, 156916, -19458, -51492, 9296, -11070]
17792a92750a754D2707a64168B49952D0275c949G744e6763I0907c08021C624N8387
17780F2011J33739p1832f0757i610A39226D4324P0303a81226D7559d2347C03994
17768B9322a90056A75219L6784o2408P9751H2194a69451o8712B01841I3962L9790
17757A33752e3787k38448A56658a91471j08146A4653c56949R7748m1099A07888
17746d55481E5474a88047H9391a32054B3253K24507j19659L47401d6346A76763
17735A29913B4763J83983a15518j4168e1569j74218A59591b16135H5006J6848
17725A01854D0999j0844a03063C28806b90196J41100A08894J81188i3371j52090
17715b45461D6557j7446f0933j76212F3241g1593C7579J49025a31547a0383A79444
$$ y = [-192750, -1754, 42707, -164168, 249952, 40275, -3949, 7744, -56763, 90907, -308021, 3624, 62011, 195750, 123918, -60757, -9610, 139226, 44324, 114627, -181226, 47559, -42347, 303994, 29322, -190056, 175219, 212003, 149595, 229346, 82194, -169451, -238163, 201841, 93962, 133752, -53787, -292235, 156658, -191471, -299617, 14653, -356949, -259201, -300300, 107888, -455481, 55474, -188047, 89391, -132054, 23253, 247760, 128101, 475502, -46346, 176763, 129913, 24763, 208746, -115518, -129686, -51569, -225787, 159591, -216135, 85006, 101854, 40999, 30155, -103063, 328806, -290196, -149096, 108894, 290082, -93371, -245461, 46557, 29111, -60933, -237145, 63241, -71593, 37579, 186604, -131547, -10383, 179444]
17703f7197J8678r2510A95294G6908c26951C49969A56850a50808A31707E4458
17692f5046o5308A21672f1033B30382F921J35280h9384j18338f0808l2899B24890
17680B63526J28157C1227f6241A416L99539I57K26188a50060j54439K9665I4752
17668A9146b23629k52565A40255K10337b06963h5241c9364D4823J57543g1185
17657g8600B34626i5476a1019B36027k3054b31434o8520a25974A95116n2207B8700
17645B56153a89350G5397J11168B8461J29823b87240a01973E8706b13106A813
17634c654A19390B7376L86896F6380a03838E2785J28199K64649d11027B48207
17623D2436J55719B9840N226b8509E5225J61670b81229F8065a80106C45118A07147
$$ y = [-67197, -48519, -141029, 195294, 76908, -326951, 349969, 156850, -150808, 131707, 54458, -65046, -130354, 121672, -61033, 230382, 6921, 142201, -89384, -207722, -60808, -93707, 224890, 263526, 391683, 31227, -66241, 1416, 400955, 957, 227145, -150060, -304499, -274834, 94752, 19146, -223629, -476194, 140255, 350592, -206963, -85241, -39364, 44823, 202366, -71185, -78600, 234626, -95476, -11019, 236027, 212973, -231434, -299954, -125974, 195116, 142909, 28700, 256153, -189350, 75397, 186565, 28461, 158284, -287240, -101973, 58706, -213106, 1813, -3654, 119390, 27376, 414272, 66380, -103838, 52785, 180984, 445633, -411027, 248207, 42436, 198155, 29840, 35066, -28509, 55225, 216895, -281229, 68065, -180106, 345118, 107147]
17611A33638D9151J18894P6779h3922F6414J14328a60159I2559h5776j66196B8693
17599A87551c44645B12204f8007j15519B86562G7985J63195c8257A16389d3424
17588b34534h7766I2401J6237m1312B0470L16482H688a00805A98740b9389A46851
17576b68200H9772N7782I002K80841j44379a38131C0600J42272h8593A76419J94819
17565C71238A00847l1758J90512A06328L39189G2955g4920C9053P8069a95326
17554A03758Q86P8024A482K99430e8326b0993k26114D15397h515C02661f3910
17542E2538O7024M17078a14830c9797F6692E83b55521n247A28316m4758a5798
17530a25336C14997N5589A69598J49609q6606D8878f9304C2869f4880b8843A27489
$$ y = [133638, 49151, 168045, 244824, -83922, 66414, 180742, -160159, 92559, -85776, -251972, 28693, 187551, -344645, 212204, -68007, -183526, 286562, 77985, 241180, -38257, 116389, -43424, -234534, -87766, 92401, 108638, 67326, 20470, 336952, 8688, -100805, 198740, -29389, 146851, -268200, 89772, 147554, 9002, 289843, 145464, -138131, 30600, 172872, -88593, 176419, 371238, 100847, 69089, 259601, 106328, 445517, 72955, -74920, 39053, 117122, -195326, 103758, 104644, 182668, 1482, 300912, -58326, -20993, -247107, 415397, -8515, 302661, -63910, 52538, 119562, 536640, -114830, -39797, 66692, 583, -255521, -260768, 128316, 83558, -15798, -125336, 314997, 370586, 169598, 319207, 232601, 48878, -69304, 32869, -64880, -28843, 127489]
17518A85953o1519o667J75381n0440m7712q2195j0182h65D22432a69365c68q5736
17506h6104B49721a61487m9537C99611I8525e1417B09132f1926D3814a42855B86213
17494B47577J72278A10527L902L14438b2679A82948n3466K30408A28821N6568
17484A85389E0022J11594e5123H0759N2029h8836A47118a9471C43036G5467J35432
17473B10899P3129p6974E5010K32795i5661d6589C63471d2101B40551I681J85908
17462A95589f8002j41921J00464l4582I8290C0287N7907J98597K41511D0527Q4169
17451A24696J63041I1263K0903J77452J09715O2083j79049J53997C7037L08474
17441C45511j67414o9677M1879Q9510o1489J1025P411Q1512M9926A35035Q4308
$$ y = [185953, 124434, 117767, 293148, 242708, 194996, 112801, 102619, -865, 422432, -169365, -368, -86104, 249721, -161487, -211024, 399611, 98525, -51417, 209132, -61926, 43814, -142855, 286213, 247577, 419855, 110527, 114429, 428867, -22679, 182948, 129482, 359890, 128821, 185389, 50022, 161616, -55123, 80759, 132788, -88836, 147118, -19471, 343036, 75467, 210899, 284028, 207054, 55010, 287805, -95661, -46589, 363471, -42101, 240551, 9681, 195589, -68002, -209923, -109459, -144041, 98290, 30287, 88194, 286791, 528302, 40527, 124696, 287737, 91263, 112166, 289618, 399333, 461416, 282367, 436364, 37037, 345511, 178097, 108420, 150299, 239809, 178320, 189345, 196756, 278268, 328194, 135035, 219343]
17430B19343A04085J01031J72938F0011J97749J5092j19931O5719F1398a37072
17419G3551J47876K05594j76907j2856J8056c4470E57214A87663C4884L99836
17409D34720e2157A42000O1935k4030B4456M2N13642B36027H9331d43D6574J10368
17397A56942N8159I4515K48583a05406k1972A16992K69274c35035B03572I7722
17386B08628A46K5443J60862J75716n1910a01042F9727B3844a08260B0023J82807
17375B02830b1874j0171D62889A31048N9459A6338K75324j32773m4550Q7937J98782
17364D01058e1471H6354c4210A85573n4639k6429J61174E8068I078J71196c8076
17352C21651j58236Q778A9340J97002k3346m4015K53113j38586f3681H9427b1612
$$ y = [219343, 104085, 205116, 378054, 60011, 257760, 272852, 152921, 218640, 61398, -137072, 73551, 221427, 427021, 250114, 237258, 255314, -34470, 557214, 187663, 34884, 434720, -52157, 142000, 203935, 179905, 24456, 24498, 538140, 236027, 89331, -443, 46574, 156942, 215101, 94515, 343098, -105406, -127378, 116992, 386266, -335035, 203572, 97722, 208628, 146, 25589, 186451, 362167, 310257, -101042, 69727, 23844, -108260, 20023, 202830, -21874, -32045, 462889, 131048, 190507, 16338, 291662, 158889, 114339, 202276, 401058, -51471, 86354, -34210, 185573, 130934, 104505, 265679, 58068, 9078, 180274, -38076, 321651, 163415, 172193, 19340, 216342, 192996, 148981, 402094, 263508, -63681, 89427, -21612]
17340I3117K9913J05140H2465I107a79847C30412A08273h2844A94682p9664k942
17329A12076a70931c3382B90510n6393j03655a93731b2925F2278J63888g1420
17318D31559j6544r5162A16057J45213E7802i8707D5288B0155J65774l9084R7411
17307B44256K96265k41596l5141d5839E1310K10681I4346J25504J16454J12789
17297D49093j94400I6488k2709J85230J57158B01768K89588j54841j35673J40504
17287C41346b22257B61948r6138a80615A21539i9196c9968A17070i6720j14894
17277b11614C38173r1535A18090J7463L03804g7100B61092A2314Q2953B4026L20420
17266C44446A53476p5335J31966M8795p3096n6174J42328K34650j29651A87504
$$ y = [93117, 123030, 228170, 82465, 9107, -179847, 330412, 108273, -82844, 194682, 115018, 112076, -170931, -33382, 290510, 234117, 130462, -193731, -22925, 62278, 226166, -71420, 431559, 415015, 319853, 116057, 261270, 57802, -98707, 45288, 20155, 185929, 146845, 244256, 540521, 298925, 263784, -45839, 51310, 261991, 94346, 219850, 336304, 449093, 254693, 96488, 73779, 259009, 416167, 201768, 491356, 336515, 200842, 341346, -222257, 261948, 165810, -180615, 121539, -99196, -39968, 117070, -96720, -211614, 338173, 246638, 118090, 135553, 439357, -77100, 261092, 12314, 95267, 24026, 344446, 153476, 78141, 210107, 258902, 185806, 129632, 271960, 506610, 376959, 187504]
17255A7012J03213J62640K75928j79782i8614B47800n2503p6209O0573Q9798A26030
17243A17548K0932J6337k6772L9628A0538b520G237a2083B92982F7861J68718
17232B36579j14531m7061b1283B17910J44644M1698j62907j7894m1081J04665
17222B87035J04161N7032k19379E6380J4823m587K16684r9531K47151j15583o3575
17211B51762n3214a20435D77127A39837K55948L237F5467L06009A14150Q4317
17201A98467K04275A39747J68676q1878M62218I8674K59424J61429a23674C56368
17190C03394Q9925A83257n6808J38563K8818A05321K54856A79430J0455L8062
17180B27947J96526j19562q3906J8730K22443j17559A70297G9605J91073J20072
$$ y = [17012, 120225, 282865, 558793, 379011, -98614, 247800, 195297, 119088, 179661, 269459, 126030, 117548, 138480, 154817, 128045, 167673, 10538, -2520, 7237, -12083, 292982, 67861, 236579, 122048, 74987, -21283, 217910, 362554, 404252, 241345, 223451, 182370, 287035, 391196, 448228, 228849, 56380, 71203, 66616, 283300, 183769, 430920, 315337, 251762, 198548, -120435, 477127, 139837, 395785, 399022, 65467, 371476, 114150, 198467, 402742, 139747, 308423, 226545, 688763, 98674, 358098, 519527, -123674, 356368, 303394, 393319, 183257, 126449, 265012, 293830, 105321, 360177, 179430, 189885, 227947, 424473, 304911, 221005, 239735, 462178, 344619, 170297, 79605, 270678, 390750]
17170C90750j85806L15437A55493o5186C6750M43772A07270K55367j0440k3005
17160C29192J0596A59206K69770o1032j06858k05q5934J069D8456j6691L12063
17149C43828K07693j82985K31338B10768K02513j84478m9756o8267N44755l07354
17139C48181H2689J02635R5635N3654A58991B0866K19597J17252q455M2167j1096
17128C80331q9305A10815k044L24297j5660K00728k45188p2489M86850C34165
17117E86994k02362j04530o0420j00382J47132o040O0815J84921j76544J0491
17107C40075K58976A81399L28697K11095B03534O8455A35390m8654L49686B08457
17096D37682Q2735O8692B42910J2763r4697O46408k97452A87656L61184J50829
$$ y = [390750, 204944, 520381, 155493, 90307, 36750, 480522, 107270, 362637, 352197, 329192, 339788, 159206, 428976, 367944, 261086, 260881, 174947, 176016, 48456, 31765, 343828, 551521, 368536, 599874, 210768, 413281, 228803, 179047, 110780, 655535, 348181, 82689, 185324, 280959, 334613, 158991, 20866, 240463, 357715, 349260, 391427, 380331, 291026, 110815, 108771, 433068, 417408, 618136, 372948, 300459, 787309, 334165, 586994, 384632, 280102, 219682, 119300, 266432, 260392, 321207, 506128, 329584, 340075, 599051, 181399, 510096, 721191, 203534, 271989, 135390, 86736, 436422, 208457, 437682, 520417, 589109, 242910, 255673, 160976, 807384, 509932, 187656, 548840, 699669]
17086F99669B99741L6981P8470N4790L9714J15278k87747j03652p2947Q9814K33331
17075D83773j91278j21741K67980l948A68448K63270N2382A03663L60096j91530
17065B72229L77976k26129Q4919q9870L3190b8065D51264K9767k16387M41876
17055G06520j72453P7759K4813Q7368j20383j13673L46143k0577k03470O7363
17045F79410J02300l32667N85658E16451K9600k035j55230j8636K96640k03587
17035D63203M78210m00482J02036j82218p6034N9316N17707C29786K97093j45611
17025D81268O1021L00392m0152j57588R0558n6154k66657P2377J54124K04670
17015H43859l66291L83096m3053j80072p5486J96122J14845J47318p3916k73455
$$ y = [699669, 299741, 336722, 415192, 469982, 509696, 624974, 337227, 233575, 160628, 250442, 483773, 292495, 170754, 438734, 434786, 168448, 431718, 484100, 103663, 463759, 272229, 650205, 424076, 508995, 419125, 452315, -28065, 451264, 481031, 264644, 706520, 534067, 611826, 636639, 724007, 603624, 489951, 836094, 815517, 612047, 679410, 781710, 449043, 1034701, 516451, 546051, 544016, 388786, 370150, 666790, 463203, 941413, 540931, 642967, 460749, 384715, 444031, 961738, 329786, 626879, 481268, 542289, 842681, 802529, 644941, 735499, 679345, 412688, 485065, 639189, 843859, 477568, 860664, 817611, 637539, 562053, 758175, 873020, 1020338, 946422, 672967]
17005F72967q359J06320M890J6924r0158j71832L14062k6974k37583L06824k20889
16994F66192J11407J5594J20569p6652J74337m1318o3662j74684J03171K21043
16984A055997k77245o4175L88561k20710L5339P4377J29895m67128L8677J78610
16974H72198l10218M36746j06587K9305j72958J5053K64373L3943J80201k90311
16964I51745q5643J58105O2034r7645M2078J32842j01982K57183j22018l22762
16954H73937L49441j48564k925k51242J04416Q724n8049L55598l76628j03468
16944G51240P60673j76272l80514M41266O3720k00117r6956J127m2258K80917
16934A402826k48530J40932J18789j42953r8078J70105q7328M767K83795P3799
$$ y = [672967, 664608, 770928, 775818, 792742, 702584, 530752, 844814, 817840, 580257, 887081, 666192, 777599, 793193, 913762, 837110, 1011447, 970129, 906467, 731783, 834954, 1055997, 778752, 714577, 1103138, 882428, 917767, 992144, 1122039, 654911, 693588, 872198, 561980, 998726, 892139, 921444, 748486, 763539, 1027912, 1061855, 1242056, 951745, 866102, 1024207, 1086241, 988596, 1030674, 1163516, 1061534, 1318717, 1196699, 873937, 1223378, 1074814, 1071889, 820647, 925063, 933787, 875738, 1231336, 854708, 751240, 1511913, 1335641, 955127, 1396393, 1460113, 1259996, 1163040, 1164167, 1121909, 1402826, 1154296, 1295228, 1414017, 1271064, 1172986, 1343091, 1255763, 1260530, 1544325, 1618124]
16924A618124r8114j08668K74891J29323j81007m031J1931n4006l89576P81157
16914A980024k15681k73845K9237J98300N4890p4493o6456J9362J51822l13333
16904A489827J27189j9463J84870K58638k26254L46203l48102J44617j21712q9493
16894A746320K37285k15671K30492M36593j99717l73047r296K76443j70028J97748
16884B157122K427o784k07047J61470L04153O4747j79929M84341l75471k64513
16874B140516J39300R7510K39193k15469K28905L05279l85265K15556O4130J46356
16864B976011j60963K29001J41517k47433k18881k3246N28294P8304j75178J42755
16854C270181J28009j18794K32241j63240J65551K30601n9156J87310j00319j03698
$$ y = [1618124, 1520010, 1411342, 1686233, 1815556, 1634549, 1630518, 1642449, 1588443, 1198867, 1980024, 1764343, 1490498, 1519735, 1718035, 1772925, 1698432, 1631976, 1651338, 1803160, 1489827, 1617016, 1597553, 1782423, 2041061, 1814807, 2161010, 1812908, 1957525, 1835813, 1746320, 1983605, 1767934, 1998426, 2435019, 2235302, 1862255, 1852959, 2129402, 1959374, 2157122, 2159549, 2152765, 1945718, 2107188, 2411341, 2476088, 2296159, 2780500, 2405029, 2140516, 2279816, 2377326, 2616519, 2401050, 2629955, 2935234, 2549969, 2765525, 2829655, 2976011, 2815048, 3044049, 3185566, 2938133, 2719252, 2696006, 3224300, 3302604, 3127426, 3270181, 3398190, 3279396, 3511637, 3348397, 3513948, 3744549, 3685393, 3872703, 3772384, 3668686]
16844C668686Q183P6576J38840M28804j96327M6283l55525R3524O40917N8069
16834D608030k17080J06454M34066K67l27598M6951J63330J34595J8240J59998
16824E127253N6096O7603j82449O39028j54393l6455N13601J07474K92837J84613
16814F615208q52M6698J51658p0094K51258K15767j2410K68914L8917O22131k1795
16803H105400r3816O20150k9149R8785N95576l15661L46925M73285J64306L83545
16793A0349346L7450L88116J68527K95852K76648M24181J63197M37753L14551
16784A2855621N04171N57574J92702L72434L59751L71250O66883K52460M08297
16775A6541143M91817R45702N41864L17887J141197N11530N50787N56946J100357
$$ y = [3668686, 3676869, 3753445, 3892285, 4321089, 4124762, 4171045, 3815520, 3909044, 4549961, 4608030, 4390950, 4497404, 4931470, 4931737, 4604139, 4651090, 4814420, 4949015, 4967255, 5127253, 5183349, 5250952, 5068503, 5707531, 5553138, 5516683, 6030284, 6137758, 6430595, 6615208, 6614356, 6661054, 6812712, 6742618, 6993876, 7209643, 7197233, 7466147, 7505064, 8127195, 8105400, 8011584, 8631734, 8602585, 8701370, 9296946, 8981285, 9328210, 9801495, 9965801, 10349346, 10386796, 10774912, 10943439, 11239291, 11515939, 11940120, 12103317, 12541070, 12855621, 13359792, 13917366, 14110068, 14482502, 14842253, 15213503, 15880386, 16132846, 16541143, 17032960, 17978662, 18520526, 18838413, 19979610, 20491140, 21041927, 21598873, 22699230]
16766B2699230P32188R25500J134298J294093K67706J212907J494322J133439
16758C0893683Q33835J568299J817841J330146J610543J259937K315933J736059
16750D3366276K251497K158834K401696K554418K691718L007305L036204L110915
16742F4578863L772540L365430L771328M561689M424779M562547N142338N545949
16734I9725463N781186N613125O204117O107947O552238O902313O673409P063652
16726A50623450O303462O633734N286211N750725M595096L736834L088152K023663
16718A88041327N94979l23754j498681k768293l639265m575898n090588n683257
16710A65056570o362355o601031o886304p188218o568924o858248o528009o873561
$$ y = [22699230, 23431418, 24356918, 25491216, 26785309, 27053015, 28265922, 29760244, 30893683, 31727518, 33295817, 35113658, 36443804, 38054347, 39314284, 41630217, 43366276, 45617773, 47776607, 50178303, 52732721, 55424439, 58431744, 61467948, 64578863, 68351403, 71716833, 75488161, 80049850, 84474629, 89037176, 94179514, 99725463, 105506649, 111119774, 117323891, 123431838, 129984076, 136886389, 143559798, 150623450, 156926912, 163560646, 168846857, 174597582, 179192678, 182929512, 186017664, 188041327, 188636306, 188312552, 186813871, 184045578, 180406313, 175830415, 170739827, 165056570, 158694215, 152093184, 145206880, 138018662, 131449738, 124591490, 118063481, 111189920]
16702A11189920n785541n788502n404120n407234m623824m623320m479509m290586
16694G0787284l708363l645166l147067l260271k803131k863749k543286k047674
16686D6768577k090123k410733j961316k119568j529822j694654j417854j304698
16678C2239809j511935j232592j180885j004822j031238j279920q55105q10475
16670B3332837j181070p02822p48117r69251k16283p92026r34356n53298l27309
16661A6908305n89221m36401p96332J85069p80177m28172r17759R1430l23750
16652A2912992q65396k38527p9910l23727m72773k05631m05006K3039n70903k1308
16642I752850l8392o09443J16128n93902r9892m25010K5242o6436l51334k32821
$$ y = [111189920, 105404379, 99615877, 94211757, 88804523, 84180699, 79557379, 75077870, 70787284, 67078921, 63433755, 60286688, 57026417, 54223286, 51359537, 48816251, 46768577, 44678454, 42267721, 40306405, 38186837, 36657015, 34962361, 33544507, 32239809, 30727874, 29495282, 28314397, 27309575, 26278337, 24998417, 24143312, 23332837, 22151767, 21448945, 20700828, 19731577, 19515294, 18723268, 17788912, 17235614, 16908305, 16319084, 15882683, 15086351, 15271420, 14491243, 14063071, 13145312, 13236742, 12912992, 12047596, 11809069, 11729159, 11405432, 10932659, 10727028, 10322022, 10345061, 9774158, 9752850, 9714458, 9105015, 9221143, 8627241, 8527349, 8102339, 8127581, 8061145, 7709811, 7476990]
16632G476990k31684P7095j11798j88481n38139J82386J271k74064O782k39433
16622F160925k07088M1005M0352k65979l8171j34859l07978j67260r2275m61031
16612D567641O34194m02916k78075j26802L20188j30636J35036k93273j32722
16603D292635l14231J30728J03235j77928q8334l04715O7365p4298L7399n00877
16593C170979K31130m0517j79435K82059m69161K03796L40472n61677j34053K57130
16583C100723k62189K19093p6285j77137n8571N9091M3888J4863m29296N088M39546
16572B878814L3028l62335m41049L57317l52448Q42218n81926k64730J80127j69494
16562B119522N4061J6193l17410j25525O21490J64256p02068N36887n48663K8826
$$ y = [7476990, 7245306, 7322401, 7210603, 7022122, 6483983, 6666369, 6667640, 6393576, 6400358, 6160925, 5953837, 5994842, 6035194, 5769215, 5731044, 5596185, 5288207, 5120947, 5028672, 4567641, 5201835, 4798919, 4520844, 4394042, 4714230, 4583594, 4718630, 4425357, 4292635, 3978404, 4109132, 4212367, 4034439, 3946105, 3641390, 3708755, 3634457, 3671856, 3170979, 3402109, 3361592, 3182157, 3464216, 2995055, 3198851, 3539323, 2977646, 2843593, 3100723, 2838534, 3057627, 2981342, 2804205, 2745634, 2804725, 2848613, 2863476, 2434180, 2439268, 2878814, 2911842, 2549507, 2108458, 2465775, 2113327, 2955545, 2373619, 2108889, 2289016, 2119522, 2173583, 2189776, 1872366, 1746841, 2368331, 2532587, 1830519, 2367406, 1818743, 1847569]
16552A847569K49812k80299J02820j36420N09507n98960J24387l06538K76794
16543A788672k30100K52950k47929K1690J30791j1649K13739m41442N889O392
16533A489003k7282k88256K98240M6739o7646j03843k69389J35466L34107j71239
16523A375900j31261j03034K15042Q8904p9745N0262j16597l4203M24041k39440
16513A449869k49693J10046J85264k60374l79401M9397K18030J44076j90359O7455
16503A144310L40418l71439n1976J55161M2437j36037k39451o0781k3267K94778
16493A094153l6833K96121l76353K00937m24842J30569J31661m33134L91167N85471
16483A558917n61248j69742J36831j79892K75573l82794O17186k94579n0026p2689
$$ y = [1847569, 2097381, 1817082, 1919902, 1783482, 2292989, 1694029, 1818416, 1511878, 1788672, 1558572, 1811522, 1563593, 1585283, 1716074, 1704425, 1918164, 1476722, 1482611, 1489003, 1461721, 1173465, 1471705, 1518444, 1450798, 1346955, 1077566, 1213032, 1547139, 1375900, 1244639, 1141605, 1356647, 1445551, 1365806, 1416068, 1299471, 1265268, 1689309, 1449869, 1200176, 1310222, 1495486, 1235112, 855711, 905108, 1123138, 1267214, 1076855, 1144310, 1484728, 1113289, 1061313, 1216474, 1258911, 1122874, 883423, 822642, 799375, 1094153, 1057320, 1353441, 977088, 1178025, 753183, 883752, 1015413, 582279, 973446, 1558917, 997669, 827927, 964758, 784866, 1060439, 677645, 1294831, 1000252, 950226, 877537]
16473H77537J26467j70774k66020M73725n17761J90050J10886N05860n02043j26671
16463G01256o8551j07402K11174l1932n2148K92964r3590j07232J46688p5898
16453H15329k39678P2737j80195L26680k25110K47628k23002q6792J22463r1691
16443E38369J24892k2959J00600L12577l99109p9622l7020J56501k2140N1599
16433G23688C59167J07613j31670K80468K5028j28566K4110L48997j86681p4521
16423F23945K17100k17151K40158B98426K58969o0352j64213K36946j0643k9586
16413E29547A61831K85521R0806m2309L14332C46141j0428J46410j20982P844
16403C68985K4896R324M794j20A61717K18720N2045J58631q4993O9898j85588
$$ y = [877537, 1004004, 833230, 567210, 1040935, 523174, 713224, 824110, 1329970, 827927, 701256, 632705, 525303, 736477, 704545, 652397, 945361, 851771, 744539, 891227, 815329, 575651, 648388, 468193, 794873, 569763, 817391, 594389, 507597, 630060, 538369, 663261, 640302, 740902, 1053479, 654370, 574748, 537728, 694229, 672089, 723688, 359167, 466780, 335110, 615578, 640606, 512040, 536150, 885147, 698466, 623945, 841045, 623894, 864052, 298426, 557395, 497043, 332830, 569776, 559133, 529547, 161831, 447352, 538158, 495849, 810181, 346141, 335713, 482123, 361141, 368985, 393881, 403205, 407999, 407879, 161717, 380437, 432482, 591113, 506120, 576018, 390430]
16392C90430L83409B08780K27971n7607L96190k19077Q829l3287A07065N00100
16382F07165k26402j9199n4170m7465K68415k05620r7962P2992j0975R3004q9087
16371B90696L96885k18008N0092k12736J2263K39881B65716k8514J68885P4204
16361D80291j16325R0546B26389L92431B52227p3725M482K97260K4744A36791
16350C60796N0436A21143r378K56606N2278j96105A08792L09437j59636J8727
16340B77320J9324L4345J19141J82628k24325J23933k56216N3211n2580J15849
16330C92630J09964j27726A59502K68048j95595O3906N7608G8429K91388A13034
16319B96709A13647R472L41203B24104o6266L71054r2050A43652K31624m8250
$$ y = [390430, 773839, 208780, 436751, 379144, 775334, 556257, 565086, 531799, 107065, 607165, 380763, 361564, 307394, 259929, 528344, 322724, 224762, 297754, 286779, 379783, 290696, 687581, 469573, 519665, 306929, 319192, 559073, 265716, 237202, 406087, 480291, 363966, 454512, 226389, 618820, 252227, 178502, 182984, 480244, 504988, 136791, 360796, 411232, 121143, 111765, 368371, 420649, 224544, 108792, 418229, 258593, 277320, 296644, 330989, 450130, 632758, 408433, 532366, 276150, 329361, 276781, 392630, 502594, 374868, 159502, 427550, 231955, 295861, 353469, 78429, 369817, 113034, 296709, 113647, 123119, 464322, 224104, 157838, 528892, 436842, 143652, 375276, 327026]
16309C27026r5077m1080m1877L6150J68977i363D40821A38467R0971K6110N0695
16298C06243q2501C3490K44539P008o876e5058C08045c00710C80841J04369p8023
16287D07187A92317L9959q5279J60815L9198o0260L3079J32916n3627j94789Q4557
16276B88886o9983f2588C12633h2699H7431G648K38567G9662a03200A84435p9535
16265A04900L10226j55121j07029K21144M1953j63513j15544J05793H674K93909
16255C02583j21742f3054B91745j13078g3336B65600j05577J07795i7205M5623
16245e1582A30258L48867B29292j028O3312J59807c8419a2953A01215R720K9117
16234A40052F0000b40209D8860K02627L461r1688a01839D7798e417C49469j7927
$$ y = [327026, 231949, 190869, 148992, 185142, 354119, -9363, 440821, 138467, 229438, 255548, 306243, 223742, 33490, 278029, 285037, 278161, -55058, 308045, -300710, 380841, 485210, 407187, 192317, 232276, 146997, 307812, 347010, 286750, 319829, 452745, 399118, 204329, 288886, 218903, -62588, 312633, -82699, 87431, 7648, 246215, 79662, -103200, 184435, 104900, 415126, 260005, 152976, 374120, 416073, 252560, 137016, 242809, 8674, 302583, 180841, -63054, 291745, 178667, -73336, 265600, 160023, 267818, -97205, -51582, 130258, 479125, 229292, 228264, 291576, 451383, -38419, -12953, 101215, 110935, 140052, 60000, -240209, 48860, 251487, 254948, 163260, -101839, 47798, -5417, 349469, 331542]
16223C31542m8676I0117K9088M3542R5777a35228R552e4959H7288b4847k32395
16212b57242B15998f712A58826K65879n7846E5471Q509a32143r4317J03070B29240
16200B06623J04034b12043g0178B44337c4286A93113C0592N872a86287B2398M9106
16189G1504d1367C97908d6322C2309g0632j0950A89710N5917q6414K28058i0327
16177H4462c82099a10680A21384M5128K6707d4014C08777l7235F7315b5289A88634
16165A61262J90406k9276q2451c59847A65837J41628E8907R019c9559A94810J8065
16154B12875P4207I6251M62583g2475D53428B11709J31474A34413C4103K29037
16144B63140N4727N9093A17139a0189j87436d6445c369k4455C1851J33514E2105
$$ y = [331542, 282866, 90117, 119205, 162747, 258524, -135228, -125676, -54959, 87288, -24847, -257242, 215998, -6712, 158826, 424705, 366859, 55471, 63980, -132143, -226460, -123390, 229240, 206623, 310657, -212043, -70178, 244337, -34286, 193113, 30592, 36464, -186287, 22398, 71504, -41367, 397908, -46322, 32309, -70632, -81582, 189710, 245627, 159213, 387271, -90327, 84462, -382099, -110680, 121384, 166512, 193219, -44014, 308777, 271542, 67315, -25289, 188634, 161262, 351668, 322392, 239941, -359847, 165837, 307465, 58907, 67926, -39559, 194810, 212875, 287082, 96251, 558834, -72475, 453428, 211709, 343183, 134413, 34103, 263140, 317867, 376960, 117139, -10189, -197625, -46445, -3369, -27824, 31851, 165365, 52105]
16132c4233o0599B00755J58875a55051I460K41983A20314a1173k6540A51742n5061
16121I6681b72826I9f956k02301E9725L58972A4550c5806m26101A05736O6979
16110A72715b4539F7935Q3233N5110h6777E2945L24853A07165M3569K66159m1370
16099C75523A26952o2127a9037A59896o8861Q7164c39205A41291i4251n2562k8025
16088a74838A19049b34036N352D5676P3111b68733H11b59860f3270B35809A1198
16076a90512f9791G7051J47880k9039a31017n2649e2715H0759J0479a12986j08528
16065b21514A16989e0521G3133k8570P6061b44583H3174b08159g8639m148A66004
16053C5521J51540e3817A09083b0497j27329f0204n7904j61622B2235L6490a34253
$$ y = [-34233, -94832, 200755, 359630, -155051, 9460, 251443, 120314, -11173, -37713, 151742, 96681, -272826, 99, -6956, -209257, 59725, 418697, 14550, -35806, -461907, 105736, 172715, -24539, 67935, 151168, 206278, -86777, 52945, 377798, 107165, 150734, 416893, 375523, 126952, 64825, -19037, 159896, 91035, 178199, -339205, 141291, -94251, -146813, -174838, 119049, -234036, -228684, 45676, 118787, -268733, 811, -259860, -63270, 235809, 11198, -190512, -69791, 77051, 224931, 195892, -131017, -183666, -52715, 80759, 91238, -112986, -221514, 116989, -50521, 73133, 44563, 120624, -244583, 83174, -208159, -78639, -82787, 166004, 35521, 187061, -53817, 109083, -20497, -147826, -60204, -118108, -279730, 22235, 58725, -134253]
16041A75131J03599J2499e2699H2657b14512B47424r0382o4106a41666f450k18969
16030b25419I0412a31358d836k06146j1087J2123I8219l831l2865N8534M5879
16019A65936j7006o0476m0826a7540B23974c3242j70496A19142a2117l06985a47068
16007B03446B7487K98185a87273N0864b6943l5040j6600l5631E8142O7162E5397
15995b17497A25537k7188B6667f7922C9233Q3635e0039A58699J22141r4900b35356
15983A79120a1652C56126R91o3798g0704B03666a77096A55735b1151r2983j00050
15972b14184B09224J34232g1860p4451a8340k81207E3569a62312A49378a2181
15961C5887K22744G8724R8967D9319b1245p6160E0974j4776A7027L69426b64183
$$ y = [175131, 278730, 291229, -52699, 82657, -214512, 247424, 157042, 92936, -141666, -6450, -225419, 90412, -131358, -4836, -210982, -222069, -209946, 98219, 94388, 61523, 120057, 165936, 148930, 88454, 47628, -17540, 223974, -33242, -203738, 119142, -12117, -319102, -147068, 203446, 27487, 325672, -187273, -136409, -26943, -61983, -78583, -114214, 58142, 125304, 55397, -217497, 125537, 98349, 26667, -67922, 39233, 122868, -50039, 158699, 280840, 185940, -235356, 179120, -11652, 356126, 357117, 293319, -70704, 203666, -177096, 155735, -21151, -114134, -214184, 209224, 343456, -71860, -146311, -18340, -299547, 53569, -162312, 149378, -12181, 35887, 258631, 78724, 177691, 49319, -21245, -97405, 50974, 36198, 17027, 386453, -264183]
15949B5287a50535g1715D8334g8849C1109K2449K31225a55769f365j05568M4020
15938f7913m8539I0700C190a32094e4981j84429H9735J35658a31191A95783i5305
15926A36017k7293c37185E0820c24450b8446l66990A19136a38485M891J0233d306
15914A61856a46047k06421J51133j83432b9160j91102N4908A14771c81445H6525
15903B40335b04094j0935A81257h1039A43465a39975L5500n4578I8036P6870i5879
15891C13075A5568N336a84549C9717d5771p6284j07324B1959L6139b4443k88024
15880c12467A9518J07376g3854A26984F78a4291q2248a5234j40533p5706d8057
15868D9840A3966N5007j7432i8086A43008E4366d5301k60816e5749G7750C462
$$ y = [25287, -150535, -71715, 48334, -78849, 31109, 53558, 284783, -155769, -6365, -111933, -67913, -116452, 90700, 3190, -132094, -54981, -239410, 89735, 225393, -131191, 195783, -95305, 136017, 108724, -337185, 50820, -324450, -28446, -395436, 119136, -138485, -133594, -123361, -4306, 161856, -146047, -352468, -201335, -384767, -29160, -220262, -165354, 114771, -381445, 86525, 240335, -204094, -215029, 181257, -81039, 143465, -139975, -104475, -159053, 98036, 174906, -95879, 313075, 15568, 20904, -184549, 39717, -45771, -122055, -229379, 21959, 58098, -24443, -312467, 19518, 126894, -73854, 126984, 678, -14291, -96539, -15234, -155767, -231473, -48057, 49840, 13966, 68973, 51541, -98086, 143008, 54366, -45301, -306117, -55749, 77750, 3462]
15856d6668l66122a6201C0029b40028C83441g3132L1007k06722d7694A13246c3953
15844a84580A67883b2956E7973a1832B36301b95035a23486A37371K05793j64191
15834A78973q1736D949a8331l8374k57907c8206A59039k3011K4128b32570k7230
15823b59800a15635l8963E4366J6514K96728a50020o7852A68056A1116b01525
15812B16396a16093A18459N6604b47666c8269j95153d0449Q56j64935R3173j17885
15801b29240f0775n5078M532A95787j3394b79074R5419f0319j20248m22775b5054
15789a34159K9730m8533p4091B9199K33809j27443c95783B8043J66580h8024j46199
15778b34223a09763j89441A96401a40762f9947E2691g8199B4022J29638b9079
$$ y = [-46668, -412790, -16201, 30029, -240028, 383441, -73132, -42125, -248847, -47694, 113246, -33953, -184580, 167883, -22956, 57973, -11832, 236301, -295035, -123486, 137371, 343164, 178973, 97237, 4949, -18331, -56705, -314612, -38206, 159039, 136028, 160156, -232570, -259800, -115635, -154598, 54366, 70880, 367608, -150020, -217872, 168056, 11116, -201525, 216396, -116093, 118459, 175063, -247666, -38269, -233422, -40449, -39593, -204528, -111355, -229240, -60775, -115853, -111321, 195787, 182393, -279074, -183655, -60319, -180567, -603342, -25054, -134159, -104429, -152962, -227053, 29199, 263008, 135565, -395783, 28043, 194623, -88024, -234223, -109763, -299204, 196401, -140762, -69947, 52691, -78199, 24022, 153660, -29079]
15767A7616J74631n9676e4340j27751c9841o9859A75145M9491J12256b45921F1927
15755b12710j70R9447F522K00223r8913a63298c5210p9865A00455M5795B5196
15743C208J52751C9394J09445c48701e5838B52527C9637J59562a76086g5852g991
15731D292e7356A53443a09328n9016A73098a72110o3733A65313b92666c6209j28896
15720a65105l6907h7213I2291a83062b0012B21658e1441k29512A80449l0685a37432
15708a89851B58903g7528C17959a25194A29398h4994A12583b83014j1992i4861
15697g4112q3657L2207A90842F1226G376g5760k15087d6666D7312N631a31062
15685B50100r878G7303B8744a19832d1928A24842a46675A82868M4082b7492l62578
$$ y = [17616, 192247, 132571, -54340, -182091, -39841, -109700, 175145, 224636, 336892, -245921, 61927, -212710, -212880, -113433, 6522, 206745, 107832, -163298, -35210, -115075, 100455, 146250, 25196, 3208, 155959, 39394, 148839, -348701, -55838, 252527, 39637, 199199, -176086, -75852, -7991, 4292, -57356, 153443, -109328, -168344, 173098, -172110, -235843, 165313, -292666, -36209, -165105, -202012, -87213, 92291, -183062, -20012, 221658, -51441, -280953, 180449, 149764, -137432, -189851, 258903, -77528, 317959, -125194, 129398, -84994, 112583, -283014, -295006, -94861, -74112, -157769, -125562, 190842, 61226, 7376, -75760, -290847, -46666, 47312, 52943, -131062, 250100, 240222, 77303, 28744, -119832, -41928, 124842, -146675, 182868, 226950, -27492, -390070]
15674c90070B9548e0039F2133j4512c1888o2446d95B4702J9761h1844M487j6152
15662i3509c657k04438R6482a8180B10764h6687n2363B4596b67525A36380b92789
15650E5609K08649c2904r9342j23800A40340b19600g4819E5754c8040k5284A18040
15638d1242A08970b50303I9928a01690G6451f5107B26390b03358a01531b7231
15627a93877g7909k10681a7521B2260K40424b02958E0667J53c4181k6497F9552
15615B64919a595j15046D473c08252m7928a63541P6659B6499c04877K7826O2961
15604b14090m0211f5426K7679A38708j6458e39H3704a92090n6187d7776D6520
15592f4944C08K03130d3649H2897g5932D1933K62882A05904e0102B17868h3572
$$ y = [-390070, 29548, -50039, 62133, 47621, -31888, -94334, -495, 24702, 44463, -81844, -77357, -93509, -3657, -208095, -111613, -18180, 210764, -86687, -139050, 24596, -267525, 136380, -292789, 55609, 264258, -32904, -132246, -256046, 140340, -219600, -74819, 55754, -38040, -63324, 118040, -41242, 108970, -250303, 99928, -101690, 76451, -65107, 226390, -203358, -101531, -27231, -193877, -77909, -288590, -17521, 22260, 262684, -202958, 50667, 50820, -34181, -60678, 69552, 264919, -1595, -116641, 4473, -308252, -356180, -163541, -86882, 26499, -304877, -277051, -214090, -254301, -65426, -37747, 138708, 122250, -539, 83704, -192090, -248277, -47776, 46520, -64944, 308, 203438, -43649, 82897, -75932, 41933, 304815, 105904, -50102, 217868, -83572]
15580a90888b6242F5201b71871P3111C30395D6207a23761m2309I0565D4426b68303
15568B730a42465G25b93006c1005G6058b01025A23524b70956B27137I1410b16431
15556A4709b18020A15261J8899m0479F127b12323Q5471C8787a66266j34812a0700
15544a28622e3180j8521a7588H9335M2312m4309J21229I5842N2480E207K41162
15533B46369C823O0725a04371A15987j4561a85550P8437k1433k35446h2361k26126
15522c08487A45497b00052A27533l1999A0290N3768a21740j37841a9911q8574
15512a08485D9643b3078D66908b73386G0990b19714E9982N7969Q2799F969M0974
15501D7943d4989A74258i0517l9907A52252f3857B37650A9540P2009h0054j66134
$$ y = [-190888, -26242, 65201, -271871, -198760, 330395, 46207, -123761, -166070, 90565, 44426, -268303, 2730, -142465, 725, -293006, -31005, 76058, -201025, 123524, -270956, 227137, 91410, -216431, 14709, -218020, 115261, 134160, 93681, 6127, -212323, -126852, 38787, -166266, -301078, -10700, -128622, -53180, -71701, -17588, 89335, 131647, 87338, 208567, 95842, 148322, 5207, 246369, 3823, 64548, -104371, 115987, 101426, -185550, -107113, -128546, -363992, -82361, -308487, 145497, -200052, 127533, 95534, 10290, 64058, -121740, -259581, -19911, -108485, 49643, -23078, 466908, -273386, 70990, -219714, 59982, 117951, 200750, 6969, 47943, -44989, 174258, -90517, -130424, 152252, -63857, 237650, 19540, 91549, -80054, -246188]
15490b46188Q3663A89456F8015a72323K1194p0151B91465N9993I3033P3667g4327
15478B55524i509e14B9040J4352O2639R935J05710o3563k8410B2608a51445F239
15465b47598L2100J05468n0914m0034b3767A9894g6647F0291L760J25655J75326
15454C65032A82454b40851F5342i43A31044o1455c09166B31940D080d73924a03638
15442b87868k7531J21056h8732N882B38301D8131K35498H2552a4880j42761O3168
15431i4473A67285C0404i6053D00352a13789b6890F3414a60435j03004A2363a04169
15419A50657e6162j62324i5941q5930d1427j45982e5162B65579a36637o496M3018
15408a00115o9961B45061F1570J6146J19380L2230b9074o6746B02929i8447a8808
$$ y = [-246188, -162525, 189456, 68015, -172323, -151129, -221280, 291465, 351458, 93033, 166700, -74327, 255524, -9509, -514, 29040, 43392, 106031, 115966, 221676, 158113, 129703, 22608, -151445, 6239, -247598, -215498, -110030, -160944, -200978, -23767, 19894, -76647, 60291, 64051, 189706, 365032, 182454, -240851, 65342, -943, 131044, 69589, -309166, 231940, 4080, -473924, -103638, -287868, -315399, -194343, -88732, -82850, 238301, 48131, 283629, 82552, -14880, -157641, -94473, 167285, 30404, -96053, 400352, -113789, -26890, 63414, -160435, -263439, 12363, -104169, 150657, -56162, -218486, -95941, -181871, -41427, -187409, -55162, 265579, -136637, -143133, -100115, -170076, 245061, 61570, 77716, 197096, 229326, -29074, -95820, 202929, -98447, -18808]
15396C9647a66664B5488b30998D12484c7525B17189j07665J0998a27431J6789
15386a10642r8419e8233A9473N31732d4590E9958h4229A77783C7837J9490K23289
15375B80616f8322L0669k446k14878B53830G2007d9503k3482j36113C58843b00778
15363A93103j1909n3920d0043q0091N2495A73889K61456B2868a02233j03165j3147
15352b18545F1133b89965B9577a43920A72567d7644j6580F4153b85680C3094J22758
15341A55852B8010J88222F1484J03486p1150K9150q483J35368I0742L0905J7747
15330A39394j4161J05382c4204k27077A73454m9320f4155A61749o3555K73504
15320C71698A54012a65027I8674a01901I553K7337a76075B47967l3524d204n9097
$$ y = [39647, -166664, 25488, -230998, 412484, -37525, 217189, 109524, 120522, -127431, -110642, -209061, -58233, 19473, 551205, -44590, 59958, -84229, 177783, 37837, 57327, 280616, -68322, -37653, -40099, -254977, 253830, 72007, -49503, -72985, -209098, 358843, -200778, 193103, 181194, 127274, -40043, -120134, -67639, 173889, 435345, 22868, -102233, -205398, -218545, 61133, -289965, 29577, -143920, 172567, -47644, -64224, 64153, -285680, 33094, 155852, 28010, 216232, 61484, 164970, 93820, 122970, 114487, 249855, 90742, 121647, 139394, 125233, 230615, -34204, -261281, 173454, 124134, -64155, 161749, 98194, 371698, 154012, -165027, 98674, -101901, 9553, 36890, -176075, 247967, 214443, -4204, -63301]
15309f3301n5688A59452a02176L1645j20786I4424k0171b92044A91791g1378f039
15297D63790j50941b53314j60453d0395A49760i8255D987L00349j31249b8426
15286a73421A03016m0539J37955K813b57854E5103a92457j24865J7930A05665
15275A87041h1564D57811A24427a08852A82746a70019N1924B12757K0336e5381
15264B18026C1604K3360a55666g0930n5431d572j8258A12838C3083L25297r7413
15253B60967i6676I1171B9783R0227K73418K16391N77530J662917j284466P74988
15243B340788n24090H41539B18119N8908F6687h5337B65662C8479f2095A94926
15232D48920D311O036J4380a31990B07063H1503J33249B5350J27956m5435m2889
$$ y = [-63301, -118989, 159452, -102176, -70531, -191317, 94424, 74253, -292044, 191791, -71378, -6039, 463790, 312849, -253314, -413767, -40395, 149760, -98255, 4987, 305336, 174087, -28426, -173421, 103016, 62477, 200432, 203245, -257854, 55103, -192457, -317322, -299392, 105665, 187041, -81564, 457811, 124427, -108852, 182746, -170019, -118095, 212757, 233093, -55381, 218026, 31604, 54964, -155666, -70930, -126361, -4572, -22830, 112838, 33083, 358380, 260967, -96676, 91171, 29783, 120010, 393428, 609819, 1187349, 2850266, 1565800, 2340788, 1816698, 841539, 218119, 277027, 66687, -85337, 265662, 38479, -62095, 194926, 448920, 4311, 10347, 24727, -131990, 207063, 81503, 214752, 25350, 153306, 107871, 64982]
15221F4982j2178a6510q782E9647M4749d7618I251M35575b13225a9142j42747
15210a61889E4879A8211J23525a15713I6722c60254E739g084A53109J39164C0811
15198F7573J49222b07762C43143A6496K59447j25630b658F7672B6315K68461j3337
15187B81439l0104q5433K0735k3972K1370N6617f4261B34705a8876j20924C73662
15175e0202D23767A26293K6012J45233R0436J7406j85397b15688d3853C11165
15164I1719a42102A91156a65438A45433j0276k8966K50117A04347K53024j56384
15154B00987a98428A84448a47742B03161a19621C6124b9616l2595j2968d339A54781
15142A93883D2668K5693A8697J84197K02652j78165b2040B04672M5201a30218
$$ y = [64982, 52804, -16510, -25292, 59647, 104396, -47618, 9251, 444826, -213225, -19142, -161889, 54879, 18211, 141736, -115713, 96722, -360254, 5739, -7084, 153109, 292273, 30811, 67573, 216795, -207762, 343143, 16496, 275943, 150313, -2658, 67672, 26315, 294776, 281439, 251335, 165902, 186637, 162665, 184035, 240652, -64261, 234705, -18876, -139800, 373662, -50202, 423767, 126293, 152305, 297538, 387974, 405380, 219983, -215688, -43853, 311165, 91719, -142102, 191156, -165438, 145433, 135157, 106191, 356308, 104347, 357371, 200987, -198428, 184448, -147742, 203161, -119621, 36124, -29616, -62211, -75179, -4339, 154781, 193883, 42668, 68361, 18697, 202894, 405546, 227381, -22040, 204672, 249873, -130218]
15131C47361q3592b16450B67131a85955B00764k8967K96073I0202I678a92B39133
15119A6671N69862A28286b842B44254B6379K03856c7310B36297f0131p2242D06965
15107F5805K26196K4672m8762O536b3590A29938B2781K71922g1874j4992C88852
15095i193n7199A70506a03247G0459J87059L9670N2645A34197K9888J22249n0346
15084B35988c1533C71080m3596A54945K2466a66354K0254A87496a3003A3167d0562
15072G0172J94820N2314j15395f3877G1653J14622J63937j03886A18975Q1015
15062A99990L66713k69504k5131e2238C24012J9004O6060j68331k3168h0599B58869
15050B14261G5489A8762K89105L426a26904A56188K4448o6027K47754l2377j53630
$$ y = [347361, 263769, -216450, 267131, -185955, 200764, 171797, 467870, 90202, 9678, -192, 239133, 16671, 586533, 128286, -2842, 244254, 26379, 230235, -37310, 236297, -60131, -132373, 406965, 65805, 292001, 316673, 267911, 274447, -23590, 129938, 22781, 294703, -71874, -86866, 388852, -9193, -66392, 170506, -103247, 70459, 257518, 297188, 349833, 134197, 164085, 286334, 235988, -31533, 371080, 327484, 154945, 177411, -166354, -146100, 187496, -13003, 13167, -40562, 70172, 264992, 317306, 201911, -63877, 71653, 186275, 350212, 246326, 118975, 199990, 566703, 297199, 272068, -52238, 324012, 343016, 409076, 240745, 217577, -80599, 258869, 214261, 75489, 18762, 307867, 311293, -126904, 156188, 180636, 114609, 362363, 329986, 176356]
15039A76356l5304a58629B06658r0686P7646J88913g5440m2989E6475d1056E31564
15027F08802k51468l9918A08328N1422C4155K95939j16621a39871A32133L12759
15017D44892a42679B88111n5324P5372K343d0971E36848C1619d5244B31303c4461
15005C8237a39116J7889B65738a43624C82612M2644A14707j9307J27376A05671
14994D0844Q1503k243O8356P1492m7866I9014L28096j01579k2721m7014R6498
14983C52294J074J21372C2450K30698Q5589j47958J7185r1001F0376M29654A53914
14971B44237K65765A12308L2483M87195A88908L6858M2959C2390K31443b361B81981
14959C54563a56805A01336K40461r4451J27586g2213b0196G4620b2217I7302M27085
$$ y = [176356, 141052, -158629, 206658, 115972, 193618, 382531, -75440, -118429, 56475, -41056, 531564, 608802, 357334, 317416, 108328, 159750, 34155, 330094, 213473, -139871, 132133, 444892, -142679, 288111, 232787, 308159, 310502, -40971, 536848, 31619, -45244, 231303, -34461, 38237, -139116, -121227, 265738, -143624, 382612, 425256, 114707, 95400, 222776, 105671, 40844, 122347, 120104, 188460, 259952, 212086, 99014, 427110, 325531, 302810, 255796, 352294, 353368, 474740, 32450, 263148, 348737, 200779, 217964, 126963, 60376, 490030, 153914, 244237, 510002, 112308, 144791, 631986, 188908, 225766, 268725, 32390, 263833, -2361, 281981, 354563, -156805, 101336, 341797, 247346, 374932, -72213, -20196, 74620, -22217, 97302, 524387]
14948E24387I829L23286C0298N70402B47794J23299j37456D4870L94548j3053
14938D26365j31196A0806c2654D37523j3760A02946M11354k02667l5130A21164
14927C62730j20404c6838A56991L28811k39754H5258K16829J80507j30155j02123
14917B50316P5617J16629j22136M9328N6805l5265O6525A43374C3985K22764q4989
14906A71760i2172D14532L7276H4554L05918j2359j73678L31745R2101G2195M17272
14895D89467m0648j30662K19538B38289J9832J83625p5855J10027A78854J46012
14885C24866j38759q0665N95128B13204K79305M2928B30280m4912L46003B45711
14874D83421J05214j87985r3632R6512A11902K80574k9359J10954K13164k17212
$$ y = [524387, 9829, 333115, 30298, 600700, 247794, 371093, 233637, 44870, 439418, 426365, 295169, 10806, -32654, 437523, 423763, 102946, 514300, 311633, 276503, 121164, 362730, 242326, -36838, 156991, 485802, 246048, 85258, 302087, 482594, 352439, 250316, 325933, 442562, 320426, 369754, 426559, 391294, 457819, 143374, 33985, 256749, 171760, -92172, 414532, 451808, 84554, 390472, 378113, 204435, 536180, 628281, 72195, 489467, 448819, 318157, 537695, 238289, 258121, 441746, 365891, 475918, 178854, 324866, 186107, 105442, 700570, 213204, 492509, 535437, 230280, 185368, 531371, 245711, 483421, 588635, 400650, 307018, 403530, 111902, 392476, 363117, 474071, 687235, 470023]
14864D70023L491k04276j7797J65622A10500K93332K34106k78821o3013L55524
14854F51628A24286M398O55964f2589F99006B84753R0950J28919K51586k72409
14844D83799J22042j36308A57967K71856J35814J60972l6225N2507I6300J88192
14834B84492K21807J12506q2114K8227K00823B27746L88020K4978k21703M597
14824D23638j72775K85620O8468j93017P2733R7162p1643j13767B049O26784j26585
14813E02248j08664r6249K28252J1361j47453m8190j7144J85981A15910L76790
14803D92700k19629K25606j41292M55476B55869J45345K61391j0191j68543N2765
14793E36636N783m9241P1426L74971k58827q0303j11422r1733L95044n2781k14135
$$ y = [470023, 473514, 269238, 251441, 417063, 110500, 403832, 637938, 359117, 296104, 651628, 124286, 128684, 784648, -62589, 699006, 284753, 375703, 504622, 756208, 483799, 605841, 469533, 157967, 429823, 565637, 726609, 690384, 742891, 96300, 284492, 506299, 618805, 536691, 564918, 765741, 227746, 615766, 640744, 419041, 423638, 250863, 536483, 604951, 411934, 484667, 581829, 510186, 396419, 2049, 628833, 502248, 393584, 297335, 525587, 536948, 389495, 341305, 324161, 510142, 115910, 492700, 273071, 498677, 357385, 812861, 255869, 401214, 662605, 652414, 483871, 536636, 542419, 493178, 564604, 939575, 680748, 600445, 489023, 397290, 792334, 739553, 525418]
14782E25418J1321L8073n6967J88760A33320K50189K94760J5727m1538j75673
14772D76785r7702I1359O88768P622C24731N64272l42433P5062j59356K15133
14762F77409J38760j12882J4012Q9849q1398J11394o3763j94149M5676K93981
14752I18889k42908J49337j43912K65006D72032M38305j93870O8601k29696K04992
14742G60364K86770j89400K6419j37414J17092k18445J62305j95810K59699l15204
14732E56376L73746k48258k53896M49806J30302m32874N0226l7579L09614j46478
14722G50985K56722l43599O5799L5543L63663l87070j43159R8491j95288K64329
14712G66416J38926j56326J23921K64238j64549k82704k25024M99455M7428k21475
$$ y = [525418, 536739, 574812, 517845, 706605, 133320, 383509, 678269, 693996, 652458, 476785, 379083, 91359, 780127, 787749, 324731, 889003, 546570, 621632, 462276, 677409, 816169, 703287, 717299, 807148, 725750, 837144, 773381, 579232, 624908, 918889, 675981, 825318, 681406, 946412, 472032, 910337, 716467, 785068, 555372, 760364, 1047134, 857734, 884153, 746739, 863831, 645386, 807691, 611881, 871580, 556376, 930122, 681864, 427968, 877774, 1008076, 575202, 625428, 587849, 897463, 750985, 1007707, 664108, 729907, 765450, 1129113, 742043, 598884, 697375, 502087, 766416, 905342, 749016, 872937, 1137175, 972626, 689922, 464898, 964353, 1011781, 790306]
14702G90306M3392N2460j84870J33740J08209J67311j62706m1752j85916J04380
14692H24554J49312k5960O8902j29316J14200n0151j3608n9049N115j89220K35106
14681I29885J16145p6016k12628L21197k82561R7525o3187L19042j8907L13850
14671A444345k69852k65707L44591m17305K42775q4951K0902K71293m01009R7444
14661I82526k273L12061L7228m48938j26200M60596J96421p3786k1747j23611
14651A192277K16694o86963Q74510l92292J1077J20799L782j50128j22679J93089
14641A260166J6844j83202K50749j16974J2113J20162O2163k29551L21866M047
14631A518383R3525k85836j04271M29115J11180j78659j23485Q1833l35604K94715
$$ y = [790306, 833698, 886158, 701288, 835028, 943237, 1110548, 947842, 906090, 720174, 824554, 973866, 947906, 1016808, 887492, 1001692, 951541, 937933, 878884, 883999, 694779, 929885, 1046030, 970014, 757386, 1078583, 796022, 893547, 830360, 1149402, 1130495, 1444345, 1174493, 908786, 1253377, 836072, 1078847, 993896, 1014798, 1286091, 885082, 982526, 980253, 1292314, 1329542, 880604, 754404, 1215000, 1411421, 1337635, 1315888, 1192277, 1408971, 722008, 1596518, 1204226, 1215303, 1336102, 1339884, 1189756, 1067077, 1260166, 1277010, 1093808, 1344557, 1227583, 1239696, 1359858, 1422021, 1192470, 1514336, 1518383, 1611908, 1326072, 1221801, 1650916, 1762096, 1583437, 1459952, 1541785, 1206181, 1500896]
14621A500896L3892J83421k31390k19M1390J65964j64106L04672p07253Q4950
14611A212217M80311k03894L20463j90068J20869l55163K78422K42000l73020
14602A532137J42136j77778K89030r6182P213j73660L65127k52233J50374j0786
14592A775378n6468J02090j56913J89143J15603l89886K59646L15574j05693j38779
14582A909695r7313l4165J73280L24260R1198j17187K7074j5601o2983M81752
14572B680010l43851k70518M19115j18084j16240K17644N5372K30445l34413K8468
14562B447948J77501Q1353N259j7319M40402O7182k17080L78088R4176L61143
14552C818653L80346P05408Q40850J595042L468123Q642849J9828243R968801
$$ y = [1500896, 1534788, 1718209, 1486819, 1486600, 1527990, 1693954, 1529848, 1834520, 1127267, 1212217, 1692528, 1488634, 1809097, 1619029, 1739898, 1384735, 1663157, 1905157, 1532137, 1674273, 1496495, 1785525, 1689343, 1696556, 1522896, 1888023, 1635790, 1786164, 1775378, 1718910, 1821000, 1664087, 1853230, 1968833, 1578947, 1838593, 2154167, 2048474, 1909695, 1812382, 1778217, 1951497, 2275757, 2366955, 2249768, 2276842, 2261241, 2198258, 2680010, 2336159, 2065641, 2484756, 2366672, 2250432, 2468076, 2523448, 2753893, 2419480, 2447948, 2625449, 2706802, 2712061, 2694742, 3135144, 3202326, 2985246, 3363334, 3457510, 3818653, 4198999, 4904407, 5745257, 7340299, 10808422, 19451271, 39279514, 49248315]
14544D9248315B1900527A0629836j710833m138537k102090m31126l06150n485
14536A935615N92672l18628l4166j48390K27971j18015r464L36856k30159P9084
14526B313376J93049j31554K9952k50980J60208K22891J35454N0416M2471k82665
14516B482618k3310O15140N9418l19684j23662K00498R4474J1757m22809M30262
14506C004702K2338P1456K9037R529J69291L94056l57571l5231j43112J00529
14496C265024Q3478P6087O5173K47552J5879l09023J4262l3346L878O63005k29925
14485C862044l29668Q9507M25313k39063j18989L05791J2059J89909k27886K30011
14475D199028k25483j6489N97270n4612l47301N1983M38877j24804L55112r6002
$$ y = [49248315, 21900527, 10629836, 8919003, 4780466, 2678376, 2247250, 1941100, 1935615, 2528287, 2209659, 2175493, 2027103, 2255074, 2137059, 2127595, 2464451, 2234292, 2313376, 2506425, 2374871, 2404823, 2153843, 2314051, 2536942, 2672396, 2722812, 2765283, 2482618, 2459308, 3074448, 3133866, 2814182, 2690520, 2891018, 2985492, 2997249, 2574440, 3004702, 3027040, 3098496, 3127533, 3137062, 3306353, 3700409, 3342838, 3307607, 3164495, 3265024, 3348502, 3424589, 3489762, 3737314, 3753193, 3444170, 3458432, 3425086, 3428964, 4091969, 3862044, 3532376, 3621883, 4047196, 3808133, 3689144, 3994935, 4006994, 4196903, 3969017, 4199028, 3973545, 3957056, 4554326, 4499714, 4152413, 4204396, 4643273, 4518469, 4873581, 4777579]
14465D777579n36133N41198J88494j18797l19558L05453Q23718k07298l43565
14456E111091o1314M53104p5371K86932n5598k34813m8963M07015l4401L92024
14446F139706L6642o3951q0967J80476l50263J96504K7990L72703J42140K2988
14436F623968J52528l14911K83366K89067o4160K30776K78651j85335k4395q0808
14426G188747N13465k77054L68521K85493J76305j24048j83508L49396M7630J2446
14416H357393P16593j83431j8990J85433L32975j67885L06322j98773K81529L75133
14406I986299K06394J93996n02577N69275M63955j98312K45184J11998L10148
14397A1386360J34546Q2144M11535J53330L39394J0808K54339J63268o6678L08637
$$ y = [4777579, 4241446, 4782644, 4971138, 4852341, 4532783, 4838236, 5661954, 5454656, 5111091, 5049777, 5502881, 5427510, 5714442, 5658844, 5424031, 5375068, 5782083, 5747682, 6139706, 6176348, 6112397, 6031430, 6211906, 5861643, 6058147, 6086137, 6458840, 6600980, 6623968, 6776496, 6461585, 6744951, 7034018, 6969858, 7200634, 7479285, 7293950, 7269555, 7188747, 7702212, 7425158, 7793679, 8079172, 8255477, 8131429, 7947921, 8297317, 8344947, 8357393, 9073986, 8890555, 8871565, 9056998, 9389973, 9222088, 9528410, 9329637, 9611166, 9986299, 10192693, 10386689, 9884112, 10453387, 10917342, 10719030, 10964214, 11076212, 11386360, 11520906, 11603050, 12014585, 12167915, 12507309, 12518117, 12772456, 12935724, 12869046, 13177683]
14387A3177683N01956J51191L03954K52402K45757k5160Q84243l17K5908M86214
14377A6003831K71420K32660K43030N83393K58911M91052J09197N98783J18775
14368A8911052M15823L83021O35161n7851N18632Q45101K39323M93657L10833
14359B2694752Q68643J92736P35985L99826R10152L38311P79955L03106O32402
14350B7855868J244377M96580R31101O68702N03005Q58208P42424J047006Q44956
14341C5192227J089545N20798J016932J531034P25169J238019J311513J492921
14333D4118158Q30710J663702J413592J523999J632934J394430J602431K005954
14325E6185910J534844J947710J916697K497297K027327K540132K088896K655048
$$ y = [13177683, 13679639, 13830830, 14134784, 14387186, 14632943, 14607783, 15492026, 15491709, 15517617, 16003831, 16275251, 16507911, 16750941, 17334334, 17593245, 18084297, 18193494, 18792277, 18911052, 19326875, 19709896, 20345057, 20287206, 20805838, 21650939, 21890262, 22383919, 22694752, 23563395, 23756131, 24492116, 24891942, 25802094, 26140405, 26920360, 27223466, 27855868, 29100245, 29596825, 30527926, 31196628, 31699633, 32557841, 33300265, 34347271, 35192227, 36281772, 36802570, 37819502, 39350536, 40075705, 41313724, 42625237, 44118158, 44948868, 46612570, 48026162, 49550161, 51183095, 52577525, 54179956, 56185910, 57720754, 59668464, 61585161, 64082458, 66109785, 68649917, 70738813, 73393861]
14317G3393861K454923L383772K690237L361949L361252L305961M031965L831753
14309I9815673M052820M389664M304007M669411N190736N706815N592472O063251
14301A39784849O530645O951576O923427P803794P955195Q474443R085509R617672
14293B03127110R881135J0829628J0944453J1649143J2133993J2530472J3380603
14286B84476537J3746200J4036766J4157783J4755087J4864129J4361879J4679265
14279C85077646J4294090J3456698J2544025J1688418J0645120R149030O894136
14272D63749163M284740P64735l94273p63877l443093l666967n907510q755338
14264D45867580j0484064j2479846j3202401j4322471j4991663j5366836j5222745
$$ y = [73393861, 75848784, 79232556, 81922793, 85284742, 88645994, 91951955, 95983920, 99815673, 103868493, 108258157, 112562164, 117231575, 122422311, 128129126, 133721598, 139784849, 146315494, 153267070, 160190497, 167994291, 175949486, 184423929, 193509438, 203127110, 213008245, 223837873, 234782326, 246431469, 258565462, 271095934, 284476537, 298222737, 312259503, 326417286, 341172373, 356036502, 370398381, 385077646, 399371736, 412828434, 425372459, 437060877, 447705997, 456855027, 463749163, 468033903, 468798638, 468404365, 467640488, 464197395, 460530428, 454622918, 445867580, 435383516, 422903670, 409701269, 395378798, 380387135, 365020299, 349797554]
14257C49797554j5698731j5624458j4724631j4664311j3219613j2125254j3039352
14250B50701204j2568002j1666345j0900510j0477627r744848r366433q480761
14243A77496678q265775p762234p767163o857568o381987o054856n675922n672913
14235A23058260n370251n046681m454031m862581l147119m231945l722536l903293
14227H8319823l253266l330106k855629k754936k850689k574142k838927j561877
14219F6300251k260803k480676k019569k061403j609816j757622j364961j561201
14211E1184200j985563j516141j274057j310390m96862j294438j544192j396744
14203D0365813j241170p20101r88313o71151j034388j446015p47008r99358o37888
$$ y = [349797554, 334098823, 318474365, 303749734, 289085423, 275865810, 263740556, 250701204, 238133202, 226466857, 215566347, 205088720, 195343872, 185977439, 177496678, 169230903, 161468669, 153701506, 146843938, 140461951, 134407095, 128731173, 123058260, 117688009, 112641328, 108187297, 103324716, 100177597, 95945652, 92223116, 88319823, 85066557, 81736451, 78880822, 76125886, 73275197, 70701055, 67862128, 66300251, 64039448, 61558772, 59539203, 57477800, 55867984, 54110362, 52745401, 51184200, 49198637, 47682496, 46408439, 45098049, 44601187, 43306749, 41762557, 40365813, 39124643, 38404542, 37416229, 36745078, 35710690, 34264675, 33517667, 32518309, 31880421]
14194C1880421l09711r81007j109219m40996p08034q19713o36048l78924q50792
14185B5645977n66600o38292m31443n99563k00075p24107m19353l70022k34978
14176B1461544o47902l75485q09281R8137n96137k22698l25960n36499r6537o78766
14166A7270416l02031J22009n34340o80127j60691r5571m07553J611j66819n12605
14156A4534299L1267n37907j83691j94590n0953m46371J021j75056m05552n05816
14146A2066651l22394J36973P5577K4291l45884l74891k13186k1348m79916j34437
14136A0411436M9656l53675j69568m5157J61723p6261j47805q27035K85855R5948
14126I385117m31025k91055k50069Q9051N8708k52576J07846j13841n05506L19592
$$ y = [31880421, 31570710, 30589703, 29480484, 29039488, 28331454, 27511741, 26875693, 26496769, 25645977, 25079377, 24441085, 24009642, 23410079, 23210004, 22485897, 22066544, 21696522, 21461544, 20813642, 20438157, 19628876, 19727013, 19130876, 18908178, 18582218, 18045719, 17949182, 17270416, 16968385, 17090394, 16556054, 15875927, 15715236, 15619665, 15212112, 15213723, 15046904, 14534299, 14565566, 14027659, 13843968, 13649378, 13598425, 13152054, 13153075, 12978019, 12572467, 12066651, 11744257, 11881230, 11956807, 11981098, 11635214, 11260323, 11047137, 11025789, 10545873, 10411436, 10461092, 10107417, 9937849, 9892692, 10054415, 9978154, 9830349, 9003314, 9289169, 9385117, 8954092, 8663037, 8412968, 8502019, 8560727, 8308151, 8415997, 8302156, 7796650, 8116242]
14116H116242m33949k02323M70710l40205N7745j76659J8984k08787k83644P3077
14106G091191k44365P9150r3412j42933l77100K57325k06284K9672l24307N4652
14096F123589N1323j57092M45819m04689q0984j60090p3m0916P0256j33244k30047
14085E483852L40869m80594J33401k96281J11724j26791j83632l2742j02131R6527
14075D944202j7419k23904j68933L94615M697l47941P4503l79908L41996l03984
14065D317924K96274k8189j51464k91614M0795L28405l88078m578m1956R7558
14055D175077j06534L207j13049j2963j31892K41683k45863j57548o3303o6656
14045C522159J66894M1061n2889O3510l74482K41832j28535j16795p4067K71515
$$ y = [8116242, 7682293, 7479970, 7950680, 7610475, 7668220, 7491561, 7510545, 7301758, 7018114, 7091191, 6846826, 6925976, 6832564, 6689631, 6312531, 6569856, 6363572, 6393244, 6068937, 6123589, 6174912, 6017820, 6463639, 6058950, 5977966, 5817876, 5817803, 5776887, 5847143, 5713899, 5483852, 5824721, 5344127, 5477528, 5181247, 5292971, 5166180, 4982548, 4949806, 4847675, 4944202, 4926783, 4702879, 4533946, 4928561, 4933258, 4585317, 4659820, 4279912, 4621908, 4317924, 4614198, 4586009, 4434545, 4142931, 4183726, 4512131, 4124053, 4119475, 4077519, 4175077, 4068543, 4071750, 3958701, 3945738, 3813846, 4055529, 3809666, 3652118, 3588815, 3522159, 3689053, 3730114, 3677225, 3740735, 3366253, 3608085, 3479550, 3362755, 3288688, 3560203]
14035C560203j70105k4867J90002l86487k6957L82682n951n97870N79089k11388
14025C288351q5787Q6958q0032l05705L08304l92675o4054J40878k4510l2513
14015B839215k19361j02389l0465K34128l2201l8885n45704L12960K2710j45710
14005B294298M3333L35211j83715P3542j98379j63690J24486Q0414j98152K14066
13995B421414j56784J87729O579j90411P66837J64782N99570J637668O727963
13986A2165347J8935303J9809991k1851565A4094445n127327k709550j361668
13979D895900n65195j48130o62678r167r329n98343O011P7416J55310l47514j95893
13968B598388n9880K15976k55437M5333j30975O2761q7747K33460k24049l03145
$$ y = [3560203, 3390098, 3365231, 3555233, 3168746, 3141789, 3524471, 3518520, 2920650, 3499739, 3288351, 3202564, 3289522, 3209490, 2903785, 3212089, 2819414, 2755360, 2896238, 2871728, 2839215, 2619854, 2517465, 2487000, 2721128, 2688927, 2650042, 2104338, 2417298, 2440008, 2294298, 2337631, 2672842, 2489127, 2562669, 2364290, 2200600, 2325086, 2405500, 2207348, 2421414, 2264630, 2452359, 2458938, 2268527, 3035364, 3200146, 3799716, 5437384, 12165347, 31100650, 50910641, 29059076, 14094445, 8967118, 6257568, 4895900, 4330705, 4182575, 3519897, 3510730, 3501401, 2903058, 2909069, 2986485, 3141795, 2794281, 2598388, 2538508, 2754484, 2499047, 2544380, 2413405, 2476166, 2388419, 2621879, 2397830, 2094685]
13958B094685N14877m67555J11719N6146N1299j54372K8986k04280m7256O9076
13948B053325m9686j47334J23044q3173n4333J88672J23985k03875j94069M80812
13938B237368n41156K11152J23656K6916l81759P7497J83005j1138m29661J01757
13928A597637J77666n832L07839l72872j96126J48377j16429K38943m92541M53820
13918A740482j20589N0723M7620k82177K60772J99394n50527M08809n22183L00236
13908A532560j32052J82371k1693j35458l18007M87420R4618k99319j3345k62494
13898A114601J20043K47042K76879m08329J11153J37918k45817l889N5931l56108
13888A049424K58883L12051n86225L69596M7734K7271k83494k43351N93370l89445
$$ y = [2094685, 2609562, 2142007, 2253726, 2309872, 2361171, 2206799, 2235785, 2031505, 1984249, 2053325, 2003639, 1856305, 1979349, 1896176, 1841843, 2030515, 2154500, 1950625, 1756556, 2237368, 1696212, 1907364, 2031020, 2057936, 1676177, 1753674, 1936679, 1925541, 1495880, 1597637, 1775303, 1769471, 2077310, 1704438, 1508312, 1656689, 1540260, 1779203, 1286662, 1740482, 1619893, 1670616, 1718236, 1436059, 1696831, 1896225, 1345698, 1754507, 1232324, 1532560, 1400508, 1582879, 1561186, 1425728, 1107721, 1595141, 1689759, 1390440, 1377095, 1114601, 1234644, 1481686, 1758565, 1350236, 1461389, 1599307, 1353490, 1349601, 1405532, 1049424, 1308307, 1620358, 1034133, 1403729, 1451463, 1478734, 1195240, 951889, 1545259, 1155814]
13878A155814L68608k11317J28499k82161P4723m4555j737K14773k31039M30714
13868A602322l44148L78976k44817j57845j47872K63909m13102M54477k20516
13859A171384J01925l9069m49897O07984J05153m10128j82264M9103J92083L0869
13849A177143m05752k3817K14047p4732J13013J50189Q7318n24182N34234n5877
13839A191584l11137L0989R7464k75136J62276L35701Q5324k26268l52456M77592
13829A215933k99953M0631l64083J79437L82589j70038Q4236m45704P07433l35600
13819I94881j30703j52747J18499J30816K71437j12494k67985J79413n7699P8651
13809A052069l87593Q9369R029l47692N02817J0702j09422J10291j14057K32117
$$ y = [1155814, 1524422, 1313105, 1441604, 1159443, 1234166, 1189611, 1187874, 1402647, 1171608, 1602322, 1258174, 1637150, 1392333, 1234488, 1086616, 1350525, 937423, 1391900, 1171384, 1273309, 1234240, 784343, 1392327, 1497480, 1087352, 905088, 954191, 1146274, 1177143, 771391, 747574, 961621, 886889, 999902, 1150091, 1237409, 713227, 1247461, 1191584, 880447, 911436, 1008900, 733764, 896040, 1231741, 1317065, 1090797, 738341, 1215933, 915980, 956611, 592528, 771965, 1154554, 984516, 1068752, 623048, 1330481, 994881, 864178, 711431, 829930, 960746, 1232183, 1119689, 851704, 1031117, 973418, 1052069, 664476, 753845, 762874, 415182, 917999, 928701, 819279, 929570, 815513, 1047630]
13799A047630m34378J89546K40285k26936j20108K29518k71636J35518J42300
13790I31739k31961J24352O5302k06857j81380O37706j34402M7824l40400K35957
13780I47880k08626j24790J71795j95097J84949q8605P7244p0246K46814j52493
13770G88825J8804M12888l86945k75044J37893J39577C55176L36388j33186K98805
13760H57183L0655B79807M22923l12397L68247j88628B15841L03497L27394j95976
13750F50756J24648J61252k95522B87871K27244R3221J08467N53219n67234n3408
13740F49380k3105M28366k60216n0942l03510O4293j23819L50470K86832l14283
13730G03466R0436A53116P33319A04972L51630K39199M5738k16703j1454M09864
$$ y = [1047630, 613252, 802798, 1043083, 816147, 696039, 925557, 653921, 789439, 931739, 699778, 824130, 889432, 682575, 501195, 1138901, 1004499, 1052323, 711923, 947880, 739254, 614464, 786259, 591162, 776111, 687506, 764750, 694504, 941318, 788825, 807629, 1220517, 833572, 558528, 696421, 835998, 355176, 691564, 558378, 857183, 887838, 279807, 702730, 390333, 758580, 569952, 215841, 519338, 846732, 650756, 775404, 936656, 641134, 287871, 515115, 608336, 716803, 1270022, 702788, 649380, 626275, 1054641, 794425, 743483, 439973, 504266, 380447, 730917, 1017749, 703466, 793902, 153116, 886435, 104972, 456602, 695801, 741539, 524836, 513382, 923246]
13720I23246j24095j57615K36096O4165k64044j69025o0743K75528J16067k02044
13710F37536o9483K55308j56946o8284B32137K94657J47305B35737L09505K2643
13700E67885J32531j85083J2565j65955J27774B27637M70365B45833M78260K6952
13690G51045k53430L76385k00713k52609J04631J86729k19187J4407l1306J4935
13680D90887J81235m0582j73998J30043k62499L33031l24946M513M82753o9443
13670G50994k88556K28066j3305M9406h759D75103K86588m3212k44702B27011
13659B44068M09874C01988J10737j75014J31488P9451K17426j34000O3204R682
13649F04962o9498k2602K2259K44623C58884N8208q0802H0258N88368N1036l27817
$$ y = [923246, 799151, 641536, 877632, 941797, 677753, 508728, 447985, 723513, 839580, 637536, 568053, 823361, 666415, 598131, 232137, 526794, 674099, 235737, 545242, 567885, 700416, 515333, 527898, 361943, 489717, 227637, 698002, 245833, 724093, 751045, 497615, 874000, 673287, 420678, 525309, 712038, 492851, 507258, 475952, 490887, 672122, 631540, 457542, 587585, 325086, 658117, 333171, 337684, 820437, 750994, 462438, 690504, 677199, 726605, -8759, 475103, 761691, 718479, 473777, 227011, 244068, 653942, 301988, 412725, 237711, 369199, 448650, 666076, 532076, 595280, 604962, 535464, 512862, 535121, 779744, 358884, 417092, 336290, 80258, 668626, 719662, 391845]
13638C91845n262K82635B91229n9391L81453j8711j49703J08186j81310J66675
13628E38428k3395K00553j00861k48509J18548M5630J75221j59215M7038k24788
13618C68650K19016j81996l8908o1702J23970I7843L46053r8688J4201L0733L74192
13607G64334C42988O1488K85622B05436L31422j06720k14850J73140L566K10442
13597F02436B84722J29492J69971j74839M18313C63616q7463L77819l14284J34960
13587D74648P2222j21059R3803B23816J40338Q4798J80369I3757L73459A98981
13576A04218M22037I7190L29704j80232F1089M32048A42224L93612R1758k47735
13566C79859A81942J72428J534Q8639j69975K006J48149j28141n2866L26115M7388
$$ y = [391845, 386583, 669218, 291229, 231838, 613291, 594580, 444877, 553063, 371753, 538428, 515033, 715586, 614725, 366216, 484764, 530394, 705615, 546400, 593438, 368650, 587666, 405670, 366762, 305060, 429030, 97843, 443896, 345208, 359409, 390142, 764334, 342988, 404476, 690098, 205436, 536858, 430138, 215288, 388428, 391994, 602436, 284722, 414214, 584185, 409346, 827659, 363616, 276153, 653972, 339688, 474648, 546870, 425811, 519614, 223816, 364154, 448952, 629321, 93757, 467216, 198981, 104218, 526255, 97190, 426894, 246662, 61089, 493137, 142224, 535836, 627594, 379859, 181942, 354370, 355904, 444543, 274568, 276574, 424723, 296582, 243716, 569831, 617219]
13555F17219k41463I8611L95802A56614K14831m8267A22075L7270J79615m0052
13545B98908p8514K19677p3609A03167M83308A38150N6619a19407A89308P2434
13535B61742L77188A23084M40553G6784M79946J4482F1209L02403L2451A59499
13524C26303j5288J47847A48529J86909C7817J49564L83232A22616L64590L5404
13514E22610A63642m2797Q2444K17579A34585K54550q7754M0814E3232K53806
13504C07038j03039I2409J90280r3043K74764k14906J21473R0439A62187k7822
13494A34365n9776d2911A95981J82538L7594N502A12019L94299B4354J54070C9036
13482C34770A28680b0033D30777o4075l264p2264q3945N5347L682L2108J05126
$$ y = [617219, 375756, 98611, 494413, 156614, 371445, 323178, 122075, 159345, 338960, 298908, 220394, 440071, 366462, 103167, 586475, 138150, 194769, -119407, 189308, 261742, 638930, 123084, 563637, 76784, 556730, 571212, 61209, 363612, 396063, 159499, 326303, 311015, 458862, 148529, 335438, 37817, 187381, 570613, 122616, 487206, 522610, 163642, 120845, 203289, 420868, 134585, 389135, 301381, 342195, 53232, 307038, 203999, 92409, 282689, 189646, 464410, 249504, 370977, 461416, 162187, 134365, 74589, -42911, 195981, 378519, 416113, 421615, 112019, 506318, 24354, 178424, 39036, 334770, 128680, -20033, 430777, 366702, 363438, 291174, 207229, 262576, 266258, 298366, 403492]
13471D03492L1713J05444A31185N4553O1851g1175B3476K43269J15970P8648A66103
13459C76354H2350J4716m4955K26079L9496l3445R9859A59533J39628H1632J51523
13448B33155G7394N9716b4157D47820j84581J54977A75775R2709n4827K51904
13438D65561A62176B2353L21554i428C77022A09188O2916D2098J57676O7405J29050
13427C96229j87513m7224j419J29551h2765D56628j57425R2380j53685J75627
13417D13525l9654o5567C4718K61984j43081a01321A91918o5625K36567A68711
13406E07176M2670P3377A12344K28948F4912b9097B05759L0131f7397A53617O6249
13395B19866l2935B6185M26691q6374A25235K0673J24518o0659L72067N2831B84393
$$ y = [403492, 435205, 540649, 131185, 185738, 247589, -71175, 23476, 266745, 382715, 461363, 166103, 376354, 82350, 97066, 52111, 278190, 317686, 284241, 384100, 159533, 299161, 81632, 233155, 77394, 137110, -24157, 447820, 263239, 418216, 175775, 268484, 213657, 465561, 162176, 22353, 343907, -9428, 377022, 109188, 172104, 42098, 199774, 267179, 396229, 208716, 161492, 160073, 289624, -82765, 456628, 299203, 391583, 237898, 413525, 373871, 308304, 34718, 296702, 153621, -101321, 191918, 126293, 362860, 168711, 507176, 549846, 623223, 112344, 341292, 64912, -29097, 205759, 235890, -67397, 153617, 219866, 186931, 26185, 452876, 366502, 125235, 145908, 270426, 209767, 581834, 634665, 284393]
13383B41522c1708H0048K25033K90356b6286E22621c7101l9202B65143I8300R0561
13372A88861J16272n6713J10347A9375J04536K13442g8782C77855a3149D07054
13361B35205B7378b59139B99433d206B01810M1333j16668n4729K48837K74923
13351E95506k82215E3005K60555p9473M8135K48981B04609K88140o5439M5837
13341D73147j29964K7517M04658A40824K43396K7989j47217D5702M66735j41595
13331C70842j56732f6756B95306d6635C01888o4511Q1039f5195B09535o8229P2240
13320B13546J74250j20522A33134J22109q7988o93m0339K94461K4565I0591A9753
13308H452K17088b81292b5854A26787L4304J2378m4177L75677A65838L4396n4441
$$ y = [241522, -31708, 80048, 305081, 595437, -26286, 522621, -37101, -76303, 265143, 98300, 188861, 305133, 248420, 358767, 19375, 123911, 337353, -78782, 377855, -13149, 407054, 235205, 27378, -259139, 299433, -4206, 201810, 243143, 126475, 71746, 320583, 595506, 313291, 53005, 313560, 234087, 282222, 531203, 204609, 492749, 427310, 473147, 343183, 370700, 775358, 140824, 384220, 412209, 264992, 45702, 512437, 370842, 214110, -66756, 295306, -46635, 301888, 237377, 318416, -65195, 209535, 141306, 213546, 387796, 267274, 133134, 255243, 167255, 166562, 126223, 420684, 445249, 90591, 19753, 8452, 225540, -281292, -25854, 126787, 161091, 173469, 129292, 504969, 165838, 200234, 145793]
13297A45793o7035J14871G9266J97907A3000L89119q3663p6330I3278A2360f9003
13285D94314B09642J07205a34946A91469k2364J16017G201e7005G2240K20920
13275B93160n6972I1138a29337r6674E7134L89537j90507I2874M8670J28113p5780
13264A93877k5242J78536k8418j27932n7891b65074c3664H1040h0207A95087L01108
13253D96195j30860A53594p6637K20054A43769O3608a23732m659D75081B3344
13242A40125a6496F4218J37961a03400C48556j71069a12614h625B51954o0989
13232A90965P8461g0636A31227N3951c4828E72892A14277K01008c2326A87942
13221I4012l2487K9300b25198h601A18050G410J89685K93692a66632C97738o9752
$$ y = [145793, 78758, 193629, 79266, 277173, 13000, 402119, 318456, 242126, 93278, 12360, -69003, 494314, 209642, 316847, -134946, 191469, 169105, 285122, 7201, -57005, 72240, 293160, 236188, 91138, -129337, -226011, 57134, 446671, 256164, 92874, 141544, 269657, 193877, 168635, 347171, 318753, 190821, 132930, -265074, -33664, 81040, -80207, 195087, 496195, 365335, 153594, 76957, 297011, 143769, 207377, -123732, -128391, 475081, 23344, 140125, -16496, 64218, 202179, -103400, 348556, 177487, -112614, -8625, 251954, 190965, 269426, -70636, 131227, 185178, -34828, 572892, 114277, 315285, -32326, 187942, 94012, 61525, 90825, -225198, -8601, 118050, 7410, 197095, 490787, -166632, 397738, 327986]
13210C27986j21348E3801J41800C8998J58560H4592g3783A18758c09355G5390
13199e6930a6167B61862r7510e4896B37747a17012C09514a09076B72324A0347
13188B24552G951J48485b0387I9022Q6765L04651F7720Q103a48749c1259B55896
13176a36810A20904K91235a4978B96081H0917b1970F1436J95075n5291D9691J98118
13165B47809F4993J52753M669n8793J72622j55737J07591A13280n3574J57110
13155B16816F8600J13531b92677N6109E2026J25128a9202o5756B31025E6646B3963
13143A62750p6462K79603E0759a02655p2927J6918P3185C60572a94515A20936
13132D2777N7075K7713J62473a16229F1089L36114d7332l1673D29481N3062b9496
$$ y = [327986, 206638, 53801, 195601, 38998, 197558, 84592, -73783, 118758, -309355, 75390, -56930, -16167, 261862, 164352, -54896, 237747, -117012, 309514, -109076, 272324, 10347, 224552, 7951, 156436, -20387, 99022, 185787, 490438, 67720, 75823, -148749, -31259, 255896, -136810, 120904, 412139, -14978, 296081, 80917, -21970, 61436, 256511, 201220, 49691, 247809, 64993, 217746, 222415, 163622, 336244, 180507, 288098, 113280, 59706, 216816, 68600, 182131, -292677, -236568, 52026, 177154, -19202, -84958, 231025, 56646, 23963, 162750, 86288, 365891, 50759, -102655, -175582, -158664, -85479, 360572, -194515, 120936, 42777, 99852, 127565, 290038, -116229, 61089, 397203, -47332, -79005, 429481, 482543, -29496]
13120C71292d5905k1291D62475A30326K53292A20186d40246B48012J64287r9831
13110C12468G8973N683b4942l4545k4104B11094C2977O1295L4489A8910a91246
13098C6372a29750m4959P5877C77013j59412a59808k9866E5833M37377d7100B00395
13086g4267G3097K29794C2414J99548J3944A06349a60032b6572A50539O4745A5874
13074B29209b35834A9460K84168g1137A1334M12347E4041a41126A17984K34153
13064C52137a60985B56669l2358b1481B85219n9046J6133a13813K3173C20465
13053b1006B57138K444L449o2801n0702K01871J31563B5551J21705d6634A89428
13041A57909K42995m8858r2842j03348G239L20939A42974P3833k8406n1410b45282
$$ y = [371292, -45905, -67196, 462475, 130326, 383618, 120186, -440246, 248012, 412299, 312468, 78973, 84656, -24942, -59487, -83591, 211094, 32977, 94272, 128761, 18910, -191246, 36372, -129750, -174709, -98832, 377013, 217601, -159808, -189674, 55833, 493210, -47100, 200395, -74267, 73097, 302891, 32414, 231962, 245906, 106349, -160032, -26572, 150539, 215284, 15874, 229209, -235834, 19460, 303628, -71137, 11334, 423681, 54041, -141126, 117984, 352137, -160985, 256669, 224311, -21481, 285219, 226173, 242306, -113813, -90640, 320465, -21006, 257138, 259582, 263031, 200230, 149528, 351399, 482962, 25551, 147256, -46634, 189428, 157909, 400904, 352046, 259204, 155856, 7239, 328178, 142974, 216807, 188401, 136991, -245282]
13029B58125L222M8227a55641I2039h2818l2140B25124p396m2842q504A0556b00440
13016A77034D3165P847j1774J56730R1873b54277e4080B89601G0497J49422c9805
13004h0954g77l73449a18374D30629A02401a2560A89056j9407J63944a16913J352
12993a15561G9011K2735a25946k6649B8265J66836e8301B0483J86788r0811Q242
12982A24702c05145E5016B447J3584O59412b29545J3103D81411E6997J33108p1004
12971A19101a21768A27100a45094A35773m7985J929g9846o9909p8631F01L03622
12960C04223C7374o924f4899K1536j68547E2654K76846a03796C6978K47075B4495
12948F7604k7647J94004D6618b83226G8485I625K93966a64429A60685E47c03489
$$ y = [258125, 261347, 309574, -155641, 92039, -82818, -114958, 225124, 217728, 174886, 166382, 10556, -200440, 177034, 43165, 51012, 39238, 195968, 287841, -254277, -54080, 289601, 70497, 219919, -39805, -80954, -777, -374226, -118374, 430629, 102401, -12560, 189056, 169649, 333593, -116913, -115561, 79011, 101746, -125946, -152595, 28265, 195101, -58301, 20483, 207271, 116460, 124702, -305145, 55016, 2447, 16031, 675443, -229545, -216442, 481411, 56997, 190105, 119101, -121768, 127100, -145094, 135773, 87788, 89717, -79846, -149755, -228386, 601, 304223, 37374, 30450, -64899, -43363, -211910, 52654, 329500, -103796, 36978, 284053, 24495, 67604, 39957, 233961, 46618, -283226, 78485, 9625, 303591, -164429, 160685, 547, -303489]
12936E665g341j9049r7297E4781c1256A95972Q6318g7206D6247L09439a35878
12924C6264J19642J24775n2514d8694C13510a61355k48068C0167p427f3411M721
12913e8690A83075B9849b13343a05804A33056C4009J88013a63253M1283A02114
12902c57546J63355F5497c23713H5049i2114j54867A8779a2498A96844q1794g7449
12890E1497i4372C1146P9019O4195l0369m8201a55938C19598b4930C29064j00027
12879B29037E9057L11272A73033l277L1757o136L2274a20636A01544L58846H923
12867a68525A57332g1130B04586f5753A15280d8003M637D58344A90566b49752
12856A196a8956q829A22905f7739k29530J38946C7899K71041E6521L83085a07075
$$ y = [5665, -7341, -26390, -123687, 54781, -31256, 195972, 282290, -77206, 46247, 355686, -135878, 36264, 155906, 280681, 228167, -48694, 313510, -161355, -409423, 30167, 22740, -63411, -58690, 183075, 29849, -213343, -105804, 133056, 34009, 222022, -163253, -121970, 102114, -357546, -194191, 65497, -323713, 85049, -92114, -246981, 18779, -12498, 196844, 115050, -77449, 51497, -94372, 31146, 110165, 174360, 143991, 95790, -155938, 319598, -24930, 329064, 229037, 59057, 370329, 173033, 169756, 201513, 195377, 227651, -120636, 101544, 460390, 8923, -168525, 157332, -71130, 204586, -65753, 115280, -48003, -43366, 458344, 190566, -249752, 1196, -18956, -27785, 122905, -67739, -297269, -158323, 37899, 308940, 56521, 439606, -107075]
12844a19245D6819N9123Q381O0284E4558N7955d6658j86814C1341A4442a54671
12832d074q6203G6860K94374c61228a57264d3193B06962E3740e5473B29376b58813
12820b20245C60438m2370k2480A24173E7690b08235O6964A92170e5818E5765a15981
12808g4900A51008F3013L8959B3306K2560h5570A49987C8150b26723b6108j4141
12797d0249a8258n2032j46536A34468N2662c4143B9374c993r7040n306M5245H969
12784C7855a09629A06056a16525A00128J94068c34992A83014c47704b1761B57801
12773B45223j2766e5569A67905a05514B7896a95445k2762B05737f59A78347p3955
12762A04392J34057N2566A17353B4846J51199d57185A94621o6784M5434A1959
$$ y = [-119245, 46819, 105942, 114323, 174607, 54558, 112513, -46658, -233472, 31341, 14442, -154671, -4074, -90277, 76860, 371234, -361228, -157264, -43193, 206962, 53740, -55473, 229376, -258813, -220245, 360438, 318068, 295588, 124173, 57690, -208235, -141271, 192170, -55818, 55765, -115981, -74900, 151008, 63013, 101972, 23306, 45866, -85570, 149987, 38150, -226723, -26108, -40249, -18258, -70290, -216826, 134468, 187130, -34143, 29374, -3993, -101033, -106339, -61094, 8969, 37855, -109629, 106056, -116525, 100128, 294196, -334992, 183014, -347704, -21761, 257801, 245223, 232457, -55569, 167905, -105514, 27896, -195445, -218207, 205737, -659, 178347, 104392, 238449, 291015, 117353, 24846, 176045, -457185, 194621, 127837, 173271, 11959]
12751F9595J06228c3041j00462C1962j0113R134i7986Q08k9376d1119n8718B24540
12738I6707P2358B1241J1449J18890h187l6683C63465A29013b39066A36679F7979
12726G966N35038b0985r0582B03431d473k64320J15553B05408Q346O5073q9206
12715A89621K947A9971a6010I0125N0481J74625J38366a67550A51549c5557A54958
12703A5185L12752j32541b28357I9010g7004j26721P3748j84427a2502B46631
12692A3953J81240a35376C05995a32298f2696A29518d2180j27043B69487a20842
12681H1443k0764e6018C24014G2677L2141L53209a45510a8734B76655A10175K4994
12670A35169A227L8688J49996i2375C645O8850a19397C2439J21505A5072K88657
$$ y = [69595, 175823, -33041, -133503, 31962, 21849, 30983, -97986, -97178, -126554, -41119, -99837, 224540, 96707, 169065, 21241, 32690, 151580, -8187, -44870, 363465, 129013, -239066, 136679, 67979, 7966, 543004, -20985, -111567, 203431, -4473, -268793, -153240, 205408, 213754, 278827, 189621, 192568, 19971, -16010, 90125, 140606, 315231, 453597, -167550, 151549, -35557, 154958, 15185, 327937, 195396, -228357, 99010, -77004, -203725, -129977, -314404, -12502, 246631, 13953, 195193, -135376, 305995, -132298, -62696, 129518, -42180, -169223, 269487, -120842, 81443, 60679, -56018, 324014, 72677, 104818, 458027, -145510, -18734, 276655, 110175, 135169, 1227, 39915, 189911, -92375, 3645, 72495, -119397, 32439, 153944, 15072, 303729]
12659C03729c44867F02L29061A17240K6051J71062p2950D2589L53282E6485N27282
12648E83767a39115k96032D6018b57638D41386p3541F1410K93437a97021A84674
12637b32506A35180J88766C2009R9921B6549h1559J560C09853a31463A48460a55086
12625C25359a08227D62538j42124r0148d4825A89399d0334F7590a09664J3433
12615i6231L9801A1738O5163h2211B664J09054J18044m9166a85012G3774f5539
12603a74834C45189H0737l508a1058B36853H3013d8691C18121i316C06378A21591
12591B18105c7162H0534h8065G3405a62964D26905j84039E1189j8754N6687e6276
12579a51553d3154q6242c7349A99562a17044b723k17391G8944a1945j11581B97133
$$ y = [303729, -344867, 602, 329663, 117240, 143291, 314353, 241403, 42589, 395871, 56485, 583767, -139115, -435147, 46018, -257638, 441386, 367845, 61410, 354847, -197021, 184674, -232506, 135180, 323946, 32009, 131930, 26549, -81559, -79999, 309853, -131463, 148460, -155086, 325359, -108227, 462538, 320414, 230266, -44825, 189399, -40334, 67590, -109664, -96231, -56430, 11738, 76901, -82211, 2664, 111718, 229762, 180596, -185012, 73774, -65539, -174834, 345189, 80737, 77229, -11058, 236853, 83013, -48691, 318121, -9316, 306378, 121591, 218105, -37162, 80534, -88065, 73405, -162964, 426905, 242866, 51189, 32435, 89122, -56276, -151553, -43154, -129396, -37349, 199562, -117044, -2723, -220114, 78944, -11945, -123526, 297133]
12567e0425D9574J78692a0238C6776J01420J98720g5867j6700A48856a87942B3965
12555B73944j27227j0070d6450C3465a18461B62828A00600C3716c0596B94455
12544A76642m6702h2353C8329K09591J15643j76569c86898C29897A5644J15324
12534A30968b6503A24727a45447B59929D1784I605a13404n098q8890A04708g9113
12522D10370A88550J16368r5817b64970A31008a93808j53789B22076d0921I9037
12511a83562A03983j5759a13050d1569D775i0341D02644A48629R9523N7870L535
12500C09557G1070J0765f6872A48376O4353o6700K9892i4566j36675A20171o515
12489A13656K20103C4868Q0828C1638d24655C10957m0146f2564i050j56134A28878
$$ y = [-50425, 49574, 228266, -10238, 36776, 138196, 336916, -75867, -92567, 148856, -187942, 23965, 273944, 146717, 136647, -46450, 33465, -118461, 262828, 100600, 33716, -30596, 294455, 176642, 129940, -82353, 38329, 247920, 363563, 186994, -386898, 329897, 15644, 130968, -26503, 124727, -145447, 259929, 41784, 9605, -113404, -118502, -207392, 104708, -79113, 410370, 188550, 304918, 209101, -264970, 131008, -193808, -347597, 222076, -40921, 99037, -183562, 103983, 88224, -113050, -41569, 4775, -90341, 402644, 148629, 248152, 306022, 309557, 71070, 81835, -66872, 148376, 212729, 146029, 175921, -94566, -231241, 120171, 113656, 333759, 34868, 115696, 31638, -424655, 310957, 270811, -62564, -9050, -165184, 128878]
12477B81053d1604m1719j55560B14871a13609G8396c397E7055d0260B80890a88509
12465B00435B9759e1390B21797C5531a27155m4140G8117a54692A8176N2231a45670
12453A84658a6156D09124a50482e6631P871B8056b13954A54028a02664E3605m745
12442D8860a63075f6792A33741c06556A2208M69485I9699J49829e2296G7152a56891
12430A16210a44277G4356a17335j97846E2907e074I9347A5153a51469C69678a52737
12418a30394F002a40006k29737C73792e0870A27542b7898j31030O5400k3297A67449
12406b77493A29920g600A18126g8730J7834a3387o9996b8616B2236R308K7762
12395E9306J97648f1143B91673d696F1933a89236a244k91861A17554L45124j8157
$$ y = [281053, -41604, -83323, -238883, 214871, -113609, 78396, -3397, 57055, -40260, 280890, -188509, 200435, 29759, -51390, 221797, 35531, -127155, -171295, 78117, -154692, 18176, 70407, -145670, 184658, -16156, 409124, -150482, -56631, -48760, 28056, -213954, 154028, -102664, 53605, 48860, -163075, -66792, 133741, -306556, 12208, 481693, 99699, 249528, -52296, 77152, -156891, 116210, -144277, 74356, -117335, -315181, 52907, -5074, 99347, 15153, -151469, 369678, -152737, -130394, 6002, -140006, -369743, 373792, -50870, 127542, -27898, -158928, -93528, -116825, 167449, -277493, 129920, -7600, 118126, -78730, -60896, -13387, -83383, -28616, 22236, 31544, 59306, 256954, -61143, 291673, -4696, 61933, -189236, -1244, -293105, 117554, 462678, 444521]
12384D44521H863L8117R1300O7875A7495L81348b16528H2912N6883J37724a06837
12372g1187A10580E1384c96353e1636j46761A26086c42882g043D4632J93531b73791
12360h3028A67210b72060D6269a5305B08694c4663Q403F0908a98166c7544B10577
12348B66606l5150Q2231H0663P3761b42011a02842C00459F3833a12725m8033b3206
12336b5837d407H2718p9A3999J53349a53267b1162n9582G2460b51522B2061h65
12323c8395j61461N6832B68100e9612B65762r8409a91267D757L9011c7804B24949
12311D5034K4840f4789b1391A38810L1511f0742H3181a22767A88458K8963h2832
12299c56969C67392a73497A3046J55673O5338b10263A37831a60842B2733L41577
$$ y = [444521, 8863, 46980, 138280, 206155, 17495, 398843, -216528, 82912, 139795, 277519, -106837, -71187, 110580, 51384, -396353, -51636, -198397, 126086, -342882, -7043, 44632, 238163, -273791, -83028, 167210, -272060, 46269, -15305, 208694, -34663, -26260, 60908, -198166, -37544, 210577, 266606, 231456, 313687, 80663, 154424, -242011, -102842, 300459, 63833, -112725, -160758, -23206, -25837, -4407, 82718, 82639, 13999, 167348, -153267, -21162, -80744, 72460, -251522, 22061, -865, -38395, -199856, -143024, 268100, -59612, 265762, 167353, -191267, 4757, 43768, -37804, 224949, 45034, 69874, -64789, -21391, 138810, 170321, -60742, 83181, -122767, 188458, 217421, -82832, -356969, 367392, -173497, 13046, 168719, 234057, -210263, 137831, -160842, 22733, 364310]
12289C64310C9868e5836e209E13238d42371A10897c0819B00832J68784c2121C35327
12277g2807L109A59415a7753B69261H407K85908a5991o7339J8456q6233f5144
12265A89726J09040a68715I1063M9760l1883p511f3227P477A13654J51443B8531
12253H1587k8080d6920C31006F8375K46115q0973r5204e3870B34864j05417c38376
12241B71783l9341k8139a89995i2874B09976H4095Q4490P0850b27756i2482E1858
12229b14947D16807E1804N3580L04203l842m9140k1295A67599J41209k7092M1419
12218C23135A02294f0891D64004B27083J68333j43767q6106F8502K41442J38293
12208D48237A27548B5872L10941f912G1795J23536K59281a42842B65542F6610
$$ y = [364310, 39868, -55836, -5209, 513238, -442371, 110897, -30819, 200832, 369616, -32121, 335327, -72807, -69698, 159415, -17753, 269261, 8407, 294315, -15991, -83330, -64874, -151107, -65144, 189726, 298766, -168715, 91063, 140823, 108940, 101429, -63227, -55750, 113654, 265097, 28531, 81587, 53507, -46920, 331006, 68375, 314490, 233517, 138313, -53870, 234864, 129447, -338376, 271783, 232442, 204303, -189995, -92874, 209976, 84095, 168585, 239435, -227756, -92482, 51858, -214947, 416807, 51804, 105384, 409587, 405745, 356605, 335310, 167599, 308808, 281716, 323135, 102294, -60891, 464004, 227083, 395416, 251649, 165543, 68502, 309944, 448237, 127548, 25872, 336813, -6912, 71795, 195331, 454612, -142842, 265542, 66610]
12197c6880C50189j18144b29618B3357c33F39278k33357O421M3222D3483b5087
12185B38280J69131B4419J69100K21446e3123a0430D8236j1349Q2803C8515M3527
12174H2042J95403K8305d2844E33063E4383d4116B4204b9387j23121O0093j13842
12163b06257D23334j24727q1014E851N81362a31635j6966j65257d9331n23283
12153e72614B75172J58981j34582c08263J36273A87491E2286E397i7473B5154
12142B7305d82369A68046F8415a13639B96987o7292N658o248a97677C77481A08537
12130d2858A1259c2828j1628M918o1950N946A95470n0148K07860a82679A72936
12118b24366E9615J07391K89315B15195O3898l0432k0868r9533J7891m3865j2456
$$ y = [-36880, 350189, 232045, -229618, 23357, -333, 639278, 405921, 412342, 455564, 43483, -25087, 238280, 407411, 24419, 193519, 414965, -53123, -10430, 48236, 36887, 119690, 38515, 82042, 277445, 305750, -42844, 533063, 54383, -44116, 24204, -29387, -152508, -92415, -206257, 423334, 298607, 217593, 5851, 587213, -131635, -148601, -313858, -49331, -572614, 275172, 434153, 299571, -308263, -171990, 187491, 52286, 5397, -97473, 25154, 27305, -482369, 168046, 68415, -113639, 296987, 229695, 235353, 229105, -197677, 377481, 108537, -42858, 11259, -32828, -44456, -39538, -101488, -95542, 195470, 145322, 353182, -182679, 172936, -224366, 59615, 167006, 456321, 215195, 279093, 248661, 227793, 128260, 146151, 102286, 89830]
12107H9830a31351n6619Q3634j680C07940e458j42105F5397a36847F4240i8044
12095A0478a84021n2553G9089P3954c4428B11908B1309O5002b44239Q7110A89282
12083a46800A92128q5618a07037A09752J22556C5433b74392A05661a68148A89009
12072A69511l6174c37395C49460r9694j08272J20088J87603J361765D54561j39900
12062C14661e1930A07674M97396A16943h4415B29673N5486E9485Q056k5882K01531
12051B43190d78390D9668j8137a62913B6i1294K5219c1002j09528j14344J2612
12040b42262M5049a6412G1664a04825B83852g3260p5255J1996D31374A00105b10091
12028A34333a80050J1123A24565b42742E0067K3859K10609b7120B4608d2553A96217
$$ y = [89830, -131351, -187970, -104336, -106016, 307940, -5458, -147563, 65397, -136847, 64240, -98044, 10478, -184021, -236574, 79089, 153043, -34428, 211908, 21309, 86311, -244239, -157129, 189282, -146800, 192128, 106510, -107037, 109752, 232308, 35433, -274392, 105661, -168148, 189009, 169511, 133337, -337395, 349460, 249766, 141494, 261582, 449185, 1810950, 454561, 314661, -51930, 107674, 605070, 116943, -84415, 229673, 285159, 59485, 67541, 41659, 243190, -478390, 49668, 31531, -162913, 26, -91294, -66075, -31002, -140530, -254874, -242262, -197213, -16412, 71664, -104825, 283852, -73260, -148515, -136519, 431374, 100105, -210091, 134333, -180050, -168927, 124565, -242742, 50067, 73926, 284535, -27120, 24608, -42553, 196217]
12016C98868c6822A47739a54118j0563j12048l2291C76360c0833j29403j88819
12006c49055d5959A03098J11231I2976N9063b1126C1589a23234a7651A19738c8352
11994A1526K90310b66769I9815g8445F0802N881b06482j46746A60788a9026r9382
11983a18408N4520J590k7150C36555E1949a07089L097j67167A62683N814a52628
11971C65456f4451n7540D3666O3245i0063l666B26609q8972a66972J9393q2568
11960b30147c7757A55046d4436q9628f4493B88148a8335l02530C55092A71293
11949G3310J9421P6124B9757h5037l3250a2814H5340J35769p9739c82169a81118
11937A66678n1843r931P9029B8198A1b66121B73500j24155C3649a02875j46388
$$ y = [398868, -36822, 147739, -154118, -164681, -276729, -309020, 376360, -30833, -160236, -349055, -45959, 103098, 214329, 92976, 152039, -21126, 31589, -123234, -17651, 119738, -38352, 11526, 301836, -266769, 99815, -78445, 60802, 66683, -206482, -353228, 160788, -19026, -118408, -63888, -62298, -89448, 336555, 51949, -107089, -103992, -271159, 162683, 168497, -152628, 365456, -64451, -121991, 43666, 106911, -90063, -93729, 226609, 137637, -166972, -147579, -230147, -37757, 155046, -44436, -134064, -64493, 288148, -18335, -320865, 355092, 171293, 73310, 92731, 168855, 29757, -85037, -118287, -12814, 85340, 221109, 141370, -382169, -181118, 166678, 114835, 104904, 183933, 28198, 11, -266121, 273500, 149345, 33649, -102875, -249263]
11926b49263K4569R1039l5842A37940a04073k4201A25697K344B0609b8545A68239
11914a26780F4890g5446J4704A99972J17827j50532b77196B99953e99714c8813
11903B85638j28615J85610b8323l4791j82890B5616P3314a36096J6460j28532
11893b48168d1782H2769N8789J8456i7540j03692j2714A50305c09862B5408G194
11881c67741a22478G9576R2389a13828H8509b60671D0940A7464h3050j30058A09399
11869e1712j16797H5819P7409a50177A26430m8868b3652j246k2060j25258l5815
11858b08031A20090N0833E8520c5737k9281N419j9976j6578C72987H7698d26697
11846D19939g3000j28703j11996F1349P3282c20587H2445a73527C2412c73666
$$ y = [-249263, -224694, -133655, -169497, 137940, -104073, -128274, 125697, 128041, 20609, -28545, 168239, -126780, 64890, -75446, -60742, 199972, 317799, 167267, -277196, 299953, -599714, -38813, 285638, 157023, 342633, -28323, -63114, -246004, 25616, 98930, -136096, -119636, -248168, -41782, 82769, 141558, 160014, -97540, -201232, -213946, 150305, -309862, 25408, 7194, -367741, -122478, 79576, 171965, -113828, 88509, -260671, 40940, 17464, -83050, -213108, 109399, -51712, -168509, 85819, 163228, -150177, 126430, 77562, -23652, -24898, -46958, -172216, -208031, 120090, 170923, 58520, -35737, -65018, -59599, -79575, -96153, 372987, 87698, -426697, 419939, -73000, -201703, -313699, 61349, 134631, -320587, 82445, -173527, 32412, -373666]
11835I803a50955j7391e7781k11738A64925e8364D960d9112b3979o4391A15879
11823A57700h9319j8289Q288B08947a69067l2004A47950b8722D9343J26529b19778
11811a63994B49830f4490B05331h2910j34982e1073I1573b47592E9153j0919c60884
11799B09683E804c14496b8466j92768A04166a76174A45h0928n2917A54115a28926
11787I6307b0484A06265Q9656b04427d5726k4441N644G0595a88825A00607f8573
11775b0169D3465J46858F2837k5479h260D0824L1456l4770R0922E1379b65527
11763a74339n3638l4177h5354m1131I385L50035b3560k67816H0073b9106o6257
11752i5363B01331e8346B44072f5639A77575a81029j4617K1154H9984a3638k4954
$$ y = [9803, -150955, -168346, -57781, -269519, 164925, -58364, 4960, -49112, -23979, -88370, 115879, 157700, -89319, -107608, -99320, 208947, -169067, -201071, 147950, -28722, 49343, 175872, -219778, -163994, 249830, -64490, 205331, -82910, -217892, -51073, 91573, -247592, 59153, 48234, -360884, 209683, 5804, -314496, -28466, -221234, 104166, -176174, 145, -80928, -133845, 154115, -128926, 96307, -20484, 106265, 195921, -204427, -45726, -70167, -64523, 70595, -188825, 100607, -68573, -20169, 43465, 190323, 62837, 37358, -8260, 40824, 72280, 37510, 128432, 51379, -265527, -174339, -227977, -262154, -85354, -126485, 9385, 359420, -23560, -291376, 80073, -29106, -95363, 201331, -58346, 244072, -65639, 177575, -181029, -195646, -174492, 89984, -13638, -38592]
11741c8592q9130q1023H3895l1521F400c44917B67758A06061J41567f520j15246
11730a21766A16378I745e0204b0362k42099G7711c7782B07561B2388c7158D4747
11718H7762M5238b98378D0824b26250c9450k9515A71776a25385A08443I341J1034
11707B0375h8922r3902A0229c0964C4460a00932A008K5459L4169J93375D6991
11695a10926A27948m73D7803J31343j4078b51109L6576A04733a66277A17266e897
11683a35769C1475a94665g2178J130A11702c8821B71302f9877D92977b68107A47507
11671h7775C4757a80455H5948a644l87697C12610a11467B52392b95279d096m3727
11660d7823q2512B15765q0548h0979n3212O4229k48271B39276L7668E4286b122
$$ y = [-38592, -127722, -208745, 83895, 52374, 6400, -344917, 267758, 106061, 247628, -6520, -121766, 116378, 9745, -50204, -20362, -262461, 77711, -37782, 207561, 22388, -37158, 44747, 87762, 133000, -298378, 40824, -226250, -39450, -68965, 171776, -125385, 108443, 9341, 20375, -88922, -182824, 10229, -30964, 34460, -100932, 1008, 26467, 60636, 254011, 46991, -110926, 127948, 127475, 47803, 179146, 165068, -251109, -214533, 104733, -166277, 117266, -5897, -135769, 31475, -194665, -72178, -71048, 111702, -38821, 271302, -69877, 492977, -268107, 147507, -87775, 34757, -180455, 85948, -1644, -389341, 312610, -111467, 252392, -295279, -4096, -47823, -130335, 215765, 135217, -80979, -134191, -69962, -318233, 239276, 276944, 54286, -2122]
11648a07422B2849P1199I391a55335M6619d8654C75831d48249a56574j61398c1218
11636C66139B4125M3440J82906C6793h7219A91212J03572j22341a11380c3900
11625D0475d47990c7746k38123b3028D6583o971L35696a14172l26781a40257O9976
11614g0281k58557J04596h370B96263Q4735F5465k5715K68519j8513g450j68500
11603a75950C97193b1150B11091H3590a30661L673j1166A64652i4229c7521B25925
11591F0338a10268d8697l4762A1488K78625d9314j4826A01771a07136A84935J96550
11580C81485p9792B2769O0279L06129F7618b99917B55146N5993r6185c2211B50716
11568a43140A42448a78748B082J2158b08387e571j84522b8612I882J28094P8154
$$ y = [-107422, 22849, 94048, 9391, -155335, -108716, -48654, 375831, -448249, -156574, -317972, -31218, 366139, 24125, 67565, 250471, 36793, -87219, 191212, 294784, 172443, -111380, -33900, 40475, -447990, -37746, -275869, -23028, 46583, 39612, 375308, -114172, -440953, -140257, -70281, -328838, -224242, -8370, 296263, 380998, 65465, 39750, 308269, 289756, -7450, -175950, 397193, -21150, 211091, 83590, -130661, -126988, -138154, 164652, -94229, -37521, 225925, 60338, -110268, -48697, -83459, 11488, 290113, -49314, -64140, 101771, -107136, 184935, 381485, 301693, 22769, 83048, 389177, 67618, -299917, 255146, 311139, 214954, -32211, 250716, -143140, 142448, -178748, 2082, 14240, -208387, -5571, -190093, -28612, 9882, 137976, 216130]
11557B16130q5711b38503a06035r4788A48258R8138a67351p6752B45555a23325
11546A29471a66876A43664l2648a68343A15112a31207C3001b53117A05929J06989
11536B12918l520b30167a09825A45600g2068k09770A66042r360K49239b2569C02539
11524B21560H797e3405B87438J27854i1111F5694L4185M19416B41095A11295M25281
11513E36576A75345b46934B24059J02264j11697a49597A08112b7220j42503I2571
11502B06136g8345A2056N6215j3732e6888k54060B24786E314Q6443a77016B4289
11490B13762c83B31573J33625c9485j33767B20064J28248f6072D43445a13782
11479B15643E1070K72198a22569B42553A7965L26082d91A16675k6701E787K93083
$$ y = [216130, 130419, -238503, -106035, -200823, 148258, 246396, -167351, -244103, 245555, -123325, 129471, -166876, 143664, 111016, -168343, 115112, -131207, 33001, -253117, 105929, 212918, 209398, -230167, -109825, 145600, -72068, -281838, 166042, 156682, 405921, -22569, 302539, 221560, 8797, -53405, 287438, 415292, -91111, 65694, 99879, 519295, 241095, 111295, 536576, 175345, -246934, 224059, 326323, 214626, -149597, 108112, -27220, -169723, 92571, 206136, -78345, 12056, 68271, 54539, -56888, -310948, 224786, 5314, 91757, -177016, 24289, 213762, -383, 231573, 365198, -39485, -173252, 220064, 348312, -66072, 443445, -113782, 215643, 51070, 323268, -122569, 242553, 17965, 344047, -491, 116675, 89974, 5787, 298870]
11468B98870D5598L97182k13972r7024Q0375J37321M4817j72425G8545K11894
11458B90439A9026a34434B29697P6745j04665I6848a26517B7503R3425J33039
11448B53967g5906C1973e0980l03990B6546J26532L7952d8650A2574J71842a11201
11436B33452a01202A97195J03396H1277b5809A82754i5979j9646D3471a30005
11425A75615M5014A9260e5461E5342b07522G4602c29319h74A90794J9870A04218
11413g4660C04182a12167B9058d3374j61874H9978a12314j36246j07384A33402
11402a00755k4221J9509C6541g3283A419L33604d9613A61410f7666j13758j85304
11391c66728A75419a37893A32961k1759d70538A00892a75182B46110j04947R0345
$$ y = [298870, 45598, 442780, 228808, 131784, 212159, 349480, 394297, 221872, 78545, 290439, 19026, -134434, 229697, 306442, 201777, 96848, -126517, 27503, 120928, 253967, -75906, 31973, -50980, -354970, 26546, 153078, 191030, -48650, 12574, 184416, -111201, 233452, -101202, 197195, 300591, 81277, -25809, 182754, -95979, -115625, 43471, -130005, 175615, 220629, 19260, -55461, 55342, -207522, 74602, -329319, -874, 190794, 210664, 104218, -74660, 304182, -112167, 29058, -43374, -205248, 89978, -112314, -248560, -355944, 133402, -100755, -124976, -105467, 36541, -73283, 1419, 335023, -49613, 161410, -67666, -181424, -366728, 175419, -137893, 132961, 111202, -470538, 100892, -175182, 246110, 141163, 231508]
11381B31508a37056C68223j27839c5640A18251c9851j29825B96875m7693m0870
11371B08312K77286A23857m5519a41509A13538B4880J29353a24774K2648F2505
11360E0562Q5066a56254J9081I5916d66250a83236k5014h6010B66234K7195b09612
11348a56120I7142c45021a01153F9001R2341R2195l7563C0869O4882e9054j50204
11337b09258g5934j26441A08283d04523J53641J10720A43119F1942K90902b02478
11326e3419k27830e9444k888J8394A06858C1764f2039q0626A1449d4660p6639
11315a21299k0585j00419d7297B9160R4294b35128N1780A11314b78086f990B25540
11303E1467M3102N3110C496J65148m6810B9819a30069C07330B1804c52621A67293
$$ y = [231508, -137056, 368223, 240384, -35640, 118251, -39851, -169676, 296875, 249182, 208312, 485598, 123857, 78338, -141509, 113538, 24880, 154233, -124774, -102126, 62505, 50562, 135628, -156254, -137173, 95916, -466250, -183236, -208250, -86010, 266234, 293429, -209612, -156120, 97142, -345021, -101153, 69001, 161342, 253537, 215974, 30869, 95751, -59054, -209258, -75934, -202375, 108283, -404523, -250882, -140162, 143119, 61942, 352844, -202478, -53419, -281249, -59444, -62332, -43938, 106858, 31764, -62039, -142665, 11449, -44660, -121299, -141884, -242303, -47297, 29160, 123454, -235128, -183348, 111314, -278086, -6990, 225540, 51467, 94569, 147679, 3496, 168644, 121834, 29819, -130069, 307330, 21804, -352621, 167293]
11291G703b78759A27704b24798C15662b54863A76766b41759d3378k5705E0962
11280c73689C32167h4315j4401l16617a16289j54286F0650a97066F0198a09570
11269a51446F8159J03216B7038J82415c776p8506C83245g9434k23487a32102C8127
11257A59818c0579j0254a4834F55i8720d2818j09030N4580D1791N1306c12120
11245e130A0180h8365c0483E1661J18057J5834a71136j67388J67209f0302K0171
11234d0131A83428B9835M1333a94891B53683d140A09356D1324a49332k3133h5169
11222a26904k4037h487k44751B08523e3190A3391f493A75006G4494B2848c03091
11210b32225d9425l790C6461a97947l08548a64133C01873I5139K39190a05434
$$ y = [7703, -278759, 127704, -224798, 315662, -254863, 176766, -241759, -43378, -69083, 50962, -373689, 332167, -84315, -98716, -415333, -116289, -270575, 60650, -197066, 60198, -109570, -151446, 68159, 171375, 27038, 209453, -3776, -82282, 383245, -79434, -302921, -132102, 38127, 159818, -30579, -40833, -14834, 655, -98720, -42818, -151848, -97268, 41791, 93097, -312120, -5130, 10180, -88365, -30483, 51661, 169718, 185552, -171136, -338524, -171315, -60302, -40131, 183428, 29835, 71168, -194891, 253683, -4140, 109356, 41324, -149332, -172465, -85169, -126904, -150941, -8487, -253238, 208523, -53190, 13391, -6493, 175006, 74494, 22848, -303091, -232225, -49425, -53215, 36461, -197947, -506495, -164133, 301873, 95139, 334329, -105434]
11199i1733l5314j86750R0343A25469a64326F2517d907j82157F7571R3870n7537
11188A03904d62526h1648D8156b6818C62813h5054B15922a29882d7852k10120
11178b57972I8387a71831n7069k2302A26266a69068J0966k7217R1540b855A45983
11166G7334A0617K00612l4512A9932c6025B3765J61932C9957d2353A8852c40472
11154g8194b9001E2839L14584d10853e6055a5976A30279m1261a86191A24790F1105
11142c9184B71133a49251l1440b6188G0095O493N4818d2437I4022d95707A98262
11130A53663o7350A2018h414E3720a16771J3551d6362A26018a74695B0691Q0829
11119A01520K13364m5864m7775o7549D607N8056K04003A27713J30396a1736A71770
$$ y = [-91733, -127047, -313797, -223454, 125469, -164326, 62517, -4907, -187064, 67571, 161441, 103904, -462526, -81648, 48156, -26818, 362813, -85054, 215922, -129882, -47852, -257972, 98387, -171831, -228900, -251202, 126266, -169068, -158102, -185319, -93779, -2855, 145983, 77334, 10617, 211229, 176717, 19932, -36025, 23765, 185697, 39957, -42353, 18852, -340472, -78194, -29001, 52839, 367423, -410853, -56055, -15976, 130279, 89018, -186191, 124790, 61105, -39184, 271133, -149251, -180691, -26188, 70095, 76588, 131406, -42437, 94022, -495707, 198262, 153663, 86313, 12018, -8414, 53720, -116771, -103220, -46362, 126018, -174695, 20691, 101520, 314884, 269020, 221245, 153696, 4607, 62663, 266666, 127713, 258109, -11736, 171770]
11107H676M29939j98875A8227L69156a56677F50389k28151G1973c9241J7913C80018
11095A24154K14295A55537C4052J49997j5665J60780H7826K09326A14713R8308
11085B13021J19302J4010k7467A01170J21222K31518o142a73679B69768J0269
11075B80037H3176K31288K10240A10862a18386A73074j4762b36608f196D27497
11064B70683J32304K1395j39519J19054J1677m9081K90387K61857k78313B83187
11053E64473j96872J65533j64389L97373J37162l76988j59426J17892j74785L95724
11043G05697o0829P8859j82830j19615L28562N3445k00761M46165l24428l18139
11033D06126M14843j85278j18592J88640R0685k48508r519K24087o7868j30321
$$ y = [8676, 438615, 239740, 18227, 387383, -156677, 650389, 422238, 71973, -39241, -21328, 380018, 124154, 338449, 155537, 34052, 184049, 168384, 329164, 87826, 297152, 114713, 213021, 332323, 346333, 318866, 101170, 222392, 453910, 447768, -173679, 269768, 280037, 83176, 314464, 524704, 110862, -118386, 173074, 158312, -236608, -6196, 427497, 270683, 402987, 424382, 284863, 403917, 415594, 366513, 656900, 918757, 640444, 283187, 564473, 367601, 533134, 368745, 766118, 903280, 526292, 366866, 484758, 309973, 705697, 644868, 723727, 540897, 421282, 749844, 803289, 602528, 1048693, 724265, 406126, 820969, 635691, 517099, 705739, 796424, 547916, 538397, 762484, 694616, 564295]
11023E64295K62565l6106J83685k17934C05789K18389M58831m28193j59996K42546
11013F37366k35845K49533K76715k39904j64480j60034J74878m4772N0438r058
11003E34837J30941R9867k45585M99460l27169Q0353o6304j53521M511Q3440J16021
10992G56851q5815o8935K6139J62856m6967R8022o9449M72778n7630j60591m5264
10981I81995N9455J39880Q5187j155M16402l9721N90106J33013k88747L79992
10971B456407N64862l18274l02843K8897j32324m97452J56646j07391k13904m03882
10961A230742J75695l90889K44178J66739m8021J96376k89116J6835j30823n09079
10951F62637K53570j73931k74028j39643J09396r740A85614k3729M39952b6644
$$ y = [564295, 826860, 790754, 974439, 756505, 305789, 524178, 983009, 554816, 394820, 637366, 401521, 651054, 927769, 687865, 523385, 363351, 538229, 493457, 543895, 534837, 665778, 765645, 520060, 1019520, 692351, 772704, 706400, 552879, 557390, 640830, 756851, 671036, 602101, 628240, 791096, 744129, 842151, 772702, 1245480, 1187850, 1027259, 981995, 1041450, 1181330, 1266517, 1265362, 1681764, 1642043, 2232149, 2365162, 2076415, 2456407, 3021269, 2702995, 2400152, 2429049, 2296725, 1799273, 1955919, 1848528, 1634624, 1230742, 1406437, 1015548, 1259726, 1426465, 1378444, 1574820, 1285704, 1302539, 1171716, 662637, 916207, 742276, 468248, 328605, 438001, 428261, 185614, 161885, 601837, -26644]
10940B69080c02275B06291B3504K35308j14833a67308A03749E21b01533d1840
10929B32293d3824D743J2902f7577o4107B9650d1166l47958A17737a72744A55772
10917D25109A74714b0550H2110b94100O9300l563B77370j38547l4003P246b50259
10905d9567B3759a9862j31736C07085a48228f5423B59165a08324n0919L3739j02833
10894b28337b6668p4646j0120o5862L617A54474p5294e1382j11673N3183Q420
10883a01452F103L77789b06935A07197a20801G7130b00616B67796n7730J3201
10873B23267r2048d9846n4830j17592A7922b39487B14617d09609A8524J63656
10863A82180K5538c912A29114a12200c2264F6404d8604a9402A40703b02451E1921
$$ y = [269080, -302275, 206291, 23504, 258812, 143979, -167308, 103749, 521, -201533, -41840, 232293, -43824, 4743, 17645, -67577, -131684, 29650, -41166, -389124, 117737, -172744, 155772, 425109, 174714, -20550, 82110, -294100, -224800, -228363, 277370, 138823, 104820, 112066, -250259, -49567, 23759, -19862, -151598, 307085, -148228, -65423, 259165, -108324, -159243, -125504, -228337, -26668, -101314, -111434, -177296, -173679, 154474, 79180, -51382, -163055, -109872, -101452, 6103, 383892, -206935, 107197, -120801, 77130, -200616, 267796, 210066, 223267, 131219, -49846, -104676, -222268, 17922, -239487, 214617, -409609, 18524, 182180, 207718, -3912, 129114, -112200, -32264, 66404, -48604, -19402, 140703, -202451, 51921]
10851B12851h3964F9986e6854B48082a30790D369J5634a18828F3170g2398A07880
10839a54395b8456j62826q8558I2580O3424i9174h999l9294j40204g2614D505
10827A28876a07676M6915F5604c09365J44007A35972E1493h7464j87680p800A26070
10815G1262d735j11471c9179B80464a01979b065C5415a03916e915C5620b49884
10803b23111f11E1656g7259J0587I5246a92365g1000D4657i1571q0286A05769
10791e9543k32905A75851F5844b76377C8573b36632r7357E2711c38598J05691
10781b32907B32740c6719B30475n8681J9647b9852j46544L5726k18197D0388a23966
10769h550o5650J7624k06773A31727c2161k68479G0271Q2678d6465q1778e3910
$$ y = [212851, -83964, 69986, -56854, 248082, -130790, 4369, 20003, -118828, 63170, -72398, 107880, -154395, -28456, -191282, -279840, 92580, 156004, -99174, -8999, -48293, -188497, -72614, 4505, 128876, -107676, -60761, 65604, -309365, -165358, 135972, 51493, -87464, -275144, -282944, 126070, 71262, -4735, -116206, -39179, 280464, -101979, -2065, 35415, -103916, -5915, 35620, -249884, -223111, -611, 51656, -77259, -66672, 95246, -192365, -71000, 44657, -91571, -171857, 105769, -59543, -292448, 175851, 65844, -276377, 38573, -236632, -333989, 52711, -338598, -232907, 232740, -36719, 230475, 171794, 191441, -29852, -176396, -140670, -358867, 40388, -123966, -8550, -74200, -56576, -263349, 131727, -32161, -300640, 70271, 152949, -46465, -128243, -53910]
10757g0638Q936p4179o4021c6149B58792p7336a04883R831C492f9677A18704b44839
10744B41327c38500J45693J0658K7406r2595d8497j40930A13016e16482b14919
10733g2030p2026M7372A26188a86150O7985K4972L1717l6036C28032c21273a11501
10721b82664f6172A93383j19B1179a69100n8944g7598j46734B5804K0777K18313
10710B64894b56315j25046H7422a98677f6513p1743c8640C432O8181L98314E318
10698b09323A09020b30920d4014E4440J30412a43026k5749h721q3837M0338n4795
10687a07015k44652f85j14218j62001a24605Q142r3591c8296k88879b8172o4722
10676i2894e707A95724d9641j80338G0014h8187b2109j2504k2666n1660c6703
$$ y = [-70638, -61702, -135881, -199902, -36149, 258792, 181456, -104883, -95052, 3492, -69677, 118704, -244839, 241327, -338500, -192807, -182149, -154743, -247338, -48497, -189427, 113016, -516482, -214919, -72030, -144056, -96684, 126188, -186150, -118165, -93193, -61476, -97512, 328032, -321273, -111501, -282664, -66172, 193383, 193264, 21179, -169100, -228044, -77598, -224332, 25804, 46581, 264894, -256315, -381361, 87422, -198677, -66513, -138256, -38640, 3432, 71613, 469927, 5318, -209323, 109020, -230920, -44014, 54440, 184852, -143026, -168775, -8721, -92558, -52220, -107015, -351667, -685, -114903, -276904, -124605, -116463, -210054, -38296, -327175, -28172, -92894, -5707, 195724, -49641, -229979, 70014, -88187, -22109, -34613, -57279, -108939, -36703]
10664a90337j3272A32685a37580j7094k5187E0746J6243a636A10023j2802G424
10652b43111E0616c80500a17010m0131i45B12429C7360K56288A15526c20837a48751
10640f6287D5090K80409a54785A26413e0358A27195b1649j25533a0887r0874j2761
10629a14522B8238a77042d8375k4422r7290n7272d3541o9588d5553Q440j80088
10618b17201O5246A59260i691B648b51051d2304G0115k7881b24745A09255a12066
10606a52911A49087C7386K8882N9519a17965l53821f386k05056J1907h9546H2576
10594A36352k6875J30816b06788A96101b13114k532A55629b6147l34320M5441
10584c15026E2646b19239i1268C88401G7225b1208k52552J04214h2343D9148b2754
$$ y = [-190337, -203609, 132685, -137580, -154674, -179861, 50746, 66989, -1636, 110023, 97221, 7424, -243111, 50616, -380500, -117010, -157141, -945, 212429, 37360, 293648, 115526, -320837, -148751, -66287, 45090, 325499, -154785, 126413, -50358, 127195, -21649, -147182, -10887, -101761, -114522, 28238, -177042, -48375, -72797, -170087, -227359, -43541, -113129, -45553, -37113, -217201, -151955, 159260, -9691, 2648, -251051, -42304, 70115, 42234, -224745, 109255, -112066, -152911, 149087, 37386, 66268, 125787, -117965, -471786, -6386, -211442, -199535, -89546, 82576, 136352, 109477, 240293, -206788, 196101, -213114, -215646, 155629, -26147, -360467, -315026, 52646, -219239, -91268, 388401, 77225, -21208, -273760, -169546, -82343, 49148, -22754]
10572G1565e069r5398L5273A62489B5410h9748N10A32133N4378i9841P029k08
10560i3020I8685J52888a07604l2731l48330A52912N9526F8320J09865G8999C1971
10548C3859J26923H044K35252p6385c06080f9329j91075B81558H9520i8330F8621
10536a6878A66668l9048i4077A85718b69054j76464i9535I6147N4324D7649L9706
10525H7355d7400j28722g1432j9534A55226J7906b16814R8981o5671O9907C438
10513C0994a17359I054d8281l05835D1740c6132j75762h9709l3854i616j21568
10502a31184E7221h7596j99850C02890A47694b440k32717J03181L1715C699d86297
10490g8918c7756j74596f0600B37895j05158b53397A19570c2974m4978r1642C5029
$$ y = [71565, -5069, -100467, -65194, 162489, 25410, -89748, -89238, 132133, 186511, -99841, -92812, -93020, 98685, 251573, -107604, -140335, -488665, 152912, 212438, 68320, 178185, 78999, 31971, 33859, 160782, 8044, 243296, 166911, -306080, -69329, -260404, 281558, 89520, -98330, 68621, -16878, 166668, 127620, -94077, 185718, -269054, -445518, -99535, 96147, 150471, 47649, 87355, -47400, -176122, -71432, -90966, 155226, 173132, -216814, -117833, -183504, -113597, 3438, 30994, -117359, 9054, -48281, -354116, 41740, -36132, -211894, -89709, -123563, -9616, -131184, 57221, -87596, -287446, 302890, 147694, -2440, -235157, -131976, -100261, 3699, -486297, -78918, -37756, -212352, -60600, 237895, 132737, -253397, 119570, -32974, -77952, -169594, 35029]
10478C01575A40060J64912q2164l6130g8125A35673a49348B7879L05953b36227
10467a10198N2679q2120A40019c28375n7689J51697j52429P1246J20028A13289
10456E2360M4252f7190i652A69447a26904J7219L125n8050b5597H2969j1562O830
10444G8237C5513b18634A34158D0207K5895b42861B05773A5470J10329a24026
10433D0470K307a1170A94498b25671B888a11285A62985e0802B92306b92325e9927
10421a05601G9319d23893F3659B4086b86773g3524a7432A06984h7400B5427c5007
10409c199A8663b65557A59559a67768A8362K2509a43011C11757b29852G0633g7693
10397D55312a4558n229m14997A57025m5932N4993d8045A03066b6617A25853J85718
$$ y = [301575, 140060, 304972, 222808, 186678, -78125, 135673, -149348, 27879, 333832, -236227, -110198, -57519, -139639, 140019, -328375, -386064, -234367, -386796, -315550, -195522, 113289, 52360, 96612, -67190, -9652, 169447, -126904, -109685, -106560, -164610, -25597, 82969, 71407, 78237, 35513, -218634, 134158, 40207, 66102, -242861, 205773, 15470, 125799, -124026, 40470, 42777, -11170, 194498, -225671, 2888, -111285, 162985, -50802, 292306, -292325, -59927, -105601, 79319, -423893, 63659, 24086, -286773, -73524, -17432, 106984, -87400, 25427, -35007, -3199, 18663, -265557, 159559, -167768, 18362, 40871, -143011, 311757, -229852, 70633, -77693, 455312, -14558, -19787, -434784, 157025, 111093, 166086, -48045, 103066, -26617, 125853, 311571]
10386C11571g7645A43164L5582j0538c3805A43415b1801C58838H4477L3779J39213
10375B57469P2668H8997K20868C6370K52741j29524K40644A63733J50006J39157
10365D52896K42635k57976j61749j2947a08999E50836c4066D06569j99925j4259
10355A92385n3162M07097q6805o3340K17268k05235J06165L9954q1890A49988
10344A00652K47107j41698K62449f0753F9830B6857K63341J05624c60840A68031
10333G6329a60605b2431k73035B29870J64264a14265B24334a11370H7676K6805
10323A14481n489K31199E7365A7794J31976p0267h333o2527L3516A79917H8012
10311D2253a0540H3312M8M1540b98281B92223H6766J26427a53084j28380Q3308
$$ y = [311571, -77645, 143164, 178746, 168208, -33805, 143415, -21801, 358838, 84477, 118256, 257469, 330137, 88997, 309865, 36370, 289111, 159587, 400231, 163733, 313739, 452896, 695531, 437555, 275806, 262859, -108999, 550836, -34066, 406569, 206644, 192385, 139223, 546320, 459515, 396175, 613443, 408208, 514373, 554327, 472437, 149988, 100652, 347759, 206061, 468510, -60753, 69830, 26857, 290198, 395822, -360840, 168031, 76329, -160605, -22431, -295466, 229870, 394134, -114265, 224334, -111370, 87676, 114481, 108992, 340191, 57365, 17794, 149770, 79503, -8333, -70860, -37344, 179917, 88012, 42253, -10540, 83312, 83360, 124900, -298281, 292223, 86766, 213193, -153084, -281464, -198156]
10300a98156B4611J31979K56939d8115b355A43772a42684r6147F6714L41128I9300
10288B85210a71438A91036c05277a05364E6909A7007J7350b04442d2698C75615
10277C575b39280A06993c14434a15855D5698b82122A03878a74493A32216f2999
10266b28929J13253L8270j53642C78316j56251H88K59215j23839K0060K38534
10256C94858f8495a2871C44727p1931R9229A85247a06853M8779B11001d4688G0858
10244a98298m7259d3311A09533b79986G0058a30914D0459a90589F0695a76814
10233H8b29608N3334a2610k06934B57689m0751b78954J35392b8277J3024A65973
10221b66013L3314I7645f3763j58359a00870p8104B42238E3152Q3526b15895A78706
$$ y = [-198156, 24611, 156590, 413529, -48115, -2355, 143772, -142684, -238831, 66714, 407842, 99300, 285210, -171438, 191036, -305277, -105364, 56909, 17007, 34357, -204442, -42698, 375615, 3575, -239280, 106993, -314434, -115855, 45698, -282122, 103878, -174493, 132216, -62999, -228929, -115676, -77406, -231048, 378316, 222065, 888, 260103, 136264, 156324, 394858, -68495, -12871, 344727, 272796, 372025, 185247, -106853, -58074, 211001, -44688, 70858, -198298, -245557, -43311, 109533, -279986, 70058, -130914, 40459, -190589, 60695, -176814, 88, -229608, -176274, -12610, -219544, 257689, 216938, -278954, -143562, -28277, -15253, 165973, -266013, -232699, 97645, -63763, -222122, -100870, -178974, 242238, 53152, 136678, -215895, 178706]
10209B57979c3678f692j12329A69813a1533C8837b46883D264f3188B43646c8239
10197B58544b6487G1334a58195n79K1254o6364C27800D4838K2952b98798H2082
10185a74661M7460j06109f4224A55607O2699o065b57944O6584C49142a30667N5233
10174g5434f926D73831d45624A16710p42Q4622b49404O9545h3795k1225k68575
10163c73595h5299G5130a67437r5412f3327A68397R6644j30601b3099k04777A24342
10151B27700n4028a43759H9550f4487c1273q6249B74179a56724O8780L7931j53424
10140b03437I4276f7855l13173R5478f4264k52486b3445j08240L7438k94922B21714
10128I8352a29087k3220A86389a92704P914D3549b09900B4414c16261j2083c7192
$$ y = [257979, -33678, -6692, -119021, 169813, -11533, 38837, -246883, 4264, -63188, 243646, -38239, 258544, -26487, 71334, -158195, -158774, -137520, -203884, 327800, 44838, 67790, -298798, 82082, -174661, -127201, -233310, -64224, 155607, 218306, 212241, -257944, -191360, 349142, -130667, -75434, -6926, 473831, -445624, 116710, 115968, 200590, -249404, -179859, -83795, -105020, -373595, -85299, 75130, -167437, -262849, -63327, 168397, 265041, 134440, -23099, -227876, 124342, 227700, 173672, -143759, 89550, -64487, -31273, -117522, 274179, -156724, -87944, -50013, -203437, 94276, -67855, -381028, -285550, -64264, -316750, -23445, -131685, -94247, -389169, 221714, 98352, -129087, -152307, 186389, -192704, -184790, 43549, -209900, 24414, -316261, -328344, -37192]
10116f6710C14356a28559e1520k61606A7193o478K9597a92408B6475J1721a14412
10104a9948C2217b57134J26802M2048C7880h2150B90211h3480m7082k14918h635
10092A59612D3975b1105B32723b8148l80033a42165b443k587j12978j84542P1060
10081b31490a9726G4094b88435c4436H8064A2044b89976m5670n4682g9077D6554
10069b48168b965B29554b5257l2217G6397L7137h5016D2591J60797B7614h562
10057c24696d7534B23245c97501A98036a62342L1591B2955a84835j33397F0625
10046G1820d9635A57308A6101h3371H48a49682I3571b24756A37001c21919C9835
10034a34061L7922D829P8852b61555P9988G6490c47788F7263c4308B1873o727
$$ y = [-66710, 314356, -128559, -51520, -313126, 17193, 10715, 40312, -192408, 26475, 38196, -114412, -19948, 32217, -257134, -130332, -88284, 37880, -82150, 290211, -83480, -130562, -345480, -8635, 159612, 43975, -21105, 232723, -28148, -408181, -142165, -2443, -5030, -118008, -302550, -231490, -19726, 74094, -288435, -34436, 88064, 12044, -289976, -335646, -390328, -79077, 46554, -248168, -2965, 229554, -25257, -57474, 76397, 113534, -85016, 42591, 203388, 27614, -8562, -324696, -47534, 223245, -397501, 198036, -162342, -130751, 22955, -184835, -318232, 60625, 71820, -49635, 157308, 16101, -83371, 848, -149682, 93571, -224756, 137001, -321919, 39835, -134061, -96139, 4829, 83681, -261555, -181567, 76490, -347788, 67263, -34308, 21873, 15146]
10023A5146c0766j80113k9796j56327B48554a46547G0059C0968O3341B0640J14266
10012A34906e4413k18558C16129c70554d8637k68244R8218k5408B6102O8556a82586
10000E9173d4050A16219a82322P0045c8852C6273b11917B7396l441h4650B88377
9988d15416a78011A11734a48305B36278k8971a18233A23731a70667N4309k98425
9978d14783H3517a00199A19745c80871e9914C467L29631a3219k63329c5512N185
9967c0327F4800a25409o6052R1341l12324C07635H6892E236a94785M4232G8572
9955c65643a43564H2650L0000A9704c86751B6623b38825d0836B0757h4152K4051
9944f0101l06705A4541e2767k2321j00109a8105D192b87739g615j52437j57269
$$ y = [15146, -30766, -210879, -240675, -397002, 248554, -146547, 70059, 30968, 94309, 20640, 134906, -54413, -272971, 316129, -370554, -48637, -316881, -218663, -244071, 26102, 94658, -182586, 59173, -44050, 116219, -182322, -112277, -38852, 36273, -211917, 27396, 23955, -84650, 288377, -415416, -178011, 111734, -148305, 236278, 207307, -118233, 123731, -170667, -116358, -414783, 83517, -100199, 119745, -380871, -59914, 3467, 333098, -13219, -276548, -35512, -30327, 64800, -125409, -191461, -100120, -412444, 307635, 86892, 5236, -194785, -150553, 78572, -365643, -143564, 82650, 112650, 19704, -386751, 26623, -238825, -40836, 20757, -84152, -60101, -366806, 14541, -52767, -75088, -175197, -18105, 4192, -287739, -7615, -160052, -317321]
9933c17321B82120a86458G8256b31431C5653B568a99512K2053A242a31359e5619
9921a9023j11125A87891D5345a40521L3944m5509a3914k45365j36606h8546r5186
9910a83732k1461A78957P3215d0587G8144J3602b570B4457b27013R3308j67796
9899c01501J31025g2353B514L74901g1251A34772f0571A98300b45096m14639A0003
9887h9442H2924c3529A23350a68167j7560j33344E4774a19972c0250m08950h8703
9875c1106B7677b06089e3395G798h2729C2266g5097A4480L7964B686Q075c7422
9862d6275k07494j20638e5480j44443A2153a38129B6089d39041B55726A7007K55387
9851B72394b11699B9931i4751A54939c47681e6447m5798M8123l41460a97617G2084
$$ y = [-317321, 282120, -186458, 78256, -231431, 35653, 2568, -199512, -177459, 1242, -131359, -55619, -19023, -130148, 187891, 45345, -140521, -106577, -152086, -13914, -259279, -395885, -88546, -183732, -205193, 178957, 252172, -40587, 78144, 91746, -2570, 24457, -227013, -133705, -301501, -170476, -72353, 2514, 377415, -71251, 134772, -60571, 198300, -245096, -659735, 10003, -89442, 82924, -33529, 123350, -168167, -185727, -319071, 54774, -119972, -30250, -439200, -88703, -31106, 27677, -206089, -53395, 7798, -82729, 32266, -75097, 14480, 52444, 2686, 10761, -37422, -46275, -253769, -374407, -55480, -199923, 12153, -138129, 26089, -439041, 255726, 17007, 272394, -211699, 29931, -94751, 154939, -347681, -56447, -102245, -54122, -395582, -197617, 72084]
9839a30443K6440A41999K0882F4619a46067I0457a68549a8085l03747e3228j61737
9828b14965a03224K7834A93684b61613A34703i9403A2861a17934C98423b05908
9817A64834F7906a31746l71146J39325i537l4072j90977B68949E1819J02408E5608
9805B8959J94061F5106b1622j99948l2816A47063a22599e6281J002p2146A47840
9793i5352m538j43953B26975a97255j7178d8215p3957D3356a45300B27022d10382
9781g3585q8693P2646F6928J14480b60095a24196A9516c65604I1000b08110O9532
9770a38578L1778A8287g992j87172B40367o4115o9898a89088n615i4244j52254
9759b46498H9084c59131N0021B00720g448G4154I609a09390A22649C5420b24122
$$ y = [-130443, -104003, 141999, 162881, 64619, -146067, 90457, -168549, -18085, -321832, -53228, -214965, -103224, -75390, 193684, -261613, 134703, -99403, 12861, -117934, 398423, -205908, 164834, 67906, -131746, -502892, -363567, -9537, -43609, -234586, 268949, 51819, 154227, 55608, 28959, 223020, 65106, -21622, -221570, -254386, 147063, -122599, -56281, -55279, -127425, 147840, -95352, -99890, -243843, 226975, -197255, -214433, -48215, -122172, 43356, -145300, 227022, -410382, -73585, -162278, -89632, 66928, 181408, -260095, -124196, 19516, -365604, 91000, -208110, -138578, -106800, 18287, -7992, -195164, 240367, 176252, 106354, -189088, -194703, -94244, -246498, 89084, -359131, -309110, 200720, -7448, 74154, 9609, -109390, 122649, 35420, -224122]
9747C6372a51833I3655B7106b34814A68130a50610j47233R0071A10414i1305E6414
9735A87836b56712h3205E0365i4137j74041c8862j39614F1066k0666a54030A13685
9723a55911A43190J17107F4338b31599B63463j03488D8535i0167k49147d2013
9712a07369d7770B00281i7982Q607j92151d7900j46895A13717b97650b5781B77540
9700a48212E8853c66499a25439A7115J21981b41682A05404m9868b886A29230b41276
9688A40332D3739a59968l8491h2904j39304d0580p1580R737K5846B11322p7501
9677A33821b44048A16547b71377A14298b95662a917H6480a22007j09018c0308
9666E4366g622A1974b84256l0352D898a9391H3117l2150L20157g2745A04699b31845
$$ y = [36372, -151833, 93655, 27106, -234814, 168130, -150610, -297843, -207772, 110414, -91305, 56414, 187836, -256712, -83205, 50365, -94137, -268178, -38862, -178476, 61066, 40400, -154030, 113685, -155911, 143190, 260297, 64338, -231599, 263463, 159975, 48535, -90167, -339314, -42013, -107369, -47770, 200281, -97982, -89375, -281526, -47900, -194795, 113717, -297650, -25781, 277540, -148212, 58853, -366499, -125439, 17115, 139096, -241682, 105404, 55536, -2886, 129230, -241276, 140332, 43739, -159968, -198459, -82904, -222208, -40580, -112160, -102423, -76577, 211322, 133821, -244048, 116547, -271377, 114298, -295662, -1917, 86480, -122007, -231025, -30308, 54366, -7622, 11974, -284256, -314608, 4898, -19391, 83117, 50967, 371124, -72745, 104699, -231845]
9653A4310c9811j19045D6520b0109A00003d93433h5071j60125A39602m2956b25389
9641A53697b70167M8518B4725M5709d02326B43827b51324A16023b29602e0262
9630b16865B35903h9371F9001J32899g7142k5975n55425B71455C4915c61053D6316
9618c0263D5427Q9984b21910J3084L9836C29300b00471A71048l4070a06739A20098
9606A41159a40897j08031f8255C46271j43155c60849O6023b692B8495b54782h2058
9594A11471b08280A42010E0127J02232c9604A75930g4454j84635j13710d6639
9583A05292l4495J00102a28655D3459a42129f6437A11722a95267n0549F4062M2287
9572A06349a40217j46786a33128A82071a20077A71852F5099a73410P2607M483
$$ y = [14310, -39811, -158856, 46520, -20109, 100003, -493433, -85071, -245196, 139602, 96646, -225389, 153697, -270167, -221649, 24725, 70434, -402326, 243827, -251324, 116023, -229602, -50262, -216865, 235903, -89371, 69001, 201900, -77142, -103117, -658542, 271455, 34915, -361053, 46316, -30263, 45427, 135411, -221910, -208826, -168990, 329300, -200471, 171048, 136978, -106739, 120098, 141159, -140897, -248928, -68255, 346271, 203116, -360849, -294826, -2692, 28495, -254782, -82058, 111471, -208280, 142010, 50127, 152359, -39604, 175930, -74454, -259089, -372799, -46639, 105292, 70797, 170899, -128655, 43459, -142129, -66437, 111722, -195267, -245816, 64062, 106349, -140217, -287003, -133128, 182071, -120077, 171852, 65099, -173410, -100803, -96320]
9562i6320A31852L0746a78424J2076N4480A97124a51068j34681r0914a23961l9177
9551a63138A8154O1537h3206j45522B36604n6274b80787L1421A53817E2176A3015
9539b14829B63322a80276n8569A15572J00766a98774A09043E0600l970a41728
9528a35974M360K4688k30877M1846J14979N2214k1123d1603B85338B237i0566
9516c88938M5091d9834k0027l08087m5510b2932A98470h8446d4220C7101j3004
9505B4097a65663c0561H0002d6676j00502B0985b29039l5024P6169q2482j611
9494b71987B51059L8178A0192h0644b4976k8154B39001C5206b71737h5555l5598
9483a21153k5526G6030N2914b40592A12354i2146A00319a24489A76422R6568b24737
$$ y = [-96320, 131852, 162598, -178424, -166348, -111868, 197124, -151068, -285749, -376663, -123961, -163138, 18154, 79691, -83206, -228728, 236604, 180330, -280787, -249366, 153817, 52176, 13015, -214829, 263322, -180276, -238845, 115572, 216338, -198774, 109043, 50600, 46630, -141728, -135974, -131614, -106926, -337803, -295957, -180978, -128764, -149887, -41603, 285338, 2237, -90566, -388938, -343847, -49834, -69861, -377948, -423458, -22932, 198470, -88446, -44220, 37101, 24097, -165663, -30561, 80002, -46676, -147178, 20985, -229039, -264063, -187894, -270376, -271987, 251059, 289237, 10192, -80644, -24976, -53130, 239001, 35206, -271737, -85555, -121153, -146679, 76030, 128944, -240592, 112354, -92146, 100319, -124489, 176422, 272990, -224737]
9471F2696d4148l10765J51745A7583a07235K8857f688A47302b30452k5203D4200
9459d9407B48001n0693F6235a9981j5754l62290d942C2635a47590o4327A64039
9447A42626h3523r3358j63288Q4036a28062b6722j17673A4609K09820l6075a56493
9435A07217E1329O4111a84602D8675c60655a63543A84854c81515g206k42963H3405
9423h7643C7832a67917q1700Q4932o2964r4236C4789J21862b02727c6521k14779
9412b51300l26107a19072G7158B1008b21539e5056j84005d8699i901j97437B44741
9400b25656A265K7872b01944K6314L7879l16241p3345a76211c753F4424P6567
9389A40991o2419f8099J697B12247a09791k45227e5568J9351B9036a28238A53414
$$ y = [62696, -44148, -354913, -203168, 17583, -107235, -78378, -6688, 147302, -230452, -255655, 44200, -49407, 248001, 197308, 66235, -19981, -35735, -398025, -4942, 32635, -147590, -211917, 164039, 142626, -83523, -176881, -340169, -256133, -128062, -26722, -144395, 14609, 224429, 188354, -156493, 107217, 51329, 115440, -184602, 48675, -360655, -163543, 184854, -381515, -7206, -250169, 83405, -87643, 37832, -167917, -249617, -164685, -227649, -321885, 34789, 156651, -202727, -36521, -251300, -577407, -119072, 77158, 21008, -221539, -55056, -239061, -48699, -9901, -207338, 244741, -225656, 1265, 29137, -201944, -175630, -137751, -453992, -527337, -176211, -3753, 64424, 140991, 78572, -68099, -66402, 212247, -109791, -355018, -55568, -36217, 29036, -128238, 153414]
9377B4576g8735j80856B70512c81771a18129j60596A25034b70313Q9505K8069
9367a52739M3474C5866a38631r4247a6290A06378j8154a22739D2066c53838j09060
9356d62898f9775k252k93988F7708A224J05025b88180j02555a27481b7178C37776
9344D3220g9004A94803D4612i601A14505D3514a30339L9691K6971j6783E1142
9332A14416J33493n3365I7153D4611a37784m9404r7086f1196C0062K02539g0393
9320c99562F367M4110j0590O0110L59186a62010n6747C0965q810c46527a54009
9308A96497a46260r6567Q5203d3288q7223D05975h5255I7996g3870k93112A16364
9296B3582a97994P9175A32917C103b57923M398O6463L7490j16096F0648N4689
$$ y = [24576, -78735, -259591, 270512, -381771, -118129, -278725, 125034, -270313, -180808, -152739, -109265, 35866, -138631, -232878, -16290, 106378, 88224, -122739, 42066, -353838, -462898, -69775, -72027, -366015, 67708, 1224, 106249, -288180, -390735, -127481, -27178, 337776, 43220, -79004, 194803, 44612, -9601, 114505, 43514, -130339, -90648, -63677, -80460, 51142, 114416, 247909, 194544, 97153, 44611, -137784, -187188, -284274, -61196, 30062, 232601, -70393, -399562, 6367, 50477, 39887, 99997, 459183, -162010, -218757, 30965, 22155, -346527, -154009, 196497, -146260, -242827, -157624, -43288, -130511, 405975, -85255, 97996, -73870, -366982, 116364, 23582, -197994, -118819, 132917, 3103, -257923, -253525, -187062, -149572, -265668, 60648, 115337]
9285A15337M7017D943a34378G3044b8721j32830C05110H2582g3251r6090c6174
9273e0948k01846I0557j62a37869p18O3381A2178c07348G1896a17316b2686j57409
9261a80095C6264a14894J7480j22265K3210R7893A70396a9239F2585a68607f8463
9249i2559k421B09385Q9390c0210q7774N0183m10291A7317a86348C57256D7235
9237B05085p6389d3360j51556A33562e4250H9128f5139F9770i8648d3513B42667
9225A82702c10311I2472a81169A01012g794k36327d5732K0248k9752D7949J0299
9214E8248i4898j09237b2251l1691j95344a7992G4269c9941B53797b58659a2261
9202D4255c5450e460A92759E3042g2449j51491a8537A41166a0722j34802M4264
$$ y = [115337, 162354, 4943, -134378, 73044, -28721, -161551, 305110, 82582, -73251, -169341, -36174, -50948, -252794, 90557, 90395, -137869, -138587, -75206, 12178, -307348, 71896, -117316, -22686, -180095, 36264, -114894, -97414, -219679, -196469, -98576, 170396, -19239, 62585, -168607, -68463, -92559, -94980, 209385, 298775, -30210, -117984, -67801, -478092, 17317, -186348, 357256, 47235, 205085, 128696, -43360, -194916, 133562, -54250, 89128, -65139, 69770, -98648, -43513, 242667, 182702, -310311, 92472, -181169, 101012, -7794, -244121, -45732, -25484, -55236, 47949, 58248, -94898, -204135, -22251, -53942, -249286, -17992, 74269, -39941, 253797, -258659, -12261, 44255, -35450, -5460, 192759, 53042, -72449, -223940, -18537, 141166, -10722, -145524, -101260]
9191a01260c5946j69485r9147E3331J26258Q7755c9234k18270g2342E6370c20415
9179A33374o0554c34165B34431g8145B8536M5859b02191M0358b6932B22779j02527
9168A20252B6756J11617A1150K11866i5858A62921i2582n8462P911f742D03559
9156B19996h7997j42528M7115I937a38397A29900c7358m29871J27124D6952J28707
9145A75659O7786p9761i7386p4552b6029p3723k84961a46441k44126a46403F0012
9133a36611j58979J28794B3163K1993K06812A00007B572a77608e0171E4679p444
9122D7235c67789d0552j27920d6230A45151f1180l34581a04444D5358b22975j4467
9111b37442B19548I2256a23580F0316a17804I5495a39786A22488L3096c9904k2557
$$ y = [-101260, -35946, -205431, -304578, 53331, 179589, 267344, -39234, -257504, -72342, 56370, -320415, 133374, 72820, -334165, 234431, -78145, 28536, 74395, -202191, -161833, -26932, 222779, 120252, 26756, 138373, 11150, 223016, -95858, 162921, -92582, -151044, -143133, -6742, 403559, 219996, -87997, -230525, -183410, 9937, -138397, 129900, -37358, -467229, -340105, 46952, 175659, 243445, 163684, -97386, -171938, -26029, -99752, -384713, -146441, -390567, -146403, 60012, -136611, -295590, -166796, 23163, 45156, 251968, 100007, 2572, -177608, -50171, 54679, 47235, -367789, -40552, -168472, -46230, 145151, -61180, -395761, -104444, 45358, -222975, -237442, 219548, 92256, -123580, 60316, -117804, 95495, -139786, 122488, 155584, -39904, -62461]
9100f2461A41455h9796R888a5418j0643k90226f712B7149a1441l6391a9557j90347
9088b09904A02465R0776n6543c3823j64647C85039b9578j02279A22060b0804m35088
9077d55892B2625c8487E068J49771C0933e692l3933I1529L1039E1177j01B4674
9064G2610a40241A8542a09761n60169a24540k81088A54732c3384C5337L22284
9054C57621a29315j2515C0537c25862G0206b1874A8241i8647b1814n7982D12611
9042f9853G540b1169A31824c07967Q5739f1409D5449a28704k30894B1260Q5285
9031A06545f4059H9873b32949a3387n3146k68811H9057i3335r8848B39712c05632
9019G3988A7745O3940A6200b45855a9529H4012a58709k15918h9058j9050e3802
$$ y = [-62461, 141455, -89796, -79908, -15418, -26061, -316287, -6712, 27149, -11441, -47832, -19557, -209904, 102465, 193241, 136698, -33823, -198470, 385039, -29578, -131857, 122060, -20804, -455892, 22625, -38487, 5068, 154839, 30933, -5692, -39625, 91529, 122568, 51177, 51076, 24674, 72610, -140241, 18542, -109761, -669930, -124540, -405628, 154732, -33384, 35337, 357621, -129315, -141830, 30537, -325862, 70206, -21874, 18241, -98647, -21814, -79796, 412611, -69853, 7540, -21169, 131824, -307967, -222228, -61409, 45449, -128704, -359598, 21260, 106545, -64059, 89873, -232949, -13387, -66533, -335344, 89057, -93335, -192183, 239712, -305632, 73988, 17745, 81685, 16200, -245855, -19529, 84012, -158709, -374627, -89058, -108108, -53802]
9007a99491f5467m8354Q506j81993J33379j14109b1831E8212Q6270b1448k26858
8996b48306A60323a83930L4413F1682n972e7765K2190k10101O1335B78797A02348
8984a74847i245A14838E1832e18964a49925B8410A0369e4573D5030a46787A2609
8972H850i7763j05348j48582i2659c7031A57939K5331p3326N7976c39072B0018
8960B50720a14368k43998A65288D0907b75216A15559b1928B0295J08537C495M2814
8949D6309a18988C3988J74195g9918b939j87379A16048a99180C05032a09570n4617
8938a64187j57377B1128a58187E88331j27392j24580J05496A03380b18762B03288
8927b85951a10585B17996J17811L51801J331261O095363J2328205D961938A239529
$$ y = [-199491, -65467, -113821, -105315, -287308, -153929, -268038, -21831, 58212, 144482, -21448, -248306, 160323, -183930, -149517, 61682, 55710, -57765, -35575, -245676, -184341, 278797, 102348, -174847, -9245, 114838, 51832, -518964, -149925, 28410, 10369, -54573, 45030, -146787, 12609, 8850, -97763, -203111, -351693, -92659, -37031, 157939, 183270, 109944, 167920, -339072, 20018, 250720, -114368, -358366, 165288, 40907, -275216, 115559, -21928, 20295, 128832, 3495, 46309, -118988, 33988, 208183, -79918, -2939, -190318, 116048, -199180, 305032, -109570, -164187, -321564, 21128, -158187, 588331, 460939, 336359, 441855, 103380, -218762, 203288, -285951, -110585, 217996, 335807, 687608, 2018869, 8114232, 20442437, 4961938, 1239529]
8917B46749M4826p4057H85a7846A58309b47924A62318a30111A50501O27340c4561
8905B23191a03482G2826h7334D34512D3916a16340I9098f9910C44719a91127A28364
8893a0810m2764a9361E9429R5668d84574a01819C1120L51749a24235L9109c2385
8881I5382c24630D8327a2614j93800c510r6009j97885D29716i5166j70021B18612
8869A68166c6889B38914D7550j386a87927n89k1405j34959C4139M50799b57556
$$ y = [246749, 291575, 217518, 885, -17846, 158309, -247924, 162318, -130111, 150501, 777841, -34561, 223191, -103482, 72826, -87334, 434512, 43916, -116340, 99098, -69910, 344719, -191127, 128364, -10810, -53574, -19361, 59429, 155097, -484574, -101819, 31120, 382869, -124235, -85126, -32385, 95382, -324630, 48327, -12614, -206414, -3510, -99519, -297404, 429716, -95166, -265187, 218612, 168166, -36889, 238914, 47550, 46164, -187927, -188516, -209921, -344880, 34139, 484938, -257556]
$$ [...]
##END NTUPLES=NMR SPECTRUM
##END=
