
##TITLE=UV1226_M6_1234-1212_70_7240115_p97Uzr14WF
##JCAMPDX= 6.0         $$ Bruker NMR JCAMP-DX V2.0
##DATA TYPE= NMR SPECTRUM
##DATA CLASS= NTUPLES
##ORIGIN= BRUKER
##OWNER= Administrator
$$ 1.72 TOPSPIN		Version 2.1
$$ 2013-01-18 02:29:01.305 -0500  Administrator@X
$$ Compression mode = diff/dup
##.OBSERVE FREQUENCY= 400.02188249412
##.OBSERVE NUCLEUS= ^1H
##.ACQUISITION MODE= SIMULTANEOUS (DQD)
##.ACQUISITION SCHEME= undefined
##.AVERAGES= 8
##.DIGITISER RES= 22
##SPECTROMETER/DATA SYSTEM= spect
##.PULSE SEQUENCE= zg30
##.SOLVENT NAME= COFFEE_meoh
##.SHIFT REFERENCE= INTERNAL, COFFEE_meoh, 1, 14.98509
##AUDIT TRAIL= $$ (NUMBER, WHEN, WHO, WHERE, PROCESS, VERSION, WHAT)
$$ ##TITLE= Audit trail, TOPSPIN		Version 2.1
$$ ##JCAMPDX= 5.01
$$ ##ORIGIN= Bruker BioSpin GmbH
$$ ##OWNER= Administrator
$$ $$ E:\/data/COFFEE/nmr/UV1226_M6_1234-1212_70_7240115_p97Uzr14WF/20/pdata/1/auditp.txt
$$ ##AUDIT TRAIL=  $$ (NUMBER, WHEN, WHO, WHERE, PROCESS, VERSION, WHAT)
(   1,<2013-01-18 02:28:53.367 -0500>,<Administrator>,<X>,<go>,<TOPSPIN 2.1>,
      <created by zg
	started at 2013-01-18 02:27:46.977 -0500,
	POWCHK enabled, PULCHK disabled,
       configuration hash MD5:
       86 BA 57 50 F2 9D 5C 9B 26 00 A9 28 5F 66 2E 89
       data hash MD5: 64K
       CE 8A 59 04 44 CF 8F F7 C9 A3 77 74 66 91 E2 88>)
(   2,<2013-01-18 02:28:56.399 -0500>,<Administrator>,<X>,<proc1d>,<TOPSPIN 2.1>,
      <Start of raw data processing
       efp LB = 0 FT_mod = 6 PKNL = 1 PHC0 = 0 PHC1 = 0 SI = 32K 
       data hash MD5: 32K
       2E 22 B0 71 91 CA 55 A5 AE 8A 61 03 D8 E2 E8 BC>)
(   3,<2013-01-18 02:28:56.852 -0500>,<Administrator>,<X>,<proc1d>,<TOPSPIN 2.1>,
      <pk PHC0 = 96.93237 PHC1 = 0 
       data hash MD5: 32K
       5E 10 DD 3B 28 9D 40 04 62 C1 9F D5 E4 4A 17 BF>)
(   4,<2013-01-18 02:28:57.086 -0500>,<Administrator>,<X>,<proc1d>,<TOPSPIN 2.1>,
      <abs ABSG = 1 
       data hash MD5: 32K
       52 AC 63 FB 21 27 EB C9 FD 97 E9 13 68 FF 53 6C>)
(   5,<2013-01-18 02:28:57.227 -0500>,<Administrator>,<X>,<proc1d>,<TOPSPIN 2.1>,
      <abs ABSG = 2 
       data hash MD5: 32K
       68 A5 F5 3B 5A CD D5 59 DB A8 9C 83 53 F7 91 8D>)
(   6,<2013-01-18 02:28:57.367 -0500>,<Administrator>,<X>,<proc1d>,<TOPSPIN 2.1>,
      <abs ABSG = 3 
       data hash MD5: 32K
       A1 8A 11 56 DF 59 62 B4 15 69 37 64 F1 94 B7 C1>)
(   7,<2013-01-18 02:28:57.508 -0500>,<Administrator>,<X>,<proc1d>,<TOPSPIN 2.1>,
      <abs ABSG = 4 
       data hash MD5: 32K
       D5 65 74 47 38 BC F0 C9 0D CB 8F 3C 01 36 C1 9A>)
(   8,<2013-01-18 02:28:57.649 -0500>,<Administrator>,<X>,<proc1d>,<TOPSPIN 2.1>,
      <abs ABSG = 5 
       data hash MD5: 32K
       47 6D FE 62 7D AE 61 86 A2 B5 C8 0E 20 6F 0A F6>)
$$ ##END=
$$ 
$$ $$ hash MD5
$$ $$ 00 C5 5B D7 AE A8 B9 A3 79 65 57 FA 86 F3 B6 DA
##$RELAX= 
##$RELAX= 
##$RELAX= 
##$RELAX= 
##$RELAX= 
##$RELAX= 
##$RELAX= 
$$ Bruker specific parameters
$$ --------------------------
##$DU= <E:\>
##$EXPNO= 20
$$ [...]
##$TP= (0..7)
150 150 150 150 150 150 150 150
##$TP07= 0
##$TPNAME0= <>
##$TPNAME1= <>
##$TPNAME2= <>
##$TPNAME3= <>
##$TPNAME4= <>
##$TPNAME5= <>
##$TPNAME6= <>
##$TPNAME7= <>
##$TPOAL= (0..7)
0.5 0.5 0.5 0.5 0.5 0.5 0.5 0.5
##$TPOFFS= (0..7)
0 0 0 0 0 0 0 0
##$TUNHIN= 0
##$TUNHOUT= 0
##$TUNXOUT= 0
##$USERA1= <user>
##$USERA2= <user>
##$USERA3= <user>
##$USERA4= <user>
##$USERA5= <user>
##$V9= 5
##$VALIST= <valist>
##$VCLIST= <CCCCCCCCCCCCCCC>
##$VD= 0
##$VDLIST= <DDDDDDDDDDDDDDD>
##$VPLIST= <PPPPPPPPPPPPPPP>
##$VTLIST= <TTTTTTTTTTTTTTT>
##$WBST= 1024
##$WBSW= 4
##$XGAIN= (0..3)
0 0 0 0
##$XL= 0
##$YL= 0
##$YMAX_a= 704493
##$YMIN_a= -599084
##$ZGOPTNS= <>
##$ZL1= 120
##$ZL2= 120
##$ZL3= 120
##$ZL4= 120
##$ABSF1= 14.98509
##$ABSF2= -5.573092
##$ABSG= 5
##$ABSL= 3
##$ALPHA= 0
##$AQORDER= 0
##$ASSFAC= 0
##$ASSFACI= 0
##$ASSFACX= 0
##$ASSWID= 0
##$AUNMP= <proc_prof1d_extract_pilot.lims>
##$AXLEFT= 0
##$AXNAME= <>
##$AXNUC= <1H>
##$AXRIGHT= 0
##$AXTYPE= 0
##$AXUNIT= <>
##$AZFE= 0.1
##$AZFW= 0.1
##$BCFW= 0
##$BC_mod= 0
##$BYTORDP= 0
##$COROFFS= 0
##$CY= 15
##$DATMOD= 1
##$DC= 0
##$DFILT= <>
##$DTYPP= 0
##$F1P= 0
##$F2P= 0
##$FCOR= 0.5
##$FTSIZE= 32768
##$FT_mod= 6
##$GAMMA= 0
##$GB= 0
##$INTBC= 1
##$INTSCL= 1
##$ISEN= 128
##$LB= 0
##$LEV0= 0
##$LPBIN= 0
##$MAXI= 10000
##$MC2= 0
##$MEAN= 0
##$ME_mod= 0
##$MI= 0
##$NCOEF= 0
##$NC_proc= -8
##$NLEV= 6
##$NOISF1= 0
##$NOISF2= 0
##$NSP= 0
##$NTH_PI= 0
##$NZP= 0
##$OFFSET= 14.98509
##$PC= 1
##$PHC0= 96.93237
##$PHC1= 0
##$PH_mod= 1
##$PKNL= yes
##$PPARMOD= 0
##$PPDIAG= 0
##$PPIPTYP= 0
##$PPMPNUM= 2147483647
##$PPRESOL= 1
##$PSCAL= 4
##$PSIGN= 0
##$PYNMP= <proc.py>
##$REVERSE= no
##$SF= 400.02
##$SI= 32768
##$SIGF1= 0
##$SIGF2= 0
##$SINO= 400
##$SIOLD= 32768
##$SPECTYP= <>
##$SREGLST= <1H.CDCl3>
##$SSB= 0
##$STSI= 32768
##$STSR= 0
##$SW_p= 8223.68421052631
##$SYMM= 0
##$S_DEV= 0
##$TDeff= 65536
##$TDoff= 0
##$TI= <>
##$TILT= no
##$TM1= 0
##$TM2= 0
##$TOPLEV= 0
##$USERP1= <user>
##$USERP2= <user>
##$USERP3= <user>
##$USERP4= <user>
##$USERP5= <user>
##$WDW= 1
##$XDIM= 32768
##$YMAX_p= 476303314
##$YMIN_p= -776645
##$CURPLOT= <Network HP LaserJet P1505>
##$CURPRIN= <$Network HP LaserJet P1505>
##$DFORMAT= <normdp>
##$LAYOUT= <+/1D_H.xwp>
##$LFORMAT= <normlp>
##$PFORMAT= <normpl>
##$SURQMSG= 1
$$ End of Bruker specific parameters
$$ ---------------------------------
##NTUPLES= NMR SPECTRUM
##VAR_NAME=  FREQUENCY,     SPECTRUM/REAL,   SPECTRUM/IMAG
##SYMBOL=    X,             R,               I
##VAR_TYPE=  INDEPENDENT,   DEPENDENT,       DEPENDENT
##VAR_FORM=  AFFN,          ASDF,            ASDF
##VAR_DIM=   32768,         32768,           32768
##UNITS=     HZ,            ARBITRARY UNITS, ARBITRARY UNITS
##FACTOR=    0.250966925370066, 1,           1
##FIRST=     8223.43324360094, 40711,        -43596
##LAST=      0,             241047,          -69101
##MIN=       0,             -776645,         0
##MAX=       8223.43324360094, 476303314,    0
$$ Real data points
##PAGE= N=1
##DATA TABLE= (X++(R..R)), XYDATA
$$ [...]
19518C4976N1493H279O2425d30348d6619G7335c7483k26610P8784j3910B34645
$$ 34976 86469 8279 70704 -430348 -46619 77335 -37483 -264093 -185309 -199219 234645
19506C90424b09432f5537n404q8042A0822a72102G0648d8150o3037q350j06360
$$ 390424 -209432 -65537 -70941 -158983 10822 -172102 70648 -48150 -111187 -119537 -225897
19495b25897B53125a37338M9720d853F4937b71562E4745a30472e1819K2880E6285
$$ -225897 253125 -137338 -87618 -4853 64937 -271562 54745 -130472 -51819 -28939 56285
19483B39006c29296M3361J24532r2790A99976r5088k7608b63715B19309b06480
$$ 239006 -329296 -285935 -161403 -254193 199976 104888 77280 -263715 219309 -206480
19472b2823j34728c6697D39689b37565J2998j08392A6967c06800A59043a0998
$$ -22823 -157551 -36697 439689 -237565 -224567 -332959 16967 -306800 159043 -10998
19461I3146l3039c4388j54918J9438j59824b3175q4111A26544a03813m54425C03010
$$ 93146 60107 -34388 -189306 -169868 -329692 -23175 -107286 126544 -103813 -558238 303010
19449a00197j34590e9707k20439d6843l3920k0354C0106c185A2406N9382B608
$$ -100197 -234787 -59707 -280146 -46843 -80763 -101117 30106 -3185 12406 71788 2608
19437a38445A90128K8998n9491n8157b60475E7410e2138k54325f6825A53432b04158
$$ -138445 190128 219126 159635 101478 -260475 57410 -52138 -306463 -66825 153432 -204158
19425D9006b15834o3171D2403d92854G1737R093f66887A08280a82451G5369h5628
$$ 49006 -215834 -279005 42403 -492854 71737 80830 -666887 108280 -182451 75369 -85628
19413C8537g4456A73062a1704o8645B8403a65990A38961a93508m8077i9308G2901
$$ 38537 -74456 173062 -11704 -80349 28403 -165990 138961 -193508 -241585 -99308 72901
19401d28313e0330j7354A89229q2280b71923b5215j578m4744n0852B0650c80128
$$ -428313 -50330 -67684 189229 106949 -271923 -25215 -26793 -71537 -122389 20650 -380128
19389a30312e7144l737m332j0267L637j9081B50980K4943G3687b77159P4939h1250
$$ -130312 -57144 -60881 -65213 -75480 -71843 -90924 250980 275923 73687 -277159 -202220 -81250
19376d8274F2835a5347j54292r7571M1654B73004b85341c2720B62800D9712J61129
$$ -48274 62835 -15347 -169639 -267210 -225556 273004 -285341 -32720 262800 49712 210841
19365B10841a53170c3319A36388f8118A3414b32209c6670r7391d5957n9299k45133
$$ 210841 -153170 -33319 136388 -68118 13414 -232209 -36670 -134061 -45957 -105256 -350389
19354c50389D7610j0607J22027b32739R6729j8577b8190l72295b2759p6177A29360
$$ -350389 47610 37003 159030 -232739 -136010 -154587 -28190 -400485 -22759 -98936 129360
19342b95782C26136H8979b29115K1538A68035D0223b10357F5952d03397a12913
$$ -295782 326136 88979 -229115 -207577 168035 40223 -210357 65952 -403397 -112913
19331A45168b68448R8894A60632b02513d9919j54429K0118Q1499r3844j92798
$$ 145168 -268448 -169554 160632 -202513 -49919 -204348 -184230 -102731 -196575 -389373
19321c89373a20351d5139r8030l99533K00413b7831j08206j43154B76907d201
$$ -389373 -120351 -45139 -143169 -542702 -342289 -27831 -136037 -279191 276907 -4201
19310G1972b07227j1154e9290j3320m89968A5628b5896l67101b7629B4079b1026
$$ 71972 -207227 -218381 -59290 -72610 -562578 15628 -25896 -392997 -27629 24079 -21026
19298b09611d3253n3615D4078g2585A16688J68146A29937c67641a04171B9g6799
$$ -209611 -43253 -96868 44078 -72585 116688 284834 129937 -367641 -104171 29 -76799
19286B62689a72306d2H7439a48690q277d02k8752k62622A57184C7616K44002a19005
$$ 262689 -172306 -42 87439 -148690 -156967 -402 -29154 -291776 157184 37616 281618 -119005
19273b88617P0563d3279k4588B19690a23231C1822i3643E08873B15617g4839m30177
$$ -288617 -218054 -43279 -67867 219690 -123231 31822 -93643 508873 215617 -74839 -505016
19262e05016A1748J03919J15405a1759A22796i3388p8977d9067C9862a0784k82492
$$ -505016 11748 115667 231072 -11759 122796 -93388 -172365 -49067 39862 -10784 -293276
19251b93276b8348A06204a20217j26306A8469J26451a60907b3372D6565b24297
$$ -293276 -28348 106204 -120217 -246523 18469 144920 -160907 -23372 46565 -224297
19240g6750L5621A83780C6691b12602L1509e3495k31424J36737L6738B7691J02441
$$ -76750 -41129 183780 36691 -212602 -181093 -53495 -284919 -148182 -111444 27691 130132
19229A30132a93542A03322i9449A11112a68108A75985f3702o3495H6449a31813
$$ 130132 -193542 103322 -99449 111112 -168108 175985 -63702 -127197 86449 -131813
19218B69948d09467c0490B79969H0128h2182E6442a75561A73042c64161a4228
$$ 269948 -409467 -30490 279969 80128 -82182 56442 -175561 173042 -364161 -14228
19207A10668A3447b15558n9777i1891B07484a7591q5189j23061j44067i4899k5659
$$ 110668 13447 -215558 -275335 -91891 207484 -17591 -102780 -225841 -369908 -94899 -120558
19196a20558k41319a8034j30722A16052i4215B03450a55302B2910b06437Q1450
$$ -120558 -361877 -18034 -148756 116052 -94215 203450 -155302 22910 -206437 -124987
19186a24987j37035c3501o7818A87009b51587A48182F7881h2177J5293a7131j43996
$$ -124987 -262022 -33501 -101319 187009 -251587 148182 67881 -82177 -66884 -17131 -161127
19175a61127C56040I2267b02585A33085a24439E8972d3164J690F5392a37243I1552
$$ -161127 356040 92267 -202585 133085 -124439 58972 -43164 -41474 65392 -137243 91552
19163a8918o7132p8521L7714l6667I4909b3967p7179k26748d6048j16043c227
$$ -18918 -86050 -164571 -126857 -163524 94909 -23967 -101146 -327894 -46048 -162091 -3227
19151B09813b30459O9733g0962A35177b18796A74924b12039Q5956l8646B1796
$$ 209813 -230459 -160726 -70962 135177 -218796 174924 -212039 -126083 -164729 21796
19140A04830g7763k47409a18094A5115a75460j59003n9433J85808e0570j32891
$$ 104830 -77763 -325172 -118094 15115 -175460 -334463 -393896 -208088 -50570 -183461
19130a83461b0149j89305C06697c99229J47768j12434H4857B3079J77808j6648
$$ -183461 -20149 -209454 306697 -399229 -251461 -363895 84857 23079 200887 184239
19120A84239D969b85639j16152A87723A5162J86047b1107k8657q5366A47816o1291
$$ 184239 4969 -285639 -401791 187723 15162 201209 -21107 -49764 -135130 147816 86525
19109H6525K7017F175b09243A70247E8466c63465A64706A8843c2043l228A62421
$$ 86525 113542 6175 -209243 170247 58466 -363465 164706 18843 -32043 -35271 162421
19097A61398c6687n0780m5065j71628A179c6800j85479k09267D4709j8833a06542
$$ 161398 -36687 -87467 -132532 -304160 1179 -36800 -222279 -431546 44709 25876 -106542
19085b28774q4472R4221B47456a41658D14843a84150A22487A5642R7339b5j68779
$$ -228774 -313246 -219025 247456 -141658 414843 -184150 122487 15642 112981 -25 -168804
19074a68804h0176J9189A68848b35755G5155a97455j90465A0034K27554E778h2029
$$ -168804 -80176 -60987 168848 -235755 75155 -197455 -387920 10034 237588 5778 -82029
19062B7384P8273b46687d7895k14704a03717M4215a8456H4807c8721A2472c18763
$$ 27384 105657 -246687 -47895 -262599 -103717 -59502 -18456 84807 -38721 12472 -318763
19050C13207b4999o9144p7046n980k22665G0903J26820h4838A99259g3154A63323
$$ 313207 -24999 -94143 -171189 -177169 -399834 70903 197723 -84838 199259 -73154 163323
19038a08799I2333e9163r6926A62432a87682C20088j41147J97706a67321O4303
$$ -108799 92333 -59163 -156089 162432 -187682 320088 178941 376647 -167321 -103018
19028a03018m3997L0326L4353o3664q8922j53472H3650a43395a2694C34449a40757
$$ -103018 -147015 -116689 -82336 -146000 -234922 -388394 83650 -143395 -12694 334449 -140757
19016b99742a4027k07955f6043k34184g7052H0157e8044I8423J18190a33136j52503
$$ -299742 -14027 -221982 -66043 -300227 -77052 80157 -58044 98423 216613 -133136 -285639
19005b85639h8917k53815B53881a40349H1399B8710j0423J15101a02197E1804
$$ -285639 -88917 -342732 253881 -140349 81399 28710 18287 133388 -102197 51804
18994c1760D20394b10570j17083N0256E0081b22584F4099a29496A81075i8787
$$ -31760 420394 -210570 -327653 -277397 50081 -222584 64099 -129496 181075 -98787
18983e5223A4607J80525b79745c5617j8930q245N923l97407J78938f6971J9816
$$ -55223 14607 195132 -279745 -35617 -54547 -62792 -56869 -454276 -275338 -66971 -47155
18972d7155O039A02028d17854a31460M7389K6823A33501b36696c832j10140r7884
$$ -47155 -41116 102028 -417854 -131460 -84071 -57248 133501 -236696 -3832 -113972 -211856
18961b11856B83718j39580Q5885c9266B79863a02006l334D4068H58L5563a19725
$$ -211856 283718 144138 230023 -39266 279863 -102006 -105340 44068 858 36421 -119725
18949I8470g8866b7237C09346j32061a4924o9738G972K05298a09565A86676d00035
$$ 98470 -78866 -27237 309346 177285 -14924 -84662 7972 213270 -109565 186676 -400035
18937e3347J2875B71685a90798g88j00138a8490D435a29116A54591d7721j09133
$$ -53347 -40472 271685 -190798 -788 -100926 -18490 4435 -129116 154591 -47721 -156854
18926a56854j7330A69072a64525c6045A64406b14699i7835n5454B95358d38740
$$ -156854 -174184 169072 -164525 -36045 164406 -214699 -97835 -153289 295358 -438740
18915c16695J16159j33042b9758k33605B83252b91226A65338a25391A15920O1464
$$ -316695 -200536 -333578 -29758 -263363 283252 -291226 165338 -125391 115920 177384
18905A77384q8652b23102C3142c9486G4323a61498A66486j5424c5197k01584J5695
$$ 177384 88732 -223102 33142 -39486 74323 -161498 166486 151062 -35197 -236781 -221086
18894b21086f2697D3677R0076b5619A53800a09737K6417j8450D8548c5864E7412
$$ -221086 -62697 43677 133753 -25619 153800 -109737 -83320 -101770 48548 -35864 57412
18882B33860b32637j47837a87996B58228D8592N0507c9292k75908J49111A46369
$$ 233860 -232637 -380474 -187996 258228 48592 99099 -39292 -315200 -166089 146369
18871A49721J02870j22957a77860k1124k553m2603P9026O6920J0380b834A83531
$$ 149721 252591 129634 -177860 -198984 -201537 -244140 -165114 -98194 -87814 -2834 183531
18859a26211M8700m3628k62858c8190p7824k3351A39095c35230b1718B074a65208
$$ -126211 -77511 -121139 -383997 -38190 -116014 -139365 139095 -335230 -21718 2074 -165208
18847d8222d739k48046d7994E7818b69316L8812j320A76839i7851a3174k0345
$$ -48222 -4739 -252785 -47994 57818 -269316 -230504 -231824 176839 -97851 -13174 -33519
18836c3519n461o5546J7633j46183M8281j7057g5130C92255A28771R4330D6081
$$ -33519 -38980 -104526 -86893 -233076 -184795 -201852 -75130 392255 128771 223101 46081
18824a09422A50186b97865B70164q9749a30348n9354j9469B71087a12951A91864
$$ -109422 150186 -297865 270164 180415 -130348 -189702 -209171 271087 -112951 191864
18813C25489a00744C3859Q0393b9689A70893p1488L2058h6219I9848a46871E3368
$$ 325489 -100744 33859 114252 -29689 170893 99405 131463 -86219 99848 -146871 53368
18801a41495M0246M7089l0305q7158R152p7693D28804d42857b06772B95275c08640
$$ -141495 -101249 -54160 -84465 -171623 -162471 -240164 428804 -442857 -206772 295275 -308640
18789d56889A83282E0082b23252a05043k85381a77470P0921N2212A50980a38518
$$ -456889 183282 50082 -223252 -105043 -390424 -177470 -106549 -54337 150980 -138518
18778a47798K6326b4232L082j08108j82223C639d8877D0511K97413E9089O9482
$$ -147798 -121472 -24232 -21150 -129258 -311481 3639 -48877 40511 337924 59089 128571
18767A28571b7846m8790j2635C13598j31777d2766A02124c19205g7878G8465d6796
$$ 128571 -27846 -76636 -89271 313598 181821 -42766 102124 -319205 -77878 78465 -46796
18755b2414E4104J8179J14943f3975G2423b14833F9251d0984j57554I1313l1125
$$ -22414 54104 72283 187226 -63975 72423 -214833 69251 -40984 -198538 91313 60188
18744F0188b42836f4401E6845c13735B81396j21005a84898G4106a71288e7413
$$ 60188 -242836 -64401 56845 -313735 281396 160391 -184898 74106 -171288 -57413
18733A076a04674H3108B9093a09768A06361a19008m6499j9431j29483i8006o8435
$$ 1076 -104674 83108 29093 -109768 106361 -119008 -165507 -184938 -314421 -98006 -166441
18722a66441m3324l0216j53298c0363A83097a48267B4062b98688g5900A01645
$$ -166441 -209765 -239981 -393279 -30363 183097 -148267 24062 -298688 -75900 101645
18711A77022C4489b87839c3308k36315I9823f5786C2500f0963A06599c64581C82591
$$ 177022 34489 -287839 -33308 -269623 99823 -65786 32500 -60963 106599 -364581 382591
18699a95211B22943A5900P0354e3826A99801a84649F3461J9212f4235j48709Q3478
$$ -195211 222943 15900 86254 -53826 199801 -184649 63461 82673 -64235 -212944 -129466
18688a29466f2717l70485K13562C830P8385L9869O9473a83954e5437G843a84893
$$ -129466 -62717 -433202 -219640 3830 82215 122084 191557 -183954 -55437 7843 -184893
18676c405B38515f9408K2293O652j13028L8337K9549D0170b66937a18605j46682
$$ -3405 238515 -69408 -47115 -40463 -153491 -115154 -85605 40170 -266937 -118605 -265287
18665b65287n2468C8579a5342j68235a0721k64041A00310i0981n0548j1526A28281
$$ -265287 -317755 38579 -15342 -183577 -10721 -274762 100310 -90981 -141529 -153055 128281
18653F814e2296l5144j01466i2652j83385j5702f013D6526q865G864J28121c241
$$ 6814 -52296 -87440 -188906 -92652 -276037 -291739 -6013 46526 37661 7864 135985 -3241
18640a058r1321C42927a64672B05138a82259A2530a2192m820A99749G5708c0295
$$ -1058 -92379 342927 -164672 205138 -182259 12530 -12192 -17012 199749 75708 -30295
18628B5885d9989k83224A5774J00645n6420F793Q0360a79811G9003J49047R1943
$$ 25885 -49989 -333213 15774 116419 59999 6793 87153 -179811 79003 228050 319993
18617C19993a29704J8053B0243a20187j12102j26016a25736j8231j1007B37018
$$ 319993 -129704 -111651 20243 -120187 -232289 -358305 -125736 -143967 -154974 237018
18606a3901q6999k20833a24818M3038A54676A8191c41955J15707G2266d33122
$$ -13901 -100900 -321733 -124818 -81780 154676 18191 -341955 -226248 72266 -433122
18595B49098h9586k27746D4714k1875b77695e3931k17709J28668q7429A20485
$$ 249098 -89586 -317332 44714 22839 -277695 -53931 -271640 -142972 -230401 120485
18584B69740j25335a87336J9067e4351F8946j8044c098j24713j08741B5941J68693
$$ 269740 144405 -187336 -168269 -54351 68946 50902 -3098 -127811 -236552 25941 194634
18573A94634b06093g2044H0851b12489G2784a90038g5059A1686J07470b52065
$$ 194634 -206093 -72044 80851 -212489 72784 -190038 -75059 11686 119156 -252065
18562c04871J31097B09374e3943p0040H1697h2430j44793A37142a35752F2891
$$ -304871 -173774 209374 -53943 -123983 81697 -82430 -227223 137142 -135752 62891
18551b90654h0722j46953c9532a5491A02499b70332A72507c45261J21375j2052
$$ -290654 -80722 -227675 -39532 -15491 102499 -270332 172507 -345261 -223886 -235938
18541b35938D2838K45552c96669a49988H6824N7702C3576c3827m2252l63028K05030
$$ -235938 42838 288390 -396669 -149988 86824 144526 33576 -33827 -76079 -439107 -234077
18530b34077A60387i6010H3188c1942H756M630b29186B43253c36375B66377G5794
$$ -234077 160387 -96010 83188 -31942 8756 13386 -229186 243253 -336375 266377 75794
18518B9715P00L9212d85298C4922e4928m6855n68381b22445j12578J62419g4581
$$ 29715 30415 69627 -485298 34922 -54928 -101783 -670164 -222445 -335023 -172604 -74581
18506a00241c8917l23260d6274q9228A3511b23427O9318A74076j77C0905e09602
$$ -100241 -38917 -362177 -46274 -135502 13511 -223427 -154109 174076 173899 30905 -509602
18494g1132q6374A74918a98720l1816J14480G3251K2541b58833M8476B8911A3054
$$ -71132 -157506 174918 -198720 -230536 -116056 73251 95792 -258833 -210357 28911 13054
18482A99926r5685C8642A1272L3642J16935h1640n8984r1404E05972c3572H4595
$$ 199926 104241 38642 11272 44914 161849 -81640 -140624 -232028 505972 -33572 84595
18470c9980A8246J26386d40895A4585J06245a09762E339M6920R5586J50758i490
$$ -39980 18246 144632 -440895 14585 120830 -109762 5339 52259 147845 298603 -9490
18458B7347i8324l1490A72127d8813c75A86208N4247D3708h707B04863b23591
$$ 27347 -98324 -129814 172127 -48813 -375 186208 240455 43708 -8707 204863 -223591
18446g7985D9011c40676g0938k36748A01021f1024a7809k33638p7112B06602b57520
$$ -77985 49011 -340676 -70938 -307686 101021 -61024 -17809 -251447 -328559 206602 -257520
18434A4111e8933q9166E0839h432A8985b56351a26990A81578o204J83723F6425
$$ 14111 -58933 -148099 50839 -8432 18985 -256351 -126990 181578 175374 359097 66425
18422b29636d9498A11640p753E1647h1315k27098D6294J58750h1646j35867k07350
$$ -229636 -49498 111640 103887 51647 -81315 -308413 46294 205044 -81646 -217513 -424863
18411d24863A01551D3616h4532B07353a14409j45664R6130A30179K9508b28604
$$ -424863 101551 43616 -84532 207353 -114409 -260073 -163943 130179 159687 -228604
18400A89716R915P6024A7248g9673A47553A458i3054A26510m7000e6637A66390
$$ 189716 199631 275655 17248 -79673 147553 1458 -93054 126510 79510 -56637 166390
18388b1635k41860C03979c25232J22637A2579b4602n3243b00p2634j90246j7692
$$ -21635 -263495 303979 -325232 -202595 12579 -24602 -77845 -200 -72834 -263080 -280772
18377b80772D15379a94422n5544O5496n973F6853p103a83887Q6242B8631K05899
$$ -280772 415379 -194422 -249966 -184470 -190443 66853 59750 -183887 -97645 28631 234530
18366B34530h1483p6342e234j6736A28463Q5359N3787i7696F3193J36924a24216
$$ 234530 -81483 -157825 -5234 -21970 128463 213822 267609 -97696 63193 200117 -124216
18354c36785D2473a15697A78597d8013k82438A6448J4241d90148A78884a17596
$$ -336785 42473 -115697 178597 -48013 -330451 16448 30689 -490148 178884 -117596
18343d39803h2704I5696d41852R9671C619b01217B35464A13333k346Q7516a40762
$$ -439803 -82704 95696 -441852 -342181 3619 -201217 235464 113333 110987 198503 -140762
18331a53629G5825c13567e3433r7136L6186k07701B41170b59730f4428F222a05150
$$ -153629 75825 -313567 -53433 -150569 -114383 -322084 241170 -259730 -64428 6222 -105150
18319f631C667c44123I7688g2577I3176a51604N4800B73630a34488r9776q9532
$$ -6631 3667 -344123 97688 -72577 93176 -151604 -96804 273630 -134488 -234264 -323796
18308c23796E9448J51436g2873n8351l00691A39325b33331B366J3847a92594l23185
$$ -323796 59448 210884 -72873 -131224 -431915 139325 -233331 2366 16213 -192594 -515779
18297e15779a75289a4839k0976A59773A979K70285H4776b34854B47200a68390
$$ -515779 -175289 -14839 -35815 159773 1979 272264 84776 -234854 247200 -168390
18286a30315D6127J76423A00459m1170f45454C90317f9210B6f6065F9273a83621
$$ -130315 46127 222550 100459 59289 -645454 390317 -69210 26 -66065 69273 -183621
18274B52188i5326K0073j26015Q8787G7146k7655A0873b87720J31227j10836G4949
$$ 252188 -95326 -75253 -201268 -112481 77146 49491 10873 -287720 -156493 -267329 74949
18262a52853B64662b84770n6138a12983k21137E9445g8342C605J81471a01021
$$ -152853 264662 -284770 -340908 -112983 -334120 59445 -78342 3605 185076 -101021
18251a54906m5936C6369b17244B3301a06960K1351H161c4997k02730m25689a49947
$$ -154906 -200842 36369 -217244 23301 -106960 -85609 8161 -34997 -237727 -663416 -149947
18239b9844I5273b2172F8048e3597j25969p8287B5015P8392R6523c88544l88101
$$ -29844 95273 -22172 68048 -53597 -179566 -257853 25015 103407 199930 -388544 -776645
18228g76645I9933J80808g2582r7939f8079B50412j00433a53137k51812J96100
$$ -776645 99933 280741 -72582 -170521 -68079 250412 149979 -153137 -404949 -208849
18218b08849j23485e9250G2349a28116A88375e9749j99020B22879H6250d6875
$$ -208849 -332334 -59250 72349 -128116 188375 -59749 -258769 222879 86250 -46875
18207h7623H6602F880g4428A52200K1072k8607J16623a25395B82205E0726R0172
$$ -87623 86602 6880 -74428 152200 173272 144665 261288 -125395 282205 50726 140898
18196A40898B5682L8749K55865a49206M0434M0721A04534a06301j16395B3555
$$ 140898 25682 64431 320296 -149206 -108772 -68051 104534 -106301 -222696 23555
18185A53560M2994a88999A13244a52418A33052g2497B1671b57093a08705k52510
$$ 153560 196554 -188999 113244 -152418 133052 -72497 21671 -257093 -108705 -361215
18175c61215J79065A08054J52456N6523a11644n1505I4529J04725K4431A06155
$$ -361215 -182150 108054 260510 317033 -111644 -163149 94529 199254 223685 106155
18164A19174c1558I6050b6432m4169k4651E6018b04341j59555J11498n477B17126
$$ 119174 -31558 96050 -26432 -70601 -95252 56018 -204341 -363896 -252398 -257875 217126
18152b9158j85634J01940k278o5945B40203d7820l74463b04630F0280K22769G1524
$$ -29158 -214792 -112852 -115130 -181075 240203 -47820 -422283 -204630 60280 283049 71524
18140E4370K5638a9029j66664p1870e1661A65159J06710a63643c891m07124a8022
$$ 54370 80008 -19029 -185693 -257563 -51661 165159 271869 -163643 -3891 -411015 -18022
18128C03156m0640k8332c1691k9551A87235a94855r4591G7456a296j16629g893
$$ 303156 262516 234184 -31691 -61242 187235 -194855 -289446 77456 -1296 -117925 -7893
18116A85610H7835e9062B7684a00975B03370g8610j13072i4246B8140e5137k48664
$$ 185610 87835 -59062 27684 -100975 203370 -78610 -191682 -94246 28140 -55137 -303801
18105c03801B1332g3980C82a32623e6850j2986C2820b24794A18777a60882k9598
$$ -303801 21332 -73980 382 -132623 -56850 -69836 32820 -224794 118777 -160882 -190480
18094a90480B29487q3121i888j24669j7691e4325j66900C0439a65740O7020O886
$$ -190480 229487 146366 -9888 -134557 -152248 -54325 -221225 30439 -165740 -98720 -91834
18083i1834B08162e1400A88025b27969i1783A7978i7982H4419C4795d7504C70921
$$ -91834 208162 -51400 188025 -227969 -91783 17978 -97982 84419 34795 -47504 370921
18071B93491a60807B62941b22209H6872a19936C01143A31356a78580g592j04207
$$ 293491 -160807 262941 -222209 86872 -119936 301143 131356 -178580 -7592 -111799
18061a11799J5767A28124B9629H758O505a69638O2544B02701m3992b81585B4646
$$ -111799 -96032 128124 29629 8758 15263 -169638 -107094 202701 158709 -281585 24646
18049a25534J4737A27632a55360d4884A81478h93F1450Q0785H54O8722a43053
$$ -125534 -110797 127632 -155360 -44884 181478 -893 61450 142235 854 69576 -143053
18037g4912A31444K70799a40263j27179F6318O4796a45137j43739J13460i365
$$ -74912 131444 402243 -140263 -267442 66318 131114 -145137 -288876 -175416 -9365
18026a08695k4697k8625k78850A64949c3411A00179b35400i9628A60492A1383
$$ -108695 -133392 -162017 -440867 164949 -33411 100179 -235400 -99628 160492 11383
18015B85309b62938B64236q6333a44786A12115D0276P9699E3410a89924A75557
$$ 285309 -262938 264236 177903 -144786 112115 40276 119975 53410 -189924 175557
18004b8508j36796H4607h512q8637E8091P0727J38139a05460j11018C7180a93913
$$ -28508 -165304 84607 -8512 -97149 58091 128818 266957 -105460 -216478 37180 -193913
17992C66577b94257H6104g906A10680d3615H4967J89396a4972m1528B4613a52750
$$ 366577 -294257 86104 -7906 110680 -43615 84967 274363 -14972 -56500 24613 -152750
17980C52448b30098a04721A68715b56319g770A48984o5024A498a98912A83721
$$ 352448 -230098 -104721 168715 -256319 -7770 148984 83960 1498 -198912 183721
17969g9706H3036J69408H0990L7388J84664a8123A44926f7192B03763D954a55878
$$ -79706 83036 252444 80990 118378 303042 -18123 144926 -67192 203763 4954 -155878
17957B17025a14501e2157A87572a31396N8144j34411A87243J3293d305j998r7817
$$ 217025 -114501 -52157 187572 -131396 -73252 -207663 187243 200536 -4305 -6303 -104120
17946a04120a3606H1029c35771f9525k38162A34300f8495D07230e7844A10937
$$ -104120 -13606 81029 -335771 -69525 -307687 134300 -68495 407230 -57844 110937
17935a53544m9254B25664B4722f8777C16622H8120a86748A40399a93109N2521
$$ -153544 -202798 225664 24722 -68777 316622 88120 -186748 140399 -193109 -140588
17925a40588j20805F0232d64840a42955A25848L32637a49599K4000A39241d3093
$$ -140588 -261393 60232 -464840 -142955 125848 458485 -149599 -125599 139241 -43093
17914g3495I7694a2574C07444e0163A18025K4178C4786b68318l4094k1318A06811
$$ -73495 97694 -12574 307444 -50163 118025 142203 34786 -268318 -302412 -323730 106811
17902I3558M3414n3097g6820k2408A53899A9398D934g2942c3313A47634J93692
$$ 93558 136972 83875 -76820 -99228 153899 19398 4934 -72942 -33313 147634 341326
17891C41326b31707G9481E8g3583r7737b9532j50418q344F4036J07800a22146
$$ 341326 -231707 79481 58 -73583 -171320 -29532 -179950 -188294 64036 171836 -122146
17879E5764c29224B64867q9397k9189b49859A03129D3807L06379a18213p3442
$$ 55764 -329224 264867 175470 146281 -249859 103129 43807 350186 -118213 -191655
17869a91655C24007g1486A50769b7162A98930i3091L9559B39520b07521B40727
$$ -191655 324007 -71486 150769 -27162 198930 -93091 -53532 239520 -207521 240727
17858c49859I9593a80645H8301a50104J5042B1754b17725f7547F9007a1276l8708
$$ -349859 99593 -180645 88301 -150104 -135062 21754 -217725 -67547 69007 -11276 -49984
17847d9984j68332b7744j85298F3337J43408D1300A5994M3192K4658J24067J3016
$$ -49984 -218316 -27744 -213042 63337 206745 41300 15994 59186 83844 207911 220927
17836B20927a05502j94020J25816k21201h0414k45302A442i1692k2417D3523J95125
$$ 220927 -105502 -299522 -173706 -394907 -80414 -325716 1442 -91692 -114109 43523 238648
17825B38648a10733b3322a550H0581j9253e8264l7317A46798d7671k63570f9579
$$ 238648 -110733 -23322 -1550 80581 61328 -58264 -95581 146798 -47671 -311241 -69579
17813D7568a18853K0824A7064a5389C2644d027A88310J1154d6539A31691a57435
$$ 47568 -118853 -98029 17064 -15389 32644 -4027 188310 199464 -46539 131691 -157435
17801a11583q5619a1880H9793K65719c8493r2910A44479J61536b60288h7619C24844
$$ -111583 -197202 -11880 89793 355512 -38493 -131403 144479 306015 -260288 -87619 324844
17789A77203J1000g6772j6723j16964N3544B37320m5640q7102a3008B099b48769
$$ 177203 188203 -76772 -93495 -210459 -156915 237320 191680 104578 -13008 2099 -248769
17777F2066J4308C8078P9827a5442n9624B40268J93812B9121g2230B50430f7333
$$ 62066 76374 38078 117905 -15442 -75066 240268 434080 29121 -72230 250430 -67333
17765a75845h7775D52264c68330a81615gl1512B7277K06771O581h8337A41095
$$ -175845 -87775 452264 -368330 -181615 -7 -31519 27277 234048 240629 -88337 141095
17753b28900d7545E1600a04297B7327g2929H8634a14183l8901B02651b7043D3295
$$ -228900 -47545 51600 -104297 27327 -72929 88634 -114183 -153084 202651 -27043 43295
17741A91794a01449k42272A87817a07516j42632R0060G7226d4608C82331a36872
$$ 191794 -101449 -343721 187817 -107516 -250148 -160088 77226 -44608 382331 -136872
17730B48692a80294C5252a70735c8892C55120a56320L0756r1453A28268b49162
$$ 248692 -180294 35252 -170735 -38892 355120 -156320 -125564 -217017 128268 -249162
17719A76067c69161D00002A45583m4241j6685M4050R8334g7519A21920a22295
$$ 176067 -369161 400002 145583 101342 84657 128707 227041 -77519 121920 -122295
17708C9692d0294a693B2795g0802A4728M4366g4995B05642c04634a45476B48919
$$ 39692 -40294 -1693 22795 -70802 14728 59094 -74995 205642 -304634 -145476 248919
17696D2052N6044b24895a08958d4268l46117B25511a46759A34789F5156J65040
$$ 42052 98096 -224895 -108958 -44268 -390385 225511 -146759 134789 65156 230196
17686B30196c0006A21486L020b23102A39255K00817b64602C4698a79747m6162
$$ 230196 -30006 121486 124506 -223102 139255 340072 -264602 34698 -179747 -225909
17676b25909C49593h3376A66687g2625A78181A7385L9400N983a2274p76A02229
$$ -225909 349593 -83376 166687 -72625 178181 17385 56785 62768 -12274 -13050 102229
17664C81111i7325L9054m03328B06241n1747N0746a06351L0975c0394j32549j26585
$$ 381111 -97325 -58271 -461599 206241 154494 205240 -106351 -75376 -30394 -162943 -289528
17653b89528A38039c6353A76541R3382a8740o6655C4071c5064m30909C71712D3056
$$ -289528 138039 -36353 176541 269923 -18740 -85395 34071 -35064 -465973 371712 43056
17641A31188c3492C18383A09172c65093G591c59422B15501a09538m4485B399d0237
$$ 131188 -33492 318383 109172 -365093 7591 -359422 215501 -109538 -154023 2399 -40237
17629h0511a2169B17110D2297b34382B69396e8030C43504h7074H8425J92884j17918
$$ -80511 -12169 217110 42297 -234382 269396 -58030 343504 -87074 88425 281309 163391
17618A63391K3026N0219G638J4776J49621a13956A02661c9155r8510A85916F6669
$$ 163391 186417 236636 7638 22414 172035 -113956 102661 -39155 -137665 185916 66669
17606a41797a7328k35718e7152j51431B49058H9672J7927K42544A33694Q6135
$$ -141797 -17328 -253046 -57152 -208583 249058 89672 107599 350143 133694 219829
17596B19829b68059Q4965A39766L02424A68226F1844e7390J6229B08151b28596
$$ 219829 -268059 -183094 139766 442190 168226 61844 -57390 -41161 208151 -228596
17585A00594a77992N6962b2046C40518A1700L91363a50088d6967B15182a22916
$$ 100594 -177992 -121030 -22046 340518 11700 403063 -150088 -46967 215182 -122916
17574a66600D6813J98531C5876L63491b10890A41383b5970C11515C5901p214K9803
$$ -166600 46813 245344 35876 399367 -210890 141383 -25970 311515 35901 28687 58490
17563E8490k2023N4349K8243a03000d2534k13942C27421D4342L4815a9701q3960
$$ 58490 36467 90816 119059 -103000 -42534 -256476 327421 44342 79157 -19701 -103661
17552a03661g938o0793C70230j84167O2850a7343j00359j24553g490l1780D80099
$$ -103661 -7938 -68731 370230 186063 248913 -17343 -117702 -242255 -7490 -39270 480099
17540E0965O9179J12793C4782P7417D9136a4355C98798I2325C5721d7611A76970
$$ 50965 120144 232937 34782 112199 49136 -14355 398798 92325 35721 -47611 176970
17528a41227E9732J94850C7753M95936k10641e512A83794K23056j88566d6119
$$ -141227 59732 254582 37753 533689 323048 -5512 183794 406850 218284 -46119
17517a44189c8529C43741j63818J53054b13650B65815J14487A21405h0674A07533
$$ -144189 -38529 343741 179923 332977 -213650 265815 380302 121405 -80674 107533
17506a95801C34213b5822A1353J75872b51553I6020D4574K65468a85637c8215
$$ -195801 334213 -25822 11353 187225 -251553 96020 44574 310042 -185637 -38215
17495A26928n372N6405C3857c9214A25820b05792L8332A27283R3939C8677K44324
$$ 126928 121556 177961 33857 -39214 125820 -205792 -167460 127283 221222 38677 283001
17484B83001h2025a2070A74069f042m6835D3791K74286j48766D1653O7727R3643
$$ 283001 -82025 -12070 174069 -6042 -52877 43791 318077 169311 41653 109380 203023
17473B03023K7214a01691C60937A34409j5998J816K34268n0036a2096F8820K8894
$$ 203023 230237 -101691 360937 134409 118411 120227 354495 304459 -12096 68820 97714
17462I7714K4913D9424j0284J74291N3979A2315J61332H2938L03331J6287J19437
$$ 97714 122627 49424 39140 213431 267410 12315 173647 82938 386269 402556 521993
17451E21993b05149C31398A49478N2157K32681j47447J06183j90805K29615j94505
$$ 521993 -205149 331398 149478 201635 434316 286869 393052 202247 431862 237357
17441B37357Q4165M6963B3616J91422J84344j16237G8595J84047K17140n7717
$$ 237357 321522 368485 23616 215038 399382 283145 78595 262642 479782 422065
17431D22065K59188B78688H7198K67632K1864o7553R495G5639J93669o8150K59596
$$ 422065 681253 278688 87198 354830 376694 309141 318636 75639 269308 201158 460754
17420D60754B11845a23424k43457B49942G3982R4603J17363J21418j64241M7909
$$ 460754 211845 -123424 -366881 249942 73982 168585 285948 407366 243125 291034
17410B91034m170H207P6013J97482D4286B425J23320j7508B6487K55421j4246
$$ 291034 286864 8207 84220 281702 44286 2425 125745 108237 26487 281908 267662
17399B67662d0205N357A91050J37165j50707b19736C08479k046m4893a48739C53499
$$ 267662 -40205 -34848 191050 328215 177508 -219736 308479 306433 261540 -148739 353499
17387G1194J65800A699g0979B62867K49005A8674K76657B1201M40560j32190A07079
$$ 71194 236994 1699 -70979 262867 511872 18674 295331 21201 461761 329571 107079
17375E05763a30549e3697A29093a08952C63365E0910J00088l8046K24712n7212
$$ 505763 -130549 -53697 129093 -108952 363365 50910 150998 112952 337664 280452
17365B80452o8917f2869E4630i3959C06670A33264J85304k7590Q4040k6207a20491
$$ 280452 211535 -62869 54630 -93959 306670 133264 318568 290978 375018 348811 -120491
17353B58376j06611K5000B9570Q3487L52067A6211d6390C26233N772P7310n949
$$ 258376 151765 176765 29570 113057 465124 16211 -46390 326233 332005 409315 403366
17342D03366G4680O8905L1257H6011J5560J01628e9589B08767a27847B44355l9254
$$ 403366 74680 143585 174842 86011 101571 203199 -59589 208767 -127847 244355 205101
17331B05101K58424A18299l9500K93807j73712j1562J39644r1804K23495B1706
$$ 205101 463525 118299 78799 372606 198894 187332 326976 235172 458667 21706
17320G4629J75103K78575A31734N1697J89241q1786A23843P9258G4468K78695
$$ 74629 249732 528307 131734 183431 372672 290886 123843 203101 74468 353163
17310C53163J27774N3203e8464A71892k5098K4396E9234b1923A59017G0530J61473
$$ 353163 480937 534140 -58464 171892 146794 171190 59234 -21923 159017 70530 232003
17299B32003r5313L34123b3734A57833J29405J09888j58740m3110K86882p3428
$$ 232003 136690 470813 -23734 157833 287238 397126 238386 195276 482158 408730
17289D08730J03821k46861J51674e9665B3469K82418J03938G0876L28409A24503
$$ 408730 512551 265690 417364 -59665 23469 305887 409825 70876 399285 124503
17278B85524H3319f8560C50175K84252A67229R0101N0494J15898a3918A54479
$$ 285524 83319 -68560 350175 634427 167229 257330 307824 423722 -13918 154479
17267A30455d169A38170J31750J77913A66485Q3016G8046K71216R7402j87296
$$ 130455 -4169 138170 269920 447833 166485 249501 78046 349262 446664 259368
17257B59368M39I3656M36857k62216a33742k50651B12734J82211l5057M9258p8501
$$ 259368 259807 93656 530513 268297 -133742 -384393 212734 394945 359888 409146 330645
17246C30645o3839R1424r2964G5623J79048F8890o031K42170J85481A35415K85428
$$ 330645 266806 358230 265266 75623 254671 68890 62859 305029 490510 135415 420843
17235D20843J52601j65707A04899O7983E7557L90810B22160m1196J98389j46824
$$ 420843 573444 407737 104899 172882 57557 448367 222160 180964 379353 232529
17225B32529j10927M21563j76540r2397k0968P6769j1766E0836M06899b03432
$$ 232529 121602 543165 366625 274228 253260 330029 318263 50836 457735 -203432
17214E61995A04148A4402J79287J00775L1720A52968Q7406K01140j82076q3586
$$ 561995 104148 14402 193689 294464 326184 152968 240374 441514 259438 175852
17204A75852Q0782M8604k2590j40550K2273O3516M8230K52993B50512K3780K48744
$$ 175852 256634 305238 282648 142098 164371 227887 276117 529110 250512 274292 523036
17193E23036j64029K354A16878b3918C78278j45920K59269j04332j44682K37548
$$ 523036 359007 361361 116878 -23918 378278 232358 491627 387295 242613 480161
17183D80161o6321Q6342Q3857B00786L30105p4336r8783P6868k7954B00072O717
$$ 480161 413840 500182 584039 200786 530891 456555 357772 434640 406686 200072 206789
17172B06789K09955j40640k9211l5386r084K23870M674A47643K13045f2905B73755
$$ 206789 416744 276104 246893 211507 202423 426293 430967 147643 360688 -62905 273755
17160A09618J25415q456J73694j26231J54555N35574d0485C91762A60778Q3584
$$ 109618 235033 226577 400271 274040 428595 964169 -40485 391762 160778 244362
17150B44362K32372j73554j9950L5276K71127B69509K97868M024R3774C05447
$$ 244362 476734 303180 283230 318506 589633 269509 567377 571401 665175 305447
17139B1175M06732j29480R6098N5021r3151o5438Q9584K22934j27722J30385A76796
$$ 21175 427907 298427 394525 449546 356395 290957 380541 603475 475753 606138 176796
17127D26972p2221J09778K61930l19995L9842j64577m6537K48842B17795J82267
$$ 426972 354751 464529 726459 406464 446306 281729 235192 484034 217795 400062
17117D00062J07088L31942C78412L71586l12731K21690k70857J43156K36532l15367
$$ 400062 507150 839092 378412 749998 437267 658957 388100 531256 767788 452421
17107D52421K41170C39527n78K06323J74682B96887d68C20800K37054j09688q9660
$$ 452421 693591 339527 338949 545272 719954 296887 -468 320800 557854 448166 358506
17096C58506q8047J24636A66918K13049K84292k96076j20441K87697k9519J32660
$$ 358506 270459 395095 166918 379967 664259 368183 247742 535439 505920 638580
17086F38580k51818k3323m3562O69609B78349K91469l7808j27561L35532M4075
$$ 638580 386762 363439 319877 989486 278349 569818 532010 404449 739981 784056
17076G84056C62420K36758j8394K8769k39827j48849L30157j26025P5760k32869
$$ 784056 362420 599178 580784 609553 369726 220877 551034 425009 500769 267900
17066B67900K59344j21050L636K22126j0894K16852l88650J32191K11994l36269
$$ 267900 527244 406194 409830 631956 621062 837914 449264 581455 793449 457180
17056D57180K32415j19141J07562k81233l51p7121P5267J22495q624K61769k65487
$$ 457180 689595 570454 678016 396783 396432 319311 394578 517073 508449 770218 504731
17045E04731N0051L34580l52111p0617L12102j00794L61233k53242k11501j76483
$$ 504731 554782 889362 537251 466634 778736 677942 1039175 785933 574432 397949
17035C97949L60430M4238k5571l58393K87188k85945N28932l56711n3947j1574
$$ 397949 758379 802617 777046 418653 705841 419896 948828 592117 538170 526596
17025E26596J17866j3625N6755p7414J26594K42847l42630j9550L97392k94676
$$ 526596 644462 630837 687592 610178 736772 979619 636989 617439 1014831 720155
17015G20155L52791k0900D09249M16085N433p9250k5910J06376j05938K35936
$$ 720155 1072946 1052046 409249 825334 830767 751517 725607 831983 726045 961981
17005I61981j50901P116R3482j2246m0774M368K70891n23234J87160K02873J7173
$$ 961981 811080 818196 911678 899432 858658 863026 1133917 610683 797843 1000716 1017889
16994A017889k6692m7113o0830r2574L51630Q2504K70818k81889l98206P0723
$$ 1017889 991197 944084 883254 790680 1142310 1224814 1495632 1213743 815537 886260
16984H86260k2049Q0513n552K9498j2069K58964l29392J39752j48688L87362j03825
$$ 886260 864211 944724 939172 968670 956601 1215565 886173 1025925 877237 1264599 1160774
16973A160774K83361G18635R3247N44956n06176M16415m96620J90552j94686K16396
$$ 1160774 1444135 718635 811882 1356838 850662 1267077 770457 961009 766323 982719
16963I82719J51631P7115j18501J67396R3306k76402J8523P8931q7111r9326L26635
$$ 982719 1134350 1211465 1092964 1260360 1353666 1077264 1095787 1174718 1087607 988281 1314916
16952A314916r5316l0047j33915k36784N44895J05283p6541k94035J44768K43458
$$ 1314916 1219600 1189553 1055638 818854 1363749 1469032 1392491 1098456 1243224 1486682
16942A486682j75611J60147J50106k63326J82016m09802M26357P9223k20826Q7884
$$ 1486682 1311071 1471218 1621324 1357998 1540014 1130212 1556569 1635792 1414966 1502850
16932A502850J7219K67344m14821K55694J90202J70439l01704P9731k27679K83632
$$ 1502850 1520069 1787413 1372592 1628286 1818488 1988927 1687223 1766954 1539275 1822907
16922A822907j43891M883R8176k32799L50852n072k85350m9734M37506m14013
$$ 1822907 1679016 1683899 1782075 1549276 1900128 1895056 1609706 1559972 1997478 1583465
16912A583465M65893j80859j13P7082O2124j26395O2261l58956P92390m54316
$$ 1583465 2049358 1868499 1868386 1945468 2007592 1881197 1943458 1584502 2376892 1922576
16902A922576K69099k76511J9884R0377J407K88968k87959K98645o0739R5473
$$ 1922576 2191675 1915164 1935048 2025425 2026832 2315800 2027841 2326486 2265747 2361220
16892B361220J77022p8076m44076K97619O9896k24034O57186j52351J38522m27476
$$ 2361220 2538242 2460166 2016090 2313709 2383605 2159571 2816757 2664406 2802928 2375452
16882B375452K49098l37067J67410M7207J24748M3091j10004K30659j5960J57833
$$ 2375452 2624550 2287483 2454893 2502100 2626848 2669939 2559935 2790594 2774634 2932467
16872B932467m2566m6907J19748J25445J65257l06487n2469Q9492K69807j23011
$$ 2932467 2889901 2842994 2962742 3088187 3253444 2946957 2894488 2983980 3253787 3130776
16862C130776K26991L3l2293K28227j46309q4012J21012K37859k38799n6163O43755
$$ 3130776 3357767 3357800 3325507 3553734 3407425 3323413 3444425 3682284 3443485 3387322 4031077
16851D031077l66528O52720n30210K83424P9820l13119M47100J7992K91075o0894
$$ 4031077 3664549 4317269 3787059 4070483 4150303 3837184 4284284 4302276 4593351 4532457
16841D532457P0631K10841k36136l32258N88576K20139j44856K08391K90108j0892
$$ 4532457 4603088 4813929 4577793 4245535 4834111 5054250 4909394 5117785 5407893 5397001
16831E397001l02282M15807J72873K01621k83258N87530j00407M2243L15559J83930
$$ 5397001 5094719 5510526 5683399 5885020 5601762 6189292 6088885 6131128 6446687 6630617
16821F630617m35274M88318J1521L30698K7832K68704R5700L626J17692Q5837
$$ 6630617 6195343 6683661 6695182 7025880 7053712 7322416 7418116 7421742 7539434 7625271
16811G625271P1523M41736L32266J70466N7620o5317N33037P6902L78631J42557
$$ 7625271 7696794 8138530 8470796 8641262 8698882 8633565 9166602 9243504 9622135 9764692
16801I764692J87231J98306L52585Q4241J70363P61449k33456K83113K91197O64583
$$ 9764692 9951923 10150229 10502814 10587055 10757418 11518867 11285411 11568524 11859721 12524304
16791A2524304L14243L54853L91870J43658L95823N79520L25328L33703L95668
$$ 12524304 12838547 13193400 13585270 13728928 14124751 14704271 15029599 15363302 15758970
16782A5758970P36027J32942O70695P86942N252J138719M21434O14039Q56674
$$ 15758970 16494997 16627939 17298634 18085576 18090828 19229547 19650981 20265020 21121694
16773B1121694M35152O05420J100744N55180P93467J331514N13142J217948R68274
$$ 21121694 21556846 22162266 23263010 23818190 24611657 25943171 26456313 27674261 28642535
16764B8642535J041693J511040J168531J321586J409873J621199J571284J668990
$$ 28642535 29684228 31195268 32363799 33685385 35095258 36716457 38287741 39956731
16756C9956731J676521J933017K499689J757877K392440K335056K818520K622748
$$ 39956731 41633252 43566269 46065958 47823835 50216275 52551331 55369851 57992599
16748E7992599L105377L365030L405159L532489L827247M020174M631252M661912
$$ 57992599 61097976 64463006 67868165 71400654 75227901 79248075 83879327 88541239
16740H8541239M985117N128015N531601O164307O301861O533084O447489O460133
$$ 88541239 93526356 98654371 104185972 110350279 116652140 123185224 129632713 136092846
16732A36092846P271217O920103O538769O939962N727850N786142M875099M363551
$$ 136092846 143364063 150284166 156822935 163762897 169490747 175276889 180151988 184515539
16724A84515539L146193K675602J456377J019829p22750n94021j706752k560827
$$ 184515539 187661732 190337334 191793711 192813540 192090790 191496769 189790017 187229190
16716A87229190l800320l816950m683440n339667n796140o039561o800429o824087
$$ 187229190 183428870 179611920 174928480 169588813 163792673 157753112 150952683 144128596
16708A44128596o786301p035413o841729o933140n983260o228483n948931n074537
$$ 144128596 137342295 130306882 123465153 116532013 110548753 104320270 98371339 93296802
16700I3296802n798858m675046m483602m147349m277402l566832l458698l491449
$$ 93296802 87497944 82822898 78339296 74191947 69914545 66347713 62889015 59397566
16692E9397566k985080k919980k986669k401903k216280k556313j964109j913647
$$ 59397566 56412486 53492506 50505837 48103934 45887654 43331341 41367232 39453585
16684C9453585j829556j615722j605970j499315j678985j158589j206288j215234
$$ 39453585 37624029 36008307 34402337 32903022 31224037 30065448 28859160 27643926
16676B7643926q08507j108524j316402p34764j029898q12745q53447m99043r11353
$$ 27643926 26835419 25726895 24410493 23675729 22645831 21833086 20979639 20480596 19569243
16667A9569243r41928r8186p74078o26528q03395j97353j78251r54284m92536
$$ 19569243 18627315 18529129 17755051 17128523 16325128 16127775 15949524 14995240 14502704
16658A4502704k39220n64778n20368k86242m76518k53565m66029o3449m99726
$$ 14502704 14263484 13698706 13178338 12892096 12415578 12162013 11695984 11632535 11132809
16649A1132809m42400j80817j42086l11097j56485o17376k72212J81798n35028
$$ 11132809 10690409 10509592 10367506 10056409 9899924 9282548 9010336 9192134 8657106
16640H657106k34615n27405R8737j73007j67028P672k74486l84343k76781k2899
$$ 8657106 8422491 7895086 7993823 7820816 7653788 7661460 7386974 7002631 6725850 6702951
16630F702951j9690L5688m18792r7177r4522l18423m5564m5039O4239l03623Q9426
$$ 6702951 6683261 6718949 6300157 6202980 6108458 5790035 5744471 5699432 5763671 5460048 5549474
16619E549474k99268r924n1336j66931k70996p3168J8772l21995J23702j48588
$$ 5549474 5250206 5240282 5188946 5022015 4751019 4677851 4696623 4374628 4498330 4349742
16609D349742m52673L10640M6642k63621j60179k347l8075N9309n8240k07172
$$ 4349742 3897069 4207709 4254351 3990730 3830551 3828204 3790129 3849438 3791198 3584026
16599C584026L2157o2818K3298r2224P1134m45015J01325J41328j76278m8905
$$ 3584026 3616183 3553365 3576663 3484439 3555573 3110558 3211883 3353211 3176933 3128028
16589C128028P2557K22436n56102j46127L9825L64762k85497k59455M00796r6420
$$ 3128028 3200585 3423021 2866919 2720792 2760617 3125379 2839882 2580427 2981223 2884803
16579B884803l95088J3863J2843K66997j99665k96684L54181k15714J7891k32909
$$ 2884803 2489715 2503578 2516421 2783418 2583753 2287069 2641250 2425536 2443427 2210518
16569B210518K03303k16014J52717j24854Q7195k12637J25360J13281m23449J67618
$$ 2210518 2413821 2197807 2350524 2225670 2312865 2100228 2225588 2338869 1915420 2083038
16559B083038j7289l97542L86365p8173K93916k60616k03904p5895K2163K08318
$$ 2083038 2065749 1668207 2054572 1976399 2270315 2009699 1805795 1729900 1752063 1960381
16549A960381j37548k18361J18542k6847j44648J44199Q6822l89021J73138j98554
$$ 1960381 1822833 1604472 1723014 1696167 1551519 1695718 1782540 1393519 1566657 1368103
16539A368103J11325L11145k04915n14l07007L67070j07894K75909n89803L2359
$$ 1368103 1479428 1790573 1585658 1585144 1278137 1645207 1537313 1813222 1223419 1255778
16529A255778K1109Q5368J65681k54953J87809j70014L19950n95257K75178j4729
$$ 1255778 1276887 1362255 1527936 1272983 1460792 1290778 1610728 1015471 1290649 1275920
16519A275920n9306M5507j47109K8065K15050K3712o28929J71933K19807J43273
$$ 1275920 1216614 1262121 1115012 1143077 1358127 1381839 752910 924843 1144650 1287923
16509A287923j10776O263j90448R8991n5830m0727k07232L31801j82787j33154
$$ 1287923 1177147 1183410 992962 1091953 1036123 995396 788164 1119965 937178 804024
16499H04024K36532Q7790n36353M02143l11149L85108j2371k40424j63722M76940
$$ 804024 1040556 1128346 591993 994136 682987 1068095 1055724 815300 651578 1128518
16489A128518k59459M4025K21636n66521L02332j26824K36233p2004K7832o2179
$$ 1128518 869059 913084 1134720 568199 870531 743707 979940 907936 935768 873589
16479H73589n2813P9995j90836J95522j13775l8111J9072J92941l5584k23362
$$ 873589 820776 900771 709935 905457 791682 753571 772643 965584 930000 706638
16469G06638j57993n1769N9477M60263k78663L34434m00684M1644M8834K14467
$$ 706638 548645 496876 556353 1016616 737953 1072387 671703 713347 762181 976648
16459I76648l15624K07925l04205k65575L03632j20250n1753K66716j2887J03085
$$ 976648 661024 868949 564744 299169 602801 482551 430798 697514 684627 787712
16449G87712n0277K16645C20957M35235k43074R2706J16310q6174B78057N72761
$$ 787712 737435 954080 320957 756192 513118 605824 722134 635960 278057 850818
16439H50818C18252N16561j87088J49587j35846P8437C49654K42830j69668J46634
$$ 850818 318252 834813 647725 797312 661466 739903 349654 592484 422816 569450
16429E69450L92673l85322k9841J8806J18422j73686J44358Q248j21816K9504
$$ 569450 962123 576801 546960 565766 684188 510502 654860 663108 541292 570796
16419E70796j65378O2494K50919k77415P7291m5445K10544C41797J93675k45566
$$ 570796 405418 467912 718831 441416 518707 473262 683806 341797 535472 289906
16409B89906L59659j65991j56222J34017M14385m3645C85413F7460L38766J23409
$$ 289906 649565 483574 327352 461369 875754 832109 385413 67460 406226 529635
16399E29635m0709k6596k4031m0985j61944K09157P0391r5238J08806k51286P7402
$$ 529635 488926 462330 438299 397314 235370 444527 514918 419680 528486 277200 354602
16388C54602k2514P5940Q0759j03758J4972j21872j2734a2914A95812J35043K68357
$$ 354602 332088 408028 488787 385029 400001 278129 265395 -12914 195812 330855 599212
16377E99212j10198m9881J39641j62207c9202B75147G8137a12877B76182f725
$$ 599212 489014 439133 578774 416567 -39202 275147 78137 -112877 276182 -6725
16366C96496K49593B88711P492J18761p8644J40410A77006M36234j51242o6307
$$ 396496 646089 288711 296203 414964 336320 476730 177006 613240 461998 395691
16356C95691j37073J22545J46773k62520M9364L77537B20688B3060L52760j40087
$$ 395691 258618 381163 527936 265416 314780 692317 220688 23060 375820 235733
16346B35733K07989k02680L08091A50990K1743N0757K74080h4305A27532J57126
$$ 235733 443722 241042 549133 150990 172733 223490 497570 -84305 127532 284658
16336B84658R5368j07829K8661a23363C66657A67017K45943J05438I9959J61555
$$ 284658 380026 272197 300858 -123363 366657 167017 412960 518398 99959 261514
16326B61514q5969n478J22350j21465a2908C24838M5568j32260m5094L04689g8218
$$ 261514 175545 170067 292417 170952 -12908 324838 370406 238146 193052 497741 -78218
16314A61336J8025G3045N91247B28902K33265o381A17709B7437a5230m6459A65754
$$ 161336 179361 73045 664292 228902 462167 455786 117709 27437 -15230 -61689 165754
16302C40632a0759d328j07666C23683c3502C2531Q2151d4886D97145k25495A26366
$$ 340632 -10759 -4328 -111994 323683 -33502 32531 114682 -44886 497145 271650 126366
16290F6166L8975K1421l9950K2882A1069b65595J18043D7533e769A74392J1487
$$ 66166 105141 126562 86612 109494 11069 -265595 -147552 47533 -5769 174392 185879
16279A85879K20288B01979J21444C9016a29466G8050L52268A5236J57869Q269
$$ 185879 406167 201979 323423 39016 -129466 78050 430318 15236 173105 181374
16269A81374l8838K26563L3438F8994c6144D3594L73207k01078k9915B299L5728
$$ 181374 142536 369099 402537 68994 -36144 43594 416801 215723 185808 2299 38027
16258C8027Q5108A5547J23860c2288K430p0392E0138B730L94134a08139A32633
$$ 38027 123135 15547 139407 -32288 -29858 -100250 50138 2730 396864 -108139 132633
16246I1671B5666J63988J44208j23686P4477A09602e3935A04858O28131A3502
$$ 91671 25666 189654 333862 210176 284653 109602 -53935 104858 732989 13502
16235A75915a09425p425d1177C87245r6452H2760q270j6699i8432A55567o5585
$$ 175915 -109425 -116850 -41177 387245 290793 82760 74490 57791 -98432 155567 89982
16224H9982J9190h1409A83713n3983c5815D6024J01168C3859K31325r8108j5447
$$ 89982 109172 -81409 183713 129730 -35815 46024 147192 33859 265184 167076 151629
16213A51629J80291e1533n307C06749j20501O0327a02357K2486q8488B45536a49753
$$ 151629 331920 -51533 -56840 306749 186248 246575 -102357 -79871 -168359 245536 -149753
16201D680K98352A33092b7044A88036a269j38553B4165R6195a8995j36219b0456
$$ 4680 303032 133092 -27044 188036 -1269 -139822 24165 120360 -18995 -155214 -20456
16189g3304p7506E3117j6323K33256B2563J82198a28487B98912j17371a59592
$$ -73304 -150810 53117 36794 270050 22563 204761 -128487 298912 181541 -159592
16178c77564g6662P697A42373N2423N8206C9542J17628a92221a5044j45014e6056
$$ -377564 -76662 -68965 142373 194796 253002 39542 157170 -192221 -15044 -160058 -56056
16166H4122l1929L41568c6963o4070B39968B8201b77261A8087g8800b5738B90570
$$ 84122 52193 393761 -36963 -101033 239968 28201 -277261 18087 -78800 -25738 290570
16154A56383J97179i0660A52447a14505B23674b76759A42351E7348K908a03782
$$ 156383 353562 -90660 152447 -114505 223674 -276759 142351 57348 60256 -103782
16143a91466B04743a09761K8014A25619m7624C774h6261A65220c5489j50467B9983
$$ -191466 204743 -109761 -81747 125619 77995 3774 -86261 165220 -35489 -185956 29983
16131A62735a89143c8485A33421L0532g4036L2158a0727r1310A77103R2236a5608
$$ 162735 -189143 -38485 133421 163953 -74036 -41878 -10727 -102037 177103 269339 -15608
16119F4519a3530H5935a62506c8633A87254F7129k0578j8850K34358e9930A98461
$$ 64519 -13530 85935 -162506 -38633 187254 67129 46551 27701 262059 -59930 198461
16107C225K15801a10043B72223A05599J19721F8278A0252N3855J33660A9252a33967
$$ 3225 219026 -110043 272223 105599 225320 68278 10252 64107 197767 19252 -133967
16095A09923K6498F1233c92572E2097a37236a1378j64452l39A22408l7469M6781
$$ 109923 136421 61233 -392572 52097 -137236 -11378 -175830 -176169 122408 84939 131720
16084A31720j5263a95388B8406b4008k65304A73148b19567a531j96833D05413
$$ 131720 116457 -195388 28406 -24008 -289312 173148 -219567 -1531 -198364 405413
16073A39937b41403R5585r8074Q32B56194a8690j30994b4570l23832A2085h4148
$$ 139937 -241403 -145818 -243892 -243060 256194 -18690 -149684 -24570 -348402 12085 -84148
16061d9377J0271a7531A17299f1673C0151a37191J6349p8690K7267A378J62789
$$ -49377 -39106 -17531 117299 -61673 30151 -137191 -120842 -199532 -172265 1378 164167
16050A64167m7204m3195B1300h7939l0569a144A14781b4527A86890c12899R8696
$$ 164167 116963 73768 21300 -87939 -118508 -1144 114781 -24527 186890 -312899 -214203
16039b14203k01252c8065n6397l4927B41521a3187k75174J09790e8431k4883k10255
$$ -214203 -415455 -38065 -94462 -129389 241521 -13187 -288361 -178571 -58431 -83314 -293569
16028b93569A44048K4465h7835A85512B4549a31223c47k50600A06961E2394P6203
$$ -293569 144048 168513 -87835 185512 24549 -131223 -347 -250947 106961 52394 128597
16017A28597J33880a49727c3602j02698d711j77490j3547h5659L5473J7638k56396
$$ 128597 262477 -149727 -33602 -136300 -4711 -182201 -195748 -85659 -50186 -32548 -288944
16006b88944A00667A5163a84912C70259j39230q8379b1757c490F5517b54811c1358
$$ -288944 100667 15163 -184912 370259 231029 142650 -21757 -3490 65517 -254811 -31358
15994A03906a39217c3189k50908P9225k98458C2896J25215b01523c8767B71824
$$ 103906 -139217 -33189 -284097 -204872 -503330 32896 158111 -201523 -38767 271824
15983C21672a22931H9650j7023N13341B22818n4693j6410e3306A91786d37233
$$ 321672 -122931 89650 72627 585968 222818 168125 151715 -53306 191786 -437233
15972h0637k89745a28418c5595A34774D3742J34988c1408I3193a87512j82112
$$ -80637 -370382 -128418 -35595 134774 43742 178730 -31408 93193 -187512 -369624
15962c69624I9630m6250a48523f6069A16096D2240Q5211f142B49309a01658G9899
$$ -369624 99630 53380 -148523 -66069 116096 42240 127451 -6142 249309 -101658 79899
15950H6264A8535K21321D6376b92577a32860L1810j19360B82414A2471K79231
$$ 86264 18535 239856 46376 -292577 -132860 -101050 -220410 282414 12471 291702
15940B91702a59747P3990j84026e6671C51807a00990q8284D6394e4397J9510I712
$$ 291702 -159747 -85757 -269783 -56671 351807 -100990 -189274 46394 -54397 -34887 9712
15928B31768d4568A94242C8199c11064A0231a01183B5025a36009A67426J54385
$$ 231768 -44568 194242 38199 -311064 10231 -101183 25025 -136009 167426 321811
15918C21811a23002I2627L27942b19478B7845Q1962a03290H64N1672L6051B3331
$$ 321811 -123002 92627 420569 -219478 27845 109807 -103290 864 52536 88587 23331
15906a26352q7312a05869g221C82550i4525A93894r3802M8923F9277L09024b50990
$$ -126352 -213664 -105869 -7221 382550 -94525 193894 100092 149015 69277 378301 -250990
15894B31609n4068c03212E69132a40403p3056I8694b6740G1488E103a39433H5947
$$ 231609 177541 -303212 569132 -140403 -213459 98694 -26740 71488 5103 -139433 85947
15882A7798L0465J10508A4157R2447a49436P4223a59o5708b4069a1029q9040m8913
$$ 17798 48263 158771 14157 106604 -149436 -75213 -159 -65867 -24069 -11029 -100069 -148982
15870a48982A19210d95931A41176m1866M3793c19459a57543o0131C28734B7346
$$ -148982 119210 -495931 141176 99310 143103 -319459 -157543 -217674 328734 27346
15859A45266B28Q2175J57370n8800B3892K8356K81438D9450a77385f635j58214
$$ 145266 228 82403 239773 180973 23892 52248 333686 49450 -177385 -6635 -164849
15848a64849l4661M2899f5475k78199A4124J22481a11099A85521c86786a24516
$$ -164849 -199510 -156611 -65475 -343674 14124 136605 -111099 185521 -386786 -124516
15837a14070F4469e367B81619A26213l3121K77c3189E8192a79297B39489C9085
$$ -114070 64469 -5367 281619 126213 93092 93369 -33189 58192 -179297 239489 39085
15825d4726B0405a55542A81436a11525l0514c1833A53004C2080b64706P9861D9903
$$ -44726 20405 -155542 181436 -111525 -142039 -31833 153004 32080 -264706 -184845 49903
15813h7452K6977j3206j69088b7671k22328G0251A5841a12154e1119A01651B3380
$$ -87452 -60475 -73681 -242769 -27671 -249999 70251 15841 -112154 -51119 101651 23380
15801h4453j74724b1361m9238A54538b2992k90531O8263q266A57457G6858a04292
$$ -84453 -259177 -21361 -70599 154538 -22992 -313523 -245260 -253526 157457 76858 -104292
15789c22949I3835l2210c60197a37001k45703B29040b87812a403n9044d937A10017
$$ -322949 93835 61625 -360197 -137001 -382704 229040 -287812 -1403 -60447 -4937 110017
15777f0465A96046B9588J72717o5546g4756B01590c9642o2882A52143K5652m1087
$$ -60465 196046 29588 202305 136759 -74756 201590 -39642 -102524 152143 177795 136708
15766A36708C6688J3516L10596A77762i0359m01157g4547l9558j800j62840n1204
$$ 136708 36688 50204 360800 177762 -90359 -491516 -74547 -114105 -115905 -278745 -329949
15755c29949B3236L64215c7094H0191L37e7778k5298A84919b4408F2786A2650
$$ -329949 23236 387451 -37094 80191 80528 -57778 -83076 184919 -24408 62786 12650
15743a91538g4941D6182J66535D3306O6521d02101C2401e2407j5380m3648j63114
$$ -191538 -74941 46182 212717 43306 109827 -402101 32401 -52407 -67787 -111435 -274549
15732b74549e3694C69987a51709A6402K04717a2250B93738a08164o6923n4686
$$ -274549 -53694 369987 -151709 16402 221119 -12250 293738 -108164 -175087 -229773
15722b29773I9379a93711B39921j2298b63349c9561B19835B3211g9946C19982
$$ -229773 99379 -193711 239921 227623 -263349 -39561 219835 23211 -79946 319982
15711a8179G0590i2260A14729f1307A47624b4668A40772n0741b5569k32796n7244
$$ -18179 70590 -92260 114729 -61307 147624 -24668 140772 90031 -25569 -258365 -315609
15700c15609J53082a4811k01690J04720A07559D0608K13429b38781j39075D0078
$$ -315609 -162527 -14811 -216501 -111781 107559 40608 254037 -238781 -377856 40078
15689c7205l27190J54080d2891J7000A46075a61336A43862D7028e16994B98771
$$ -37205 -364395 -210315 -42891 -25891 146075 -161336 143862 47028 -516994 298771
15678E9742P69A3908a91311B96755G1548b91789D0668i1401B19434a39980E6431
$$ 59742 60511 13908 -191311 296755 71548 -291789 40668 -91401 219434 -139980 56431
15666a42978j8464B48103h1855q1582b8324k62286J39398B31239a44029F5517
$$ -142978 -161442 248103 -81855 -163437 -28324 -290610 -151212 231239 -144029 65517
15655F7271b53751B3373R7161b3780A3674a52595l4859B85652c53167C415d40271
$$ 67271 -253751 23373 120534 -23780 13674 -152595 -187454 285652 -353167 3415 -440271
15643a76706h484q4771G6780J92367a72782c8027l289q7046H0823a15224C4448
$$ -176706 -8484 -93255 76780 269147 -172782 -38027 -41316 -128362 80823 -115224 34448
15631G5652c151q8593k87995A27340k1303h9950B19781f8105C5136A1143a11680
$$ 75652 -3151 -91744 -379739 127340 106037 -89950 219781 -68105 35136 11143 -111680
15619A37227a46838c9691k4173k01555N8154A8784d47794e8019j47189E8415a91537
$$ 137227 -146838 -39691 -63864 -265419 -207265 18784 -447794 -58019 -205208 58415 -191537
15607a17757b7719C00745f9687j76707a237j36142j48073f9646j85537n6285J51626
$$ -117757 -27719 300745 -69687 -246394 -1237 -137379 -285452 -69646 -255183 -311468 -159842
15596a59842D25L27339d2517j33437c6399g710D5987K19360j10855a71846A87835
$$ -159842 425 327764 -42517 -175954 -36399 -7710 45987 265347 154492 -171846 187835
15584B55368c1399C93352b5681j83148O4976k0386r407b2221p981B22985J12746
$$ 255368 -31399 393352 -25681 -208829 -143853 -164239 -173646 -22221 -30202 222985 335731
15573C35731a15114k03479A24013e4825A46236K0025A9215a46778q7391b893A10579
$$ 335731 -115114 -318593 124013 -54825 146236 166261 19215 -146778 -234169 -2893 110579
15561A09762L00451c9839j02048m4551B64362j2940b26095J6818C8576b63486
$$ 109762 410213 -39839 -141887 -186438 264362 251422 -226095 -209277 38576 -263486
15550F8383l017a1785G1625b44637c274A29874g6053D4772b8131A21043M9377
$$ 68383 65366 -11785 71625 -244637 -3274 129874 -76053 44772 -28131 121043 170420
15539A70420B2575Q7495n2346Q0177a96930A73133i4482G2458a17083j94350B55876
$$ 170420 22575 110070 57724 137901 -196930 173133 -94482 72458 -117083 -311433 255876
15527C49351B8291j1011f6084B47050c14734Q7864j33279f4613A81750A6399J26848
$$ 349351 28291 17280 -66084 247050 -314734 -226870 -360149 -64613 181750 16399 143247
15516A43247D9049a47337g2656j7439M2763K3438r8436A01806L0252c17543H0895
$$ 143247 49049 -147337 -72656 -90095 -47332 -23894 -122330 101806 132058 -317543 80895
15504b85716D8973J26802K6255d7568G4392P7779e2545L00j80133A43995b0412
$$ -285716 48973 175775 202030 -47568 74392 152171 -52545 -52245 -232378 143995 -20412
15492a12920K0005J774F6822J57302a45083L5952j85587A50365a91968G8746c20637
$$ -112920 -92915 -91141 66822 224124 -145083 -109131 -294718 150365 -191968 78746 -320637
15480h3386B09559G2323b61133m2057a5778n19958b5949I8585C9292a34857P45
$$ -83386 209559 72323 -261133 -303190 -15778 -535736 -25949 98585 39292 -134857 -134112
15469a34112l1324N2048L5119F7670B8163e28800A52843a41774A24784J62143
$$ -134112 -165436 -113388 -78269 67670 28163 -528800 152843 -141774 124784 286927
15459B86927o7781J36918K6613h0588k23140A8285L0885c69333B5107g7919b2004
$$ 286927 219146 356064 382677 -80588 -303728 18285 49170 -369333 25107 -77919 -22004
15447g2196A30885j511c23334Q4135B31598e0966J3487J2125A5274e23975b5781
$$ -72196 130885 129374 -323334 -239199 231598 -50966 -37479 -25354 15274 -523975 -25781
15435a46311B74026j27335m8034e1028I8242Q3325b99352A97706b72463A43053
$$ -146311 274026 146691 98657 -51028 98242 181567 -299352 197706 -272463 143053
15424h4686j90169I0371d1792o3122A57479K21518b7921A95175g3575B14353i2468
$$ -84686 -274855 90371 -41792 -104914 157479 378997 -27921 195175 -73575 214353 -92468
15412a88336R741A61063b79910A79936c210j011j4326l8874A50a2376l5909J5047
$$ -188336 -178595 161063 -279910 179936 -3210 -4221 -18547 -57421 150 -12376 -48285 -33238
15400c3238q9455A7839K04608H2228M6786a95808B27874b24283Q4570A71253C4936
$$ -33238 -122693 17839 222447 82228 129014 -195808 227874 -224283 -139713 171253 34936
15388h0136I3893J34927b09981A98545C5504d6414A96261a41912N7186I0117a32541
$$ -80136 93893 228820 -209981 198545 35504 -46414 196261 -141912 -84726 90117 -132541
15376b55704e9215l85046c786p3242C373d2612A70730F0169M29027j72641a53767
$$ -255704 -59215 -444261 -3786 -77028 3373 -42612 170730 60169 489196 316555 -153767
15364C38514a90513g846H395K19645a11578e3929I0363E726e5837A09300b07201
$$ 338514 -190513 -7846 8395 228040 -111578 -53929 90363 5726 -55837 109300 -207201
15352b7067p9713l41013i1428f202E9527a94754a4269C8639N0649J11152a60348
$$ -27067 -106780 -447793 -91428 -6202 59527 -194754 -14269 38639 89288 200440 -160348
15340b56132g9913B37692A17768P8578Q141p1922d45169c2018O461A37316M7407
$$ -256132 -79913 237692 117768 196346 204487 132565 -445169 -32018 -25557 137316 184723
15329A84723C6009a21305k5148L1274A63092m8230K351J67024j11215q6484L0030
$$ 184723 36009 -121305 -146453 -115179 163092 114862 117213 284237 173022 86538 116568
15318A16568e1171B79645L4422a79689A46847E5183J07109R4723A02123N2223
$$ 116568 -51171 279645 314067 -179689 146847 55183 162292 257015 102123 154346
15308A54346B8289K35036c5707A62686C2957b68515f2596B84000a97447C7036
$$ 154346 28289 263325 -35707 162686 32957 -268515 -62596 284000 -197447 37036
15297b15510j1815P8364F2955a29699e3682B87297J04717I61L56683C4790J50998
$$ -215510 -227325 -148961 62955 -129699 -53682 287297 392014 961 357644 34790 185788
15286A85788f149D7826b7136m8059E1573J73030a07632D07752a59846j9527E1074
$$ 185788 -6149 47826 -27136 -75195 51573 224603 -107632 407752 -159846 -179373 51074
15274a13913B50756B6699A573a33786B86496E871a19894p9311C78117G0691L75536
$$ -113913 250756 26699 1573 -133786 286496 5871 -119894 -199205 378117 70691 446227
15263D46227B04718J38754j35484O3246f5001G9946i483A77739F9096J93946c1333
$$ 446227 204718 343472 207988 271234 -65001 79946 -9483 177739 69096 263042 -31333
15251a65814I2324C9052K45907j07339K14564O31507K89717J75253M98475p7262
$$ -165814 92324 39052 284959 177620 392184 1023691 1313408 1488661 1987136 1909874
15241A909874m47149J23806k14219F75263A57406a56856c4606j1199A67641a55264
$$ 1909874 1462725 1586531 1372312 675263 157406 -156856 -34606 -45805 167641 -155264
15230A36108Q2951f0165B28072g1837E9490K16923J03400j25475a37660C13235
$$ 136108 219059 -60165 228072 -71837 59490 276413 379813 254338 -137660 313235
15219c1176A14186a03410D9697a99369A10440M6328a72539j68290B54421p8135
$$ -31176 114186 -103410 49697 -199369 110440 156768 -172539 -340829 254421 176286
15209A76286l0066c6782B01128a12122D174K29584J077p8632K53409A47720l1659
$$ 176286 146220 -36782 201128 -112122 4174 233758 234835 156203 409612 147720 116061
15198A16061O7099N7846e2094c991C86961j47246K08884E0450Q6688K59991A1543
$$ 116061 183160 241006 -52094 -3991 386961 239715 448599 50450 137138 397129 11543
15186B67348g6269F9970K07527b19494B30742a31390B83663A31071j264J63309
$$ 267348 -76269 69970 277497 -219494 230742 -131390 283663 131071 129807 293116
15176B93116j44280c5416B11314a0717B3216a18548I6410K45392a6190B03707
$$ 293116 148836 -35416 211314 -10717 23216 -118548 96410 341802 -16190 203707
15165A99772b33637H491J91666J06865c4657A80827n3966M38712j27230B09393
$$ 199772 -233637 8491 200157 307022 -34657 180827 126861 565573 438343 209393
15154B29918d9740K2489p8574G137O4060J82213r0983K01369e1200D02019j55253
$$ 229918 -49740 -27251 -105825 7137 71197 253410 162427 363796 -51200 402019 246766
15143B46766e1566C35665F7145B7765J00579l6651B221K3589L32478j0641A4527
$$ 246766 -51566 335665 67145 27765 128344 91693 2221 25810 358288 347647 14527
15131D34631j06434I6419l3073L08512d9060q8597C1011L55694j91540J65706
$$ 434631 328197 96419 63346 371858 -49060 -137657 31011 386705 195165 360871
15121C60871i6829A32094K60605b27140A15225D2909b38499j658D72237j62297
$$ 360871 -96829 132094 392699 -227140 115225 42909 -238499 -240157 472237 309940
15111C09940j12570a96784B97303Q9925i9609G5064J38712J11214A44279J15162
$$ 309940 197370 -196784 297303 387228 -99609 75064 213776 324990 144279 259441
15101B59441A01274c8161k33076c2503A25683a32514A35217L6736A9658J39978
$$ 259441 101274 -38161 -271237 -32503 125683 -132514 135217 171953 19658 159636
15091A59636o2423h1116I1424J89863d9237j80372D6196M00212l0306j9683G405
$$ 159636 97213 -81116 91424 281287 -49237 -229609 46196 446408 416102 396419 7405
15079A57239J11369o5548m8818J01582b31509A14449J13508j03083J74799L57672
$$ 157239 268608 203060 154242 255824 -231509 114449 227957 124874 299673 657345
15069F57345A58581j9135G615L92439A43629J30138J49471j1414j01686F5466
$$ 657345 158581 139446 7615 400054 143629 273767 423238 411824 310138 65466
15058E4786J052a76705D0179b9542C30928F2390L45884A38247l0473K11843J4392
$$ 54786 55838 -176705 40179 -29542 330928 62390 408274 138247 107774 319617 334009
15047C34009K17592B65921n7626J8522K1494F9176K68678j67373n8568K6823J03924
$$ 334009 551601 265921 208295 226817 248311 69176 337854 170481 111913 138736 242660
15036B42660m951r4395P6148j3057K15001m6129A29394K10508R9087k06386K9547
$$ 242660 237709 143314 219462 206405 421406 375277 129394 339902 438989 232603 262150
15025B62150J94491B18615M590I2553a84042E7518K71083A00536a67321B40225
$$ 262150 456641 218615 223205 92553 -184042 57518 328601 100536 -167321 240225
15014A22194M50569n8621r8572j15825n7300F9360Q1883a94528B73326J71801
$$ 122194 572763 514142 415570 299745 242445 69360 151243 -194528 273326 445127
15004D45127B7505K55055A06885J2493k653K67676K33901B494J26575J08170A14800
$$ 445127 27505 282560 106885 119378 116725 384401 618302 2494 129069 237239 114800
14992C80116A15330L20596A73852R5810K36389j18604K66219B18053a23056C11303
$$ 380116 115330 435926 173852 269662 506051 387447 653666 218053 -123056 311303
14981E28218A65681N8551J76987K41531A95654J98865a69206E02827N6457k53670
$$ 528218 165681 224232 401219 642750 195654 394519 -169206 502827 559284 305614
14971C05614A35039J13435r7361J92067A41755C9828d0434A75667C6583H740L6565
$$ 305614 135039 248474 151113 343180 141755 39828 -40434 175667 36583 8740 45305
14960D5305J94316n6426n0794I871J86738n9720L2783J51738M9600N1552L46396
$$ 45305 239621 183195 132401 9871 196609 136889 169672 321410 371010 422562 768958
14949G68958A87909K75520j21675E1925L78232A50647J26111K04130e0570B93162
$$ 768958 187909 463429 341754 51925 430157 150647 276758 480888 -50570 293162
14938h722D56821A14969K04741P3644A33867A74M99732j65436M8006a9864D73935
$$ -8722 456821 114969 319710 393354 133867 174 499906 334470 382476 -19864 473935
14926B14706K45869A49761M81687k44672J2683k7923o3857M76009k31008j85044
$$ 214706 460575 149761 631448 386776 399459 371536 307679 783688 552680 367636
14916C67636K51478k16338j17168P1588k9564j46432J28617I4404L51410k2354
$$ 367636 619114 402776 285608 357196 327632 181200 309817 94404 445814 423460
14906D23460j33809J95187p3121j60846M32202j87155r850k04176M7604J94586
$$ 423460 289651 484838 411717 250871 683073 495918 486068 281892 329496 524082
14896E24082K3710k4722k8377O3199A80047o3785M33988k33602J35643j49220
$$ 524082 547792 523070 494693 557892 180047 116262 550250 316648 452291 303071
14886C03071A42338M75754r7371A54419J43883K9237P5730p5086j3440j41903
$$ 303071 142338 618092 520721 154419 298302 327539 403269 328183 314743 172840
14876A72840l6823L46865O9569m1989j12403J15091r7123j22835N1781K7871L34916
$$ 172840 136017 482882 552451 510462 398059 513150 416027 293192 344973 372844 707760
14865G07760k33319B10015L26101q2792J32424K29351k05971k15928j60390L77226
$$ 707760 474441 210015 536116 453324 585748 815099 609128 393200 232810 610036
14855F10036r2223P3340B85270L5442o8603K95146j18057m9017k6493j04366J57222
$$ 610036 517813 591153 285270 320712 252109 547255 429198 380181 353688 249322 406544
14844D06544p5259K65293P0817B51698L963L70846k15960K62357N1393A09528
$$ 406544 331285 596578 667395 251698 255661 626507 410547 672904 724297 109528
14833E32631k2245r932j88692J39553j28034J14208p7401l6723L34883o4254A95701
$$ 532631 510386 500454 311762 451315 323281 437489 360088 323365 658248 593994 195701
14821C45905R0866Q8140J39507L5546j98674Q878F4019J80945K1627m0000K90549
$$ 345905 436771 524911 664418 699964 501290 510168 64019 244964 266591 226591 517140
14810E17140k5051J03417j25642N5806Q6298k67383O07071D30679L95641j8470
$$ 517140 492089 595506 469864 525670 611968 344585 951656 430679 826320 807850
14800H07850j81442j54918j64925L47042K12692l24573K01030j21545J54098j41733
$$ 807850 626408 471490 306565 653607 866299 541726 742756 621211 775309 633576
14790F33576L43334D37288L38809l14924L30003j39806k63291J90445L17193K1669
$$ 633576 976910 437288 776097 461173 791176 651370 388079 578524 895717 917386
14780I17386k060l58121Q7011J71195j53801j69588P4285M012K03931j93263K33312
$$ 917386 915326 557205 644216 815411 661610 492022 566307 570319 774250 580987 814299
14769H14299r9026C10932M93864j18847K38371j83250j72039j07257K61442p2381
$$ 814299 715273 310932 804796 685949 924320 741070 569031 461774 723216 650835
14759F50835C16273N21198K7589M5792j94296J00992j04890o5807J22630j91963
$$ 650835 316273 837471 865060 910852 716556 817548 712658 646851 769481 577518
14749E77518K47817j97995L9212R9635J99816l52037P6828L25725J0146k76603
$$ 577518 825335 627340 666552 766187 966003 613966 690794 1016519 1026665 750062
14739G50062J73893k5759j73939r5578L41175K00383m82786N00134m40534K302
$$ 750062 923955 898196 724257 628679 969854 1170237 687451 1187585 747051 749353
14729G49353M1913L85590m67794L96978o6071D36108M56954K59227p0138P0391
$$ 749353 791266 1176856 709062 1106040 1039969 436108 893062 1152289 1082151 1152542
14719A152542r3932l46378R6626n3512N13206j63036k26281M53126m84924j68430
$$ 1152542 1058610 712232 808858 755346 1268552 1105516 879235 1332361 847437 679007
14709F79007K06708P0934K75144j86845J16697m71517k46903L88623L52111m11162
$$ 679007 885715 956649 1231793 1044948 1161645 690128 443225 831848 1183959 772797
14699G72797K94220K8150l74440J97246K95625l25307J43058P527J13858l16846
$$ 772797 1067017 1095167 720727 917973 1213598 888291 1031349 1038876 1152734 835888
14689H35888K98603J59708j57571N9479k10923N6697J23469K62897k15126K80039
$$ 835888 1134491 1294199 1136628 1196107 985184 1041881 1165350 1428247 1213121 1493160
14679A493160l30567L03938m60087j56457L79563J0901J17912m15583J85718k0405
$$ 1493160 1162593 1466531 1006444 849987 1229550 1240451 1358363 942780 1128498 1108093
14669A108093K87649k84587K41029l04719L18102j28296L58128n14528K94374
$$ 1108093 1395742 1111155 1352184 1047465 1365567 1237271 1595399 1080871 1375245
14660A375245k39349J2246L30576j41119j38678N41340p2696n02593o5160M08553
$$ 1375245 1135896 1148142 1478718 1337599 1198921 1740261 1667565 1164972 1099812 1508365
14650A508365l85597p8917K50147n3579j69662N64128o5583l8194l25306K39445
$$ 1508365 1122768 1043851 1293998 1240419 1070757 1634885 1569302 1531108 1205802 1445247
14640A445247j4218J6169L0603J30353k96248P2682J02426J51614l13220r950
$$ 1445247 1431029 1447198 1477801 1608154 1311906 1384588 1487014 1638628 1325408 1315458
14630A315458L09903k3617j66130L26312R7634l8631l97450K18699J08211k28381
$$ 1315458 1625361 1601744 1435614 1761926 1859560 1820929 1423479 1642178 1750389 1522008
14620A522008p56J0310N968k6893m2254m0790R6309R7930J20827q4329K42242
$$ 1522008 1521252 1531562 1537530 1510637 1468383 1427593 1523902 1621832 1742659 1658330 1900572
14609A900572k0022k15456J237L38904j61639j1198j42956J40062k45977L09406
$$ 1900572 1880550 1665094 1666331 2005235 1843596 1832398 1689442 1829504 1583527 1892933
14599A892933L6227J12297j55343j66341K58980p1548j78341N87619k28107r2540
$$ 1892933 1929160 2041457 1886114 1719773 1978753 1907205 1728864 2316483 2088376 1995836
14589A995836r6296P6926K58824l41972J40826q5773L38459k03909P9930K5762
$$ 1995836 1899540 1976466 2235290 1893318 2034144 1948371 2286830 2082921 2162851 2188613
14579B188613L75201o2542j29804J08307n12644J45087R0938L73015l29346M37896
$$ 2188613 2563814 2501272 2371468 2479775 1967131 2112218 2203156 2576171 2246825 2684721
14569B684721K66463m11593L20504q5930N0682J21177o7320J93190O405k67965
$$ 2684721 2951184 2539591 2860095 2774165 2824847 2946024 2878704 3071894 3078299 2810334
14559B810334K83924K54619l9145K5403L69777J64196O39026J72860M03607J586434
$$ 2810334 3094258 3348877 3309732 3335135 3704912 3869108 4508134 4680994 5084601 6671035
14549F671035J569469L992454P432948J7224449J6042776B5549741A1050815n044861
$$ 6671035 8240504 12232958 19665906 36890355 52933131 25549741 11050815 6005954
14541F005954j341773k72912j51798O60289j044277j011583o76862R5526j42377
$$ 6005954 4664181 4391269 4239471 4899760 3855483 2843900 2167038 2262564 2120187
14532B120187N46895N617j43152L2560k72223N68261l85910J50503R3262K64984
$$ 2120187 2667082 2672699 2529547 2562107 2289884 2858145 2472235 2622738 2716000 2980984
14522B980984l42596N3665K02263K07869j37312l94567L90515m81606J62964M64154
$$ 2980984 2638388 2692053 2894316 3102185 2964873 2570306 2960821 2479215 2642179 3106333
14512C106333J5738L4763p6048K41052l73565K14032O8401J40222K31665k78894
$$ 3106333 3122071 3156834 3080786 3321838 2948273 3162305 3230706 3370928 3602593 3323699
14502C323699J15270R8122M6842l13974N36686q7218J16281k5672K90646l40478
$$ 3323699 3438969 3537091 3583933 3269959 3806645 3719427 3835708 3810036 4100682 3760204
14492C760204J96649k68043L30004M38562j81784j30199J34432R3396j85421j2125
$$ 3760204 3956853 3688810 4018814 4457376 4275592 4145393 4279825 4373221 4187800 4175675
14482D175675J22499K09042R8723J22062j11163j22186M20171L5610P7044m27506
$$ 4175675 4298174 4507216 4605939 4728001 4616838 4494652 4914823 4950433 5027477 4599971
14472D599971M47113J40000k60421L56902l4691K3290N0716J07539k54595L63923
$$ 4599971 5047084 5187084 4926663 5283565 5248874 5272164 5322880 5430419 5175824 5539747
14462E539747J73632j81199M11776l47700K01651K10683n20601K69507M05230
$$ 5539747 5713379 5532180 5943956 5596256 5797907 6008590 5487989 5757496 6162726
14453F162726o0380j58940M66130l60055J37974K99548k47434K05118J09346L08248
$$ 6162726 6102346 5943406 6409536 6049481 6187455 6487003 6239569 6444687 6554033 6862281
14443F862281k43287j04254K99397N9072K13460J96906l29706O54877l22343O71843
$$ 6862281 6618994 6514740 6814137 6873209 7086669 7283575 6953869 7608746 7286403 7958246
14433G958246j7021m2228o3396j4247K54520L50245j42988K69335J58704o7426
$$ 7958246 7941225 7898997 7835601 7821354 8075874 8426119 8283131 8552466 8711170 8643744
14423H643744m0065O23670j51535k2628K32571P2877L12178k10136L81511J88956
$$ 8643744 8603679 9227349 9075814 9053186 9285757 9358634 9670812 9460676 9842187 10031143
14413A0031143n3504K17860J47833L14897j48795L56308K01525K43583J02254
$$ 10031143 9977639 10195499 10343332 10658229 10509434 10865742 11067267 11310850 11413104
14404A1413104J30130R2087K11539N63245j1439K39613P1790q4101J40414L57086
$$ 11413104 11543234 11635321 11846860 12410105 12398666 12638279 12710069 12625968 12766382 13123468
14394A3123468N33590J41708J80707K82924M86000J74919R4844L59999L27573
$$ 13123468 13657058 13798766 13979473 14262397 14748397 14923316 15018160 15378159 15705732
14385A5705732J09131K44346N88141k8362M36442K16304M01481K74210M54205
$$ 15705732 15814863 16059209 16647350 16618988 17055430 17271734 17673215 17947425 18401630
14376A8401630N32594o6071J87250Q03154J72694M49615O45118q440O03343M87880
$$ 18401630 18934224 18868153 19055403 19858557 20031251 20480866 21125984 21117544 21720887 22208767
14366B2208767M87249N72577L74223K78626Q79135L99857M08380M25417P88040
$$ 22208767 22696016 23268593 23642816 23921442 24800577 25200434 25608814 26034231 26822271
14357B6822271M38845J150738M59829M05380M67664R70144K92420J263681O89468
$$ 26822271 27261116 28411854 28871683 29277063 29744727 30714871 31007291 32270972 32960440
14348C2960440R63925P29280R90947L10995J139540J187158Q33301J004993J059832
$$ 32960440 33924365 34653645 35644592 35955587 37095127 38282285 39115586 40120579 41180411
14339D1180411J119862J269773J309670J534161Q13881J553954J143716J261635
$$ 41180411 42300273 43570046 44879716 46413877 47227758 48781712 49925428 51187063
14331E1187063K139331J423582J533789J881723J921710J483899K252335J870204
$$ 51187063 53326394 54749976 56283765 58165488 60087198 61571097 63823432 65693636
14323F5693636K523982K258598K250351K418153K790809K745339K930033L142882
$$ 65693636 68217618 70476216 72726567 75144720 77935529 80680868 83610901 86753783
14315H6753783L076698L274148L718322L485518M195101M063961M654623M520499
$$ 86753783 89830481 93104629 96822951 100308469 104503570 108567531 113222154 117742653
14307A17742653N173225M892981N404787N488568O471284O121437O957247O864687
$$ 117742653 122915878 127808859 133213646 138702214 145173498 151294935 158252182 165116869
14299A65116869P535197Q228595Q482664Q580431R757691R679209J0148600J0916709
$$ 165116869 172652066 180880661 189363325 197943756 207701447 217380656 227529256 238445965
14291B38445965J1378227J1970157J2356627J2735601J3324468J3940456J3999561
$$ 238445965 249824192 261794349 274150976 286886577 300211045 314151501 328151062
14284C28151062J4615615J4689024J4584928J4665332J4569172J3930398J3644329
$$ 328151062 342766677 357455701 372040629 386705961 401275133 415205531 428849860
14277D28849860J2218567J1658968J0192999P512663L680414J220362N13097j15973
$$ 428849860 441068427 452727395 462920394 470433057 474113471 475333833 475846930 475730957
14269D75730957N72357l716626m292841n157353q492212j0161729j1439399j3103362
$$ 475730957 476303314 472586688 468293847 463136494 454644282 444482553 433043154 419939792
14261D19939792j4006894j5105974j5401369j5566808j5430509j5170991j4849642
$$ 419939792 405932898 390826924 375425555 359858747 344428238 329257247 314407605
14254C14407605j4625035j4099392j3385603j2644970j2289895j1135131j0613716
$$ 314407605 299782570 285683178 272297575 259652605 247362710 236227579 225613863
14247B25613863j0645772j0552624r091674r089832q693544p787930p926919o971082
$$ 225613863 214968091 204415467 195323793 186233961 177540417 169752487 161825568 154854486
14239A54854486o863637o094643n746469o177007n228392n015591n304286m655275
$$ 154854486 147990849 141896206 136149737 129972730 124744338 119728747 114424461 109769186
14231A09769186l512444l969437m258107l709976l884188l011731l367046k704243
$$ 109769186 106256742 102287305 98029198 94319222 90435034 87423303 84056257 81352014
14223H1352014k874194k982412k508152k387472k339086k222795k480404j772533
$$ 81352014 78477820 75495408 72987256 70599784 68260698 66037903 63557499 61784966
14215F1784966k099355j515000j354802j564068k176028j645200j512992j503559
$$ 61784966 59685611 58170611 56815809 55251741 53075713 51430513 49917521 48413962
14207D8413962p90744r86898j884767j282614j294619r85188j436548l58807r49713
$$ 48413962 47623218 46636320 44751553 43468939 42174320 41189132 39752584 39393777 38444064
14198C8444064j643356o07060q96715r59677r64129n11956r63581p34141j097523
$$ 38444064 36800708 36193648 35296933 34337256 33373127 32861171 31897590 31163449 30065926
14189C0065926n16900n20626m45103p92527p64431p14857n31042m51922r70387
$$ 30065926 29549026 29028400 28583297 27790770 27026339 26311482 25780440 25328518 24358131
14180B4358131j61514k98313p59411l73964m33259o09670l12748l42852j075323
$$ 24358131 24196617 23898304 23138893 22764929 22331670 21722000 21409252 21066400 19991077
14171A9991077j49l05801m62212k35183m09774l17785o99463K34824l49576p38150
$$ 19991077 19990928 19685127 19222915 18987732 18577958 18260173 17560710 17795534 17445958 16707808
14161A6707808J55869o46107n49205L79840m84165k64976k21390m34320J01375
$$ 16707808 16863677 16217570 15668365 16048205 15564040 15299064 15077674 14643354 14744729
14152A4744729l45205k35548l69398J74864k14061k98023Q0057p52765K24334
$$ 14744729 14399524 14163976 13794578 13969442 13755381 13457358 13537415 12784650 13008984
14143A3008984o35654J66557o16885K46634l88016k57575M7950J1355m17086j57890
$$ 13008984 12373330 12539887 11923002 12169636 11781620 11524045 11571995 11583350 11166264 11008374
14133A1008374j01405l1252l72643k21374j06803l11495J95175j79435k85880
$$ 11008374 10906969 10875717 10503074 10281700 10174897 9863402 10058577 9879142 9593262
14124I593262R0931m24854N0314j03305k23113j13209j22978k24936j67899K65611
$$ 9593262 9684193 9259339 9309653 9206348 8983235 8870026 8747048 8522112 8354213 8619824
14114H619824r2965j97385j32578k7015k09885k42147R4353l38568J5612N7770
$$ 8619824 8526859 8329474 8196896 8169881 7959996 7717849 7812202 7473634 7489246 7547016
14104G547016k22836m6119Q7931j02884k11383q6896q211l49936K23305j68649
$$ 7547016 7324180 7278061 7365992 7263108 7051725 6964829 6956618 6606682 6829987 6661338
14094F661338k16908J68606j82959j5072K29157n01462p3414j41587j15172J8595
$$ 6661338 6444430 6613036 6430077 6415005 6644162 6142700 6069286 5927699 5812527 5831122
14084E831122N741O9488Q6080k16048k99887J9563k14823K30410o2426J01964
$$ 5831122 5836863 5906351 5992431 5776383 5476496 5496059 5281236 5511646 5449220 5551184
14074E551184k81156J55901n05337J43506J24959q0063k23538k42485J92926J26011
$$ 5551184 5270028 5425929 4920592 5064098 5189057 5108994 4885456 4642971 4835897 4961908
14064D961908K322m11742L26868m73419K09648K3707J53329J49415m83854j75499
$$ 4961908 4964230 4552488 4879356 4405937 4615585 4639292 4792621 4942036 4458182 4282683
14054D282683J49891m36002N22673k32984k01300J77307o13244L52331J10355
$$ 4282683 4432574 3996572 4519245 4286261 4084961 4262268 3649024 4001355 4111710
14045D111710l17897O7333l48794K47105K83331j29709j66926Q8189j64736J65775
$$ 4111710 3793813 3861146 3512352 3759457 4042788 3913079 3746153 3834342 3669606 3835381
14035C835381j68028P550R5850k19812j39290k92277O60956j99485r4365k54368
$$ 3835381 3667353 3674903 3770753 3550941 3411651 3119374 3780330 3580845 3486480 3232112
14025C232112K01935J05688k911l68157j5066q3352K53153k39241O8579k21921
$$ 3232112 3434047 3539735 3536824 3168667 3153601 3070249 3323402 3084161 3152740 2930819
14015B930819P6795r2743p4748j81549Q1486R6107m2053j85261M36003j23161
$$ 2930819 3007614 2914871 2840123 2658574 2740060 2836167 2794114 2608853 3044856 2921695
14005B921695k76414L43745o91067L42225l27735R2428N595j39305O9391J96288
$$ 2921695 2645281 2989026 2297959 2640184 2312449 2404877 2410472 2271167 2340558 2536846
13995B536846J49430k43213m14383O35425p204J78449J201463K692972N934876
$$ 2536846 2686276 2443063 2028680 2664105 2656901 2835350 4036813 6729785 12664661
13986A2664661J5972769K3622669j9188756j6114785p065450l027709j255324
$$ 12664661 28637430 52260099 33071343 16956558 9891108 6863399 5608075
13979E608075j018195l19926l95227m18791j5046k65646M5056j49086J61766j38789
$$ 5608075 4589880 4269954 3874727 3455936 3440890 3175244 3220300 3071214 3232980 3094191
13969C094191q3113j94546J09381j90623J7586J05900k50552m91359J06805L30112
$$ 3094191 3011078 2816532 2925913 2735290 2752876 2858776 2608224 2116865 2223670 2553782
13959B553782J2468k07496K21541K12808l31362r0581K76651l96208l6307P235
$$ 2553782 2566250 2358754 2580295 2793103 2461741 2371160 2647811 2251603 2215296 2222531
13949B222531k91842N02257j75319l63215J87642j25674M71041m22542J00307
$$ 2222531 1930689 2432946 2257627 1894412 2082054 1956380 2427421 2004879 2105186
13940B105186L60166k46499j8725k44721K69864k84523L10370r1995k41005m0477
$$ 2105186 2465352 2218853 2200128 1955407 2225271 1940748 2251118 2159123 1918118 1877641
13930A877641j79238J43522J15757J45385j77932J01449k92844L37349m03365
$$ 1877641 1698403 1841925 1957682 2103067 1925135 2026584 1733740 2071089 1667724
13921A667724L05505l14130J06923M7274j44414N97344p43771J43217R4581p2445
$$ 1667724 1973229 1659099 1766022 1813296 1668882 2266226 1522455 1665672 1760253 1687808
13911A687808n4526J86133J44641r4607j41269O8432J66697o5590k76122R2950
$$ 1687808 1633282 1819415 1964056 1869449 1728180 1796612 1963309 1897719 1621597 1714547
13901A714547n8500k18103J8896M39787m06557N4308J06741j74838n7369J22509
$$ 1714547 1656047 1437944 1456840 1896627 1490070 1544378 1651119 1476281 1418912 1541421
13891A541421K58455k63436R0453j81218L77371l89397K54772r117l9864j02963
$$ 1541421 1799876 1536440 1626893 1445675 1823046 1433649 1688421 1679304 1639440 1536477
13881A536477k13680M2281L55799n92558J65278Q9053j83459K760O4775j37704
$$ 1536477 1322797 1365078 1720877 1128319 1293597 1382650 1199191 1201951 1266726 1129022
13871A129022k6993K56610J95341k46403k12620O2177J61636J15087k56966l491
$$ 1129022 1102029 1358639 1553980 1307577 1094957 1157134 1318770 1433857 1176891 1173400
13861A173400J1371J20539k92996J63149M97690j44721n00164L4621K19413M4486
$$ 1173400 1184771 1305310 1012314 1175463 1673153 1528432 1028268 1062889 1282302 1326788
13851A326788O3044k10361M73989m51417J30201j16251J27728J60042k26365k30027
$$ 1326788 1389832 1179471 1653460 1202043 1332244 1215993 1343721 1503763 1277398 1047371
13841A047371J30354k5872l042j07514J23264j76936J32807j64977J89967k0764
$$ 1047371 1177725 1151853 1148811 1041297 1164561 987625 1120432 955455 1145422 1124658
13831A124658q0551r9383J31611m9119r0897J84271n1056J61899j8407k12239
$$ 1124658 1044107 944724 1076335 1027216 936319 1120590 1069534 1231433 1213026 1000787
13821A000787L49146k34870j92041j13760M18735l09904J73105O4984K9312k54161
$$ 1000787 1349933 1115063 923022 809262 1227997 918093 1091198 1156182 1185494 931333
13811I31333j32936J10158M94160n82233R7022M8733k07723L40562m6200O5276
$$ 931333 798397 908555 1402715 820482 917504 966237 758514 1099076 1052876 1118152
13801A118152j64345K8262j86172K78397p3759L7179j04017q8810J71862j18187
$$ 1118152 953807 982069 795897 1074294 1000535 1037714 933697 844887 1016749 898562
13791H98562K52119j83733j61192J43535j56851r735Q8315k7079j03979j59779
$$ 898562 1150681 966948 805756 949291 792440 782705 871020 843941 739962 580183
13781E80183K49860R2370J65061k54388k56895Q2839J94198j0038J24100k11428
$$ 580183 830043 922413 1087474 833086 576191 659030 853228 843190 967290 755862
13771G55862K1054n8570j04022J4545L42959J13633j46512j58664k2431M4672
$$ 755862 776916 718346 614324 628869 971828 1085461 938949 780285 757854 802526
13761H02526k63847Q610M68499l33422K48577J23928m77511m4679M2609k5131
$$ 802526 538679 547289 1015788 682366 930943 1054871 577360 532681 575290 550159
13751E50159K04251J39789l48662K28733j5846J36622O445l16174K28844L25838
$$ 550159 754410 894199 545537 774270 758424 895046 901491 585317 814161 1139999
13741A139999l24866J18518l87018L59786l91227K34635Q4173K1774Q46o6800
$$ 1139999 815133 933651 546633 906419 515192 749827 834000 855774 856620 789820
13731G89820n9930l4984L1738K10873D56540K19441j42546J33122L7548j42936
$$ 789820 729890 694906 726644 937517 456540 675981 533435 666557 704105 561169
13721E61169j21960M05296J99280l87003J6333Q9945P9257n4182l7924O2176n1973
$$ 561169 439209 844505 1043785 656782 673115 763060 842317 788135 750211 812387 760414
13710G60414k54214q2412o150M32514l07718J32175q018R9921k06986j02715K36154
$$ 760414 506200 423788 417638 850152 542434 674609 666591 766512 559526 456811 692965
13699F92965j93558q3419O090L41131n0038J39733P9266m48338J6099J77106k5630
$$ 692965 499407 415988 422078 763209 713171 852904 932170 483832 499931 677037 651407
13688F51407j98006j85018L14492J40045l60637q0511M46195l085o0808C21221
$$ 651407 453401 268383 582875 722920 362283 281772 727967 724882 664074 321221
13677E48431J22321l20105N01929J74720l72372r9604L7526j39871L09447K09560
$$ 548431 670752 350647 852576 1027296 654924 555320 592846 452975 762422 971982
13667I71982D03732j421o6012R7174J98878j87842L4540O0743J90047k6350q5306
$$ 971982 403732 402311 336299 433473 632351 444509 479049 539792 729839 703489 618183
13656F18183j58492N2570L20441k63768B60255J27207K06849j99948J59856o4795
$$ 618183 459691 512261 832702 568934 260255 387462 594311 394363 554219 489424
13646D89424P0028p9803B30038M23881r0257J85855l57705o7885M77647B38451
$$ 489424 559452 479649 230038 653919 563662 749517 391812 323927 801574 238451
13635D99416r5354j75161M17894j27462k41182M3940n3195K31677k28241L09538
$$ 499416 404062 228901 646795 519333 278151 322091 268896 500573 272332 581870
13625E81870k0952K5142p2357m4086l8552J00892B61997K13332R670j21527L8437
$$ 581870 560918 586060 513703 469617 431065 531957 261997 475329 484999 363472 401909
13614D01909o3004O09472I6669L92900J98716C30445J08164N0189J43750A51267
$$ 401909 338905 948377 96669 489569 688285 330445 438609 488798 632548 151267
13603F62849C22171L9921J58247K24986C19387O4331J52384H5531M52925n20k4668
$$ 662849 322171 362092 520339 745325 319387 383718 536102 85531 538456 537936 513268
13592E13268q6697J12868j43299K77363k91086M41956B1295N48651j06925L8789
$$ 513268 426571 539439 396140 673503 382417 824373 21295 569946 463021 501810
13582E01810r9103J30551k19700H9006L60554J08270j47919J74120B80526J34563
$$ 501810 402707 533258 313558 89006 449560 557830 409911 584031 280526 415089
13572D15089j68373O5334A39696J04961J18911C1372L21659j3783k0567P1387
$$ 415089 246716 312050 139696 244657 363568 31372 353031 339248 318681 390068
13562C90068J00896p4856A43559K72335J9425K06982O2290a02469E04584H2753
$$ 390068 490964 416108 143559 415894 435319 642301 704591 -102469 504584 82753
13551D59492A69472L64043k11033l2262N46728l76091p637J4657k31206a01148
$$ 459492 169472 533515 322482 290220 836948 460857 453220 467877 236671 -101148
13540C02899N07873l94232J96573k43223K04212j03456q8249K977J40985k23995
$$ 302899 810772 416540 613113 369890 574102 470646 382397 385374 526359 302364
13530C02364K26674J25918k25468j5123J2514O3951G9675M55417Q5810A88467
$$ 302364 529038 654956 429488 414365 426879 490830 79675 535092 620902 188467
13519B36355m8092J37544r8126L08329j36684j67825K9251m6787R1730J69698
$$ 236355 188263 325807 227681 536010 399326 231501 260752 213965 305695 475393
13509D75393j71413P6664A03377J00219N0855a9541G6087K23186j27497K47720
$$ 475393 303980 380644 103377 203596 254451 -19541 76087 299273 171776 419496
13499D19496j48496j4019L35720A99925f8566D33125a02274B79629k3461j04789
$$ 419496 271000 256981 592701 199925 -68566 433125 -102274 279629 256168 151379
13489A51379J60141P6119N4087J04040A62236J26628A26882J15497l4005J18477
$$ 151379 311520 387639 441726 545766 162236 288864 126882 242379 208374 326851
13479C26851h456D77689j53989j5608K14950R6364k51470P279J54217j47301j44318
$$ 326851 -8456 477689 323700 308092 523042 619406 367936 375215 529432 382131 237813
13468B37813J04335A41740P8203J34256Q5236D4620L25295K20193k44782A7605
$$ 237813 342148 141740 219943 354199 439435 44620 369915 590108 345326 17605
13457a4912I8932K90629J48431J01285A36530K08060K57995B02986L01879r4156
$$ -14912 98932 389561 537992 639277 136530 344590 602585 202986 504865 410709
13447D10709F6070A8785L32579A7541J58191k4135a60901C29744r1491J38264
$$ 410709 66070 18785 351364 17541 175732 151597 -160901 329744 238253 376517
13437C76517E036L94K85810r1788D0435L64570K09841A01126L39566j85857a484
$$ 376517 5036 5430 291240 199452 40435 405005 614846 101126 440692 254835 -1484
13425a7893B06641N60414C52176G9884J5929L30729j70551C4179K62499j389A02590
$$ -17893 206641 767055 352176 79884 95813 426542 255991 34179 296678 295289 102590
13413F83392F6343M50053H1273L57011Q5003K24240k29296k30084N8994j17770
$$ 683392 66343 516396 81273 438284 523287 747527 518231 288147 347141 229371
13403B29371m4335P3278K58978B26114K46517j81292P2666A23942f7719J7454
$$ 229371 185036 258314 517292 226114 472631 291339 364005 123942 -67719 -50265
13393e0265j7347A94567J96535H3579L18365A98283J79572A82406K3459P8926
$$ -50265 -67612 194567 391102 83579 401944 198283 377855 182406 205865 284791
13383B84791q0030n9382k4086Q6879k8417e8746B84662A40878N7429R0456m0572
$$ 284791 204761 145379 121293 208172 179755 -58746 284662 140878 198307 288763 248191
13372B48191R4320I219M81812A64710d9747B25837r93E6693M22960O911A07199
$$ 248191 342511 9219 491031 164710 -49747 225837 224844 56693 479653 486564 107199
13360a16600D45196J11328F9075K71599m3534K21107n6573A58445o9996M8084
$$ -116600 445196 556524 69075 340674 297140 518247 461674 158445 88449 136533
13350A36533h8088B94635o5525J14929A61353K2926K35508A39971M27007k3585
$$ 136533 -88088 294635 229110 344039 161353 184279 419787 139971 566978 543393
13340E43393A15436K52151A41080L94841j95951j14021L54865B72109J43313q5130
$$ 543393 115436 367587 141080 535921 339970 225949 580814 272109 415422 330292
13330C30292A44921K79291J6829O7047B51568k6029K7563J37540H8476a1013H2598
$$ 330292 144921 424212 441041 508088 251568 225539 253102 390642 88476 -11013 82598
13318C35121r0520J73426L61597A45559K85179D9449L9608K31298i8574A62496
$$ 335121 244601 418027 779624 145559 430738 49449 89057 320355 -98574 162496
13307A37204q22C1438K28269a27274B20519N4853A9015K23773h5059C3616L66913
$$ 137204 136382 31438 259707 -127274 220519 275372 19015 242788 -85059 33616 400529
13296D00529A94103c20788H7866J60393A05892K16793f6324j64107A37628J60780
$$ 400529 194103 -320788 87866 248259 105892 322685 -66324 -230431 137628 298408
13286B98408e4908A97007C1803i065A86570F5130J61329E4545b10120B95695l9035
$$ 298408 -54908 197007 31803 -9065 186570 65130 226459 54545 -210120 295695 256660
13275B56660G3438Q1489k4067a4513E37856c208B49713k708b50383E8188J54022
$$ 256660 73438 154927 130860 -14513 537856 -3208 249713 247005 -250383 58188 212210
13264B12210M4731l4040J42448j44030A10254L61193c2550p813j03123L8849D17397
$$ 212210 256941 222901 365349 221319 110254 471447 -32550 -40363 -143486 -104637 417397
13252g3465J6138k296I768P0334L25657j63618r5841C1004J64536r5125K802e2143
$$ -73465 -57327 -59623 9768 80102 405759 242141 146300 31004 195540 100415 103217 -52143
13239C35797n8239G1696R2820O409c0982D45809j48450a19198E9741J93171B0487
$$ 335797 277558 71696 164516 170925 -30982 445809 297359 -119198 59741 252912 20487
13227D4117J13340M2354o1643N1252n1193k8742K85499A03487B3053a05174A73898
$$ 44117 157457 199811 138168 189420 138227 109485 394984 103487 23053 -105174 173898
13215A63914J67670A42197L24909A47252O1929A661J94840J18427K2993D0903
$$ 163914 331584 142197 467106 147252 209181 1661 196501 314928 337921 40903
13204B64089J65130A33846B0563K00861K4978a24527A31440l7767J33968a02244
$$ 264089 429219 133846 20563 221424 246402 -124527 131440 93673 227641 -102244
13193a57817B17948M0868A26116J34647b65792e186D1763J96579a52511C22120
$$ -157817 217948 258816 126116 260763 -265792 -5186 41763 238342 -152511 322120
13182F4820Q2554a26003l9703B49990R7259D1024L40676A27054L29771B01247
$$ 64820 147374 -126003 -165706 249990 347249 41024 381700 127054 456825 201247
13171f6840f693D22988I1900J50128q7736R1137Q3012h3706E5236J55477m8916
$$ -66840 -6693 422988 91900 242028 154292 245429 328441 -83706 55236 210713 161797
13160A61797J57222B893K89673j00416J02228m1381L5843e0437k3423C49776P4319
$$ 161797 319019 2893 292566 192150 294378 252997 288840 -50437 -73860 349776 424095
13149D24095E0500a41456A35552J59487f141q8150p3485A17701d896C7253c26413
$$ 424095 50500 -141456 135552 295039 -6141 -94291 -167776 117701 -4896 37253 -326413
13137C1059M6921J4330C9826J97988D8417N8923Q583a40663F7707L77277A91579
$$ 31059 77980 92310 39826 237814 48417 107340 115923 -140663 67707 444984 191579
13125B42791I3248d4293B56364J12088e6742D14013j42263f5518B1618E578L29932
$$ 242791 93248 -44293 256364 368452 -56742 414013 271750 -65518 21618 5578 335510
13114C35510A33049C4232K52443f6371j71561A93162a66639e1381b1460B70813
$$ 335510 133049 34232 286675 -66371 -237932 193162 -166639 -51381 -21460 270813
13103D278M91530d3392D24118A73473P7304a14958r2574E0881J53437j4433m9346
$$ 4278 495808 -43392 424118 173473 250777 -114958 -207532 50881 204318 189885 140539
13092A40539J32985C0518J17674b6161A09924a74501Q5976F0922K434K4550O1616
$$ 140539 273524 30518 148192 -26161 109924 -174501 -88525 60922 63356 87906 149522
13081A49522J7200a62543A60438K20116a26971B12999R8419A20967J85542G4522
$$ 149522 166722 -162543 160438 380554 -126971 212999 311418 120967 306509 74522
13070C34852A01387h266B8253K32523M5607b78552A82229j5270C3474J40123B9492
$$ 334852 101387 -8266 28253 260776 306383 -278552 182229 166959 33474 173597 29492
13058H6246a12072j09006I4228J08880J61738A27952N8198E1111K33816A16979
$$ 86246 -112072 -221078 94228 203108 364846 127952 186150 51111 284927 116979
13047E7797b16027K1640A67495a32709B09899j01479a64058E20850a7368j31300
$$ 57797 -216027 -194387 167495 -132709 209899 108420 -164058 520850 -17368 -148668
13037a48668B89525b0009A35126g2628M391k10596B38663F2902N9081J62084H4904
$$ -148668 289525 -20009 135126 -72628 -68237 -278833 238663 62902 121983 284067 84904
13025b77752A0396M97376B35289L93557e0988q9868d0657E23999A66594b44928
$$ -277752 10396 507772 235289 628846 -50988 -140856 -40657 523999 166594 -244928
13014B73269n8919c8446B24338j00615K8381a57422D5723J36372Q6188c3545j3125
$$ 273269 214350 -38446 224338 123723 152104 -157422 45723 182095 268283 -33545 -46670
13003d6670B15914b82143a28013A02280B1743J74605q6623K81217A12322J83558
$$ -46670 215914 -282143 -128013 102280 21743 196348 109725 390942 112322 295880
12993B95880j5629a09556A68067g2585B40177o0326K2351J31292c0610j3150B97614
$$ 295880 280251 -109556 168067 -72585 240177 179851 202202 333494 -30610 -43760 297614
12981I7752c17324B6986Q0908K62239c2513A40466b08356e8878R193i675B3596
$$ 97752 -317324 26986 107894 370133 -32513 140466 -208356 -58878 -49685 -9675 23596
12969e1910p060A23821C9882d3839m4202m2485e8735M801k403A49642a35029a9015
$$ -51910 -58970 123821 39882 -43839 -88041 -130526 -58735 -53934 -56337 149642 -135029 -19015
12956g8512A51597f2437B81707B1610K58824L6293i2650F688e9316F7099i477
$$ -78512 151597 -62437 281707 21610 280434 316727 -92650 6688 -59316 67099 -9477
12944C21481g0324A59417J4937p0653J1695J37918a78963B11311q4775f5042A24151
$$ 321481 -70324 159417 174354 103701 115396 253314 -178963 211311 126536 -65042 124151
12932C08996q4781c16821a29516A33411h2689b6614j6720k8417j02232a0118j99145
$$ 308996 224215 -316821 -129516 133411 -82689 -26614 -43334 -71751 -173983 -10118 -209263
12921b09263C46043c9242A90707O163a64092d760j37524N0843K9741C23490A2036
$$ -209263 346043 -39242 190707 196870 -164092 -4760 -142284 -91441 -61700 323490 12036
12909C03894M2521a39261A73253n8537b25695F6424h8147A43459a40380e7808
$$ 303894 346415 -139261 173253 114716 -225695 66424 -88147 143459 -140380 -57808
12898A32201b4712A92680o1656l195a48111O6932B73771J91783f8494F16247b493
$$ 132201 -24712 192680 131024 127829 -148111 -81179 273771 465554 -68494 616247 -2493
12886A28764N6571l6456a42470A29763F2269J58078C759b29035Q2372N1800j44308
$$ 128764 185335 148879 -142470 129763 62269 220347 3759 -229035 -146663 -94863 -239171
12875b39171B81078F6807E726b582F3493A462g6790m1100F048b43840B23186b86773
$$ -239171 281078 66807 5726 -2582 63493 1462 -76790 -117890 6048 -243840 223186 -286773
12862b11068B2223K77457A22556J71118l5280k2426J89257A03442a91941g2268
$$ -211068 22223 299680 122556 293674 258394 235968 425225 103442 -191941 -72268
12851B6767O3990c4592A54908a61868C47780A393M080O2923k7827P7474E3335
$$ 26767 90757 -34592 154908 -161868 347780 1393 5473 68396 40569 118043 53335
12839b73085C80721j88924k7820g772B69586K17723d8465F6555J55605g6860J7247
$$ -273085 380721 191797 163977 -7772 269586 487309 -48465 66555 222160 -76860 -59613
12828e9613B36887Q9174a1292k21034B03955p0933K26314j08409e6424k26098
$$ -59613 236887 326061 -11292 -232326 203955 133022 359336 250927 -56424 -282522
12818b82522C37338j36473n584I1485d3399k5486r085l2225A26682A5587a17968
$$ -282522 337338 200865 195281 91485 -43399 -68885 -77970 -110195 126682 15587 -117968
12806c60206B13619c7105B3266l862d28269C60827j31264a77006Q5070D2605K18484
$$ -360206 213619 -37105 23266 19404 -428269 360827 229563 -177006 -91936 42605 261089
12795B61089A06923B1981b19025F0232c6786j75632h4758E2293b7897E6229j1410
$$ 261089 106923 21981 -219025 60232 -36786 -212418 -84758 52293 -27897 56229 44819
12784D4819a48878B15260K6110P0074p0856D7283b97712D5588J84345H5148b73975
$$ 44819 -148878 215260 241370 311444 240588 47283 -297712 45588 229933 85148 -273975
12772a54178A08626J53546L6449d5845a3276m17040I6387P6079A2261f2741p7142
$$ -154178 108626 262172 298621 -45845 -13276 -430316 96387 172466 12261 -62741 -139883
12761a39883B04831a50878rF5016a9323B6625m000Q5973b58979a12580a2394j33679
$$ -139883 204831 -150878 -150887 65016 -19323 26625 22625 108598 -258979 -112580 -12394 -146073
12749a46073A45J70080a78006B29291e053m9801H7851e918k29793H2271J32823
$$ -146073 145 170225 -178006 229291 -5053 -54854 87851 -5918 -235711 82271 215094
12738B15094c0512C97049A25479a54562A32869a96217C9601a54222B7886L46516
$$ 215094 -30512 397049 125479 -154562 132869 -196217 39601 -154222 27886 374402
12728C74402A41564E0004c47303q4995G7422F549a2333A29917b40925B10246f9097
$$ 374402 141564 50004 -347303 -432298 77422 6549 -12333 129917 -240925 210246 -69097
12716B97597j32954K09707f7613B29603r9841J96767A45271K4273M067a04698
$$ 297597 164643 374350 -67613 229603 129762 326529 145271 169544 173611 -104698
12705B68723a50618k9995N403M4293H9969e1956C9838J14460a97481A31205C0264
$$ 268723 -150618 -180613 -175210 -130917 89969 -51956 39838 154298 -197481 131205 30264
12693A53121c61661A42514o5659c45275a64639B69094n5744D8767b97005A5816
$$ 153121 -361661 142514 76855 -345275 -164639 269094 213350 48767 -297005 15816
12682a34752E7291b40022K5635B72538H760M16498a50951K7838A25239l3940R1793
$$ -134752 57291 -240022 -214387 272538 8760 425258 -150951 -123113 125239 91299 183092
12671A83092l035a45777J9312c8680A85030J00679I6893D1131L28993j61586f0827
$$ 183092 180057 -145777 -126465 -38680 185030 285709 96893 41131 370124 208538 -60827
12659D88509A27056a216A95793L579b372D93632A11678l4107J49828D39d0788
$$ 488509 127056 -1216 195793 199372 -2372 493632 111678 77571 227399 439 -40788
12647I4682L56760a84875L367A86828L11961B0478K2129R1182O200B9441J29818
$$ 94682 451442 -184875 -181508 186828 498789 20478 42607 133789 139989 29441 159259
12636A59259a23284A43731J56512J57065c3352D6196c330E5245L71239q8893D313
$$ 159259 -123284 143731 300243 457308 -33352 46196 -3330 55245 426484 337591 4313
12624C56267J4841b02889C33721q4228a65970H5635J69527Q8764j62630b06914
$$ 356267 371108 -202889 333721 249493 -165970 85635 255162 343926 181296 -206914
12613A64934J48504A20416N34648A70219c3151C93101a85342M0881o9826c0266
$$ 164934 313438 120416 655064 170219 -33151 393101 -185342 -144461 -214287 -30266
12602b71288C34992b70722f0132A45486J38005I1594J52405a71949A85499a86486
$$ -271288 334992 -270722 -60132 145486 283491 91594 243999 -171949 185499 -186486
12591D939J51663A4312J49127a81611a3147A71961J01322b57567L2559b4186A15326
$$ 4939 156602 14312 163439 -181611 -13147 171961 273283 -257567 -225008 -24186 115326
12579B84639d951l1244a5330B50290b46422A3071K26903K0323c2703k9233b0642
$$ 284639 -4951 -36195 -15330 250290 -246422 13071 239974 260297 -32703 -61936 -20642
12567a3703j80996A59906M9927b8719k03141B56506j00035a09227A45985I266
$$ -13703 -194699 159906 209833 -28719 -231860 256506 156471 -109227 145985 9266
12556b73298J10054K2675A23196h1507B99941G0718J22074A718a18706I3691N6934
$$ -273298 -163244 -140569 123196 -81507 299941 70718 192792 1718 -118706 93691 150625
12545A50625b85554G1807d7398A2081M3150F859K97285A42709b99251a9469D0377
$$ 150625 -285554 71807 -47398 12081 55231 6859 304144 142709 -299251 -19469 40377
12533a53133K6149A65009c30608L6982K940A17460A7005a36363D3134J56914g2510
$$ -153133 -126984 165009 -330608 -293626 -290686 117460 17005 -136363 43134 200048 -72510
12521C55154d9364o0118B63032l2843K77758A9627L18174a17177B23716q587G4938
$$ 355154 -49364 -109482 263032 230189 507947 19627 337801 -117177 223716 215129 74938
12509d4625A97268R8774b52536G052K50061a95314B19309b30075A19688a60838
$$ -44625 197268 296042 -252536 7052 257113 -195314 219309 -230075 119688 -160838
12498a16811d8986j25579K3802O6697H0956O8945J02460A06437J5014K36989A35301
$$ -116811 -48986 -174565 -150763 -84066 80956 149901 252361 106437 121451 358440 135301
12486b01995A14307K56079A82478a02006G5449P4754b94014a7029j00791F2290
$$ -201995 114307 370386 182478 -102006 75449 150203 -294014 -17029 -117820 62290
12475a19915o0862D2832L30040b69967A09259J27462a75426B5298j1893c6445
$$ -119915 -180777 42832 372872 -269967 109259 236721 -175426 25298 13405 -36445
12464a70267L0748p3643L6264P3723C83823a44986d3484G5107M21787c02509H7645
$$ -170267 -139519 -213162 -176898 -103175 383823 -144986 -43484 75107 496894 -302509 87645
12452A74088D6054b83448i8630d1700c162k72731g1312I6522Q4823A6892a70401
$$ 174088 46054 -283448 -98630 -41700 -3162 -275893 -71312 96522 181345 16892 -170401
12440a02920d8301Q746q108A78161A4672a3927H8542a67593C12793b59576j2669
$$ -102920 -48301 -39555 -47663 178161 14672 -13927 88542 -167593 312793 -259576 -272245
12429b72245A58119p3007J40922n7395J96308a95519e6847l28680C9996o947J6962
$$ -272245 158119 85112 226034 168639 364947 -195519 -56847 -385527 39996 33049 50011
12418E0011J75551b63971a04998B8943O973a09233A62309j4943L8925P0921k4922
$$ 50011 225562 -263971 -104998 28943 35916 -109233 162309 147366 186291 257212 232290
12407B32290a02583j30705b1640A33704F964L07707o226F096a21310a6393j16361
$$ 232290 -102583 -233288 -21640 133704 6964 314671 308445 6096 -121310 -16393 -132754
12396a32754l28615J55702E371K23951a40277e8214o4840J6828q8161B47020e2487
$$ -132754 -461369 -305667 5371 229322 -140277 -58214 -123054 -106226 -194387 247020 -52487
12384E2636k4144J85837k5747o9161b92806B8410N0685d05137e4064B37381b05523
$$ 52636 28492 214329 188582 119421 -292806 28410 79095 -405137 -54064 237381 -205523
12372F6207P6014M0199J38604A55042m1156J78891a90936B50386i1298j09649
$$ 66207 142221 182420 321024 155042 113886 292777 -190936 250386 -91298 -200947
12362b00947k04578J76320j04646c6113D0498b74185F2159j2817i7982l0151D24686
$$ -200947 -405525 -229205 -333851 -36113 40498 -274185 62159 49342 -97982 -128133 424686
12350a14331B01706B5575a85774m5864C07161h9891J6014E303P3858b3401k14558
$$ -114331 201706 25575 -185774 -231638 307161 -89891 -73877 5303 79161 -23401 -237959
12339b37959G8644b07422d5709A50588c7924j36857j69219F3618N8635a50931
$$ -237959 78644 -207422 -45709 150588 -37924 -174781 -344000 63618 122253 -150931
12328A0682g508A16631j525b39815L6561O2406e2211B70533a83925A3611K78383
$$ 10682 -7508 116631 115106 -239815 -203254 -140848 -52211 270533 -183925 13611 291994
12317B91994A9889c8202A73496a38037M0359A84208l4681J3211E6562J15187a74043
$$ 291994 19889 -38202 173496 -138037 -97678 184208 149527 162738 56562 171749 -174043
12305a92435R3144h060A5562e6553p8784l89214a28524C18518A27L5104J00137
$$ -192435 -99291 -8060 15562 -56553 -135337 -524551 -128524 318518 127 35231 135368
12294A35368B9645O5627d7181D5194g3080B54558a85264L2485k91242I9069J33674
$$ 135368 29645 95272 -47181 45194 -73080 254558 -185264 -152779 -444021 99069 232743
12283B32743d6972C19277F4992J27702B8966h4959D45338k03987k6505P612K85478
$$ 232743 -46972 319277 64992 192694 28966 -84959 445338 241351 214846 222458 507936
12272E07936I3531K90634a62048F5164l426a65819C7804a79938B22638J34170
$$ 507936 93531 384165 -162048 65164 61738 -165819 37804 -179938 222638 356808
12262C56808r4168K3063a47667C00322a2451j27817B12422p2836K37740h0371
$$ 356808 262640 285703 -147667 300322 -12451 -140268 212422 139586 377326 -80371
12251B10196b11684C13808B1193J01087l7560C8290g7147j84077H6304J0581a43812
$$ 210196 -211684 313808 21193 122280 84720 38290 -77147 -261224 86304 96885 -143812
12239a98733A97594C763O6929K71027A08381n413k1521o888K2715a35002A83906
$$ -198733 197594 3763 70692 341719 108381 102968 81447 74559 97274 -135002 183906
12227B47278j16969J32327K5851A38298b2762C26984O0251j13898j23836C9408
$$ 247278 130309 262636 288487 138298 -22762 326984 387235 273337 149501 39408
12216a84620A60881J94003R128A3090J43683J64718j31521l203F9477K02455H6300
$$ -184620 160881 354884 364012 13090 156773 321491 189970 186767 69477 271932 86300
12204C3734a17282A83102J16882J31301I506Q1299J90133a53279A35532m3127
$$ 33734 -117282 183102 299984 431285 9506 90805 280938 -153279 135532 92405
12194I2405J57669r7403a2965A01485J88869B6379b4846A18142i8164H0059J33143
$$ 92405 250074 152671 -12965 101485 290354 26379 -24846 118142 -98164 80059 213202
12183B13202M1478E4827e836E1027n414J96620C3815o412o8J88510A8917b03519
$$ 213202 254680 54827 -5836 51027 45613 242233 33815 27403 27335 215845 18917 -203519
12170A86513L1803Q2927a53496B09426b21091g6692B89627A38406J85630J04211
$$ 186513 218316 301243 -153496 209426 -221091 -76692 289627 138406 324036 428247
12160D28247j74642k1801E2676k0582g4976C38101f5391C8251R2526A6903J22809
$$ 428247 253605 231804 52676 32094 -74976 338101 -65391 38251 130777 16903 139712
12149A39712a97813E2313L34244c96814i9833F3814b00577D31137i5733K4384
$$ 139712 -197813 52313 386557 -396814 -99833 63814 -200577 431137 -95733 -71349
12139g1349A00432b15731G4626a31506A08552a44810N8301A92569i8505F349g5202
$$ -71349 100432 -215731 74626 -131506 108552 -144810 -86509 192569 -98505 6349 -75202
12127A73939k0635l3576O1213O547m1506n0510P72b20276c7210C68392a37651
$$ 173939 153304 119728 180941 187488 145982 95472 96244 -220276 -37210 368392 -137651
12115B60821A07828L77186a3191E6254J40790F4228N9079a83968J281e5858B56336
$$ 260821 107828 485014 -13191 56254 197044 64228 123307 -183968 -182687 -55858 256336
12103A34996c8991B51868c4018k91150f1200B63754h3138B66648A26455P1673
$$ 134996 -38991 251868 -34018 -325168 -61200 263754 -83138 266648 126455 198128
12093A98128J05065j39009a09491a7752r9590o1239A32130a72949A75388E0567
$$ 198128 303193 164184 -109491 -17752 -117342 -178581 132130 -172949 175388 50567
12082c55837e7308A43324a98704A11683h1096G147e653B48822j16163k9000d5957
$$ -355837 -57308 143324 -198704 111683 -81096 7147 -5653 248822 132659 103659 -45957
12070h286B2667h6765F3835a06110I5022K57898J39324M66938K3126J90129E17751
$$ -8286 22667 -86765 63835 -106110 95022 352920 492244 959182 982308 1172437 517751
12058C51896b02161j31983B26464r7688m6661e5112j67713b0590H5639j0460J51231
$$ 351896 -202161 -334144 226464 128776 82115 -55112 -222825 -20590 85639 75179 226410
12047B26410d0364o4316J830J5243j86132A5368a58500b417I1811a58543B6212
$$ 226410 -40364 -104680 -102850 -87607 -273739 15368 -158500 -2417 91811 -158543 26212
12035c03375A6033J03980j4427c9316A09226a46822M3393C18763b3898l49567
$$ -303375 16033 120013 105586 -39316 109226 -146822 -103429 318763 -23898 -373465
12025c73465B69059a29672N9246b6491E8818b80300F6883o486b26310A51610J70584
$$ -373465 269059 -129672 -70426 -26491 58818 -280300 66883 60397 -226310 151610 322194
12014C22194F1005a13698K3054k02174A59622C7786e9303B1887b08799N0512A83394
$$ 322194 61005 -113698 -90644 -292818 159622 37786 -59303 21887 -208799 -158287 183394
12002a47815J1746C85066j02123b03950M9486M4409n1816k833B04705A3929K07668
$$ -147815 -136069 385066 282943 -203950 -154464 -110055 -161871 -164704 204705 13929 221597
11991B21597E625K51060j02213g0488B291a61358A46718G2909A4143J54674c6731
$$ 221597 5625 256685 154472 -70488 2291 -161358 146718 72909 14143 168817 -36731
11979a51349j6828I7629h1458A28616N8396a8926B14138d4425l3227o1176G5036
$$ -151349 -168177 97629 -81458 128616 187012 -18926 214138 -44425 -77652 -138828 75036
11967B0826a62816P0232E485b06809C54501a38683C0019c40898C25120j52313
$$ 20826 -162816 -92584 5485 -206809 354501 -138683 30019 -340898 325120 172807
11957A72807C4215a84386D0024a17392o8063j13200a08341B21806E7736M311A039
$$ 172807 34215 -184386 40024 -117392 -185455 -298655 -108341 221806 57736 62047 1039
11945G0226a50442A2204f6473B16470b61795J8844J08190H2613B7934a22917A25022
$$ 70226 -150442 12204 -66473 216470 -261795 -242951 -134761 82613 27934 -122917 125022
11933b66975B993a22370j46907A36859E6864a50354j1402n6698m9495i9443B79544
$$ -266975 2993 -122370 -269277 136859 56864 -150354 -161756 -218454 -267949 -99443 279544
11921h2296e839m02670F399g0704k57006a8593A33976a81678R985H1753j5490
$$ -82296 -5839 -408509 6399 -70704 -327710 -18593 133976 -181678 -171693 81753 66263
11910F6263J70134a78202l3388C00522j18217B3566J33558e298A68023b58424
$$ 66263 236397 -178202 -211590 300522 182305 23566 157124 -5298 168023 -258424
11899G7229J47350b7465B35484f6767k14679R4122g1771A21938n6513J67208i0006
$$ 77229 224579 -27465 235484 -66767 -281446 -187324 -71771 121938 65425 232633 -90006
11887b73114J24877B60822a92003E6917b16771B4033a13538r2440N2577g6548
$$ -273114 -148237 260822 -192003 56917 -216771 24033 -113538 -205978 -153401 -76548
11876f7639B615P1303L12393c92791a33796k28673B6911e4212F7596j5907c62526
$$ -67639 2615 73918 386311 -392791 -133796 -362469 26911 -54212 67596 51689 -362526
11864a20044A5344g6225c4086j38383A3567i9562A53291d007E6794L8320m129
$$ -120044 15344 -76225 -34086 -172469 13567 -99562 153291 -4007 56794 95114 90985
11853I0985a57245A61355b65132E6125L9536K4202L36075e7914G3320b08326M8741
$$ 90985 -157245 161355 -265132 56125 95661 119863 455938 -57914 73320 -208326 -159585
11842a59585j74854d5669j56972c4329A39263C9846d7346C60628j57915b72739
$$ -159585 -334439 -45669 -202641 -34329 139263 39846 -47346 360628 202713 -272739
11831A60521b64486A15686f6257j9705H9855j176b37256N4032B98904a32087r8033
$$ 160521 -264486 115686 -66257 -85962 89855 88679 -237256 -183224 298904 -132087 -230120
11820b30120G212a12948A32576C8216b96315Q9131g4484D1697f1044j01447F9090
$$ -230120 7212 -112948 132576 38216 -296315 -207184 -74484 41697 -61044 -162491 69090
11808h3892j42591A06459d73758G0336d2700q8859c8650p1358F1550c0583j74035
$$ -83892 -226483 106459 -473758 70336 -42700 -131559 -38650 -110008 61550 -30583 -204618
11797b04618j971j5455a08994K4884F3408a95985Q9293A0576g5756I4537f4391
$$ -204618 -206589 -222044 -108994 -84110 63408 -195985 -106692 10576 -75756 94537 -64391
11785D8493M2903a41505E2079K2248a89710R0283K4091B17641a3090H0105b09526
$$ 48493 91396 -141505 52079 74327 -189710 -99427 -75336 217641 -13090 80105 -209526
11773C1570J78932I61M9279a26753A49776l6010e15262a46716d68A4161c4641
$$ 31570 210502 961 50240 -126753 149776 113766 -515262 -146716 -468 14161 -34641
11761A94863a01027H1368b12165M6316I2064L78105b7409I3417O1236C429g6453
$$ 194863 -101027 81368 -212165 -165849 92064 470169 -27409 93417 154653 3429 -76453
11749A29303e20o454E5968f9133K8848q4254j08348A3430K59114a87113a6595
$$ 129303 -520 -6974 55968 -69133 -40285 -124539 -232887 13430 272544 -187113 -16595
11737a46476d9070q766p6306e2961j9643A51536Q251c31542D29809H9472J62715
$$ -146476 -49070 -57836 -134142 -52961 -72604 151536 159787 -331542 429809 89472 252187
11726B52187M774a18895A26747n6472a80563C0485f6791F0943H791a01375l9899
$$ 252187 256961 -118895 126747 70275 -180563 30485 -66791 60943 8791 -101375 -141274
11715a41274A73150L20155b27347B7551a43139r879n3646F5022a95860A77687
$$ -141274 173150 493305 -227347 27551 -143139 -153018 -206664 65022 -195860 177687
11704g0242A44038a03365j78766F4097J13036a02331j14210d9156I2248M5231
$$ -70242 144038 -103365 -282131 64097 177133 -102331 -216541 -49156 92248 137479
11694A37479N7699m4804K24480a9498B10628H7714d270o6494j03563A98362C9752
$$ 137479 195178 150374 374854 -19498 210628 87714 -4270 -70764 -174327 198362 39752
11682D9592K63983a03810B36117b0797m498H6382g1603m7527E7303C297J83715
$$ 49592 313575 -103810 236117 -20797 -25295 86382 -71603 -119130 57303 3297 187012
11671A87012h0829F2875e5978j31768a2874G0768b9161D1473a41170D7037d8791
$$ 187012 -80829 62875 -55978 -187746 -12874 70768 -29161 41473 -141170 47037 -48791
11659a41491L0203N4469j41013B1959a62390B017a72496B07637e3822j89743A72441
$$ -141491 -111288 -56819 -197832 21959 -162390 2017 -172496 207637 -53822 -243565 172441
11647G5609b66375a17512A80689B1251b94415H3543a5539O721k24707K683G0210
$$ 75609 -266375 -117512 180689 21251 -294415 83543 -15539 -8818 -233525 -230842 70210
11635d26451D2495b69458i753l7088p7717j01605a6852B84871c5090H2974a0917
$$ -426451 42495 -269458 -9753 -46841 -124558 -226163 -16852 284871 -35090 82974 -10917
11623A58651a45907A92108l9445c64091G8527J03013K8409F6846c3714A66967
$$ 158651 -145907 192108 152663 -364091 78527 181540 209949 66846 -33714 166967
11612B29543F5794a60686m5822E5773e9775A07896a2838k6509q224H1536l8533
$$ 229543 65794 -160686 -206508 55773 -59775 107896 -12838 -39347 -47571 81536 43003
11601D3003a17356I2134J83457b31188A19227J69159j0474b41901E7807a43648
$$ 43003 -117356 92134 275591 -231188 119227 288386 277912 -241901 57807 -143648
11590G1389b18755C056d22408B38291j08866M3980m1175P2713H5602f8252J5225
$$ 71389 -218755 3056 -422408 238291 129425 173405 132230 204943 85602 -68252 -53027
11579e3027b1556j72748B15577B9458J06494L43952B05203a6168C81191A25015
$$ -53027 -21556 -194304 215577 29458 135952 479904 205203 -16168 381191 125015
11568G9860b08090i1357l04390C84690D625e4818p8415B30732M6353A18744l497
$$ 79860 -208090 -91357 -395747 384690 4625 -54818 -133233 230732 277085 118744 115247
11557A15247n5647e6716j2549j50012K7680i4838C7691P5264m4323d2618B23199
$$ 115247 59600 -56716 -69265 -219277 -191597 -94838 37691 112955 68632 -42618 223199
11545a41147A55873e0974j09938c2287B0603d0365R318C6534b784A53983b12812
$$ -141147 155873 -50974 -160912 -32287 20603 -40365 -31047 36534 -2784 153983 -212812
11533B38149g1543C79561G5351J39561n5764K73052a54822F2877f4885j7826A67513
$$ 238149 -71543 379561 75351 214912 159148 432200 -154822 62877 -64885 -82711 167513
11521a62435c508r1498l9027a2973j37314o96M2408B34278R255G7199P4842k223
$$ -162435 -3508 -95006 -134033 -12973 -150287 -150983 -108575 234278 243533 77199 152041 149818
11509A49818P111L847J72m173L9236a43458A11356f279j85243B38773r8742J15970
$$ 149818 156929 160776 160948 156775 196011 -143458 111356 -6279 -191522 238773 140031 256001
11497B56001A00707p748K51106A61311P9220a05409E2482d2965H3208M25777k40505
$$ 256001 100707 92959 344065 161311 240531 -105409 52482 -42965 83208 508985 268480
11486B68480a82569A34179L77740B05086g026B21359K44172k5974c13667J23592
$$ 268480 -182569 134179 511919 205086 -7026 221359 465531 439557 -313667 -190075
11476a90075h5721C05568O2784A61683b3041C0361J17007O9987p2073b0433k3820
$$ -190075 -85721 305568 368352 161683 -23041 30361 147368 217355 145282 -20433 -44253
11465d4253E31879B0489J86606K8038B1583K91362h053j28001B96871a47966C28759
$$ -44253 531879 20489 207095 235133 21583 312945 -8053 -136054 296871 -147966 328759
11453B60716b78027B1699L31454r2579J06000c8835A27016D5049J32252A7873
$$ 260716 -278027 21699 353153 260574 366574 -38835 127016 45049 177301 17873
11442A22593D2919f0331B61877q3746c38035a42950r7489D3682a88250E6715P1318
$$ 122593 42919 -60331 261877 178131 -338035 -142950 -240439 43682 -188250 56715 128033
11431A28033l0916N4646J67532e0043B32913h2474k12882B76944H4312M2338c32726
$$ 128033 97117 151763 319295 -50043 232913 -82474 -295356 276944 84312 126650 -332726
11419a58616J3379B04166n5441J16647D4704b11148M6154A58219l2746a02564
$$ -158616 -145237 204166 148725 265372 44704 -211148 -164994 158219 125473 -102564
11408D649i1322p318j90512A47719m5246D9508a85263M6147j34117l51054b02251
$$ 4649 -91322 -98640 -289152 147719 102473 49508 -185263 -139116 -273233 -624287 -202251
11396a6435r4154j18622M9795b3528k91255h5926A58443A5393g19G322K02513
$$ -16435 -110589 -229211 -179416 -23528 -314783 -85926 158443 15393 -719 7322 209835
11385B09835R8527a01442H7925o285J76155a74338K1218B9760a66748B04906a04364
$$ 209835 308362 -101442 87925 81640 257795 -174338 -153120 29760 -166748 204906 -104364
11373A658K02571a36246A74251G0684i6675A6949b955A15580E2254a69279H0776
$$ 1658 204229 -136246 174251 70684 -96675 16949 -2955 115580 52254 -169279 80776
11361A11867M944d6547k963G2867K95039B1039g4121A72297C3902J22034j46c86469
$$ 111867 116811 -46547 -49510 72867 367906 21039 -74121 172297 33902 155936 155790 -386469
11348b04937n0518J07464A15714g6688L8149A29603e9935A3010J25583R0715K77188
$$ -204937 -255455 -147991 115714 -76688 -38539 129603 -59935 13010 138593 229308 506496
11337E06496d11308f8231q2672q5006Q8279A34413l0144J76384A09707l0052B5926
$$ 506496 -411308 -68231 -150903 -235909 -147630 134413 104269 280653 109707 79655 25926
11325a6070F6390a21864A29241k7568a80694Q1291m08352a03071k23102m1169
$$ -16070 66390 -121864 129241 101673 -180694 -99403 -507755 -103071 -326173 -367342
11315c67342B03277a7704D1394J70199a24572B02951f2090C5076L0121J92140
$$ -367342 203277 -17704 41394 211593 -124572 202951 -62090 35076 65197 257337
11305B57337k9559r2836a58257k04669I4207h2143A26326c81878C50879b68268
$$ 257337 227778 134942 -158257 -362926 94207 -82143 126326 -381878 350879 -268268
11294a94306E0360q868a10627A97368f6723A05915b73965B5271d35120a9264r9771
$$ -194306 50360 41492 -110627 197368 -66723 105915 -273965 25271 -435120 -19264 -119035
11283a19035K0588C35741f1108H2991f1842B0393a8545j33649A16727h540A08979
$$ -119035 -98447 335741 -61108 82991 -61842 20393 -18545 -152194 116727 -8540 108979
11271a77008D022a05715j12164e9842n1096M6453B3257J78120a86071N6387n572
$$ -177008 4022 -105715 -217879 -59842 -110938 -64485 23257 201377 -186071 -129684 -135256
11260a35256a7720l5026p1688m7583O2090B36685D1572h4180j60938a04430A93753
$$ -135256 -17720 -52746 -124434 -172017 -109927 236685 41572 -84180 -245118 -104430 193753
11248b52890a08612L6888D9835b76835B36472a10721F47699d21114A41267c37423
$$ -252890 -108612 -71724 49835 -276835 236472 -110721 647699 -421114 141267 -337423
11237B26740b4321B01895q0500J42188a04685B1705a01189j12504f213A37002
$$ 226740 -24321 201895 121395 263583 -104685 21705 -101189 -213693 -6213 137002
11226A04038b57469j62160c1889G4249B3558c59184B43164b23327a00907B74526
$$ 104038 -257469 -419629 -31889 74249 23558 -359184 243164 -223327 -100907 274526
11215A41728P0023g118o3520b0141C9147c02967A33620l4857a30994o3046l1006
$$ 141728 211751 -7118 -70638 -20141 39147 -302967 133620 98763 -130994 -194040 -225046
11204b25046g5787m7112B9579i5678I2395F632h5335A51509b94759h4857j82657
$$ -225046 -75787 -122899 29579 -95678 92395 6632 -85335 151509 -294759 -84857 -267514
11193b67514o324N8971D1816J48457b0491m9877A38031b69648J24589k34997F1267
$$ -267514 -273838 -214867 41816 190273 -20491 -70368 138031 -269648 -145059 -380056 61267
11181D1101K24517k2435a41434k44874I8475C7030K00983C5546a23062H2888O0479
$$ 41101 265618 243183 -141434 -386308 98475 37030 238013 35546 -123062 82888 143367
11170A43367B9105J74072b45589P8560A1756f395j67883k2648B23713a53084C2712
$$ 143367 29105 203177 -245589 -167029 11756 -6395 -174278 -196926 223713 -153084 32712
11158b98210B01781b55772b3837B45875f1042l4529d844j76524H7320b71184B71432
$$ -298210 201781 -255772 -23837 245875 -61042 -95571 -4844 -181368 87320 -271184 271432
11146a31570a0236l11370e4003n0822j07030e3172M460H0000a20729p4949q445
$$ -131570 -10236 -321606 -54003 -104825 -211855 -53172 -48712 80000 -120729 -195678 -204123
11135b04123j64969A64582b41582f9683A56054k665o1779h5869H1172b2106B92285
$$ -204123 -369092 164582 -241582 -69683 156054 153389 91610 -85869 81172 -22106 292285
11123F7879R075J87607C2160b65344C25211j16124m3184b44785B71210a70662
$$ 67879 76954 264561 32160 -265344 325211 209087 165903 -244785 271210 -170662
11112I9392J24903l1848d5617A84606K0118D916L48715A54379K25501H362a02091
$$ 99392 224295 192447 -45617 184606 204724 4916 353631 154379 379880 8362 -102091
11100A27273L16296a23997C89780A90442n8343a77223k7771A61271K55298b5063
$$ 127273 443569 -123997 389780 190442 132099 -177223 -204994 161271 416569 -25063
11089C55093A48460k6189j8927L32561j76229J4196K62044i9214E52289j03768
$$ 355093 148460 122271 103344 435905 259676 273872 535916 -99214 552289 448521
11079D48521g2267B08069L7542J06203R6357j44610m5943J71891N1804k21833
$$ 448521 -72267 208069 245611 351814 448171 303561 257618 429509 481313 259480
11069B59480K1583J07347m4439A25176M93691I6158J23547M00699k74015K89604
$$ 259480 281063 388410 343971 125176 618867 96158 219705 620404 346389 635993
11059F35993k03459J93201O0447j36254J89867A92392M15673J53448N5888k39884
$$ 635993 432534 625735 686182 549928 739795 192392 608065 761513 817401 577517
11049E77517K46213j82623j34639K56381j89108L11108L93408n60734J90658J69353
$$ 577517 823730 641107 506468 762849 573741 884849 1278257 717523 908181 1077534
11039A077534K8460m17647P5428m5121j20303M7804J41389j86250J09887j28761
$$ 1077534 1105994 688347 763775 718654 598351 646155 787544 601294 711181 582420
11029E82420L68242p4272p2769J51455j73164r5399J8069o4461R742m4500r5444
$$ 582420 950662 876390 803621 955076 781912 686513 704582 640121 649863 605363 509919
11018E09919A78003P85127m03388K8042L04541m05449K03601k71669M62204o9666
$$ 509919 178003 963130 559742 587784 892325 486876 690477 418808 881012 811346
11008H11346k84963M32499j18229k48636j22070J22778k39880L48296l30287L97626
$$ 811346 526383 958882 840653 592017 469947 592725 352845 701141 370854 768480
10998G68480j79863j4368J42417p2888J68368l78140K45710j62895J14154q7094
$$ 768480 588617 574249 716666 643778 812146 434006 679716 516821 630975 543881
10988E43881L20997K71769j87308Q746l91853L11138K69753j94235L82841k27321
$$ 543881 864878 1136647 949339 958085 566232 877370 1147123 952888 1335729 1108408
10978A108408L03609k677J03550N22240M19365J75298l65834L17097K60701O4415
$$ 1108408 1412017 1409340 1512890 2035130 2454495 2629793 2263959 2581056 2841757 2906172
10968B906172K18464l51349l29670P349m64621m9709l46308j34607O7667k21766
$$ 2906172 3124636 2773287 2443617 2450966 1986345 1936636 1590328 1455721 1523388 1301622
10958A301622K97863m31967Q4684J40544j51416j94084l47873L47764C61767L72451
$$ 1301622 1599485 1167518 1252202 1392746 1241330 1047246 699373 1047137 361767 734218
10948G34218j20692A04235M88167A83140K44185j9175b04548C04845A38228n0284
$$ 734218 613526 104235 592402 183140 427325 408150 -204548 304845 138228 87944
10938H7944K61058a00188D08969j64918o5913L8682A0817M0132L22386I5839P4177
$$ 87944 349002 -100188 408969 244051 178138 216820 10817 50949 373335 95839 170016
10927A70016a06570B00048e6231F6895R3389O6099b05280A13532l3621a65166
$$ 170016 -106570 200048 -56231 66895 160284 226383 -205280 113532 79911 -165166
10916a80237C60614m1801g3902F0210J93298I6090a3227C97516A52365c9209q6949
$$ -180237 360614 318813 -73902 60210 253508 96090 -13227 397516 152365 -39209 -126158
10905a26158A79190c1697j7737m662A39641i4552M1132m6914D21865A18574d4250
$$ -126158 179190 -31697 -49434 -54096 139641 -94552 -53420 -100334 421865 118574 -44250
10893a64189B0466g9880F6433L0392P2517c2596d310j23806J3290L7770a0222
$$ -164189 20466 -79880 66433 96825 169342 -32596 -4310 -128116 -114826 -77056 -10222
10881A12826k6241i1165A92231K4455A0496K3028f9590l2389j77606G2034J72662
$$ 112826 86585 -91165 192231 216686 10496 33524 -69590 -101979 -279585 72034 244696
10870B44696b69720e5635j60489P3593b2322E9884k6283d8419A7112K17390D8459
$$ 244696 -269720 -55635 -216124 -142531 -22322 59884 33601 -48419 17112 234502 48459
10858c87363A57157D0205K69557C0066a83653j88461F3816b14114A89214h9545
$$ -387363 157157 40205 309762 30066 -183653 -372114 63816 -214114 189214 -89545
10847c4334J5010m9161k56621c547B06445e7023I0975G633P2835l1968B514d8539
$$ -34334 -19324 -68485 -325106 -3547 206445 -57023 90975 7633 80468 48500 2514 -48539
10834A09481k237c73831f0073B36282b42343B16349a96683O2381B22606a4785
$$ 109481 107244 -373831 -60073 236282 -242343 216349 -196683 -134302 222606 -14785
10823F9453L450c15277B9063d2377j27703r0725B08161d9046B23734r4243e3806
$$ 69453 72903 -315277 29063 -42377 -170080 -260805 208161 -49046 223734 129491 -53806
10811a49949L5916L8425j40941Q3246j59841c1089B67468b35711A1254a72567
$$ -149949 -114033 -75608 -216549 -133303 -293144 -31089 267468 -235711 11254 -172567
10800D9392f3998G9164l794a22719A91274a80281E7697e6734A27433J31435a50026
$$ 49392 -63998 79164 75370 -122719 191274 -180281 57697 -56734 127433 258868 -150026
10788e81155a76556p1437B8472c41248A69218c37907f9038j00883A25916a53565
$$ -581155 -176556 -247993 28472 -341248 169218 -337907 -69038 -169921 125916 -153565
10777c45578f7738j92955l8753a41961H0187k2543O2224K721b1911p0744D70795
$$ -345578 -67738 -260693 -299446 -141961 80187 57644 119868 122589 -21911 -92655 470795
10765I7935J14107A4300a30496B40747c02946G632b22631e6268q6116d8338l7688
$$ 97935 212042 14300 -130496 240747 -302946 7632 -222631 -56268 -142384 -48338 -86026
10754h6026q4641H9432c59745B51953H2872a17983c7789D0189J18125J93432c5803
$$ -86026 -170667 89432 -359745 251953 82872 -117983 -37789 40189 158314 351746 -35803
10742c03468A81205A5110O9288J15859c3672l15382J57701M9242N5801E7205c16436
$$ -303468 181205 15110 84398 200257 -33672 -349054 -191353 -142111 -86310 57205 -316436
10730a28908D0709L71695p0814c60734A37918c03446I2742a89680k38189a81k55467
$$ -128908 40709 412404 341590 -360734 137918 -303446 92742 -189680 -427869 -181 -255648
10719b55648D3926A0854f7575A209K34957b36311j9986L6670B4901L25162A12686
$$ -255648 43926 10854 -67575 1209 236166 -236311 -256297 -219627 24901 350063 112686
10707h4919A91303G4071d5338F800a38897p1370H3355f86k67121c8825a1615k15822
$$ -84919 191303 74071 -45338 6800 -138897 -210267 83355 -686 -267807 -38825 -11615 -227437
10695b27437A43097n0554A7996J76462a11755A36339b17499J4916B03764b47627
$$ -227437 143097 92543 17996 194458 -111755 136339 -217499 -202583 203764 -247627
10684g0513C15559D3852f9672g944B48712c50358a45713o7455b738k144b176l8540
$$ -70513 315559 43852 -69672 -7944 248712 -350358 -145713 -213168 -2738 -4882 -2176 -40716
10672d0716E9427a63926H8808A2133b58773F9572g697l05683I3088c03470A89100
$$ -40716 59427 -163926 88808 12133 -258773 69572 -7697 -313380 93088 -303470 189100
10660F5969a08357A15851a9864o8890J4726A8785h6973k49205B14868B2087n23
$$ 65969 -108357 115851 -19864 -88754 -74028 18785 -86973 -336178 214868 22087 21564
10649B1564C029g8834k80822B42668Q0517a72789H5426J39757a27530I9171g8543
$$ 21564 3029 -78834 -359656 242668 323185 -172789 85426 225183 -127530 99171 -78543
10637C2990a43362F5767a68476q5161h9911l58449K18547B7239R0239f3359A6344
$$ 32990 -143362 65767 -168476 -253637 -89911 -448360 -229813 27239 117478 -63359 16344
10625b61017E1300b41811J7082P7510r9206B195K1180a88128d9950G067f6658
$$ -261017 51300 -241811 -224729 -147219 -246425 2195 23375 -188128 -49950 7067 -66658
10613A38355a92571D682a64169L5835D4590e1075m80095E9535b4236j45604N8909
$$ 138355 -192571 4682 -164169 -128334 44590 -51075 -531170 59535 -24236 -169840 -110931
10602a10931K2396J3138j00611A42596A1264a17766A09953a8851j67790G2031
$$ -110931 -88535 -75397 -176008 142596 11264 -117766 109953 -18851 -186641 72031
10591a49261F3743G013P2930g7375G7944g6686A46753K8730k5022a52128K5360
$$ -149261 63743 7013 79943 -77375 77944 -76686 146753 175483 150461 -152128 -126768
10580a26768C77879h0230j19966A49229A203a9543A10534b9312j59611b4359j70020
$$ -126768 377879 -80230 -200196 149229 1203 -19543 110534 -29312 -188923 -24359 -194379
10569a94379m0060f5286B88519b21856e383r1148L3041m3362a5327o912j67811
$$ -194379 -234439 -65286 288519 -221856 -5383 -96531 -63490 -106852 -15327 -22239 -190050
10558a90050f3405j14473l1200D2381a65878A35381F3207L9056a43613A83478
$$ -190050 -63405 -177878 -209078 42381 -165878 135381 63207 102263 -143613 183478
10547I7949c8012A58282M0742A8478c08111R8819A59164G5955J15141q1473k7426
$$ 97949 -38012 158282 199024 18478 -308111 -209292 159164 75955 191096 109623 82197
10536H2197C9820A2919b4841j2766B04704D75a17179A03964m8896a36849G9367
$$ 82197 39820 12919 -24841 -37607 204704 475 -117179 103964 55068 -136849 79367
10524A31678a51474N5909A67179a47803H8179b060j00635a4307q8223C8300J34248
$$ 131678 -151474 -95565 167179 -147803 88179 -2060 -102695 -14307 -102530 38300 172548
10513A72548b10214B2053c14723A38800i2541j0846k7631C4378N3257M0546H49
$$ 172548 -210214 22053 -314723 138800 -92541 -103387 -131018 34378 87635 128181 849
10501B5528j1414O312d1743p1625n2425j1764j1343g7442n45A36284a48832M0881
$$ 25528 14114 20426 -41743 -113368 -165793 -177557 -188900 -77442 -77987 136284 -148832 -107951
10489a07951G735e9260D714K69759h2566B13889a51126N4291H0990K38826C4280
$$ -107951 7735 -59260 4714 274473 -82566 213889 -151126 -96835 80990 319816 34280
10477B49427D2178A8121N0011c0548p2525B78476c43599b041C13357D6521Q9633
$$ 249427 42178 18121 68132 -30548 -103073 278476 -343599 -2041 313357 46521 136154
10466A36154f0586j38504H2889c4750j90794A2280J17687B8338N8604A7243c6381
$$ 136154 -60586 -199090 82889 -34750 -225544 12280 129967 28338 86942 17243 -36381
10454a16659p0012a6346j2648q8879PA18704b64424a20230E2343a48570A45270
$$ -116659 -186671 -16346 -28994 -117873 -117866 118704 -264424 -120230 52343 -148570 145270
10442G8378j6143c61135J72103I4254L937f9742K7292E1438h8002C7008b27907
$$ 78378 62235 -361135 -189032 94254 98191 -69742 -42450 51438 -88002 37008 -227907
10430d9555A86897n0422o7109d6412b1215q1359G1370b80567J32849L1237b3200
$$ -49555 186897 136475 69366 -46412 -21215 -102574 71370 -280567 -147718 -116481 -23200
10418B04835a82743m8395Q7907a8707r359A94723f5799A510c50029p6926K05821
$$ 204835 -182743 -231138 -143231 -18707 -28066 194723 -65799 1510 -350029 -426955 -221134
10407b21134H6336E031N5673R9198f6631l1371K4399D9061M7804J56503D2124
$$ -221134 86336 5031 60704 159902 -66631 -98002 -73603 49061 96865 253368 42124
10395A65654a07155B9056J87421J80753e321E4118K82954a9016H4988h6742A37607
$$ 165654 -107155 29056 216477 397230 -5321 54118 337072 -19016 84988 -86742 137607
10383a3515C906i522B60489l3227K69943j56191p4025J04129A67365o6799R6338
$$ -13515 3906 -9522 260489 227262 497205 341014 266989 371118 167365 100566 196904
10372A96904m9237L5032K48522A67775L37066A08602M79035j52047j52678j3678
$$ 196904 147667 182699 431221 167775 504841 108602 587637 435590 282912 269234
10362B69234A03948J66642J88519A01648Q0311K870J90433A1854J7805L0377B7775
$$ 269234 103948 270590 459109 101648 181959 184829 375262 11854 29659 60036 27775
10350D31043Q6963j2357A77922K50168j41057n3423K22704j01166A61421K97838
$$ 431043 518006 505649 177922 428090 287033 233610 456314 355148 161421 459259
10340D59259B18089F2873L37222D4232J6267A1478N35398k31120Q629m5208j19938
$$ 459259 218089 62873 400095 44232 60499 11478 546876 315756 324385 279177 159239
10329A59239J10012b4923A1631b28686A11010b3867B36915a04284B54640K99399
$$ 159239 269251 -24923 11631 -228686 111010 -23867 236915 -104284 254640 554039
10319E54039A68150j3853b8213A18676m1515d74523B32812a83988j8321A53886
$$ 554039 168150 154297 -28213 118676 77161 -474523 232812 -183988 -202309 153886
10308I5972K6481N42524a08867A83156O2592d6700H8368l5055a04773B21533C1610
$$ 95972 122453 664977 -108867 183156 245748 -46700 88368 53313 -104773 221533 31610
10296A31719N3898f6769k09870A15637j3033A4098J60430k3296k1099C6187a75391
$$ 131719 185617 -66769 -276639 115637 102604 14098 174528 151232 130133 36187 -175391
10284d0954k83819A06548J34732G1367h5541D3185a30826H7692a20582d658k46400
$$ -40954 -324773 106548 241280 71367 -85541 43185 -130826 87692 -120582 -4658 -251058
10273b51058e0550A75699j7164o6909d492j3671B95686j46890a19361C9858a81832
$$ -251058 -50550 175699 158535 91626 -4492 -18163 295686 148796 -119361 39858 -181832
10261b7898C42250c17346C06650r4871a23644A75513B6538J33268n7609c3771
$$ -27898 342250 -317346 306650 211779 -123644 175513 26538 159806 102197 -33771
10250B84546j27282F0441J8295C107K33110b54795E1317M9520h2125I6061B8740
$$ 284546 157264 60441 78736 3107 236217 -254795 51317 100837 -82125 96061 28740
10238F3976a7372o0754E1680J80807B4680j487b80566I9113r453m157h4004B18008
$$ 63976 -17372 -78126 51680 232487 24680 23193 -280566 99113 89660 85503 -84004 218008
10225b25839c8194B8243M5096k1652J39598a59591j41755a08842j49458G3454
$$ -225839 -38194 28243 73339 51687 191285 -159591 -301346 -108842 -258300 73454
10214A65678f4727j94558P7910A9065c04308d6344k58060O2039F2161J09432A3522
$$ 165678 -64727 -259285 -181375 19065 -304308 -46344 -304404 -242365 62161 171593 13522
10202d9544k63452A46428F9581J446A6908Q7526g3796p4350C2542b51635c3388
$$ -49544 -312996 146428 69581 71027 16908 104434 -73796 -148146 32542 -251635 -33388
10190b1959k44532M0576b1201B4870g869p8922A64265a26548j84700A41275b3606
$$ -21959 -266491 -225915 -21201 24870 -7869 -86791 164265 -126548 -311248 141275 -23606
10178A13887B9440d2117l51830f086m52344a48344p5376f2927B14469C0229a12335
$$ 113887 29440 -42117 -393947 -6086 -458430 -148344 -223720 -62927 214469 30229 -112335
10166C2891a05708o1852k55373a24656H4974J49361C9093J50610B7346a74810
$$ 32891 -105708 -167560 -422933 -124656 84974 234335 39093 189703 27346 -174810
10155a28872J4397B30361A0133b2663k1931p3854n937l89663A01742a02561F5736
$$ -128872 -114475 230361 10133 -22663 -44594 -118448 -124385 -514048 101742 -102561 65736
10143A21a34932M5061k6920M6631j91816R9792a3606l54954a18929B900b48947
$$ 121 -134932 -89871 -116791 -70160 -261976 -162184 -13606 -368560 -118929 2900 -248947
10131d4443k40751D8536J5898a78108Q4881A33455B0218c21068d9005K051j44866
$$ -44443 -285194 48536 64434 -178108 -93227 133455 20218 -321068 -49005 -46954 -191820
10120a91820b174j528r4115a8019k73879J05065A94743n3762g9382B3162f4856
$$ -191820 -2174 -3702 -97817 -18019 -291898 -186833 194743 140981 -79382 23162 -64856
10108b3620j85412A2365J00458J9667l3411a81935g7172H7729a22533n5906F6819
$$ -23620 -209032 12365 112823 132490 99079 -181935 -77172 87729 -122533 -178439 66819
10096b03066e837j75629j5414O0546B7614a7708G4090j3440b58447F4819e64472
$$ -203066 -5837 -181466 -196880 -136334 27614 -17708 74090 60650 -258447 64819 -564472
10084c0841j26101l7060c0151L851j35868j15215e2278k0591A35125a33030C1223
$$ -30841 -156942 -194002 -30151 -26300 -162168 -277383 -52278 -72869 135125 -133030 31223
10072e1416n0656F3950i320A54821a01952k25543Q0422L2676j05832Q6508C5072
$$ -51416 -102072 63950 -9320 154821 -101952 -327495 -247073 -214397 -320229 -233721 35072
10060I8138b35235C51413e0325j14881B32336a54733A08918g5728D9206a37691
$$ 98138 -235235 351413 -50325 -165206 232336 -154733 108918 -75728 49206 -137691
10049e9893k40282i9351J0811A06966b59477c6488l1378J5166n3234h070F7101
$$ -59893 -300175 -99351 -88540 106966 -259477 -36488 -67866 -52700 -105934 -8070 67101
10037a72061N7588l45025a66630A97431a43653L6245A27607a2087j52290D4029
$$ -172061 -114473 -459498 -166630 197431 -143653 -107408 127607 -12087 -164377 44029
10026f8837C14802d0648k02765i6638d7174A30273a26605L4911K3430l3174K7436
$$ -68837 314802 -40648 -243413 -96638 -47174 130273 -126605 -91694 -68264 -101438 -74002
10015g4002E247a22426j03383a06680K9406A51977F6740A1209K5607a63173k30523
$$ -74002 5247 -122426 -225809 -106680 -77274 151977 66740 11209 36816 -163173 -393696
10004c93696a38004N5900o0124L3634l47291K16249J5414g330A14727b30493A2494
$$ -393696 -138004 -82104 -142228 -108594 -455885 -239636 -224222 -7330 114727 -230493 12494
9992i8783q109p1561G1163b08173C6863L2679d0984j08420d5681C1020a75665
$$ -98783 -106892 -178453 71163 -208173 36863 69542 -40984 -149404 -45681 31020 -175665
9980I2005b00133D4728j039c62838b0428B39417f4291k3086J4607b0219l06091
$$ 92005 -200133 44728 43689 -362838 -20428 239417 -64291 -87377 -72770 -20219 -326310
9969c26310B6375K7385b44G5780L9346m1053b63954a9333B22983J01616K3355
$$ -326310 26375 53760 -244 75780 115126 74073 -263954 -19333 222983 324599 347954
9958C47954c20440R4497G3146a21390j44864a19563q3309n2386C0250a00743B80082
$$ 347954 -320440 -225943 73146 -121390 -266254 -119563 -202872 -255258 30250 -100743 280082
9946A23255c66j00601M1064F4592a49824B10807L6063e12306g7453L8683j9132
$$ 123255 -366 -100967 -59903 64592 -149824 210807 246870 -512306 -77453 -38770 -57902
9935e7902j84731A44259F083M451P5301h9724j76032b5252k903l61706e0640k8967
$$ -57902 -242633 144259 6083 10534 85835 -89724 -265756 -25252 -28155 -389861 -50640 -79607
9923g9607j8296r2619f5878b1138A50951c87893C1185f7514B26925a86619C49296
$$ -79607 -97903 -190522 -65878 -21138 150951 -387893 31185 -67514 226925 -186619 349296
9911a47470k1048K4868c7847C8409J05641P4956E7799j9173N9984L304K1145f7885
$$ -147470 -168518 -143650 -37847 38409 144050 219006 57799 38626 98610 101914 123059 -67885
9898B41085c9370j56625i2895d3993l63203I5901b6124A95711q303l5244f8587
$$ 241085 -39370 -195995 -92895 -43993 -407196 95901 -26124 195711 187408 152164 -68587
9886b91899d0908j06872j8286k26903A25495c07379f166A95992i8888j7227q2739
$$ -291899 -40908 -147780 -166066 -392969 125495 -307379 -6166 195992 -98888 -116115 -198854
9875a98854c3677a6403A08255J24626c42078a00749A93665E0348h3861E4287b78142
$$ -198854 -33677 -16403 108255 232881 -342078 -100749 193665 50348 -83861 54287 -278142
9863b73852A2753a21565B44552g9144k09997A08560a71585j84653c0588k81411
$$ -273852 12753 -121565 244552 -79144 -289141 108560 -171585 -356238 -30588 -311999
9853c11999C8612J72793J14928F8936C1857b03266a4556H331f0555k298k25930
$$ -311999 38612 211405 326333 68936 31857 -203266 -14556 8331 -60555 -62853 -288783
9842b88783J9857J27708k10500a15941r6680A4941a05668E8670a50019f2130j10482
$$ -288783 -268926 -141218 -351718 -115941 -212621 14941 -105668 58670 -150019 -62130 -172612
9831a72612O6711A49713K6561b51638J04245A8535i7162i410m4591q0913j3349
$$ -172612 -105901 149713 176274 -251638 -147393 18535 -97162 -9410 -54001 -134914 -148263
9820a48263N4010F9743b69568a21092a9614j24097G8656C9094b72511J01094f1500
$$ -148263 -94253 69743 -269568 -121092 -19614 -143711 78656 39094 -272511 -171417 -61500
9808d04428A63056e5625E6468J09964a46994B35690d49394a92492M3982A45143
$$ -404428 163056 -55625 56468 166432 -146994 235690 -449394 -192492 -148510 145143
9797B12667a99238L8035L4899A50092M0836b04727k10452f2918J8547G7859a80506
$$ 212667 -199238 -161203 -126304 150092 190928 -204727 -415179 -62918 -44371 77859 -180506
9785g7682j05195j06932n04A73832q4374J18437E4751a62265k35372E8587e739
$$ -77682 -182877 -289809 -290313 173832 89458 207895 54751 -162265 -397637 58587 -5739
9773B90974e7618r5827f8788j16499A0218b03793A60776d74517c9303j40948j94766
$$ 290974 -57618 -153445 -68788 -185287 10218 -203793 160776 -474517 -39303 -180251 -375017
9762c75017a80317A98721b83993g5235k08351a18367A4016L2570N8582i2264k87580
$$ -375017 -180317 198721 -283993 -75235 -283586 -118367 14016 46586 105168 -92264 -379844
9751c79844A66446f7790j16601i0553o2042P1996C4517M7904c33686f1066K425
$$ -379844 166446 -67790 -184391 -90553 -152595 -80599 34517 82421 -333686 -61066 -58641
9740e8641a4506F5524J19840c57246g0538j0320C07719a804A15916i052C39313
$$ -58641 -14506 65524 185364 -357246 -70538 -80858 307719 -1804 115916 -9052 339313
9728h1274J9374j28986q1027a10159a0602B71838b0495k33350C8445b88034A55356
$$ -81274 -61900 -190886 -271913 -110159 -10602 271838 -20495 -253845 38445 -288034 155356
9716e15287a01686D3038a22100D876J15564i0262p0576H3534a4855j24617a7097
$$ -515287 -101686 43038 -122100 4876 120440 -90262 -160838 83534 -14855 -139472 -17097
9704A30461e4302I4055K02657a7847k24996M9192g6856a7670k00505a04266E9971
$$ 130461 -54302 94055 296712 -17847 -242843 -193651 -76856 -17670 -218175 -104266 59971
9692e3920J377j02220J9309f7259o8226N5228A30881l7108a86294B49354b34175
$$ -53920 -52543 -154763 -135454 -67259 -135485 -80257 130881 93773 -186294 249354 -234175
9680A43744b1557Q361D1629i1558j23099h6804o364A2317a21056A59306l2295
$$ 143744 -21557 -13196 41629 -91558 -214657 -86804 -93168 12317 -121056 159306 127011
9669A27011C5107a15420I2491a33755k01998a10120J4384k9819D1051b99484h8511
$$ 127011 35107 -115420 92491 -133755 -335753 -110120 -95736 -125555 41051 -299484 -88511
9657f6390l7098D2801a65409A1752b142k06272B0836i0544D7325a9111k87421
$$ -66390 -103488 42801 -165409 11752 -2142 -208414 20836 -90544 47325 -19111 -306532
9646c06532G3405j4543b1742I4955b8915A64471J43349c82476M9576h292k87600
$$ -306532 73405 58862 -21742 94955 -28915 164471 307820 -382476 -332900 -8292 -295892
9635b95892a40914A01246a79899c2475A9670a4289B9502A1240J5199a72386O1037
$$ -295892 -140914 101246 -179899 -32475 19670 -14289 29502 11240 26439 -172386 -111349
9624a11349e2736p580m9319A2040a85480l6361p6133Q4453B44916D5793f8184
$$ -111349 -52736 -60316 -109635 12040 -185480 -221841 -297974 -213521 244916 45793 -68184
9612A22076i8078G7034e17508G2193A9881J04433g9593C42803I1648G267a47900
$$ 122076 -98078 77034 -517508 72193 19881 124314 -79593 342803 91648 7267 -147900
9600B7271M5286b7607n1825l0644M9879k4488H3387a36296o9780O9825r4241A57979
$$ 27271 72557 -27607 -79432 -110076 -60197 -84685 83387 -136296 -206076 -136251 -230492 157979
9587A33030c06156A35743B3424J6873O8876D9879N366Q0969a29095j81325k4082
$$ 133030 -306156 135743 23424 40297 109173 49879 55245 136214 -129095 -310420 -334502
9576c34502J48939j35751e1242A07445a19914M3121I3623K1420J2736a42449k64011
$$ -334502 -185563 -321314 -51242 107445 -119914 -76793 93623 115043 127779 -142449 -406460
9565d06460d4316G9671a21134A71236m7327c6358k23650B1999i6157k30937R5051
$$ -406460 -44316 79671 -121134 171236 123909 -36358 -260008 21999 -96157 -327094 -232043
9554b32043A9357M9646a56763C2950A4355L5635a87603Q4455c0346k67484h3897
$$ -232043 19357 69003 -156763 32950 14355 49990 -187603 -103148 -30346 -297830 -83897
9542D08014f6574k90057J65420r6505a28431O1292j21626j10249G5806J308a15173
$$ 408014 -66574 -356631 -191211 -287716 -128431 -67139 -188765 -299014 75806 77114 -115173
9530a70440J3896A60551k5808n1479a44113O4767B01254a10935L5250D9101a30368
$$ -170440 -156544 160551 134743 83264 -144113 -79346 201254 -110935 -75685 49101 -130368
9518e1426j78167D5832J05978a90616A19604a60371B2813K68651d25613a80049
$$ -51426 -229593 45832 151810 -190616 119604 -160371 22813 291464 -425613 -180049
9507b95818F3841b98831M1662B54222a86413A6044O8497O4302a62660b8301F9516
$$ -295818 63841 -298831 -257169 254222 -186413 16044 84541 148843 -162660 -28301 69516
9495a59975F3903j5932e941j01526e719j27004L4978H863a4229A12786A4847M4906
$$ -159975 63903 47971 -5941 -107467 -5719 -132723 -97745 8863 -14229 112786 14847 59753
9483E9753b34380G7223b74414c0E1792O2247m2759a5612B9201A0196d19376J18259
$$ 59753 -234380 77223 -274414 -30 51792 114039 71280 -15612 29201 10196 -419376 -301117
9471c01117I9596a22462j255j3032f7170m0258D3647c99011H2480J4649b36995
$$ -301117 99596 -122462 -123717 -136749 -67170 -107428 43647 -399011 82480 97129 -236995
9459E2734a43833k71091a64411p2064C70305b33043f8388o1319M3832b0266j63263
$$ 52734 -143833 -414924 -164411 -236475 370305 -233043 -68388 -129707 -85875 -20266 -183529
9448a83529h2207I4788e6905E0898L956a13894R281A04759a82844L1595M7319
$$ -183529 -82207 94788 -56905 50898 54854 -113894 -104613 104759 -182844 -151249 -103930
9437a03930B04891c04957D02276A86821a37068m6885m5227C8980P5427J52725
$$ -103930 204891 -304957 402276 186821 -137068 -183953 -229180 38980 114407 267132
9427B67132a29371r1886i7747o6740C07114i6859q1525j05179L8477P8393E4570
$$ 267132 -129371 -221257 -97747 -164487 307114 -96859 -178384 -283563 -245086 -166693 54570
9415B71437p0238b73184c1786q0656e348q0111j44798J02107C41845A8890J39558
$$ 271437 201199 -273184 -31786 -112442 -5348 -85459 -230257 -128150 341845 18890 158448
9404A58448n3481d4345E5164b0645B04947h4121A64068d08139a77372j3096a4303
$$ 158448 104967 -44345 55164 -20645 204947 -84121 164068 -408139 -177372 -190468 -14303
9392c15512H7984p160a22027a5977j42896J453l11984A9220d45380B84979D3660
$$ -315512 87984 80824 -122027 -15977 -158873 -157420 -469404 19220 -445380 284979 43660
9380f1452I59a30452f3280o6564m6473o916B374a3991j41269H6525L46625B16433
$$ -61452 959 -130452 -63280 -129844 -176317 -183233 2374 -13991 -155260 86525 433150 216433
9367H5339c0429j57829A68703a21070A34501b4395l09105A89176c3187r7327c4883
$$ 85339 -30429 -188258 168703 -121070 134501 -24395 -333500 189176 -33187 -130514 -34883
9355A87506I1240c16027a52866n2036C6747J8156J26810J12274a14366a8128A3085
$$ 187506 91240 -316027 -152866 -204902 36747 54903 181713 293987 -114366 -18128 13085
9343b14692c0705k22708J21684O5097j31057d2353j80326n4950f7176k72735J08182
$$ -214692 -30705 -253413 -131729 -66632 -197689 -42353 -222679 -277629 -67176 -339911 -231729
9332b31729a8514C02052b52147l1272I1129a49450k2956c624j47816j13482J13659
$$ -231729 -18514 302052 -252147 -283419 91129 -149450 -172406 -3624 -151440 -264922 -151263
9321a51263k28558J54042P9018k66443a71995C5968h3083E9914a24335j42384
$$ -151263 -379821 -225779 -146761 -413204 -171995 35968 -83083 59914 -124335 -266719
9311b66719B41902K71299c56624c9309m2195j33559P4688b5488P174A23668f2124
$$ -266719 241902 513201 -356624 -39309 -81504 -215063 -140375 -25488 -18314 123668 -62124
9299D9489e24247A34269d4066j12419q7532Q063A37429c83137I9796a93454A67905
$$ 49489 -524247 134269 -44066 -156485 -244017 -235954 137429 -383137 99796 -193454 167905
9287I2292b69418g5710l92453J85600A01369j9914i6111I4630D0237g8830l16039
$$ 92292 -269418 -75710 -468163 -282563 101369 81455 -96111 94630 40237 -78830 -394869
9276c94869J38822B97920E6978d77770E2729c69469Q4379Q8030G9925c38095F9280
$$ -394869 -256047 297920 56978 -477770 52729 -369469 -285090 -197060 79925 -338095 69280
9264b73140o7481a02400I7900g4443j20992M749I5978a25263H7519j4550d9682
$$ -273140 -340621 -102400 97900 -74443 -195435 -190686 95978 -125263 87519 72969 -49682
9252b05376A99336q8312b12711E2596a11699l1151p8701B15217a64380n8865A93625
$$ -205376 199336 111024 -212711 52596 -111699 -142850 -221551 215217 -164380 -223245 193625
9240a78498O8777b2431A65346k6992f9005P103A32209g6012F0501J11374a80744
$$ -178498 -109721 -22431 165346 138354 -69005 -61902 132209 -76012 60501 171875 -180744
9228C8364a26291J2338k1754n6552N5927k3046M2049l55521a10223B4163J88181
$$ 38364 -126291 -113953 -135707 -192259 -136332 -159378 -117329 -472850 -110223 24163 212344
9217B12344a06919J8583A38327b86625Q8206C853b28196j46332B91162a07722
$$ 212344 -106919 -88336 138327 -286625 -198419 3853 -228196 -374528 291162 -107722
9206a77246j87156A32946G116e9506A66274k9214J0253n9928a02324C14751a04262
$$ -177246 -364402 132946 7116 -59506 166274 137060 147313 87385 -102324 314751 -104262
9194A07479a17324B27226F5677b54727b1130j29897A25413a42434A6147a66287
$$ 107479 -117324 227226 65677 -254727 -21130 -151027 125413 -142434 16147 -166287
9183B47771E336L68432b89970J37853j09609K8598A50694c7231E2316a26377o1110
$$ 247771 5336 373768 -289970 -152117 -261726 -233128 150694 -37231 52316 -126377 -187487
9172a87487A80867a60890I2939a01065K2641C69355F0641f9641j79427j76303
$$ -187487 180867 -160890 92939 -101065 -78424 369355 60641 -69641 -249068 -425371
9162d25371f9386o8662f2050m8371G8517a11889k14593A57474N8399C0415b92366
$$ -425371 -69386 -138048 -62050 -110421 78517 -111889 -326482 157474 215873 30415 -292366
9150a9531B0338f4587C72509b30361C31025a97290R5960A15658L3167a99179K2988
$$ -19531 20338 -64587 372509 -230361 331025 -197290 -101330 115658 148825 -199179 -176191
9139a76191Q432j06414f3367F5164h7339A07623b6502m7650q5617M1903D2709
$$ -176191 -167759 -274173 -63367 65164 -87339 107623 -26502 -74152 -159769 -117866 42709
9127c4849C0535a99751A5004a86095l7459A63455p0612O1441k5127b1943j66617
$$ -34849 30535 -199751 15004 -186095 -223554 163455 92843 154284 129157 -21943 -188560
9116a88560k89084A17204g6709N87H8760R5627a08102B29851m0412E1066Q4807
$$ -188560 -477644 117204 -76709 -76122 88760 184387 -108102 229851 189439 51066 135873
9105A35873l0323L166i7599j34769c0605j14214l1822a9253B73724b67640g4663
$$ 135873 105550 108716 -97599 -232368 -30605 -144819 -176641 -19253 273724 -267640 -74663
9093D4641c84290D4883c97850A3993l691c03810A03359j0483L41876F4775R650
$$ 44641 -384290 44883 -397850 13993 10302 -303810 103359 92876 434752 64775 74425
9082G4425L07853a88917n5677A05889a0182J026j38089n7283A55557m7229a12255
$$ 74425 382278 -188917 -244594 105889 -10182 -9156 -147245 -204528 155557 108328 -112255
9070B13818b53150g0533A9027c24022d2930l40879D4673J69250a50654o7000A4568
$$ 213818 -253150 -70533 19027 -324022 -42930 -383809 44673 213923 -150654 -217654 14568
9058b0217j50235A05153a42744O6207f739o6712m6132j71779j06555Q3673a44207
$$ -20217 -170452 105153 -142744 -76537 -6739 -73451 -119583 -291362 -397917 -314244 -144207
9046a00877l0133A06277J71718F1906d12958a93940M7668d6878b1356k60878i815
$$ -100877 -131010 106277 277995 61906 -412958 -193940 -146272 -46878 -21356 -282234 -9815
9034b98036Q6503l30400a23868j39153o152C3904a773j99591a2146A51432a10742
$$ -298036 -211533 -541933 -123868 -263021 -269173 33904 -1773 -201364 -12146 151432 -110742
9022F7722H028a08932J682b9458n4245C1989a27200A68852b49016i7899p2463
$$ 67722 8028 -108932 -107250 -29458 -83703 31989 -127200 168852 -249016 -97899 -170362
9011a70362B21112d4988Q417l5224B95873a07899j75132g9671D938b87506j1044
$$ -170362 221112 -44988 -36571 -71795 295873 -107899 -283031 -79671 4938 -287506 -298550
9000b98550K2201a5413j73932d0266o1776A98301C9620a11174a7489p2479A58739
$$ -298550 -276349 -15413 -189345 -40266 -102042 198301 39620 -111174 -17489 -89968 158739
8988a88783l7691K7157P3498L9844B55819a69148f6166a3327k2048B25776b31247
$$ -188783 -226474 -199317 -125819 -85975 255819 -169148 -66166 -13327 -35375 225776 -231247
8976A12021k5287d44321D618Q8356b0717n5759A0440K04464J0102I1471h4882
$$ 112021 86734 -444321 4618 92974 -20717 -76476 10440 214904 225006 91471 -84882
8964F3c5471C12137c91953g3951j83569A71767i7187c170k73602C0383g1530C51759
$$ 63 -35471 312137 -391953 -73951 -257520 171767 -97187 -3170 -276772 30383 -71530 351759
8951A0315c56392A36664J89359A51273c10274J38687B5308a74542K8451I7909
$$ 10315 -356392 136664 326023 151273 -310274 -171587 25308 -174542 -146091 97909
8940b15675l1688a21042m8324B16538I7516J09043K9159J58082a49651b3162n4684
$$ -215675 -247363 -121042 -169366 216538 97516 206559 235718 393800 -149651 -23162 -77846
8929g7846A69421K2544J24128J4817K6218J485633L233830J831774J780913L107047
$$ -77846 169421 191965 316093 330910 357128 1842761 5076591 6908365 8689278 11796325
8919A1796325m694698B403983F63736k14717j06022n5317E2121c21789D1340a73219
$$ 11796325 7101627 2403983 663736 449019 342997 287680 52121 -321789 41340 -173219
8908E0575K71604o0201J11292A01007b23667M9088g9259M605j72678B8544K52005
$$ 50575 322179 261978 373270 101007 -223667 -174579 -79259 -74654 -247332 28544 280549
8897B80549n6138b10019a2677n1095b4372k28480J1023A20994A8527H519g2551
$$ 280549 224411 -210019 -12677 -63772 -24372 -252852 -241829 120994 18527 8519 -72551
8885e91230P6442K33603Q0684h7243P600c7838P741k4789I2041D4005Q321J9438
$$ -591230 -514788 -281185 -200501 -87243 -79643 -37838 -30097 -54886 92041 44005 52326 71764
8873G1764c517G7957b00108P7137A15715A2261K0716h6032g438H3262a84005a5045
$$ 71764 -3517 77957 -200108 -122971 115715 12261 32977 -86032 -7438 83262 -184005 -15045
$$ [...]
##END NTUPLES=NMR SPECTRUM
##END=
