
##TITLE=UV1226_M6_1234-1212_70_7240115_p97Uzr14WF
##JCAMPDX= 6.0         $$ Bruker NMR JCAMP-DX V2.0
##DATA TYPE= NMR SPECTRUM
##DATA CLASS= NTUPLES
##ORIGIN= BRUKER
##OWNER= Administrator
$$ 1.72 TOPSPIN		Version 2.1
$$ 2013-01-18 02:42:02.900 -0500  Administrator@X
$$ Compression mode = diff/dup
##.OBSERVE FREQUENCY= 400.02188249412
##.OBSERVE NUCLEUS= ^1H
##.ACQUISITION MODE= SIMULTANEOUS (DQD)
##.ACQUISITION SCHEME= undefined
##.AVERAGES= 64
##.DIGITISER RES= 22
##SPECTROMETER/DATA SYSTEM= spect
##.PULSE SEQUENCE= noesygpps1d.comp
##.SOLVENT NAME= COFFEE_meoh
##.SHIFT REFERENCE= INTERNAL, COFFEE_meoh, 1, 14.96188
##AUDIT TRAIL= $$ (NUMBER, WHEN, WHO, WHERE, PROCESS, VERSION, WHAT)
$$ ##TITLE= Audit trail, TOPSPIN		Version 2.1
$$ ##JCAMPDX= 5.01
$$ ##ORIGIN= Bruker BioSpin GmbH
$$ ##OWNER= Administrator
$$ $$ E:\/data/COFFEE/nmr/UV1226_M6_1234-1212_70_7240115_p97Uzr14WF/22/pdata/1/auditp.txt
$$ ##AUDIT TRAIL=  $$ (NUMBER, WHEN, WHO, WHERE, PROCESS, VERSION, WHAT)
(   1,<2013-01-18 02:41:57.104 -0500>,<Administrator>,<X>,<go>,<TOPSPIN 2.1>,
      <created by zg
	started at 2013-01-18 02:30:27.383 -0500,
	POWCHK enabled, PULCHK disabled,
       configuration hash MD5:
       86 BA 57 50 F2 9D 5C 9B 26 00 A9 28 5F 66 2E 89
       data hash MD5: 64K
       FA 11 90 47 CF 73 BB 04 76 27 2A 4C 7E 98 3C B2>)
(   2,<2013-01-18 02:42:00.150 -0500>,<Administrator>,<X>,<proc1d>,<TOPSPIN 2.1>,
      <Start of raw data processing
       efp LB = 0.3 FT_mod = 6 PKNL = 1 PHC0 = 0 PHC1 = 0 SI = 128K 
       data hash MD5: 128K
       13 AE F1 24 D4 60 2C 22 54 08 D8 8B 49 7C A7 5D>)
(   3,<2013-01-18 02:42:01.166 -0500>,<Administrator>,<X>,<proc1d>,<TOPSPIN 2.1>,
      <pk PHC0 = -80.354 PHC1 = 0 
       data hash MD5: 128K
       EF 0B DC 48 15 2F DE 89 6A 4F C4 DF E4 43 33 71>)
(   4,<2013-01-18 02:42:01.854 -0500>,<Administrator>,<X>,<proc1d>,<TOPSPIN 2.1>,
      <abs ABSG = 1 
       data hash MD5: 128K
       85 45 9F 3B 10 EF F6 89 F8 CF 5F F7 47 F6 76 46>)
(   5,<2013-01-18 02:42:02.025 -0500>,<Administrator>,<X>,<proc1d>,<TOPSPIN 2.1>,
      <abs ABSG = 2 
       data hash MD5: 128K
       F2 5C 3D 02 56 54 47 96 44 68 F9 52 F6 D1 D1 A3>)
(   6,<2013-01-18 02:42:02.213 -0500>,<Administrator>,<X>,<proc1d>,<TOPSPIN 2.1>,
      <abs ABSG = 3 
       data hash MD5: 128K
       1F 17 F0 E7 54 CF 24 C9 C2 BC 4C 1F 00 15 5E 87>)
(   7,<2013-01-18 02:42:02.400 -0500>,<Administrator>,<X>,<proc1d>,<TOPSPIN 2.1>,
      <abs ABSG = 4 
       data hash MD5: 128K
       0F 8E FA 98 2E 68 EE A8 B4 6D FD 4F A1 2B 82 DA>)
(   8,<2013-01-18 02:42:02.572 -0500>,<Administrator>,<X>,<proc1d>,<TOPSPIN 2.1>,
      <abs ABSG = 5 
       data hash MD5: 128K
       04 86 9B 32 E9 D6 DD AF 50 CF 15 BD EA 4F 5C FB>)
$$ ##END=
$$ 
$$ $$ hash MD5
$$ $$ 79 C6 F4 8F A8 60 20 19 87 C4 46 0A 7F 73 A2 2C
##$RELAX= 
##$RELAX= 
##$RELAX= 
##$RELAX= 
##$RELAX= 
##$RELAX= 
##$RELAX= 
##$RELAX= 
$$ Bruker specific parameters
$$ --------------------------
##$DU= <E:\>
##$EXPNO= 22
$$ [...]
150 150 150 150 150 150 150 150
##$TP07= 0
##$TPNAME0= <>
##$TPNAME1= <>
##$TPNAME2= <>
##$TPNAME3= <>
##$TPNAME4= <>
##$TPNAME5= <>
##$TPNAME6= <>
##$TPNAME7= <>
##$TPOAL= (0..7)
0.5 0.5 0.5 0.5 0.5 0.5 0.5 0.5
##$TPOFFS= (0..7)
0 0 0 0 0 0 0 0
##$TUNHIN= 0
##$TUNHOUT= 0
##$TUNXOUT= 0
##$USERA1= <user>
##$USERA2= <user>
##$USERA3= <user>
##$USERA4= <user>
##$USERA5= <user>
##$V9= 5
##$VALIST= <valist>
##$VCLIST= <CCCCCCCCCCCCCCC>
##$VD= 0
##$VDLIST= <DDDDDDDDDDDDDDD>
##$VPLIST= <PPPPPPPPPPPPPPP>
##$VTLIST= <TTTTTTTTTTTTTTT>
##$WBST= 1024
##$WBSW= 4
##$XGAIN= (0..3)
0 0 0 0
##$XL= 0
##$YL= 0
##$YMAX_a= 6581088
##$YMIN_a= -13964825
##$ZGOPTNS= <>
##$ZL1= 120
##$ZL2= 120
##$ZL3= 120
##$ZL4= 120
##$ABSF1= 14.96188
##$ABSF2= -5.596302
##$ABSG= 5
##$ABSL= 3
##$ALPHA= 0
##$AQORDER= 0
##$ASSFAC= 0
##$ASSFACI= 0
##$ASSFACX= 0
##$ASSWID= 0
##$AUNMP= <proc_prof1d_extract.lims>
##$AXLEFT= 0
##$AXNAME= <>
##$AXNUC= <1H>
##$AXRIGHT= 0
##$AXTYPE= 0
##$AXUNIT= <>
##$AZFE= 0.1
##$AZFW= 0.1
##$BCFW= 0
##$BC_mod= 0
##$BYTORDP= 0
##$COROFFS= 0
##$CY= 15
##$DATMOD= 1
##$DC= 0
##$DFILT= <>
##$DTYPP= 0
##$F1P= 0
##$F2P= 0
##$FCOR= 0.5
##$FTSIZE= 131072
##$FT_mod= 6
##$GAMMA= 0
##$GB= 0
##$INTBC= 1
##$INTSCL= 1
##$ISEN= 128
##$LB= 0.3
##$LEV0= 0
##$LPBIN= 0
##$MAXI= 10000
##$MC2= 0
##$MEAN= 0
##$ME_mod= 0
##$MI= 0
##$NCOEF= 0
##$NC_proc= -2
##$NLEV= 6
##$NOISF1= 0
##$NOISF2= 0
##$NSP= 0
##$NTH_PI= 0
##$NZP= 0
##$OFFSET= 14.96188
##$PC= 1
##$PHC0= -80.354
##$PHC1= 0
##$PH_mod= 1
##$PKNL= yes
##$PPARMOD= 0
##$PPDIAG= 0
##$PPIPTYP= 0
##$PPMPNUM= 2147483647
##$PPRESOL= 1
##$PSCAL= 4
##$PSIGN= 0
##$PYNMP= <proc.py>
##$REVERSE= no
##$SF= 400.020009283322
##$SI= 131072
##$SIGF1= 0
##$SIGF2= 0
##$SINO= 400
##$SIOLD= 131072
##$SPECTYP= <>
##$SREGLST= <1H.CDCl3>
##$SSB= 0
##$STSI= 131072
##$STSR= 0
##$SW_p= 8223.68421052631
##$SYMM= 0
##$S_DEV= 0
##$TDeff= 65536
##$TDoff= 0
##$TI= <>
##$TILT= no
##$TM1= 0
##$TM2= 0
##$TOPLEV= 0
##$USERP1= <user>
##$USERP2= <user>
##$USERP3= <user>
##$USERP4= <user>
##$USERP5= <user>
##$WDW= 1
##$XDIM= 131072
##$YMAX_p= 453974458
##$YMIN_p= -12407
##$CURPLOT= <Network HP LaserJet P1505>
##$CURPRIN= <$Network HP LaserJet P1505>
##$DFORMAT= <normdp>
##$LAYOUT= <+/1D_H.xwp>
##$LFORMAT= <normlp>
##$PFORMAT= <normpl>
##$SURQMSG= 1
$$ End of Bruker specific parameters
$$ ---------------------------------
##NTUPLES= NMR SPECTRUM
##VAR_NAME=  FREQUENCY,     SPECTRUM/REAL,   SPECTRUM/IMAG
##SYMBOL=    X,             R,               I
##VAR_TYPE=  INDEPENDENT,   DEPENDENT,       DEPENDENT
##VAR_FORM=  AFFN,          ASDF,            ASDF
##VAR_DIM=   131072,        131072,          131072
##UNITS=     HZ,            ARBITRARY UNITS, ARBITRARY UNITS
##FACTOR=    0.0627417313425164, 1,          1
##FIRST=     8223.62146879497, -3940,        -66191
##LAST=      0,             -839,            -67438
##MIN=       0,             -12407,          0
##MAX=       8223.62146879497, 453974458,    0
$$ Real data points
##PAGE= N=1
##DATA TABLE= (X++(R..R)), XYDATA
$$ [...]
61406E25130k413l168l285k942k757k993l357l511l414l234l151l107k696j691
61392D83411o86o21j484k185j986j334q74n21q6M2l51o10j25P05J189J373J515
61375D77372J297O43N56J895L737M367L620K931L153L628L535K976K454K196K284
61360E16644K725L190L309L275L534M028M435M969O079P467Q270Q330Q352Q819
61346E93426R555J0442J1656J2977J3772J3956J4236J4971J5453J4703J2596R837
61334G47580P159M823K649M05j794l521m616n476o482p483q133q384q250p567
61320G00910o514n822n821n765m932l837l389l284k419o87Q22J448J698K153K692
61305F67253L043L338L773M363N198O373P612Q544R261R994J0388R935Q948Q138
$$ plain form
61406 525130 522717 519549 516264 513322 510565 507572 504215 500704 497290 494056 490905 487798 485102 483411
61392 483411 482725 482104 480620 478435 476449 475115 474241 473720 473634 473676 473325 472715 472590 473295 474484 475857 477372
61375 477372 478669 479312 479868 481763 485500 489867 493487 496418 499571 503199 506734 509710 512164 514360 516644
61360 516644 519369 522559 525868 529143 532677 536705 541140 546109 552188 559655 567925 576255 584607 593426
61346 593426 602981 613423 625079 638056 651828 665784 680020 694991 710444 725147 737743 747580
61334 747580 754739 759562 762211 762616 760822 757301 752685 747209 740727 733244 725111 716727 708477 700910
61320 700910 694396 688574 682753 676988 672056 668219 664830 661546 659127 658440 659262 660710 662408 664561 667253
61305 667253 670296 673634 677407 681770 686968 693341 700953 709497 718758 728752 739140 749075 758023 766161
61291G66161P244N134J468k677o007q019q677q141p110o487o275n582m049k387
61277G14596j185j02J263K500L090L294L733M514N349O117O839P382P660P871
61263G72921Q280R072J0435J2354J4150J4860J4403J3775J3803J4317J4883J5740
61251I28993J7294J9009J9580J8158J5032J1052O658J688l939r495j3756j6164
61239I94110j7353j8127j8403j7714j6383j5250j4397j3074j1057r089p734o617
61227H28912n248l842k787j945j032k17K89Q41J940L430M588M902M399L401K269
61212H39900J367R30R38J133J135O64j43o52l31O08J452J932K412L190M034M657
61196H63226N240O237P944J0476J3792J7513K0860K3143K4363K5194K6307K7629
$$ plain form
61291 766161 773405 778539 780007 777330 771323 763304 754627 746486 739376 732889 726614 721032 716983 714596
61277 714596 713411 713309 714572 717072 720162 723456 727189 731703 737052 743169 750008 757390 765050 772921
61263 772921 781201 790273 800708 813062 827212 842072 856475 870250 884053 898370 913253 928993
61251 928993 946287 965296 984876 1003034 1018066 1029118 1035776 1037464 1033525 1024030 1010274 994110
61239 994110 976757 958630 940227 922513 906130 890880 876483 863409 852352 843263 835529 828912
61227 828912 823664 819822 817035 815090 814058 813841 814130 814971 816911 820341 824929 829831 834230 837631 839900
61212 839900 841267 842197 843135 844268 845403 846067 845924 845272 844941 845549 847001 848933 851345 854535 858569 863226
61196 863226 868466 874703 882647 893123 906915 924428 945288 968431 992794 1017988 1044295 1071924
61184A071924K8386K7977K6743K5453K4030K1437J7211J2549R189P538O510N001
61172A283948K835M25j839l856n929q548j1656j4398j6048j6946j7936j9260k0669
61159A150123k2164k3786k4904k4742k3485k2017k0620j8924j6975j5297j3862
61148I23347j2113j0135q695p817o492m245j914l06R48K431L666L692K451O76
61134H85494j231l429n767p393p481o142m346k882j497O28L563O364Q409J0337
61120H74627J3015J6196J9100K1769K4681K7368K8879K9458L0391L1974L3067
61109A150525L3024L2677L2764L2671L1554K9631K7468K4878K1495J7792J4537
61098A449016J1755Q946N995L090J5l738q326j3430j8551k3148k6842k9729l2161
$$ plain form
61184 1071924 1100310 1128287 1155030 1180483 1204513 1225950 1243161 1255710 1264899 1272437 1278947 1283948
61172 1283948 1286783 1287208 1285369 1281513 1275584 1267036 1255380 1240982 1224934 1207988 1190052 1170792 1150123
61159 1150123 1127959 1104173 1079269 1054527 1031042 1009025 988405 969481 952506 937209 923347
61148 923347 911234 901099 892404 884587 878095 873850 871936 871630 872578 875009 878675 882367 884818 885494
61134 885494 884263 880834 875067 867674 860193 854051 849705 846823 845326 845954 849517 855881 864290 874627
61120 874627 887642 903838 922938 944707 969388 996756 1025635 1055093 1085484 1117458 1150525
61109 1150525 1183549 1216226 1248990 1281661 1313215 1342846 1370314 1395192 1416687 1434479 1449016
61098 1449016 1460771 1469717 1475712 1478802 1478817 1475079 1466753 1453323 1434772 1411624 1384782 1355053 1322892
61085A322892l4065l5012l5129l5191l5482l5230l3661l1056k8248k5683k3407
61074I70728k1468j9729j7759j5384j3023j1042r251p414n770m567l515k212p96
61061H38798K82Q52J114J406K113L392M824N710N959O270P245Q827J0703J2737
61047I10232J4794J6703J8599K0788K3141K5203K6974K8841L0698L1903L2286
61036A180162L2411L2620L2707L2690L2986L3450L3280L2283L1277L0822L0548
61025A535236L0176L0143L0533L0518K9693K8976K9400L0801L2579L4871L8052
61014A880978M1754M5397M9149N3568N8866O5214P3191Q3085R4411J06840J20997
61003B673450J37741J57362J80445K08891K45214K91349L48762M19322N05212
$$ plain form
61085 1322892 1288827 1253815 1218686 1183495 1148013 1112783 1079122 1048066 1019818 994135 970728
61074 970728 949260 929531 911772 896388 883365 872323 863072 855658 849888 845321 841806 839594 838798
61061 838798 839080 839932 841046 842452 844565 847957 852781 858491 864450 870720 877965 886792 897495 910232
61047 910232 925026 941729 960328 981116 1004257 1029460 1056434 1085275 1115973 1147876 1180162
61036 1180162 1212573 1245193 1277900 1310590 1343576 1377026 1410306 1442589 1473866 1504688 1535236
61025 1535236 1565412 1595555 1626088 1656606 1686299 1715275 1744675 1775476 1808055 1842926 1880978
61014 1880978 1922732 1968129 2017278 2070846 2129712 2194926 2268117 2351202 2445613 2552453 2673450
61003 2673450 2811191 2968553 3148998 3357889 3603103 3894452 4243214 4662536 5167748
60994E167748O07250P21702Q36877R34912J002261J040864J065416J087094J104650
60985A3568774J116629J137395J189307J274964J364653J418984J423106J396580
60977B3890392J374759J385879J438359J511733J550216J476371J232123Q19061
60969C4678893L01086k29234o83121r86146j088651r97153p99930o39524o35195
60960B8921025q19323j139882j510769j853696k108453k233632k216739k081241
60952A4957290j873705j639531j408693j197044j012049q55050p22798o11041
60944E637379n17359m40652l79305l30692k91878k60289k34034k11959j93208
60935B778003j76815j61877j47983j35034j22784j10968r9855r0174q2211p5386
$$ plain form
60994 5167748 5774998 6496700 7333577 8268489 9270750 10311614 11377030 12464124 13568774
60985 13568774 14685403 15822798 17012105 18287069 19651722 21070706 22493812 23890392
60977 23890392 25265151 26651030 28089389 29601122 31151338 32627709 33859832 34678893
60969 34678893 34979979 34750745 34067624 33081478 31992827 30995674 30195744 29556220 28921025
60960 28921025 28101702 26961820 25451051 23597355 21488902 19255270 17038531 14957290
60952 14957290 13083585 11444054 10035361 8838317 7826268 6971218 6248420 5637379
60944 5637379 5120020 4679368 4300063 3969371 3677493 3417204 3183170 2971211 2778003
60935 2778003 2601188 2439311 2291328 2156294 2033510 1922542 1822687 1732513 1650302 1574916
60925A574916o9008o3235n8795n5685n2634m8345m2990l7969l4155l1066k7879
60914A053155k4533k1391j8390j5232j2072r450p697o891o999p568p595o451m831
60901I04055m151n033o853q745j0387j1833j3108j4192j5021j5420j5285j4782
60889G69245j4181j3541j2804j2061j1446j0953j0516j0102r540q614p478o637
60877F41372o193n581m324k691j236j86M02M63K56L70Q92J222J166J499K768M260
60861F34459M976N072N461O452P602Q493Q797Q126O608N243M749M594M038L511
60847G18181L787M370M043K758J653J312J219Q68J62j133l118m953n669n799o835
60832G10846q936j0581j0754j0112r524q882q001p442p545p634p018o050n371
$$ plain form
60925 1574916 1505908 1442673 1383878 1328193 1275559 1227214 1184224 1146255 1112100 1081034 1053155
60914 1053155 1028622 1007231 988841 973609 961537 952087 944390 937499 930500 922932 915337 908886 904055
60901 904055 899904 894871 888018 879273 868886 857053 843945 829753 814732 799312 784027 769245
60889 769245 755064 741523 728719 716658 705212 694259 683743 673641 664101 655487 648009 641372
60877 641372 635179 629598 625274 622583 621347 621161 621563 622026 622282 622652 623544 624766 625932 627431 630199 634459
60861 634459 639435 644507 649968 656420 664022 672515 681312 689438 696046 701289 706038 710632 714670 718181
60847 718181 721968 726338 730381 733139 734792 736104 737323 738191 738353 737220 734102 729149 723480 717681 710846
60832 710846 701910 691329 680575 670463 660939 652057 644056 636614 629069 621435 614417 608367 602996
60819F02996m851m007k966k257j922j499n92Q71K654M232N115N398N649O116O561
60804F21498O944P629Q698R691J0339J0984J1985J3195J4414J5738J7205J8520
60792G66840J9559K0648K2010K3330K4254K5043K6282K8121L0023L1260L1512
60781A048882L1094L0493K9721K8362K6388K4426K2779K0691J7235J2611P772
60770A300454L128j545o197j0485j4483j8452k1910k4044k5060k6070k7509k8733
60758A099094k9343k9729l0050k9764k8698k7542k6742k5807k4275k2462k0734
60747H03948j8927j7048j5646j4839j3816j2077j0311r342q937q571q568r374
60735F56492j0302j0206r169q362q280q172p310n932m625l531k487j479n53L39
$$ plain form
60819 602996 598145 594138 591172 588915 586993 585494 584902 585773 588427 592659 597774 603172 608821 614937 621498
60804 621498 628442 636071 644769 654460 664799 675783 687768 700963 715377 731115 748320 766840
60792 766840 786399 807047 829057 852387 876641 901684 927966 956087 986110 1017370 1048882
60781 1048882 1079976 1110469 1140190 1168552 1194940 1219366 1242145 1262836 1280071 1292682 1300454
60770 1300454 1303582 1302037 1295840 1285355 1270872 1252420 1230510 1206466 1181406 1155336 1127827 1099094
60758 1099094 1069751 1040022 1009972 980208 951510 923968 897226 871419 847144 824682 803948
60747 803948 785021 767973 752327 737488 723672 711595 701284 691942 683005 674434 665866 656492
60735 656492 646190 635984 626815 618453 610173 602001 594691 588759 584134 580603 578116 576637 576084 576423
60721E76423J153J647J687J475J264R56K74p66j784k508l170m131n295o112o228
60706E54885n838n331m993n161o128p583q572q493p765p054o311n196m026l436
60692D68998l316k970k291j938k200k433j920p34M64J118J214J254J753K503K651
60677D62153J896J159J397K204K444J966J620J773J931J874K062K652L041K753
60663D90925K058J499J429K046L124L745L183K074J805K708L854M627N325O059
60649E34461O293N963N866O466P238P699P948P752O270L479Q20m48p76j375k539
60634E95117l781m930o040o724o548n820n255n027m834m636m680m923m899m254
60620E22766l050j753r70r69j383j625j603j559j342n55N10R19K50r16j840k234
$$ plain form
60721 576423 577576 579223 580910 582385 583649 584605 584879 584113 582329 579821 576651 572520 567225 561113 554885
60706 554885 549047 543716 538723 533562 527434 519851 511279 502786 495021 487967 481656 476460 472434 468998
60692 468998 465682 462712 460421 458483 456283 453850 451930 451196 451660 452778 453992 455246 456999 459502 462153
60677 462153 464049 465208 466605 468809 471253 473219 474839 476612 478543 480417 482479 485131 488172 490925
60663 490925 492983 494482 495911 497957 501081 504826 508009 510083 511888 514596 518450 523077 528402 534461
60649 534461 540754 546717 552583 559049 566287 573986 581934 589686 595956 599435 600255 599807 599031 597656 595117
60634 595117 591336 586406 580366 573642 567094 561274 556019 550992 546158 541522 536842 531919 527020 522766
60620 522766 519716 517963 516993 516024 514641 513016 511413 509854 508512 507957 508467 509386 509636 508720 506880 504646
60604E04646j982j139m21o92j667j987j037K96J021J251J486J623J436J186J095
60589E05115R38O99R32J806K603K783K833L294L666L187K122J453J636K330L050
60574E38447L556L908M514N697P023P649P571P747Q667R726J0426J1213J2455
60561F38599J3561J3848J3516J3068J2557J2108J2304J3223J3920J3753J3411
60550G83868J3704J4110J3568J2037J0202Q186N569K440n25k798m130m352l593
60537H48286k254l08K668O276R119J0563J1651J3299J4732J4943J4755J5776J7993
60524I77499J9917K0728K0713J9811J7357J3377Q888M657P14k886n775p860r327
60511A077813j0046r739q651p348n938m246k536j216k1J719M105O843J0104J4341
$$ plain form
60604 504646 502664 501525 501104 500412 498745 496758 495721 496017 497038 498289 499775 501398 502834 504020 505115
60589 505115 506053 506752 507684 509490 512093 514876 517709 521003 524669 527856 529978 531431 533067 535397 538447
60574 538447 542003 545911 550425 556122 563145 570794 578365 586112 594779 604505 614931 626144 638599
60561 638599 652160 666008 679524 692592 705149 717257 729561 742784 756704 770457 783868
60550 783868 797572 811682 825250 837287 847489 855675 861244 863684 863159 860361 856231 851879 848286
60537 848286 846032 845724 848392 854668 863787 874350 886001 899300 914032 928975 943730 959506 977499
60524 977499 997416 1018144 1038857 1058668 1076025 1089402 1098290 1102947 1103661 1100775 1095000 1087140 1077813
60511 1077813 1067767 1058028 1049377 1042029 1036091 1031845 1029309 1028093 1028072 1029791 1033896 1040739 1050843 1065184
60497A065184J9357K4354K8887L3017L6763M0146M3540M7158N0384N2506N3873
60486A495169N5416N7203N8406N8526N7692N5848N2651M8186M2865L6590K8868
60475B047420J9758R798j026j3237k6621l9851n1667o1815p0559p7782q2770q4596
60463A567052q2899p8600p3489o8555o3074n6108m8446m2090l7923l4888l1485
60452I49495k7321k3077j9683j7597j6403j5114j3236j1290r803q397o631n233
60440G75710n364o823q138q395q013p651p304o749o098n604n318n023m256k676
60426F88298p71K73K2m88k61J33l94j464j692q17Lk1n30j118j833k361j965o73
60408F74341M49O30K21q1RN83J626K565K567J624P23O78J407K434L411M007M041
$$ plain form
60497 1065184 1084541 1108895 1137782 1170799 1207562 1247708 1291248 1338406 1388790 1441296 1495169
60486 1495169 1550585 1607788 1666194 1724720 1782412 1838260 1890911 1939097 1981962 2018552 2047420
60475 2047420 2067178 2076976 2075950 2062713 2036092 1996241 1944574 1882759 1812200 1734418 1651648 1567052
60463 1567052 1484153 1405553 1332064 1263509 1200435 1144327 1095881 1053791 1015868 980980 949495
60452 949495 922174 899097 879414 861817 845414 830300 817064 805774 795971 787574 780943 775710
60440 775710 770346 763523 755385 746990 738977 731326 724022 717273 711175 705571 700253 695230 690974 688298
60426 688298 687527 687800 687822 687334 687073 687206 686812 685348 683656 682839 682842 682821 682291 681173 679340 676979 675014 674341
60408 674341 674790 675420 675641 675560 675569 676152 677778 680343 682910 684534 685257 685935 687342 689776 693187 697194 701235
60391G01235L865L981M228L999L350L058L440L909L856L348K826K711L353M679
60377G51838N860N977N065L904L002K440K481L315M321M632M437M737N707O438
60363H14154O399O157O312O669O879P116P786R033J0722J2359J3128J2755J2154
60350I31623J2470J3627J4830J6179J8468K1420K3582K4300K4537K5262K6198
60339A152496K6711K6828K6856K6865K7057K7699K8220K7217K3815J8353J1447
60328A423564L370n375j3901k1873k9557l6484m1108m2505m1447l9230l6289l2682
60316A086483k8925k5418k1763j7521j3205r688p112n003l006q90J739M983Q302
60303I68976J1138J3651J6296J9008K1311K3034K4540K6265K8241K9999L0989
$$ plain form
60391 701235 705100 709081 713309 717308 720658 723716 727156 731065 734921 738269 741095 743806 747159 751838
60377 751838 757698 763675 768740 772644 775646 778086 780567 783882 788203 792835 797272 802009 807716 814154
60363 814154 820553 826710 833022 839691 846570 853686 861472 870505 881227 893586 906714 919469 931623
60350 931623 944093 957720 972550 988729 1007197 1028617 1052199 1076499 1101036 1126298 1152496
60339 1152496 1179207 1206035 1232891 1259756 1286813 1314512 1342732 1369949 1393764 1412117 1423564
60328 1423564 1426934 1421559 1407658 1385785 1356228 1319744 1278636 1236131 1194684 1155454 1119165 1086483
60316 1086483 1057558 1032140 1010377 992856 979651 969963 962851 957848 954842 953952 955691 960674 968976
60303 968976 980114 993765 1010061 1029069 1050380 1073414 1097954 1124219 1152460 1182459 1213448
60292A213448L1342L1950L3249L4170L3082K9677K5021J9879J4077P613J185m866
60280A469827j1150j8142k5385l2234l8590m4374m8997n1925n3083n2374m9521
60269A044052m4845l9497l4427k9819k5794k2731k0416j7864j4695j1822j0085
60258G72057r062p970o952o479o127n078l462k252j946k084k083j840j552j368
60244G13802j280j175j006r41j119j274j072p31p58j075j087o47j47M18J594L371
60228G06873M829N267M917M253L459K998L641N330O773O976O421O146O304O294
60214G80481N716M525K857J301P89J528K550K858K582K481K866L555M279M577
60200H22945L831K065K56o89r17j072j276j261r92o67l73k43n42j237j884k246
$$ plain form
60292 1213448 1244790 1276740 1309989 1344159 1377241 1406918 1431939 1451818 1465895 1473508 1474693 1469827
60280 1469827 1458677 1440535 1415150 1382916 1344326 1299952 1250955 1199030 1145947 1093573 1044052
60269 1044052 999207 959710 925283 895464 869670 846939 826523 808659 793964 782142 772057
60258 772057 762995 755025 748073 741594 735467 730389 726927 724675 722729 720645 718562 716722 715170 713802
60244 713802 712522 711347 710341 709400 708281 707007 705935 705204 704446 703371 702284 701637 701490 701908 703502 706873
60228 706873 711702 716969 721886 726139 729598 732596 736237 741567 748340 755316 761737 767883 774187 780481
60214 780481 786197 790722 793579 794880 795669 797197 799747 802605 805187 807668 810534 814089 818368 822945
60200 822945 826776 828841 829097 828408 827491 826419 825143 823882 822890 822223 821850 821607 821065 819828 817944 815698
60184H15698k531k777k557j725p71j23L08N77M18m4q0N91J305J526J718K428L272
60167H17233L586L512L623L902L885L574L496L930M511M575L735K353J425J596
60153H64936K370K796K732K626K248Q88j144k513k666k384k219j702o79M9J65
60138H65503O36K115L802M764N301N980O462O352O106O048N533M261L295L504
60124I29662M013L604K658K227J996Q64j063k675l604m237m415l649k455j954
60110I20972k233k340j801r74q9P97J092J63j489k692l086l118k805j788l98O62
60094I00873J586L095M820N444M696L878M039M772N204N105M606L702K550J578
60080I55948R15K90l20o64q98j628k960m249n061n749o816q200r494j0484j1265
$$ plain form
60184 815698 813167 810390 807833 806108 805337 805214 805522 806099 806517 806473 806393 806984 808289 809815 811533 813961 817233
60167 817233 820819 824331 827954 831856 835741 839315 842811 846741 851252 855827 859562 861915 863340 864936
60153 864936 867306 870102 872834 875460 877708 878596 877452 874939 872273 869889 867670 865968 865289 865338 865503
60138 865503 866139 868254 872056 876820 882121 888101 894563 900915 907021 913069 918602 922863 926158 929662
60124 929662 933675 937279 939937 942164 944160 945024 943961 941286 937682 933445 929030 925381 922926 920972
60110 920972 918739 916399 914598 913624 913535 914332 915424 915587 914098 911406 908320 905202 902397 900609 900211 900873
60094 900873 902459 905554 910374 915818 920514 924392 928431 933203 938407 943512 948118 951820 954370 955948
60080 955948 956863 957153 956833 956169 955271 953643 950683 946434 941373 935624 928808 920608 911114 900630 889365
60065H89365j2057j2962j3603j3229j1552r406p940p322o796n977n391n501n812
60052G71817n348l843k151j417j921k879l435l562l642l568k969k169j899j987
60038G31027j316M20K026K360J723J081P98P27P55N21n16k101l129l249l492m547
60022G23088n555n664n643o596q066q794q657q383p981o936n479m271l198j839
60008F36026o59l44l56M13J862L026L874N250P089Q274Q344Q037P967P957P835
59993G04595P794P841P839P973Q355Q393P594O658O598P106O993N981M651K994
59979H01365N57k081l699m315n179o681p810p995p915q055p863o969o014n626
59965G21720n520n131m336l173j746o20m82j155j794k111k402k381j238Q78K624
$$ plain form
60065 889365 877308 864346 850743 837514 825962 816556 808616 801294 794498 788521 783130 777629 771817
60052 771817 766469 762626 760475 759058 757137 754258 750823 747261 743619 740051 737082 734913 733014 731027
60038 731027 729711 730131 732157 734517 736240 737321 738119 738846 739601 740122 739606 737505 734376 731127 727635 723088
60022 723088 717533 711869 706226 699630 691564 682770 674113 665730 657749 650813 645334 641063 637865 636026
60008 636026 635367 635023 634667 635080 636942 639968 643842 649092 656181 664455 672799 680836 688803 696760 704595
59993 704595 712389 720230 728069 736042 744397 752790 760384 767042 773640 780746 787739 793720 798371 801365
59979 801365 801922 799841 796142 791827 786648 779967 772157 764162 756247 748192 740329 733360 727346 721720
59965 721720 716200 711069 706733 703560 701814 701194 700712 699557 697763 695652 693250 690869 689631 690509 693133
59950F93133L102K813K570K453K225J965J878K077K677L465L613K628J370J012
59936G26981J149L18j595k968k782j973j804k204k421k334k300k339k217j843
59922G01668j304q26p80j182j330o61K66M65Nk66k06l60o38m01J89L26J23N92
59904F95680J814K638K582K503L003L528L638L748L985L658K513J355P37K91r1
59889G31582L43J791L109L348L091L421M476N737O887P608P431O563O058O457
59875G97902O992O765N897M894L710K102K69j549l383n074o202o834p491q052
59861G89946p717o511n630n737n970n420m497m005l756l082k034j241r97j076
59847G32273r30J59K385M643N466M986M876N926P068P312P207P485P665P239P012
$$ plain form
59950 693133 696235 699048 701618 704071 706296 708261 710139 712216 714893 718358 721971 724599 725969 726981
59936 726981 728130 728448 726853 723885 721103 719130 717326 715122 712701 710367 708067 705728 703511 701668
59922 701668 700364 699538 698758 697576 696246 695585 695851 696316 696321 696055 695849 695489 694851 694450 694639 694965 695088 695680
59904 695680 697494 700132 702714 705217 708220 711748 715386 719134 723119 726777 729290 730645 731382 731673 731582
59889 731582 731925 733716 736825 740173 743264 746685 751161 756898 763785 771393 778824 785387 791445 797902
59875 797902 804894 811659 817556 822450 826160 828262 828531 826982 823599 818525 812323 805489 797998 789946
59861 789946 782229 775718 770088 764351 758381 752961 748464 744459 740703 737621 735587 734346 733349 732273
59847 732273 731343 731502 733887 738530 743996 748982 753858 759784 766852 774164 781371 788856 796521 803760 810772
59832H10772P933R509J0669J1479J2644J3913J4370J3880J3067J2020J0065O759
59820I47080K381k455p049j0740j3250j4702j5144j4509j3284j2408j2196j2170
59808H21554j2205j2788j3703j3746j2540j1350j1148j0976r509p174n361m359
59796F96695l543l033l516m670n264m914m531m853n537n916n839n505n064m618
59782F29892m217l764l179k561k044j605j197p77j98N48R57M76n32j066q86p72
59766F09075j106j187l75R50K121K976L377K880J674R54J472K404K511J751R64
59751F30441N59M26O84J555K799L947M785N161M787L747K762K363K261J922J272
59736F69471M88k44n07R7J060J258N15n2K51P00N00M9K6J99Q0r0L2J12j63l26
$$ plain form
59832 810772 818705 828214 838883 850362 863006 876919 891289 905169 918236 930256 940321 947080
59820 947080 949461 947006 939957 929217 915967 901265 886121 871612 858328 845920 833724 821554
59808 821554 809349 796561 782858 769112 756572 745222 734074 723098 713589 706415 701054 696695
59796 696695 693152 690119 686603 681933 676669 671755 667224 662371 656834 650918 645079 639574 634510 629892
59782 629892 625675 621911 618732 616171 614127 612522 611325 610548 610350 610898 611855 612331 611799 610733 609847 609075
59766 609075 607969 606782 606407 607357 609478 612454 615831 618711 620385 621339 622811 625215 627726 629477 630441
59751 630441 631000 631426 632110 633665 636464 640411 645196 650357 655144 658891 661653 664016 666277 668199 669471
59736 669471 669959 669715 669208 669305 670365 671623 672138 672086 672337 673037 673537 673586 673612 673811 673891 673801 673833 673945 673782 673456
59716F73456K5M11L09Q4K07L33M3k62q2L34O94J362K453L176L033K797L197L554
59698F95124L002K151K194L018L558L482L259K911K076J026N42Q99J764K756L370
59683G31132K991J758P83P16P97J82p20j185j518k244k921l010l000l463l836
59668G16462l551l405m244n166m771l521k961l186k997k232j895k126j864p06
59654F73837N53J370J965K379K424K527L255M042L878L050K664K496J174j470
59640G04144l910n189n904o530o444n264l792k810k089j254n88l30j29K67N95
59625F60773P59J042J355J143L72k72n26r10j578j804j155k98rp9J75Q05J248
59608F61041J167P86N63P18R62Q32M29M42J078J414N46j036k023j956j480j182
$$ plain form
59716 673456 673481 673892 674201 674285 674492 674825 674868 674606 674524 674858 675552 676914 679367 682543 685576 688373 691570 695124
59698 695124 698126 700277 702471 705489 709047 712529 715788 718699 720775 721801 722343 723242 725006 727762 731132
59683 731132 734123 735881 736664 737380 738177 738359 737639 736454 734936 732692 729771 726761 723761 720298 716462
59668 716462 712911 709506 705262 700096 695325 691804 688843 685657 682660 680428 678533 676407 674543 673837
59654 673837 674390 675760 677725 680104 682528 685055 688310 692352 696230 699280 701944 704440 705614 704144
59640 704144 700234 695045 689141 682611 676167 670903 667111 664301 662212 660958 660370 660040 659911 660178 660773
59625 660773 661532 662574 663929 665072 665444 665172 664646 663736 662158 660354 659199 658901 658892 658813 658988 659793 661041
59608 661041 662208 662994 663557 664275 665237 666069 666498 666940 668018 669432 669978 668942 666919 664963 663483 662301
59592F62301j098j310j988k812l107k708k054j482j073r82j200j188n22J85o0
59577F40902j281k493k950k636j819r44p45j521k451k484j744j227j325j573j622
59562F14087j475r83o8P08P59M52N26Q61Q47O42R05J474J598J304J348J814K057
59545F26856J975K155K746L378M160N487O870P286O859O851P792Q891R541J0117
59531G10964J0960J1801J2640J3977J5610J6280J5121J2685J0060P761N867M463
59519H48189L495K697J968J321N03q39k605m507o669r227j1571j2916j3420j3836
59505G82583j4181j3820j2682j1330r978q498p260o815o761o165n004m082l564
59492F72443k878k031j625j506p45Q26K282L038L411L663L663L728M491N738O526
$$ plain form
59592 662301 661203 659893 657905 655093 651986 649278 647224 645742 644669 643687 642487 641299 640777 640962 640902
59577 640902 639621 637128 634178 631542 629723 628779 628034 626513 624062 621578 619834 618607 617282 615709 614087
59562 614087 612612 611629 611561 612269 613028 613480 614006 614867 615714 616356 617261 618735 620333 621637 622985 624799 626856
59545 626856 628831 630986 633732 637110 641270 646757 653627 660913 667772 674623 682415 691306 700847 710964
59531 710964 721924 733725 746365 760342 775952 792232 807353 820038 830098 837859 843726 848189
59519 848189 851684 854381 856349 857670 858173 857334 854729 850222 843553 834326 822755 809839 796419 782583
59505 782583 768402 754582 741900 730570 720592 712094 704834 698019 691258 685093 680089 676007 672443
59492 672443 669565 667534 665909 664403 663658 664484 666766 669804 673215 676878 680541 684269 688760 694498 701024
59477G01024O661O881P461P871P951Q107Q221P741P068P363Q628R414Q789P303
59463H10483N614L631J490J5l88j54N88K277M731P065R251J2243J5965J8701J9321
59448I10833J8770J8394J7959J6375J3431R911O607L990K147N66j458l903o286
59435A007336q825j2192j5967j8622j9423j9083j8213j6527j4033j1569r551p419
59423H35912m970k897j337P08L794P192J0373J3946J8144K1623K2896K1982J9776
59410I67142J6852J3733J1241R553P898O038N095N825O997O482L260k358r464
59397A048294j6501k1378k2925k1828j9372j5882j1265o405l050k569n280j0438
59385H91401j6367k1137k3746k4407k3577k1474j8577j5637j2867r990p306n548
$$ plain form
59477 701024 707685 714566 722027 729898 737849 745956 754177 761918 768986 776349 784977 794391 803180 810483
59463 810483 816097 819728 821218 821233 820845 820691 821279 823556 828287 835352 844603 856846 872811 891512 910833
59448 910833 929603 947997 965956 982331 995762 1005673 1012280 1016270 1018417 1018983 1017525 1013622 1007336
59435 1007336 998511 986319 970352 951730 932307 913224 895011 878484 864451 852882 843331 835912
59423 835912 830942 828045 826708 827416 831210 838402 848775 862721 880865 902488 925384 947366 967142
59410 967142 983994 997727 1008968 1018521 1026419 1032457 1037552 1043377 1050374 1056856 1060116 1057758 1048294
59397 1048294 1031793 1010415 987490 965662 946290 930408 919143 912738 909688 907119 901839 891401
59385 891401 875034 853897 830151 805744 782167 760693 742116 726479 713612 703622 696316 690768
59373F90768m493k951o35J288K011K172K578L081L410L807M117L609K527K481
59359G13770M302O720Q224R088J0363J1932J2902J3218J3699J4876J6662J8747
59347H54503K0703K2267K3888K6219K8728K9885K9155K7671K6415K4971K2682
59336A137087J9709J6130J1394N544k03m988r243j3278j6368j8249k0100k2793
59324A084642k5363k6392k5892k4632k2836k0685j8990j7992j6585j4025j1354
59313H59896r851r133q184p182o767o436n310l813l003k772k117q12N24J579K424
59298G99043K943L183L861N424P203Q353Q979R470R589R243R235J0100J0969J0841
59284I08436J0157R923J0012R662Q946Q514Q446Q564R231J0735J2530J4144J6075
$$ plain form
59373 690768 686275 683324 682689 683977 685988 688160 690738 693819 697229 701036 705153 708762 711289 713770
59359 713770 718072 724792 733016 742104 752467 764399 777301 790519 804218 819094 835756 854503
59347 854503 875206 897473 921361 947580 976308 1006193 1035348 1063019 1089434 1114405 1137087
59336 1137087 1156796 1172926 1184320 1189864 1189661 1184673 1175430 1162152 1145784 1127535 1107435 1084642
59324 1084642 1059279 1032887 1006995 982363 959527 938842 919852 901860 885275 871250 859896
59313 859896 850045 840912 832728 825546 818779 812343 807033 803220 800217 797445 795328 794516 795040 796619 799043
59298 799043 801986 805169 809030 814454 821657 830010 838989 848459 858048 867291 876526 886626 897595 908436
59284 908436 918593 928516 938528 948190 957136 965650 974096 982660 991891 1002626 1015156 1029300 1045375
59271A045375J8549K0202J9402J6297J2320Q301M313P32j986m204o582r004j1079
59258A112636j3147j5831j8924k1678k3623k4387k3620k1887k0637k0264j9312
59247H89326j6711j3633j1665j0350q226n363l055j668n26O02J526K722M804P199
59233H34982Q829R666J0286J0379R176P015M966L175R03k021n057p947j0678j2784
59219H60890j3780j3971j3901j3503j2695j2008j1632j0677q638o578n592m998
59207G32917l582j705n56j22M31J038J170J272K083L073L272L116L712M808N275
59192G56202N151N424O127O429O277O322O501O267N937O203O723O734O549O773
59178H43619O692N293L398K785L474L917L668L821M861O011O870P851Q932R562
$$ plain form
59271 1045375 1063924 1084126 1103528 1119825 1132145 1140446 1144759 1145491 1143505 1139301 1132719 1123715 1112636
59258 1112636 1099489 1083658 1064734 1043056 1019433 995046 971426 949539 928902 908638 889326
59247 889326 872615 858982 847317 836967 828741 823378 820323 818655 818129 818731 820257 822979 827783 834982
59233 834982 843811 853477 863763 874142 883318 890333 895299 898474 899377 897356 892299 884352 873674 860890
59219 860890 847110 833139 819238 805735 793040 781032 769400 758723 750085 743507 737915 732917
59207 732917 729335 727630 727074 726952 727383 728421 729591 730863 732946 736019 739291 742407 746119 750927 756202
59192 756202 761353 766777 772904 779333 785610 791932 798433 804700 810637 816840 823563 830297 836846 843619
59178 843619 850311 855604 859002 861787 865261 869178 872846 876667 881528 887539 894409 902260 911192 920754
59164I20754R919J0675J1526J1416J0240Q831P440N709L879K405O76k277n958
59151I95235q979j1127j3167j4970j5635j5241j4606j3660j1936j0282r908j0023
59139H45701q741o265m681m490l893k020l44n1k01M61J680K641L213L440L123
59124H29573K664L008M264N546O543P915R854J1651J2957J4143J5121J5269J4683
59111I53191J4181J3877J3164J2162J1590J1158R761P437N418M022K269o0j843
59098A056327k562l141m269n374n915o256o717p039p234p722q278q049o902n660
59084I71209m874m507m759n875p297q344r416j1065j2350j1991j0747j0468j1102
59071H58414j0930r750r256r887r909q333o412n390m754l696k474j485n88Kl32
$$ plain form
59164 920754 930673 941348 952874 964290 974530 983361 990801 996510 1000389 1002794 1003470 1001193 995235
59151 995235 986256 975129 961962 946992 931357 916116 901510 887850 875914 865632 855724 845701
59139 845701 836960 830695 826014 821524 817631 815611 815267 815216 815015 815476 817156 819797 823010 826450 829573
59124 829573 832237 835245 839509 845055 851598 859513 869367 881018 893975 908118 923239 938508 953191
59111 953191 967372 981249 994413 1006575 1018165 1029323 1039084 1046521 1051939 1055961 1058230 1058170 1056327
59098 1056327 1053765 1050624 1046355 1040981 1035066 1028810 1022093 1015054 1007820 1000098 991820 983771 976869 971209
59084 971209 966335 961828 957069 951194 943897 935553 926137 915072 902722 890731 879984 869516 858414
59071 858414 847484 837734 828478 818591 808682 800349 793937 788547 783793 780097 777623 776138 775550 775552 775220
59056G75220j243j637j577k216l529m083l455k856k872k626j815j433j786j773
59042G42319q64J00P30J687K851L015K166J895K714L171K487J986K776M138N242
59027G76413O411P646Q016P699Q517J1048J3317J3770J3510J4048J4729J4145
59015I09269J2401J0235P426L773L49j840l346m960o134o028n006l839k385l34
59001I09581J815L535N150P000Q746J0145J1428J2340J2124J0918R742Q700O904
58988A018128M524K832J650r09n264r233j1243j2378j3907j5009j4584j3279j1996
58975I19332j0198p397m638k882j467M42K469M376O991J0320J2707J3418J4099
58962I57572J6058J8091J8785J8856J9196J8613J5866J2062Q721N052l14o440
$$ plain form
59056 775220 773977 772340 770763 768547 765018 760935 757480 754624 751752 749126 747311 745878 744092 742319
59042 742319 741455 741555 742285 743972 746823 749838 752004 753899 756613 759784 762271 764257 767033 771171 776413
59027 776413 782824 790470 798486 806185 814702 825750 839067 852837 866347 880395 895124 909269
59015 909269 921670 931905 939331 943104 943453 941613 938267 933307 927173 921145 916139 912300 909915 909581
59001 909581 911396 914931 920081 927081 935827 945972 957400 969740 981864 992782 1002524 1011224 1018128
58988 1018128 1022652 1025484 1027134 1026225 1020961 1011728 1000485 988107 974200 959191 944607 931328 919332
58975 919332 909134 901737 897099 894217 892750 893192 895661 900037 907028 917348 930055 943473 957572
58962 957572 973630 991721 1010506 1029362 1048558 1067171 1083037 1095099 1103820 1108872 1108558 1102118
58950A102118j1428j5402j9483k2940k4024k2933k1464k0187j8320j5898j3806
58939H96233j2003r733p322n862n352m698l432k048r97n43j036k245l110l284
58925H34568l923n791p679q171p760p665p615o619m940l583k567j356k27L49R04
58910G67925K010K999L193L439M810O704P864Q368Q992R508R457R689J1264J3555
58896H69777J5257J6571J8592K1155K3149K4487K6049K8137L0455L3051L5809
58885A142489L7636L7740L6925L6122L4418L0272K3987J7268J0970M968m35m907
58873A407453r384j5153k1821k7663l1672l3849l4094l2371k9647k7136k4902
58862A119761k2409k0018j8581j8077j7846j7808j8170j8541j8394j7910j7319
$$ plain form
58950 1102118 1090690 1075288 1055805 1032865 1008841 985908 964444 944257 925937 910039 896233
58939 896233 884230 874497 867175 861313 855961 851263 847831 845783 844786 844243 843207 840962 837852 834568
58925 834568 830645 824854 817175 809004 801244 793579 785964 779345 774405 770822 768255 766899 766672 767021 767925
58910 767925 769935 772934 776127 779566 784376 791080 798944 807312 816304 825812 835269 844958 856222 869777
58896 869777 885034 901605 920197 941352 964501 988988 1015037 1043174 1073629 1106680 1142489
58885 1142489 1180125 1217865 1254790 1290912 1325330 1355602 1379589 1396857 1407827 1412795 1412360 1407453
58873 1407453 1398069 1382916 1361095 1333432 1301760 1267911 1233817 1201446 1171799 1144663 1119761
58862 1119761 1097352 1077334 1058753 1040676 1022830 1005022 986852 968311 949917 932007 914688
58851I14688j6222j4518j3136j2702j2450j1558j0524j0038r678r010q734r286
58839G76832r592q740p681p622p942p458o594o478o850o686n925m999l613j724
58825F84928o27j234k341k312j430p78q0J367K742K877K430K742L483L487L057
58810F98311L226L506K649J015J46M02Q61J056J124Q35R4l46q8qn59n42P44J723
58792G14149Q93n62p11K1J05j96K71J092J298J684L428N551O368O355O808O998
58776G53552N598L814L767M702M108J873J5j156l106n678p121p395q105r052q265
58761G27551n713l726l191k385k64J916K977L336L454L087K595K945L893M229
58747G40704L961M358N705P087Q219R488J0426J0373J0326J1746J3800J4320J3204
$$ plain form
58851 914688 898466 883948 870812 858110 845660 834102 823578 813540 803862 794852 786118 776832
58839 776832 767240 758500 750819 743197 735255 727797 721203 714725 707875 701189 695264 690265 686652 684928
58825 684928 684301 683067 680726 678414 676984 676206 676126 677493 680235 683112 685542 688284 691767 695254 698311
58810 698311 701537 705043 707692 708707 708853 709255 710116 711172 712296 713131 713225 712879 712791 712783 712224 711682 712426 714149
58792 714149 715042 714480 713769 713790 713895 713699 713970 715062 716360 718044 721472 727023 733391 739746 746554 753552
58776 753552 759150 762964 766731 771433 775541 777414 777429 776273 773167 767489 760368 752973 744868 735816 727551
58761 727551 721838 718112 714921 712536 712272 714188 717165 720501 723955 727042 729637 732582 736475 740704
58747 740704 744665 749023 754728 761815 770034 779522 789948 800321 810647 822393 836193 850513 863717
58734H63717J2313J2241J2005J1752J2805J4843J5831J5125J4065J3231J1725
58723A009653R509P887P229O569N770N859O924P853Q299Q867R441R391R166R329
58709A121746Q586N358Q29k473m661p971j2532j6053j7826j9686k2527k5089k6691
58696I81010k8191k9615k9718k8468k7224k6065k3716k0412j7828j5889j2812
58685G21072q793o370o421o972o827p069p990p793n745l836l643m025l257j379
58671F40952O87K425L324L181L280N239Q392J0495J1207J2389J4760J6818J7299
58658G50448J6171J3190Q218L047oj420l441o018p101o842p659r720j0392q871
58644G29604p494p489p283o157n686o215n625l151r22j45P74K733L984L437K661
$$ plain form
58734 863717 876030 888271 900276 912028 924833 939676 955507 970632 984697 997928 1009653
58723 1009653 1019162 1027049 1034278 1040847 1046617 1052476 1059400 1067253 1075552 1084419 1093860 1103251 1112417 1121746
58709 1121746 1130332 1135690 1136519 1134046 1129385 1121414 1108882 1092829 1075003 1055317 1032790 1007701 981010
58696 981010 952819 923204 893486 865018 837794 811729 788013 767601 749773 733884 721072
58685 721072 712279 705909 699488 692516 685689 678620 670630 662837 657092 653256 649613 645588 642331 640952
58671 640952 641639 644064 647388 650569 653849 659088 667480 677975 689182 701571 716331 733149 750448
58658 750448 766619 779809 788027 791074 791068 789648 786207 780189 773088 766246 758587 748867 738475 729604
58644 729604 722110 714621 707338 701181 695495 689280 683655 680504 679582 679437 680211 682944 686928 690365 693026
58629F93026K734K230J62j988k885l195l294k055N85K750L740N161P615R395R835
58614G23816J0678J2607J3730J3149J2723J3397J3132J0413O709L546K60l426
58602H30734n795o195o590q066q857p853o848p138p066n335l578l203k647l99
58588G51164K163L481M676P086R613J1082J2667J5355J7488J7455J6535J6467
58576H85232J6375J4670J1981R841Q311P096O981Q173R251R618J0881J4066J7728
58563A030204K0532K3311K6768K9682L1164L2134L2853L1638K7779K2964J8163
58552A327192J2026M234k727p173j0608j4412j7311j8258j8657j9465j9242j7456
58540A198143j6471j7786j9525k0079k0976k3409k5287k4674k3037k2160k0916
$$ plain form
58629 693026 695760 697990 698152 696164 693279 690084 686790 684735 685320 688070 691810 696971 704586 713981 723816
58614 723816 734494 747101 760831 773980 786703 800100 813232 823645 830354 833900 834160 830734
58602 830734 824939 818744 812154 804088 795231 787378 780530 773392 766326 760991 757413 754210 751563 751164
58588 751164 753327 756808 761484 768570 778183 789265 801932 817287 834775 852230 868765 885232
58576 885232 901607 916277 928258 938099 946410 953506 960487 968660 977911 987529 998410 1012476 1030204
58563 1030204 1050736 1074047 1100815 1130497 1161661 1193795 1226648 1258286 1286065 1309029 1327192
58552 1327192 1339218 1343452 1340725 1333552 1322944 1308532 1291221 1272963 1254306 1234841 1215599 1198143
58540 1198143 1181672 1163886 1144361 1124282 1103306 1079897 1054610 1029936 1006899 984739 963823
58529I63823j8025j4985j3161j1008p211l645k118j134J006K895K994K918M367
58516I06716N691M980L797M293N240M488K921K470K474J357k16r74j637l005l838
58501I34757l365l260m476n069l959l567n591p545o901n349n347n658m215k223
58487H68232j487p06J634L701L743M081P348J1624J3658J4209J5814J7807J8073
58474I77731J7321J7187J6293J2531P155K582j613o568j0649j2142j2840j4750
58462I92238j5921j3931j0735r487r151o939l551j239Q56M517Q054Q945Q638R741
58448I62035J0771Q744M832K326Q81k082o032q349r041r719r674p542m936l899
58434I28315k850L30L565L815K589L192M892N074M833O899J0092J1334J1219J2267
$$ plain form
58529 963823 945798 930813 917652 906644 899433 895788 893670 892536 893542 896437 899431 902349 906716
58516 906716 912407 917387 921184 925477 930717 935205 938126 940596 943070 944427 944211 943237 941600 938595 934757
58501 934757 931392 928132 923656 918587 914628 911061 905470 897925 891024 885675 880328 874670 870455 868232
58487 868232 866745 866039 867673 871374 875117 879198 886546 898170 911828 926037 941851 959658 977731
58474 977731 995052 1012239 1028532 1041063 1048218 1050800 1049187 1042619 1031970 1019828 1006988 992238
58462 992238 976317 962386 951651 942164 933013 926074 922523 921284 922140 926657 934711 943656 952294 962035
58448 962035 972806 981550 986382 988708 989589 987507 981475 973126 964085 954366 944692 937150 932214 928315
58434 928315 925465 925795 929360 933175 935764 938956 943848 948922 953755 960654 970746 982080 993299 1005566
58420A005566J3667J3089J1650J1576J1112P404K343j58o87k350m480m336l124
58407A061272m101o441p024o590p974j0025r485p290o757p159n413k539k029l193
58393I75252k568n57l83j742j845j290k570m320l459j446j885l576k708j64L47
58378I47086k62J863N875P659P536R137J1875J2044J0309J0525J2175J1578R599
58365A056999J0346J3137J3683J2432J3708J7189J8321J6788J6539J7724J6633
58354A223499J3370J1645J1192Q340L842K114L073K734J428L052O670P477N827
58341A304263O611R850J0752R110R642J2772J4089J3302J4658J8077J8855J6727
58329A458708J6229J7705J6922J4001J3431J4851J3202Q561O307P082O196L463
$$ plain form
58420 1005566 1019233 1032322 1043972 1055548 1066660 1074064 1076407 1076249 1075562 1073212 1068732 1064396 1061272
58407 1061272 1057171 1050730 1043706 1037116 1029142 1019117 1009632 1002342 995585 988426 983013 980474 978445 975252
58393 975252 972684 972127 971744 970002 968157 966867 964297 959977 956518 955072 953187 949611 946903 946739 947086
58378 947086 946824 948687 954562 962221 969757 978894 990769 1002813 1013122 1023647 1035822 1047400 1056999
58365 1056999 1067345 1080482 1094165 1106597 1120305 1137494 1155815 1172603 1189142 1206866 1223499
58354 1223499 1236869 1248514 1259706 1268046 1271888 1274002 1277075 1279809 1281237 1284289 1290959 1298436 1304263
58341 1304263 1310874 1320724 1331476 1340586 1350228 1363000 1377089 1390391 1405049 1423126 1441981 1458708
58329 1458708 1474937 1492642 1509564 1523565 1536996 1551847 1565049 1573610 1579917 1586999 1593195 1596658
58317A596658L647O490O550L794M117Q332J0930J0807J2689J6709J7377J4417
58305A712517J3974J7375J9210J8122J8832K1882K2210J9528J9271K1770K1503
58294A926194J8426J8606K2269K2987K0212K0473K4604K6271K4801K6606L1979
58283B183428L3697L0927L0983L4999L5798L2557L3262L9395M2758M0951M1493
58272B580248M6759M9645M8274M9993N6499N9882N8089N9180O5681O9941O9699
58261C213890P2508P9922Q3258Q0191P9234Q2683Q1895P4888P1332P4369P5107
58250D069277P1102P2065Q0906Q7615Q8692R3708J05712J14561J16929J23006
58240E023573J35865J44837J46943J53632J68212J78817J82125J90938K09247
$$ plain form
58317 1596658 1600305 1606795 1613345 1617139 1621256 1629588 1640518 1651325 1664014 1680723 1698100 1712517
58305 1712517 1726491 1743866 1763076 1781198 1800030 1821912 1844122 1863650 1882921 1904691 1926194
58294 1926194 1944620 1963226 1985495 2008482 2028694 2049167 2073771 2100042 2124843 2151449 2183428
58283 2183428 2217125 2248052 2279035 2314034 2349832 2382389 2415651 2455046 2497804 2538755 2580248
58272 2580248 2627007 2676652 2724926 2774919 2831418 2891300 2949389 3008569 3074250 3144191 3213890
58261 3213890 3286398 3366320 3449578 3529769 3609003 3691686 3773581 3848469 3919801 3994170 4069277
58250 4069277 4140379 4212444 4293350 4380965 4469657 4563365 4669077 4783638 4900567 5023573
58240 5023573 5159438 5304275 5451218 5604850 5773062 5951879 6134004 6324942 6534189
58231F534189K23835K30291K42354K65084K84615K95723L12770L41495L67615
58222I097971L85935M12057M51987M90155N21346N63032O21496O78993P30123
58213A3953095P95702Q83954R75436J064466J175811J320954J480556J651601
58205B3301575J866516K142891K463998K834698L303147L898764M605291N423318
58197D9840198O394874P538443Q841939J0363112J2252031J4627748J7522519
58190A27380864K0972879K5011907K9505088L4170018L8784571M2925082M5079653
58183C63830062M2407524L2388853J5348019m830102k2881834l5229029m1222009
58176C49811484m2176128l9881547l5866499l1258568k6732905k2552027j8796173
$$ plain form
58231 6534189 6758024 6988315 7230669 7495753 7780368 8076091 8388861 8730356 9097971
58222 9097971 9483906 9895963 10347950 10838105 11359451 11922483 12543979 13222972 13953095
58213 13953095 14748797 15632751 16608187 17672653 18848464 20169418 21649974 23301575
58205 23301575 25168091 27310982 29774980 32609678 35912825 39811589 44416880 49840198
58197 49840198 56235072 63773515 72615454 82978566 95230597 109858345 127380864
58190 127380864 148353743 173365650 202870738 237040756 275825327 318750409 363830062
58183 363830062 406237586 438626439 453974458 449144356 426262522 391033493 349811484
58176 349811484 307635356 267753809 231887310 200628742 173895837 151343810 132547637
58169A32547637j5550614j2866032j0672388q840690p291604n999309m943177
58162F6383823m100805l445945k916368k414570j863495j245069o01454n0258
58154D9745859K18524M9741n36160j350935k193501k945591l523168l833840l839811
58145C1791118l610082l258916k862040k459429k091622j785219j528878j302163
58137A2892769j109479r59783q38157p26405o30275n60088n04788m49895m01808
58128F712091l70725l47522l19744k93256k77007k62984k41451k19955k07775
58119D171672j97020j77965j58064j47356j39523j25450j11578j07125j06193
58110B901398r9767r2957r3580r5718r0857q3877q2304q1014p2956o4072o2406
$$ plain form
58169 132547637 116997023 104130991 93458603 84617913 77326309 71327000 66383823
58162 66383823 62283018 58837073 55920705 53506135 51642640 50397571 49796117 49745859
58154 49745859 49964383 50014124 49477964 48127029 45933528 42987937 39464769 35630929 31791118
58145 31791118 28181036 24922120 22060080 19600651 17509029 15723810 14194932 12892769
58137 12892769 11783290 10823507 9985350 9258945 8628670 8068582 7563794 7113899 6712091
58128 6712091 6341366 5993844 5674100 5380844 5103837 4840853 4599402 4379447 4171672
58119 4171672 3974652 3796687 3638623 3491267 3351744 3226294 3114716 3007591 2901398
58110 2901398 2801631 2708674 2615094 2519376 2428519 2344642 2262338 2181324 2108368 2044296 1981890
58099A981890o2827n7424n0774n0285n1277m6140l9045l7415l7742l3563k8812
58088A486586k9637l1437k7333k1455k0893k2392j9761j6645j9142k3295k2566
58077A232030k0454k3289k7539k6644k3661k4824k7087k4314j9626j9449k1151
58066I73992j8552j4169j4143j6214j4331j0357r846j0924q490m982n929r125
58054H36930q914p113r030j2636j2340r752j0293j2530j1166p512o890q468p393
58041G12893m426m080n708n364m017n245p403o517m298n003p116o373m235n056
58027F38052p680q003p101q645j1065j0450q486r259j0967r178n639n380p372
58014E28827o629l569k757m033l285o98j35j375p01J699K287J136J316K390J470
$$ plain form
58099 1981890 1919063 1861639 1810865 1760580 1709303 1663163 1624118 1586703 1548961 1515398 1486586
58088 1486586 1456949 1425512 1398179 1376724 1355831 1333439 1313678 1297033 1277891 1254596 1232030
58077 1232030 1211576 1188287 1160748 1134104 1110443 1085619 1058532 1034218 1014592 995143 973992
58066 973992 955440 941271 927128 910914 896583 886226 876380 865456 856966 851984 846055 836930
58054 836930 828016 820903 811873 799237 786897 777145 766852 754322 743156 735644 728754 720286 712893
58041 712893 708467 704387 698679 693315 689298 684053 676650 670133 665835 660832 653716 647343 643108 638052
58027 638052 630372 622369 615268 606623 595558 585108 576622 567363 556396 547218 541579 536199 528827
58014 528827 522198 518629 515872 511839 508554 507856 507721 506346 505645 507344 509631 510767 512083 514473 515943
57999E15943l16O86L809N187M561M660N234M072K428L033M202K358j149k167j028
57984E51513j170k155q95J533J161j836l841m471o103p965p175m738m177n135
57970E04546m477k653k750m187l695j557p86j089J94K229K052O87J553L813L742
57955D97622J728J437K781K376L67J20J542J247p98j311j60l25j554o02K091K511
57939E09072L21m38J484K775J848J066J812K697L454N348P283O531L772K310K341
57924E51676J229o82l27J992K680J337J230K839K875N50j045p95j117k603k762
57909E57077j281j106k895l742k727k499l966m630l718l875o060p633p224o871
57895D98850p681p893o821o351o958o579m836m104n054n407m400m073m847m321
$$ plain form
57999 515943 515627 516313 520122 525309 529870 534530 539764 543836 546264 549297 553499 555857 554708 552541 551513
57984 551513 550343 548188 547293 548826 549987 548151 544310 539839 533736 525771 518596 513858 509681 504546
57970 504546 500069 497416 494666 490479 486784 485227 484441 483352 483546 485775 487827 488514 490067 493880 497622
57955 497622 499350 500787 503568 505944 506311 506431 507973 509220 508422 507111 506951 506626 505072 504470 506561 509072
57939 509072 509393 508955 510439 513214 515062 516128 517940 520637 524091 529439 536722 543253 547025 549335 551676
57924 551676 552905 552223 551896 553888 556568 557905 559135 561974 564849 565399 564354 563559 562442 559839 557077
57909 557077 555796 554690 551795 548053 545326 542827 538861 534231 530513 526638 520578 512945 505721 498850
57895 498850 491169 483276 476455 470104 463146 456567 451731 447627 442573 437166 432766 428693 423846 419525
57881D19525j950m46r76j250J0R75O71P55J666J234j064k583k020j515k414k931
57865D07687j950j302k217l042k541k048k503k577j543q60j290j434o02J0J40
57850C83928J232L220M027L437L876O105P737P487P154P885Q137P097O571P582
57836D65475Q427P918P336P425O662M295K053J101K86j056j618j005r62k169k849
57821E01319k099j550k201k708k372k686m216n067m133k961k787k645j967k023
57807D61904l119l419k200j385k101k743k124j649k586l860m262m238m067k975
57793D21176j390j208k508k955j691p19j103j173J5Q35L75K17J174J540N13O1
57777D13159J486L258M167N334P168P646N887M170M170M350L325K604L488M328
$$ plain form
57881 419525 417575 417129 416153 414903 414913 415888 416559 417314 418980 420214 419150 416567 414547 413032 410618 407687
57865 407687 405737 404435 402218 399176 396635 394587 392084 389507 387964 387104 385814 384380 383778 383788 383928
57850 383928 385160 388380 392407 395844 399720 405825 413562 421049 428203 436088 444225 451322 457893 465475
57836 465475 473902 481820 489156 496581 503243 507538 509591 510692 510978 509922 508304 507299 506337 504168 501319
57821 501319 499220 497670 495469 492761 490389 487703 483487 478420 474287 471326 468539 465894 463927 461904
57807 461904 458785 455366 453166 451781 449680 446937 444813 443164 440578 436718 432456 428218 424151 421176
57793 421176 419786 418578 416070 413115 411424 410705 409602 408429 408444 409279 409654 409871 411045 412585 413098 413159
57777 413159 414645 417903 422070 427404 434572 442218 448105 452275 456445 460795 464120 466724 470212 474540
57763D74540L474K085J548R61m28j255r15j433l868n850n498m739n814p312o995
57748D38501n853n967o574n753m107l472l571k966j920j548j507j048q61j547
57734C91807j843o78O09M13m74n59k66o68j280j249j065j136n67P99J249J05n62
57717C84635O48J868J175rM24J573J437M62J87K01n32j055j32R46L09j260j789
57700C89088j397j312j101K02J518J236J76K80J429K137K321K748K888J937R40
57685D03090J353K496K781K423K646L333L887N115P871J1053J3368J5897K0464
57672D95777K6605L2523L7778M2584M5809M6282M4974M3498M1747L9414L8355
57661I35346M0463M4178M5678M2384L3175J6935n668l0010n0232o3748p0981p2262
$$ plain form
57763 474540 478014 480099 481647 482608 482180 480925 480010 478577 474709 468859 463361 458622 452808 445496 438501
57748 438501 432648 426681 420107 414354 410247 406775 403204 400238 398318 396770 395263 394215 393354 391807
57734 391807 389964 389286 389895 390308 389834 389275 389009 388341 387061 385812 384747 383611 383044 383843 385092 385197 384635
57717 384635 385283 387151 388326 388317 388741 390314 391751 392213 392400 392601 392069 391014 390882 391828 392137 390877 389088
57700 389088 387691 386379 385278 385480 386998 388234 388410 388690 390119 392256 394577 397325 400213 402150 403090
57685 403090 404443 406939 409720 412143 414789 418122 422009 427124 434995 446048 459416 475313 495777
57672 495777 522382 554905 592683 635267 681076 727358 772332 815830 857577 896991 935346
57661 935346 975809 1019987 1065665 1108049 1141224 1158159 1152491 1122481 1072249 1008501 937520 865258
57649H65258o8028o0802n3553m6545l8628l0679k4751k0660j6657j2845j0762
57638D81348j0021q590o238m672m247l505k000r21p08n30j86k82n34j23M99K79
57622D39569k77J40J181J413R82J266K182K260J227K33k93q29j039j38J246J672
57606D50795J150Q54R68Q10N63Q22J002L15l45L33J622J906J433J523J834J085
57590D66670k06m41J26lo55m33L35Q5r14r39m4O2o76n28P15J279M70m60q31j283
57570D62329j823j571p45m49m72K52J169Q01k23K35K114L154K774K795L827M180
57554D78347L210K629L404M077L484K674K827L435L729M000M498M739M682M904
57540E30639N225M887M345M812N851N682M210L358L945M664M601M426M423L850
$$ plain form
57649 865258 797230 736428 682875 636330 597702 567023 542272 521612 504955 492110 481348
57638 481348 471327 462737 456499 451827 447580 444075 442075 441154 440446 439916 439730 439448 438914 438791 439290 439569
57622 439569 439292 439432 440613 442026 443008 444274 446456 448716 449943 450176 449883 449054 448015 447877 449123 450795
57606 450795 451945 452799 453767 454577 455140 455962 456964 457279 456934 457267 458889 460795 462228 463751 465585 466670
57590 466670 466464 466023 466149 466146 465491 465058 465393 465478 464564 463625 463581 463643 462967 462439 463154 464433 464903 464443 463612 462329
57570 462329 460506 458935 458190 457741 457269 457521 458690 459491 459268 459503 461617 464771 467545 470340 474167 478347
57554 478347 481557 484186 487590 491667 495151 497825 500652 504087 507816 511816 516314 521053 525735 530639
57540 530639 535864 540751 545096 549908 555759 561441 565651 569009 572954 577618 582219 586645 591068 594918
57526E94918K825K550K960K629J562J550K972L902L348K797L356L958L668L359
57512F36354L696L694K775K183K797L486L132K531K724L134K857K346K460L038
57498F77207L617M294M938M810L824K948K679K472K198K511L302L509L055L092
57484G24456L763L779K906K695L789M670M189L309L073K892K230K043L054M264
57470G71112M624M693N255N794N706N563N880N958N247M513M520M826M958N352
57456H44001O123O356N767N525O371P327P449P348P807Q345Q408Q551R223R675
57442I48276R341Q942R083R046Q206P320P228P517P612P889Q604R004Q630Q258
57428A064956Q504Q826Q835R134R816R749Q534P582P936Q602Q403P931Q215Q876
$$ plain form
57526 594918 597743 600293 603253 605882 607444 608994 611966 615868 619216 622013 625369 629327 632995 636354
57512 636354 640050 643744 646519 648702 651499 654985 658117 660648 663372 666506 669363 671709 674169 677207
57498 677207 680824 685118 690056 694866 698690 701638 704317 706789 708987 711498 714800 718309 721364 724456
57484 724456 728219 731998 734904 737599 741388 746058 750247 753556 756629 759521 761751 763794 766848 771112
57470 771112 775736 780429 785684 791478 797184 802747 808627 814585 819832 824345 828865 833691 838649 844001
57456 844001 850124 856480 862247 867772 874143 881470 888919 896267 904074 912419 920827 929378 938601 948276
57442 948276 957617 966559 975642 984688 992894 1000214 1007442 1014959 1022571 1030460 1039064 1048068 1056698 1064956
57428 1064956 1073460 1082286 1091121 1100255 1110071 1119820 1128354 1135936 1143872 1152474 1160877 1168808 1177023 1185899
57414A185899R202R630J0546J0950J0015Q835Q964J0184J1257J1853J2266J2187
57402A311788J1388J0724J1005J1621J1646J1327J1272J1141J0565J0299J1046
57391A433822J2024J2194J1980J2338J2923J2796J2131J1805J1909J2077J2559
57380A568558J3640J4664J4970J5099J5802J6560J6442J5739J5383J5368J5130
57369A737355J4940J5489J6429J6647J5886J5044J4979J5776J6952J7827J7991
57358A915315J7853J8178J8844J8900J8215J7854J8394J9091J9407J9952K1067
57347B123070K1843K1522K0703K0228K0104K0369K1596K3485K4411K3579K2281
57336B363191K1878K1961K1759K1807K2677K3396K2884K1836K1596K2156K2741
$$ plain form
57414 1185899 1195101 1204731 1215277 1226227 1236242 1245077 1254041 1264225 1275482 1287335 1299601 1311788
57402 1311788 1323176 1333900 1344905 1356526 1368172 1379499 1390771 1401912 1412477 1422776 1433822
57391 1433822 1445846 1458040 1470020 1482358 1495281 1508077 1520208 1532013 1543922 1555999 1568558
57380 1568558 1582198 1596862 1611832 1626931 1642733 1659293 1675735 1691474 1706857 1722225 1737355
57369 1737355 1752295 1767784 1784213 1800860 1816746 1831790 1846769 1862545 1879497 1897324 1915315
57358 1915315 1933168 1951346 1970190 1989090 2007305 2025159 2043553 2062644 2082051 2102003 2123070
57347 2123070 2144913 2166435 2187138 2207366 2227470 2247839 2269435 2292920 2317331 2340910 2363191
57336 2363191 2385069 2407030 2428789 2450596 2473273 2496669 2519553 2541389 2562985 2585141 2607882
57325B607882K3329K4052K4187K3314K2537K2954K3886K4109K3864K4127K4783
57314B869024K5150K5379K5914K6365K6439K6954K8451K9771K9632K8646K8195
57303C169920K8251K8019K7766K8217K8963K9167K9181K9777L0590L0850L0872
57292C491573L1164L1056K9914K8800K8994K9772K9599K8737K8614K9272K9548
57281C817043K9308K9397K9712K9353K8509K8301K8991K9894L0823L1963L2726
57270D146020L2404L1592L1488L2150L2941L4010L5691L7113L7273L6877L7315
57259D524874L8338L8676L8336L8304L8484L7985L7074L6733L6653L5740L4298
57248D935495L3575L3404L2518L1065L0540L1136L1442L0926L0594L0835L0783
$$ plain form
57325 2607882 2631211 2655263 2679450 2702764 2725301 2748255 2772141 2796250 2820114 2844241 2869024
57314 2869024 2894174 2919553 2945467 2971832 2998271 3025225 3053676 3083447 3113079 3141725 3169920
57303 3169920 3198171 3226190 3253956 3282173 3311136 3340303 3369484 3399261 3429851 3460701 3491573
57292 3491573 3522737 3553793 3583707 3612507 3641501 3671273 3700872 3729609 3758223 3787495 3817043
57281 3817043 3846351 3875748 3905460 3934813 3963322 3991623 4020614 4050508 4081331 4113294 4146020
57270 4146020 4178424 4210016 4241504 4273654 4306595 4340605 4376296 4413409 4450682 4487559 4524874
57259 4524874 4563212 4601888 4640224 4678528 4717012 4754997 4792071 4828804 4865457 4901197 4935495
57248 4935495 4969070 5002474 5034992 5066057 5096597 5127733 5159175 5190101 5220695 5251530 5282313
57237E282313L0252L0396L1803L3522L4526L4735L4347L3501L2886L3190L3926
57226E645397L4058L3684L3659L3766L3029L1629L0633K9810K7772K4471K1566
57215E979474J9942J8690J7040J5516J4572J3712J2623J1864J1829J2157J2646
57204F140065J3585J4966J6386J7857J9570K0951K1172K0572K0214K0194J9759
57193F345291J8976J8782J9358J9963K0322K0779K1107K0628J9521J8512J7404
57182F560643J5461J3035J1164R721P622M791K165j45k841n689p710r091j1057
57169F588069j3755j6114j7828j9602k1414k2547k3450k5442k8305l0222l0354
57158F339036k9532k8252k6097k3473k1701k0890j9741j7893j6288j4840j2063
$$ plain form
57237 5282313 5312565 5342961 5374764 5408286 5442812 5477547 5511894 5545395 5578281 5611471 5645397
57226 5645397 5679455 5713139 5746798 5780564 5813593 5845222 5875855 5905665 5933437 5957908 5979474
57215 5979474 5999416 6018106 6035146 6050662 6065234 6078946 6091569 6103433 6115262 6127419 6140065
57204 6140065 6153650 6168616 6185002 6202859 6222429 6243380 6264552 6285124 6305338 6325532 6345291
57193 6345291 6364267 6383049 6402407 6422370 6442692 6463471 6484578 6505206 6524727 6543239 6560643
57182 6560643 6576104 6589139 6600303 6610024 6617646 6622437 6624602 6624457 6621616 6615927 6608217 6599126 6588069
57169 6588069 6574314 6558200 6540372 6520770 6499356 6476809 6453359 6427917 6399612 6369390 6339036
57158 6339036 6309504 6281252 6255155 6231682 6209981 6189091 6169350 6151457 6135169 6120329 6108266
57147F108266p767l862j569M5J870L143L045K026M72k326o835j2397j8419k4915
57133F040777l1335l6525m0490m4363m7986m9404m7490m3299l8003l1329k2966
57122E607587j3792m875L178R323J2288J2455J1877J1877J2378J3962J8438K6774
57110E721470L8543N4004P4424R9595J27379J56678J88830K25562K68247L20057
57100G274789L86098M70042N72882O95695Q40522J007154J191924J391206J603441
57091A5433753J826344K054880K282585K500845K695792K851650K960568L024622
57083C5631039L045297L017754K941320K827369K682655K482905K173929J707616
57075E6509884J078565L29733m68314j241489j928601k491508k918104l215295
$$ plain form
57147 6108266 6100499 6096637 6095068 6095113 6096983 6100126 6103171 6105197 6105669 6103343 6096508 6084111 6065692 6040777
57133 6040777 6009442 5972917 5932427 5888064 5840078 5790674 5743184 5699885 5661882 5630553 5607587
57122 5607587 5593795 5588920 5592098 5601421 5613709 5626164 5638041 5649918 5662296 5676258 5694696 5721470
57110 5721470 5760013 5814017 5888441 5988036 6115415 6272093 6460923 6686485 6954732 7274789
57100 7274789 7660887 8130929 8703811 9399506 10240028 11247182 12439106 13830312 15433753
57091 15433753 17260097 19314977 21597562 24098407 26794199 29645849 32606417 35631039
57083 35631039 38676336 41694090 44635410 47462779 50145434 52628339 54802268 56509884
57075 56509884 57588449 57918182 57449868 56208379 54279778 51788270 48870166 45654871
57067D5654871l396785l475162l461504l368194l210317l004625k767373k512855
57059B0458056k253588k000794j763384j546381j351353j178527j027741q97731
57051H438557p85998o90022o07919n37798m77439m24984l79278l39359l04208
57042C891552k73133k45822k21865k00714j82026j65495j50465j36280j23023
57033B192729j11346j01525r3029q4982p6846o8775o1451n5261m9610m3493l6730
57022A409681k9877k2946j5306p189p8N072R006J2736J5912J7560J7762J7712
57010A430045J8523K0591K3623K6803K9439L1817L4860L8947M3996N0296N7378
56999A806318O1700N7610M1936J6379j5080m9024q1715j07950j23511j28054j23994
$$ plain form
57067 45654871 42258086 38782924 35321420 31953226 28742909 25738284 22970911 20458056
57059 20458056 18204468 16203674 14440290 12893909 11542556 10364029 9336288 8438557
57051 8438557 7652559 6962537 6354618 5816820 5339381 4914397 4535119 4195760 3891552
57042 3891552 3618419 3372597 3150732 2950018 2767992 2602497 2452032 2315752 2192729
57033 2192729 2081383 1979858 1886829 1801847 1725001 1656226 1594775 1539514 1489904 1446411 1409681
57022 1409681 1379804 1356858 1341552 1334363 1334285 1339357 1348363 1361099 1377011 1394571 1412333 1430045
57010 1430045 1448568 1469159 1492782 1519585 1549024 1580841 1615701 1654648 1698644 1748940 1806318
56999 1806318 1868018 1925628 1967564 1983943 1968863 1919839 1838124 1730174 1606663 1478609 1354615
56988A354615j13643r9001q2939o8117n5091m3117l2379k4006j8611j6353j7635
56977G83723k2056k7267l0690l1928l2120l1511k9425k6107k2757j9871j6996
56966D92995j3986j1104q145m757j309J725M763Q342J1886J4698J7372K0567K2744
56953E55791K0948J3903L186q346j8058k4058k5993k5376k3940k1853j8573j4709
56941D12922j1515q948n925k258J208M281P738J1912J6371K0920K5765L0625L4551
56928E37647L6366L4366K6489J2411m706j9954l0186l5084l5651l3312k9910k6806
56916D31670k3853k0373j6805j4112j2106r911p625o049n124m122l043k265j213
56903C05069Q78L285M608N015N873P320Q091P811P516P753P852P420O960O749
$$ plain form
56988 1354615 1240972 1141971 1059032 990915 935824 892707 860328 836322 817711 801358 783723
56977 783723 761667 734400 703710 671782 639662 608151 578726 552619 529862 509991 492995
56966 492995 479009 467905 459760 455003 453694 455419 460182 468524 480410 495108 512480 533047 555791
56953 555791 576739 590642 593828 585482 567424 543366 517373 491997 468057 446204 427631 412922
56941 412922 401407 392459 386534 384276 385484 389765 397503 409415 425786 446706 472471 503096 537647
56928 537647 574013 608379 634868 647279 642573 622619 592433 557349 521698 488386 458476 431670
56916 431670 407817 387444 370639 356527 344421 334510 326885 320836 315712 311590 308547 306282 305069
56903 305069 305947 309232 313840 318855 324728 332048 340139 347950 355466 363219 371071 378491 385451 392200
56889C92200O494O393P154Q731J0227J1041J0878Q749L611l894j1693j8299k3346
56876D08246k6298k6353k3811k0046j5913j1421o937l194kL612P853J2167J6814
56863C14717K2785K9935L6663M1868M5829M8768M9659M6757L8512K4212N233j4327
56851F90611k9657l8361m1019l9204l4304k7866k1319j4998q595k327L532R745
56839D46238J7263K5641L3977M2786N2950O3248P1160P5796P7474P4216O1689
56828A042438L7950O569k5729n2920p1042p8507p6907p0274o2086n3463m4403
56817E51626l5272k6417j7577q622n6P798J5356K3219L1639M0419M8525N4159
56805F84797N6061N4060M7240L2998J0386j6202l9270n4301o1669o3145n9683
$$ plain form
56889 392200 398694 405087 412241 420972 431199 442240 453118 461867 465478 461584 449891 431592 408246
56876 408246 381948 355595 331784 311738 295825 284404 277467 274273 274271 277883 285736 297903 314717
56863 314717 337502 367437 404100 445968 491797 540565 590224 636981 675493 699705 704938 690611
56851 690611 660954 622593 581574 542370 508066 480200 458881 443883 435288 432961 436493 446238
56839 446238 463501 489142 523119 565905 618855 682103 753263 829059 906533 980749 1042438
56828 1042438 1080388 1086957 1061228 1008308 937266 858759 781852 711578 649492 596029 551626
56817 551626 516354 489937 472360 463738 463682 471480 486836 510055 541694 582113 630638 684797
56805 684797 740858 794918 842158 875156 885542 869340 830070 775769 714100 650955 591272
56794E91272n2882m5459l8818l2241k5287j8912j3410p594j084M735R118J3237
56782C82675J7901K2059K4789K6744K7958K6099J8758O518p620k0659l0517l5946
56770D58759l7161l5859l3527l0376k6391k2295j8749j5723j3253j1633j0462
56759B03330q802o771n552n416n245m426l620l124k292j170q82j585j929j306
56745A51210r07j531k193j937j346j156j000n83n39j052j215o93m36q27q21NL84
56728A35363m80j413j173k59L66Q20J279J056J8n56J47J146J338J011O69n4j099
56711A38179j215J44J657K036J697J491J306J041J243J702J205k24p94J33P39
56696A50340k03j208p35K62L84L70J348K321J777L54l75m86r05j218n10O48J018
$$ plain form
56794 591272 538390 492931 454113 421872 396585 377673 364263 356669 355585 360320 369438 382675
56782 382675 400576 422635 447424 474168 502126 528225 546983 553501 545881 525222 494705 458759
56770 458759 421598 385739 352212 321836 295445 273150 254401 238678 225425 213792 203330
56759 203330 194528 187757 182205 176789 171544 167118 163498 160374 158082 156912 156030 154445 152516 151210
56745 151210 150303 148772 146579 144642 143296 142140 141140 140557 140018 138966 137751 137058 136622 135795 134974 134979 135363
56728 135363 134883 133470 132297 132038 132404 133224 134503 135559 135577 135021 135168 136314 137652 138663 139332 139278 138179
56711 138179 136964 137108 138765 140801 142498 143989 145295 146336 147579 149281 150486 150262 149468 149601 150340
56696 150340 150137 148929 148194 148456 148840 149210 150558 152879 154656 155010 154635 154149 153244 152026 151516 152164 153182
56679A53182O75L25k30j208j642q36Q6j24p95p06j97n8K30J219J757O87r53j496
56661A49916j209j175r72K10J318P77p92j573j428j451j491n84Q05J378J317J790
56645A46836K576K410J277L51j4k64j75O63J465J281Q41J408K461K607K102K243
56629A68068K778K260O81m44m78j02L64J135J696J337P55J200K260K334J122j70
56613A84796q60j281j475j196r84j509k143j771p09j80l19l94m76j152j960j859
56597A66528r36p7N59J211J370O63N0M53R69M11l84J08J345J612R57Q49J422J526
56579A78636J061R21R74M54m3O21J732J611O04O39J899K625K175J823K260K767
56563B00759L133M015N106N203M436M347N385O348O618O958P732Q285Q377Q481
$$ plain form
56679 153182 153857 154182 153952 152744 151102 150266 150352 150228 149433 148727 148530 148472 148702 149921 151678 152365 151412 149916
56661 149916 148707 147532 146560 146770 148088 148865 148073 146500 145072 143621 142130 141546 142351 143729 145046 146836
56645 146836 149412 151822 153099 153450 153436 153172 152997 153660 155125 156406 157247 158655 161116 163723 165825 168068
56629 168068 170846 173106 173787 173343 172865 172763 173127 174262 175958 177295 178050 179250 181510 183844 184966 184796
56613 184796 183936 182655 181180 179984 179000 177491 175348 173577 172868 172688 172369 171975 171499 170347 168387 166528
56597 166528 165592 165515 166074 167285 168655 169318 169368 169821 170790 171201 170817 170925 172270 173882 174839 175688 177110 178636
56579 178636 179697 180618 181592 182046 182003 182624 184356 185967 186571 187210 189109 191734 193909 195732 197992 200759
56563 200759 203892 207907 213013 218216 222652 226999 232384 238732 245350 252308 260040 268325 276702 285183
56549B85183Q472P669O276N107M050K595J554K165L649L859K334O30l14j003j612
56534C30614j690j669k545l880m242l707l817m945n861o008o093o248n737m706
56520B69466m213m308m011l216k738k548j968j365j622k229k083j800k795m444
56506B30126m753l657k975l212l235l003l663m842m792l508k763k813k144p67
56492A83999n49j696k097j020k75p85j037j32N43jo97o04k89P2J375L305L894
56475A84006K564J156R53J103R36J180J797J364j39o13P35J903J449O63Q66J119
56459B01042M89J08J011K079K005J460J456J393M96m46m27J21M17O34R61Q77M34
56442B14110O60J687K140J347L94J85K27J78O08J385J325L76P9R73J706J519J422
$$ plain form
56549 285183 293655 301324 307600 312707 316757 319352 320906 323071 326720 330579 332913 333543 333229 332226 330614
56534 330614 328924 327255 324710 320830 316588 312881 309064 304119 298258 292250 286157 279909 274172 269466
56520 269466 265253 260945 256934 253718 250980 248432 246464 245099 243477 241248 239165 237365 234570 230126
56506 230126 225373 221716 218741 215529 212294 209291 205628 200786 195994 192486 189723 186910 184766 183999
56492 183999 183450 181754 179657 178637 178362 177577 176540 176408 176951 176950 176253 175649 175360 175432 176807 180112 184006
56475 184006 186570 187726 188679 189782 190718 191898 193695 195059 194920 194307 195042 196945 198394 199057 199923 201042
56459 201042 201531 201639 202650 204729 206734 208194 209650 211043 211539 211093 210666 210787 211204 211838 212799 213676 214110
56442 214110 214770 216457 218597 219944 220338 220523 220750 220928 221536 222921 224246 224622 224701 225674 227380 228899 230321
56425B30321J934J991J135M92M73j38j751k847k457j459m84J028K738K994J685
56410B35655Q78J364J345j16j248p88k29r53j798j424o98p64r79o57o21j298j470
56393B26199n79L0l32l42N48O87p05j723j025p9j50J89K204M291M648M175M259
56376B42295M051K594J297J592K281J820J233K028L160K823J563R45P67N3p41
56361B67761q35q66j354j194J62R74n2j315r24K22M32K40Q33J402Q15J21O74J449
56343B68545R74K43R26K146J919N16l42l86m03j21J040K196K294K012K391K868
56327B86818K610K273K477K309J293R19K053K897J915O66J124K210J775K44n07
56312C11076k63J84J153K873L806K795J313J155J666J641J897L269M122K844Q99
$$ plain form
56425 230321 232255 234246 235381 235873 236346 236208 234457 231610 229153 227694 227210 228238 230976 233970 235655
56410 235655 236533 237897 239242 239126 237878 237090 236861 235908 234110 232686 231988 231224 230245 229588 228967 227669 226199
56393 226199 225620 225650 225318 224976 225524 226211 225506 223783 222758 222679 222529 222718 224922 229213 233861 238036 242295
56376 242295 246346 248940 250237 251829 254110 255930 257163 259191 262351 265174 266737 267682 268449 268502 267761
56361 267761 266926 266060 264706 263512 263674 264648 264596 263281 262357 262579 263011 263251 264084 265486 266301 266422 267096 268545
56343 268545 269519 269762 270688 272834 274753 275269 274927 274541 274138 274017 275057 277253 279547 281559 283950 286818
56327 286818 289428 291701 294178 296487 297780 298699 300752 303649 305564 306230 307354 309564 311339 311583 311076
56312 311076 310813 310997 312150 315023 318829 321624 322937 324092 325758 327399 329296 332565 336687 339531 340430
56297C40430M78J006R35R93K468M105L967K887K818L310K738J550J207J323Q47
56282C71062N36J428K428K272K035K902L486K402J349K309L838L612K528K699
56268D04886L458L197L080M881P001O823N367N437O744P104O935Q186J0169J0868
56254D94136J1165J3364J6540J7836J7542J8476K1088K3379K5105K7757L0959
56243G17347L3001L4368L6811L9468L9969L8740L8346L9010L8716L7124L5535
56232A128435L3607K9999K5646K2510J9756J4944Q399K559k263p655j3422j8082
56220A244433k2162k7134l1876l4139l4603l5533l6473l5381l2944l1456l0445
56209H92287k7824k4423k2878k2866k1892j9996j9138j8810j6907j4088j2685
$$ plain form
56297 340430 340908 341914 342849 343842 346310 350415 354382 357269 360087 363397 366135 367685 368892 370215 371062
56282 371062 371598 373026 375454 377726 379761 382663 386149 388551 389900 392209 396047 399659 402187 404886
56268 404886 408344 411541 414621 419502 426503 433326 438693 444130 450874 457978 464913 473099 483268 494136
56254 494136 505301 518665 535205 553041 570583 589059 610147 633526 658631 686388 717347
56243 717347 750348 784716 821527 860995 900964 939704 978050 1017060 1055776 1092900 1128435
56232 1128435 1162042 1192041 1217687 1240197 1259953 1274897 1283296 1285855 1283592 1275937 1262515 1244433
56220 1244433 1222271 1195137 1163261 1129122 1094519 1058986 1022513 987132 954188 922732 892287
56209 892287 864463 840040 817162 794296 772404 752408 733270 714460 697553 683465 670780
56198F70780j2122j0138p579p068p793o703m140l036l226j891P50J572J64p28
56184F08842k36R8L61J913L476K655P39Q95K401K031J90q5O64o67l180k982m30
56167F16685K90j197r75J595K674J130L45J755K864K830L944O336P142O145O469
56152F58032Q667R775R128R273J0406R934Q306R073J2358J4459J4756J6571K0327
56139H11065K2680K3584K7284L4787M2029M7112N2640N9307O4038O6389P0070
56128A320985P6098Q1032Q3915Q8163R4602R9458J01444J03941J07690J08173
56118B265501J02884R4690Q5465P3101N7528M3213L2749K3921J5335Q579K709
56107B805675o608j9832l2022m0701m8563n6312o0284n9928o0397o4727p0276
$$ plain form
56198 670780 658658 648520 640941 633873 626080 619377 615237 612201 608975 607084 607834 609406 609570 608842
56184 608842 608606 608704 609065 610978 614454 617109 617848 618743 621144 623175 623365 623280 623944 623277 620097 617115 616685
56167 616685 616975 615778 614803 616398 619072 620202 620547 622302 625166 627996 631940 638276 645418 651563 658032
56152 658032 666699 676474 685602 694875 705281 715215 723521 732594 744952 759411 774167 790738 811065
56139 811065 833745 857329 884613 919400 961429 1008541 1061181 1120488 1184526 1250915 1320985
56128 1320985 1397083 1478115 1562030 1650193 1744795 1844253 1945697 2049638 2157328 2265501
56118 2265501 2368385 2463075 2548540 2621641 2679169 2722382 2755131 2779052 2794387 2802966 2805675
56107 2805675 2799067 2779235 2747213 2706512 2657949 2601637 2541353 2481425 2421028 2356301 2286025
56096B286025p5415q2358r0491r4444r2121q7615q3224p6093o5654n6543n0619
56085A431448m3811l4466k7021k3647k0074j3800q674p214n877k246N26N83J293
56072A247020M322O177N555O592J0913J4126J4069J4715J7997J9945J8811J8637
56060A398879K0833K0845J7340J5656J7865J8533J4995J2443J3987J5182J3494
56049A580052J3535J7505K0207J9000J9004K2783K4928K2662K1580K4857K7201
56038A813314K5713K6057L1190L4898L3437L2751L6902M0402L9445L9567M4350
56027B198026M7826M6071M5058M8918N1936N0372N0387N5747N9854N8670N9050
56016B771915O5198O9779O8044O7547P3864Q0004Q0337Q1396Q8188R3741R3360
$$ plain form
56096 2286025 2210610 2128252 2037761 1943317 1851196 1763581 1680357 1604264 1538610 1482067 1431448
56085 1431448 1387637 1353171 1326150 1302503 1282429 1268629 1259955 1252741 1246864 1244618 1245144 1245727 1247020
56072 1247020 1251342 1257519 1263074 1269666 1280579 1294705 1308774 1323489 1341486 1361431 1380242 1398879
56060 1398879 1419712 1440557 1457897 1473553 1491418 1509951 1524946 1537389 1551376 1566558 1580052
56049 1580052 1593587 1611092 1631299 1650299 1669303 1692086 1717014 1739676 1761256 1786113 1813314
56038 1813314 1839027 1865084 1896274 1931172 1964609 1997360 2034262 2074664 2114109 2153676 2198026
56027 2198026 2245852 2291923 2336981 2385899 2437835 2488207 2538594 2594341 2654195 2712865 2771915
56016 2771915 2837113 2906892 2974936 3042483 3116347 3196351 3276688 3358084 3446272 3540013 3633373
56005C633373R4990J04001J12304J14215J17868J28710J37707J38846J41861J53857
55995D877732J65396J69172J74880J90219K05245K11860K20285K39133K58222
55986F712144K69049K82598L07961L33652L50136L69780M03477M39442M67309
55977I935548N00382N50481O04654O51791P07144P84117Q68462R48793J044475
55968A6595847J173040J320211J475038J662574J906664K195879K525578K936021
55960C1790852L465893M107958M854849N741772O796085Q005414R400810J1111036
55952H5274669J3263020J5893318J9018782K2676767K6786787L1111946L5471601
55945B49496890L9648931M2573690M1728596L4270016J9532237M34776j7979835
$$ plain form
56005 3633373 3728363 3832364 3944668 4058883 4176751 4305461 4443168 4582014 4723875 4877732
55995 4877732 5043128 5212300 5387180 5577399 5782644 5994504 6214789 6453922 6712144
55986 6712144 6981193 7263791 7571752 7905404 8255540 8625320 9028797 9468239 9935548
55977 9935548 10435930 10986411 11591065 12242856 12950000 13734117 14602579 15551372 16595847
55968 16595847 17768887 19089098 20564136 22226710 24133374 26329253 28854831 31790852
55960 31790852 35256745 39364703 44219552 49961324 56757409 64762823 74163633 85274669
55952 85274669 98537689 114431007 133449789 156126556 182913343 214025289 249496890
55945 249496890 289145821 331719511 373448107 407718123 427250360 427685136 409705301
55938D09705301l1600756l9073521m1301894l9961255l6577615l2323103k7970170
55931A60896987k3874838k0143387j6845932j4041333j1702554r750356q140982
55924E6397605o850249n811264m942878m214154l622490l135936k711453k344197
55916B2764984k047401j804609j586519j393773j240407j113972r91617q78072
55908A1708614p90496p21630o52497n86510n37974n00602m58469m15549l85086
55899F659801l61652l31515k99342k78132k63298k42061k18329k03955j94923
55890D266594j79574j61367j51036j44865j32333j17044j09103j04728r3697p9453
55880B993394p1980o8129n8306m5813m0584m0163l5219k7848k6435k8153k4228
$$ plain form
55938 409705301 378104545 339031024 297729130 257767875 221190260 188867157 160896987
55931 160896987 137022149 116878762 100032830 85991497 74288943 64538587 56397605
55924 56397605 49547356 43736092 38793214 34579060 30956570 27820634 25109181 22764984
55916 22764984 20717583 18912974 17326455 15932682 14692275 13578303 12586686 11708614
55908 11708614 10918118 10196488 9543991 8957481 8419507 7918905 7460436 7044887 6659801
55899 6659801 6298149 5966634 5667292 5389160 5125862 4883801 4665472 4461517 4266594
55890 4266594 4087020 3925653 3774617 3629752 3497419 3380375 3271272 3166544 3072847 2993394
55880 2993394 2921414 2853285 2794979 2749166 2708582 2668419 2633200 2605352 2578917 2550764 2526536
55869B526536j7285j6277j9230j7815j4486j8467k8708l6710m2524n2443o4085
55858B198506o9006o7536o7008o8001o5705o1893o2330o4964o3400n9183n8451
55847A491029n9548n6329n0500m8395m8573m4743l8179l5143l4795l1466k6292
55836A017066k4803k5542k2734j7866j7069j9206j8126j4605j4459j6621j4719
55825H11316r259o950q695r081p225p634j0680j2050j1379j2162j3711j2194q835
55812F81461q193r407p926m588m005n296l584N77K406K343N043R986J2267J1942
55798F83026J3345J5822J4378R147N209L164j137p667j1940j3580j6466k0226
55786F73075k0391j7345j6382j8234j8015j4438j1722j1310r786o263m066l777
$$ plain form
55869 2526536 2509251 2492974 2473744 2455929 2441443 2422976 2394268 2357558 2315034 2262591 2198506
55858 2198506 2129500 2061964 1994956 1926955 1861250 1799357 1737027 1672063 1608663 1549480 1491029
55847 1491029 1431481 1375152 1324652 1276257 1227684 1182941 1144762 1109619 1074824 1043358 1017066
55836 1017066 992263 966721 943987 926121 909052 889846 871720 857115 842656 826035 811316
55825 811316 802057 795107 786412 777331 770106 762472 751792 739742 728363 716201 702490 690296 681461
55812 681461 673268 663861 655935 651347 647342 642046 638462 639039 641445 643788 648831 658817 671084 683026
55798 683026 696371 712193 726571 735718 740927 744091 742954 735287 723347 709767 693301 673075
55786 673075 652684 635339 618957 600723 582708 568270 556548 545238 535452 529189 525123 521346
55774E21346k063J285K365M86n72K44k16k440k807m72R53oo55lm74k529l629l646
55756E07167n413q882j0537r633r239j0315j0460r314r343j0523j0023p947p524
55743C88014q860q485n936m803o121o719n227m101m355l924k456k279l357k736
55729C18655j92R11m75j573j320k065m456n866n224m528m439l258j222q09j864
55714B82275j472M51P42j011j500J99J071j2l71J019J612N36N26K638L967K597
55698B93267K72j588l965o710p546o284n665o500o417m746l940m669m266j760
55684B29483J85J74L01J692K426J716J721L190L696K147Q41J061Q61q46k136j962
55668B44550k131l442l877k505j292j226o55R18J491O97J006L031M032L055L047
$$ plain form
55774 521346 519283 520568 522933 523419 522847 523091 522875 520435 517628 517156 518109 518103 517448 517445 516971 514442 510813 507167
55756 507167 501754 492872 482335 472702 463463 453148 442688 433374 424031 413508 403485 395538 388014
55743 388014 379154 370669 364733 359930 353809 347090 341863 337762 333407 329483 327027 324748 321391 318655
55729 318655 318463 319374 318899 317326 316006 313941 309485 303619 298395 293867 289428 286170 284948 284139 282275
55714 282275 280803 281254 281996 280985 279485 279684 280755 280743 280372 281391 283003 283539 284065 286703 290670 293267
55698 293267 293539 291951 287986 281276 273730 267446 261781 255281 248864 244118 240178 235509 231243 229483
55684 229483 229668 229842 230143 231835 234261 235977 237698 240888 244584 246731 247572 248633 249494 248648 246512 244550
55668 244550 242419 238977 235100 232595 231303 230077 229422 230340 231831 232528 233534 236565 240597 243652 246699
55653B46699N563P783P356O104O179O396N164L455K175Ql555o358p090p505q887
55638B63487r648q663p602p667p348n664m322m318l824j844n89j704l271l159
55624A93864k295k123j791m60M00l77j418j348j053j348j188j94m9j347k008r02
55608A76363j1q27j718j117k94n27n92M82J120J24r23o79n52j672k261q39P25
55591A66802K90r19o31P02J291J149J172R79O2p39q91j369k369k135k8J749J557
55574A66672R42J658K629K327J630J835K157J645J390K331L094K441J739K496
55560A94986L651L635L022K785K122M24p78l74N2j108k614k719k280k885l917
55545A94002m043l832m291m605l739k591k243j897p50K1o52j654j821k010k824
$$ plain form
55653 246699 252262 260045 267401 273505 279684 286080 291244 294699 296874 296882 293327 286969 279879 272374 263487
55638 263487 253839 245176 237574 229907 222559 216895 212573 208255 204431 202587 201998 200294 197023 193864
55624 193864 191569 189446 187655 187195 187595 187218 185800 184452 183399 182051 180863 180669 180620 179273 177265 176363
55608 176363 176352 175525 173807 172690 172396 171869 171277 171759 172879 173003 172080 171401 170849 169177 166916 166077 166802
55591 166802 167092 166173 165542 166244 167535 168684 169856 170835 170897 170158 169267 167898 165529 163394 163366 165115 166672
55574 166672 167614 169272 171901 174228 175858 177693 179850 181495 182885 185216 188310 190751 192490 194986
55560 194986 198637 202272 205294 208079 210201 210625 209847 209473 209525 208417 205803 203084 200804 197919 194002
55545 194002 189959 186127 181836 177231 173492 170901 168658 166761 166011 166032 165380 163726 161905 159895 157071
55530A57071k782j129j0j082k400j601J07K93n59n77j85q60j875j707j246k220
55514A39238l705l494j930j157j472j445q49o04m97K89J218J391J603K893M119
55499A35598L578J988J265J318P31l13n30j79n51j430j549r69o92n93J7M98j87
55482A38000j356j594j034o86m42J87L85o98j986j961j123q17p34J22J141J068
55466A28472L20N2l3p28j309p63P1m0l57L25J034J89j328j482m56K5r6M29J362
55447A25687J322M35J2P4k80o68j20O43K39o54k85J043J440O45J24K78K00r2K91
55428A30334J009Q58P7qO03P28K92K38N39M28K08O49J144P22K13R93K270K190
55410A43487J102R49J847K092J403J280K119K634K292J884J491L48j231k055k251
$$ plain form
55530 157071 154289 153160 153150 152068 149668 148067 148174 148467 147908 147331 147146 146286 144411 142704 141458 139238
55514 139238 135533 132039 130109 128952 127480 126035 125186 124582 124085 124374 125592 126983 128586 131479 135598
55499 135598 139176 141164 142429 143747 144478 144165 143635 143456 142905 141475 139926 138957 138265 137672 137689 138187 138000
55482 138000 136644 135050 134016 133330 132888 133075 133460 132762 130776 128815 127692 126875 126141 126263 127404 128472
55466 128472 128792 128844 128811 128083 126774 126011 126082 126042 125685 126010 127044 127233 125905 124423 123967 123992 123896 124325 125687
55447 125687 127009 127444 127456 127530 127250 126582 126462 127105 127344 126690 126405 127448 128888 129533 129657 129935 130135 130043 130334
55428 130334 131343 132201 132278 132270 132873 133601 133893 134131 134670 135098 135306 135955 137099 137821 138034 139027 141297 143487
55410 143487 144589 145538 147385 149477 150880 152160 154279 156913 159205 161089 162580 162928 161697 159642 157391
55395A57391k875l523k776j021k67j011j752j803k050k670k639k016k212l365
55381A27411l687k180l4J302J655J259J96q43q67m3N76Q53J496K323K445K025
55365A33887K024K224J503M0p83o75o25q03l76M77M96m55j115r77p90p75l50K84
55347A33211K10l89m72j80n36j123m53J174J626L17q68o34n6l31r09q66m72l05
55329A28944k97m06r23j525j331l71K74J52o9nPJ5N53J318J218M7j188j719j574
55310A23120q46K90J014P54L00O03J005L98n09k13Q99J210P53R20J542J026n61
55293A31705j284n63P4j46k44J11j28j018j087m1M99j40m99K54Q12J72n95l99
55275A27483N7r7k22M52J359J655J459J050K51n70m49M75P88N2m52K6M98K01m4
$$ plain form
55395 157391 154516 150993 148217 147196 146929 145918 144166 142363 140313 137643 135004 132988 130776 127411
55381 127411 123724 121544 121510 122812 124467 125726 125922 125079 124212 124169 124745 125598 127094 129417 131862 133887
55365 133887 135911 138135 139638 139678 138895 138220 137595 136792 136416 136893 137389 136934 135819 134842 134052 133277 132927 133211
55347 133211 133421 133032 132560 132380 131844 130721 130268 131442 133068 133385 132517 131883 131827 131496 130587 129721 129249 128944
55329 128944 128647 128241 127318 125793 124462 124091 124365 124517 124448 124443 124450 124465 125018 126336 127554 127601 126413 124694 123120
55310 123120 122274 122564 123578 124332 124632 125235 126240 126638 126129 125916 126815 128025 128778 129698 131240 132266 131705
55293 131705 130421 129858 129932 129786 129542 129653 129525 128507 127420 127379 127878 127738 127239 127493 128305 128477 127882 127483
55275 127483 127540 127443 127221 127673 129032 130687 132146 133196 133447 132877 132428 132903 133691 133743 133291 133317 133815 134016 133972
55256A33972N00J113J013O16L76j45j036j351o62J3j78o73p27o11p01o48k29J30
55238A30772L52R35J682J553L41q70j399j597j497n17R26J415P39L28P69Q31j85
55221A34578j096r44n72q85j194o23K75N93M61L51J17k85l50o7r4l34J92J367
55203A31490J611L20j028j093l69K11O47R16L99o79r69j79K52l30o07K00O97j95
55185A31294j126n55N87M49p94j503j101k33O25J197R05k06r16m55K23K9n21m43
55167A27456k3j0j24K11N53K88j10N9M29L68K62O99J228J202J002J216J409R21
55149A37036R5l89o09p81m39N95J310P78l72q87n65l9L51N52L85mJ9N14O77K02
55129A38429j67q6k95j026j225l78L24j30r22q30j00M66J006J760J980J085n7
$$ plain form
55256 133972 134472 135585 136598 137214 137590 137445 136409 135058 134396 134409 134231 133558 132831 132220 131519 130871 130642 130772
55238 130772 131124 132059 133741 135294 135635 134765 133366 131769 130272 129755 130681 132096 132835 133163 133932 134763 134578
55221 134578 133482 132538 131966 131081 129887 129264 129539 130132 130593 130944 131061 130776 130426 130359 130265 129931 130123 131490
55203 131490 133101 133421 132393 131300 130931 131142 131789 132705 133104 132425 131456 131277 131529 131199 130592 130792 131489 131294
55185 131294 130168 129613 130200 130649 129855 128352 127251 127018 127643 128840 129745 129539 128623 128168 128391 128420 127899 127456
55167 127456 127433 127423 127299 127510 128063 128351 128241 128300 128729 129097 129359 130058 131286 132488 133490 134706 136115 137036
55149 137036 137131 136742 136133 135352 134913 135508 136818 137596 137224 136337 135772 135733 136084 136636 137021 137017 137036 137550 138227 138429
55129 138429 138262 138176 137881 136855 135630 135252 135576 135446 134524 133694 133594 134060 135066 136826 138806 139891 139834
55112A39834m00k62l15j91O03J347J150M34R5R6N6K10O20N94K1J8J046J702Q95
55093A47553k76l44K03K01O7P39J493R28o28j664j781j579j102k18J84o69j753
55076A41354j567n82l91j016j082l41P5j85j87M70J024R16N01K28K14N00Q68P05
55058A41504n8m55Q8O39K19m92l55K54J98m17o14l08j13rK65J41p85j414n55Q96
55038A38629J099O8n97m08l38p11p10q5M69P58J294K025K240J825J204L27r06
55021A46183j566p29P19J028J83l06o6k59j188j539o02N79Q88O02M85O41Q86J274
55003A47213J693J777J490J122P01K18J57P96J302P03m68q68l95j31l22%J127
54986A56115J913J338k26j677k255j777p45j97o39j256j020k37J18J27O40J579
$$ plain form
55112 139834 139434 139172 138857 138666 139269 140616 141766 142200 142295 142391 142447 142657 143277 143871 143892 143910 144956 146658 147553
55093 147553 147277 146933 147136 147337 147404 148143 149636 150564 149936 148272 146491 144912 143810 143592 143776 143107 141354
55076 141354 139787 139205 138814 137798 136716 136375 136450 136265 136078 136548 137572 138488 138989 139217 139431 139931 140799 141504
55058 141504 141446 140991 141079 141718 141937 141445 141090 141344 141542 141125 140511 140203 140090 140081 140346 140487 139702 138288 137733 138629
55038 138629 139728 139796 139199 138791 138453 137742 137032 136947 137416 138174 139468 141493 143733 145558 146762 147089 146183
55021 146183 144617 143888 144607 145635 145818 145512 145446 145187 143999 142460 141858 142437 143325 143927 144412 145053 145939 147213
55003 147213 148906 150683 152173 153295 153996 154214 154371 155167 156469 157172 156704 155836 155441 155310 154988 154988 156115
54986 156115 158028 159366 159140 157463 155208 153431 152686 152489 151850 150594 149574 149337 149455 149582 150222 151801
54970A51801K019J813J605J310K15j260j563k48J195J332M63k22j98K01M16J19
54954A58998m71o48p2O73R27R71J327J612J152K81j26p3j12p1N65J286J091K24
54936A67534j18K89N10K27K31R36J773K323K818L424L952M424M932N126M864N016
54920B08261O385Q171Q906Q577Q286Q118P120N306L858L037J691q27l688n935
54906B67266p468q343q390p882p501p369p052o496n867m794l114j940k418l589
54892A85043l395j695l90m17o69k40K77L91P15J658K606L204L964N004N610N683
54876B07349O181P445Q506Q660Q420Q200P429N697L567J567n68l015n307p080
54862B57051q358q859q235p173o831p012o391m912m160m822n513m917l529k449
$$ plain form
54970 151801 153820 155633 157238 158548 158763 157503 155940 155692 156887 158219 158682 158460 158262 158463 158879 158998
54954 158998 158527 157879 157807 158480 159407 160378 161705 163317 164469 164750 164624 164551 164439 164368 164933 166219 167310 167534
54936 167534 167416 167705 168215 168442 168673 169609 171382 173705 176523 179947 183899 188323 193255 198381 203245 208261
54920 208261 214646 222817 231723 240300 248586 256704 263824 269130 272988 276025 277716 276889 273201 267266
54906 267266 259798 251455 243065 235183 227682 220313 213261 206765 200898 196104 192990 191050 188632 185043
54892 185043 181648 179953 179563 179146 178477 178237 178514 178905 179620 181278 183884 187088 191052 196056 201666 207349
54876 207349 213530 220975 229481 238141 246561 254761 262190 267887 271454 273021 272453 269438 264131 257051
54862 257051 248693 239834 231599 224426 217595 210583 204192 199280 195120 190298 184785 179868 176339 173890
54848A73890j834j431j262j103m93J24l36j656k183j335n86j067j865j720r25
54833A56218l51K4M43M57j53o43m74k04k63j58L23L34n08j181q66k19L1M62J645
54814A54917K739K741K076J595J040j22j284j600j400j371j110O6J517J938J206
54799A62948L49J7R1L74P18Q03O14O48J037J104N00m5J37N99P09O94Q84Q98N34
54780A73613N16J282J902J431M81J88M83O81J047K300M161N690O706P605Q228
54765B16314Q173P841P943Q288Q204P819P683P459O202L857J312r63l279n731
54751B81122p756q837q967q415p526o639n772m661l525l130l634l996l266j844
54737B03154p17j47J22L7l87m73L20J430K025K341L155M325M940M718M278M178
$$ plain form
54848 173890 172056 170625 169363 168260 167767 167891 167555 165899 163716 162381 161795 160728 158863 157143 156218
54833 156218 155867 155891 156334 156791 156638 155995 155521 155317 155054 154896 155219 155553 155045 153864 152998 152779 152810 153272 154917
54814 154917 157656 160397 162473 164068 165108 164986 163702 162102 160702 159331 158221 158287 159804 161742 162948
54799 162948 163297 163314 163405 163779 164497 165300 165914 166562 167599 168703 169203 169158 169295 169894 170603 171297 172181 173079 173613
54780 173613 174129 175411 177313 178744 179225 179413 179896 180577 181624 183924 188085 193775 200481 208086 216314
54765 216314 224487 232328 240271 248559 256763 264582 272265 279724 285926 289783 291095 290132 286853 281122
54751 281122 273366 264529 255562 247147 239621 232982 227210 222549 219024 215894 212260 208264 204998 203154
54737 203154 202437 202290 202412 202449 202062 201589 201909 203339 205364 207705 210860 215185 220125 224843 229121 233299
54721B33299M526N341O478P320P308O594N626M384K681P65j067l023n252p149
54707B67831q047q165q159q106p720p106o516n683m357l101k685k872k714j840
54693A90760p90j85k54r36j854k414k398k180j964j386l59L95L35o3k10m65j324
54676A74708k180j986q25J65K37l75j053j254o83L43R40O43j1l37l33k69j41r3
54658A67496n44j213j038J76J046O11p1L58J274J075k46j227j234r06n90Q9J085
54641A66141J700J668J342Q40Q5m71k58L42M68J30J0J05j77p65r69p53p17q39
54623A67882n02J78L58k9k1P99J626J665J090M27j24l93j47M09O57M44L07O18
54605A75244J076J192P83L2n50l77N14J277J333J232J675K173J710L39q60j304
$$ plain form
54721 233299 237825 243166 249644 256964 264272 270866 276492 280876 283557 284322 283255 280232 274980 267831
54707 267831 259784 251619 243460 235354 227634 220528 214012 208329 203972 200871 198186 195314 192600 190760
54693 190760 189970 189785 189531 188595 186741 184327 181929 179749 177785 176399 176040 176435 176770 176707 176497 176032 174708
54676 174708 172528 170542 169717 169882 170119 169744 168691 167437 166754 167097 168037 168680 168669 168332 167999 167730 167589 167496
54658 167496 166952 165739 164701 164877 165923 166534 166463 166821 168095 169170 168924 167697 166463 165557 164967 165056 166141
54641 166141 167841 169509 170851 171691 171776 171305 171047 171389 171857 171987 171997 172102 171925 171160 170191 169438 168721 167882
54623 167882 167380 167558 167916 167887 167866 168665 170291 171956 173046 173473 173349 172956 172809 173218 173875 174319 174626 175244
54605 175244 176320 177512 178295 178327 177777 177400 177914 179191 180524 181756 183431 185604 187314 187653 186793 185489
54589A85489j288j076o68l76n53q19n16J44M02K37K62M50K10l26l74O3J55j77
54571A81239JR34J533R84l3m06j0N45Q45P69K38o66j649k430k697k000l71J141
54553A77967J433P98M73P79Q46K80j32K32Q43R59O50L45J01j08PO53J565K306
54535A89997K605K317J523P57N44P32Q49R76J464J979J819J175R26J143R17m6
54519B09677q61r39q29j009q95J32J491K099J714R39K66k62p60j321j895k123
54503B05424j647o72J95O72Q96Q04K57k70pQ88J314P29j78n80m33l8M61P53M27
54484B08995k12k92K92N80J35j89L28J039J049O51O98J147J340J182J078J022
54468B18843P38M68P05J252J419J068P31O77O99P58J141J694J685P48m38q98n46
$$ plain form
54589 185489 184201 183125 182457 182081 181528 180709 180193 180337 180739 180976 181238 181688 181898 181572 181198 181261 181416 181239
54571 181239 181240 182174 183707 184691 184658 184252 184242 184787 185632 186401 186639 185973 184324 181894 179197 177197 176826 177967
54553 177967 179400 180198 180671 181450 182296 182576 182444 182676 183519 184478 185128 185473 185574 185466 185473 186126 187691 189997
54535 189997 192602 194919 196442 197199 197743 198475 199324 200300 201764 203743 205562 206737 207663 208806 209723 209677
54519 209677 208816 207877 207048 206039 205144 205276 206767 208866 210580 211519 211785 211523 210763 209442 207547 205424
54503 205424 203777 203105 203300 203972 204868 205672 205929 205659 205652 206540 207854 208583 208405 207825 207392 207354 207815 208568 208995
54484 208995 208783 208491 208783 209363 209498 209309 209637 210676 211725 212376 213074 214221 215561 216743 217821 218843
54468 218843 219581 220049 220754 222006 223425 224493 225224 225901 226600 227358 228499 230193 231878 232626 232188 231290 230744
54451B30744k42o68j470j692r14K40Q62O93J46m15r35j330j298p11J12O06M03
54434B24131l91j212j401q70k59j73m86o53n61n48p30q48p01k92M06J268J740
54417B18420J267Q9r29j261j078p18l67k33m42o90n40n8K90L27K09j20p62j259
54399B12145q95K73J437K150K649L016K787J774N42k44m41j60M14Q13N04k94o81
54382B25789k44M35O80N59M50L99K83J53N4j17l20l41k27k86m82m08J7L63M15
54363B27172M58N73L26n07j359j504q46J38Q57Q43L7r25j200p24k40k37m59n91
54345B21812p25q99q90p91j101j793j997j204j63L3o69j446j789j799j602j121
54329B03856m86p3lJ02O57J533K049J650N80k75l45L4J66j13m28n39n64o89r89
$$ plain form
54451 230744 230502 229834 228364 226672 225758 225998 226860 227553 227699 227284 226349 225019 223721 223010 223122 223728 224131
54434 224131 223740 222528 221127 220257 219998 219825 219339 218686 218125 217577 216847 215999 215298 215006 215412 216680 218420
54417 218420 219687 219776 218847 217586 216508 215790 215423 215190 214748 214058 213518 213460 213750 214077 214286 214166 213404 212145
54399 212145 211250 211523 212960 215110 217759 220775 223562 225336 225878 225634 225193 225033 225447 226260 226764 226470 225789
54382 225789 225545 225980 226660 227219 227669 228068 228351 228504 228558 228441 228121 227780 227553 227267 226785 226377 226394 226757 227172
54363 227172 227630 228203 228529 228022 226663 225159 224313 224451 225308 226151 226188 225263 224063 223339 223099 222862 222403 221812
54345 221812 221087 220188 219298 218507 217406 215613 213616 212412 212249 212282 211613 210167 208378 206579 204977 203856
54329 203856 203370 203297 203294 203396 204053 205586 207635 209285 209865 209590 209245 209279 209445 209332 208904 208365 207801 207112 206123
54310B06123j400j579j058O5R71J118R14Q24M95m36j225r42j16j07j021j610j261
54293A99755p10n19k39M61J025R86O79M39R2l45l69O3J86m72j368j819j734j202
54275A94909k28P21Q58K66o1J94J32p02j308p02N56J307J395J370J285Q08L4o69
54257B00165j188j410r48J54J034J028N77N07Q47J071J024R05P47N04K97J23k10
54240B05227n21k95L14L43n73j496j565j188j094j016m03L05K73l15n65l04j58
54223A96969l41l93o3K84K32k09p28r07n19P2J41m75j066j038o48l76j77J46L91
54204A91295L61K58K08p4o27r14o35k30PM54J191J382N23n43q01n53o39q96o27
54185A89140o5p5n82o39O6P99R51O93M29L75O29J052J102M26n31j068j134j182
$$ plain form
54310 206123 204723 203144 202086 202151 203122 204240 205154 205978 206473 206037 204812 203870 203754 203647 202626 201016 199755
54293 199755 199045 198526 198287 198748 199773 200759 201438 201877 201969 201624 201255 201318 201504 201032 199664 197845 196111 194909
54275 194909 194681 195402 196260 196526 196465 196659 196791 196089 194781 194079 194635 195942 197337 198707 199992 200800 200834 200165
54257 200165 198977 197567 196619 196773 197807 198835 199412 199919 200766 201837 202861 203766 204513 205017 205314 205437 205227
54240 205227 204706 204411 204725 205068 204495 202999 201434 200246 199152 198136 197733 198038 198311 197996 197431 197127 196969
54223 196969 196628 196235 196172 196456 196688 196479 195751 194844 194325 194397 194538 194063 192997 191959 191311 190935 190758 190904 191295
54204 191295 191656 191914 192122 192048 191421 190507 189872 189642 189649 190103 191294 192676 193199 192656 191855 191302 190663 189767 189140
54185 189140 189075 189000 188418 187779 187845 188644 189595 190288 190717 191092 191721 192773 193875 194301 193770 192702 191568 190386
54167A90386j357j453j351r67r9J101J969K199K278K499K209R17n92j235j167
54152A95337j221j365r43j34J82j27l32j74k01o65j050r07l59L23R50J233J072
54135A91619Q62Q90P05j48j144j397r84o33l60L97J431J809J349R29J075J278
54119A97678J021N26J78Qm1Mj11n11o12K17J386J522M29n04k44N87Q53N35L64
54100B03285N55O63L71k26r50j602j783j186q5P43P83L55K79Q72J461J183J41
54083B04859o90p56n37o19q49p98m44J11R57J857K083J401O86P04R39N87L2K14
54065B09737R59J237Q61O38Q43Q03J81m46o28p13j037j217p31L05J237J500J039
54048B14568L74J95N97J005J069J179J588J798J505J449K267L187L095K389K429
$$ plain form
54167 190386 189029 187576 186225 185258 185159 186260 188229 190428 192706 195205 197414 198331 197739 196504 195337
54152 195337 194116 192751 191808 191674 191856 191729 191397 191223 191022 190357 189307 188400 188041 188364 189314 190547 191619
54135 191619 192481 193371 194076 193928 192784 191387 190403 189770 189410 189807 191238 193047 194396 195325 196400 197678
54119 197678 198699 199225 199403 199411 199370 199374 199263 198752 198140 198357 199743 201265 201694 201190 200946 201533 202386 202921 203285
54100 203285 203840 204503 204874 204648 203698 202096 200313 199127 199042 199785 200568 200923 201202 202074 203535 204718 204859
54083 204859 204169 203413 202876 202257 201408 200610 200166 200277 201234 203091 205174 206575 207261 207965 208904 209491 209523 209737
54065 209737 210696 211933 212794 213432 214275 215078 215259 214813 214185 213472 212435 211218 210487 210792 212029 213529 214568
54048 214568 214942 215137 215734 216739 217808 218987 220575 222373 223878 225327 227594 230781 233876 236265 238694
54033B38694L336L898L597L292L677M409N028N565N904N717N366N782P093Q340
54019C09698Q916R211R506R321Q393P324O709O498O594P198P989P848N998K828
54005D14031q58m647q150j0621j1596j1418j0704r761q792q058p483o724n886
53992C09333n491n504n196m319l620l693m024l745k770j720j197j436k235k878
53978B61505k680j831j212j182j254j121j150j485j603j198q28j010j356j204
53964B42391o07l6M12R50J472J547R81J26k62M24J872K757K094O42J75J215K384
53947B58537K360J502J039J390K009K411K604K826L258L849M199L951L474L600
53933B97009M528N502N828N677N608N750N757N187L839K161J181J446K020J440
$$ plain form
54033 238694 242030 245928 249525 252817 256494 260903 265931 271496 277400 283117 288483 294265 301358 309698
54019 309698 318614 327825 337331 346652 355045 362369 369078 375576 382170 389368 397357 405205 411203 414031
54005 414031 413173 408526 400376 389755 378159 366741 356037 346276 337484 329426 321943 315219 309333
53992 309333 303842 298338 293142 288823 285203 281510 277486 273741 270971 269251 268054 266618 264383 261505
53978 261505 258825 256994 255782 254600 253346 252225 251075 249590 247987 246789 245961 244951 243595 242391
53964 242391 241784 241748 242160 243110 244582 246129 247110 247236 246974 247398 249270 252027 254121 254763 254938 256153 258537
53947 258537 260897 262399 263438 264828 266837 269248 271852 274678 277936 281785 285984 289935 293409 297009
53933 297009 301537 307039 312867 318544 324152 329902 335659 340846 344685 346846 348027 349473 351493 352933
53919C52933l12j741j909j476j251q44M63K344L829M530M711M613M333M035L765
53904C78023L342K821K619K887L203L324L570M119M413L892K756J558M26p31j675
53889D14547k058j958j734j590j570j772k303l121m055m733m661l853l250l763
53875C74126m944n425m728l689k988k294j267l19J86O21J346J976K148K191K459
53860C59399K603K269J838J814J926J546O10m23j195j569j544j447j750k347k495
53845C59235j778n46P72K104L238L718L627L564L369J893j358n188q107r822j0732
53830C43989j0804j0007r038q601q402p774o720n542m102k401j328j653k745l275
53816B61597k868k138j426n91J57L05p2l30k10j0J61O55J696K948L809L812K965
$$ plain form
53919 352933 352621 350880 348971 347495 346244 345400 345863 348207 352036 356566 361277 365890 370223 374258 378023
53904 378023 381365 384186 386805 389692 392895 396219 399789 403908 408321 412213 414969 416527 416953 416222 414547
53889 414547 412489 410531 408797 407207 405637 403865 401562 398441 394386 389653 384992 381139 377889 374126
53875 374126 369182 363757 359029 355340 352352 350058 348791 348472 348658 349279 350625 352601 354749 356940 359399
53860 359399 362002 364271 366109 367923 369849 371395 372005 371582 370387 368818 367274 365827 364077 361730 359235
53845 359235 357457 356911 357683 359787 363025 366743 370370 373934 377303 379196 377838 372650 364543 354721 343989
53830 343989 333185 323178 314140 305539 297137 289363 282643 277101 272999 270598 269270 267617 264872 261597
53816 261597 258729 256591 255165 254574 254731 255036 254964 254634 254424 254414 254575 255230 256926 259874 263683 267495 270460
53799B70460J942J606K027K382K152J866K215L042L794M385M902N019M464L705
53785C13961L410L536L570L319K843K024R07R0rQ2m20j425k159k223j780j099
53769C24627m98m64j088j699j703j429j575k180k823l425m105m566m408l778l106
53754B87780k432j665j097j052j311j522j750k075k099j586j129j385k009k108
53740B64560j467n97L8K33j51r01j410j490j647k022j841o87M88P02M80Q44J513
53723B56645J475Q00M44N55M11r0l05r8pj25kL31L51P9J34O94J340J802J970J511
53703B67915M89O5J172K788K954J490K52N22J644K495K943L292L528L638L735
53688B98922L526K539J178M77O25P33L54R4L51N50J93l34m94l60j22L18Q90J148
$$ plain form
53799 270460 272402 274008 276035 278417 280569 282435 284650 287692 291486 295871 300773 305792 310256 313961
53785 313961 317371 320907 324477 327796 330639 332663 333570 333660 333651 333733 333313 331888 329729 327506 325726 324627
53769 324627 324129 323665 322577 320878 319175 317746 316171 313991 311168 307743 303638 299072 294664 290886 287780
53754 287780 285348 283683 282586 281534 280223 278701 276951 274876 272777 271191 270062 268677 266668 264560
53740 264560 263093 262496 262534 262767 262616 261715 260305 258815 257168 255146 253305 252618 253106 253808 254288 255132 256645
53723 256645 258120 258920 259364 259919 260330 260240 259935 259837 259830 259705 259703 260034 260385 260464 260598 261292 262632 264434 266404 267915
53703 267915 268404 268469 269641 272429 275383 276873 277125 277647 279291 281786 284729 288021 291549 295187 298922
53688 298922 302448 304987 306165 306642 307267 308000 308354 308448 308799 309349 309542 309208 308714 308354 308232 308550 309440 310588
53670C10588R27N23O7o02j257j332q64m72k92J06N94L79o48j510j556j205r80
53653C02466p82o13q66j397j335m50L09L04J43M21N80j2p59p28j82j38q33j537
53635B94591j622j057j49N82O13N3l18o5L25L73M84J251K399L127L062K365J306
53618C07320L85L59J484K990L911M083L821L165K157J403J544K293K756K589K295
53603C42555K442L077L808M097L633K787K402K800L269L007K155J391R23M71K9
53588C78846j03L3N2j14o3L91Q52P72N8q52j311r41p0M58L1j039j837j768j056
53569C72339m07l06o32q46o02r9J75k9n37r75r57k69Q15J580J640J492J831K477
53551C76690K605K006J439J592K335L073L310K808J846J404K300L959M837M359
$$ plain form
53670 310588 311515 312038 312105 311503 310246 308914 308050 307578 307286 307392 307986 308365 307717 306207 304651 303446 302466
53653 302466 301684 301071 300205 298808 297473 297023 297332 297636 297779 298200 298780 298768 298009 297281 297099 296961 296128 294591
53635 294591 292969 291912 291763 292345 292958 293011 292693 292628 292953 293326 293810 295061 297460 300587 303649 306014 307320
53618 307320 307705 308064 309548 312538 316449 320532 324353 327518 329675 331078 332622 334915 337671 340260 342555
53603 342555 344997 348074 351882 355979 359612 362399 364801 367601 370870 373877 376032 377423 378346 378817 378846
53588 378846 378743 378776 378828 378714 378651 379042 379894 380666 380724 379872 378561 377620 377550 378008 378039 377000 375163 373395 372339
53569 372339 371932 371626 370994 370148 369546 369447 369622 369593 369056 368081 367124 366855 367670 369250 370890 372382 374213 376690
53551 376690 379295 381301 382740 384332 386667 389740 393050 395858 397704 399108 401408 405367 410204 414563
53537D14563L623L796M624N171N240N323N586N755N702N582N504N504N648N889
53523D87510O125O646Q000J0050J1720J2232J2088J2307J3095J3996J4968J6394
53511F25131J8152J9430J9719J9487J9587K0340K1342K2146K2847K3895K5247
53500H57323K6044K5643K4733K4724K5877K6813K6254K4550K2967K2135K1887
53489A128950K2077K2671K3231K3166K2544K1992K1767K1456K0726J9903J9549
53478A368032J9776K0105J9874J8765J7056J5368J4070J3002J1759J0183Q477
53467A536467O929N584M079J939p70l268m896o065p755j0119j2237j3477j4345
53454A482066j5660j7439j9144k0535k1663k2342k2319k1861k1665k2102k2882
$$ plain form
53537 414563 418186 421982 426606 431777 437017 442340 447926 453681 459383 464965 470469 475973 481621 487510
53523 487510 493635 500281 508281 518331 530051 542283 554371 566678 579773 593769 608737 625131
53511 625131 643283 662713 682432 701919 721506 741846 763188 785334 808181 832076 857323
53500 857323 883367 909010 933743 958467 984344 1011157 1037411 1061961 1084928 1107063 1128950
53489 1128950 1151027 1173698 1196929 1220095 1242639 1264631 1286398 1307854 1328580 1348483 1368032
53478 1368032 1387808 1407913 1427787 1446552 1463608 1478976 1493046 1506048 1517807 1527990 1536467
53467 1536467 1543396 1548980 1553059 1554998 1554228 1550960 1546064 1539999 1532244 1522125 1509888 1496411 1482066
53454 1482066 1466406 1448967 1429823 1409288 1387625 1365283 1342964 1321103 1299438 1277336 1254454
53443A254454k3494k3707k3657k3550k3302k2503k0921j8975j7402j6367j5303
53432A025273j3726j1805r998q451p028n604m107k538j056K54J709L792O436Q952
53418I82103J0815J2157J3443J5078J7287J9819K1780K2490K2648K3795K6292
53407A187707K8734K9823L0060L0863L2699L4968L7247L9695M2301M4485M5679
53396A584261M6008M6340M7699N0310N3135N4819N5306N5887N7383N8915N9191
53385B169254N8260N7309N7026N6997N6581N5566N4005N2014M9805M7543M5083
53374B759443M2201L8978L5597L1851K7231K1619J5649J0262N912K181j817o542
53362B982565j1630j6515k1193k5906l0423l4283l7778m1832m6739n1691n5792
$$ plain form
53443 1254454 1230960 1207253 1183596 1160046 1136744 1114241 1093320 1074345 1056943 1040576 1025273
53432 1025273 1011547 999742 989744 981293 974265 968661 964554 962016 960960 961214 962923 966715 973151 982103
53418 982103 992918 1005075 1018518 1033596 1050883 1070702 1092482 1114972 1137620 1161415 1187707
53407 1187707 1216441 1246264 1276324 1307187 1339886 1374854 1412101 1451796 1494097 1538582 1584261
53396 1584261 1630269 1676609 1724308 1774618 1827753 1882572 1937878 1993765 2051148 2110063 2169254
53385 2169254 2227514 2284823 2341849 2398846 2455427 2510993 2564998 2617012 2666817 2714360 2759443
53374 2759443 2801644 2840622 2876219 2908070 2935301 2956920 2972569 2982831 2988743 2990924 2989107 2982565
53362 2982565 2970935 2954420 2933227 2907321 2876898 2842615 2804837 2763005 2716266 2664575 2608783
53351B608783n8901o1229o2845o3905o4723o5255o5089o4132o2719o0924n8650
53340A920411n6513n5467n5195n4025n1199m8034m6046m5015m3880m2467m1085
53329A381485l9298l6537l3365l0796k8773k6517k3983k1709j9551j6927j4150
53318A089879j2172j1026r731p864o111n015m192l058j509L26K220L629M087L968
53304A043431M217N292O903Q735J0681J2476J3894J5271J7051J8954K0342K1333
53292A198580K2623K4278K5704K6801K8001K9090K9138K8008K6839K6504K6483
53281A492049K5880K4757K3752K2975K2014K0644J8929J6882J4509J1992R527
53270A703910P166M954K918P60k038n497q872j1441j3347j5290j7602j9950k1928
$$ plain form
53351 2608783 2549882 2488653 2425808 2361903 2297180 2231925 2166836 2102704 2039985 1979061 1920411
53340 1920411 1863898 1808431 1753236 1699211 1648012 1599978 1553932 1508917 1465037 1422570 1381485
53329 1381485 1342187 1305650 1272285 1241489 1212716 1186199 1162216 1140507 1120956 1104029 1089879
53318 1089879 1077707 1066681 1056950 1049086 1042975 1037960 1033768 1030710 1029201 1029527 1031747 1035376 1039463 1043431
53304 1043431 1047648 1052940 1059843 1068578 1079259 1091735 1105629 1120900 1137951 1156905 1177247 1198580
53292 1198580 1221203 1245481 1271185 1297986 1325987 1355077 1384215 1412223 1439062 1465566 1492049
53281 1492049 1517929 1542686 1566438 1589413 1611427 1632071 1651000 1667882 1682391 1694383 1703910
53270 1703910 1711076 1716030 1718948 1719708 1717670 1712173 1703301 1691860 1678513 1663223 1645621 1625671 1603743
53257A603743k3683k5722k8159l0352l1586l2015l2508l3467l4311l4475l4342
53246A263123l4647l5405l6044l6312l6340l6029l5109l3715l2269l0845k9191
53235H87217k7379k5792k4606k3792k3450k3524k3399k2478k1030j9784j8799
53224F33184j7528j5890j4416j3348j2412j1567j1111j0929j0459r557q713q213
53212D89041p848p568p593p701p252o260n600n791o284o395o232o236o388o365
53198C95528o071n548m805m066l765l965m200m115l892l789l775l804l932l950
53184C35851l548l018l135l894m150l121j585q88j146j314q20l11n89j437j867
53169C05028j301k26L69J00m84p07n60m09k39K32Q38R74M27l81j035j524j811
$$ plain form
53257 1603743 1580060 1554338 1526179 1495827 1464241 1432226 1399718 1366251 1331940 1297465 1263123
53246 1263123 1228476 1193071 1157027 1120715 1084375 1048346 1013237 979522 947253 916408 887217
53235 887217 859838 834046 809440 785648 762198 738674 715275 692797 671767 651983 633184
53224 633184 615656 599766 585350 572002 559590 548023 536912 525983 515524 505967 497254 489041
53212 489041 481193 473625 466032 458331 451079 444819 439219 433428 427144 420749 414517 408281 401893 395528
53198 395528 389457 383909 379104 375038 371273 367308 363108 358993 355101 351312 347537 343733 339801 335851
53184 335851 332303 329285 326150 322256 318106 314985 313400 312512 311366 310052 309232 308921 308332 306895 305028
53169 305028 303727 303501 303870 303970 303486 302779 302219 301810 301571 301803 302641 303615 304042 303661 302626 301102 299291
53152B99291j651j022l07J59K63j78j232k254k202r69K67M77l2l75l84n02p71
53135B88578p86m88k78l01k15J81N15L43j82m25n8M47M01j43l06M42J460J710
53117B90895J138O58P71R53N78j61o12n12m0N68J086J193P80K10k8O9J7n64j470
53098B95529k132k204j929j787j891j923j704j468j427j394j190j006j003r19
53084B73552n28k00l60p44q42q68j435k411k877k331j166mQ50J197R61N22M20
53067B63736O35P70P69Q31P16P5n55j82J029J691J098K14K14R41J416J166M08
53050B74972n26j330j701j620j378j104p00l35l35n11l82j76o61j723k200j568
53034B58722p57o60q73p06m41o32r48q06m67n18p07m07J17k2r86j964k198j553
$$ plain form
53152 299291 297640 296618 296311 296470 296733 296555 295323 293069 290867 289898 290165 290642 290610 290235 289851 289349 288578
53135 288578 287792 287304 287026 286725 286510 286691 287206 287549 287367 286942 286884 287331 287732 287589 287283 287725 289185 290895
53117 290895 292033 292691 293462 294415 294993 294832 294220 293708 293668 294236 295322 296515 297295 297505 297477 297546 297563 296999 295529
53098 295529 293397 291193 289264 287477 285586 283663 281959 280491 279064 277670 276480 275474 274471 273552
53084 273552 273024 272824 272464 271720 270878 270010 268575 266164 263287 260956 259790 259786 260636 261833 262794 263316 263736
53067 263736 264371 265141 265910 266741 267457 267532 266977 266795 267824 269515 270613 270827 271041 271982 273398 274564 274972
53050 274972 274446 273116 271415 269795 268417 267313 266613 266278 265943 265432 265050 264874 264213 262490 260290 258722
53034 258722 257965 257305 256432 255726 255285 254653 253705 252899 252432 251914 251207 250800 250917 250895 249909 247945 245747 244194
53016B44194l10R53J462R48J13j75J14M35N59N19J52m73n98L13J489J697J007
52999B52399O51J045J169K33j062j583j306j064j201j253r11n55o27q47m80O75
52983B45283J936K465K096J281N16J78N14J219J295J48j238j138P13K671L251
52968B61190K713K122J720J077J50o83j266j593j477q66j86K29O30J228J577J227
52952B67792N76L30N10O55N79K23p26k250l434l395k504j768j403r51m93n65j018
52935B52158j109q16r27j658k245k183j858j591j031JQ32P43m7p27q35m53J12
52918B38366M58L11j21j71N45J679K571K896K714K214J624J098O41J77k14m51
52902B54337o94j130j539j477r30l42L7M30R87J423J350P06k14r31q62K44J868
$$ plain form
53016 244194 243884 244837 246299 247247 247360 247185 247299 247734 248293 248812 248964 248491 247893 248206 249695 251392 252399
52999 252399 253050 254095 255264 255497 254435 252852 251546 250482 249281 248028 247117 246562 245935 245088 244608 245283
52983 245283 247219 249684 251780 253061 253577 253755 254269 255488 256783 256931 255693 254555 255268 257939 261190
52968 261190 263903 266025 267745 268822 268972 268289 267023 265430 263953 263087 262901 263130 263760 264988 266565 267792
52952 267792 268368 268698 269208 269863 270442 270665 269939 267689 264255 260860 258356 256588 255185 254234 253741 253176 252158
52935 252158 251049 250233 249306 247648 245403 243220 241362 239771 238740 238741 239573 240316 240269 239542 238707 238254 238366
52918 238366 238824 239135 239014 238843 239388 241067 243638 246534 249248 251462 253086 254184 254825 255002 254788 254337
52902 254337 253643 252513 250974 249497 248567 248225 248262 248692 249679 251102 252452 253158 252944 252013 251151 251395 253263
52885B53263K950K805J639J72j027j789k239k566k680k231j142l4L22n6m07k65
52869B46715Rk7j82L7O74J326J733J972K115K077J865J760J952K205K103J662
52853B67996J311J223R86L50j35K02J037J289N25o60j733k905m273n138m785l517
52837B51773k217j316p39m61n14o52o26n70o72p61o70o82j040j413j393j156j005
52820B35886o81J73J196J733J759J592J154L46j84J45O52J90q58q74N64J916J903
52803B46612J172R83J373J615J677K001K281J616j58k140l456m036m215m074l495
52788B37756k518j429n49q4j04n43j104j278p45J41N89L47J00N28J256J342O91
52771B34396K61P38J613J880J193Q9o89p91m04j0J37K80P38J312J417Q31Qm13
$$ plain form
52885 253263 256213 259018 260657 260829 259802 258013 255774 253208 250528 248297 247155 247121 247443 247387 246980 246715
52869 246715 246724 246697 246515 246552 247226 248552 250285 252257 254372 256449 258314 260074 262026 264231 266334 267996
52853 267996 269307 270530 271516 271866 271731 271933 272970 274259 274784 274124 272391 269486 265213 260075 255290 251773
52837 251773 249556 248240 247501 247040 246526 245874 245248 244678 244006 243245 242575 241893 240853 239440 238047 236891 235886
52820 235886 235205 235378 236574 238307 240066 241658 242812 243158 242974 243119 243771 243961 243103 242229 242793 244709 246612
52803 246612 247784 248767 250140 251755 253432 255433 257714 259330 259172 257032 253576 249540 245325 241251 237756
52788 237756 235238 233809 233260 233176 233072 232529 231425 230147 229402 229543 230132 230479 230579 231107 232363 233705 234396
52771 234396 234657 235395 237008 238888 240081 240170 239481 238690 238286 238276 238413 238693 239431 240743 242160 242991 242999 242586
52753B42586j90M32R56J034Q16P73R17O10m41j388j144J13J095J052M99K39M09
52736B48368P03Q83P64L24L2M29J218J374N11n40r15p72o53m99MN40M90k7k42
52717B51992J46N56M15q3m14m86n93q14q14m03P8R9m36j139j618j708j258k15
52699B43305R16J239N50j50K41J511K405K153J138J57l53l24N0K40j98r77j232
52682B50671n73M23R09O48P9j84K06J044J641J449P07K03L63Q25R22L09p86j680
52664B57176j686p80K88Q42J037J350J689J590J096O64L78l9m28k56M59J028J058
52647B65466Q64P88Q04Q97J118J115M18n92q54j12O08M20l52r44j213j299r47
52630B66185j0R17J103O63K57J46R9Kn4m1J18O76J585K114J563K42q20j085r86
$$ plain form
52753 242586 242396 242828 243784 244818 245634 246407 247324 247934 247493 246105 244961 245074 246169 247221 247720 247959 248368
52736 248368 249071 249954 250718 251042 251074 251503 252721 254095 254606 254066 253151 252379 251726 251227 251231 251771 252261 252234 251992
52717 251992 252138 252694 253109 253026 252612 252126 251533 250719 249905 249502 249580 249679 249243 248104 246486 244778 243520 243305
52699 243305 244221 245460 246010 245860 246101 247612 250017 252170 253308 253465 253112 252788 252838 253078 252880 251903 250671
52682 250671 250098 250521 251430 252078 252157 251973 252179 253223 254864 256313 257020 257223 257586 258411 259333 259642 258856 257176
52664 257176 255490 254710 254998 255840 256877 258227 259916 261506 262602 263266 263644 263605 263177 262921 263380 264408 265466
52647 265466 266330 267118 267922 268819 269937 271052 271470 270878 270024 269912 270520 270940 270588 269644 268431 267132 266185
52630 266185 266175 267092 268195 268858 269115 269261 269360 269362 269308 269267 269385 270061 271646 273760 275323 275565 274745 273660 272674
52611B72674j142j598j971k000j684j054j00R56J544J232L92o7J49K59l77j108
52595B66105q28K87Q84L55l87l78J21L17J51J45M86Q61R86Q33N11L00N25J115
52577B72389J538J388Q21K44m6J17O17Q28J72r61j441q76j01J12J09N73J360J844
52559B78687J857J621J060m6j365k139j987j255n75l44n68r39j214j475j785j729
52543B67804q49M53J158R19M11J67o2l89k14P97J792J711O54l41n54m9P35J289
52525B75432J293R54P64O64Q6q82j236n50K03J02k78J80J436K585L213L433L068
52508B90467K020J058J048J634J782J413J298J544J452Q79M35K15m72j791k886
52493C00096l156l005k902k568j657n34K12N16O36O12L08k45q24j040m84P32J716
$$ plain form
52611 272674 271532 269934 267963 265963 264279 263225 263125 264081 265625 266857 267249 267182 267331 267590 267213 266105
52595 266105 265277 265564 266448 266803 266416 266038 266159 266476 266627 266772 267258 268119 269105 269938 270449 270749 271274 272389
52577 272389 273927 275315 276136 276380 276334 276451 277068 277896 278068 277107 275666 274790 274689 274801 274910 275483 276843 278687
52559 278687 280544 282165 283225 283179 281814 279675 277688 276433 275858 275514 274946 274007 272793 271318 269533 267804
52543 267804 266955 267408 268566 269485 269896 270063 270001 269612 269398 270195 271987 273698 274352 274011 273457 273408 274143 275432
52525 275432 276725 277679 278443 279107 279193 278311 277075 276525 276728 276830 276552 276732 278168 280753 283966 287399 290467
52508 290467 292487 293545 294593 296227 298009 299422 300720 302264 303716 304595 305030 305245 304773 302982 300096
52493 300096 296940 293935 291033 288465 286808 286274 286486 287002 287638 288250 288558 288313 287489 286449 285965 286697 288413
52476B88413J605O48j31k82j52R8P86J783K312K125K050K714L475L319K333J540
52460C12636J527J947K175J973J468Q93L65k29j061j988k587k688k602k581k433
52445C06815j895j205q59r86j214j169q81o94q41j113j056o18m34j015j813j654
52429B89368l24R39R52P6m05q7K03j96q20r08n72n09q43r42l96M26R95J348J803
52410B90108K324K579K490K308K250K409K894L630M141M064L736L791M203M391
52396C35318M225M244M663M991M869M642M622M450L628K181L73j706l804n344
52382C67352o065o335o379n869m779l884l620l182j704K74J495J729J712J746
52368C32491J622J686K621M012M411L194J376J61l93q46j331j622j682j554j094
$$ plain form
52476 288413 290018 290666 290535 290253 290101 290199 290985 292768 295080 297205 299255 301969 305444 308763 311096 312636
52460 312636 314163 316110 318285 320258 321726 322619 322984 322755 321694 319706 317119 314431 311829 309248 306815
52445 306815 304920 303715 302856 301870 300656 299487 298606 297912 297071 295958 294902 294284 293850 292835 291022 289368
52429 289368 289044 289983 290935 291011 290606 290519 290722 290526 289706 288798 288226 287717 286874 285932 285536 285962 286957 288305 290108
52410 290108 292432 295011 297501 299809 302059 304468 307362 310992 315133 319197 322933 326724 330927 335318
52396 335318 339543 343787 348450 353441 358310 362952 367574 372024 375652 377833 378206 376500 372696 367352
52382 367352 361287 354952 348573 342704 337925 334041 330421 327239 325535 325809 327304 329033 330745 332491
52368 332491 334113 335799 338420 342432 346843 350037 351413 351574 351181 350335 349004 347382 345700 344146 343052
52353C43052k32O81J099P68q0p93o89K53J183J221M64k56m16j32L93J037J501
52336C49054J532J371J428J588J526J528K180L249L829L714L706M338N127N477
52322C89647N522N704O170O891P735Q136P381N636L987L152K795K465K435K994
52308D60650L675L895L903M341N207N927O186O176O157O225O432O756P127P622
52294E40279Q346Q990Q935Q072P047O371N745M721L573K955K996L256L417L471
52280F18174L390L033K391J663J117J034J557K465L269L710L906L964L767L325
52266F56765K922K672K406K201K546L598M681N025M664M198M006M117M539N160
52252G09500N581N500N114M796M614M512M647N011N071M372L399L052L356L407
$$ plain form
52353 343052 342820 343501 344600 345368 345288 344495 343806 344059 345242 346463 346927 346671 346255 346123 346516 347553 349054
52336 349054 350586 351957 353385 354973 356499 358027 360207 363456 367285 370999 374705 379043 384170 389647
52322 389647 395169 400873 407043 413934 421669 429805 437186 442822 446809 449961 452756 455221 457656 460650
52308 460650 464325 468220 472123 476464 481671 487598 493784 499960 506117 512342 518774 525530 532657 540279
52294 540279 548625 557615 566550 574622 581669 588040 593785 598506 602079 605034 608030 611286 614703 618174
52280 618174 621564 624597 626988 628651 629768 630802 632359 634824 638093 641803 645709 649673 653440 656765
52266 656765 659687 662359 664765 666966 669512 673110 677791 682816 687480 691678 695684 699801 704340 709500
52252 709500 715081 720581 725695 730491 735105 739617 744264 749275 754346 758718 762117 765169 768525 771932
52238G71932K713J913J801K246K588K673K937L520L947L801L342L125L296L559
52224H13393L750L974M175M010L401K838K787L033L020K605K158J925J825J746
52210H54640J687J559J289J100J328J885K287K271K025J818J755J932K424L058
52196H81058L549L912M327M664M614M298M291M847N555N855N526M650L525K625
52182I43296K148J624N21q27j571j681k060l136m165m308l693k968k461k237k376
52167I16106k650k532j955j521j487j219k26R26J413J312J216J191R50P23J016
52152I13263J718K180K158J901J508Q82K96K84Q44J409J659J858K223K546K547
52137I37276K234J725J096M74N0j37j87j14J64O02J073J612K399L528M907O303
$$ plain form
52238 771932 774645 776558 778359 780605 783193 785866 788803 792323 796270 800071 803413 806538 809834 813393
52224 813393 817143 821117 825292 829302 832703 835541 838328 841361 844381 846986 849144 851069 852894 854640
52210 854640 856327 857886 859175 860275 861603 863488 865775 868046 870071 871889 873644 875576 878000 881058
52196 881058 884607 888519 892846 897510 902124 906422 910713 915560 921115 926970 932496 937146 940671 943296
52182 943296 945444 947068 947589 946762 945191 943510 941450 938314 934149 929841 926148 923180 920719 918482 916106
52167 916106 913456 910924 908969 907448 905961 904742 904516 905442 906855 908167 909383 910574 911524 912247 913263
52152 913263 914981 917161 919319 921220 922728 923610 923906 924190 925034 926443 928102 929960 932183 934729 937276
52137 937276 939510 941235 942331 942805 942855 942718 942531 942417 942581 943183 944256 945868 948267 951795 956702 963005
52121I63005P411Q023Q291Q601Q980Q975Q403P845P923Q256P747N926L535J687
52107A064608P09L6r45k118k718k194q46N47J672K885M480O218P792R187J0275
52092A099588J0524R684Q387P423O618N073K477l39k311l163l388l485l516l245
52078A130327k551j599o41K25R35J210P94p5p26p29k94Q9R7l27r69j383j353j253
52060A121777j560j967j666n43N94J152J364J578J789K202L252M481M445K556
52046A139454K27q31p88j044k014k818k894k615k338k007j812k160k714k398q24
52031A112424R87J695J010k55j091j032m78l93j357k797l547l175k388k157k781
52016A094665l764m293l802k465j088l51k78o01j160j620j315r3J077J072r9j669
$$ plain form
52121 963005 970416 978439 986730 995331 1004311 1013286 1021689 1029534 1037457 1045713 1053460 1059386 1062921 1064608
52107 1064608 1065317 1065353 1064408 1062290 1059572 1057378 1056532 1057079 1058751 1061636 1066116 1072334 1080126 1089313 1099588
52092 1099588 1110112 1119796 1128183 1135606 1142224 1147297 1149774 1149435 1147124 1143961 1140573 1137088 1133572 1130327
52078 1130327 1127776 1126177 1125536 1125761 1126696 1127906 1128700 1128625 1127899 1127170 1126876 1126965 1127062 1126735 1125766 1124383 1123030 1121777
52060 1121777 1120217 1118250 1116584 1116041 1116635 1117787 1119151 1120729 1122518 1124720 1127972 1132453 1136898 1139454
52046 1139454 1139681 1138850 1138062 1137018 1135004 1132186 1129292 1126677 1124339 1122332 1120520 1118360 1115646 1113248 1112424
52031 1112424 1113411 1115106 1116116 1115861 1114770 1113738 1113260 1112867 1111510 1108713 1105166 1101991 1099603 1097446 1094665
52016 1094665 1090901 1086608 1082806 1080341 1079253 1078902 1078624 1078023 1076863 1075243 1073928 1073835 1074912 1075984 1075885 1074216
52000A074216l333n221p097q618j0189j2416j4736j5799j5296j4305j3634j3021
51988I40551j2340j2283j3136j3905j3583j2592j2155j2734j3778j4607j4861
51977G94577j4431j3574j2886j2654j2498j2001j1342j0902j0534r694q027n566
51965F60468k679j07J393J912K504L969N907P370Q037Q127P551N954L515R85j155
51950G13751l008m669n913o647p154p550p309n722k808N15L182M851O047P569
51936F85135R739J2081J3716J4069J3294J1906J0047P355L699j66l195n294p379
51923G65007j0025j2594j4116j4575j4698j4848j4797j4406j3845j3191j2338
51912F15574j1328j0276r038p446n779m395l051j221R34K713L979N306O881Q180
$$ plain form
52000 1074216 1070883 1065662 1058565 1049947 1039758 1027342 1012606 996807 981511 967206 953572 940551
51988 940551 928211 915928 902792 888887 875304 862712 850557 837823 824045 809438 794577
51977 794577 780146 766572 753686 741032 728534 716533 705191 694289 683755 674061 666034 660468
51965 660468 657789 657682 659075 660987 663491 667460 673367 680737 688774 696901 704452 710406 713921 714906 713751
51950 713751 710743 706074 700161 693514 686360 678810 671501 665779 662971 663486 666668 671519 677566 685135
51936 685135 694874 706955 720671 734740 748034 759940 769987 777342 781041 780875 777680 772386 765007
51923 765007 754982 742388 728272 713697 698999 684151 669354 654948 641103 627912 615574
51912 615574 604246 593970 584932 577486 571707 567312 564261 563040 563974 566687 570666 575972 582853 591033
51898E91033Q950R587J0082R504P224M019J169j132l637o614r253j0552j0293
51885F00087r099p710o205l933m12L746P279R745J1877J4282J6570J8161J9296
51872F73684K0474K1495K1872K1843K2057K2321K1327J7729J1072J944q140j7127
51860H30551k3463k6966k8363k8139k6335k3345k0078j7142j4458j1902r792q425
51848E92143p526o611n666n090n064n246n142m662m261m477n278n991o044n623
51834E15462n331n343n237m671l770k699j284N85K386L272K967K074J391J140
51820E00942J010P79N73N32M81J60l62o36k06J040K756M223M694L940K447R18
51804E23291l96j634k724l335l508l852m786n857o149n244l590k057j301j386
$$ plain form
51898 591033 599983 609570 619652 629156 636380 640399 641568 640436 636799 630185 620932 610380 600087
51885 600087 590988 583278 577073 573140 572728 576474 583753 593498 605375 619657 636227 654388 673684
51872 673684 694158 715653 737525 759368 781425 803746 825073 842802 853874 855818 847678 830551
51860 830551 807088 780122 751759 723620 697285 673940 653862 636720 622262 610360 600568 592143
51848 592143 584617 578006 572340 567250 562186 556940 551798 547136 542875 538398 533120 527129 521085 515462
51834 515462 510131 504788 499551 494880 491110 488411 487127 487712 490098 493370 496337 498411 499802 500942
51820 500942 501952 502731 503304 503836 504317 504477 504115 503479 503273 504313 507069 511292 515986 519926 522373 523291
51804 523291 522895 521261 518537 515202 511694 507842 503056 497199 491050 485806 482216 480159 478858 477472
51790D77472j695j393k36J078J629J285P69P09R73R72M40l21q63j052j084j117
51774D77566j086q38m14l4J20J72N54J736L737N873P224P541P493P776Q167P822
51758E33409O302L877R49k263n370p744r085r626r553q670p002n290m356m186
51744D71392m133l774l112k111p13O43J209R62R44K081L952N274N515N404N743
51729D89276O225N940M704L395K895L168L434K952J528l26j621j581m16Q89J679
51714E22141K180K753L042K471J227K06n0J35J45j56l39O1R01J362P66m59j136
51697E35250p99r8N14J602L472M923M470K354J52j317k365k973k506j040L79J160
51681E43178J545J358k01k904n115n837n843n920n403l661j764j153j562j743
$$ plain form
51790 477472 475777 474384 474148 475226 476855 478140 478909 479618 480591 481563 482003 481682 480819 479767 478683 477566
51774 477566 476480 475642 475228 475194 475314 475486 476040 477776 481513 487386 494610 502151 509644 517420 525587 533409
51758 533409 539711 543588 544537 542274 536904 529160 520075 510449 500896 492226 485224 479934 475578 471392
51744 471392 467259 463485 460373 458262 457549 458192 459401 460363 461307 463388 467340 472614 478129 483533 489276
51729 489276 495501 501441 506145 509540 512435 515603 519037 521989 523517 523191 521570 519989 519573 520462 522141
51714 522141 524321 527074 530116 532587 533814 534020 533970 534105 534250 534094 533755 533816 534717 536079 536845 536386 535250
51697 535250 534451 534353 534867 536469 539941 544864 549334 551688 551840 550523 548158 545185 542679 541639 542018 543178
51681 543178 544723 546081 545880 542976 537861 532024 526181 520261 514858 511197 509433 508280 506718 504975
51667E04975j594j944k748l104k890k832k957k437j076L03J211K090L339M750
51653D95086O070P105P177N628L099J159L62j68r44j237o10ql46j049j070o13
51637E19641o27j209j649j808k341l608n278o976q545r617r703q844p630o455
51623D45351n239l916k674j601n78L56R70J280J609K008K065J462M23n72j244
51608D39700j543j510j369j407j588j530j028l97O0N33J379K476L382L964M431
51593D45553M777M723M300L998M125M401M517M671N203N975O573O924P229P467
51579E20436P521P714Q490R454R512Q367P280P783R998J2845J5574J8339K1305
51566F64618K4095K6352K8219K9945L1535L3219L5809L9773M4142M7051M7622
$$ plain form
51667 504975 503381 501437 498689 495585 492695 489863 486906 484469 483393 483696 484907 486997 490336 495086
51653 495086 501156 508261 515438 521066 524165 525324 525686 525518 524574 523337 522727 522719 522373 521324 520254 519641
51637 519641 519014 517805 516156 514348 512007 508399 503121 496145 487600 477983 468280 459436 451806 445351
51623 445351 440112 436196 433522 431921 431343 431699 432669 433949 435558 437566 439631 441093 441516 440944 439700
51608 439700 438157 436647 435278 433871 432283 430753 429725 429328 429388 429921 431300 433776 437158 441122 445553
51593 445553 450330 455053 459353 463351 467476 471877 476394 481065 486268 492243 498816 505740 512969 520436
51579 520436 527957 535671 544161 553615 563127 571494 578774 586557 596555 609400 624974 643313 664618
51566 664618 688713 715065 743284 773229 804764 837983 873792 913565 957707 1004758 1052380
51555A052380M6735M5696M4635M2758L9753L6201L2522K8129K2002J3715L628
51544A408154p697j9801l2066m3453n2752n9155o2650o3846o3297o1081n7218
51533H85138n2326m7291m2304l6868l1022k5886k2396k0044j7548j4497j1536
51522E63420r232p537o348n687n331m890m399m191m157l874l482l582m097m145
51508D92468l395k645k578k781k563k051j747j670j616j799k411k991k950k450
51494D58821k053j801j315o19j28l1j95n49r79j050m97K15M18J85J45M43N88K95
51476D51893j66n03o83o35k07M04P07M86N1j81j1N42J209J455R56j2r49j785k714
51457D49857l545l777l309k580k009j631j330r87m45L03R65J397J948K960M098
$$ plain form
51555 1052380 1099115 1144811 1189446 1232204 1271957 1308158 1340680 1368809 1390811 1404526 1408154
51544 1408154 1400457 1380656 1348590 1305137 1252385 1193230 1130580 1066734 1003437 942356 885138
51533 885138 832812 785521 743217 706349 675327 649441 627045 607001 589453 574956 563420
51522 563420 554188 546651 540303 534616 529285 524395 519996 515805 511648 507774 504292 500710 496613 492468
51508 492468 489073 486428 483850 481069 478506 476455 474708 473038 471422 469623 467212 464221 461271 458821
51494 458821 456768 454967 453652 453033 452905 452874 452679 452130 451151 450101 449604 449819 450237 450422 450567 451010 451598 451893
51476 451893 451727 451224 450541 449906 449699 450103 450810 451296 451347 451166 451155 451697 452906 454361 455317 455305 454356 452571 449857
51457 449857 446312 442535 439226 436646 434637 433006 431676 430689 430244 430547 431512 432909 434857 437817 441915
51442D41915M801N152N669O412P022P611Q650J0017J0947J1105J0861J0262Q734
51429E49158O155L424J366j93j603k424k107j213r87j876l213m319n198o005o563
51414E24402o684o551o369n914m838l363k222j826j761j425q71n94o12l79L08
51399D81301R16J083J280K031K997L516L709M271N342O463P581R235J1621J4277
51385E55623J6852J9573K2649K5953K9522L3785L8887M4312M9442N4126N8441
51374I49165O2350O5767O8434O9655O8666O5499O0876N5000M7099L6505K3544
51363A572560R055o270k1659l6102m9028o0502p0196p6874p9637p9098p6556p2486
51351I53207o6820o0219n3882m8157m2361l6159l0211k5266k1382j8329j6060
$$ plain form
51442 441915 446716 451868 457537 463949 470971 478582 487232 497249 508196 519301 530162 540424 549158
51429 549158 555313 558737 560103 559910 558307 555883 553776 552563 551576 549700 546487 542168 536970 530965 524402
51414 524402 517718 511167 504798 498884 494046 490683 488461 486635 484874 483449 482578 481984 481372 480993 481301
51399 481301 482217 483300 484580 486611 489608 493124 496833 501104 506446 512909 520490 529725 541346 555623
51385 555623 572475 592048 614697 640650 670172 703957 742844 787156 836598 890724 949165
51374 949165 1011515 1077282 1145716 1215371 1284037 1349536 1410412 1465412 1512511 1549016 1572560
51363 1572560 1581615 1575345 1553686 1517584 1468556 1408054 1337858 1260984 1181347 1102249 1025693 953207
51351 953207 886387 826168 772286 724129 681768 645609 615398 590132 568750 550421 534361
51340E34361j4426j2929j1270r763q822q242p398o017m509l455k975k696k284
51327D39575j877j815k015j963j417p74m88m68l57j55j72m95r61j447j833j813
51311D21525j234m73l6J14K94L87L0m97l59O51J693J983J618J026K40o87j192
51294D25083r05m75q90k010k700k412j843j765j969j826j338r39o14O8J092J814
51278D08371J810J492J596K370L427M270M755N098N535N906N636M312K269M02
51264D57249o45r44r63j149j762k698l326k970j765o61k79k40m0L7m82j195j278
51247D36889q53q97j703k400k284j769j483j223n47J67J56m97q93o37l29n80j158
51230D19959j393j029l08N13J353K074K388K116J389N83O2m1J16K00O2l0L63J283
$$ plain form
51340 534361 519935 507006 495736 485973 477151 468909 461511 455494 450985 447530 444555 441859 439575
51327 439575 437698 435883 433868 431905 430488 429714 429226 428758 428401 428246 428074 427579 426618 425171 423338 421525
51311 421525 420291 419818 419782 419896 420190 420577 420607 420110 419751 420402 422095 424078 425696 426722 426962 426275 425083
51294 425083 424178 423703 422813 420803 418103 415691 413848 412083 410114 408288 406950 406011 405397 405465 406557 408371
51278 408371 410181 411673 413269 415639 419066 423336 428091 433189 438724 444630 450266 454578 456847 457249
51264 457249 456604 455660 454697 453548 451786 449088 445762 442792 441027 440366 440087 439847 439807 439844 439362 438167 436889
51247 436889 436036 435139 433436 431036 428752 426983 425500 424277 423730 423897 424053 423556 422663 422026 421697 421117 419959
51230 419959 418566 417537 417229 417742 419095 421169 423557 425673 427062 427645 427707 427666 427782 427982 428044 428014 428377 429660
51212D29660K103K112J334N50M81J113J933K581K973L074K816K278J672J185R69
51197D56834J134J574J897J850J713J888K226K140J519R71R99J299J284R44P48
51182D79020P61M64l63j031p11L60J018O63J4l1K42j47j258k121k290k475l229
51165D68886l955l906l444l360l574l483l173l193l303k627j079M00J140J313
51151D36642J096L44n89p31K28J354J704J458J195Q65J51o20p81k78L72Q13J037
51134D44260J036P97M94K23k37j058j889k148j648o36N53J561J963J622J013Q35
51118D46741J353K338L456M491N278N659N537M871L770K603J767J264P87K86L5
51103D90236P1N0j69k41Q8M73M58J14j28m3K43M38K81k25p04q68j003j427j618
$$ plain form
51212 429660 431763 433875 435209 435759 436240 437353 439286 441867 444840 447914 450730 453008 454680 455865 456834
51197 456834 457968 459542 461439 463289 465002 466890 469116 471256 472775 473746 474745 476044 477328 478272 479020
51182 479020 479781 480245 479882 478851 478140 478500 479518 480181 480195 480164 480406 480259 479001 476880 474590 472115 468886
51165 468886 464931 461025 457581 454221 450647 447164 443991 440798 437495 434868 433789 434189 435329 436642
51151 436642 437738 438082 437493 436762 436990 438344 440048 441506 442701 443566 443717 443097 442316 442038 442410 443223 444260
51134 444260 445296 446093 446587 446810 446573 445515 443626 441478 439830 439194 439747 441308 443271 444893 445906 446741
51118 446741 448094 450432 453888 458379 463657 469316 474853 479724 483494 486097 487864 489128 489915 490201 490236
51103 490236 490307 490357 490188 489947 490035 490508 490966 491080 490952 490909 491152 491590 491871 491646 490942 490074 489071 487644 486026
51084D86026p48P86J419M98p08p98j00K39J77N89J542K126J888J350R59N08j27
51067D95626n37l27L72J255K158K875L130L019L094L749M726N393N410N065N067
51052E40075N930P457Q966J0036J0742J1064J0616R348P973P220P015O974P271
51039F50687Q329R897J1150J1630J1436J0653R236P372N317K869l00l776o498
51026G28002p801p918p456o986p137q339j0235j1812j2336j1822j0551q658o327
51013F10624l985k027n90L88J149K047L192M210M769N126N720O444O832O849O806
50998F57554O652O079N338N113N421N469M863M279M429N094N637N999O578P437
50984G35942Q270Q967R789J0863J1827J2018J1007R022O938N628N262N252M877
$$ plain form
51084 486026 485278 486064 487483 487981 487273 486475 486375 486614 486791 487380 488922 491048 492936 494286 495245 495753 495626
51067 495626 495089 494762 495134 496389 498547 501422 504552 507571 510665 514414 519140 524533 529943 535008 540075
51052 540075 546005 553462 562428 572464 583206 594270 604886 614234 622207 629427 636442 643416 650687
51039 650687 659016 668913 680063 691693 703129 713782 723018 730390 735707 738576 738276 734500 728002
51026 728002 720201 712283 704827 697841 690704 682365 672130 660318 647982 636160 625609 616951 610624
51013 610624 606639 604612 604022 604410 605559 607606 610798 615008 619777 624903 630623 637067 643899 650748 657554
50998 657554 664206 670285 675623 680736 686157 691626 696489 700768 705197 710291 715928 721927 728505 735942
50984 735942 744212 753179 762968 773831 785658 797676 808683 817705 824643 830271 835533 840785 845662
50971H45662L878K531J354P81R11J565K532L626M545N079N618O926R048J1027
50957I05083J2208J3251J5080J7335J8830J9324J9730K0570K1313K1486K1472
50946A105682K1759K2232K2599K2871K2938K2354K1035J9721J9223J9539K0080
50935A340033K0408K0422K0148J9674J8974J7567J4799J0650N966J537k618o789
50923A480771j0847j4347j7109j9307k1179k2966k4879k6868k8597k9840l0788
50912A234044l1773l2806l3470l3180l1657k9296k6981k5221k3676k1891k0101
50901I23992j8733j7411j5419j3086j1669j1613j1875j1367j0171q828p358n693
50889G80769m384l964m032l713k768j679r08n96p24r70p72PP86J156J578K589
$$ plain form
50971 845662 849540 852071 853425 854206 855117 856682 859214 862840 867385 872464 878082 885008 894056 905083
50957 905083 917291 930542 945622 962957 981787 1001111 1020841 1041411 1062724 1084210 1105682
50946 1105682 1127441 1149673 1172272 1195143 1218081 1240435 1261470 1281191 1300414 1319953 1340033
50935 1340033 1360441 1380863 1401011 1420685 1439659 1457226 1472025 1482675 1488641 1490178 1487560 1480771
50923 1480771 1469924 1455577 1438468 1419161 1397982 1375016 1350137 1323269 1294672 1264832 1234044
50912 1234044 1202271 1169465 1135995 1102815 1071158 1041862 1014881 989660 965984 944093 923992
50901 923992 905259 887848 872429 859343 847674 836061 824186 812819 802648 793820 786462 780769
50889 780769 776385 772421 768389 764676 761908 760229 759321 758725 758001 757031 756259 756266 757052 758208 759786 762375
50873G62375L705M019L613L523M248N184N691N965O422O934P128P180P684Q836
50859H42507J0128J1025J1654J2572J3937J5271J6226J7265J9150K1849K4516
50848A016100K6569K8328L0403L2936L5744L8696M1564M3856M5295M6273M7391
50837A433155M8728M9852N0454N0577N0370M9913M9224M8159M6355M3578M0152
50826A960517L6804L4037L1763K9543K7185K5069K3789K3404K3251K2736K2076
50815B260174K1825K1849K1369J9959J7884J5285J1733O844P78o118j3655k1454
50803B356473k8900l5748m2296m8551n3856n7737o0507o2442o2947o1332n7975
50792A784182n3987m9867m5207l9589l3246k6783k0817j5755j1544p703l929m45
$$ plain form
50873 762375 766080 770099 773712 777235 781483 786667 792358 798323 804745 811679 818807 825987 833671 842507
50859 842507 852635 863660 875314 887886 901823 917094 933320 950585 969735 991584 1016100
50848 1016100 1042669 1070997 1101400 1134336 1170080 1208776 1250340 1294196 1339491 1385764 1433155
50837 1433155 1481883 1531735 1582189 1632766 1683136 1733049 1782273 1830432 1876787 1920365 1960517
50826 1960517 1997321 2031358 2063121 2092664 2119849 2144918 2168707 2192111 2215362 2238098 2260174
50815 2260174 2281999 2303848 2325217 2345176 2363060 2378345 2390078 2396922 2397700 2391582 2377927 2356473
50803 2356473 2327573 2291825 2249529 2200978 2147122 2089385 2028878 1966436 1903489 1842157 1784182
50792 1784182 1730195 1680328 1635121 1595532 1562286 1535503 1514686 1498931 1487387 1479684 1475755 1475310
50780A475310K470M921P019Q418Q811Q523Q045P257N677L284N02k418n434q294
50766A524091j0717j2834j4967j7123j9247k1655k4509k7112k8528k8871k9171
50755A289357k9951l0689l0753l0063k8677k6515k3821k1236j9049j6881j4373
50744A017349j1676q992o208l357q34J248L469O336R393J1743J3196J4474J6273
50731A062414J8565K0848K2728K4181K5560K7381K9830L2382L4057L4324L3637
50720A365907L2905L2397L1462K9465K6740K4277K2552K1075J9147J6636J3804
50709A636367J0863Q008N633M016K939K004J243J101J836L206M716O026P162Q476
50695A703596J0199J1925J2783J2330J0992R365P448M899J752j725n536r785j3969
$$ plain form
50780 1475310 1477780 1482701 1489720 1498138 1506949 1515472 1523517 1530774 1536451 1539735 1540237 1537819 1532385 1524091
50766 1524091 1513374 1500540 1485573 1468450 1449203 1427548 1403039 1375927 1347399 1318528 1289357
50755 1289357 1259406 1228717 1197964 1167901 1139224 1112709 1088888 1067652 1048603 1031722 1017349
50744 1017349 1005673 996681 990473 987116 986282 987530 990999 997335 1006728 1018471 1031667 1046141 1062414
50731 1062414 1080979 1101827 1124555 1148736 1174296 1201677 1231507 1263889 1297946 1332270 1365907
50720 1365907 1398812 1431209 1462671 1492136 1518876 1543153 1565705 1586780 1605927 1622563 1636367
50709 1636367 1647230 1655238 1660871 1664887 1667826 1669830 1671073 1672174 1674010 1677216 1681932 1687958 1695120 1703596
50695 1703596 1713795 1725720 1738503 1750833 1761825 1771190 1778638 1783537 1785289 1783564 1778028 1768243 1754274
50682A754274j7114j8566j8386j6877j4270j0819o785k275K539P014J0435J2887
50670A682057J5294J8390K1989K5456K8536L1448L4390L7277L9928M2286M4331
50659B021382M5797M6057M4569M1562L8044L4935L2322K9710K6822K3894K1380
50648B406474J9595J8547J7822J6895J5745J4977J4991J5398J5553J5447J5602
50637B587046J6365J7760J9830K2499K5318K7852L0206L2683L5043L6661L7258
50626B888521L6853L5047L1201K5442J8921J2765P261K174k500o345q814r841
50614C030685j0548j3196j9584k9232l9495m7629n2400n3811n2176m7878m1674
50603B623062l4669k8071k2897j9646j8129j7923j9050k1891k6475l2266l8646
$$ plain form
50682 1754274 1737160 1718594 1700208 1683331 1669061 1658242 1651457 1649182 1651721 1658735 1669170 1682057
50670 1682057 1697351 1715741 1737730 1763186 1791722 1823170 1857560 1894837 1934765 1977051 2021382
50659 2021382 2067179 2113236 2157805 2199367 2237411 2272346 2304668 2334378 2361200 2385094 2406474
50648 2406474 2426069 2444616 2462438 2479333 2495078 2510055 2525046 2540444 2555997 2571444 2587046
50637 2587046 2603411 2621171 2641001 2663500 2688818 2716670 2746876 2779559 2814602 2851263 2888521
50626 2888521 2925374 2960421 2991622 3017064 3035985 3048750 3056011 3058185 3055685 3049340 3040526 3030685
50614 3030685 3020137 3006941 2987357 2958125 2918630 2871001 2818601 2764790 2712614 2664736 2623062
50603 2623062 2588393 2560322 2537425 2517779 2499650 2481727 2462677 2440786 2414311 2382045 2343399
50592B343399m5167n1302n6457o0354o3084o4691o5124o4523o3101o0738n7181
50581A691677n2672m7816m2901l7828l2779k8223k4221k0322j6312j2432q877
50570A367294n673l125j514k50J778M667P202Q448Q846R258R863J0554J1603J3233
50556A442184J5203J7501K0696K4773K8408L0357L1159L2421L4861L7956M1207
50545A756726M4612M7990N0862N3097N4867N5920N5792N4839N4259N4756N5882
50534B339602N6984N8212O0216O3440O7978P3745Q0296Q6762R2361R6939J00905
50523C177440J04780J08844J12957J16600J19259J20804J21352J20805J18839
50514D221680J15315J10320J03626R4553Q2698O8615N3453L7916K1815M764j2963
$$ plain form
50592 2343399 2298232 2246930 2190473 2130119 2067035 2002344 1937220 1872697 1809596 1748858 1691677
50581 1691677 1639005 1591189 1548288 1510460 1477681 1449458 1425237 1404915 1388603 1376171 1367294
50570 1367294 1361621 1358496 1356982 1356732 1358510 1363177 1370379 1378827 1387673 1396931 1406794 1417348 1428951 1442184
50556 1442184 1457387 1474888 1495584 1520357 1548765 1579122 1610281 1642702 1677563 1715519 1756726
50545 1756726 1801338 1849328 1900190 1953287 2008154 2064074 2119866 2174705 2228964 2283720 2339602
50534 2339602 2396586 2454798 2515014 2578454 2646432 2720177 2800473 2887235 2979596 3076535 3177440
50523 3177440 3282220 3391064 3504021 3620621 3739880 3860684 3982036 4102841 4221680
50514 4221680 4336995 4447315 4550941 4645494 4728192 4796807 4850260 4888176 4909991 4914755 4901792
50503D901792l0440m6876o2046p5766q7274r5529j00131j01495j00192r6483r0683
50492D014877q3389p5091o5915n6113m6366l7216k8560k0289j3165q413o604p491
50480C566265j0980j7629k7913m1395n6746p2382q6932r9418j09236j16044j19743
50469B807847j20672j19528j16859j12726j07239j01096r5153q9463q3350p6527
50459A785234o9552o3069n7085n1364m6073m1541l7616l3742k9629k5479k1579
50448A308505j8002j4779j2034r789p762n641l473j640m03M19J179J927K390K546
50434A243443K976M363O703R220J1183J2553J3686J4668J5311J5792J6794J8688
50422A385380K0973K2942K4780K7321L0616L3510L5152L6291L8384M1667M5039
$$ plain form
50503 4901792 4871352 4824476 4762430 4686664 4599390 4503861 4403730 4302235 4202043 4105560 4014877
50492 4014877 3931488 3856397 3790482 3734369 3688003 3650787 3622227 3601938 3588773 3580360 3573756 3566265
50480 3566265 3555285 3537656 3509743 3468348 3411602 3339220 3252288 3152870 3043634 2927590 2807847
50469 2807847 2687175 2567647 2450788 2338062 2230823 2129727 2034574 1945111 1861761 1785234
50459 1785234 1715682 1652613 1595528 1544164 1498091 1456550 1418934 1385192 1355563 1330084 1308505
50448 1308505 1290503 1275724 1263690 1253901 1246139 1240498 1237025 1235385 1234982 1235401 1236580 1238507 1240897 1243443
50434 1243443 1246419 1250782 1257485 1266705 1277888 1290441 1304127 1318795 1334106 1349898 1366692 1385380
50422 1385380 1406353 1429295 1454075 1481396 1512012 1545522 1580674 1616965 1655349 1697016 1742055
50411A742055M7752N0340N3621N7588O1781O6041P0294P3964P6291P7142P7055
50400B453924P6418P4997P2154O7344O0549N2370M3640L4725K5535J6259P634
50389B985549Rp443j6028k6123l6889m7183n6173o3186o7592o9218o8529o6264
50377B460930o2922n8637n3359m7219m0746l4579k8871k3324j7985j3527j0404
50366B069357q214o588o225q236j2608j8188k4167l0606l7439m3885m9242n3437
50354A770522n6354n7433n6557n4706n2933n1134m8589m5385m2428m0138l7950
50343A226915l5298l2426l0035k8447k7343k6025k3866k0882j7910j5905j4942
50332I53836j4156j2851j1242r914q964q070p174o539o163n560m371k911j895
$$ plain form
50411 1742055 1789807 1840147 1893768 1951356 2013137 2079178 2149472 2223436 2299727 2376869 2453924
50400 2453924 2530342 2605339 2677493 2744837 2805386 2857756 2901396 2936121 2961656 2977915 2985549
50389 2985549 2985558 2978115 2962087 2935964 2899075 2851892 2795719 2732533 2664941 2595723 2527194 2460930
50377 2460930 2398008 2339371 2286012 2238793 2198047 2163468 2134597 2111273 2093288 2079761 2069357
50366 2069357 2061143 2054555 2048330 2040094 2027486 2009298 1985131 1954525 1917086 1873201 1823959 1770522
50354 1770522 1714168 1656735 1600178 1545472 1492539 1441405 1392816 1347431 1305003 1264865 1226915
50343 1226915 1191617 1159191 1129156 1100709 1073366 1047341 1023475 1002593 984683 968778 953836
50332 953836 939680 926829 915587 905673 896709 888639 881465 874926 868763 863203 858832 855921 854026
50319H54026j639j721j379j80J668L502M730N320N858P054R084J1424J3349J4532
50305I25628J5099J5259J5081J4731J4696J5462J6890J8103J8190J7038J5157
50294A101334J2742R283M483o69m331n488m805l591k439j240j64K24n1n8R09K140
50278A108279J938q67o014j2143j7519k0620k0747j8547j5590j3030j0790q237
50266I66113n383k955j377k40J132K937M939O840Q320Q987Q652P644O599O009
50252A018217O038O632P473Q016P887P240O440N533M288K731J216p0j289k528
50238A077824l497l863l670l293l036k907k641j940p42P76K519M602O986R258
50224A076376J1175J3210J6067J9628K2941K5282K6826K8200K9969L2558L6044
$$ plain form
50319 854026 852387 850666 849287 849107 850775 854277 859007 864327 870185 877239 886323 897747 911096 925628
50305 925628 940727 955986 971067 985798 1000494 1015956 1032846 1050949 1069139 1086177 1101334
50294 1101334 1114076 1123359 1127842 1127173 1122842 1117354 1112549 1108958 1106519 1105279 1105115 1105339 1105288 1105230 1106139 1108279
50278 1108279 1110217 1109350 1103336 1091193 1073674 1053054 1032307 1013760 998170 985140 974350 966113
50266 966113 960730 957775 956398 956158 957290 960227 965166 972006 980326 989313 997965 1005609 1012208 1018217
50252 1018217 1024255 1030887 1038360 1046376 1054263 1061503 1067943 1073476 1077764 1080495 1081711 1081641 1080352 1077824
50238 1077824 1074327 1070464 1066794 1063501 1060465 1057558 1054917 1052977 1052235 1053011 1055530 1060132 1067118 1076376
50224 1076376 1087551 1100761 1116828 1136456 1159397 1184679 1211505 1239705 1269674 1302232 1338276
50213A338276L9743M2644M4550M6217M8048M9285M9035M7427M5063M1827L7091
50202A829206L0841K3801J6596R563L280j602n304q960j3480j8820k4497l0287
50190A810337l6127m1733m6665n0526n3052n4260n4524n4085n2517m9152m4207
50179A273489l8867l4027k9502k4890k0656j7766j6590j6779j7930j9615k0838
50168A016029k0370j8054j5149j2958j1466r844p872o198n216m535l711k886k226
50155H95544j300L04K058K968K868K516K393K165J599J239J590K258K490K195
50141I20887J861J627J183M50k06n02n48n68o75r18j221j347j145p47j69J015
50125I18977L124N591P374Q148Q533R017R302Q954Q219P756Q010R141J1192J3822
$$ plain form
50213 1338276 1378019 1420663 1465213 1511430 1559478 1608763 1657798 1705225 1750288 1792115 1829206
50202 1829206 1860047 1883848 1900444 1910007 1913287 1911685 1906381 1897421 1883941 1865121 1840624 1810337
50190 1810337 1774210 1732477 1685812 1635286 1582234 1527974 1473450 1419365 1366848 1317696 1273489
50179 1273489 1234622 1200595 1171093 1146203 1125547 1107781 1091191 1074412 1056482 1036867 1016029
50168 1016029 995659 977605 962456 949498 938032 928188 920316 914118 908902 904367 900656 897770 895544
50155 895544 894244 894548 896606 899574 902442 904958 907351 909516 911115 912354 913944 916202 918692 920887
50141 920887 922748 924375 925558 926008 925802 925300 924752 924184 923509 922591 921370 920023 918878 918131 917962 918977
50125 918977 922101 927692 935066 943214 951747 960764 970066 979020 987239 994995 1003005 1012146 1023338 1037160
50111A037160J6219J7864J9291K1620K5274K9596L3800L7853M2136M6661N1028
50100A378502N5161N9547O4517O9639P4184P8037Q1849Q6168R0796R4912R7454
50089B230766R7321R3848Q7406P9210P0161O0303M9789L9804L1583K4733J7361
50078B882285Q057k928j4671k6923m0004n3773o7280p9275q8694r4911r8003r8744
50066B225136r8009r6112r2849q8132q2374p6175o9793o3022n5622m7856m0572
50055A414620l4713l0658k8015k5983k3948k1849k0088j8956j8131j6880j4853
50044A160546j2488j0441q914p670o553n604m856m337m130m107l757k677j100
50031A083912L57J395K026K066J316L13J58J293K860L679L518L064K908L001K982
$$ plain form
50111 1037160 1053379 1071243 1090534 1112154 1137428 1167024 1200824 1238677 1280813 1327474 1378502
50100 1378502 1433663 1493210 1557727 1627366 1701550 1779587 1861436 1947604 2038400 2133312 2230766
50089 2230766 2328087 2421935 2509341 2588551 2658712 2719015 2768804 2808608 2840191 2864924 2882285
50078 2882285 2890342 2887414 2872743 2845820 2805816 2752043 2684763 2605488 2516794 2421883 2323880 2225136
50066 2225136 2127127 2031015 1938166 1850034 1767660 1691485 1621692 1558670 1503048 1455192 1414620
50055 1414620 1379907 1349249 1321234 1295251 1271303 1249454 1229366 1210410 1192279 1175399 1160546
50044 1160546 1148058 1137617 1128703 1121033 1114480 1108876 1104020 1099683 1095553 1091446 1087689 1085012 1083912
50031 1083912 1084269 1085664 1087690 1089756 1091072 1091385 1091543 1092836 1095696 1099375 1102893 1105957 1108865 1111866 1114848
50016A114848K722K368K014J483N93l77p99n29l45j110k687m079m614m413l695
50001A101380k366n46J083J933K301L028M589O720Q871J0773J2580J4557J6606
49988A181509J8245J9132J9502J9839K0302K0890K1852K3390K4966K5721K5721
49977A421069K6077K7599K9841L1899L3637L5657L8435M1784M4797M6076M4486
49966A821357M0200L4601K8821K2773J6063R289L748N5k404m758p943j2519j8623
49953A930660k5890l3633m1061m7288n1446n3205n2986n1431m8811m5216m0929
49942A438764l6352l1908k8313k6463k6447k7100k7160k6664k6494k6884k7125
49931A127854k6791k6352k6437k7009k7523k7409k6331k4370k2054j9899j7903
$$ plain form
50016 1114848 1117570 1119938 1121952 1123435 1124028 1123651 1122852 1122323 1121978 1120868 1118181 1114102 1109488 1105075 1101380
50001 1101380 1099014 1098468 1099551 1101484 1103785 1106813 1111402 1118122 1126993 1137766 1150346 1164903 1181509
49988 1181509 1199754 1218886 1238388 1258227 1278529 1299419 1321271 1344661 1369627 1395348 1421069
49977 1421069 1447146 1474745 1504586 1536485 1570122 1605779 1644214 1685998 1730795 1776871 1821357
49966 1821357 1861557 1896158 1924979 1947752 1963815 1973104 1976852 1976907 1974503 1969745 1961802 1949283 1930660
49953 1930660 1904770 1871137 1830076 1782788 1731342 1678137 1625151 1573720 1524909 1479693 1438764
49942 1438764 1402412 1370504 1342191 1315728 1289281 1262181 1235021 1208357 1181863 1154979 1127854
49931 1127854 1101063 1074711 1048274 1021265 993742 966333 940002 915632 893578 873679 855776
49920H55776j5842j3922j2515j1344r692p432n213l422j728R7J638K628L543M883
49906G87455O355P421Q223R270J0460J1245J1675J2468J3916J5375J6135J6272
49894I26270J6214J5849J4572J2176R202O328L689J040j620l970n949q069j0817
49881I74915j3914j6581j8487k0006k1357k1933k0930j8457j5655j3631j2609
49870G81355j2088j1479j0409q750o699m749l297k276j254P0J624L154M471N527
49856G35200O453P637R535J2093J4483J5685J5504J4814J4723J5452J6097J5504
49844H93180J3313J0199P125M463J965n31k680m072m835n534o646q362j0664j3142
49830H73779j4855j4958j3528j1459r441p506n603l972k629j085R33K880M103
$$ plain form
49920 855776 839934 826012 813497 802153 792461 785029 779816 776394 774666 774763 776401 779029 782572 787455
49906 787455 793810 801231 809454 818724 829184 840429 852104 864572 878488 893863 909998 926270
49894 926270 942484 958333 972905 985081 994283 1000611 1004300 1005340 1003720 999750 993801 985732 974915
49881 974915 961001 944420 925933 905927 884570 862637 841707 823250 807595 793964 781355
49870 781355 769267 757788 747379 738629 731930 727181 723884 721608 720354 720424 722048 725202 729673 735200
49856 735200 741653 749290 758825 770918 785401 801086 816590 831404 846127 861579 877676 893180
49844 893180 906493 916692 923817 928280 930245 929714 927034 922962 918127 912593 905947 897585 886921 873779
49830 873779 858924 843966 830438 818979 809538 802032 796429 792457 789828 788743 789676 792556 796659
49817G96659M824N810P259Q669R805J1023J2453J3506J3536J2669J1572J0638
49805I18423R740Q599P053M998K383n87l381n445o704p702r125j1072j2881j3774
$$ plain form
49817 796659 801483 807293 814552 823221 833026 844049 856502 870008 883544 896213 907785 918423
49805 918423 928163 936762 943815 948813 951196 950609 947228 941783 935079 927377 918252 907180 894299 880525
$$ [...]
##END NTUPLES=NMR SPECTRUM
##END=
