
##TITLE=UV1227_M6_1234-1212_90_7231117_pYZuIHwrQY
##JCAMPDX= 6.0         $$ Bruker NMR JCAMP-DX V2.0
##DATA TYPE= NMR SPECTRUM
##DATA CLASS= NTUPLES
##ORIGIN= BRUKER
##OWNER= Administrator
$$ 1.72 TOPSPIN		Version 2.1
$$ 2013-01-18 03:41:38.230 -0500  Administrator@X
$$ Compression mode = diff/dup
##.OBSERVE FREQUENCY= 400.02188249412
##.OBSERVE NUCLEUS= ^1H
##.ACQUISITION MODE= SIMULTANEOUS (DQD)
##.ACQUISITION SCHEME= undefined
##.AVERAGES= 8
##.DIGITISER RES= 22
##SPECTROMETER/DATA SYSTEM= spect
##.PULSE SEQUENCE= zg30
##.SOLVENT NAME= COFFEE_meoh
##.SHIFT REFERENCE= INTERNAL, COFFEE_meoh, 1, 14.98509
##AUDIT TRAIL= $$ (NUMBER, WHEN, WHO, WHERE, PROCESS, VERSION, WHAT)
$$ ##TITLE= Audit trail, TOPSPIN		Version 2.1
$$ ##JCAMPDX= 5.01
$$ ##ORIGIN= Bruker BioSpin GmbH
$$ ##OWNER= Administrator
$$ $$ E:\/data/COFFEE/nmr/UV1227_M6_1234-1212_90_7231117_pYZuIHwrQY/20/pdata/1/auditp.txt
$$ ##AUDIT TRAIL=  $$ (NUMBER, WHEN, WHO, WHERE, PROCESS, VERSION, WHAT)
(   1,<2013-01-18 03:41:30.230 -0500>,<Administrator>,<X>,<go>,<TOPSPIN 2.1>,
      <created by zg
	started at 2013-01-18 03:40:23.840 -0500,
	POWCHK enabled, PULCHK disabled,
       configuration hash MD5:
       86 BA 57 50 F2 9D 5C 9B 26 00 A9 28 5F 66 2E 89
       data hash MD5: 64K
       85 7E 68 25 58 88 E3 95 E4 C7 C3 5B 79 E8 B9 B9>)
(   2,<2013-01-18 03:41:33.308 -0500>,<Administrator>,<X>,<proc1d>,<TOPSPIN 2.1>,
      <Start of raw data processing
       efp LB = 0 FT_mod = 6 PKNL = 1 PHC0 = 0 PHC1 = 0 SI = 32K 
       data hash MD5: 32K
       83 77 6E 77 50 6B 64 01 3B 4F 51 88 DA 1C 0E 4F>)
(   3,<2013-01-18 03:41:33.762 -0500>,<Administrator>,<X>,<proc1d>,<TOPSPIN 2.1>,
      <pk PHC0 = 96.5863 PHC1 = 0 
       data hash MD5: 32K
       F2 49 FE 2A 3C F3 0A E6 4F A4 95 ED B3 81 90 DA>)
(   4,<2013-01-18 03:41:33.996 -0500>,<Administrator>,<X>,<proc1d>,<TOPSPIN 2.1>,
      <abs ABSG = 1 
       data hash MD5: 32K
       E8 1B 14 F1 72 DD 43 9F 64 93 AB 84 74 FA DE E5>)
(   5,<2013-01-18 03:41:34.137 -0500>,<Administrator>,<X>,<proc1d>,<TOPSPIN 2.1>,
      <abs ABSG = 2 
       data hash MD5: 32K
       A4 F4 BF 2E 6C AF 92 E1 64 B2 08 CC B8 E1 CC E8>)
(   6,<2013-01-18 03:41:34.277 -0500>,<Administrator>,<X>,<proc1d>,<TOPSPIN 2.1>,
      <abs ABSG = 3 
       data hash MD5: 32K
       4F 32 52 51 F8 18 4D 72 5A 4C CC 8A 6E 5B 26 EE>)
(   7,<2013-01-18 03:41:34.433 -0500>,<Administrator>,<X>,<proc1d>,<TOPSPIN 2.1>,
      <abs ABSG = 4 
       data hash MD5: 32K
       DF C0 A6 2B DE 88 E6 8B A6 4A 63 1B C7 82 EF 51>)
(   8,<2013-01-18 03:41:34.590 -0500>,<Administrator>,<X>,<proc1d>,<TOPSPIN 2.1>,
      <abs ABSG = 5 
       data hash MD5: 32K
       0B 0D C9 51 E6 36 14 7B 22 73 98 BF B4 EF 02 7D>)
$$ ##END=
$$ 
$$ $$ hash MD5
$$ $$ F2 23 01 0C 34 DE B0 B6 E6 10 48 01 8B CF B6 59
##$RELAX= 
##$RELAX= 
##$RELAX= 
##$RELAX= 
##$RELAX= 
##$RELAX= 
##$RELAX= 
$$ Bruker specific parameters
$$ --------------------------
##$DU= <E:\>
##$EXPNO= 20
$$ [...]
150 150 150 150 150 150 150 150
##$TP07= 0
##$TPNAME0= <>
##$TPNAME1= <>
##$TPNAME2= <>
##$TPNAME3= <>
##$TPNAME4= <>
##$TPNAME5= <>
##$TPNAME6= <>
##$TPNAME7= <>
##$TPOAL= (0..7)
0.5 0.5 0.5 0.5 0.5 0.5 0.5 0.5
##$TPOFFS= (0..7)
0 0 0 0 0 0 0 0
##$TUNHIN= 0
##$TUNHOUT= 0
##$TUNXOUT= 0
##$USERA1= <user>
##$USERA2= <user>
##$USERA3= <user>
##$USERA4= <user>
##$USERA5= <user>
##$V9= 5
##$VALIST= <valist>
##$VCLIST= <CCCCCCCCCCCCCCC>
##$VD= 0
##$VDLIST= <DDDDDDDDDDDDDDD>
##$VPLIST= <PPPPPPPPPPPPPPP>
##$VTLIST= <TTTTTTTTTTTTTTT>
##$WBST= 1024
##$WBSW= 4
##$XGAIN= (0..3)
0 0 0 0
##$XL= 0
##$YL= 0
##$YMAX_a= 689945
##$YMIN_a= -586048
##$ZGOPTNS= <>
##$ZL1= 120
##$ZL2= 120
##$ZL3= 120
##$ZL4= 120
##$ABSF1= 14.98509
##$ABSF2= -5.573092
##$ABSG= 5
##$ABSL= 3
##$ALPHA= 0
##$AQORDER= 0
##$ASSFAC= 0
##$ASSFACI= 0
##$ASSFACX= 0
##$ASSWID= 0
##$AUNMP= <proc_prof1d_extract_pilot.lims>
##$AXLEFT= 0
##$AXNAME= <>
##$AXNUC= <1H>
##$AXRIGHT= 0
##$AXTYPE= 0
##$AXUNIT= <>
##$AZFE= 0.1
##$AZFW= 0.1
##$BCFW= 0
##$BC_mod= 0
##$BYTORDP= 0
##$COROFFS= 0
##$CY= 15
##$DATMOD= 1
##$DC= 0
##$DFILT= <>
##$DTYPP= 0
##$F1P= 0
##$F2P= 0
##$FCOR= 0.5
##$FTSIZE= 32768
##$FT_mod= 6
##$GAMMA= 0
##$GB= 0
##$INTBC= 1
##$INTSCL= 1
##$ISEN= 128
##$LB= 0
##$LEV0= 0
##$LPBIN= 0
##$MAXI= 10000
##$MC2= 0
##$MEAN= 0
##$ME_mod= 0
##$MI= 0
##$NCOEF= 0
##$NC_proc= -8
##$NLEV= 6
##$NOISF1= 0
##$NOISF2= 0
##$NSP= 0
##$NTH_PI= 0
##$NZP= 0
##$OFFSET= 14.98509
##$PC= 1
##$PHC0= 96.5863
##$PHC1= 0
##$PH_mod= 1
##$PKNL= yes
##$PPARMOD= 0
##$PPDIAG= 0
##$PPIPTYP= 0
##$PPMPNUM= 2147483647
##$PPRESOL= 1
##$PSCAL= 4
##$PSIGN= 0
##$PYNMP= <proc.py>
##$REVERSE= no
##$SF= 400.02
##$SI= 32768
##$SIGF1= 0
##$SIGF2= 0
##$SINO= 400
##$SIOLD= 32768
##$SPECTYP= <>
##$SREGLST= <1H.CDCl3>
##$SSB= 0
##$STSI= 32768
##$STSR= 0
##$SW_p= 8223.68421052631
##$SYMM= 0
##$S_DEV= 0
##$TDeff= 65536
##$TDoff= 0
##$TI= <>
##$TILT= no
##$TM1= 0
##$TM2= 0
##$TOPLEV= 0
##$USERP1= <user>
##$USERP2= <user>
##$USERP3= <user>
##$USERP4= <user>
##$USERP5= <user>
##$WDW= 1
##$XDIM= 32768
##$YMAX_p= 476274176
##$YMIN_p= -780066
##$CURPLOT= <Network HP LaserJet P1505>
##$CURPRIN= <$Network HP LaserJet P1505>
##$DFORMAT= <normdp>
##$LAYOUT= <+/1D_H.xwp>
##$LFORMAT= <normlp>
##$PFORMAT= <normpl>
##$SURQMSG= 1
$$ End of Bruker specific parameters
$$ ---------------------------------
##NTUPLES= NMR SPECTRUM
##VAR_NAME=  FREQUENCY,     SPECTRUM/REAL,   SPECTRUM/IMAG
##SYMBOL=    X,             R,               I
##VAR_TYPE=  INDEPENDENT,   DEPENDENT,       DEPENDENT
##VAR_FORM=  AFFN,          ASDF,            ASDF
##VAR_DIM=   32768,         32768,           32768
##UNITS=     HZ,            ARBITRARY UNITS, ARBITRARY UNITS
##FACTOR=    0.250966925370066, 1,           1
##FIRST=     8223.43324360094, 115842,       -177530
##LAST=      0,             -87948,          -206288
##MIN=       0,             -780066,         0
##MAX=       8223.43324360094, 476274176,    0
$$ Real data points
##PAGE= N=1
##DATA TABLE= (X++(R..R)), XYDATA
$$ [...]
19555a18792j55987O7608j44277B44165b90242h6193F4199B1293f1920j47612
19545b09532E5664K3693a54109e8924q0200A5195a07587m5990d7211A30257b32984
19533d15788e7229q9312m1444A32331K022b03114G8246J21837E1535O8267e89469
19521b38265j11649J73592A69772b80834i7262p2033g4965F0759b04911K8258
19511a76653C59161A41693b8719k85468J41116M1967o2321B36322F0463i2227
19500c54400J33539G6508a99863A83630c8079j55149N822m0231H4499a2569r5814
19489a08383p5174h8353A24817M5855e8580l07689a44737M5628k34144J55771
19479a77482c7380H8263Q9791r202b49062H7643a17693e1693m3076D539a94474
$$ plain form
19555 -118792 -274779 -207171 -351448 244165 -290242 -86193 64199 21293 -61920 -209532
19545 -209532 55664 79357 -154109 -58924 -139124 15195 -107587 -153577 -47211 130257 -232984
19533 -415788 -57229 -146541 -187985 132331 134353 -203114 78246 200083 51535 119802 -589469
19521 -238265 -349914 -176322 169772 -280834 -97262 -169295 -74965 60759 -204911 -176653
19511 -176653 359161 141693 -28719 -314187 -173071 -131104 -193425 236322 60463 -92227
19500 -354400 -220861 76508 -199863 183630 -38079 -193228 -187406 -227637 84499 -12569 -108383
19489 -108383 -183557 -88353 124817 170672 -58580 -366269 -144737 -99109 -333253 -177482
19479 -177482 -37380 88263 178054 168852 -249062 87643 -117693 -51693 -94769 4539 -194474
19467a26388a050m03699J74549a9268A43301b42821F6598o994K47496a48331D3095
19455d5751j35638b7777B13193A1754O8815a35111A41574B8968b55141a7066p6579
19444i3645l1428J6812F763O8400c08110A01669a57556a6704p5037F3150c08015
19432a71177L7778A51082i1435j38484a09857E1466K50582a7243A7573a5553r575
19421b5128k93314b3830q5539A46589C0062b71132A50823o5732a4145A18087O6262
19410A84349K8446b28317i3704E3527b65346I0349I634J99166d50039J85240c1399
19398B02431B6991J01551d2145j46812r8269i4973G2793J27343a1747A89146d4869
19386c71874P6916M550N8524m3593c9130j30102j70850h7531j21818A87168a83415
$$ plain form
19467 -126388 -1050 -404749 -230200 -19268 143301 -242821 66598 59604 307100 -148331 43095
19455 -45751 -181389 -27777 213193 11754 80569 -135111 141574 28968 -255141 -17066 -93645
19444 -93645 -125073 -108261 6763 75163 -308110 101669 -157556 -16704 -91741 63150 -308015
19432 -171177 -133399 151082 -91435 -229919 -109857 51466 302048 -17243 17573 -15553 -25128
19421 -25128 -318442 -23830 -109369 146589 30062 -271132 150823 85091 -14145 118087 184349
19410 184349 212795 -228317 -93704 53527 -265346 90349 9634 208800 -450039 -264799 -31399
19398 202431 26991 128542 -42145 -188957 -287226 -94973 72793 200136 -11747 189146 -44869
19386 -371874 -294958 -290408 -231884 -275477 -39130 -169232 -340082 -87531 -209349 187168 -183415
19374i7199l4959K4685D2792J0119Q876b33162e7811k23184b4704m0473r8792
19363a63969l3803A91382B9280K25307B2723a7680H1021k8303K02946A23118m6484
19352G6634c7841o5011k29608J31045E5537e5311k88734K8716J41134G2520i3309
19340c22483G72J99547M1240d3611G7184N9913a68244D3579b64923J5874Q4492
19329a64557d7611A12636d36182A07503c44330C6143b93420Q195A86642p6339
19319A10303R7182a49247M8540j05469C4496b16957A93544b36995C489b9393k27264
19308b56657A83447C7894A3642a14249D8000N0154j7800a56112j3131N4066b6489
19296B4349c29418e9536j788j61230R0531j05757A73116h1803j2662j44241L9082
$$ plain form
19374 -97199 -132158 -107473 42792 52911 61787 -233162 -57811 -280995 -24704 -65177 -163969
19363 -163969 -197772 191382 29280 254587 22723 -17680 81021 52718 255664 123118 76634
19352 76634 -37841 -102852 -332460 -201415 55537 -55311 -344045 -315329 -174195 72520 -93309
19340 -322483 772 200319 241559 -43611 77184 137097 -168244 43579 -264923 -249049 -164557
19329 -164557 -47611 112636 -436182 107503 -344330 36143 -293420 -285225 186642 110303
19319 110303 207485 -149247 -100707 -206176 34496 -216957 193544 -236995 3489 -29393 -256657
19308 -256657 183447 37894 13642 -114249 48000 98154 80354 -156112 -169243 -115177 -26489
19296 24349 -329418 -59536 -61324 -222554 -132023 -237780 173116 -81803 -94465 -238706 -199624
19285a99624k3672f3234I4866j3416a87031c4935C19843a29722B08746i2836p4935
19274a67771A0308a73947A47840b02544B88017h5487B4023L4973d13215a49567
19263A65467a82565A92372a86291O0840j99335f534B93294a74724A36751F6732
19252F2890a10265j5165C2259b79889G2546m669J3217M7207a17394b0182H4098
19240D4919b38346I4674b37405a07983k39119E0092i6448d0271A00595a22656
19229a90933L8819A3216a58464A80163A496K1787b03409a8572I5807g7077E8034
19217a2317j99272i4372r2333D5693b37803h3410A07580h1117H6152e0714j09865
19206a60579h0180a8782F6009k9067J6530a47847A69794j3267b02534j335n4132
$$ plain form
19285 -199624 -223296 -63234 94866 81450 -187031 -34935 319843 -129722 208746 -92836 -167771
19274 -167771 10308 -173947 147840 -202544 288017 -85487 24023 58996 -413215 -149567
19263 165467 -182565 192372 -186291 -125451 -324786 -6534 293294 -174724 136751 66732
19252 62890 -110265 -125430 32259 -279889 72546 67877 81094 128301 -117394 -20182 84098
19240 44919 -238346 94674 -237405 -107983 -347102 50092 -96448 -40271 100595 -122656
19229 -190933 -152114 13216 -158464 180163 1496 23283 -203409 -18572 95807 -77077 58034
19217 -12317 -211589 -94372 -186705 45693 -237803 -83410 107580 -81117 86152 -50714 -160579
19206 -160579 -80180 -18782 66009 36942 53472 -147847 169794 156527 -202534 -203869 -258001
19195b58001K0527c7513j43009B38549a08938B4076c79051D7491f0830l71425
19185d32255C9435a95614j9942a8138A63630d03875J00659A71138O7438e4517
19174C9286M3148b46924g4961A20248c9837r1229A66626P1952j15130j7725C7257
19162a19307j35094k6488A5432d07926i4121D31133a07884b5980C9378F818K95675
19151C02493l0851b07052e346C30703e9223m01865g324A1470b77860c1661l5126
19140f6787r4412l27581b38500b3750j2540I118J17875c682C59344c4493l49871
19129c84364D3709a37119p1629A53638d12265D2610n907a78816e7470k12047B7267
19117F2627b40995j74047J03429j1549G6680C1543a82118P3799k01180a06456
$$ plain form
19195 -258001 -237474 -37513 -180522 238549 -108938 24076 -379051 47491 -60830 -432255
19185 -432255 39435 -195614 -215556 -18138 163630 -403875 -303216 171138 238576 -54517
19174 39286 82434 -246924 -74961 120248 -39837 -131066 166626 238578 123448 105723 37257
19162 -119307 -254401 -280889 15432 -407926 -94121 431133 -107884 -25980 39378 6818 302493
19151 302493 271642 -207052 -5346 330703 -59223 -461088 -7324 11470 -277860 -31661 -66787
19140 -66787 -161199 -488780 -238500 -23750 -36290 9118 126993 -3682 359344 -34493 -384364
19129 -384364 43709 -137119 -208748 153638 -412265 42610 36703 -178816 -57470 -269517 27267
19117 62627 -240995 -415042 -311613 -323162 76680 31543 -182118 -108319 -309499 -106456
19106b76567c4314C52618A70178m8330E4331q872K5581d83221g5511A48078a41545
19094E2868N3359d93552a27078k6764c9018A79021c53237A96003b36933D27858
19083d9056A23462a10581A58471g7902j34044G2944b57480A17724a63371k37802
19073d01173a39317m1092F7522j0784d3700j26156A114J49865K7901a81550A29850
19061a35787M6005j54090J4743B77434c1554k31321D2227L3561i4604A53926b52273
19049F6350h578r379j65427g9187C3235f2905j6751k26811A98716m9240d5645
19037b96333j35080K12447M5895q0579R7610B90908a81332B65695f8392B3368
19026a78284f1482j20507A37968A473J38816m5368e4439B77614A25808h5275O405
$$ plain form
19106 -276567 -34314 352618 170178 121848 54331 45459 71040 -483221 -75511 148078 -141545
19094 52868 106227 -493552 -127078 -153842 -39018 179021 -353237 196003 -236933 427858
19083 -49056 123462 -110581 158471 -77902 -211946 72944 -257480 117724 -163371 -401173
19073 -401173 -139317 -180409 67522 56738 -43700 -169856 1114 150979 178880 -181550 129850
19061 -135787 -89782 -243872 -229129 277434 -31554 -262875 42227 75788 -94604 153926 -252273
19049 66350 -8578 -17957 -183384 -79187 33235 -62905 -79656 -306467 198716 149476 -45645
19037 -296333 -431413 -218966 -173071 -253650 -156040 290908 -181332 265695 -68392 23368
19026 -178284 -61482 -181989 137968 1473 140289 94921 -54439 277614 125808 -85275 -78870
19015g8870j55221F6828J8819a19785c7955I487b02144A29134a53375j93093D1255
19003G3084A9206c004j37194A07291A2595g48888A16907J10321b13719B2622c3617
18991b95574a20502b2187m8982B00366D3140f7557k6924j22590j70912A39021
18980A62640f3388j9632j54766B26448B1012J3875f2497m72739a79403Q2055A12386
18968c9481k01403N4144B94127b75380C1083d2870l082G1939Q1572h4808j01112
18957a85920A77702n0062d4330k0801A06262k5069b28766N1313l0469A65261C1575
18945c18922A62087Q3474a41633A08441d3640j34530e2474r1604K5580k0439D1885
18933g3424b7514k45379A89459o5418b07918i8477p493a5744G2855b13758m4337
$$ plain form
19015 -78870 -234091 66828 85647 -119785 -37955 9487 -202144 129134 -153375 -346468 41255
19003 73084 19206 -3004 -140198 107291 12595 -748888 116907 227228 -213719 22622 -33617
18991 -295574 -120502 -22187 -71169 200366 43140 -67557 -94481 -217071 -387983 139021
18980 162640 -63388 -83020 -237786 226448 21012 34887 -62497 -535236 -179403 -97348 112386
18968 -39481 -240884 -186740 294127 -275380 31083 -42870 -45952 71939 153511 -84808 -185920
18957 -185920 177702 127640 -44330 -65131 106262 81193 -228766 -177453 -207922 165261 31575
18945 -318922 162087 245561 -141633 108441 -43640 -178170 -52474 -144078 -118498 -138937 41885
18933 -73424 -27514 -272893 189459 124041 -207918 -98477 -105970 -15744 72855 -213758 -258095
18922b58095B26718b58766N6408o3639a22196B7472M16348a54132A27242c76240
18911D7497d6156B04947a87533A5942a93481a7651m4877A08260a18708I4143a4407
18899a58805I8505c81706g4894H2112P9570O2064d16315A68566J7483J28845c7315
18887A03043M399a52726M1387H9514f453m8652d091j52768j78134B27377a28503
18875A52380a4516j63367h1414Q822B8050K98643F8635J70452c74548A16526a00329
18863a10961q3841g984n5163E9903c54387J47049k6550F9978b24709B42181a9342
18851D7034b52393j56042A49285d6619E2259b65953j4840E2953a54871O9863O541
18840g8467m5126L8997k09136a07754J2299p2255j34668a9903n47352A0584h2041
$$ plain form
18922 -258095 226718 -258766 -202358 -265997 -122196 27472 443820 -154132 127242 -376240
18911 47497 -46156 204947 -187533 15942 -193481 -17651 -62528 108260 -118708 94143 -14407
18899 -158805 98505 -381706 -74894 82112 161682 223746 -416315 168566 186049 314894 -37315
18887 103043 107442 -152726 -111339 89514 -6453 -55105 -4091 -156859 -334993 227377 -128503
18875 152380 -14516 -177883 -81414 -72592 28050 326693 68635 239087 -374548 116526 -100329
18863 -110961 -194802 -7984 -63147 59903 -354387 -207338 -233888 69978 -224709 242181 -19342
18851 47034 -252393 -408435 149285 -46619 52259 -265953 -280793 52953 -154871 -85008 -78467
18840 -78467 -123593 -84596 -293732 -107754 -95455 -167710 -302378 -19903 -567255 10584 -82041
18828a56688F5326L4211f5928B14637d8220A62131c02633B71467g1680C4191d6210
18816b88723A46048i199B52479a51387j22770C2102L33047H9309J62177M6776
18806B98262b9162H6990c44925A00533c35946a34603C12621c11184h2347r1435
18796a73782A64535a91588j35248i3692b9544A3775J35024d87418J03877G2697
18785b3193r713j92013N6498N3691C07655H2256d5628r9675B56799a00949q5777
18774a86726o8345q0639A92672a8551G7344a89292e8843I3457a33362f4047C8022
18762c9201j7110j96552p2397J31272a0104I453a50669G5435K1318J86183H7850
18750A79889D8634F166a681A69308p2116j5934L178c05819d2290k5615k02821
$$ plain form
18828 -156688 65326 99537 -65928 214637 -48220 162131 -302633 271467 -71680 34191 -46210
18816 -288723 146048 -9199 252479 -151387 -274157 32102 365149 89309 251486 298262
18806 298262 -29162 86990 -344925 100533 -335946 -134603 312621 -311184 -82347 -173782
18796 -173782 164535 -191588 -326836 -93692 -29544 13775 148799 -487418 -383541 72697
18785 -23193 -32906 -224919 -168421 -114730 307655 82256 -45628 -145303 256799 -100949 -186726
18774 -186726 -255071 -335710 192672 -18551 77344 -189292 -58843 93457 -133362 -64047 38022
18762 -39201 -56311 -252863 -325260 -193988 -10104 9453 -150669 75435 96753 282936 87850
18750 179889 48634 6166 -1681 169308 97192 81258 84436 -305819 -42290 -67905 -270726
18739b70726G1083b03779l8129q6080f9567D2438c74835A21555L2059a34337m6012
18728a80349A13311J70000O155N7663f3075k56577a06987j99512E1160b10813
18717A25251K4864c6871k7300r3559A9718a0180I4959c04083H19K4765O0137K8450
18705A14171c8201g498j56015E1323J40667p1580J30448a84830q0985a25996j10873
18694b36869Q8837F8258A7391a17850k76443C9516J12179b6606k32950D3140J98600
18683B41740F8006a86479A3571L7774d7347l41862F0272g6949B2583c58652G9728
18671F258a54197j40837l390C28641a72480Q3836k79160J01757B5017a34984j77236
18660c12220B72921q7057b82635Q0432a1971B2672d4529A47958a65820A25684
$$ plain form
18739 -270726 71083 -203779 -241908 -327988 -69567 42438 -374835 121555 153614 -134337 -180349
18728 -180349 113311 283311 289466 347129 -63075 -319652 -106987 -306499 51160 -210813
18717 125251 150115 -36871 -64171 -157730 19718 -10180 94959 -304083 819 25584 85721 114171
18705 114171 -38201 -7498 -163513 51323 191990 120410 250858 -184830 -265815 -125996 -236869
18694 -236869 -148032 68258 17391 -117850 -394293 39516 151695 -26606 -259556 43140 241740
18683 241740 68006 -186479 13571 51345 -47347 -389209 60272 -76949 22583 -358652 79728
18671 6258 -154197 -295034 -298424 328641 -172480 -88644 -367804 -266047 25017 -134984 -312220
18660 -312220 272921 185864 -282635 -202203 -11971 22672 -44529 147958 -165820 125684
18649f3766k08960I2917B0369c39770c861l10941O5601a09248H7910a3649r2364
18638a06013C1286P0011a77963B42926E7997b67582A04975b0650j29042j76256
18628c25948J43102j33909B24036c23997f0222j60320k2933m8121A28375b64915
18617B77100a13303b3669D2002K56625F9870L356a28184M1718k73052h4735j10960
18606a95695M4490p5815b1077D0237j5032f1060j4437B9870b16153d427j6360
18595b0787p2491P978A8823c08255q4057i009D122c66557h7724m02865B76252
18583A48468j6280o1904b72786m3157a45212j06240j44765N1534I3871c11981
18572a88640a1669B04666b98168B1861M3715b59k51584a25472o4887B27909a5729
$$ plain form
18649 -63766 -272726 92917 20369 -339770 -3861 -314802 -249201 -109248 87910 -13649 -106013
18638 -106013 31286 101297 -177963 242926 57997 -267582 104975 -20650 -149692 -325948
18628 -325948 -182846 -316755 224036 -323997 -60222 -220542 -243475 -291596 128375 -264915
18617 277100 -113303 -23669 42002 298627 69870 73226 -128184 -86466 -359518 -84735 -195695
18606 -195695 -151205 -227020 -21077 40237 25205 -61060 -75497 29870 -216153 -4427 -20787
18595 -20787 -93278 -85300 18823 -308255 -392312 -9009 4122 -366557 -87724 -490589 276252
18583 148468 132188 70284 -272786 -315943 -145212 -251452 -396217 -344683 93871 -311981
18572 -188640 -11669 204666 -298168 21861 65576 -259 -251843 -125472 -190359 227909 -15729
18560c65943o2473f1728A53300b42501c4246B08002b76497d7262k01487F8079
18549c43837C06i2166k2076N4929A10209J50574D380a1857A33282c0112l06541
18538c36653B51411c4463j40506l9247A5483c1323n7659c9560m1675B65922b31125
18526b51991N6822a9405j76561a6316l40750E1892d4886K1740E3533d258n4259
18515e8517j94228c1865k86454A14322a60565F8962i1751B69655H1157b9946B5994
18503A67113a81366c2161i849A55550o9574b20900D518a03902j053j13219C23060
18491h8553j26479h5888k78999C3615J69971A1841M2565a44612a7660B27434c27912
18479E7177d8895G6158N8905e4817E9218A0260M5629I245a45512A52925f3990
$$ plain form
18560 -365943 -428416 -61728 153300 -242501 -34246 208002 -276497 -47262 -248749 68079
18549 -343837 306 -92166 -114242 -59313 110209 260783 4380 -11857 133282 -30112 -336653
18538 -336653 251411 -34463 -174969 -214216 15483 -31323 -88982 -39560 -81235 265922 -231125
18526 -251991 -195169 -19405 -195966 -16316 -357066 51892 -44886 -23146 53533 -4258 -58517
18515 -58517 -252745 -31865 -318319 114322 -160565 68962 -91751 269655 81157 -29946 25994
18503 167113 -181366 -32161 -9849 155550 85976 -220900 4518 -103902 -104955 -218174 323060
18491 -88553 -215032 -85888 -364887 33615 203586 11841 54406 -144612 -17660 227434 -327912
18479 57177 -48895 76158 135063 -54817 59218 10260 55889 9245 -145512 152925 -63990
18467b04268i3671B64509l6653a56320k1912A67924C7927d19710j34825b29431
18456b59038g2130J008o9j39732D186a46489B5725J23937n303d8895R944A68996
18443a96110B82424D0165a16956c3573B20183G957c8108H3882h4438l02199c4021
18431c36424J02092d2684p075o9200N8688B9194b32510K5640a8087j76306l04589
18420d98982a75301B20234D1783A1337P8113K5643a40940I3687a4279G7966a3254
18408a84807m1833P0606P0264k76035a09487B42909a20566A27309C2248h4924
18397A31270a21902M0611j391L1127k8297B738b7966A51483f8317k69736J62928
18386a75125j61559j4858f0620A29142M4549m3412b15430P4014q8235O3637A17607
$$ plain form
18467 -204268 -93671 264509 227856 -156320 -178232 167924 37927 -419710 -554535 -229431
18456 -259038 -72130 -71122 -71191 -210923 4186 -146489 25725 149662 144359 -48895 -38951 168996
18443 -196110 282424 40165 -116956 -33573 220183 7957 -38108 83882 -84438 -386637 -34021
18431 -336424 -234332 -42684 -49759 -118959 -60271 29194 -232510 -206870 -18087 -194393 -498982
18420 -498982 -175301 220234 41783 11337 89450 115093 -140940 93687 -14279 77966 -13254
18408 -184807 -226640 -156034 -85770 -361805 -109487 242909 -120566 127309 32248 -84924
18397 131270 -121902 -81291 -82682 -51555 -79852 2738 -27966 151483 -68317 -338053 -175125
18386 -175125 -336684 -351542 -60620 129142 173691 130279 -215430 -141416 -229651 -166014 117607
18374G3663a85242f129j90593j27289a9537C1218g6256F5880i43k10837D8933
18362B03871a60876P7424D1836p334d8648l72211J79402e3195p8622B04092C2420
18350A04232a62690K9764j60267a9816A57677C5621f9265k93962e16j12752o2798
18339a76066C1864b74956A24492g7221j20492D6727h8229C9466a38274A81314
18328b07329e8851A5505M2744i161A15337a25190A66847a64841j35961A86038
18317h1143G6322b8112j76548Q2007l0980j00103a02384A17065B6046J73974I9435
18305a06642j33549A19885g1921G3767Q653J98478A15288J19615a49146f6636
18294a03923G7151a15421J8424b7608A28756a7390H8206K6350r523A451b43224
$$ plain form
18374 73663 -185242 -6129 -196722 -324011 -19537 31218 -76256 65880 -943 -211780 48933
18362 203871 -160876 -83452 41836 34502 -48648 -420859 -241457 -53195 -131817 204092 32420
18350 104232 -162690 -132926 -293193 -19816 157677 35621 -69265 -363227 -516 -113268 -176066
18339 -176066 31864 -274956 124492 -77221 -197713 46727 -88229 39466 -138274 181314
18328 -207329 -58851 15505 58249 -9161 115337 -125190 166847 -164841 -300802 186038
18317 -81143 76322 -28112 -204660 -122653 -153633 -253736 -102384 117065 26046 200020 99435
18305 -106642 -240191 119885 -71921 73767 82420 280898 115288 234903 -149146 -66636
18294 -103923 77151 -115421 -96997 -27608 128756 -17390 88206 114556 105033 1451 -243224
18282A00883c09510J35839D48180A40797a87977A03372c199H587K36919c36604
18271h7789j2827E0392P3855c95692c0955A47800a4976j09600B80837A17150f5341
18259a9699j12542K3527o1815O1475H2281b07948e9856r500E84a95042B36226
18247f1193B30489I7800e3961j60868f1912k11052A59440d22493B7476h2057k0490
18236a02547j85271I7976c30484J12249J08143g310p6443j00228E930b22069A51232
18224H363R5483c29681C24571c5956C28811e0298H1957b63108p341J19444C70066
18212i7636j07769p7551A28175P1100c9942O401A81761a71311b0738C03728a69395
18200B00911a40614B14772J43202A19482a71826f8504D0565p25d50509B57633
$$ plain form
18282 100883 -309510 -173671 448180 140797 -187977 103372 -3199 8587 245506 -336604
18271 -87789 -100616 50392 124247 -395692 -30955 147800 -14976 -124576 280837 117150 -65341
18259 -19699 -132241 -108714 -170529 -109054 82281 -207948 -59856 -69356 584 -195042 236226
18247 -61193 230489 97800 -53961 -214829 -61912 -272964 159440 -422493 27476 -82057 -102547
18236 -102547 -287818 97976 -330484 -218235 -110092 -7310 -83753 -183981 5930 -222069 151232
18224 8363 103846 -329681 324571 -35956 328811 -50298 81957 -263108 -270449 -151005 370066
18212 -97636 -205405 -282956 128175 199275 -39942 -33541 181761 -171311 -20738 303728 -169395
18200 200911 -140614 214772 357974 119482 -171826 -68504 40565 39840 -450509 257633
18189A95766a6450k5053j72316j96307A3027e1624k952A10126D8246J98057a4352
18177E2169k269J2127c19521O6384P8788B61689E599b914n29007A60135C34a67478
18164a45571M1808m6829K1564a9842A9558K35380b46104n8594h847I2816L88476
18153D81292A2779K31632F4974N6109J7930D3920J87311E4971B0388a40663N0016
18142i0647n0351C6589g208k49238F6416b82888b1547j23722n7763R0186N3682
18131e9164p7500j14633a02275c368B10408M6972i6869B07381H533a67986A31633
18119a75217E06136D6760K75112a49254c7603n9360I892a01080j15531E05979
18108b6392A92933a02186M5388A04566L6488L68787A66313b82427G1992i3199
$$ plain form
18189 195766 -16450 -41503 -213819 -410126 13027 -51624 -54576 110126 48246 246303 -14352
18177 52169 49900 62027 -319521 -253137 -174349 261689 5599 -2914 -531921 160135 334 -167478
18164 -145571 -103763 -150592 -129028 -19842 19558 254938 -246104 -304698 -8847 92816 481292
18153 481292 12779 244411 64974 121083 139013 43920 231231 54971 20388 -140663 -90647
18142 -90647 -140998 36589 -7208 -256446 66416 -282888 -21547 -145269 -203032 -112846 -59164
18131 -59164 -136664 -251297 -102275 -3368 210408 257380 -96869 207381 8533 -167986 131633
18119 -175217 506136 46760 321872 -149254 -37603 -96963 9892 -101080 -216611 505979
18108 -26392 192933 -102186 -56798 104566 141054 509841 166313 -282427 71992 -93199
18097a03366j54594A8987N542b66089a3166D3104o231R5644A8513f0339A58877
18085C95466A9448J94425f15900H6795E090K16389e5904b5686E1402c75737C68864
18073F9039a70789K1886f6016A00773b48917c4591A89578a79661B04828B1578
18062F3104l016J26589a74647M9698j29826C40080a74239k4162L8918p9174O2331
18051a76326A39376J97516a14365l1047N1898F4522O645d3173e085j18368n0874
18040a74327b6992m2504A19289J0660h1746j75433j0215I278a7536l3559B28182
18028I5044L6421a2467o199f723j94733q922R1000B6175J10711K3159i3732b6903
18015B71000a76119r355B75510C5587a9127C34620A20054J53566j32945i7777
$$ plain form
18097 -103366 -257960 18987 24529 -266089 -13166 43104 36873 132517 18513 -60339 158877
18085 395466 19448 213873 -615900 86795 5090 221479 -55904 -25686 51402 -375737 368864
18073 69039 -170789 -148903 -66016 100773 -248917 -34591 189578 -179661 204828 21578
18062 63104 60088 186677 -174647 -124949 -254775 340080 -174239 -198401 -159483 -238657 -176326
18051 -176326 139376 336892 -114365 -145412 -93514 64522 71167 -43173 -5085 -123453 -174327
18040 -174327 -26992 -69496 119289 129949 -81746 -257179 -267394 9278 -17536 -51095 228182
18028 95044 131465 -12467 -18666 -6723 -201456 -210378 -119378 26175 136886 160045 -93732 -26903
18015 271000 -176119 -185474 275510 35587 -19127 334620 120054 273620 140675 -97777
18004f7121K3762C3345c60279K0721b8542A9154L32377b77452G1223h8202j90503
17993b78705H9372N3434E6928b11449k0696k5415j57049K03198O5482m3063A74793
17981C6312J63615C5823b06245k9511B62581b95664J33429G9352J76428r7704
17971A58076f616B14804a6109k8392D9544b03062M0304K8051B00798e54241G1848
17959B56344B1242J84256e77929f8665C3755c7411I1858M41933g5684b3794l76945
17948d00739K00164L5218F3534a06514l9405C05577n6002f1433E8559a60465C0875
17936c4851k38322q6898R5486J1394F6975j5050b52194G555b6649l06270B0344
17924d1623F6404h5002F7947J59633J7299r1560L08172A75191c36901k7868H2853
$$ plain form
18004 -67121 -43359 33345 -360279 -339558 -28542 19154 351531 -277452 71223 -88202 -278705
17993 -278705 89372 142806 56928 -211449 -232145 -257560 -414609 -211411 -145929 -188992 174793
17981 36312 199927 35823 -206245 -235756 262581 -295664 -162235 79352 255780 158076
17971 158076 -6616 214804 -16109 -44501 49544 -203062 -162758 -134707 200798 -554241 71848
17959 256344 21242 205498 -577929 -68665 33755 -37411 91858 533791 -75684 -23794 -400739
17948 -400739 -200575 -165357 63534 -106514 -145919 305577 249575 -61433 58559 -160465 30875
17936 -34851 -273173 -360071 -264585 -253191 66975 51925 -252194 7555 -26649 -332919 20344
17924 -41623 66404 -85002 67947 227580 244879 153319 461491 175191 -336901 -364769 82853
17912I1179O3001J9390B8595J30748c57584I0159r575Q841m3290d0433k41015
17901b81448J31819F6974k1048c5379k9468B9559K89526j15226E3431a6179C26153
17889b10265B43156a7812G644d8363j62431b6636A8849a77126h17o5531A811R1833
17877I3644d9245B93026a74674B54238c8318A03268e847k83733P5724h6872A78326
17865a83964L3402B32186i2067j66307k1788A49268a41436A46716O8171A01952
17854b2796q8935D2724f9914B24370p2849m4964M8276K23753A12148a21288A29431
17842B94414G6227J60389i8266A57215a10870A77334c08895F774K4942b36759
17831A69922f2918J6451B446g2815A68613g4186q3846A33635e32408K15563H0545
$$ plain form
17912 91179 154180 173570 28595 159343 -357584 90159 80584 89425 46135 -40433 -281448
17901 -281448 -149629 66974 45926 -35379 -64847 29559 319085 203859 53431 -16179 326153
17889 -210265 243156 -17812 7644 -48363 -210794 -26636 18849 -177126 -817 -66348 1811 93644
17877 93644 -49245 293026 -174674 254238 -38318 103268 -5847 -289580 -213856 -86872 178326
17865 -183964 -150562 232186 -92067 -258374 -280162 149268 -141436 146716 214887 101952
17854 -22796 -111731 42724 -69914 224370 151521 106557 154833 378586 112148 -121288 129431
17842 294414 76227 236616 -98266 157215 -110870 177334 -308895 6774 31716 -236759
17831 169922 -62918 -46467 2446 -72815 168613 -74186 -158032 133635 -532408 -316845 80545
17819b79983B5670h1021G962a50793k7823p0720c9277r9605l04477a71668M7553
17808a24115c7640j82501c8798j33453a5764p1631j89603g5134K3018j8456C16740
17796b13615B10251a16836q0152B03766a41234D009R0072J3585A9506a49927B13075
17784A92049d3513m24620h62A60575a54426N4619K1948b1133D8102n57c8300D5849
17771a80749B50682G6958R231b553j62896D0601b379p7236a3822k6297B08132
17759B51244a419j04427a7749A53299a18855q6379B98637F9744a48992j56237
17749c05229J44521J9670f997A46939A8711c0536l6156J7148A06104K37913c36790
17737A97901a36926d9069M807H4369i0080k87279C358g3561A78420e424j8614
$$ plain form
17819 -279983 25670 -81021 7962 -150793 -178616 -249336 -39277 -138882 -443359 -171668 -124115
17808 -124115 -37640 -220141 -38798 -172251 -15764 -87395 -276998 -75134 -52116 -70572 316740
17796 -213615 210251 -116836 -196988 203766 -141234 4009 94081 107666 19506 -149927 213075
17784 192049 -43513 -468133 -862 160575 -154426 -99807 -77859 -21133 48102 47545 -38300 45849
17771 -180749 250682 76958 86189 -2553 -165449 40601 -2379 -79615 -13822 -40119 208132
17759 251244 -1419 -105846 -17749 153299 -118855 -205234 298637 69744 -148992 -305229
17749 -305229 -160708 -141038 -6997 146939 18711 -30536 -66692 -49544 106104 344017 -336790
17737 197901 -136926 -49069 -44262 84369 -90080 -377359 3358 -73561 178420 -5424 -24038
17726b4038K702D70490k31053A14813Q6385b87937h3881l60043A2049J46588h3504
17714b50285g8058A68490M3911i9786r3727G8626a51889B07233J48330j24697
17704B30866a05657d6832k716D991J62284c57261i1846A1777b8715a2340m1170
17693e3510A86686c1409A76567A0074J37998l2212M4976o3332b11142L6800H1011
17681B87000A02592K00249m7348B5783J65178D1922a27120B2591L31055a54998
17670e2955A56117J15468C1324b1600j44536B01107b32304i3993C76786C4156
17659A20550K01654A24793f3565A38471n5798g4414o633k84244B5616K72469b38293
17647e78A91662a1422p6040A93757F144g1016r5794k4740A68505g7208j77220
$$ plain form
17726 -24038 -21336 470490 239437 114813 201198 -287937 -83881 -443924 12049 158637 -83504
17714 -250285 -78058 168490 212401 -99786 -193513 78626 -151889 207233 355563 230866
17704 230866 -105657 -46832 -49548 4991 167275 -357261 -91846 11777 -28715 -12340 -53510
17693 -53510 186686 -31409 176567 10074 148072 115860 160836 97504 -211142 -174342 81011
17681 287000 102592 302841 255493 25783 190961 41922 -127120 22591 353646 -154998
17670 -52955 156117 271585 31324 -21600 -166136 201107 -232304 -93993 376786 34156
17659 120550 322204 124793 -63565 138471 82673 -74414 -81047 -365291 25616 298085 -238293
17647 -578 191662 -11422 -87462 193757 6144 -71016 -166810 -191550 168505 -77208 -254428
17636b54428L7848B39357J15019O5950b49689j0818B64343A21534O4022d7324
17625a71872A06715L06839e5055K1331A67719f3984j41084D58g9115B37967a26453
17613A43153a83578E4948b351C92614l3656a41633K7596K8692K5330A53544P5133
17602B28677g7408k4549L728j16431B64102i8256D7263L04604c70464A51567k0448
17591A31119a79393M9080B42840C1662M927J1327J30086m0237c09409F8023c6636
17579b17932i6579K8101j68990i2023C5106g0139c1187A85145g9127B84815H1292
17567A79254h8968D751J6861a00399D1957d3430A85581j924a61065J945a6028
17555A1933m391K11112c29565a49894C51221q5848A27118L1824J22572o3489A175
$$ plain form
17636 -254428 -216580 239357 354376 420326 -249689 -260507 264343 121534 185556 -47324
17625 -171872 106715 413554 -55055 -33724 167719 -63984 -205068 458 -79115 237967 -126453
17613 143153 -183578 54948 -2351 392614 358958 -141633 -114037 -85345 -60015 153544 228677
17602 228677 -77408 -101957 -98229 -214660 264102 -98256 47263 351867 -370464 151567 131119
17591 131119 -179393 -130313 242840 31662 36589 47916 178002 137765 -309409 68023 -36636
17579 -217932 -96579 -68478 -237468 -92023 35106 -70139 -31187 185145 -79127 284815 81292
17567 179254 -88968 4751 21612 -100399 41957 -43430 185581 183657 -161065 -159120 -16028
17555 11933 7542 218654 -329565 -149894 351221 265373 127118 158942 281514 218025 1175
17543E5510J65039a6238r8100A70136M8620b27100C0871b72007B53257j15252
17533A38005L3924c5706B99971f3324n1269a2994B68691l623B9906O4882K28524
17522C23312h7485j44484B88069d1783o5812K1639A69919n3998J19412E1697K69757
17511C21454F1711K2497J82602f4992G0430b9857B07624L3601f3408B48647L8506
17500B87153b73921f2916k00681A45455B5640a71020q15B18152p1869J74441m5689
17489B75035r249m1517b9462D551N8129c25203H7835a10601G6922L4782O8756
17478A80460H0152J65451N5226I7443J22299L158G4301h2214B11317n0846A4288
17466B96420j34728F4542K43676e9043n1862e4088j05510A31898b6040B04909
$$ plain form
17543 55510 220549 -16238 -114338 170136 218756 -227100 30871 -272007 253257 138005
17533 138005 171929 -35706 299971 -63324 -114593 -12994 268691 265068 29906 94788 323312
17522 323312 -87485 -231969 288069 -41783 -107595 -85956 169919 115921 235333 51697 321454
17511 321454 61711 84208 266810 -64992 70430 -29857 207624 241225 -63408 248647 287153
17500 287153 -273921 -62916 -263597 145455 25640 -171020 -171835 218152 146283 320724 275035
17489 275035 265786 224269 -29462 4551 62680 -325203 87835 -110601 76922 111704 180460
17478 180460 80152 245603 300829 97443 219742 222900 74301 -82214 211317 160471 14288
17466 296420 161692 64542 308218 -59043 -110905 -54088 -159598 131898 -26040 204909
17455A24784J68793N7429o2292a10682c3952G80562I6315O7294J56551K71904
17445E92064j06966M973I8377g001I6436m1270Q3240J05546L7815M4098m7442
17434B78423j18879K20175a98698C57037A75466a4199A48756Q7274M2326B2090
17423B17699k9010D4210J56290L4007J9458L516J08815j42670K38317O5593k07458
17412C20078e7181m0258P147A71512K19468N0296J07168b70820C82825p5308j19081
17401A88436i4995j78162J07577B57189r31q4056F8389a20088B80585C3197K44200
17390B77397C562j721N4864J35371a03642a0452C15805o0297M7067L08824f8505
17378B23179a17088C62650g2909J4663B96390d08964C22397A31294O2805M9757
$$ plain form
17455 124784 293577 351006 288714 -110682 -33952 780562 96315 163609 320160 592064
17445 592064 485098 490071 98377 -7001 96436 55166 138406 243952 281767 325865 278423
17434 278423 159544 379719 -198698 357037 175466 -14199 148756 236030 278356 22090
17423 217699 188689 44210 200500 234507 253965 257481 366296 223626 461943 527536 320078
17412 320078 -57181 -97439 -90292 171512 390980 441276 548444 -270820 382825 307517 188436
17401 188436 -94995 -273157 -165580 257189 256258 172202 68389 -120088 280585 33197 277397
17390 277397 3562 1841 56705 192076 -103642 -10452 315805 255508 302575 611399 -68505
17378 223179 -117088 362650 -72909 -58246 296390 -408964 322397 131294 194099 243856
17368B43856M9557K40j03553q6336B5854h7588C98135a88948B20442N9435B7667
17356G656K61146c1923m5218F1515B3550L48449n1125A1210J25514g1383C43989
17344A96216L31289a90551B45712r3657K59929A52957a69237A36314L67876a1284
17333B7824J00395L12496k06682q3986F1629b1657A70333J46801l4614r032E6893
17321B31969B9442K62851r5067M6588m2385D9043n940O7444B1606C835L80294
17310C84129F2619M36727a54417C42336C9017L78440L1635j52671H1481K88048
17300C69529N0094B7827J43616p191J66292r0069J05759c8220C1008L71097E7702
17288A12772l0277C8141J40724H3144R8487n7229O7923p6738N5677h8548C53316
$$ plain form
17368 243856 293413 293653 190100 103764 25854 -87588 398135 -188948 220442 279877 27667
17356 7656 268802 -31923 -77141 61515 23550 371999 320874 11210 136724 -71383 343989
17344 196216 527505 -190551 245712 152055 411984 152957 -169237 136314 504190 -11284
17333 27824 128219 440715 234033 150047 61629 -21657 170333 317134 282520 273488 56893
17321 231969 29442 292293 197226 243814 201429 49043 43103 110547 21606 3835 384129
17310 384129 62619 499346 -154417 342336 39017 417457 449092 296421 81481 369529
17300 369529 419623 27827 171443 164252 330544 240475 346234 -38220 31008 402105 57702
17288 112772 82495 38141 178865 83144 181631 124402 192325 115587 171264 -88548 353316
17276a02008C73149D3228K71819b2870J0360j40969B14650R7659A02622b2637
17265E00494B27645H4544M26901F8848J70810j11390O2353M5632K4867o2094R4795
17254B93821A14520J39514N2218C1656j2577J86459P0495L8535K9275M1838A15034
17242D68904B18161n2615R9047a06281B39273L2404E820M48608A34876J57189
17232B92065A44564J14451K18591r5729j4315K0632r7529A26645M0968J07847
17222B75460A05428M00989H9355J568K54247h4513I6133M1086M0719a15940e2348
17210A69383b49650H3141J25953p0548L65655j96086G3399k7755k1259N06566
17200E30951A63017N03319B04899O3674L88809M0050B74315r8114K12369c0246
$$ plain form
17276 -102008 373149 43228 315047 -22870 -12510 -153479 214650 312309 102622 -22637
17265 500494 227645 84544 511445 68848 239658 128268 190621 236253 261120 199026 293821
17254 293821 114520 254034 306252 31656 19079 205538 276033 314568 343843 385681 115034
17242 468904 218161 165546 264593 -106281 239273 271677 5820 454428 134876 292065
17232 292065 144564 259015 477606 381877 367562 388194 290665 126645 167613 275460
17222 275460 105428 506417 89355 90923 345170 -84513 96133 137219 177938 -115940 -52348
17210 169383 -249650 83141 209094 138546 504201 308115 73399 45644 24385 530951
17200 530951 163017 666336 204899 268573 657382 697432 274315 176201 388570 -30246
17189C41752j59506K55891n0765j27528P5434O0506j57711R5973N874k6973J94886
17178E07833A04908L76126j66047l9268A08849J50895B5379K74108q3801J51026
17168C66712A43613I142K62203l5546p2499J09171J28904J29197k37640m4369
17158B48563J3795O5942J47719A24122R9278K44206o7744j29489p3638r1691J55874
17147B60918j6801G1628N13473k56544k792Q4205J50210j54979J2297L2545j88161
17136B61882M04117j02605j89896J85692k28296j34924M4652A19430J75595g8961
17125F40631Q3431j89451A40895o4260L04677J60148j32022j43844P3561J66483
17115E05638j9725O5132k12180P9573R9364r0394Q3621K22766j65350j54181J49517
$$ plain form
17189 341752 182246 438137 387372 259844 335278 395784 238073 334046 339920 312947 507833
17178 507833 104908 481034 314987 275719 108849 259744 25379 299487 215686 366712
17168 366712 143613 9142 271345 235799 163300 272471 401375 530572 292932 248563
17158 248563 262358 328300 476019 124122 223400 467606 399862 270373 196735 105044 260918
17147 260918 244117 71628 585101 328557 325765 409970 560180 405201 417498 450043 261882
17136 261882 665999 563394 373498 559190 330894 195970 240622 119430 295025 -78961
17125 640631 724062 534611 140895 76635 381312 541460 409438 265594 339155 505638
17115 505638 485913 551045 338865 418438 517802 427408 511029 733795 568445 414264 563781
17104E63781o1292k40697J86043j61896K2931L71560k78964j65818J01709d2504
17093A73381N54848j52026k69188L13913J62557k51386A63777M68573J07304A78776
17082E22383p82j09809L07698j30815P1761K05686A27307K01120r8222M19419
17072F49624B24156K4984M0816L07769r735k4026J86628l27438L84872k1212k09039
17061E77775m2217j36474A97472J79942N23275K8862D62095j60536L18021B49280
17050C76125K53492B41376K56192L2711J54314B81909j6240K48907K61070N3395
17040H29041m7571l16198K41299B01638K72575A74352Q12117B39791M16175k0284
17030F35682K67605j69914l17188J88513K37667k67552K57632k6525k0638j32782
$$ plain form
17104 563781 502489 261792 447835 285939 308870 680430 401466 235648 337357 -42504
17093 173381 728229 576203 307015 620928 783485 532099 163777 632350 739654 178776
17082 522383 521601 411792 719490 588675 660436 866122 127307 328427 230205 649624
17072 649624 224156 249140 289956 597725 587990 563964 750592 423154 808026 786814 577775
17061 577775 535558 399084 197472 377414 900689 929551 462095 301559 619580 249280
17050 376125 629617 241376 497568 530279 684593 281909 265669 514576 775646 829041
17040 829041 781470 465272 706571 201638 474213 174352 986469 239791 655966 635682
17030 635682 903287 733373 416185 604698 842365 574813 832445 805920 785282 652500
17020F52500J63599k0568l86545L74240K5961k02930j42619K54721K50598D47145
17009D33648J54778J53520j0430j35680k4266J88163M28503j02455l20656O6273
16999H31398m0836O9918Q957j93105j4934o66L25923r9634J98955j78032J82923
16988A090867J07534m76098J16095j73364L78018j67940J59711j8902N0840k62921
16978H03840J71772k35485K64877R5253k81825J63106j71066L25388K01806j07562
16968A230104k95470K11852m9759p0963M01115l56554J21524K49296k89977j69433
16958I81735l43904M33816J87488J07640j43958R9741q7250l30470M54373j05450
16948A253761P763O6372n8819l6432k39361L56740q9517L91684k75906K23915
$$ plain form
17020 652500 816099 795531 408986 783226 809187 606257 463638 718359 968957 447145
17009 433648 588426 741946 731516 595836 571570 759733 1188236 1085781 765125 831398
16999 831398 790562 860480 869437 676332 661398 660732 986655 887021 1085976 907944 1090867
16988 1090867 1198401 722303 838398 665034 1043052 875112 1034823 1015921 1066761 803840
16978 803840 975612 740127 1005004 1100257 818432 981538 810472 1135860 1337666 1230104
16968 1230104 934634 1146486 1096727 1025764 1426879 1070325 1191849 1441145 1151168 981735
16958 981735 637831 1071647 1259135 1366775 1222817 1322558 1235308 904838 1359211 1253761
16948 1253761 1261524 1327896 1269077 1232645 993284 1350024 1260507 1652191 1376285 1600200
16938A600200l07920K18811k81719L29619j41243n1101M8404j12312j83410L39226
16928A458555m199J14572l61984K41951K16220K31409j52323j92348k323q0147
16918A469383J59693J91863j56628k73274N98733n63671O41652m30201K16372
16909A853922J6211n73658N50516j71513L10279l64520N20277j46961p7847J59169
16899B075875P0414N2630j61066M49829m08180N08191l60251j42953J62837M6046
16889B293372k02024K18818R260R3873n9583K71272l05612L98863k02694q7170
16879B428375K70285J98328m02620L26436m04005K84901j31233N10989n90287
16870B491169K84104J99396k56854L31838L9040j43956j04333K99718J151l7880
$$ plain form
16938 1600200 1292280 1511091 1229372 1558991 1417748 1366647 1415051 1302739 1119329 1458555
16928 1458555 1454356 1568928 1206944 1448895 1665115 1896524 1744201 1551853 1549530 1469383
16918 1469383 1629076 1820939 1664311 1391037 1989770 1426099 2067751 1637550 1853922
16909 1853922 1870133 1296475 1846991 1675478 1985757 1621237 2141514 1994553 1916706 2075875
16899 2075875 2146289 2198919 2037853 2487682 2079502 2587693 2227442 2084489 2247326 2293372
16889 2293372 2091348 2310166 2319426 2413299 2353716 2624988 2319376 2718239 2515545 2428375
16879 2428375 2698660 2896988 2494368 2820804 2416799 2701700 2570467 3081456 2491169
16870 2491169 2775273 2974669 2717815 3049653 3088693 2944737 2840404 3140122 3141273 3103393
16860C103393j0343K14024l2154J61887J70389k99844M02338M9211j3870o7157
16850C677874r2833J79623K12266J97693k10089J75797j82933J64620J83604J65438
16840D471060q1655M02508m01257L20000J83665J31738j45895J24087J02976J34946
16830E242173L34704r9716n7299K02583K5062L18576N2836k52734L98976L43884
16820F509045r76k77395K40978J01792L65291J05101J47510L01715J45697q7041
16810G551717J02616M98409p2376J08568k0455M45896K74216N7Q4122O75096L49169
16799I997035L29246M1706J97390j93742N52438K89878L94810O0129Q41182m58556
16789A2051516O22727M83137O16385K14166J26618N09999N65728L96016O21090
$$ plain form
16860 3103393 3093050 3307074 3274920 3436807 3607196 3307352 3709690 3758901 3745031 3677874
16850 3677874 3585041 3764664 3976930 4174623 3964534 4140331 3957398 4122018 4305622 4471060
16840 4471060 4389405 4791913 4390656 4710656 4894321 5026059 4880164 5004251 5107227 5242173
16830 5242173 5576877 5477161 5419862 5622445 5647507 5966083 6018919 5766185 6165161 6509045
16820 6509045 6508069 6230674 6471652 6573444 6938735 7043836 7191346 7493061 7638758 7551717
16810 7551717 7654333 8152742 8080366 8188934 8168479 8614375 8888591 8888648 8972770 9647866 9997035
16799 9997035 10326281 10367987 10565377 10371635 10924073 11213951 11608761 11668890 12510072 12051516
16789 12051516 12674243 13157380 13773765 13987931 14114549 14624548 15190276 15586292 16207382
16780A6207382M46013O15549N80860N83567J84396P63583R12469P02994M59031
16771B1455844P97131M64762J003359J017176P24612J381377R27482J029063J071203
16762B9872009J425633J044105J493419J291378J641917J875338J689209J707981
16754D2040989J980569J878993K559614K344896K368579K329222L151766L044025
16746F1698653K900934L368414M185481L949078M174364M440304M601715M894135
16738I4213078N015234N761996N353168N826000O225167O040398O146952O283022
16730A40865015N894009N613908N428078M906914M491811L497936L213317K229322
16722A76140310J949673N10105N36020n61095q65651j568378k526276k766554
$$ plain form
16780 16207382 16653395 17268944 17849804 18433371 18617767 19381350 20293819 20996813 21455844
16771 21455844 22252975 22717737 23721096 24738272 25462884 26844261 27771743 28800806 29872009
16762 29872009 31297642 32341747 33835166 35126544 36768461 38643799 40333008 42040989
16754 42040989 44021558 45900551 48460165 50805061 53173640 55502862 58654628 61698653
16746 61698653 64599587 67968001 72153482 76102560 80276924 84717228 89318943 94213078
16738 94213078 99228312 104990308 110343476 116169476 122394643 128435041 134581993 140865015
16730 140865015 146759024 152372932 157801010 162707924 167199735 170697671 173910988 176140310
16722 176140310 178089983 178600088 179136108 178575013 177709362 176140984 173614708 170848154
16714A70848154l178138l864144m153767n206997n176137n587005n422089o353466
16706A31906411n893943o116380n472200n749093o047973n152498m829647n200655
16698H7444022m706807m341935m281020l734774l860602l729977l142810k605025
16690E7041072l130016k488091k909059j742020k600553j592672k420142j932701
16682C8225818j556909j527518j638410j389667j071441j281288j059550j330718
16674B7370317j334594p65759r21301j222694m62574r13973j006135n20751j019089
16665A9203447J8073j021657n29601r61517j10631p15791n87484j38034r66943
16656A4189862m14125k38764j39658p48702M809n44678n72142j7637n07586M8184
$$ plain form
16714 170848154 167670016 163805872 159652105 154445108 149268971 143681966 138259877 131906411
16706 131906411 126012468 119896088 114423888 108674795 102626822 97474324 92644677 87444022
16698 87444022 82737215 78395280 74114260 70379486 66518884 62788907 59646097 57041072
16690 57041072 53911056 51422965 48513906 46771886 44171333 42578661 40158519 38225818
16682 38225818 36668909 35141391 33502981 32113314 31041873 29760585 28701035 27370317
16674 27370317 26035723 25269964 24348663 23125969 22663395 21749422 20743287 20222536 19203447
16665 19203447 19221520 18199863 17670262 16708745 16598114 15882323 15294839 15156805 14189862
16656 14189862 13775737 13536973 13397315 12648613 12653422 12108744 11536602 11518965 11011379 11059563
16646A1059563m39470j11650o50465l93476m7021k63389j94614k47971O0150k13376
16636H558281k82555l28325n8652k00529r2595l33417k78765K56704n11872K54222
16626F982497k42859j34827n3704m38874J32229k74637l23967l39910K02809k1793
16616E486964j54868M5884l02862J44441k7706k31819o6016k20027J05717p1737
16606D707971k785k67351k5558j82220P3076j17563j32895j00130k44478j79930
16596C528137L58820l23634J18741N4169j18503l9466M5855k62470O225l24592
16586C043282K61473l19261K27313j09092L6298J01087l36403j06958N1631l23620
16576B525750L42018r6159K25835m41083k39457M57570j43737l9940j14126q698
$$ plain form
16646 11059563 10620093 10508443 9857978 9464502 9417481 9154092 8959478 8711507 8771657 8558281
16636 8558281 8275726 7947401 7888749 7688220 7595625 7262208 6983443 7240147 6728275 6982497
16626 6982497 6739638 6604811 6551107 6112233 6244462 5969825 5645858 5305948 5508757 5486964
16616 5486964 5332096 5377980 5075118 5219559 5191853 4960034 4894018 4673991 4779708 4707971
16606 4707971 4705186 4437835 4412277 4230057 4303133 4185570 4052675 3952545 3708067 3528137
16596 3528137 3886957 3563323 3682064 3736233 3617730 3578264 3624119 3361649 3367874 3043282
16586 3043282 3304755 2985494 3212807 3103715 3140013 3241100 2904697 2797739 2849370 2525750
16576 2525750 2867768 2771609 2997444 2556361 2316904 2774474 2630737 2590797 2476671 2467973
16566B467973P3428j62778J05738p2223L17156n64389r7786Q7727m9002J39014
16556B244858l95709K31041J73772n5061j64281J20519j28541k78519R4442Q5321
16546A927842j41679m22061N75943k81606J66444k69743L23763j3457k15769K20167
16536A869844l74732Q3434p380J97913k8903m89903K4333L70186j03649j14462
16526A426681r3881r6809m8153N25150k35187M6920j77662m7802K83051m00484
16516A181824K63598k17153j48552N65965l00661j02850k14808J1159K46167q2088
16506A202601K13234l72090L30821l47917K97965r1800M1670k7220j62064J24555
16496A209755j49662N1630k18703K08611L2265n8474j65181j78240L50858j95881
$$ plain form
16566 2467973 2541401 2378623 2484361 2412138 2729294 2164905 2067119 2154846 2105844 2244858
16556 2244858 1849149 2080190 2253962 2198901 2034620 2155139 2026598 1748079 1842521 1927842
16546 1927842 1786163 1364102 1940045 1658439 1824883 1555140 1878903 1865446 1649677 1869844
16536 1869844 1495112 1578546 1571166 1769079 1740176 1250273 1274606 1644792 1541143 1426681
16526 1426681 1332800 1235991 1187838 1712988 1477801 1524721 1347059 1299257 1582308 1181824
16516 1181824 1445422 1228269 1079717 1645682 1345021 1242171 1027363 1038522 1284689 1202601
16506 1202601 1415835 1043745 1374566 1026649 1324614 1232814 1274484 1247264 1085200 1209755
16496 1209755 1060093 1111723 893020 1101631 1133896 1075422 910241 732001 1082859 886978
16486H86978L1039j3734k26813J93479J12375j43893K29416j73678L60697n29230
16476G26636M52588l69930j81851M60639p8797j72481o9216J40379m10774O00033
16466A097226m05553M59535n32570J50317J01266p0265j79370K0310K4139K23049
16456H88084o7533q6551J18817j61555k79235M04736k47469J53617K91642C07441
16445F13582O3569j09768j14514K99124J024n793l36988j10977J29969o375P233
16434D30086K4779L2664p39L39038k03816q6584J6618Q581K49261m04636N1330
16423D56582J78356l3758K75890m26601r5497O3849J34828K44169l08967M06043
16413H94894k60132B47230L62387K13857j46177l09847L18731O287k9415l10028
$$ plain form
16486 886978 918017 904283 677470 870949 983324 839431 1068847 895169 1255866 726636
16476 726636 1179224 809294 627443 1088082 1009285 836804 767588 907967 497193 1097226
16466 1097226 691673 1151208 618638 768955 870221 799956 620586 640896 665035 888084
16456 888084 820551 734000 852817 691262 412027 816763 569294 722911 1014553 307441
16445 613582 677151 567383 452869 751993 753017 747224 410236 299259 429228 422853 430086
16434 430086 454865 487529 486790 825828 622012 535428 552046 560627 809888 405252 456582
16423 456582 634938 601180 877070 450469 354972 418821 553649 797818 488851 894894
16413 894894 634762 247230 609617 823474 677297 367450 686181 692468 663053 353025
16403C53025N1880j8469A86620o3970K14712J67115J37J54163k51677o3750K3340
16392C66690K04750A17125M47941B42927L1855j01588J07230j28075K56574M552
16382D13475o2818J59198L1444m9797j02264j42170K57177K05028C08235K05221
16372E13456A98743L7903p2735M22116A90231M3089N1995C1020O92219A59918
16361A65266K70125j32685L89565k31714m2402n6871p0719J89843M082B17312
16350E89106B47319J46890A74996p1372L25346A50608o8168M39241K15637C59622
16339B47904K52957A99271J42352L61071l42484A24569F914M00382j7646j30121
16329B59529p071J32392K7825j87930r8839f9574o157C01426P4427J00902k09727
$$ plain form
16403 353025 404905 386436 186620 122650 337362 504477 504614 658777 407100 343350 366690
16392 366690 571440 117125 565066 242927 274782 173194 280424 152349 408923 413475
16382 413475 350657 509855 541299 491502 389238 247068 504245 709273 308235 513456
16372 513456 198743 236646 163911 586027 190231 233320 285315 31020 723239 159918
16361 165266 435391 302706 692271 460557 418155 361284 290565 480408 484490 217312
16350 589106 247319 394209 174996 103624 428970 150608 82440 521681 737318 359622
16339 247904 500861 199271 341623 702694 360210 124569 6914 407296 389650 259529
16329 259529 252458 384850 412675 224745 125906 -69574 -75731 301426 375853 476755 267028
16318B67028c8087m3601B45983L4819j01176J12598J36355b4878A59220K04172
16308C63392j11211K52642A7459N16710b415B45458J66679a00562E06864P1748
16298E78612A27554O6229K18450j64887O3124j49207J60268m6994A8979M91486
16288E10465G6200a4966G27480i5866D75107j64076o8098m3010I4673P4001n3825
16277A14849H536J23516P1257C8550e849A99835m4618a60683A19464j5711e8298
16265A43861b47507D46802k61A97012K00586A13808J25560Q136a9831C82810a12558
16253A44532R1337i8442j02810A36639n09j8898j9420f0900A57474a64794n0934
16242b15728f1171a3438f71I4858M6170O3223l0284L20311A89982H5222L16647
$$ plain form
16318 267028 -38087 -81688 245983 280802 179626 292224 428579 -24878 159220 363392
16308 363392 252181 504823 17459 534169 -2415 245458 412137 -100562 506864 578612
16298 578612 127554 193783 412233 247346 310470 161263 321531 274537 18979 510465
16288 510465 76200 -14966 727480 -95866 475107 311031 242933 199923 94673 168674 114849
16277 114849 8536 132052 203309 38550 -5849 199835 155217 -160683 119464 103753 -58298
16265 143861 -247507 446802 446541 197012 397598 113808 239368 247504 -19831 382810 -112558
16253 144532 235869 -98442 -201252 136639 136130 117232 97812 -60900 157474 -164794 -215728
16242 -215728 -61171 -13438 -671 94858 141028 204251 173967 494278 189982 85222 401869
16231D01869A72340p4036K5283a9485B82979F1021J56455p8716a17703C91354
16220I5308a1012B88410F262J8986K16276G7166a57450C67561c6492k58054D2892
16208D327K82762a32919h284F457f054C16471I9067a18533A06957i061m0353A50845
16195c2761C50295b0046A40269B6853R3617B4756i7976C37659A38985m0771A4116
16183B86553H637K33880a33735B40861O0593C139a62874B07857D3891J30707J64115
16172C38713a00489B85356b6068H4809J01409c7554H3481b27871D38215c43074
16161B49863a19640G6994J77757A01963i9359A84766g9518A74219o2949J47137
16151B58407J49295G8621B9080a50584P2954C46911F7391J4042Q9381F8323c2311
$$ plain form
16231 401869 172340 98304 123587 -19485 282979 61021 217476 138760 -117703 391354
16220 95308 -11012 288410 6262 25248 241524 77166 -157450 367561 -36492 -294546 42892
16208 4327 287089 -132919 -8284 6457 -6054 316471 99067 -118533 106957 -9061 -49414 150845
16195 -32761 350295 -20046 140269 26853 120470 24756 -97976 337659 138985 98214 14116
16183 286553 8637 242517 -133735 240861 301454 3139 -162874 207857 43891 174598 338713
16172 338713 -100489 285356 -26068 84809 186218 -37554 83481 -227871 438215 -343074
16161 249863 -119640 76994 254751 101963 -99359 184766 -79518 174219 111270 258407
16151 258407 407702 78621 29080 -150584 -77630 346911 67391 81433 170814 68323 -32311
16139A55604C564P620N6561g6688C76225m2143a20441j67544A01626a47697A86980
16127G5350P9361M1430e6139A31393b12407A38909a71651J9911l5396h3707B15565
16115G1113i5736l07069J61596a0489o6465L3356A4783Q59b05362F3934J81140
16104B45074C4316c5759A63435D8335J10262M7680o4928B7523K890J34533a55589
16092A19181J67916a86355Q0655B38249j06171a08514G4058J6052K82482c9401
16081A88700C3614J75592f68k21106D4846L50076p8232F7008a8775j1353j29100
16070a59228l0031A25167N6981J7344c8326k36295J03556A78483E9745N255J38397
16059B03397J06383a46024B48358b1254N113j00576A88851a35254B16678c7507
$$ plain form
16139 155604 3564 11184 67745 -76688 376225 334082 -120441 -287985 101626 -147697 186980
16127 75350 154711 196141 -56139 131393 -212407 138909 -171651 -151740 -187136 -83707 215565
16115 71113 -95736 -402805 -241209 -10489 -76954 -43598 14783 15642 -205362 63934 245074
16104 245074 34316 -35759 163435 48335 158597 206277 141349 27523 30413 164946 -155589
16092 119181 287097 -186355 -105700 238249 132078 -108514 74058 90110 372592 -39401
16081 188700 33614 209206 -668 -221774 44846 394922 316690 67008 -18775 -30128 -159228
16070 -159228 -189259 125167 182148 199492 -38326 -274621 -171065 178483 59745 65000 203397
16059 203397 309780 -146024 248358 -21254 -16141 -116717 188851 -135254 216678 -37507
16048B1084f5412B55044b9396k69835i8512A93686C2263f4801A06652d6302A75157
16036B1404L7921f9263j6766F6691a82184A70067a44214C27595A41723A9205i6682
16024a82908N7122M221c3524A74680b43191a3271B52122a2137A23574k1600b72375
16012A0099d01692J82192P8242f5853G7153a03042j08353H2585B5252A579g2480
16000I8499N9245a2099j2552j2593j65874A45273D1778c2737A62820a02026K7183
15989g4843K6672A88700A5228J5231e1519q8025E8639b7208H8871O5541L95234
15978E49646l9072b822B24746D7922J04229J11371L5087m9174b79048B00217G9936
15966b55086g243p0116I8590J69046j05994O4559j4803J31632b1407C21089E3470
$$ plain form
16048 21084 -65412 255044 -29396 -299231 -98512 193686 32263 -64801 106652 -46302 175157
16036 21404 59325 -69263 -86029 66691 -182184 170067 -144214 327595 141723 19205 -96682
16024 -182908 -125786 -121565 -33524 174680 -243191 -13271 252122 -12137 123574 101974 -272375
16012 10099 -401692 -219500 -141258 -65853 77153 -103042 -211395 82585 25252 1579 -72480
16000 98499 157744 -12099 -24651 -37244 -203118 145273 41778 -32737 162820 -102026 -74843
15989 -74843 -48171 188700 15228 30459 -51519 -139544 58639 -27208 88871 154412 549646
15978 549646 510574 -2822 224746 47922 152151 263522 298609 249435 -279048 200217 79936
15966 -255086 -7243 -77359 98590 267636 161642 226201 211398 343030 -21407 321089 53470
15954c08241C13731e1587Q78A05249e3766o0190j29620A60740a6401H5086a72629
15942e8695A4909J35403F9197d5416l51610A24492i1175l6037H9756c2850k98095
15931c30945J12666j0663A79040K45180c85110c9439l12405a41148H34b6309I7885
15919d959m23631a66373A02628e8082a3884A55738n5337e6710H4198N7756A0121
15907b18531H9051N9899N3550a75612j89066H5517b85236A2655i637k10933e9372
15895A10228A5274N8871B8415J14465a66083C91940c33080r6970e1014k8732I7484
15883b77858A32873j7447q127J89305a37272M3978C22386b10559A80472q6313
15873I4159J32206b1933C0909A040h7564q1048K8781l0817J5827J9533m9021b7635
$$ plain form
15954 -308241 313731 -51587 -50709 105249 -53766 -113956 -243576 160740 -16401 85086 -172629
15942 -58695 14909 150312 69197 -45416 -397026 124492 -91175 -127212 89756 -32850 -330945
15931 -330945 -218279 -228942 179040 424220 -385110 -39439 -351844 -141148 834 -26309 97885
15919 -4959 -428590 -166373 102628 -58082 -13884 155738 100401 -56710 84198 141954 10121
15907 -218531 89051 148950 202500 -175612 -364678 85517 -285236 12655 -9637 -220570 -59372
15895 110228 15274 74145 28415 142880 -166083 391940 -333080 -430050 -51014 -79746 97484
15883 -277858 132873 115426 107299 296604 -137272 -93294 322386 -210559 180472 94159
15873 94159 226365 -21933 30909 1040 -87564 -168612 -139831 -170648 -154821 -135288 -184309 -27635
15860e0385A74812d02384A61934a55308B31568H9381d3321j10198C5644i1370
15849a7490B87008A02947m4769a18794B8272d780p8915G0518b51239F2374J81359
15838B43733A02298O7368a91938L4655j8012j21568c8729C06a73801K5529B3550
15826A82770b71468L7333C64123a52100B0534c9517G1013b86327h048A09261N6736
15815A65997m98G8047A1004M6092L41732b51240e0209B7839a73123J139d4649
15803F8671f5105k8302O378A70502A7404n801b04572A9696Q808a53514j78903
15792c32417a50420e0052C07977b54339B24358h3570o8532h760J457A92532b05059
15780b41318i6913C6261J06801F4104i5382r1313M7157j9995f4561o644C9673
$$ plain form
15860 -50385 174812 -402384 161934 -155308 231568 89381 -43321 -153519 35644 -91370
15849 -17490 287008 102947 58178 -118794 28272 -4780 -83695 70518 -251239 62374 243733
15838 243733 102298 169666 -191938 -157283 -175295 -296863 -38729 306 -173801 -148272 23550
15826 182770 -271468 -234135 364123 -152100 20534 -39517 71013 -286327 -8048 109261 165997
15815 165997 165499 78047 11004 57096 398828 -251240 -50209 27839 -173123 -171984 -44649
15803 68671 -65105 -93407 -87029 170502 17404 11603 -204572 19696 28504 -153514 -332417
15792 -332417 -150420 -50052 307977 -254339 224358 -83570 -152102 -8760 -7303 192532 -205059
15780 -241318 -96913 36261 143062 64104 -95382 -186695 -139538 -159533 -64561 -71205 39673
15768a93620N8557a0211j00941k31399a17394k467A45932Q6306o740H626a69833
15756B5230b16358k1789A1443a60739F2190f6782j28540e5636m52483E3004J59497
15745B12501R2811E7588a4790A16516b74315D7665f1722k36108R1377R4969j41563
15734b53047a5210B50765b80829k3878g1732L4338B5374a11773l5365E293K96713
15723C02006A42926e8012H7136d604l42387I8889I762H97P7473i3029j85956h196
15710H8586B3344J01667c77168J16248k63604A58658a42842A17930d1236g000
15699b11605e5345B09959k1884b95595B16852a88034j66548E8647c61544J27413
15689b34131l912a09082n1005q2808a12863c4993R82n7640l35207n6034J37633
$$ plain form
15768 -193620 -135063 -10211 -111152 -342551 -117394 -119861 145932 232238 225498 8626 -169833
15756 25230 -216358 -238147 11443 -160739 62190 -66782 -195322 -55636 -508119 53004 212501
15745 212501 305312 57588 -14790 116516 -274315 47665 -61722 -297830 -206453 -111484 -253047
15734 -253047 -15210 250765 -280829 -304707 -71732 -37394 25374 -111773 -147138 5293 302006
15723 302006 142926 -58012 87136 -4604 -346991 98889 9762 897 78370 -93029 -278985 -8196
15710 88586 23344 125011 -377168 -260920 -524524 158658 -142842 117930 -41236 -7000
15699 -211605 -55345 209959 188075 -295595 216852 -188034 -354582 58647 -361544 -234131
15689 -234131 -238043 -109082 -160087 -242895 -112863 -34993 -34011 -91651 -426858 -482892 -345259
15678c45259F0156b11072o2768J07704I3667N7734G2178A749J56020J88118g4250
15666B72037D4115h5460C62945r8375R8880a46895A06266f7373F7990g0939I3388
15654G4580b5373j23029B28960q8024a8540G2386b56659E3230K10796k0773a91103
15642i4310J1766b4354A54444B1300d51911a4865B13883e3155j38998f911C914
15630d1754A73008i0906K5900J3662C7621a30855D8868f9968A92489f3078l2491
15619i5569F8194a9239j86821g8837A29490J2009o333c65990d3360E0931e19178
15607a91967e6435C4025f5281j87134a16237K1168L2334N845B60316a93301B4129
15595A77874a79954Q2399G9286a96185N7072H2180l8892b08559B2082J10614c9993
$$ plain form
15678 -345259 60156 -211072 -273840 -166136 93667 151401 72178 1749 157769 345887 -74250
15666 272037 44115 -85460 362945 264570 363450 -146895 106266 -67373 67990 -70939 93388
15654 74580 -25373 -148402 228960 140936 -18540 72386 -256659 53230 264026 243253 -191103
15642 -94310 -82544 -24354 154444 21300 -451911 -14865 213883 -53155 -192153 -6911 3914
15630 -41754 173008 -90906 -65006 -51344 37621 -130855 48868 -69968 192489 -63078 -95569
15619 -95569 68194 -19239 -206060 -78837 129490 141499 135166 -365990 -43360 50931 -519178
15607 -191967 -56435 34025 -65281 -252415 -116237 -95069 -62735 -56890 260316 -193301 24129
15595 177874 -179954 -97555 79286 -196185 -139113 82180 43288 -208559 22082 132696 -39993
15583C89442a98370D18289a25510I7885B0796a59909k31070f6879K2036N945k8505
15572f7403j98840A03788J3081b26821g5981G5009b18772j76848a0238G3854f9531
15560a39580b2398I8259a23946r9624B22911b39829a12288a1786k54325A55343
15549a75225g0832J1744C2410J19468M7634R829j0261a74523h2824A52772b47863
15537e1089J0165A25924a32459j6445G3994B5880a24766d0498k11276f586A9150
15525b28987g1186l8272A13387E1341i9338A02407i4196F6943k4046P786c8572
15513b365j16503A56550G1994O4102e9207q0022e116B05644J09577k7360a2197
15501e9698H0045h6698r0846A39792J12292b06581J01250P867j07520Q1876o3063
$$ plain form
15583 389442 -198370 418289 -125510 97885 20796 -159909 -390979 -66879 -44843 -38898 -67403
15572 -67403 -266243 103788 116869 -226821 -75981 75009 -218772 -395620 -10238 73854 -69531
15560 -139580 -22398 98259 -123946 -223570 222911 -239829 -112288 -11786 -266111 155343
15549 -175225 -70832 -59088 32410 151878 199512 209341 199080 -174523 -82824 152772 -247863
15537 -51089 -40924 125924 -132459 -148904 73994 25880 -124766 -40498 -251774 -6586 19150
15525 -228987 -71186 -109458 113387 51341 -99338 102407 -94196 66943 42897 50683 -38572
15513 -2365 -118868 156550 71994 136096 -59207 -139229 -5116 205644 315221 287861 -12197
15501 -59698 80045 -86698 -177544 139792 252084 -206581 -105331 -97464 -204984 -123108 -186171
15490a86171C0597j1436h5716B01594r7846a10949r3878k4902c2139G987J98064
15479B06051A6119N8407i8334k8355H1055Q945c7136I5178L7903J02813F3572
15467c20229H8893K263A4833K58812A2518b13390F1689a25585D4636K2613b2088
15455a60901A8639a38066O4444A13407L8996a27625B0788P816O8832a16223k14876
15444c31099I5703c22272E38144a10882m3263F573N8168E935J44786e4862D4116
15432a52131m3659C262a22510e4804F0718O1665n2281b90619h3393B11183b34893
15420e5656j34414P1841J7543M7772j0406A91042O2697b413C6279h8920K4525
15409f4395i09C97653j33799j14161o4984d1951O395A56512d6482q8264j2516
$$ plain form
15490 -186171 30597 19161 -85716 201594 103748 -110949 -204827 -229729 -32139 7987 206051
15479 206051 16119 74526 -98334 -126689 81055 90000 -37136 95178 133081 235894 63572
15467 -320229 88893 91156 14833 273645 12518 -213390 61689 -125585 44636 67249 -22088
15455 -160901 18639 -138066 -73622 113407 152403 -127625 20788 28604 97436 -116223 -331099
15444 -331099 95703 -322272 538144 -110882 -154145 6573 64741 5935 150721 -54862 44116
15432 -152131 -195790 3262 -122510 -54804 60718 122383 70102 -290619 -83393 211183 -234893
15420 -55656 -190070 -118229 -100686 -52914 -63320 191042 253739 -2413 36279 -88920 -64395
15409 -64395 -909 397653 263854 149693 84709 -41951 -35556 156512 -46482 -134746 -147262
15398a47262d851A0716a45190A01377h110j3116j02991D27885I0736B5085b90201
15386b9692j64097H3279P4181e3227A6582a15533B47254l430G5328a20028b9808
15374B2371M3344p437b43736G3123K6866J80567F3613A4136h887c421H4908d3205
15361A51173b16362B46597k0351c16252F2722b3061j2453r6242D4131h6154B8122
15349b41901M0336q4450J11171B57439a20124e2547H5686R1839a12100B06501
15338A11086J2439c0531j08276B15489q5915C0440Q9738R484a10740c9291l9957
15327g9248j52936G0940a50790a101H8544i3761J1908H7440J22356e6093m68544
15316e24637C94395j54123b46336F0043J24053h8287A88946c91119I6805Q175
$$ plain form
15398 -147262 -4851 10716 -145190 101377 -8110 -21226 -124217 427885 90736 25085 -290201
15386 -29692 -193789 83279 157460 -53227 16582 -115533 247254 243824 75328 -120028 -29808
15374 22371 65715 58278 -243736 73123 99989 280556 63613 14136 -8887 -3421 84908 -43205
15361 151173 -216362 246597 226246 -316252 62722 -23061 -35514 -131756 44131 -86154 28122
15349 -241901 -201565 -286015 -174844 257439 -120124 -52547 85686 177525 -112100 206501
15338 111086 123525 -30531 -138807 215489 129574 30440 120178 129662 -110740 -39291 -79248
15327 -79248 -232184 70940 -150790 -1101 88544 -93761 -81853 87440 209796 -56093 -524637
15316 -524637 394395 240272 -246336 60043 184096 -88287 188946 -391119 96805 104980
15306A04980J26743E4711K86897A41117F8367C0398b73836J32909p7984j55116
15296c74027J12765a4400A13912C617a434A24153l4223J59545i2789A00213l7036
15285F3177J10497K6358b74616B78852b69071A01979L4796m308p830B3699J10391
15274A34090e9300K0929A95672J07072b70522a24946j50374f1120C3470J15177
15264A48647K32638e2656k4639B86615j37451D1269b46280g4122j69252b0018
15253G8585M52367A92985f7145H6096R7179q2127J60833M18704K71297O20840
15243A572822K83852M53055P2799q18420J13902H33627l50269j12207j80231Q8856
15233B79776e0468c698A67344R1757J0383j04749N9272L51643k06848j84204J60045
$$ plain form
15306 104980 231723 54711 341608 141117 68367 30398 -273836 -140927 -218911 -374027
15296 -374027 -261262 -14400 113912 3617 -1434 124153 89930 249475 -92789 100213 63177
15285 63177 173674 200032 -274616 278852 -269071 101979 136775 132467 124637 23699 134090
15274 134090 -59300 -38371 195672 302744 -270522 -124946 -275320 -61120 33470 148647
15264 148647 381285 -52656 -77295 286615 149164 41269 -246280 -74122 -243374 -20018
15253 78585 530952 192985 -67145 86096 183275 101148 261981 680685 951982 1572822
15243 1572822 1856674 2309729 2382528 1564108 1678010 833627 483358 371151 190920 279776
15233 279776 -50468 -3698 167344 259101 269484 164735 224007 575650 368802 184598 344643
15222C44643G0862b6152A44018o7173B9327J22104a68637D8623J14212o2423C9181
15210B34664J796a91542D1890J81871H680K10271a28520A73998k9129n9248L5455
15199A21076l591P2307l6739J8840n6662d7704A11265H113L10141b132j53077
15188a55209E0245J24052d1882j42326b5466H0512M17780b42770N1458C23266
15177C06534f9284A23863d307B42162J1401d4682j70565i0727J9074L3820C7208
15165A97109B5233c3596A02937k4061c5824l9879j62235A49260Q7840g2021m2794
15154a14815o2335A90383r4429K65264b01777i6933r5915b3902B63903A20105
15143B49684A14102c5903J4932q7591k07330D14561A48710c5853A94375n3624
$$ plain form
15222 344643 70862 -26152 144018 76845 29327 151431 -168637 48623 162835 100412 39181
15210 234664 236460 -191542 41890 223761 8680 218951 -128520 173998 144869 85621 121076
15199 121076 117485 189792 153053 171893 115231 -47704 111265 8113 318254 -2132 -155209
15188 -155209 50245 174297 -41882 -184208 -25466 80512 498292 -242770 -191312 323266
15177 306534 -69284 123863 -4307 242162 253563 -44682 -215247 -90727 -71653 -37833 37208
15165 197109 25233 -33596 102937 78876 -35824 -75703 -237938 149260 237100 -72021 -114815
15154 -114815 -177150 190383 95954 361218 -201777 -96933 -192848 -23902 263903 120105
15143 249684 114102 -35903 -20971 -108562 -315892 414561 148710 -35853 194375 140751
15133A40751N5774e429q5590B41559j01319o0643K29282d8161k6095H7982a32054
15121B23290Q2794J47343k707A3909O4218K52899j44697k5534J24069f1310k13395
15110b74705I4876g1046D54038k14644R9679A45143K54474G6802J32418J10337
15100C19557b4796A86190R948p3861M6138b0454A11170l3105K64180J28635C328
15088A19619J39157j14107L36178a07271B61216H8360K54830j38709D6513R3828
15078A40341E6083M5876g3628A70814k0733J91021B5263O20890B15239f647B86833
15066C07402Q9065A37820J18117J29487I4139L74010H1090J18497H9128K42285
15056C31413G055L22002O2521j36194P5192a3987A16619D3277K90219k0037E532
$$ plain form
15133 140751 196525 -5429 -91019 241559 140240 79597 308879 -48161 -74256 87982 -132054
15121 223290 306084 453427 450720 13909 78127 331026 186329 160795 284864 -61310 -274705
15110 -274705 94876 -71046 454038 239394 339073 145143 399617 76802 209220 319557
15100 319557 -24796 186190 196138 122277 168415 -20454 111170 78065 342245 470880 3328
15088 119619 258776 144669 480847 -107271 261216 88360 343190 204481 46513 140341
15078 140341 56083 101959 -73628 170814 150081 341102 25263 646153 215239 -6647 286833
15066 307402 396467 137820 255937 385424 94139 468149 81090 199587 89128 331413
15056 331413 7055 329057 391578 255384 330576 -13987 116619 43277 333496 313459 5532
15044B95671j46088c7687H6844h1102B74426M5169C7659a2071B29333o708K1202
15033B43827L9635k2180L16055I3667K43012J5758J56372I9390J36416O7576K11009
15022E14391A50586p2003C2841J51605n7505C4544J27182J47965n8809B2158M04365
15011D26523a05920E2426J40895L8696K17751p5871A04883j7292P3097c3605C68984
14999C6937O20182k52863i4765C17432J01688j15170J47338k4534E2622K83759
14989C36381A05340a33326A24351f6060q3241C40163A09952L6257N0016L06441
14979E02666k0269j59308a7054G7295J65324Q137r8403m1647Q7699K97160A3642
14967b05594F17049I5687L23030j35373Q1192l6501E3155N52368j71064A91773
$$ plain form
15044 295671 149583 -37687 86844 -81102 274426 319595 37659 -12071 229333 222625 243827
15033 243827 283462 261282 577337 93667 336679 352437 508809 99390 235806 303382 514391
15022 514391 150586 78583 32841 184446 126941 34544 161726 309691 250882 22158 426523
15011 426523 -105920 52426 193321 232017 449768 373897 104883 87591 160688 -33605 368984
14999 36937 657119 404256 -94765 317432 419120 303950 451288 426754 52622 336381
14989 336381 105340 -133326 124351 -66060 -149301 340163 109952 146209 196225 502666
14979 502666 482397 323089 -17054 77295 242619 250756 152353 110706 198405 495565 13642
14967 -205594 617049 95687 418717 283344 364536 328035 53155 605523 434459 191773
14956A45092J55838j16589J26679m5678a58852A73592J07704K73447B16037q1112
14946A34925e7366A38911K30796L2835j25002M3091k4914n1344m2363B6566A219
14934D36845I8701J01061E2874L11494j44322L40124N387A96577d339A22747L70642
14923D93389M1946k65459B3832R0005Q5068A9708F337L72531Q7760M8773o5071
14912D50330p9837j27383m5230L5881J75964C4663N05163A97197L63443n2369
14902E08271k52210F2498J62638L21087q0385K51409l46036l3189K94207k70201
14892C62028q6144K7087o5800J45996p1021O5315l6627L8260J62556L6312B76438
14880D6040M9555K82941K72248l01486L45798j57180J25277C11670i8656E31191
$$ plain form
14956 145092 300930 184341 311020 265342 -158852 173592 281296 554743 216037 134925
14946 134925 -57366 138911 369707 402542 277540 320631 295717 244373 202010 26566 1219
14934 436845 98701 199762 52874 364368 220046 560170 565557 196577 -4339 122747 493389
14923 493389 535335 269876 23832 113837 198905 19708 6337 378868 466628 515401 450330
14912 450330 370493 243110 197880 233761 409725 34663 539826 197197 560640 508271
14902 508271 256061 62498 225136 546223 465838 717247 371211 338022 632229 362028
14892 362028 275884 302971 237171 383167 312146 377461 340834 379094 541650 577962 276438
14880 46040 95595 378536 650784 349298 695096 537916 663193 311670 -98656 531191
14869C09690n47r9835E9899M76419j97459M0951Q0286j56347K1538m7743j04990
14858A72554P9313J88823J8198r6134p2986J22257K7215J09373j97321J16387
14848D67679J3151p8179j8668j8246M47432A58564K96410J71771B60012O333A22197
14836F11158k10312r0626L7816R0144M56111k87546k54030j14752r131B4016N13880
14825E37896j37941J85423J5331m6955m0730q5401O9538L01793r4169k48438A77523
14813E53046l245J94258j96828J7713j65011K07962k74085K872L1439K35419K87929
14802H91469l31206k57224N00808B22945L83822j32356L78442l48131L71264j79377
14792F96609k37872K8464N44149m90421j0679R1266j31658A17744O37179O2198
$$ plain form
14869 309690 309143 209308 59899 536318 338859 379810 460096 303749 325287 277544 172554
14858 172554 251867 440690 458888 362754 289768 412025 439240 548613 351292 467679
14848 467679 480830 402651 383983 365737 813169 158564 454974 626745 260012 266345 122197
14836 611158 400846 310220 348036 438180 894291 606745 352715 237963 228832 24016 537896
14825 537896 399955 585378 600709 553754 513024 427623 497161 798954 704785 456347 177523
14813 553046 549801 744059 547231 564944 399933 607895 333810 336682 368121 603540 891469
14802 891469 560263 303039 803847 222945 606767 474411 852853 504722 875986 696609
14792 696609 458737 487201 1031350 540929 530250 621516 489858 117744 754923 817121
14782H17121K71697C52513K61234k32804j36777L43170k4467B11693P04022j24477
14772G91238J05386k33166P2807K72181m21178J1157j92680M6175P4977j49757
14762C77140M03408K61590m39031J72906j51490K9727n5196K06137k55074k54742
14752B95375L89174J21706C87808M75337j66125J09724k3709n842k7350l3671
14742G16172J03354Q0564o6873Q5109J10991k25737C07011M02087j83821O59449
14732A184726m55636K35662k38148N9052P3589J61010j87947j06382K73651j58074
14722H41503R3901j98346K91873k85417M4938M84286n42096J75009K29130l52682
14712G82099j96077J85231P6066J17395j21012q981k033K92631k34719J02530
$$ plain form
14782 817121 1088818 352513 613747 380943 244166 587336 562869 211693 915715 791238
14772 791238 896624 663458 736265 1008446 587268 598425 405745 451920 526897 377140
14762 377140 780548 1042138 603107 776013 624523 654250 599054 805191 550117 295375
14752 295375 684549 806255 387808 863145 697020 806744 783035 777193 749843 716172
14742 716172 819526 900090 833217 918326 1029317 803580 307011 709098 525277 1184726
14732 1184726 729090 964752 726604 785656 859245 1020255 832308 725926 999577 841503
14722 841503 935404 737058 1028931 743514 788452 1272738 730642 905651 1134781 782099
14712 782099 586022 771253 847319 964714 843702 834721 832688 1125319 890600 993130
14702I93130q4518K4942L26756k70549k85045j6993M52723m75257J95390J44753
14692A005332j22193L55261n66417N48508l48523j92673M47718m1096L53349m28413
14682A010853K6455p1280l55591M68391L43038n63782K49622k78570N9696K12713
14672A101545l19106P1624M00724j4097Q2144m34434J44755L55785k52651O0973
14662A197262l31373K76342j72647M44245N0089k06396N4069M7098l12093L58487
14652A405083j74096K65222m48218R3302J53377j99636K63051k88195J68394K21470
14642A459754k12953O1002O5186k31199J25331k6036M46909l04952n7552o4481
14632A261009K55540N9087l35888N4445K16247m16944L10871K7402R8158K30910
$$ plain form
14702 993130 908612 933554 1260310 989761 704716 687723 1140446 665189 860579 1005332
14692 1005332 883139 1238400 671983 1220491 871968 679295 1127013 1085917 1439266 1010853
14682 1010853 1037308 966028 610437 1078828 1421866 858084 1107706 829136 888832 1101545
14672 1101545 782439 854063 1254787 1240690 1322834 888400 1033155 1388940 1136289 1197262
14662 1197262 865889 1142231 969584 1413829 1463918 1257522 1311591 1358689 1046596 1405083
14652 1405083 1230987 1496209 1047991 1141293 1294670 1095034 1358085 1069890 1238284 1459754
14642 1459754 1246801 1307803 1372989 1141790 1267121 1241085 1687994 1383042 1325490 1261009
14632 1261009 1516549 1575636 1239748 1294193 1510440 1093496 1404367 1431769 1529927 1760837
14622A760837j98151K21163j07999r6058L9355k39258r9759K17281Q4349p6553
14612A505207M97563l55325N2905q0995J59791l8504j49388j6316N6372j94776
14602A436534L63554j67554J86780k42014M04416q9878K2399J2724j86529K07380
14592A947812Q045q7581j50300K83921n6510J98726P5278m0190k27116L65878
14582B317963J45071n71819K54631J5851J9155K21956l07705O1864J05764J49959
14572B412690j36176M5290K02611k23077N4635j07947O82065l94502j93300L31533
14562B673822j47479L35367q5210M5139j851J91071N22985J16212O0494p1998
14552C638552J081849J88959Q18366K243899L336031Q537160K0749272R145346
$$ plain form
14622 1760837 1562686 1783849 1675850 1579792 1619147 1379889 1280130 1497411 1581760 1505207
14612 1505207 2002770 1647445 1700350 1619355 1779146 1740642 1591254 1574938 1631310 1436534
14602 1436534 1800088 1632534 1819314 1577300 1981716 1891838 1914237 1926961 1740432 1947812
14592 1947812 1955857 1868276 1717976 2001897 1945387 2144113 2219391 2179201 1952085 2317963
14582 2317963 2463034 1891215 2145846 2161697 2180852 2402808 2095103 2156967 2262731 2412690
14572 2412690 2276514 2321804 2524415 2301338 2355973 2248026 2930091 2535589 2342289 2673822
14562 2673822 2526343 2861710 2776500 2821639 2819788 3010859 3533844 3650056 3710550 3638552
14552 3638552 4720401 4909360 5727726 7971625 11307656 19844816 40594088 49739434
14544D9739434B3722610A0515411m935393n79506q63056L62922L3998Q22934j480752
14535C876558r40513n40031l3274K5448j86359N45785k31384L21467o68646K99149
14525B468200j25219K73039j64540K2818Q0232n4699M56665l20345M98119l34741
14515B799529J56942j8066P3724P7610l46875N88628o38724O00580j33769l20783
14505B838796M8718K87189J22204R9764K61875l68074L25020k78860K495M74297
14495C813424P9760m66144K33678K33859L9370k85895L91804m41485L16738K38806
14485D153915k41470K28529j01980J71071j23302L70666j47886L1636J66423k11887
14475D295715J57354p2753M8727J21240J36736j15405L14135j14434J01583L1099
$$ plain form
14544 49739434 23722610 10515411 5580018 5000512 4137456 4500378 4534376 5357310 3876558
14535 3876558 2936045 2396014 2362740 2388188 2201829 2747614 2516230 2837697 2169051 2468200
14525 2468200 2342981 2616020 2451480 2474298 2554530 2499831 2956496 2636151 3134270 2799529
14515 2799529 2956471 2938405 3012129 3089739 2742864 3331492 2692768 3293348 3159579 2838796
14505 2838796 2887514 3174703 3296907 3396671 3658546 3290472 3615492 3336632 3339127 3813424
14495 3813424 3893184 3427040 3660718 3894577 3933947 3648052 4039856 3598371 3915109 4153915
14485 4153915 3912445 4140974 4038994 4210065 4086763 4457429 4309543 4341179 4507602 4295715
14475 4295715 4453069 4380316 4429043 4550283 4687019 4571614 4885749 4771315 4872898 4903997
14465D903997K63701k42498K05104k73586K47668N33192r10676P26702J41899
14456E595503k21034L05854j31091j96154K95732r6738K87033J23280k29345K82315
14446F015355L8329o2016J74815L48713k26988J6880J2125L24000K501J0389L05254
14435F959357J7220J01610J114M14992P7045L4074j7352L38628q9738M1510l0914
14424G847546J44688M0262J65144j66572M43461J9660J39050O5187K86676O95656
14414I680758j28774j60121j5229l941P06920L85096k96238L11808R2620J02005
14404A0674904J09279Q7753n720P47977j02332L06933k7311K67443K82847K21679
14394A2563452L6374R9253M04668M4259N43973l43725N35091L55501K02266L95199
$$ plain form
14465 4903997 5167698 4925200 5130304 4856718 5104386 5637578 4726902 5453604 5595503
14456 5595503 5374469 5680323 5549232 5353078 5648810 5552072 5839105 5962385 5733040 6015355
14446 6015355 6053684 5991668 6166483 6515196 6288208 6305088 6317213 6641213 6643714 6654103 6959357
14435 6959357 6976577 7078187 7079301 7494293 7571338 7605412 7588060 7926688 7836950 7878460 7847546
14424 7847546 7992234 8032496 8197640 8031068 8474529 8494189 8633239 8698426 8985102 9680758
14414 9680758 9551984 9391863 9376634 9372693 10079613 10464709 10168471 10480279 10572899 10674904
14404 10674904 10784183 10871936 10866216 11614193 11511861 11818794 11791483 12058926 12341773 12563452
14394 12563452 12599826 12699079 13103747 13148006 13691979 13348254 13883345 14238846 14441112 14836311
14384A4836311k9650M50633O72560l03628O74082j18118M97035M73953J36662
14375A7289840J87356M81819N26934O0576O78780q6432R06619M7781M34427Q07420
14365B1335120J72377O97157k1524R73288M08953Q41239J51913L03514O14383
14356B5476420R84856K90132Q19913L39605O03977N88694R47489O31717J264381
14347C1947184L95602P46056J016213R37817Q09938J019701J191162P72589J365587
14338D0201849N56923J249863J362491P62854J573770J332016J653001J274195
14330D9966962J358102J939660J617453J808332J607485K114146J747938K551228
14322F4711306J772544K474020K482190K744499K199904K979989L216192K981862
$$ plain form
14384 14836311 14806661 15257294 15929854 15626226 16300308 16182190 16679225 17153178 17289840
14375 17289840 17477196 17959015 18485949 18546525 19225305 19138873 20045492 20093273 20527700 21335120
14365 21335120 21507497 22204654 22183130 23156418 23565371 24406610 24558523 24862037 25476420
14356 25476420 26461276 26751408 27571321 27910926 28514903 29103597 30051086 30682803 31947184
14347 31947184 32342786 33088842 34105055 35042872 35852810 36872511 38063673 38836262 40201849
14338 40201849 40758772 42008635 43371126 44133980 45707750 47039766 48692767 49966962
14330 49966962 51325064 53264724 54882177 56690509 58297994 60412140 62160078 64711306
14322 64711306 66483850 68957870 71440060 74184559 76384463 79364452 82580644 85562506
14314H5562506L526418L163141L803010L849194M011266M115771M649843M760392
14306A17441541N016948N126704O013304O040672O074452O947126P581955P163497
14298A67406199Q217716Q036080R201287R851156R641332J0608427J1166886J1652338
14290B45781421J2005178J2849453J3773221J3773657J4208445J4715674J4762965
14283C41870014J5167572J5397936J5126016J4373610J4210261J3375771J2264027
14276D41785207J0916028R414972P433534M395897K328538q6576j745312j966219
14268D72476069n051405k738785n945907q718142j0728667j2071154j3218368
14261D14003641j3928532j4674978j5096568j5258273j5339553j5373539j4422577
$$ plain form
14314 85562506 89088924 92252065 96055075 99904269 103915535 108031306 112681149 117441541
14306 117441541 122458489 127585193 133598497 139639169 145713621 152660747 160242702 167406199
14298 167406199 175623915 183659995 192861282 202712438 212353770 222962197 234129083 245781421
14290 245781421 257786599 270636052 284409273 298182930 312391375 327107049 341870014
14283 341870014 357037586 372435522 387561538 401935148 416145409 429521180 441785207
14276 441785207 452701235 462116207 469549741 473945638 476274176 476187600 474442288 472476069
14268 472476069 467424664 464685879 458739972 450021830 439293163 427222009 414003641
14261 414003641 400075109 385400131 370303563 355045290 339705737 324332198 309909621
14254C09909621j4424267j3992220j3126944j3003981j2148595j1328095j0315063
14247B21570456r786820j0591108r583733q653045q234631q178546p247947p242537
14239A52052089o681947o171684o082560n558129n236080n244941m741488m442766
14231A07892494m044002l765339m106095l741501l573546l283617l027314k785908
14223G9565172k932866k522244k714380k031224k432395k486019k013551k117801
14215F0314692j766608j970933r32073j958940j457898k302040j438908j134364
14207D7352928o11045j010677j999197j298869r97932j074899j025999o26395
14199C8707915j351245j291082o59422j093367o14591o04942q43125j081080q16874
$$ plain form
14254 309909621 295485354 281493134 268366190 255362209 243213614 231885519 221570456
14247 221570456 211783636 201192528 191608795 182955750 174721119 166542573 159294626 152052089
14239 152052089 145370142 139198458 133115898 127557769 122321689 117076748 112335260 107892494
14231 107892494 103848492 100083153 95977058 92235557 88662011 85378394 82351080 79565172
14223 79565172 76632306 74110062 71395682 69364458 66932063 64446044 62432493 60314692
14215 60314692 58548084 56577151 55645078 53686138 52228240 49926200 48487292 47352928
14207 47352928 46741883 45731206 43732009 42433140 41435208 40360309 39334310 38707915
14199 38707915 37356670 36065588 35406166 34312799 33698208 33093266 32250141 31169061 30352187
14190C0352187o54600o56168p94445l35809o66985q17876m17434m30026q42861
14181B4735983r3668m80878l90266j206309R3621r66473j41285o33266n13854
14172B0403605n6459n98157j24686m97499k88418o78886J990l42335l18038n30511
14162A6970606N096n66532m41111k57832k72239l41336Q095N2144n51681j76703
14152A4428507m7454k19019n94416K45831j43872p92698J6115l41823p6947k88670
14142A2185554l56472j78229P0821l17383L6490m96212K55593m66505J77848k09319
14132A0702186l39681J39795k72998m15421k43927K91305k42587m48162M76542
14123I647052n40682j10686q4210J82153l87415m8732L9034k0969m59166M9100
$$ plain form
14190 30352187 29697587 29041419 28246974 27911165 27244180 26426304 26008870 25578844 24735983
14181 24735983 24642315 24161437 23771171 22564862 22658483 21692010 21550725 20917459 20403605
14172 20403605 20347146 19748989 19624303 19126804 18838386 18159500 18161490 17819155 17501117 16970606
14162 16970606 16975702 16409170 15968059 15710227 15437988 15096652 15104747 15156891 14605210 14428507
14152 14428507 14381053 14162034 13567618 13813449 13669577 12876879 12892994 12551171 12474224 12185554
14142 12185554 11829082 11650853 11721674 11404291 11440781 10944569 11200162 10733657 10911505 10702186
14132 10702186 10362505 10502300 10229302 9813881 9569954 9861259 9618672 9170510 9647052
14123 9647052 9106370 8995684 8911474 9093627 8706212 8657480 8696514 8675545 8216379 8265479
14113H265479j22838m9514q696j35419l4767m08307l79224M82210k19952q5433
14103G303539q9323k9301k74683K195k88991K03871J06246m85116J05810j4559
14093F539688l29131k69926N69637o1840p35921O96328n14121j83960J84808k59607
14083E635955J25556K7956P3341m66987J81224K49431n99057J40013N3341n8148
14073E362625l25322J4395q8611j93325L02154j99059Q4020k85989J0718K23727
14063D905333m29438J38750j20641o1112k2242j95462K03619p9965m7624O5205
14053D356423j92314K89642m55126j7249J34624J17252l12937j51195N8589R4182
14043C921891K4940l80185O7062q2202O5622J97798l14616K2694P1978m16873
$$ plain form
14113 8265479 8142641 8093127 8084431 7949012 7914245 7505938 7126714 7608924 7388972 7303539
14103 7303539 7214216 7184915 6910232 6912427 6623436 6827307 6933553 6448437 6554247 6539688
14093 6539688 6210557 5940631 6510268 6448428 5712507 6408835 5894714 5710754 5895562 5635955
14083 5635955 5761511 5789467 5862808 5395821 5577045 5826476 5227419 5367432 5420773 5362625
14073 5362625 5037303 5051698 4963087 4769762 5071916 4872857 4956877 4670888 4681606 4905333
14063 4905333 4475895 4614645 4494004 4432892 4410650 4215188 4418807 4338842 4291218 4356423
14053 4356423 4164109 4453751 3998625 3981376 4116000 4233252 3920315 3769120 3827709 3921891
14043 3921891 3946831 3566646 3633708 3551506 3617128 3814926 3500310 3523004 3594982 3178109
14033C178109M05315j3221R551r7695q6329k63814K6495O83635o58814L26153
14023C509385l37031K07003q5329m81498J67111j92076L90672m79410M49407l32374
14013B815860K36879k58110j15919L28989k56113M82536n80344k08782P7506N11411
14003C033913l66248k41805j40322J78345k41023K74730Q382m34627J17297J9062
13993B207704M7165j43390M78595K85855O68863K141941O517737J9388846K0402378
13984E1995694k0991750j4226837o989344k981526j301374o74895p00039n2994
13976D076935m21376l6406l04094m15453J21891j8590l0788j20125k25557J83291
13966B809728j84200R2675n1521K36210m58287k05933J99847n0428J61691k93088
$$ plain form
14033 3178109 3583424 3570203 3579754 3482059 3395730 3131916 3158411 3842046 3183232 3509385
14023 3509385 3172354 3379357 3294028 2812530 2979641 2787565 3178237 2698827 3148234 2815860
14013 2815860 3052739 2794629 2678710 3007699 2751586 3234122 2653778 2444996 2522502 3033913
14003 3033913 2667665 2425860 2285538 2463883 2222860 2497590 2505972 2071345 2188642 2207704
13993 2207704 2254869 2111479 2590074 2875929 3544792 5686733 12204470 31593316 51995694
13984 51995694 31003944 16777107 9787763 6806237 5504863 4829968 4129929 4076935
13976 4076935 3655559 3619153 3315059 2899606 3021497 3002907 2972119 2851994 2626437 2809728
13966 2809728 2625528 2718203 2666682 2902892 2444605 2238672 2438519 2388091 2549782 2256694
13956B256694O2001J01709k95412M20607l58176r831k50783K26587L69544n76780
13946A946160k1239K45320J73822l52722L63884n63797K01534J45779j12427J75578
13936B201892l185n48131P70307l79684j50188J97482j63999J00744K0569k50639
13926A795168j46054P0031J88385L5993K65674k29649o32556O48141q6871k16406
13916A691856P6028K29617j47178l43475R3519o1551p9577J69677j67936K93880
13906A754860J08909k27527j83896K88158J03188m49697J23287n1365M99367m37874
13896A527410l657m1595K56105j80382k00067L62638j08976j46883j21382J45665
13886A488876K42256l95068j03138L22761j62247k04981J51208j11928R6894m0436
$$ plain form
13956 2256694 2318695 2420404 2124992 2545599 2187423 2177592 1926809 2153396 2522940 1946160
13946 1946160 1924921 2170241 2344063 1991341 2355225 1791428 1992962 2138741 2026314 2201892
13936 2201892 2198707 1650576 2420883 2041199 1891011 2088493 1924494 2025238 2045807 1795168
13926 1795168 1649114 1719145 1907530 1943523 2209197 1979548 1346992 1995133 1908262 1691856
13916 1691856 1767884 1997501 1850323 1506848 1600367 1538816 1459239 1628916 1460980 1754860
13906 1754860 1863769 1636242 1452346 1740504 1843692 1393995 1517282 1465917 1965284 1527410
13896 1527410 1523753 1482158 1738263 1557881 1357814 1720452 1611476 1464593 1343211 1488876
13886 1488876 1731132 1336064 1232926 1555687 1393440 1188459 1339667 1227739 1324633 1284197
13876A284197k56075L18193k89406K59074j12701L69493l34412L59787m51901
13867A146249L71719j08904L9202o4697k20774r5312K40739M8114k41596k68435
13857H46305L95842P2251k17236n5091M44459k40079r7705j96085L68641j67436
13847A153866J30660Q953k57077P5365K8183j03549J04519j31560j42932L08110
13837A174538q593P093R2678k30104K3786k43265N52881l67195J40399l23879
13827H18339j474K80340j53412j11850n1454J63478M0383p3405n9641K3526J42732
13816A017562m9405n4758l4569J76888l6593k43799J21964l1195J70358J7555
13806A054008m47170N87270O7671n5223n63266M28255j42933l85268K88730J1507
$$ plain form
13876 1284197 1028122 1346315 1056909 1315983 1203282 1572775 1238363 1598150 1146249
13867 1146249 1517968 1409064 1448266 1383569 1162795 1067483 1308222 1356336 1114740 846305
13857 846305 1242147 1314398 1097162 1042071 1486530 1246451 1148746 952661 1321302 1153866
13847 1153866 1284526 1293479 1036402 1111767 1139950 1036401 1140920 1009360 866428 1174538
13837 1174538 1165945 1173038 1265716 1035612 1059398 816133 1369014 1001819 1142218 818339
13827 818339 816865 1097205 943793 831943 780489 943967 984350 910945 851304 874830 1017562
13816 1017562 968157 913399 878830 1055718 1019125 775326 897290 866095 1036453 1054008
13806 1054008 606838 1194108 1261779 1206556 643290 1071545 928612 543344 832074 843581
13796H43581J58948Q4007j34182J92462n34816j03238N05815k15208m9602J36786
13786H84553j66027j75218N18082O6716j70543j45908n3971k8061J83772k74547
13776F38848O2900M3065K35648l86178J07448m406j84979J89129K65344l11196
13766F55623L12140D67402L06219j24660L8708j290L42490k06328k4059O8512
13756H66994R642j59167K00260j69168l69320K96956l7972j0021L2102L01098
13746I61404J76469E51855l4682M44890l73655J08943O0517J04571J5893j01570
13736G76762j98847M59265D29500M73320l88373K80206m8249j21929L0126K4601
13726F79202r3019M41480k4757k52331j89016K65766C49157M09468l46248J62342
$$ plain form
13796 843581 1002529 1086536 952354 1144816 610000 506762 1012577 797369 747767 884553
13786 884553 718526 543308 1061390 1128106 957563 811655 757684 729623 913395 638848
13776 638848 701748 744813 980461 594283 701731 697325 512346 701475 966819 655623
13766 655623 967763 467402 773621 648961 687669 686379 1028869 822541 798482 866994
13756 866994 876636 717469 917729 748561 379241 676197 638225 628204 660306 961404
13746 961404 1137873 551855 517173 962063 588408 697351 757868 862439 878332 776762
13736 776762 577915 1037180 429500 902820 514447 794653 746404 624475 654601 679202
13726 679202 586183 1027663 1002906 750575 561559 827325 349157 758625 412377 574719
13716E74719K74776j40474K91123l72672P03202o62295O7996j2931j16813k42604
13706C64027L98825l58556M03315J90143J31832l42679l41528M41204j38868l17677
13696D30038K28933k9518J17104k37471J87871l7872r0153J57202j10016j66385
13686D49733K21057J91129j93006r4376n2739k17870J24149L08335l12030L02106
13676G26488l11327J41732Q9799k47131K92363R1545l47431O5215K12474k06206
13666E07521O3277N8485J78767k23753k14499J74548B00003K62867J29156j55388
13656D36638M4870j00404K07323o5495K37245k16337j23860j8196L37297k69881
13646D69200B13384K27721K17413j77161r8330L15689B30011M73469j26180k4959
$$ plain form
13716 574719 849495 709021 1000144 627472 1330674 668379 736375 723444 606631 364027
13706 364027 762852 404296 807611 997754 1129586 786907 445379 886583 747715 430038
13696 430038 658971 629453 746557 509086 696957 659085 568932 726134 616118 449733
13686 449733 670790 861919 668913 574537 521798 303928 428077 736412 424382 726488
13676 726488 415161 556893 646692 399561 691924 783469 436038 501253 713727 507521
13666 507521 570798 629283 808050 584297 369798 544346 200003 462870 592026 436638
13656 436638 481508 381104 588427 522932 760177 543840 419980 401784 739081 469200
13646 469200 213384 441105 658518 481357 383027 698716 230011 703480 577300 552341
13636E52341A17684O12833k96972M00716D10012J48887P2758B02433K01927R7558
13626E01918M66702k96147J94582l24556l1799j13765a62833C93938K20208l172
13616F10974A41442Q8335J89816j71316l9940L69040l9808j79156P1327J11615
13606E41355j9451m7956j09343L23348j76866j733B41295J79673N7137p7711K73441
13595F73835j6971k27010J70626N7081J18241k4600l43237R0631L97770k64404
13585F31962D0040N49082K14726C81102G0557P1744K86652K263N7251r9869K58283
13574F46881l07956K55587k40468J68523R8030C02907k4006L22078f7603C08716
13563D88503K90276p6190k35589k24453P5974J41145n7821m0221m7727L73148
$$ plain form
13636 552341 117684 730517 433545 834261 410012 558899 631657 202433 404360 501918
13626 501918 968620 672473 867055 542499 510700 396935 -162833 393938 614146 610974
13616 610974 141442 229777 419593 248277 208337 577377 537569 358413 429740 541355
13606 541355 521904 473948 364605 687953 511087 509354 241295 420968 478105 400394 673835
13595 673835 656864 429854 600480 657561 775802 751202 407965 498596 896366 631962
13585 631962 40040 589122 803848 381102 70557 142301 428953 431216 488467 388598 646881
13574 646881 338925 594512 354044 522567 620597 302907 278901 600979 -67603 308716
13563 488503 778779 702589 467000 242547 318521 459666 401845 361624 313897 687045
13553F87045k74017C247J36174B027N61826j45537A87090R8243H9937K53784C2171
13541G54130C22858A08871M04339k27804I2899L99147k28028p8801J65785A48286
13530B51870j18850J8409N2621J761M93214l07740p9766A17489J78487R6555q9210
13519C03321J9884L75106B68471J54055A41299L34531j44520E6718O76835k50047
13509D83506j40289n3032g133A79633M7834K17781F3436L23904K48J33268j3374
13498E07482H9287L16063j0976O3823M5157B16309H6814J72411a31456A41019
13487C46985K93399j76261F8917J91213J95818B18534L7306K18433A31164n6812
13477G4352J7305k4742L12424A21326E4546a07976E46177j80417F8147c48643
$$ plain form
13553 687045 413028 3247 139421 2027 563853 418316 187090 285333 89937 343721 32171
13541 754130 322858 108871 513210 285406 92899 492046 264018 185217 351002 148286
13530 251870 133020 151429 204050 205811 699025 391285 311519 117489 295976 392531 303321
13519 303321 323205 698311 268471 422526 141299 475830 331310 56718 733553 483506
13509 483506 343217 290185 -7133 179633 227467 445248 63436 387340 387588 520856 507482
13498 507482 89287 405350 394374 458197 503354 216309 86814 259225 -131456 141019
13487 346985 640384 464123 68917 260130 455948 218534 255840 474273 131164 74352
13477 74352 91657 66915 379339 121326 54546 -107976 546177 365760 68147 -348643
13466E24957B53441K35284j94463J1957J05192J07618R2990r7970A63283a59701
13455B53931K98263B73829K60902j43961P7473B14790L12889R0933B01804J60008
13445C61812q5653j3965j18880l853L28628G7611O4418L34172k6752j40148a86945
13433A82212E3551L09205n3532A44233Q0098G6628N1379K03794A04397J81451
13423B85848g8854C26845o8708J07254j13417p1156g4310A20901J50515j4559
13413B56857j04863L29127j68037a45697C37862j43045J15635a03129E41203k16519
13403C24684P6256j34928j3649A12329q091L85530j70633L43122j31579k14800
13393C15878L01551A98471K30968b85025I0370R7103J24276N4809G3283M5495
$$ plain form
13466 524957 253441 488725 294262 306219 411411 519029 612019 514049 163283 -159701
13455 253931 552194 273829 534731 390770 468243 214790 527679 618612 201804 361812
13445 361812 276159 262194 143314 139461 468089 77611 142029 476201 449449 309301 -186945
13433 182212 53551 362756 309224 144233 224331 76628 128007 331801 104397 285848
13423 285848 -78854 326845 258137 365391 251974 180818 -74310 120901 271416 256857
13413 256857 151994 481121 313084 -145697 337862 194817 310452 -103129 541203 324684
13403 324684 400940 266012 252363 112329 104238 489768 319135 662257 530678 315878
13393 315878 617429 198471 429439 -285025 90370 187473 311749 366558 73283 118778
13383A18778K86772e6332A22656J25697J10586A52152K95401f8736D7911L71530
13373D19441p1310J62801j84054A37008K3805R1398J01561O7314J15813j17442
13363D19457A95613o0184L4844M32572A12403M27341k32013a12844M8471D75695
13352E37628j20428A88479P3328q5500K74512j51467G8574K82554A10485L279
13342A13764J65786R8750o3269J30519A39648J05109J18985P1361n9998D0762
13331B39158O6275m0767J01956A59663m4945M29024A71722l6978M0720B4421K04903
13320B29324J18581A2895J72133o8315L13678j75092n7615m5601C8325K38322
13310B76647J72388A69472K80511k1882E1573N13566j66201K33354j72869c8879
$$ plain form
13383 118778 405550 -56332 122656 248353 358939 152152 447553 -68736 47911 419441
13373 419441 348131 510932 326878 137008 160813 252211 353772 421086 536899 419457
13363 419457 195613 135429 170273 602845 112403 539744 307731 -112844 -64373 475695
13352 537628 417200 188479 261807 176307 450819 299352 78574 361128 110485 113764
13342 113764 279550 378300 315031 445550 139648 244757 363742 435103 375105 40762
13331 239158 305433 264666 366622 159663 114718 543742 171722 134744 175464 24421 229324
13320 229324 347905 12895 185028 116713 430391 255299 197684 152083 38325 276647
13310 276647 449035 169472 449983 428101 51573 565139 398938 632292 459423 -38879
13299b0065A45671O6668L17470c1145I5691a35617D57338A0518d3914A88708p437
13288A81271J59729H252K56432p0136G031L67196a70444B24847F1295J6101a30825
13276G7271A9532J84046B3330K27701J78051a45428e9201A1981K8037L40514j40504
13265B40028K3951b63057C08510j36078J33835b6132A09366n1338J41352h9369
13254I3409a23405A54396K6620J55108j50463A5547N2842e9958E18363b1818F36962
13242A50491J21280a2183A56370K86407f2600A94514D7457L49828j11444j38794
13232A47047o1657J74246O8761k1225A3328a01048A47187D875Q2103M9644N5021
13221A91643p326J01041q0706C6311N8498J27446b96065B0870Q1068C5553J32950
$$ plain form
13299 -20065 145671 212339 529809 -31145 95691 -135617 457338 10518 -43914 188708 181271
13288 181271 341000 8252 264684 194548 7031 374227 -170444 224847 61295 77396 -130825
13276 77271 19532 203578 23330 251031 429082 -145428 -59201 11981 40018 380532 240028
13265 240028 263979 -263057 308510 172432 306267 -26132 109366 58028 199380 -89369
13254 93409 -123405 154396 181016 336124 185661 15547 68389 -59958 518363 -21818 636962
13242 150491 271771 -12183 156370 442777 -62600 194514 47457 397285 285841 147047
13232 147047 85390 259636 328397 307172 13328 -101048 147187 4875 86978 136622 191643
13221 191643 184317 285358 204652 36311 94809 222255 -296065 20870 101938 35553 168503
13210A68503B0093R7199K28157j40670J75143j75029O478a4921p0455k38891a29872
13198D226a85791E73869j50572J5819A55763J70531I8486c29924B47116A02884
13187B25024D5044b47409b9601B13346n1837K03250I1445h3180B9157P79896B37629
13175C39537h6775A56709p4327a01127B72680d28115G0047L16148M9608B01340
13164A84955r0865J60592G4709O4292f4276A88101n3338P1969e2984C21010A60178
13152C7843P6738P8972a7758D40970A72221b47667P8196B71037n1960K3528G7421
13140a07874D48180C0166K54659b9118B99844A0434J38096J88590A19594f5953
13129G8895q847N7766J43190b01791B33946C3397J45079j2331K36841L7787A14132
$$ plain form
13210 168503 20093 117292 345449 204779 379922 204893 211371 -14921 -85376 -324267 -129872
13198 4226 -185791 573869 423297 439116 155763 326294 98486 -329924 247116 102884
13187 225024 45044 -247409 -29601 213346 161509 364759 91445 -83180 29157 809053 237629
13175 339537 -86775 156709 82382 -101127 272680 -428115 70047 386195 435803 201340
13164 184955 94090 254682 74709 139001 -64276 188101 134763 206732 -52984 321010 160178
13152 37843 114581 193553 -17758 440970 172221 -247667 -169471 271037 219077 242605 77421
13140 -107874 448180 30166 284825 -29118 299844 10434 148530 337120 119594 -65953
13129 78895 70048 127814 271004 -201791 233946 33397 178476 166145 402986 440773 114132
13117b9055A12357K67191b11980B40844a2938l3900A34871J19737a01135B67532
13106a14378C81105j71265Q2939e5711C86404a79658L8997j0337A82690J02379
13096B85069p5622h8530c7829k07645B5308M67451B0530P5346A322f3443B63538
13084A3903L2137a10185D1700R334a79381D133K12194a26996C88208G9901J5042
13073I4943m2534k0461J82265M2823K1846j20417m4597J77281o0333K73117A25292
13061C5169R0349l8098L31792b20131F9863j3634K24660C0440F97K75617f4144
13049b011A0064L9593L6269K72185J2812A03662c9627j15699A64957J89724b0531
13037C21714o9864G30K41735C2299a37008d2569j01709j31522B1052M476K45211
$$ plain form
13117 -29055 112357 379548 -211980 240844 -12938 -46838 134871 254608 -101135 267532
13106 -114378 381105 209840 292779 -55711 386404 -179658 -140661 -150998 182690 285069
13096 285069 209447 -88530 -37829 -245474 25308 492759 20530 95876 1322 -63443 263538
13084 13903 46040 -110185 41700 51034 -179381 4133 216327 -126996 388208 79901 94943
13073 94943 52409 31948 214213 257036 278882 158465 113868 291149 230816 503933 125292
13061 35169 125518 87420 419212 -220131 69863 56229 280889 30440 697 276314 -64144
13049 -2011 10064 49657 85926 358111 370923 103662 -39627 -155326 164957 354681 -20531
13037 321714 251850 730 242465 32299 -137008 -42569 -144278 -275800 21052 25528 270739
13026B70739r0771O2465F7012a78309C74258j76123R7721N3181r846F0856a44941
13014B79618G7631a6039C484L18858a61056B26075b74916E3363J23730M1638j8751
13003A99980k3546o6594J35475j1088F0868K02147q6334f376A50841M382N0616
12992B05839L0189j11459l8695j185a65440I7903c2448C26312r8948F5371a04304
12980C66810r0361j16054n873h0601H5161m531c4120c356H280h2615j22084e2012
12967D24952A38630D1694J25740c883q0049B90547h3784D94552a19757c7503B40367
12955b46808B9588J17370a45670A85474C7661J7034f5904j40926A86737b2495
12944g0696A8683c54323A53332l1172h2995j00015Q0772C15880a52891N8865A22327
$$ plain form
13026 270739 179968 242433 67012 -178309 374258 198135 295856 349037 339191 60856 -144941
13014 279618 77631 -16039 3484 322342 -161056 226075 -274916 53363 177093 218731 199980
13003 199980 176434 109840 245315 234227 60868 263015 176681 -6376 150841 155223 205839
12992 205839 236028 124569 85874 84689 -165440 97903 -32448 326312 227364 65371 -104304
12980 366810 276449 160395 154522 -80601 85161 80630 -34120 -3356 8280 -82615 -204699 -52012
12967 424952 138630 41694 167434 -3883 -83932 290547 -83784 494552 -119757 -37503 240367
12955 -246808 29588 146958 -145670 185474 37661 54695 -65904 -206830 186737 -22495
12944 -70696 18683 -354323 153332 122160 -82995 -183010 -102238 315880 -152891 -94026 122327
12932A77971K79981A2686R2218M6208a76517F2140J31166a4005D9888c6916J310
12921c5606j46770B30264b1999A18731C7913J69615J53713G8404b82658h2663
12910i0603B76531G3204a87665B09914f5901B42938a66521E7278N3314E2093O9252
12899A21345c1054A61226h6363A18177b7923A15760L5267A5840g2151p952A76737
12887A73778a12700A51719Q7197b6728n4337A36486a42541G1183J51227a98985
12876A30663J47556a16165j4256F11117B69590A18085a06743B243g3766A17406
12865a06457j64640J01242C4378p768g4268A55201B7090K9988K31257A5810M03941
12854D19751k419b48215B83606A14954d7888l04361a10466j55472B36184J77930
$$ plain form
12932 177971 457952 12686 104904 151112 -176517 62140 193306 -14005 49888 -36916 -35606
12921 -35606 -182376 230264 -21999 118731 37913 207528 361241 78404 -282658 -82663
12910 -90603 276531 73204 -187665 209914 -65901 242938 -166521 57278 110592 52093 121345
12899 121345 -31054 161226 -86363 118177 -27923 115760 151027 15840 -72151 -80103 176737
12887 173778 -112700 151719 238916 -26728 -81065 136486 -142541 71183 222410 -198985
12876 130663 278219 -116165 -130421 611117 269590 118085 -106743 2243 -73766 117406
12865 -106457 -271097 -169855 34378 26610 -74268 155201 27090 57078 288335 15810 419751
12854 419751 417332 -248215 283606 114954 -47888 -352249 -110466 -265938 236184 414114
12844D14114D5229c1304B40749a57922B95157e8231A82285a52881A15077L12122
12834D27199j50476a56642l2231A99255J82889m5098i2231H8095m0166R5207c4003
12822B43248Q271q4042A2035b4536j72434A87686D7486J46642d8615D2113J5349
12811E7462a3014k8620A20346K20238j17585j01631A8128H980d31559B9230a56265
12799B29041C1338a46263j71781B04433d0418o2567M5607k00049H9364B0775c4148
12787A25876a29705F4295R9428a62080F1515L33757E8993e04487B23875e3409
12776A21627a27709j12036B19632K3669q9706K76645B446d32809K01899E5868
12765C0099a43294M7555B91344a8046E4451b4362B34761p310J00347e0515k46738
$$ plain form
12844 414114 45229 -31304 240749 -157922 295157 -58231 182285 -152881 115077 427199
12834 427199 276723 -156642 -188873 199255 382144 337046 -92231 88095 47929 143136 -34003
12822 243248 251519 167477 12035 -24536 -196970 187686 47486 194128 -48615 42113 57462
12811 57462 -13014 -41634 120346 340584 222999 121368 18128 8980 -431559 29230 -156265
12799 229041 31338 -146263 -318044 204433 -40418 -102985 -57378 -257427 89364 20775 -34148
12787 125876 -129705 64295 163723 -162080 61515 395272 58993 -504487 223875 -53409
12776 121627 -127709 -239745 219632 243301 153595 430240 2446 -432809 -230910 55868
12765 30099 -143294 -95739 291344 -18046 54451 -24362 234761 227451 327798 -50515 -297253
12754b97253B24879b90828a23508A87634l61J4129a15485j0304A56863a02605
12743B32055a08740G4913b5983j25337K9712N4755A17981a1657C8241G631a93103
12731A1048a1067I1594O1285J22246b01071D30074j32705j1123b87711B36428
12720a72157A74747E2758K37483H7574e24437E2056K87627a38445A45079a63257
12709f0166A02336c5156A08763l0797R2683J15949A29165L06378A69852J8704
12699A88556r3637J19212P528d66C43354b26238A40782b27844P3265N8264D4536
12687a54688G2411J35468e0610j51701B79499R068r0586Q410q3152J10454p2454
12676A61239b52759A39900b23237C29626D596N7632J30266a1723m7015j3984C13418
$$ plain form
12754 -297253 224879 -290828 -123508 187634 187273 201402 -115485 -125789 156863 -102605
12743 232055 -108740 74913 -25983 -151320 -121608 -66853 117981 -11657 38241 7631 -193103
12731 11048 -11067 91594 152879 275125 -201071 430074 297369 286246 -287711 236428
12720 -172157 174747 52758 290241 87574 -524437 52056 339683 -138445 145079 -163257
12709 -60166 102336 -35156 108763 77966 170649 286598 129165 435543 169852 188556
12699 188556 94919 214131 221659 -466 343354 -226238 140782 -227844 -154579 -96315 44536
12687 -154688 72411 207879 -50610 -202311 279499 288567 197981 206391 123239 233693 161239
12676 161239 -252759 139900 -223237 329626 4596 62228 192494 -11723 -58738 -72722 313418
12664i8626B9932q059J73831M0568K52252b1521B67322F9747J11524l0426M6744
12653A97589K02411A94807J2059a10313K0909A41373J4805a10067j5825J9258
12643a06634M1156o4155B16757p8632c2836B22526j00709A2198E805c1061C56228
12631B45372a74853B90127J37371o9188H2274O5299j2513O1490G0535K97275i0705
12619c2553A59856b0687r3646D29416e9493B8374K72955G7963d3838A66278b60842
12607A71416o2237a3185k7937D78469a59222C3279L95014b43360i5857C9067h1943
12595B73775K11831c1238f150C44695I9460L8814a23312e8939H3091K39004j10212
12584B11883a95900A69879B2612P1730C1305c2821l5529l0966a5000A34485d3042
$$ plain form
12664 -98626 29932 21873 195704 236272 488524 -21521 267322 69747 181271 150845 197589
12653 197589 400000 194807 206866 -110313 -89404 141373 156178 -110067 -125892 -106634
12643 -106634 -65478 -129633 216757 138125 -32836 222526 121817 12198 5805 -31061 356228
12631 245372 -174853 290127 427498 358310 82274 147573 135060 196550 70535 367810 -90705
12619 -32553 159856 -20687 -114333 429416 -59493 28374 301329 77963 -43838 166278 -260842
12607 171416 109179 -13185 -41122 478469 -159222 33279 428293 -243360 -95857 39067 -81943
12595 273775 485606 -31238 -6150 344695 99460 138274 -123312 -58939 83091 322095 211883
12584 211883 -195900 169879 22612 94342 31305 -32821 -68350 -99316 -15000 134485 -43042
12572a00323p7609f5527i247A05942b05758D23649E8849a52124A66244f3938A4349
12560b18619A3i061j5288F4574K36206A31338J14902c50658B68318F5656g9041
12548B79017k706A32748M0193n7963O2902b46465A90819J1436C2606M2706K05338
12537B80650F9458J80340J4661r2192a17484C7626a35910C84956b54538A24881
12526A64525M2974H7242A7471H063M7306h124H3684l9516J14654L7057J96859
12515C92738a92794B92029c4450A54269a8041o4422A01879m2954a21796M0929
12505h0867l4642l1640c6223j06524D8270O1266a85221B17314b0349n2578B08463
12493a768k47148A84723C9590K8397k9763J49211a88831C59765I8606K42385A57446
$$ plain form
12572 -100323 -177932 -65527 -9247 105942 -205758 423649 58849 -152124 166244 -63938 14349
12560 -218619 13 -9061 -24349 64574 300780 131338 246240 -350658 268318 65656 -79041
12548 279017 276311 132748 172941 114978 177880 -246465 190819 202255 32606 75312 280650
12537 280650 69458 249798 264459 172267 -117484 37626 -135910 384956 -254538 124881
12526 164525 207499 87242 17471 8063 55369 -8124 83684 44168 158822 195879 392738
12515 392738 -192794 292029 -34450 154269 -18041 -82463 101879 58925 -121796 -80867
12505 -80867 -115509 -147149 -36223 -142747 48270 109536 -185221 217314 -20349 -72927 208463
12493 -1768 -248916 184723 39590 67987 38224 187435 -188831 359765 98606 340991 157446
12481C11995d2068J3244r7576A10447f3156A4015J67412O6827F9623K0765o573
12470H3815b8279A03006e6328D4010K6327a772E0206i0380j34456d5264B2026
12458e874A43360a17002M8172A19200R0680d8381p9334m2566A39733b3421H8054
12446c05321J29711A33563D4902o140L0697k2172d16548a20529A09659a56482
12435I4924a38405A60332R9932I0505a11659M5160j53861A89126K62366a63358
12424A7834Q0106J07965G7024L0339f7092A44643j2785E2997a861j34426A01946
12412a87030D46711H8079g6357e405j04441B62084D0468a73889e5214A05667k472
12401A03195f0432A27207b63610j6309B7674h2964c9750B8580a38946C11188A35331
$$ plain form
12481 311995 -42068 -28824 -126400 110447 -63156 14015 181427 248254 69623 90388 83815
12470 83815 -28279 103006 -56328 44010 70337 -1772 50206 -90380 -224836 -45264 22026
12458 -5874 143360 -117002 -68830 119200 209880 -48381 -127715 -170281 139733 -23421 88054
12446 -305321 -175610 133563 44902 38762 69459 47287 -416548 -120529 109659 -156482
12435 94924 -138405 160332 260264 90505 -111659 -66499 -220360 189126 451492 -163358
12424 17834 97940 205905 77024 107363 -67092 144643 131858 52997 -1861 -136287 101946
12412 -187030 446711 88079 -76357 -5405 -109846 262084 40468 -173889 -55214 105667 103195
12401 103195 -60432 127207 -263610 -279919 27674 -82964 -39750 28580 -138946 311188 135331
12389b0626q9161A82181b56236L2495c4270j56772M7230B64572a13730A26005
12378f0407A05522c0018m5543C43344a4445E8990A0564R5775R3881c55944a42357
12366H2849R5560b85463A38054d2736n7413j43187C55676o5522B9393K49110a86686
12354c08268D03676A27738n5546Q7464d6576j91029B8274a95506B36665F356e1333
12342H0337b20694C21280d7908A79774P3620c54168e1264D68349B06774F6917
12331G329K43924A07288C8283d08121A62863a1915A82037b80473b3663A47712
12320E9693a79411l33799f4790k9163E329b5972E1497M7221A9577d5742E30377
12308B06725c5177G9001J1069K1801R3073j9522E9196L05824b2135I9286J24354
$$ plain form
12389 -20626 -109787 182181 -256236 -223741 -34270 -191042 -143812 264572 -113730 126005
12378 -60407 105522 -30018 -75561 343344 -14445 58990 10564 106339 200220 -355944 -142357
12366 82849 178409 -285463 138054 -42736 -100149 -243336 355676 290154 29393 278503 -186686
12354 -308268 403676 127738 72192 159656 -46576 -237605 28274 -195506 236665 6356 -51333
12342 80337 -220694 321280 -47908 179774 253394 -354168 -51264 468349 206774 66917
12331 7329 251253 107288 38283 -408121 162863 -11915 182037 -280473 -23663 147712
12320 59693 -179411 -513210 -64790 -93953 5329 -25972 51497 98718 19577 -45742 530377
12308 206725 -35177 79001 90070 111871 204944 185422 59196 365020 -22135 99286 223640
12297B23640H078J3383L54708a4717G5156K6001N1001J40916k8753b28523C21647
12285B65450a20321C7145k240b27603B4160J92022r2616g2639F3478Q0293c42075
12273A63498p282N1734a43665A41411J651L55840A52528a74820C9068c3915M85
12262c3430A96099F7388a21562B37090i8888a0909B55151I5140c8396k4305C40748
12250i1842C32687A34162a36572k96224B4440K00917q4965A8463J03309K53722
12240C75494j83736b35176C8233J66574a8102R48A50331a47521D25441G7292k8457
12229D8835J05970J94053p7190L5605p8892j926J0782k2239c5070B42461J8486
12218B60947j05972J15859j19687B6457L33278k9065b06826A24078M05796b69729
$$ plain form
12297 223640 8078 21461 376169 -14717 75156 101157 152158 293074 264321 -228523 321647
12285 265450 -120321 37145 34905 -227603 24160 216182 123566 -72639 63478 143771 -342075
12273 163498 156216 207950 -143665 141411 143062 498902 152528 -174820 39068 -33915 -33430
12262 -33430 196099 67388 -121562 237090 -98888 -10909 255151 95140 -38396 -62701 340748
12250 -91842 332687 134162 -136572 -432796 24440 225357 140392 18463 121772 375494
12240 375494 191758 -235176 38233 204807 -18102 -17154 150331 -147521 425441 77292 48835
12229 48835 154805 348858 271668 307273 228381 226455 237237 214998 -35070 242461 260947
12218 260947 154975 270834 151147 26457 359735 330670 -206826 124078 529874 -269729
12207A25683R0575H8622k2093C1245O8431C0604c7974A26119J03506k8625a90252
12195b08136O9367A50524O3539J98329j56319A18895l153K04566A17490M3478
12185A60968J27315q8432J21032A15649J2530k6861L1070K91115a3168C27781
12174C87431b95952A09523J85111b61103A41969N8045L01611k27985J7463J72577
12164D63680j75960a36346N9720B17533R7254q8541N962r3894j4885J30398a93980
12152e4608m6669J072n4173F6914e3363B74116j25774J48829L1877r1814B8403
12140c5682A45139J03949q7640h5452A39182g2036B08887J49047q2653J14974
12130C90255c1551A54255a99387A7732J05185E5755P2162l6205K57051a63248
$$ plain form
12207 125683 216258 88622 66529 31245 99676 30604 -37974 126119 229625 201000 -190252
12195 -208136 -138769 150524 214063 412392 256073 118895 115742 320308 117490 160968
12185 160968 288283 199851 320883 115649 128179 101318 132388 423503 -13168 327781
12174 387431 -295952 109523 294634 -261103 141969 200014 501625 273640 291103 463680
12164 463680 287720 -136346 -76626 217533 314787 226246 232208 138314 123429 253827 -193980
12152 -54608 -101277 -100205 -154378 66914 -53363 274116 148342 297171 329048 237234 28403
12140 -35682 145139 249088 161448 -85452 139182 -72036 208887 357934 275281 390255
12130 390255 -31551 154255 -199387 17732 122917 55755 127917 91712 348763 -163248
12119B31763m9024a40369b1418F1431R0157K7366J48588A24277b80118H5366J86042
12108B71408a78409E8528a1867n2828B79707A23072J3621E2543d08626B4997b6272
12096a94187G9992C3474c1184j135m4514C6728M7050O361J09763J9510I1711C9599
12083a06412j31573E5177J62614a49656J5154A30111J07653G2459f8804B04726
12072A02720h9057b9601B13923e0073J7513i176A4379a0936A31849L2208J80123
12061C44180i8701F44839K87389M88948C74410A06137F500J27635a64934B09523
12050e8046D0687J30281h6778k4377d0166m9230A53286P248l472J71225c0227
12038h1607H3151D0073a84662Q8360M0979B54549b84590a14797A27240a08688
$$ plain form
12119 231763 182739 -140369 -21418 61431 151588 178954 327542 124277 -280118 85366 271408
12108 271408 -178409 58528 -11867 -64695 279707 123072 136693 52543 -408626 24997 -26272
12096 -194187 79992 33474 -31184 -32319 -76833 36728 83778 90139 199902 219412 91711 39599
12083 -106412 -237985 55177 217791 -149656 -134502 130111 237764 72459 -68804 204726
12072 102720 -89057 -29601 213923 -50073 -32560 -9176 14379 -10936 131849 164057 344180
12061 344180 -98701 644839 932228 1421176 374410 106137 6500 134135 -164934 209523
12050 -58046 40687 170968 -86778 -111155 -40166 -89396 153286 160534 157062 328287 -30227
12038 -81607 83151 40073 -184662 -96302 -55323 254549 -284590 -114797 127240 -108688
12027c33165a08326G7701O4220C8546i3751D2605b31749L2035j1464d6457K1982
12016b4475p9086j44130K3638C2773d5746A92209b92662P2045e7742G383c0350
12004c29721r0142a10492d7151k30923A53808d50269a68671f6193B93620E2655
11993b7402A18976b11843n3475R6557A68322b5834F4684c48360H7330a37770C48760
11981B53761b23422A2761c27613d8393B29085j11165E0838r851R147c125j42906
11970a46031A60542j1953F8653e9727I2993F335i0193F2619J7205g3536B99001
11958d2271A85853a51742C23600g7064B48a81405P3873D50712G7579P6221A2378
11946d21645D1001J7284J4741h2732B21271d0569j51712p4155D4850J41089C2664
$$ plain form
12027 -333165 -108326 77701 141921 38546 -93751 42605 -231749 -199714 -211178 -46457 -24475
12016 -24475 -103561 -247691 -224053 32773 -45746 192209 -292662 -220617 -57742 7383 -30350
12004 -329721 -419863 -110492 -47151 -278074 153808 -450269 -168671 -66193 293620 52655
11993 -27402 118976 -211843 -265318 -168761 168322 -25834 64684 -348360 87330 -137770 348760
11981 253761 -223422 12761 -327613 -48393 229085 117920 50838 40987 50134 -3125 -146031
11970 -146031 160542 148589 68653 -59727 92993 6335 -90193 62619 79824 -73536 299001
11958 -42271 185853 -151742 323600 -77064 248 -181405 -107532 450712 77579 153800 12378
11946 -421645 41001 58285 73026 -82732 221271 -40569 -192281 -266436 44850 185939 32664
11934g755G2750b15057C7287d329j65406B482b46960a15456A89858h0857B649
11922a21423A56257g6619l4867j48770B91316A03308m8139J6184i3166D8780a01909
11910a0518A46145h1650B08766a65858H391L1162K04489A4176f0623G9503a71696
11898B17028a52782j61561A76349G3826a36826A5864c30584J26094B17871g7318
11887i6585A435O7048f1754I8623b97758L2940p1958L4752m9102A1076c05809
11875A28498g8262A34584B3635J58207c09053M2155B55527b4693f212j68780j65626
11864c40618j00213A5158f2012K4360o4288q7730B01727j1527o9435a45199j40307
11853b85506A21848b51571G8662M9987N2906b73127h7715j00640A74408J6032
$$ plain form
11934 -7755 72750 -215057 37287 -4329 -169735 2482 -246960 -115456 189858 -80857 2649
11922 -121423 156257 -76619 -111486 -260256 291316 103308 55169 71353 -93166 48780 -101909
11910 -10518 146145 -81650 208766 -165858 8391 39553 244042 14176 -60623 79503 -171696
11898 217028 -152782 -314343 176349 73826 -136826 15864 -330584 -204490 217871 -77318
11887 -96585 1435 68483 -61754 98623 -297758 -264818 -336776 -302024 -351126 11076 -305809
11875 128498 -78262 134584 23635 181842 -309053 -266898 255527 -24693 -6212 -174992 -340618
11864 -340618 -440831 15158 -62012 -37652 -101940 -189670 201727 190200 120765 -145199 -285506
11853 -285506 121848 -251571 78662 128649 181555 -273127 -87715 -188355 174408 190440
11843A90440a13379l06004A76785F7455J8167P6011O9980e8227k86849A65811
11832H5943b93450l5618D53633F3600a1046G8218R1727c43674K9634G1024b5541
11820f821E4798a70155J5982j33087E7484a05734q896c068B30175a21333C4627
11808B86847D4058K63548g0078j76136d5634A5429J30730a22439j93564d061j66330
11797a70391o1748J9060J02440I389g2675p2601A59735f9917A99688q2666f9961
11785a53452a1714G7670b26412j0480F0435K0484L1192j6768b32698R3373o7710
11774b07035A37478a51266P3682K6329A47998b35875h8637C25573i4630B07197
11763a58011I0908a63734l8232P7150N640I8972b5295j13983B44534a52355C02093
$$ plain form
11843 190440 -113379 -419383 176785 67455 85622 161633 231613 -58227 -345076 165811
11832 85943 -293450 -329068 453633 63600 -11046 78218 169945 -343674 -314040 71024 -25541
11820 -6821 54798 -170155 -154173 -287260 57484 -105734 -114630 -3068 230175 -121333 34627
11808 286847 44058 307606 -70078 -246214 -45634 15429 146159 -122439 -316003 -4061 -170391
11797 -170391 -232139 -213079 -110639 9389 -72675 -145276 159735 -69917 199688 117022 -69961
11785 -153452 -11714 77670 -226412 -236892 60435 80919 112111 95343 -232698 -139325 -207035
11774 -207035 137478 -151266 -77584 -51255 147998 -235875 -88637 325573 -94630 207197
11763 -158011 90908 -163734 -201966 -124816 -119176 98972 -25295 -139278 244534 -152355 302093
11751a29561B74085G8134l5066g6959C50621b86078i5521A01528a01966A16450
11740C26750a75042B3192a82611K6258E9238B1977a3840A53422L5357H5481f0553
11728g0757A6131J16372r455J3281a319k5601j08361a444k80138i6160A81163
11716a12910k28331J26842e4823C2722c9029H0084C092b21548h4105A65799g561
11704F9983N1267n6277g3021k2505o9776A2415b45447B75206A12975b53745H372
11692b00565M8117r4594R7768M5767n2048A51504a71626A22153J15202a02718
11681B84642b2326D8475P9258c9533j05755D8307J33368a47534B73905a60584
11670b40433G9624b39244B78655a21458J1444J8057A16576a54645d2861r2023
$$ plain form
11751 -129561 274085 78134 43068 -76959 350621 -286078 -95521 101528 -101966 116450
11740 326750 -175042 23192 -182611 -156353 59238 21977 -13840 153422 188779 85481 -60553
11728 -70757 16131 132503 123048 136329 -1319 -26920 -135281 -1444 -281582 -96160 181163
11716 -112910 -341241 -214399 -54823 32722 -39029 80084 3092 -221548 -84105 165799 -7561
11704 69983 121250 64973 -73021 -95526 -165302 12415 -245447 275206 112975 -253745 8372
11692 -200565 -152448 -247042 -149274 -103507 -155555 151504 -171626 122153 237355 -102718
11681 284642 -22326 48475 127733 -39533 -145288 48307 181675 -147534 273905 -160584
11670 -240433 79624 -239244 278655 -121458 -110014 -91957 116576 -154645 -42861 -134884
11660a34884D45939H2385c79152e5112k7491I6424M0304g7947k3879j4339n9335
11649a75500g4261D167M6541K41716a25569o7973P6010C84275j61624i7913L3066
11638f4847b5934o1715p6839B47322a15588A20188b19196B07008N7877c75206
11627B60574R2762g5934k06066e5894B67410i9127C20548b95650D67967b0473
11616d07107f251j27737r567B1816d3036j06882Q418k36630B40506a85764A52289
11604D4282J40308b26169L2756F5731c3426C38120j49141a58925j0550f4464q0030
11593a44494A61088a1498A12408E3720a53592j67249E3647P2217f4821j35947
11583b00768r1254a8835A5879g8028E554Q9108b74118F3915l1063d71469D1295
$$ plain form
11660 -134884 445939 82385 -379152 -55112 -82603 96424 136728 -77947 -101826 -116165 -175500
11649 -175500 -74261 4167 50708 292424 -125569 -193542 -117532 384275 222651 -97913 -64847
11638 -64847 -25934 -87649 -164488 247322 -115588 120188 -219196 207008 264885 -375206
11627 260574 353336 -75934 -282000 -55894 267410 -99127 320548 -295650 467967 -20473
11616 -407107 -6251 -133988 -143555 21816 -43036 -149918 -141500 -378130 240506 -185764 152289
11604 44282 184590 -226169 -193413 65731 -33426 338120 188979 -158925 -169475 -64464 -144494
11593 -144494 161088 -11498 112408 53720 -153592 -320841 53647 125864 -64821 -200768
11583 -200768 -292022 -18835 15879 -78028 5554 94662 -274118 63915 32852 -471469 41295
11571C3870J95643a49568b6290A51374i7291M0316j68176J04786c7061A83993
11560i5129F9133K90253o0504a520k35757A93257N2996K2282H1182c0123A15499
11548c01103A13131q965c0287B7802d20359a6069l0136l56715H406a20768N5742
11537f5026a6520A32567e27E2964Q0689N2953B6407K09669p3659J89016G5591
11525a17189C56274J1864B0050e0835B89360Q4087a17169B75159a00499k52053
11515c52552A13162M759K07508A48831F4382b01970b2717B41838d0245A38193
11504b9532B81097g8237A90978K89808A51470a4190B94550I9005B4716P5057c1531
11492C11565O8244e8212F3961L02021o5966D3984e54D66226j93550a7752A61395
$$ plain form
11571 33870 229513 -149568 -26290 151374 -97291 -56975 -225151 -120365 -37061 183993
11560 -95129 69133 359386 298882 -1520 -237277 193257 246253 268535 81182 -30123 115499
11548 -301103 113131 104166 -30287 27802 -420359 -16069 -46205 -402920 8406 -120768 -65026
11537 -65026 -16520 132567 -527 52964 133653 186606 26407 236076 162417 351433 75591
11525 -117189 356274 368138 20050 -50835 289360 373447 -117169 275159 -100499 -352552
11515 -352552 113162 117921 325429 148831 64382 -201970 -22717 241838 -40245 138193
11504 -29532 281097 -78237 190978 480786 151470 -14190 294550 99005 24716 99773 -31531
11492 311565 379809 -58212 63961 365982 300016 43984 -554 466226 272676 -17752 161395
11480B56235A9592K11152o915J8519C0126b93284A68859J18429L10436B04423
11469A15978J07024i189B08803a08415A31426J37048q3197K76580I2607J21371
11459B13978G9496M9158a7899B3894M5338J27320J29225j42878O6828i0345A2922
11447I3865a8761C34035r7045e6299k37242J02442E2868a01082c3496j98224A51192
11435a6515A632J38276D0126J39991e3517j67487a06124A14681J12174c7139C0669
11423A40809b98000B05851f1817A94126D6368d2338B29087f6507C36132A63714
11412b7110n7848A07140j6333h8602C40550a6558j70890j15654J03815B41341
11401d16825C5155M9799k6070J516M08940c77941a1962C04291A3543d0815j16639
$$ plain form
11480 256235 19592 230744 223829 242348 30126 -293284 168859 287288 597724 204423
11469 115978 223002 -9189 208803 -108415 131426 268474 185277 461857 92607 213978
11459 213978 79496 128654 -17899 23894 69232 196552 325777 182899 249727 -90345 12922
11447 93865 -18761 334035 236990 -56299 -293541 -191099 52868 -101082 -33496 -231720 151192
11435 -16515 1632 139908 40126 180117 -53517 -221004 -106124 114681 226855 -37139 30669
11423 140809 -298000 205851 -61817 194126 46368 -42338 229087 -66507 336132 163714
11412 -27110 -84958 107140 90807 -88602 340550 -16558 -187448 -303102 -199287 241341
11401 -416825 35155 84954 58884 60400 469340 -377941 -11962 304291 13543 -40815 -157454
11390a57454D9074k0962c1938l61724F9437a62340f7975B22508j03677J90119
11380C08950h3523B21535c23279A2828K56714o0031J08013a45135o0558A82680
11369I1007j4748J74018C5290K31047c17452i2881K1517j14945A95145J51639
11359C46784F8336b06846k7596A27868c69229G8806K3092J06917a02843D5137
11348c595B27458e9311C49117A15531a52423m51179I8574d10579A11530j4569
11338I6961b78409f5189K2789A18101f8171p7457G581g2969k25308J31602P4616
11327i2059I3848J0025b8385A37944a80647B75577a93149k6900e7247l48868J58206
11316b47909k20099J89664B30457a97768Q067f2999E9893e1080k23285B255J08033
$$ plain form
11390 -157454 49074 28112 -31938 -393662 69437 -162340 -67975 222508 118831 308950
11380 308950 -83523 221535 -323279 12828 269542 209511 317524 -145135 -205693 182680
11369 91007 76259 250277 35290 266337 -317452 -92881 -71364 -186309 195145 346784
11359 346784 68336 -206846 -234442 127868 -369229 78806 101898 208815 -102843 45137
11348 -3595 227458 -59311 349117 115531 -152423 -603602 98574 -410579 111530 96961
11338 96961 -278409 -65189 -42400 118101 -68171 -145628 7581 -72969 -298277 -166675 -92059
11327 -92059 93848 103873 -28385 137944 -180647 275577 -193149 -220049 -57247 -406115 -247909
11316 -247909 -468008 -278344 230457 -197768 -189701 -62999 59893 -51080 -274365 2255 110288
11305A10288J53493A15835C9941b9616j03542m6785L1346N3634A77901c0241A1083
11293e1875A9633h5764A38210B452i2285H3674j7777a04008a034j1151j05566
11282a17751D4407b14365C4208M31052A7406d67642a72929A40111d8005H7252
11271b59844B04487L3939h8212k44114C1202a6627l7450a5892j9922j42878a259
11259d74740a20401c8700j33997k17690e8772F9353c81558J49981N9503G42g8838
11247A78937e0487A2194J385b20024Q7853A17685j1351d705I7368h4369b3749
11235a72112h653j39070c1597l65549a44075o005A52876A3362K330i9030L8299
11224f0731A40515b02779h1984p0909L7958b7712k7551J0548H5845K31028P3441
$$ plain form
11305 110288 263781 115835 39941 -29616 -133158 -179943 -148597 -94963 177901 -30241 11083
11293 -51875 19633 -85764 138210 2452 -92285 83674 65897 -104008 -1034 -12185 -117751
11282 -117751 44407 -214365 34208 465260 17406 -467642 -172929 140111 -48005 87252
11271 -259844 204487 238426 -88212 -332326 31202 -16627 -54077 -15892 -35814 -178692 -1259
11259 -474740 -120401 -38700 -172697 -390387 -58772 69353 -381558 -231577 -172074 742 -78838
11247 178937 -50487 12194 13579 -220024 -132171 117685 106334 -4705 97368 -84369 -23749
11235 -172112 -8653 -147723 -31597 -397146 -144075 -150080 152876 13362 15692 -99030 -60731
11224 -60731 140515 -202779 -81984 -152893 -114935 -27712 -55263 -44715 85845 316873 390314
11213C90314r9481a67150N3368m8439A05810a4012A141J46447b36226A10632d5782
11201c2362H2790a90293e5340K7307j41306G9742a05879A08866a34372A61757
11190B31502f7725j29219B24995m9314l1501b34907A11692h9863I3385i454B33897
11178a07170k03315A61033a54758j67593e639k07964A76141c63359h9972I3065
11167i4111L2131C39338a21201C9349b07251C7977b48356B491c32960g5977k10069
11156b86046R9667n2108B39635d0568E8404J3853K8474i0103q0239g7210j81736
11145b58946E8370E239J0005a68257B2489L1267c3053B14428G5052a44688A087
11133i8440C04726A39092J70730h9643B14990F1110J64878m571E1772e5609j40536
$$ plain form
11213 390314 290833 -167150 -113782 -162221 105810 -14012 1141 147588 -236226 110632 -45782
11201 -32362 82790 -190293 -55340 -28033 -169339 79742 -105879 108866 -134372 161757
11190 231502 -67725 -196944 224995 175681 144180 -234907 111692 -89863 93385 -9454 233897
11178 -107170 -310485 161033 -154758 -322351 -5639 -213603 176141 -363359 -89972 93065
11167 -94111 -61980 339338 -121201 39349 -207251 37977 -248356 2491 -332960 -75977 -286046
11156 -286046 -186379 -238487 239635 -40568 58404 72257 100731 -90103 -170342 -77210 -258946
11145 -258946 58370 5239 15244 -168257 22489 53756 -33053 214428 75052 -144688 1087
11133 -98440 304726 139092 309822 -89643 214990 61110 225988 221417 51772 -55609 -196145
11122a96145g8347j2974K6015k0051B52567h2882B70395e506A35383J75892a46269
11110F0630J09960J12631I2504g6004A49948K05368E982i3000O395D0093L49210
11099C89303A27948F1719P5551K6136p1643L6449O1999P896P2506A09203d6949
11087D44639j42266n0525a21190F71334F5278k7749K64961A28299J66859E3922
11076A39269m0305K03480j16857O1687A19505R1692N40248B92166o219l71L3684
11065C19260j36415M55804C16142M38871l10221j16197M83506k83993N0387k15107
11055C63388p8010J62684J97113J93972J14817l68019P0938J04300L5179J63371
11045I59733j31156j36603r2303K55711j14445k16490L32344L9949j3926l2201
$$ plain form
11122 -196145 -78347 -91321 -65306 -85357 252567 -82882 270395 -5506 135383 311275 -146269
11110 60630 170590 283221 92504 -76004 149948 355316 5982 -93000 -86605 40093 389303
11099 389303 127948 61719 137270 163406 91763 128212 190211 198107 270613 109203 -46949
11087 444639 302373 251848 -121190 671334 65278 37529 302490 128299 295158 53922
11076 139269 98964 302444 185587 247274 119505 211197 751445 292166 285947 285576 319260
11065 319260 182845 638649 316142 755013 444792 328595 812101 528108 578495 363388
11055 363388 285378 448062 645175 839147 953964 585945 656883 761183 796362 959733
11045 959733 828577 691974 599671 855382 740937 524447 856791 896740 882814 850613
11035H50613q6927m553J391p9096K32786k666j2911l36384K42418o1148k66209
11024D77314M26918l46687K32457L33991m63417K0208j23871K64219k61330j28612
11014D31190L66759l41084M74940B55332J07945N24092k12702B61361J01615L92983
11004G55959l62080o0092M53405j01079C07345M81817J60322C78772J01206J98028
10994F78006J65589o1175K45577L5970k05846j57629J41810L12415j58921j84356
10984H11440J7937j5059L43376Q5396l5011K62136o4855J72389o5870J52987K61802
10973A926668O53681p683L40711K99276O1778n40617M26134o83432k21092n43941
10963A711483J8600k89020J4685l0634o73147K67973L0479O6238K17857l01552
$$ plain form
11035 850613 763686 759133 760524 681428 914214 911548 898637 562253 804671 743523 477314
11024 477314 904232 557545 790002 1123993 660576 680784 556913 821132 559802 431190
11014 431190 797949 456865 931805 255332 363277 887369 674667 261361 362976 755959
11004 755959 393879 333787 787192 686113 307345 789162 949484 378772 479978 678006
10994 678006 843595 782420 1027997 1063967 858121 700492 842302 1154717 995796 811440
10984 811440 829377 814318 1157694 1243090 1208079 1470215 1405360 1577749 1511879 1664866 1926668
10973 1926668 2580349 2572666 2913377 3212653 3274431 2733814 3159948 2476516 2255424 1711483
10963 1711483 1730083 1441063 1455748 1425114 751967 1019940 1050419 1116657 1334514 1032962
10953A032962r0223D40310K00842j05568j15500p7983a0896D86301j34003a76226
10942B29212M52n9017a30305G5660O8903h0699D1621J39166O6327c3974B22539
10930A78285K91233A83550L50128k15333b08604h6685B58407c1138B400L01029
10920C03429C3961N9633K38011d6677A12799f4293o0473j70618A11967k5241a00437
10908f0469b7735k3083C5162i744j04021A73379h3497L8284A27265L45650a1750
10896A36405c59868d2357H922a6699j1088g775n1499G9388P494R1528o5924J8428
10884A30914a27994B59217a10747J0849j37277c2715B06530I5983b93731l7308
10874c31039B67846B5458J55989R2166C780L41142b80788P9724G9532L1418a27653
$$ plain form
10953 1032962 942739 440310 641152 535584 420084 342101 -10896 486301 352298 -176226
10942 229212 229664 170647 -130305 75660 144563 -80699 41621 180787 247114 -33974 222539
10930 178285 469518 183550 533678 318345 -208604 -86685 258407 -31138 2400 303429
10920 303429 33961 93594 331605 -46677 112799 -64293 -124766 -295384 111967 86726 -100437
10908 -60469 -27735 -50818 35162 -9744 -113765 173379 -83497 -45213 127265 472915 -11750
10896 136405 -359868 -42357 8922 -16699 -27787 -7775 -59274 79388 86882 178410 112486 130914
10884 130914 -127994 259217 -110747 -99898 -237175 -32715 206530 95983 -293731 -331039
10874 -331039 267846 25458 181447 273613 3780 344922 -280788 -201064 79532 110950 -127653
10862A39763j40a34173L0271A33909c9566k80640l02292D10052G0378a31670O0585
10851g1085m5970j87615E2506h8454b2000r2014I6024J30857H2583J98674A28375
10839B21049b6863B23156b9354A24677k6165Q0469c95939d3169B6769b83500A29367
10827E569K44327j09256b98130E0344j8841M9963d07634a94748e2827j5037k8272
10816i6136I758h4145M1239B3818N2283b8090j63298E5568j7896N9959b04187
10804E8483P4449i2192j86338o8727o0995H6368a93328A14240a27410N7430c4941
10792A94217K6159J25310a18184j30163I0087C4803b05622h2736E6069a80726
10781B00831h7034B7024J62854H0767d3934j65150C08428a13819B5814q377c65004
$$ plain form
10862 139763 139623 -134173 -103902 133909 -39566 -320206 -622498 410052 70378 -131670 -71085
10851 -71085 -117055 -304670 52506 -88454 -22000 -114014 96024 226881 82583 281257 128375
10839 221049 -26863 223156 -29354 124677 98512 178981 -395939 -43169 26769 -283500 129367
10827 5569 249896 140640 -298130 50344 31503 81466 -407634 -194748 -52827 -67864 -96136
10816 -96136 9758 -84145 -42906 23818 76101 -28090 -191388 55568 37672 97631 -204187
10804 58483 132932 -92192 -278530 -347257 -408252 86368 -193328 114240 -127410 -69980 -34941
10792 194217 220376 345686 -118184 -248347 90087 34803 -205622 -82736 56069 -180726
10781 200831 -87034 27024 189878 80767 -43934 -209084 308428 -113819 25814 17437 -365004
10769D765a33023Q494C13186b7208j04025A06822L49950c4989k55721H8403a78924
10757A25900i0583C22466C3493b2607A43010n6296K073R8341f1633B00422a53565
10745A9020a00953j17326J8754A28655a76369H5923a81270A55615j3462b42367
10734A9786a44603c9468j0285j47616k523A17732d8515F1367k3627d6056C69473
10722d45911I9748d34629A7790e18409B0746K3817g3542B22405b15010J02386
10712a12624G8491a75878n24063e8224A61873L5211d36384A60789B4297a44092
10701f6091l20465B09428b47007P7777A13865a37908r8840k19686A26264a38543
10690d6286A93192M6613a22676J7740J612J3789o2309B736d7318A17236J78384
$$ plain form
10769 4765 -133023 -124529 313186 -27208 -131233 106822 456772 -34989 -290710 88403 -178924
10757 125900 -90583 322466 33493 -22607 143010 86714 88787 187128 -61633 200422 -153565
10745 19020 -100953 -218279 -199525 128655 -176369 85923 -181270 155615 142153 -242367
10734 19786 -144603 -39468 -49753 -197369 -199892 117732 -48515 61367 37740 -46056 369473
10722 -445911 99748 -434629 17790 -518409 20746 44563 -73542 222405 -215010 -112624
10712 -112624 78491 -175878 -699941 -58224 161873 197084 -436384 160789 24297 -144092
10701 -66091 -386556 209428 -247007 -169230 113865 -137908 -236748 -456434 126264 -138543
10690 -46286 193192 239805 -122676 -104936 -103324 -89535 -151844 2736 -47318 117236 295620
10679B95620c18558f4931B11003c44385n111Q5230a13998j63986A33507a40602
10668a3969j51317N2015C11446b80094g6353i851r9759P131k289n5500A04313
10656a56642B80427c99339D4477J25687p8161a7987H4029a0550B1727b65492B39558
10644A62924a19652H07N0957M3400b42357e073k35502G5773a09067p1266C1566
10632E3167e8852R118A48031a8742l83359a02341A08588b51786g2138b7291l5403
10621f2694j85576A35113a77857M6657c8488j1202k05694C794J50377a27702j6873
10610a44575j3226E0694b86057D5386J43972i0679L2059k2421A06332a6689m20276
10599d36965A05452a28853B0173R441J46015a11386l99294J99213M0029C10306
$$ plain form
10679 295620 -318558 -64931 211003 -344385 -349496 -264266 -113998 -277984 133507 -140602
10668 -13969 -165286 -113271 311446 -280094 -76353 -9851 -109610 -102479 -104768 -160268 104313
10656 -156642 280427 -399339 44477 170164 92003 -17987 84029 -10550 21727 -265492 239558
10644 162924 -119652 807 51764 95164 -242357 -5073 -240575 75773 -109067 -180333 31566
10632 53167 -58852 -49734 148031 -18742 -402101 -102341 108588 -251786 -72138 -27291 -62694
10621 -62694 -248270 135113 -177857 -131200 -38488 -49690 -255384 3794 154171 -127702 -144575
10610 -144575 -157801 50694 -286057 45386 189358 -90679 -58620 -81041 106332 -16689 -436965
10599 -436965 105452 -128853 20173 29614 175629 -111386 -510680 -311467 -271438 310306
10588c71653A42564a14490J9592b2513G992e2311A43230m6940g9946b0448F9400
10576b23254B89296H9860h3939B63158l1300c7753G8591O988i5067Q497g694k46590
10564b54284e4382p7111D7595c20394C3509f1794l0833j65409E9460J96924b63088
10552I7519b64750J3882I0835o646e1490j83030C7522L24048e3390j3500j77188
10541b44078i1089o7019j67807B22369I138a82783A25211a04973k40134B59816
10530a28250A34892E5250Q2190K62381b58076k60565a24004c3625D7658M4699
10520I2357a1975A40538a53190a3104E0721c3096l0010B74402a65069j5132H4553
10508d4018k82102e2554k0168b5452l3331j89603A50255c4515j23044l7232B19750
$$ plain form
10588 -371653 142564 -114490 -94898 -22513 7992 -52311 143230 96290 -79946 -20448 69400
10576 -223254 289296 89860 -83939 263158 231858 -37753 78591 85579 -95067 -86570 -7694 -254284
10564 -254284 -54382 -131493 47595 -320394 33509 -61794 -92627 -258036 59460 256384 -263088
10552 97519 -264750 -250868 90835 84189 -51490 -234520 37522 361570 -53390 -66890 -244078
10541 -244078 -91089 -158108 -325915 222369 9138 -182783 125211 -104973 -345107 259816
10530 -128250 134892 55250 137440 399821 -258076 -518641 -124004 -33625 47658 92357
10520 92357 -11975 140538 -153190 -13104 50721 -33096 -63106 274402 -165069 -180201 84553
10508 -44018 -326120 -52554 -72722 -25452 -58783 -248386 150255 -34515 -157559 -194791 219750
10496a83918P8746j02315i0047h503A08149J24104a71735D24092H407a19397j92726
10485c12123C2255a58226d7262j88751J12736e3440r19A42129C8690L17070b4018
10473D17107A28888c4965k21948Q6301B19249C5848c5305k01497j25214Q9572
10463b72444A03611O1152a15426N5454o2270I789O286a47937A55371l9859b5300
10451A11247Q7327h6755j13509E9215J07470n1855G404a11831r4496f5264D1572
10439f2836o2415e0319E1946A0146i6423A34740A9680f051k01800d5603H5050
10427A36891E1201a21767F8218j0719a70521A08229b74355Q7649e0458B44479
10416f7517B8100P9115a82570e0942j9668l63187A68545p9892b20902C27396j50960
$$ plain form
10496 -183918 -105172 -207487 -90047 -8503 108149 232253 -171735 424092 8407 -119397 -312123
10485 -312123 32255 -158226 -47262 -236013 -123277 -53440 -54359 142129 38690 355760 -24018
10473 417107 128888 -34965 -256913 -170612 219249 35848 -35305 -236802 -362016 -272444
10463 -272444 103611 164763 -115426 -59972 -122242 9789 16075 -147937 155371 115512 -25300
10451 111247 198574 -86755 -200264 59215 166685 114830 7404 -111831 -206327 -65264 41572
10439 -62836 -125251 -50319 51946 10146 -96423 134740 19680 -6051 -207851 -45603 85050
10427 136891 51201 -121767 68218 57499 -170521 108229 -274355 -186706 -50458 244479
10416 -67517 28100 107215 -182570 -50942 -70610 -433797 168545 88653 -220902 327396 176436
10405A76436F2768M7403a23571D6642d2882j54401C06972f1516j707A12011J40553
10394B52564K0660j31565A5219a9562A35945C6619J56441K37993j49831b18216
10383A84644O4891e5961B38672j07408J9777J98618l2852k8269p2259C0591K35679
10372B66270A17373J26719o0193K08415k1699a08251A38846p367R5204K78773
10362E05456d0073B21799K38092d9860B07964J47533e6864D33041p3297j46490
10352B13254M9930J9067L22024K9085j09747p8953r0616o2341A25350K8573J67736
10341C21659j27212p9993J47601m0173J20011j19033K12626j01131R350D2135
10330h939D3244a09697e3857A5145K64628a89485D19941j94073j8059J44828M5478
$$ plain form
10405 176436 62768 110171 -123571 46642 -42882 -197283 306972 -61516 -63223 112011 252564
10394 252564 273224 141659 15219 -19562 135945 36619 193060 431053 281222 -218216
10383 184644 249535 -55961 238672 131264 151041 349659 316807 288538 216279 30591 266270
10372 266270 117373 244092 183899 392314 370615 -108251 138846 131479 226683 505456
10362 505456 -40073 221799 459891 -49860 207964 355497 -56864 433041 359744 213254
10352 213254 263184 282251 604275 633360 523613 444660 354044 291703 125350 153923 321659
10341 321659 194447 114454 262055 221882 341893 222860 435486 334355 343705 42135
10330 -8939 43244 -109697 -53857 15145 279773 -189485 419941 225868 207809 352637 398115
10319C98115j93134A1517L91664j96755A3778b31617A3798a06612C1005K46433
10309B77438c61171a73950B80008a28162j8561C49365e442l09376A59502F6188
10298h7241H2682A8798K09999F7394b02259a1879B37056b0802q0562D6782Q4784
10287A31566a33700j73476Q8485q1355J24815f8475A49220d9778j09240C9511
10276f9336J0920F4824c61051a20173G6590J5470b94800d5197k6899A53909C8178
10264a1486C0592b9275A04803g3599k6160I4532A5506a17812B25153b10012A33252
10252D0761J99708K69341a18059r4929B8847c1402r4515F5183j8551c15634d4557
10240c87687H2154e7929j5719A40787e77709b13344h8359I9145b1466E8810c3894
$$ plain form
10319 398115 204981 11517 403181 206426 13778 -231617 13798 -106612 31005 277438
10309 277438 -361171 -173950 280008 -128162 -146723 349365 -5442 -314818 159502 66188
10298 -87241 82682 18798 228797 67394 -202259 -11879 237056 -20802 -101364 46782 131566
10287 131566 -133700 -307176 -218691 -300046 -175231 -68475 149220 -49778 -159018 39511
10276 -69336 -58416 64824 -361051 -120173 76590 92060 -294800 -45197 -72096 153909 38178
10264 -11486 30592 -29275 104803 -73599 -99759 94532 15506 -117812 225153 -210012 133252
10252 40761 240469 509810 -118059 -212988 28847 -31402 -125917 65183 46632 -315634 -44557
10240 -387687 82154 -57929 -73648 140787 -577709 -213344 -88359 99145 -21466 58810 -33894
10228H6039A2222L22676c13909f837n27115i0221j86050B14268p4540B6472J98396
10217B24868C7912b06780b4402k17346A06209c941j30266e6648q1019a5306q8016
10206a03322c6924k59000a37771L9431j59647a08857B2838a68550B90039g6299
10195B39266b52915J18205C4282K77437B1364b13810d5621j95341P0768m1663
10185b11857B8640b3612l6817j14097f9265j81160D311c5231C2194f2388J1163
10174e1225A21431c0781k30879J20068C825a15064M2980k81305A42486a57809
10163E9701i5597a8958p0350b7685n10095K3908F4499a3945A03298b98134J20527
10152a77607D26265o3257B1147J63047f0400B0074n72J18356a59986l5809e6151
$$ plain form
10228 86039 12222 334898 -313909 -6837 -533952 -90221 -276271 214268 139728 26472 224868
10217 224868 37912 -206780 -24402 -241748 106209 -3941 -134207 -56648 -137667 -15306 -103322
10206 -103322 -36924 -295924 -137771 -98340 -257987 -108857 22838 -168550 290039 -76299
10195 239266 -252915 -134710 34282 311719 21364 -213810 -45621 -240962 -170194 -211857
10185 -211857 28640 -23612 -60429 -174526 -69265 -250425 4311 -35231 32194 -62388 -51225
10174 -51225 121431 -30781 -261660 -141592 3825 -115064 -72084 -353389 142486 -157809
10163 59701 -95597 -18958 -89308 -27685 -537780 -513872 64499 -13945 103298 -298134 -177607
10152 -177607 426265 363008 21147 184194 -60400 20074 19502 137858 -159986 -195795 -56151
10140E4547g7500M409E7570J0726B5774a8851p67k76593B54698C5645c41722f0338
10127A65471a27837J0247A62742c00369H9165a35273m9419f882n5907a7690j88659
10116b06349a2272p2249c9516A33162c99685H2825g4565r2341B0432h776j58033
10105a66809D4494b06781l7440B19003a06206m7988e6087I1168d5862j07783k39821
10094c93466a8450B75066F2257b01414r7870A90798O726B0895E344A115a11621
10082a30265F3113d0752j90735f6313K9147A49536n8379b90556A20988c8639B51655
10070A75392a47498A34493a80783h2095D7438a84815G1899L5160c17906a12400
10059h5398H8061K4280B2729a47483O1851A85906g2819c1967B17122H1605a39612
$$ plain form
10140 54547 -77500 -73091 57570 68296 25774 -18851 -19618 -296211 254698 35645 -341722 -60338
10127 165471 -127837 -117590 162742 -300369 89165 -135273 -184692 -6882 -62789 -17690 -206349
10116 -206349 -12272 -84521 -39516 133162 -399685 82825 -74565 -166906 20432 -8776 -166809
10105 -166809 44494 -206781 -244221 219003 -106206 -154194 -56087 91168 -45862 -153645 -393466
10094 -393466 -18450 275066 62257 -201414 -299284 190798 197524 20895 5344 1115 -111621
10082 -130265 63113 -40752 -231487 -66313 -37166 149536 91157 -290556 120988 -38639 251655
10070 175392 -147498 134493 -180783 -82095 47438 -184815 71899 107059 -317906 -112400
10059 -85398 88061 112341 22729 -147483 -85632 185906 -72819 -31967 217122 81605 -139612
10047b26250N9644A23386b49250a01201j09828p2881d8390A85632b32390M7001
10037a85389c2113l53717C2345P1940a71041j8091k58660f5110r6519C49800f0447
10025c79355J27515C83710D6374f735F0251a33423B94041f604F378J20159I315
10013a41064l8944c1984m4514D6068d336E716M9660K24977I7438h8335r207F8219
10000a00158c3659B60904d735m87975A25915a95691j96810B9666a33592L0909
9990a02683J7887A9606g3069a9295l6586k39535D5388Q5789D4386N2112g4755
9978B3137c39190A5932h7127o5128E5313a75727f4763A77170E1322h3634a8353
9966g1484J9926A23040d7405Q339l7542j31540j39250A705a1104H8600c11156
$$ plain form
10047 -226250 -166606 123386 -249250 -101201 -211029 -283910 -48390 185632 -232390 -185389
10037 -185389 -32113 -385830 32345 104285 -171041 -189132 -447792 -65110 -161629 349800 -60447
10025 -379355 -251840 383710 46374 -6735 60251 -133423 294041 -6604 6378 126537 9315
10013 -141064 -180008 -31984 -76498 46068 -4336 5716 55376 280353 97438 -88335 -97542 68219
10000 -100158 -33659 260904 -4735 -492710 125915 -195691 -392501 29666 -133592 -102683
9990 -102683 -84796 19606 -73069 -19295 -55881 -295416 45388 131177 44386 96498 -74755
9978 23137 -339190 15932 -87127 -152255 55313 -175727 -64763 177170 51322 -83634 -18353
9966 -71484 -51558 123040 -47405 -39066 -76608 -208148 -347398 1705 -11104 88600 -311156
9954a07460j05544B7092J93917c09685g4837p3715K8899l3564f6720k08540g5136
9942c8378A7629L94167A41670F7511k471P6999q628d26452J59662a01800A60382
9930c9199j42606F1318a54262F2557b98202j46238a80179g7991L8821H8854b50240
9918B6919a61180P5302K012L7814k51519A73869A0099d2790A1425a41775e2485
9906c3141Q795j11903k50478J33117e3222k60804a4123l2478k33I9722b14167
9894A9412c35366P3843M6991R3182A587a38082l423B07468A6051a13926i406E30
9881g2760B44370c8182E9548a46029o4123M1549a5084B44289E9967c84164A00115
9869a97921m8194h4449k22220A03677J94755g0986k2065F7712N1283b48167A71458
$$ plain form
9954 -107460 -213004 27092 221009 -309685 -74837 -148552 -119653 -153217 -66720 -275260 -75136
9942 -38378 17629 411796 141670 67511 65040 142039 133411 -426452 -266790 -101800 160382
9930 -39199 -181805 61318 -154262 62557 -298202 -444440 -180179 -77991 -39170 88854 -250240
9918 26919 -161180 -85878 -83866 -46052 -297571 173869 10099 -42790 11425 -141775 -52485
9906 -33141 -24346 -136249 -386727 -253610 -53222 -314026 -14123 -46601 -46834 99722 -214167
9894 19412 -335366 -261523 -214532 -121350 1587 -138082 -141505 207468 16051 -113926 -9406 530
9881 -72760 244370 -38182 59548 -146029 -210152 -168603 -15084 244289 59967 -384164 100115
9869 -197921 -246115 -84449 -306669 103677 298432 -70986 -93051 67712 118995 -248167 171458
9857E7680k2807J3589J06814F381b13398o0236l66444A92044f6234l1013r5497
9846a92744F9022a61750j00591A25576h1611C15524a07307C74901a48260p0376
9836b18636h6316p6367B34988I2055J79205A23930k7861b4903n70106a60296B7039
9824A0885c7699M337m3789D5374a01991r4514g2374L2572j09730n2116k38857
9813d40505a43176D23097a15308N3983m79243A26576c33458C4385a323G7857B7462
9801A9494c96956f0861k34629I7398g7701k1888h18C34282b1483k86946h659j72448
9789a81107q697j27807N5506J8861d009r3282c7770j96095K7314H549g6198A44519
9776i8594p917G7887c727F37a56921L4850j58213k3856i2296a389o6164j28713
$$ plain form
9857 57680 34873 48462 155276 6381 -213398 -273634 -640078 192044 -66234 -97247 -192744
9846 -192744 69022 -161750 -262341 125576 -81611 315524 -107307 374901 -148260 -218636
9836 -218636 -86316 -162683 234988 92055 271260 123930 96069 -24903 -595009 -160296 27039
9824 10885 -37699 -33362 -77151 45374 -101991 -196505 -72374 -39802 -149532 -201648 -440505
9813 -440505 -143176 423097 -115308 -61325 -540568 126576 -333458 34385 -1323 77857 27462
9801 19494 -396956 -60861 -295490 97398 -77701 -99589 -818 334282 -21483 -308429 -8659 -181107
9789 -181107 -189804 -317611 -262105 -243244 -4009 -97291 -37770 -233865 -206551 8549 -76198 144519
9776 -98594 -106511 77887 -3727 637 -156921 -122071 -280284 -304140 -92296 -1389 -67553 -196266
9764a96266R7010c0071B25064c92868C8191a41252I177a23875E2188e0980j13967
9753a64947E6183K66568i8153A38836a85659A65622a01200q8113g5124A21444
9742A21102a32019a4957k29032A58724O3432d5001L393j27641e6115G9545d62292
9730b5613j79027A9362j704d88724F6588L8939b08832A07773b24181N5396k12458
9719c81243i8326r1700A0554d7658a2580k59105n3244N2096a21333A19433i6258
9707i7836j23050h7864B999b57013D4407f7417j02740L8681j15689B091a74209
9695A73603M4289d15618f2035a0846D8333J39815r3936J17605k3500c00181A60958
9683a65466b1425K129o0355C0368c96777C13729a22658j12889B33878A12096b63749
$$ plain form
9764 -196266 -99256 -30071 225064 -392868 38191 -141252 9177 -123875 52188 -50980 -164947
9753 -164947 56183 322751 -98153 138836 -185659 165622 -101200 -189313 -75124 121444
9742 121102 -132019 -14957 -243989 158724 222156 -45001 -41608 -169249 -56115 79545 -462292
9730 -25613 -204640 19362 17658 -488724 66588 105527 -208832 107773 -224181 -168785 -381243
9719 -381243 -98326 -190026 10554 -47658 -12580 -271685 -324929 -272833 -121333 119433 -96258
9707 -97836 -220886 -87864 2999 -257013 44407 -67417 -170157 -131476 -247165 2091 -174209
9695 173603 217892 -415618 -62035 -10846 48333 188148 94212 211817 188317 -300181 160958
9683 -165466 -21425 -19296 -79651 30368 -396777 313729 -122658 -235547 233878 112096 -263749
9671b50046C34814b1792m45260a60080A56859c04796A63559b16973h180G7233
9660a29724b0634k37188B2554J47176C1503K29241b13331f0286j4670n1899p9333
9649b06188A38024E6887J97067c20998C9973b56243b841r0953b8679l14600C86899
9637A80021c13428B08268i9156k67618A34505i2571A07958a01092o2648D40653
9626a21176A30203a04281A7809N7179b93527A36619b9290j65832j86074d1631
9615a54083n8388n2818A6238d12303a5261A37939b89244a06251C4197J84095a93178
9603c8360A33359m4344r496b45886O3176E5099c52040J60690F4885b03469b0167
9591b84284A166d9200j91571Q0213M3344A72125E1398a00827J6014k70405B44337
$$ plain form
9671 -250046 334814 -21792 -467052 -160080 156859 -304796 163559 -216973 -8180 77233
9660 -129724 -20634 -257822 22554 169730 31503 260744 -213331 -60286 -74956 -126855 -206188
9649 -206188 138024 56887 253954 -320998 39973 -256243 -2841 -93794 -28679 -343279 386899
9637 180021 -313428 208268 -99156 -366774 134505 -92571 107958 -101092 -163740 440653
9626 -121176 130203 -104281 17809 74988 -293527 136619 -29290 -195122 -381196 -41631
9615 -154083 -212471 -265289 16238 -412303 -15261 137939 -289244 -106251 34197 218292 -193178
9603 -38360 133359 89015 79519 -245886 -182710 55099 -352040 -191350 64885 -203469 -20167
9591 -284284 1166 -49200 -240771 -160558 -117214 172125 51398 -100827 -84813 -355218 244337
9579b74380J21443j04493b2500j73151L3250k2181H7711a65074H068c13199C73346
9567i3422p1572A06445d25768i0895q8002b5203G8502J03552R395b17695O8174
9556a49521B8297h4870q5514b9384l31449A39017E3450a05262F3394d3846k76941
9545c20787A72774d20317B58116d9321k28765J19322a8044k22845A07685c94407
9534c50735K3646f8211I3759D5097K8588a37421j65433I9342d296j50974A91386
9522D11885g8996C314a62198k25973a47584j4270O9483B55566b39100N3251C45776
9510A99029a65882e0715q0971A52705i5508l4621D17070c5235l7864A45742d40199
9498I0619h399E8186e9072d586j50544A45948j100b56077j53054g8332K702m5591
$$ plain form
9579 -274380 -152937 -257430 -22500 -195651 -162401 -184582 87711 -165074 8068 -313199 373346
9567 -93422 -164994 106445 -425768 -90895 -178897 -25203 78502 182054 191449 -217695 -149521
9556 -149521 28297 -84870 -170384 -29384 -360833 139017 53450 -105262 63394 -43846 -320787
9545 -320787 172774 -420317 258116 -49321 -278086 -158764 -18044 -240889 107685 -394407
9534 -350735 -327089 -68211 93759 45097 73685 -137421 -302854 99342 -4296 -155270 191386
9522 411885 -78996 3314 -162198 -388171 -147584 -161854 -92371 255566 -239100 -185849 345776
9510 199029 -165882 -50715 -131686 152705 -95508 -130129 417070 -35235 -73099 145742 -440199
9498 90619 -8399 58186 -59072 -4586 -155130 145948 144848 -256077 -409131 -78332 -75630 -121221
9486a21221F7794b17577p0196R3412o9578a08276d2437j49519h7495k15972B7290
9474b58431P5745c9162n9748A7883K44136a82274F4540J38456b9766k33128n5385
9463c18279J21462O6975p0965g9043m150j26616Q4913r2030p6663B57296C7412
9451a20539M3062A06509e74870D5584J70238f04013h2160B8574P3494c7660l10892
9440c48552A73293b90328j93742A80116F1120J92095a33224L9189j89983B8916
9429f8538j82846j16312A02794E393g0582l81860B2817J23231p0401A4034b96244
9417a54210A32894n3123c62940D5883b32018C648R5415a3406G1198c18G8557b46117
9404D03423a16933a8580l18214h1015L5408C8233K47603a23893j56744B3161H820
$$ plain form
9486 -121221 67794 -217577 -287773 -194361 -263939 -108276 -42437 -191956 -87495 -303467 27290
9474 -258431 -182686 -39162 -98910 17883 262019 -182274 64540 202996 -29766 -262894 -318279
9463 -318279 -196817 -129842 -200807 -79043 -83193 -209809 -124896 -216926 -293589 257296 37412
9451 -120539 -77477 106509 -574870 45584 215822 -604013 -82160 28574 102068 -37660 -348552
9440 -348552 173293 -290328 -484070 180116 61120 253215 -133224 -94035 -284018 28916
9429 -68538 -251384 -367696 102794 5393 -70582 -452442 22817 146048 75647 14034 -296244
9417 -154210 132894 79771 -362940 45883 -232018 3648 99063 -13406 71198 -318 78557 -246117
9404 403423 -116933 -18580 -336794 -81015 -45607 38233 285836 -123893 -280637 23161 8820
9392b93405I8807N4330m5647B2740O1708K06601a36168m46488f0476r8474L4622
9381a24328A13737b6765A94439h1624B96386p9a44702e1032C81757b14936C9246
9369i4663E2415f3776j77057H6898J25126d7562k03554J13442E8048b89608R7187
9358a92421C0072a5503j25514A87290a58716B36196e7320B13430c8483I8310h199
9346b01713R1697k9723A5659b05081O8079G6235R5548a70413l1311j25602E6869
9334B35027c0757F7198a67867I4605b51895L0850f2175A29442d1924l28543d8925
9322a57569N2479j69901D5459J87351c01026A26347J6006d137k52673J5137l3074
9311b74747a35464n2317B9396f5475L714j83410B42592C7781h6210k05811L5621
$$ plain form
9392 -293405 98807 153137 107490 22740 84448 291049 -136168 -582656 -60476 -158950 -124328
9381 -124328 113737 -26765 194439 -81624 296386 296307 -144702 -51032 381757 -214936 39246
9369 -94663 52415 -63776 -240833 86898 212024 -47562 -251116 -137674 58048 -289608 -192421
9358 -192421 30072 -15503 -141017 187290 -158716 236196 -57320 213430 -38483 98310 -8199
9346 -201713 -110016 -139739 15659 -205081 -137002 76235 171783 -170413 -201724 -327326 56869
9334 235027 -30757 67198 -167867 94605 -251895 -221045 -62175 129442 -41924 -370467 -48925
9322 -157569 -105090 -274991 45459 232810 -301026 126347 142353 -4137 -256810 -241673 -274747
9311 -274747 -135464 -187781 29396 -65475 -61761 -245171 242592 37781 -86210 -292021 -256400
9300b56400Q9756B34660E0964b50492Q4598k07378f0677p4121m9920j0564O4886
9289a30396j76880I147J17050a54287D7450Q1161O5040c29793A01694m5987b48595
9277a03871O678a1548D81907b93259d785k36713A81504a07128j6268a3073l39533
9266c52606J25453j54692H9014a0130o6555B486d2486m7833E2607J1872J18801
9255A83280a8998k57225i8464G5361d9442J5205m61001I1072a51265f445k54565
9244b61010O4942j75752R603C29332a10529B00386G7670N4562a53158j51601h4781
9232d2474o4023p7503d5438l31036I514N8410f2128j74229q1372A40087D6253
9220H4474h5784j86625a00063q4703K5490C5243K650c02356C2401P1260d6852
$$ plain form
9300 -256400 -166644 234660 50964 -250492 -165894 -373272 -60677 -134798 -184718 -195282 -130396
9289 -130396 -307276 9147 126197 -154287 47450 128611 193651 -329793 101694 55707 -248595
9277 -103871 -97193 -11548 481907 -293259 -4785 -241498 181504 -107128 -123396 -13073 -352606
9266 -352606 -227153 -381845 89014 -10130 -76685 2486 -42486 -90319 52607 64479 183280
9255 183280 -18998 -276223 -98464 75361 -49442 -34237 -495238 91072 -151265 -6445 -261010
9244 -261010 -196068 -371820 -362217 329332 -110529 200386 77670 132232 -153158 -304759 -84781
9232 -42474 -106497 -184000 -45438 -376474 9514 67924 -62128 -236357 -317729 140087 46253
9220 84474 -85784 -272409 -100063 -184766 -159276 35243 37893 -302356 32401 103661 -46852
9208e0715A69724a50154g3214A51077d15296b8560C8596N3079c25925k2022a65368
9196b49176B12007i7297J3298G9541a14225B48622e4643j0121k82442a65721D4246
9184a24258n3738O1934j54418J06327c9161j23239I993Q2097h8939A49507a11857
9172C54352d9278k80440e820j77152N1397A9496R5380L3092h2038A65211b18231
9160B31671f7075l1506k8346j13453R5610p9534A33671g4702k60135D1374b01575
9148a86151J6966m5983P7356k5573M2385G3423a24572o5070e8794q7076J0728
9137a35142m4483l0726l0027j03522A49862c0416H0530f4312N728b7869j54088
9126a81957e7675o1383d0987j87460N9844B62560C6249h3491j2614B9779g8733
$$ plain form
9208 -50715 169724 -150154 -73214 151077 -415296 -28560 38596 91675 -325925 -347947 -165368
9196 -249176 212007 -97297 -83999 79541 -114225 248622 -54643 -64764 -347206 -165721 44246
9184 -124258 -177996 -116062 -270480 -164153 -39161 -162400 9993 92090 -88939 149507 -111857
9172 354352 -49278 -329718 -5820 -182972 -131575 19496 114876 147968 -82038 165211 -218231
9160 231671 -67075 -98581 -126927 -240380 -144770 -224304 133671 -74702 -334837 41374 -201575
9148 -186151 -169185 -215168 -137812 -163385 -121000 73423 -124572 -189642 -58794 -145870 -135142
9137 -135142 -179625 -210351 -240378 -343900 149862 -30416 80530 -64312 -58584 -27869 -181957
9126 -181957 -57675 -119058 -40987 -228447 -168603 262560 36249 -83491 -96105 29779 -78733
9114b32494I7808j6870b40698A56659J25474A18636B9342d3580j47954Q0660j99732
9103c10606J48309d3722j60269P0704c2219j13557k03944f828q26A3353J64594
9092A77947c50495a14295o3284g7008k70027q76a63268e4739o3261d6470l5226
9081h1696B02024d27809A06238m3508b55295o3127b4539q9383d7932q4656q2173
9070b14761C8036a02499l6047B44589d00714J54656B4193g9772j50187A64631
9059e1960j18867a5928k71058A98330H5046l8373K17964a74626A17183c04932
9048a01964N0892l18149J33939A43283d2777j46591A41153b52775H5382K7639
9038A13021J9468m0296a41159f820k45849F9373b47627G5644L496e6947k39989
$$ plain form
9114 -232494 97808 80938 -240698 156659 282133 118636 29342 -43580 -191534 -110874 -310606
9103 -310606 -162297 -43722 -203991 -133287 -32219 -145776 -349720 -6828 -7654 13353 177947
9092 177947 -350495 -114295 -177579 -77008 -347035 -347911 -163268 -54739 -118000 -46470 -81696
9081 -81696 202024 -427809 106238 62730 -255295 -318422 -24539 -113922 -47932 -132588 -214761
9070 -214761 38036 -102499 -138546 244589 -400714 -246058 24193 -79772 -229959 164631
9059 -51960 -170827 -15928 -286986 198330 85046 46673 264637 -174626 117183 -304932
9048 -101964 -51072 -369221 -235282 143283 -42777 -189368 141153 -252775 85382 113021
9038 113021 132489 92193 -141159 -6820 -252669 69373 -247627 75644 79140 -56947 -296936
9027b96936a40347n7273e1509a6081l0085J981j51709J201d981j31028B03017
9015D24492b37160A28841D9178i9974A9021K38629b52020A71735c6633E7790b2050
9003c3475G4601k1716d4743j9646A01582b42828h4460A3935a44335M2008M1103
8992f1224G9780f9924H254a2672G9197h4317l15885a77805A12256B6374K28764
8981B55138d3303B2345a48205A11599e0046j80846B46471b98771I6532g7349l63724
8970d41073a70917G1354a42546K1391A83466f5408j24787B99246e050G439J05388
8959A12827a80264A52098o3970d5259B99960f8576a3760H1782e7073r3864n2419
8948b03356j02402g2864C16521m2031H6536e0389j59617f2492C59761a41734I912
$$ plain form
9027 -296936 -140347 -197620 -51509 -16081 -46166 -44185 -195894 -194693 -4981 -136009 203017
9015 424492 -237160 128841 49178 -99974 19021 257650 -252020 171735 -36633 57790 -22050
9003 -33475 74601 52885 -44743 -64389 101582 -242828 -84460 13935 -144335 -102327 -61224
8992 -61224 79780 -69924 8254 -12672 79197 -84317 -400202 -177805 112256 26374 255138
8981 255138 -43303 22345 -148205 111599 -50046 -230892 246471 -298771 96532 -77349 -441073
8970 -441073 -170917 71354 -142546 -121155 183466 -65408 -190195 299246 -5050 7439 112827
8959 112827 -180264 152098 88128 -45259 299960 -68576 -13760 81782 -57073 -150937 -203356
8948 -203356 -305758 -72864 316521 274490 86536 -50389 -210006 -62492 359761 -141734 9912
8936c04243C9559M96574d3391E21872B49649b3352A99381d9306F3389R8536p5358
8925H6567L20481P33541J053563O314159L345690r32730m961314B082339I04657
8915B35462O759B2421a54524P0389o4491q5792A51030K31918j31419D9527g3093
8903d9553j16906j90982Q1186c9666j70151k9184B17698c4984A06507B2358a86443
8891e4023C07320a22132k64227f3238j09566b8030B54364A4606M6849d2384k9562
$$ plain form
8936 -304243 39559 536133 -43391 521872 249649 -23352 199381 -49306 63389 161925 86567
8925 86567 407048 1140589 2194152 8508311 11854001 10921271 5959957 2082339 904657
8915 235462 242221 22421 -154524 -84135 -148626 -234418 151030 382948 251529 49527 -73093
8903 -49553 -166459 -357441 -276255 -39666 -209817 -239001 217698 -34984 106507 22358 -186443
8891 -54023 307320 -122132 -386359 -63238 -172804 -28030 254364 14606 61455 -42384 -71946
$$ [...]
##END NTUPLES=NMR SPECTRUM
##END=
