
##TITLE=UV1227_M6_1234-1212_90_7231117_pYZuIHwrQY
##JCAMPDX= 6.0         $$ Bruker NMR JCAMP-DX V2.0
##DATA TYPE= NMR SPECTRUM
##DATA CLASS= NTUPLES
##ORIGIN= BRUKER
##OWNER= Administrator
$$ 1.72 TOPSPIN		Version 2.1
$$ 2013-01-18 03:54:39.965 -0500  Administrator@X
$$ Compression mode = diff/dup
##.OBSERVE FREQUENCY= 400.02188249412
##.OBSERVE NUCLEUS= ^1H
##.ACQUISITION MODE= SIMULTANEOUS (DQD)
##.ACQUISITION SCHEME= undefined
##.AVERAGES= 64
##.DIGITISER RES= 22
##SPECTROMETER/DATA SYSTEM= spect
##.PULSE SEQUENCE= noesygpps1d.comp
##.SOLVENT NAME= COFFEE_meoh
##.SHIFT REFERENCE= INTERNAL, COFFEE_meoh, 1, 14.96159
##AUDIT TRAIL= $$ (NUMBER, WHEN, WHO, WHERE, PROCESS, VERSION, WHAT)
$$ ##TITLE= Audit trail, TOPSPIN		Version 2.1
$$ ##JCAMPDX= 5.01
$$ ##ORIGIN= Bruker BioSpin GmbH
$$ ##OWNER= Administrator
$$ $$ E:\/data/COFFEE/nmr/UV1227_M6_1234-1212_90_7231117_pYZuIHwrQY/22/pdata/1/auditp.txt
$$ ##AUDIT TRAIL=  $$ (NUMBER, WHEN, WHO, WHERE, PROCESS, VERSION, WHAT)
(   1,<2013-01-18 03:54:34.277 -0500>,<Administrator>,<X>,<go>,<TOPSPIN 2.1>,
      <created by zg
	started at 2013-01-18 03:43:04.543 -0500,
	POWCHK enabled, PULCHK disabled,
       configuration hash MD5:
       86 BA 57 50 F2 9D 5C 9B 26 00 A9 28 5F 66 2E 89
       data hash MD5: 64K
       ED 06 C2 EB 01 06 5E D0 F5 F0 B6 28 35 E5 70 74>)
(   2,<2013-01-18 03:54:37.324 -0500>,<Administrator>,<X>,<proc1d>,<TOPSPIN 2.1>,
      <Start of raw data processing
       efp LB = 0.3 FT_mod = 6 PKNL = 1 PHC0 = 0 PHC1 = 0 SI = 128K 
       data hash MD5: 128K
       6C 6A 37 33 5A D6 91 AD 00 26 63 F7 F9 DE BF 25>)
(   3,<2013-01-18 03:54:38.324 -0500>,<Administrator>,<X>,<proc1d>,<TOPSPIN 2.1>,
      <pk PHC0 = -80.70007 PHC1 = 0 
       data hash MD5: 128K
       E6 B5 54 49 F8 57 57 C5 2F 79 E4 20 38 ED F0 35>)
(   4,<2013-01-18 03:54:38.965 -0500>,<Administrator>,<X>,<proc1d>,<TOPSPIN 2.1>,
      <abs ABSG = 1 
       data hash MD5: 128K
       27 03 41 EC BD 07 8A 29 7E F4 DB 68 EB E4 C6 91>)
(   5,<2013-01-18 03:54:39.152 -0500>,<Administrator>,<X>,<proc1d>,<TOPSPIN 2.1>,
      <abs ABSG = 2 
       data hash MD5: 128K
       47 44 93 4E 72 60 BF FD 53 75 5A E3 67 4C CD FA>)
(   6,<2013-01-18 03:54:39.308 -0500>,<Administrator>,<X>,<proc1d>,<TOPSPIN 2.1>,
      <abs ABSG = 3 
       data hash MD5: 128K
       21 BB DF FA C5 E6 15 80 EA 97 22 8A 4C 5E AF C9>)
(   7,<2013-01-18 03:54:39.465 -0500>,<Administrator>,<X>,<proc1d>,<TOPSPIN 2.1>,
      <abs ABSG = 4 
       data hash MD5: 128K
       D6 BD 87 B1 9F 5E A0 E8 8E 9F D3 66 F1 15 C8 9C>)
(   8,<2013-01-18 03:54:39.605 -0500>,<Administrator>,<X>,<proc1d>,<TOPSPIN 2.1>,
      <abs ABSG = 5 
       data hash MD5: 128K
       64 CB CE 12 0D A3 B4 61 5B 09 D5 FA 71 37 DA CD>)
$$ ##END=
$$ 
$$ $$ hash MD5
$$ $$ DC A4 EA 77 F6 21 F7 97 74 1C BF 9B 6F 67 A6 2C
##$RELAX= 
##$RELAX= 
##$RELAX= 
##$RELAX= 
##$RELAX= 
##$RELAX= 
##$RELAX= 
##$RELAX= 
$$ Bruker specific parameters
$$ --------------------------
##$DU= <E:\>
##$EXPNO= 22
$$ [...]
##$TP07= 0
##$TPNAME0= <>
##$TPNAME1= <>
##$TPNAME2= <>
##$TPNAME3= <>
##$TPNAME4= <>
##$TPNAME5= <>
##$TPNAME6= <>
##$TPNAME7= <>
##$TPOAL= (0..7)
0.5 0.5 0.5 0.5 0.5 0.5 0.5 0.5
##$TPOFFS= (0..7)
0 0 0 0 0 0 0 0
##$TUNHIN= 0
##$TUNHOUT= 0
##$TUNXOUT= 0
##$USERA1= <user>
##$USERA2= <user>
##$USERA3= <user>
##$USERA4= <user>
##$USERA5= <user>
##$V9= 5
##$VALIST= <valist>
##$VCLIST= <CCCCCCCCCCCCCCC>
##$VD= 0
##$VDLIST= <DDDDDDDDDDDDDDD>
##$VPLIST= <PPPPPPPPPPPPPPP>
##$VTLIST= <TTTTTTTTTTTTTTT>
##$WBST= 1024
##$WBSW= 4
##$XGAIN= (0..3)
0 0 0 0
##$XL= 0
##$YL= 0
##$YMAX_a= 6597971
##$YMIN_a= -13408351
##$ZGOPTNS= <>
##$ZL1= 120
##$ZL2= 120
##$ZL3= 120
##$ZL4= 120
##$ABSF1= 14.96159
##$ABSF2= -5.596592
##$ABSG= 5
##$ABSL= 3
##$ALPHA= 0
##$AQORDER= 0
##$ASSFAC= 0
##$ASSFACI= 0
##$ASSFACX= 0
##$ASSWID= 0
##$AUNMP= <proc_prof1d_extract.lims>
##$AXLEFT= 0
##$AXNAME= <>
##$AXNUC= <1H>
##$AXRIGHT= 0
##$AXTYPE= 0
##$AXUNIT= <>
##$AZFE= 0.1
##$AZFW= 0.1
##$BCFW= 0
##$BC_mod= 0
##$BYTORDP= 0
##$COROFFS= 0
##$CY= 15
##$DATMOD= 1
##$DC= 0
##$DFILT= <>
##$DTYPP= 0
##$F1P= 0
##$F2P= 0
##$FCOR= 0.5
##$FTSIZE= 131072
##$FT_mod= 6
##$GAMMA= 0
##$GB= 0
##$INTBC= 1
##$INTSCL= 1
##$ISEN= 128
##$LB= 0.3
##$LEV0= 0
##$LPBIN= 0
##$MAXI= 10000
##$MC2= 0
##$MEAN= 0
##$ME_mod= 0
##$MI= 0
##$NCOEF= 0
##$NC_proc= -2
##$NLEV= 6
##$NOISF1= 0
##$NOISF2= 0
##$NSP= 0
##$NTH_PI= 0
##$NZP= 0
##$OFFSET= 14.96159
##$PC= 1
##$PHC0= -80.70007
##$PHC1= 0
##$PH_mod= 1
##$PKNL= yes
##$PPARMOD= 0
##$PPDIAG= 0
##$PPIPTYP= 0
##$PPMPNUM= 2147483647
##$PPRESOL= 1
##$PSCAL= 4
##$PSIGN= 0
##$PYNMP= <proc.py>
##$REVERSE= no
##$SF= 400.020009399492
##$SI= 131072
##$SIGF1= 0
##$SIGF2= 0
##$SINO= 400
##$SIOLD= 131072
##$SPECTYP= <>
##$SREGLST= <1H.CDCl3>
##$SSB= 0
##$STSI= 131072
##$STSR= 0
##$SW_p= 8223.68421052631
##$SYMM= 0
##$S_DEV= 0
##$TDeff= 65536
##$TDoff= 0
##$TI= <>
##$TILT= no
##$TM1= 0
##$TM2= 0
##$TOPLEV= 0
##$USERP1= <user>
##$USERP2= <user>
##$USERP3= <user>
##$USERP4= <user>
##$USERP5= <user>
##$WDW= 1
##$XDIM= 131072
##$YMAX_p= 443675704
##$YMIN_p= -18431
##$CURPLOT= <Network HP LaserJet P1505>
##$CURPRIN= <$Network HP LaserJet P1505>
##$DFORMAT= <normdp>
##$LAYOUT= <+/1D_H.xwp>
##$LFORMAT= <normlp>
##$PFORMAT= <normpl>
##$SURQMSG= 1
$$ End of Bruker specific parameters
$$ ---------------------------------
##NTUPLES= NMR SPECTRUM
##VAR_NAME=  FREQUENCY,     SPECTRUM/REAL,   SPECTRUM/IMAG
##SYMBOL=    X,             R,               I
##VAR_TYPE=  INDEPENDENT,   DEPENDENT,       DEPENDENT
##VAR_FORM=  AFFN,          ASDF,            ASDF
##VAR_DIM=   131072,        131072,          131072
##UNITS=     HZ,            ARBITRARY UNITS, ARBITRARY UNITS
##FACTOR=    0.0627417313425164, 1,          1
##FIRST=     8223.62146879497, -1601,        -58418
##LAST=      0,             18,              -59601
##MIN=       0,             -18431,          0
##MAX=       8223.62146879497, 443675704,    0
$$ Real data points
##PAGE= N=1
##DATA TABLE= (X++(R..R)), XYDATA
$$ [...]
61516D69747k035j651r35j49K31M8l53o49q16q52o75n49r77j857k393k234k093
61499D51808k635l366l321k408j330n94k97m56p91o06K96R11K92q43r37J44R72
61482D36839P83M88R74J639J427M41l78o16n18k39K62P31P56L85O9J4L8RJ0L7
61462D43151j18n08q12n80K89J317J648P59r24k174k053q18L77O86L69L08R07
61445D41824J601J567P21k02n17j27P68K054L427M212M012L314K946L055L194
61430D71849L257L621M303M717M528M184M249M628M846M739M536M503M753N210
61416E33923N497N142M097K787J515K00j094j859j849j662k104l133l973m192
61402E33295m130m228m456m487m070l149j955j095j155k037k953l256k969k350
$$ plain form
61516 469747 467712 466061 465126 464977 465208 465256 464903 464254 463438 462586 461911 461362 460385 458528 456135 453901 451808
61499 451808 449173 445807 442486 440078 438748 438154 437857 437401 436610 436004 436300 437211 437503 436660 435723 435867 436839
61482 436839 437622 438110 439084 440723 442150 442591 442213 441597 441079 440840 441102 441833 442589 442974 443043 443057 443095 443104 443114 443151
61462 443151 443033 442525 441713 441133 441422 442739 444387 445146 444222 442048 439995 439177 439554 440240 440609 440917 441824
61445 441824 443425 444992 445713 445511 444994 444867 445635 447689 451116 455328 459340 462654 465600 468655 471849
61430 471849 475106 478727 483030 487747 492275 496459 500708 505336 510182 514921 519457 523960 528713 533923
61416 533923 539420 544562 548659 551446 552961 553161 552067 550208 548359 546697 544593 541460 537487 533295
61402 533295 529165 524937 520481 515994 511924 508775 506820 505725 504570 502533 499580 496324 493355 491005
61388D91005j355Q6J535K301K237J805J350Q06K02l0L47Q58R35P68J024J732K138
61371E07744J748J003O14O23O14M86N64R75J365J404J276J542K522L852M710M643
61355E35685M178M336N437O646P003O632O622P716R524J1129J2239J3477J5545
61342F46169J8224K0412K1208K0735J9704J8417J6559J3857J0390O255J629k714
61330H10845n699p153q108r343j0267r987q977q675r514j0249r517p412n239m087
61316F96618l980m211m252m200m280m137l159j631p71j179j826j327L19K097L585
61301F67666N123O621P436P558P912R033J0392J1319J1745J1565J0113O987K894
61288G76364r63m014o390q188r189r149q036o124m034k462j664j355j083m62Q51
$$ plain form
61388 491005 489650 489736 491271 493572 495809 497614 498964 499770 499972 499942 500289 501147 502082 502850 503874 505606 507744
61371 507744 509492 510495 511109 511732 512346 512832 513396 514371 515736 517140 518416 519958 522480 526332 531042 535685
61355 535685 539863 544199 549636 556282 563285 569917 576539 584255 593779 604908 617147 630624 646169
61342 646169 664393 684805 706013 726748 746452 764869 781428 795285 805675 811930 813559 810845
61330 810845 805146 797993 789885 780542 770275 760288 751311 742636 733122 722873 713356 705944 700705 696618
61316 696618 692638 688427 684175 679975 675695 671558 668399 666768 665997 664818 662992 661665 661984 664081 667666
61301 667666 672789 679410 686846 694404 702316 711349 721741 733060 744805 756370 766483 773470 776364
61288 776364 775401 771387 764997 756809 747620 738471 730435 724311 720277 717815 716151 714796 713713 713251 714102
61273G14102K789M473M905M306M037M944O401P481Q334R706J1632J3364J4438
61260H10912J5043J5449J5665J5689J5797J6410J7887K0219K2746K4446K4728
61249A014991K3738K1616J8003J2642O166l32o353j2024j7162k0886k2434k2002
61237I95963k0651j9370j8386j7257j5671j3885j2259j0584q395n911l979k906
61225H46709k075j080m82p74j224o37J040K664L370L278K828K155J310M70l36
61210H57216j209j994k287k027j657j538j549j344p21M22K068L874N255N931O208
61195H66648O719Q055J0596J4259J8206K1253K2926K3933K5322K7362K9435L0882
61183A105596L1580L1737L1390L0274K8009K4380J9598J4441R973O865M849K980
$$ plain form
61273 714102 716891 721364 726269 730575 734612 739556 745957 753438 761772 771478 783110 796474 810912
61260 810912 825955 841404 857069 872758 888555 904965 922852 943071 965817 990263 1014991
61249 1014991 1038729 1060345 1078348 1090990 1097156 1096824 1090471 1078447 1061285 1040399 1017965 995963
61237 995963 975312 955942 937556 920299 904628 890743 878484 867900 859505 853594 849615 846709
61225 846709 844634 843554 843072 842298 841074 840437 841477 844141 847511 850789 853617 855772 857082 857552 857216
61210 857216 856007 854013 851726 849699 848042 846504 844955 843611 842890 843312 845380 849254 854509 860440 866648
61195 866648 873367 881422 892018 906277 924483 945736 968662 992595 1017917 1045279 1074714 1105596
61183 1105596 1137176 1168913 1200303 1230577 1258586 1282966 1302564 1317005 1326978 1333843 1338692 1341672
61171A341672N73k201m778p040r437j2301j5404j8350k1077k3762k6410k8706
61159A172779l0203l0556k9744k8161k6309k4283k1840j8984j6235j4041j2280
61148I20143j0572q843p201n527l620j590K97K084M032O089P807Q763Q702P306
61134I27870M314R0m175p106p935o739m159r89K210N283Q293J1250J4066J6755
61120I59028J9398K1954K4236K6125K7665K8900K9739L0099L0063K9913K9905
61109A257025K9995K9793K8920K7401K5552K3508K1093J8211J5108J2090R189
61098A497885O220K999m94l930o773r062j1980j6823k3150k8817l2368l4585l6927
61085A302195l9228m0089l9061l7095l5004l2727l0240k8000k6095k4025k1688
$$ plain form
61171 1341672 1342245 1340044 1335266 1328226 1318789 1306488 1291084 1272734 1251657 1227895 1201485 1172779
61159 1172779 1142576 1112020 1082276 1054115 1027806 1003523 981683 962699 946464 932423 920143
61148 920143 909571 900728 893527 888000 884380 882790 883087 885171 889203 895292 903099 911862 920564 927870
61134 927870 932184 932274 928099 920993 913058 906319 902160 901171 903381 908664 916957 928207 942273 959028
61120 959028 978426 1000380 1024616 1050741 1078406 1107306 1137045 1167144 1197207 1227120 1257025
61109 1257025 1287020 1316813 1345733 1373134 1398686 1422194 1443287 1461498 1476606 1488696 1497885
61098 1497885 1504105 1507104 1506610 1502680 1495907 1486845 1474865 1458042 1434892 1406075 1373707 1339122 1302195
61085 1302195 1262967 1222878 1183817 1146722 1111718 1078991 1048751 1020751 994656 970631 948943
61074I48943j9603j7804j5534j2628j0145q800p728n813l481k039j705j546j028
61061H41089m39J87J251K522L003K357J600J886L304N320P713J0384J2819J4497
61047I07493J5659J7034J8977K1294K3755K6204K8188K9161K9198K9070K9355
61036A175388K9849L0052K9889K9581K9077K8163K7068K6439K6440K6369K5517
61025A483832K4178K3222K2820K2196K0832J9342J8796J9539K1102K3046K5397
61014A724302K8305L1714L5485L9656M4535N0551N7908O6218P4793Q3445R2746
61003B329658J03366J15551J29610J46327J66310J89430K15663K46411K84541
60994C926867L33550L97348M80312N86674P19306Q76680J045681J195388J286070
$$ plain form
61074 948943 929340 911536 896002 883374 873229 864429 856701 850888 847407 845368 843663 842117 841089
61061 841089 840650 840837 842088 844610 847613 849970 851570 853456 856760 862080 869793 880177 892996 907493
61047 907493 923152 940186 959163 980457 1004212 1030416 1058604 1087765 1116963 1146033 1175388
61036 1175388 1205237 1235289 1265178 1294759 1323836 1351999 1379067 1405506 1431946 1458315 1483832
61025 1483832 1508010 1531232 1554052 1576248 1597080 1616422 1635218 1654757 1675859 1698905 1724302
61014 1724302 1752607 1784321 1819806 1859462 1903997 1954548 2012456 2078674 2153467 2236912 2329658
61003 2329658 2433024 2548575 2678185 2824512 2990822 3180252 3395915 3642326 3926867
60994 3926867 4260417 4657765 5138077 5724751 6444057 7320737 8366418 9561806 10847876
60985A0847876J297765J254789J214696J226395J301698J428494J596798J792787
60977B1961298J969802K052624J994619J830527J658847J564845J558454J574728
60969C6165744J516595J298712Q81224K97028l44131q96416j246906j363007j290357
60960C5018486j122745r75820r62503j151641j523469j967086k338889k540462
60952B2435871k554636k423521k205053j947135j683896j437640j219025j029677
60944G935288q67900p31873o18948n25419m48410l86425l37494k98279k65671
60935C454869k38079k14621j94196j75991j59825j45302j31450j17826j05160
60926A972419r4306q5167p7294p0806o6014o2578n9640n6535n2928m8689m4082
$$ plain form
60985 10847876 12145641 13400430 14615126 15841521 17143219 18571713 20168511 21961298
60977 21961298 23931100 25983724 27978343 29808870 31467717 33032562 34591016 36165744
60969 36165744 37682339 38981051 39862275 40159303 39815172 38918756 37671850 36308843 35018486
60960 35018486 33895741 32919921 31957418 30805777 29282308 27315222 24976333 22435871
60952 22435871 19881235 17457714 15252661 13305526 11621630 10183990 8964965 7935288
60944 7935288 7067388 6335515 5716567 5191148 4742738 4356313 4018819 3720540 3454869
60935 3454869 3216790 3002169 2807973 2631982 2472157 2326855 2195405 2077579 1972419
60926 1972419 1878113 1792946 1715652 1644846 1578832 1516254 1456614 1400079 1347151 1298462 1254380
60915A254380l9753l5986l2293k8149k3842k0145j7276j4682j1805q763o212m691
60903A010783m152m107m221m636n587o928q294r586j0859j2018j2974j3982j5322
60890H98117j6804j8022j8879j9294j8801j7253j5618j5043j5203j4666j3005
60879G15529j1306j0378r706q747p996p946p879o789m912l434k942k985k875k368
60865F25266j664j167r85n29J016L466N545O355O373O601P274P987Q515Q909R139
60850F92101R119Q754P766O019M231L588M232M964M894M496M361L987K688R11
60836G62111n13j686l081m330m810n028o070p844r098r210q892r007r630j0341
60822F72571j0734j0544r868r264r079q967q619q452q776q837p795o219n337n094
$$ plain form
60915 1254380 1214627 1178641 1146348 1118199 1094357 1074212 1056936 1042254 1030449 1021686 1015474 1010783
60903 1010783 1006631 1002524 998303 993667 988080 981152 972858 963272 952413 940395 927421 913439 898117
60890 898117 881313 863291 844412 825118 806317 789064 773446 758403 743200 728534 715529
60879 715529 704223 693845 684139 675392 667396 659450 651571 644782 639870 636436 633494 630509 627634 625266
60865 625266 623602 622435 621450 620921 621937 625403 630948 637303 643676 650277 657551 665538 674053 682962 692101
60850 692101 701220 709974 717740 723759 727990 731578 735810 740774 745668 750164 754525 758512 761200 762111
60836 762111 761598 759912 756831 752501 747691 742663 736593 728749 719651 710441 701549 692542 682912 672571
60822 672571 661837 651293 641425 632161 623082 614115 605496 597044 588268 579431 571636 565417 560080 554986
60808E54986m390l192k829l816m778m232k375m99N41P06L85K38Q22J851K352J939
60792E37709J329J302J795K486L551N186O815P528P169O492O278O617P010P062
60778F08329O997P406Q393R208R048Q026O853N877M999M358M284M542M415L722
60764F96457L147L298L970M556M707M451M070L995M434N072N455N550N556N369
60750G60087M900M612N002N665N789N486N735O887Q210R017R333R255Q728Q220
60736H56926Q599R946J1449J2873J5060J8321K1408K2994K3355K3694K4390K4866
60724A073881K4737K4093K2882K0793J7811J4288J0519O510K163k550p350j1572
60712A196205j4697j7006j9199k1299k2654k3199k3813k5059k6342k6876k6697
$$ plain form
60808 554986 550596 547404 544575 540759 535981 531749 529374 528875 529416 530122 530507 530745 531567 533418 535770 537709
60792 537709 539038 540340 542135 544621 548172 553358 560173 567701 574870 581362 587640 594257 601267 608329
60778 608329 615326 622732 631125 640333 649381 657407 664260 670137 675136 679494 683778 688320 692735 696457
60764 696457 699604 702902 706872 711428 716135 720586 724656 728651 733085 738157 743612 749162 754718 760087
60750 760087 764987 769599 774601 780266 786055 791541 797276 804163 812373 821390 830723 839978 848706 856926
60736 856926 865525 875471 886920 899793 914853 933174 954582 977576 1000931 1024625 1049015 1073881
60724 1073881 1098618 1122711 1145593 1166386 1184197 1198485 1209004 1215514 1217677 1215127 1207777 1196205
60712 1196205 1181508 1164502 1145303 1124004 1101350 1078151 1054338 1029279 1002937 976061 949364
60701I49364k6219k5525k4752k4397k4511k4265k3098k1628k0567j9464j7609
60690F97329j5595j4663j4731j4381j2836j0862r462q673p994p226o471n811n294
60677E63330m917m436l578k462j495q46l93j22j46l23l46k44l40o48p36l31L05
60660E42272P22P45M94J53j68m39o28n85k01L54Q29J456K813M877O685P436P447
60643E74262P451P348O494M958L628K994K639K161J817J907K125J977J494J081
60629F22336R27Q82O74P8r88k274l332m021m588n134n298m861m381m607n334n493
60613E74586m582l466l220l640l566k606j640j446j620j439j103j274j793j861
60599E41330j419j305j790j982j147R6O41M48M39J098J871K093J926K163L181
$$ plain form
60701 949364 923145 897620 872868 848471 823960 799695 776597 754969 734402 714938 697329
60690 697329 681734 667071 652340 637959 625123 614261 604799 596126 588132 580906 574435 568624 563330
60677 563330 558413 553977 550399 547937 546442 545596 545203 545081 544935 544612 544266 544022 543682 543034 542298 541967 542272
60660 542272 542994 543739 544233 544386 544218 543779 543151 542566 542365 542719 543548 545004 547817 552694 559379 566815 574262
60643 574262 581713 589061 595555 600513 604141 607135 609774 611935 613752 615659 617784 619761 621255 622336
60629 622336 623263 624145 624819 624897 623909 621635 618303 614282 609694 604560 599262 594401 590020 585413 580079 574586
60613 574586 570004 566538 563318 559678 556112 553506 551866 550420 548800 547361 546258 544984 543191 541330
60599 541330 539911 538606 536816 534834 533687 533783 534424 534872 535311 536409 538280 540373 542299 544462 547643
60584E47643M302M361L031J448J091K131L319L610L264L148L477L769L667L321
60570E91582L176L681N031O941Q834J0391J1716J2911J3922J4918J6244J7764
60558G17111J8781J9005J9008J9302J9505J8972J7789J6549J5516J4605J3770
60547I09913J2707J0537O660J809k406n092o598p480p575o258l267Q63N023Q279
60533I17115J0699J3235J6481J9838K2184K3196K3448K3543K3636K3671K3424
60522A140470K2324J9785J5868J1265O645K318j606n028p862r917j0938j0953
60510A172371j0393r518q135o218m365l081j996n17J149K500M024O876J1200J5825
60496A169722J9981K4370K9955L6465M2863M8783N4714O0943O7046P2561P7504
$$ plain form
60584 547643 551945 556306 559337 560785 561876 564007 567326 570936 574200 577348 580825 584594 588261 591582
60570 591582 594758 598439 603470 610411 619245 629636 641352 654263 668185 683103 699347 717111
60558 717111 735892 754897 773905 793207 812712 831684 849473 866022 881538 896143 909913
60547 909913 922620 933157 939817 941626 939220 934128 927530 920050 912475 906217 902950 903813 908836 917115
60533 917115 927814 941049 957530 977368 999552 1022748 1046196 1069739 1093375 1117046 1140470
60522 1140470 1162794 1182579 1198447 1209712 1216357 1218675 1217069 1212041 1204179 1194262 1183324 1172371
60510 1172371 1161978 1152460 1144325 1138107 1133742 1130661 1128665 1128148 1129297 1131797 1135821 1142697 1153897 1169722
60496 1169722 1189703 1214073 1244028 1280493 1323356 1372139 1426853 1487796 1554842 1627403 1704907
60485A704907Q1932Q5322Q6808Q5972Q3115P8660P2575O4560N4506M2440K8237
60474B469034J1955n591k3158m0030n6131p1032q3620r3051r9421j03072j03870
60463A802013j01787r7505r1710q4364p5485o6228n8135n1497m5440l9557l4518
60452A055787l0889k8219k5638k2748j9686j6785j4378j2583j1135r768q677q150
60440H47131p882p233o162n305n089n350n839o421o675o008m478l049k589l066
60426G71985l777m068l615k525j345o80n85o64p67j071j432j258l84M65N02k12
60410G50569r74j300j158o55O0O50P30L21r6m0N12J230J893K535L079L119K465
60393G62940J772K028L287M443M588M046L691L724L750L627L539L462L253L082
$$ plain form
60485 1704907 1786839 1872161 1958969 2044941 2128056 2206716 2279291 2343851 2398357 2440797 2469034
60474 2469034 2480989 2475398 2452240 2412210 2356079 2285047 2201427 2108376 2008955 1905883 1802013
60463 1802013 1700226 1602721 1511011 1426647 1351162 1284934 1226799 1175302 1129862 1090305 1055787
60452 1055787 1024898 996679 971041 948293 928607 911822 897444 884861 873726 863958 855281 847131
60440 847131 839249 832016 825854 820549 815460 810110 804271 797850 791175 785167 780689 777640 775051 771985
60426 771985 768208 764140 760525 758000 756655 755975 755390 754726 753959 752888 751456 750198 749814 750279 750781 750569
60410 750569 749595 748295 747137 746482 746542 747192 747922 748243 748147 748107 748619 749849 751742 754277 757356 760475 762940
60393 762940 764712 766740 770027 774470 779058 783104 786795 790519 794269 797896 801435 804897 808150 811232
60379H11232L115K969K185J155Q23J445K326K856L153L536M028M546N141N821
60365H54331O532P349Q282Q927Q813Q230Q168R280J1214J2988J3755J3344J2480
60352I83693J2304J3183J4168J4210J3709J4117J6148J9228K2679K6515L0856
60341A180810L5352L9553M3221M5999M7343M7098M5736M3874M1847L9613L6419
60330A646865L0796K1722R990k404j4244k5670l6674m6174n3007n6939n8137n6508
60318A359616n2216m6264l9891l3757k8071k2988j8501j4473j1114q846p348n531
60306A070616k874o7K260M707Q132J2189J5719J8356K0775K3546K6480K9156L1451
60293A260446L3460L5262L6930L8438L9447L9296L7282L3177K7621K1847J6578
$$ plain form
60379 811232 814347 817316 819501 820656 821479 822924 825250 828106 831259 834795 838823 843369 848510 854331
60365 854331 860863 868212 876494 885421 894234 902464 910632 919912 931126 944114 957869 971213 983693
60352 983693 995997 1009180 1023348 1037558 1051267 1065384 1081532 1100760 1123439 1149954 1180810
60341 1180810 1216162 1255715 1298936 1344935 1392278 1439376 1485112 1528986 1570833 1610446 1646865
60330 1646865 1677661 1699383 1709373 1706969 1692725 1667055 1630381 1584207 1531200 1474261 1416124 1359616
60318 1359616 1307400 1261136 1221245 1187488 1159417 1136429 1117928 1103455 1092341 1083495 1076147 1070616
60306 1070616 1067742 1067675 1069935 1074642 1082774 1094963 1110682 1129038 1149813 1173359 1199839 1228995 1260446
60293 1260446 1293906 1329168 1366098 1404536 1443983 1483279 1520561 1553738 1581359 1603206 1619784
60282A619784J1288N130j582p593j2454j7113k2420k8001l3256l8652m4998n1805
60270A378328n7246n9756n9171n6387n2344m7448m1765l5719l0328k6281k3009
60259H88874j9411j5564j2740j1421j0460q817p132o499o534n876m259k755k112
60246G75294j880j406p31k72k98r58k192l410l805l212k240j393n50M23J121J174
60230G55665J036J602K984M277M788N043O017P569Q451P965O921O454O585O603
60216H31960O335O164O138N975N726N479M682K864R04J66L86r2j619k488j540
60201H71040m0K55m75r52r91j338j950k086j794j861k404k753k726k903l497l983
60185H41542l930l460k753j929j385j394j378m34J286K554K766K796L782N624
$$ plain form
60282 1619784 1631072 1636202 1634620 1627027 1614573 1597460 1575040 1547039 1513783 1475131 1430133 1378328
60270 1378328 1321082 1261326 1202155 1145768 1093424 1045976 1004211 968492 938164 911883 888874
60259 888874 869463 853899 841159 829738 819278 810461 803329 796830 790296 784420 780161 777406 775294
60246 775294 773414 772008 771277 771005 770707 769749 767557 764147 760342 757130 754890 753497 752947 753370 754491 755665
60230 755665 756701 758303 761287 765564 770352 775395 781412 788981 797432 805397 812318 818772 825357 831960
60216 831960 838295 844459 850597 856572 862298 867777 872459 875323 876227 876393 876779 876687 875068 872580 871040
60201 871040 871000 871255 870780 869828 868837 867499 865549 863463 861669 859808 857404 854651 851925 849022 845525 841542
60185 841542 837612 834152 831399 829470 828085 826691 825313 824879 826165 828719 831485 834281 838063 843687
60171H43687P104P237O145M772L984L850L835L727L984N002O323P125P244P234
60157I21253P494P888Q048P660O525M830L217K188J521O71m10j341k015k711l470
60142I61348l909l746l150k446j701p19O56K165L173L365L291L743M574M801M089
60127I75534L299L208L528L700L761L743L021J209j014k866m552o403p668p469
60113I71031o431n892n860n225l874l004l151l420k986k090j120O5J345J988J762
60098I33138J549K237L695N314O814Q054Q807R165R524R774R202P638N910M718
60084A025539L827K863K066J564P02r90k812l783m088m703n884p041p929q966
60070I90365j0303j1443j2017j2245j2303j1905j0945j0035r794r882r330p860
$$ plain form
60171 843687 850791 858028 864173 868945 872929 876779 880614 884341 888325 893327 899650 906775 914019 921253
60157 921253 928747 936635 944683 952343 958868 963698 966915 969103 970624 971295 970885 969544 967529 964818 961348
60142 961348 957439 953693 950543 948097 946396 945677 946333 948498 951671 955036 958327 962070 966644 971445 975534
60127 975534 978833 982041 985569 989269 993030 996773 999794 1001003 999989 997123 992571 986168 978500 971031
60113 971031 964600 958708 952848 947623 943749 940745 937594 934174 931188 929098 927978 928043 929388 931376 933138
60098 933138 934687 936924 940619 945933 952747 960801 969608 978773 988297 998071 1007273 1014911 1020821 1025539
60084 1025539 1029366 1032229 1034295 1035859 1036561 1035571 1032759 1028976 1024888 1020185 1014301 1007260 999331 990365
60070 990365 980062 968619 956602 944357 932054 920149 909204 899169 889375 879493 870163 862303
60058H62303o274n334m861m298l728l591l613k935j568q61j913m088n813o417
60044H07009o457o439o101n019l326j600m87l69r91j461j110k91P4l04q98j329
60028G70901j844k760l926m921n446n475n351n685o760q046q720q468p429n682
60014F90388l469j562o09k04N41J567J967J536J144J397J928K426L336M946O717
59999G12049Q122R409J0866J2015J2370J2432J3037J4081J4700J4459J3634J2516
59987H59690J1166R844Q951Q401P500N631K768p07m370p869j0898j3227j4685
59974H62195j5214j4979j4373j3809j3444j3116j2413j1009r128p548o780o355
59962G24027n352l629j993j057n59jO17J103J649K498L406L916M050M241M704
$$ plain form
60058 862303 856029 850695 845834 841536 837808 834217 830604 827669 826101 825240 823327 819239 813426 807009
60044 807009 800552 794113 788012 782993 779667 778067 777580 777211 776220 774759 773649 773358 773432 773128 772230 770901
60028 770901 769057 766297 762371 757450 752004 746529 741178 735493 728733 720687 711967 703499 696070 690388
60014 690388 686919 685357 684748 684544 685085 686652 688619 690155 691299 692696 694624 697050 700386 705332 712049
59999 712049 720171 729580 740446 752461 764831 777263 790300 804381 819081 833540 847174 859690
59987 859690 870856 880700 889651 898052 905552 911183 913951 913244 908874 901005 890107 876880 862195
59974 862195 846981 832002 817629 803820 790376 777260 764847 753838 744710 737162 730382 724027
59962 724027 718675 715046 713053 711996 711437 711436 712053 713156 714805 717303 720709 724625 728675 732916 737620
59947G37620N230N583N734N683N419N091M897M676L867K171J54j120j224r30j313
59932G81538k434l369l485l197l264l856m678n485n930n497m226l145l118l560
59918G26294l196j965j075j114j238o41K19M73J91J05M80R76J335J611J827J898
59902G26180J845J766J711J738J983K531L384M566N979P163P642P569P565P799
59888G89421P692O770N342M056L208K747K524K258J718J282J759L276M767N110
59874H41930M369L328K137K46k356m705n933o253o493o921p084o713o283o349
59860G92920o641o297n057l655k821k324j513m24K44J56k52l76P9J175K743M217
59844G72174M984N042M936M963M931M742M679M896N111N049M848M857N350O597
$$ plain form
59947 737620 742850 748433 754167 759850 765269 770360 775257 779933 783800 785971 786125 785005 783781 782851 781538
59932 781538 779104 775735 772250 769053 765789 761933 757255 751770 745840 740343 736117 732972 729854 726294
59918 726294 723098 721133 720058 718944 717706 717065 717284 717757 717948 718053 718533 719509 720844 722455 724282 726180
59902 726180 728025 729791 731502 733240 735223 737754 741138 745704 751683 758846 766488 774057 781622 789421
59888 789421 797113 803883 809225 813281 816489 819236 821760 824018 825736 827018 828777 832053 836820 841930
59874 841930 846299 849627 851764 852010 849654 844949 839016 832763 826270 819349 812265 805552 799269 792920
59860 792920 786279 779982 774925 771270 768449 766125 764612 764188 764432 764588 764336 763960 764039 765214 767957 772174
59844 772174 777158 782200 787136 792099 797030 801772 806451 811347 816458 821507 826355 831212 836562 843159
59830H43159Q822J1796J4742J6832J7655J7172J5567J3175J0353P393M565K005
59818I83236p10m385r086j3505j6164j6932j6662j5678j3698j1230r795j0342
59806H45049j2237j4152j5251j5223j4053j2212j0472r099p741o329n410n325
59794G17545n670n929o008n849n251m384l808l601l200k503k294l048m044m279
59780F57677l757l279l394m055m825m964l894j992m85j06l97o13o96q00n82L02
59764F24140J496K349K648K463J818R79N83R44J632K168K636L147L373L192L192
59749F56760L782M368M163L409K976L064L035K382J213k8q64r32l27L67O82O57
59733F84707M14j24q55j396j678k068k494k222j010J92M17p0l67j90J32M53P81
$$ plain form
59830 843159 851981 863777 878519 895351 913006 930178 945745 958920 969273 976666 981231 983236
59818 983236 982526 978141 969055 955550 939386 922454 905792 890114 876416 865186 855391 845049
59806 845049 832812 818660 803409 788186 774133 761921 751449 742350 734609 728280 722870 717545
59794 717545 711875 705946 699938 694089 688838 684454 680646 677045 673845 671342 669048 666000 661956 657677
59780 657677 653920 650641 647247 643192 638367 633403 629509 627517 627032 626926 626529 625916 625220 624420 623838 624140
59764 624140 625636 627985 630633 633096 634914 635893 636476 637420 639052 641220 643856 647003 650376 653568 656760
59749 656760 660542 664910 669073 672482 675458 678522 681557 683939 685152 685124 684260 683328 683001 683368 684050 684707
59733 684707 685121 684997 684142 682746 681068 679000 676506 674284 673274 673466 673883 673813 673446 673256 673388 673841 674622
59716F74622R18P75O75P76O62J15k93j6O45J211J827K584K803K033J151J364K472
59699F94324L252L285L216L430L586L552L747M405N197N701N656M860L438K109
59685G49758J550J520J215K93q66j651j522k99J287J797O54j066k102k656l590
59670G44322m634m716l791k992k981l338l591l718l560k843j989j874k509k846
59656F98940k156q26M23J383K160K790L289L579L391K661J928J657J425M89j002
59641G20131k254l092m034n127n713n467m775l922k771j421l51K52O62R42Q89
59626F83949O40N36L64m03j566k261k207j886j396j74J726L161L251K436J667
59611F87837J209Q55O37O92P55M11l13q55n91N78J883K141J039l26p74o01r40
$$ plain form
59716 674622 675540 676315 676990 677766 678428 678543 678250 678234 678879 680090 681917 684501 687304 689337 690488 691852 694324
59699 694324 697576 700861 704077 707507 711093 714645 718392 722797 727994 733695 739351 744211 747649 749758
59685 749758 751308 752828 754043 754336 753470 751819 750297 749998 751285 753082 753736 752670 750568 747912 744322
59670 744322 739688 734972 731181 728189 725208 721870 718279 714561 711001 708158 706169 704295 701786 698940
59656 698940 696784 695958 696381 697764 699924 702714 706003 709582 712973 715634 717562 719219 720644 721133 720131
59641 720131 717877 714785 710751 705624 699911 694444 689669 685747 682976 681555 681204 681456 682118 683060 683949
59626 683949 684589 685125 685489 685086 683520 681259 679052 677166 675770 675596 677322 680483 683734 686170 687837
59611 687837 689046 689901 690538 691230 691985 692396 692083 691228 690637 691215 693098 695239 696278 695952 695178 694577 693637
59594F93637j820k102j427r39j498k320k179j135k46j21n16j083j673k076k043
59579F72459j635j259j305j841k558k946k743k236j963k137k565l036l423l525
59565F39287l109k182j032j29J2p09j450j020N71J826J725J190J647K811L241
59550F42679K618K003J902J628Q20J99L87J063J778K663L876N276O959R251J1736
59535F94838J3344J3766J3941J4614J5292J5250J4688J4258J4028J3553J2396
59524H49968J0245P136M042K486K979M269M666L645J797j93k009l648n468p897
59510H72018j0687j2814j3527j3206j2850j2961j3184j2812j1533r834q616q107
59498G31887p415n688l332j399j20R37J542R09p27j932j834r90j63O35J399J568
$$ plain form
59594 693637 691817 689715 688288 687349 685851 683531 681352 680217 679971 679850 679334 678251 676578 674502 672459
59579 672459 670824 669565 668260 666419 663861 660915 658172 655936 653973 651836 649271 646235 642812 639287
59565 639287 636178 633996 632964 632835 632847 632138 630688 629668 630239 632065 633790 634980 636627 639438 642679
59550 642679 645297 647300 649202 650830 651650 651849 652236 653299 655077 657740 661616 666892 673851 683102 694838
59535 694838 708182 721948 735889 750503 765795 781045 795733 809991 824019 837572 849968
59524 849968 860213 867349 871391 873877 876856 881125 885791 889436 891233 891040 889031 885383 879915 872018
59510 872018 861331 848517 834990 821784 808934 795973 782789 769977 758444 748610 739994 731887
59498 731887 724472 718784 715452 714053 713933 714870 716412 717321 716594 714662 712828 711838 711675 712310 713709 715277
59482G15277J004O65J587L722O248Q383R603R826R803J0484J1662J2158J1681
59469H12103J1317J1625J1492R825P287N232L701J747p41k695l110j881M43L105
59455H69450N650Q425J2104J6330J9556K0928K1524K2787K4313K4290K1833J7869
59443A085059J3771J0061O554L028n44m158p878j1842j5909j9420k1656k2586
59431A014480k2677k1988k0189j7659j5621j4687j4072j2747j0657q145n020j033
59419H49985L281P090J0265J3239J6198J9049K1707K3796K4434K3090K0337J7148
59407A049619J3788J0075O342L244O45k440o614j1291j5233j7513j7811j6231
59395I96580j3208r674o923n820o077o782p960j0861j6087k1995k6021k7164k6190
$$ plain form
59482 715277 716281 716946 718533 722255 728503 736886 746489 756315 766118 776602 788264 800422 812103
59469 812103 823420 835045 846537 856362 863649 868881 872582 874329 873588 870893 867783 865902 866345 869450
59455 869450 875100 883525 895629 911959 931515 952443 973967 996754 1021067 1045357 1067190 1085059
59443 1085059 1098830 1108891 1115445 1118473 1117929 1113771 1105893 1094051 1078142 1058722 1037066 1014480
59431 1014480 991803 969815 949626 931967 916346 901659 887587 874840 864183 856038 851018 849985
59419 849985 853266 860356 870621 883860 900058 919107 940814 964610 989044 1012134 1032471 1049619
59407 1049619 1063407 1073482 1079824 1083068 1083713 1081273 1074659 1063368 1048135 1030622 1012811 996580
59395 996580 983372 973698 966775 960955 954878 948096 940136 929275 913188 891193 865172 838008 811818
59382H11818k3918k0656j7202j4679j3070j1257q843o561m680k572l28Q36M91
59369F89379j30K2N04P69J261K136K420J687J253K325M234N775P038Q458R397
59354G36528R429R898J2219J5534J7901J9192K0817K3105K4999K6142K7251K8453
59342I71468K9035K8957K8890K8623K6993K3715J9716J5379R944L198l578r019
59330A173321j3031j6215j8760k0510k1500k1891k1758k1096j9850j7986j5888
59319I64836j4341j3629j3051j1885j0369r102q084p252p182q100q768p777n600
59306H39696l949l365k881k057j631j896j886q28P54J984K753L405M022M589N302
59291H44012O377P846R627J1421J2670J3123J3221J3398J3397J2906J2390J2421
$$ plain form
59382 811818 787900 767244 750042 735363 722293 711036 702193 695632 690952 688380 688052 688888 689379
59369 689379 689249 689271 689775 690544 691805 693941 696361 698048 699301 701626 705860 711635 718673 727131 736528
59354 736528 745957 755855 768074 783608 801509 820701 841518 864623 889622 915764 943015 971468
59342 971468 1000503 1029460 1058350 1086973 1113966 1137681 1157397 1172776 1182720 1185918 1182340 1173321
59330 1173321 1160290 1144075 1125315 1104805 1083305 1061414 1039656 1018560 998710 980724 964836
59319 964836 950495 936866 923815 911930 901561 892459 884375 877123 869941 861841 853073 845296 839696
59306 839696 835747 832382 829501 827444 825813 823917 822031 821203 821957 823941 826694 830099 834121 838710 844012
59291 844012 850389 858235 867862 879283 891953 905076 918297 931695 945092 957998 970388 982809
59279I82809J2645J2537J2673J3951J5836J6849J6834J7298J9350K2538K5887
59268A169207K8689K9871K7927K2313J4181N324k971r980j5471j9954k4105k7662
59256A197369k9666k9966k9518k9044k8348k7276k6173k5052k3254k0512j7454
59245I11106j4614j1810q978o616m892l069n62K123M149N481O659P927R133J0014
59231I06051J0144R049O891M571K735J028j258m187p240j0045j2535j4593j5969
59218H74642j6538j6394j5703j4570j3040j1243r495q068o876n670m566l894l473
59205G45112k707j697j371j979k363j550k35M16O00J287K466L366M043N154O459
59190G57001P089P126P422P851P440O386O188P328Q414Q291P512O978O514N732
$$ plain form
59279 982809 995454 1007991 1020664 1034615 1050451 1067300 1084134 1101432 1120782 1143320 1169207
59268 1169207 1197896 1227767 1255694 1278007 1292188 1297512 1294541 1284561 1269090 1249136 1225031 1197369
59256 1197369 1167703 1137737 1108219 1079175 1050827 1023551 997378 972326 949072 928560 911106
59245 911106 896492 884682 875704 869088 864196 861127 860565 862688 866837 872318 878977 886904 896037 906051
59231 906051 916195 925244 932135 936706 939441 940469 939211 935024 927784 917739 905204 890611 874642
59218 874642 858104 841710 826007 811437 798397 787154 777659 769591 762715 757045 752479 748585 745112
59205 745112 742405 740708 739337 737358 734995 733445 733210 733626 734226 735513 737979 741345 745388 750542 757001
59190 757001 764090 771216 778638 786489 793929 800315 806503 813831 822245 830536 838048 845026 851540 857272
59176H57272N173N471O156O292N805N481O066P842J0568J3350J5248J6231J6996
59163I77951J7642J7334J5650J3235J0742Q010M838J710r46l495o439r585j2478
59150A034169j5052j7301j8802j9134j8367j6786j4585j2132r987q365p038n987
59138H70633n531n527n178l992k435j267p24n80m70O2J277K876M369N815P531
59123H66859R235J0397J1353J2977J5166J6813J7510J8118J9263K0380K0822K0786
59111A059679K0517J9599J7713J5331J3007J0755Q534O565M710K428j57k179l483
59098A173019n090p558r969j1361j2125j2943j3386j2703j1301j0204r477q369
59086A048533o757n434n056n649p003q935j1064j2876j4004j4303j3942j3511
$$ plain form
59176 857272 862445 867916 874072 880364 886169 891650 897716 905558 916126 929476 944724 960955 977951
59163 977951 995593 1012927 1028577 1041812 1052554 1060564 1065402 1067112 1066166 1062671 1056232 1046647 1034169
59150 1034169 1019117 1001816 983014 963880 945513 928727 914142 902010 892023 883658 876620 870633
59138 870633 865102 859575 854397 850405 847970 846703 845979 845399 844929 844991 846268 849144 853513 859328 866859
59123 866859 876094 886491 897844 910821 925987 942800 960310 978428 997691 1018071 1038893 1059679
59111 1059679 1080196 1099795 1117508 1132839 1145846 1156601 1165135 1171700 1176410 1178838 1178681 1176502 1173019
59098 1173019 1167929 1160371 1150402 1139041 1126916 1113973 1100587 1087884 1076583 1066379 1056902 1048533
59086 1048533 1041776 1036342 1031286 1025637 1018634 1009699 998635 985759 971755 957452 943510 929999
59074I29999j3587j3873j3422j1917j0147q857p860o752n740n134m630l782k739
59061H21559j964j573j430j530j837k083k113k149k474l139m025m758m630l306
59047G84548j631q52j002j008m03J68M06R67K118K993K968K669K887L387L631
59032H01846L785M237M839N447O428P904R268J0092J0811J1799J2646J3108J3841
59019I16051J5278J6466J6055J3877J0701P052L110o65l712n848p032p163o504
59006I67666n698m797l131n73J955L897N947Q698J1358J2751J2825J2240J1260
58993A034398R982Q907Q286P546O230M669K902o8m771r891j3687j6016j7671j8547
58979A002269j7938j6176j4395j2848j0874q330n820l603j395Q03K740M652P054
$$ plain form
59074 929999 916412 902539 889117 877200 867053 858196 850336 843584 837844 832710 828080 824298 821559
59061 821559 819595 818022 816592 815062 813225 811142 809029 806880 804406 801267 797242 792484 787854 784548
59047 784548 782917 782065 781063 780055 779652 779820 780226 781193 783311 786304 789272 791941 794828 798215 801846
59032 801846 805631 809868 814707 820154 826582 834486 843754 853846 864657 876456 889102 902210 916051
59019 916051 931329 947795 963850 977727 988428 995480 998590 997925 994213 988365 981333 974170 967666
59006 967666 961968 957171 954040 953467 955422 959319 965266 973964 985322 998073 1010898 1023138 1034398
58993 1034398 1044380 1053287 1061573 1069119 1075349 1080018 1082920 1082852 1078081 1068190 1054503 1038487 1020816 1002269
58979 1002269 984331 968155 953760 940912 930038 921708 915888 912285 910890 911693 914433 919085 926139
58966I26139R911J2857J5876J8935K1326K2383K2482K2288K1412J8982J5191J0983
58954A138765O427P51n959j2401j7583k1588k4545k5909k5271k3159k0563j8091
58942I50874j5803j3518j1043q424n971l901k190r52n41q91j322j444j760k866
58928H80248m571o346q052r581j0415j0311r821r415q651p108n466m599m102k856
58914G78954p68J110K070K384K587K962L700M797N894O710P471Q459R498J0410
58900H46238J1451J2744J3859J4606J5573J7197J9000K0569K2533K5576K9142
58889A048488L2173L4625L7111L9620M1583M2728M2740M0639L5757K9030K2161
58878A446655J5719R071J880n424j2422j8941k4680k9405l3269l6105l6984l5341
$$ plain form
58966 926139 936050 948907 964783 983718 1005044 1027427 1049909 1072197 1093609 1112591 1127782 1138765
58954 1138765 1145192 1145943 1139984 1127583 1110000 1088412 1063867 1037958 1012687 989528 968965 950874
58942 950874 935071 921553 910510 902086 896115 892214 890024 889072 888531 887640 886318 884874 883114 880248
58928 880248 875677 869331 861279 851698 841283 830972 821151 811736 803085 795977 790511 785912 781810 778954
58914 778954 778186 779296 781366 783750 786337 789299 792999 797796 803690 810400 817871 826330 835828 846238
58900 846238 857689 870433 884292 898898 914471 931668 950668 971237 993770 1019346 1048488
58889 1048488 1080661 1115286 1152397 1192017 1233600 1276328 1319068 1359707 1395464 1424494 1446655
58878 1446655 1462374 1471445 1473325 1467901 1455479 1436538 1411858 1382453 1349184 1313079 1276095 1240754
58866A240754l2067k8598k5465k2657k0623j9726j9343j8787j8536j9287k0391
58855I95274k0684k0269k0042j9899j8962j7186j5233j3140j0717q897q858r974
58843H11413j0418r799r385r636r438q174o830o349o333o054n562n142m701m203
58829G09389l901l771l473l052k839k659j987r58j68L98J259K288K818K900L252
58814F99496L860L869L029K087J542J104O30M55N54M14k7k87l45p03j261j208
58798G13209l23O12R63R40Q15M13k86p41l76Q90K721M415N158M880M664N485O880
58781G50319P669P621P385P167O582N611M645L725K740K074J920J396m99l291
58767H05064n642p141q239q786q158o643n257m308l420k689k359j736j0K071L018
$$ plain form
58866 1240754 1208687 1180089 1154624 1131967 1111344 1091618 1072275 1053488 1034952 1015665 995274
58855 995274 974590 954321 934279 914380 895418 878232 862999 849859 839142 830245 821387 811413
58843 811413 800995 791196 781811 772175 762737 754563 747733 741384 735051 728997 723435 718293 713592 709389
58829 709389 705488 701717 698244 695192 692353 689694 687707 686749 686581 686979 688238 690526 693344 696244 699496
58814 699496 703356 707225 710254 712341 713883 714987 715617 716072 716626 717040 717013 716726 716381 715678 714417 713209
58798 713209 712886 713498 714461 715401 716216 716629 716343 715602 715226 716116 718837 723252 728410 733290 737954 743439 750319
58781 750319 757988 765609 772994 780161 786743 792354 796999 800724 803464 805538 807458 808854 808355 805064
58767 805064 799422 792281 784042 775256 767098 760455 755198 750890 747470 744781 742422 740686 740676 742747 745765
58752G45765K864K902L425L615L616M588O533Q105Q898J0034J1938J3462J3818
58739H39563J3693J3823J3979J4039J4503J5415J6141J6686J7754J9128J9502
58728A014226J8409J6752J5095J2957J0340Q251P122O239N369N351O448P672Q423
58715A142654R223J0226J0532R704Q390O749L890k86m397p632j0914j4951j8739
58702A144449k1230k3085k5445k8071k9991l1041l1598l1548l0606k8994k6972
58691H35868k4301k0867j7211j3945j1292r485q717q452p789o832o596p265p729
58678F85387p176o039m956l983l136k475j470M84K741M055M633N944Q267J0299
58664F92575J1537J3095J5499J7542J8111J7367J5374J1429N799M41l159n469
$$ plain form
58752 745765 748629 751531 754956 758571 762187 766775 773308 781413 790311 800345 812283 825745 839563
58739 839563 853256 867079 881058 895097 909600 925015 941156 957842 975596 994724 1014226
58728 1014226 1032635 1049387 1064482 1077439 1087779 1096030 1103152 1109391 1114760 1120111 1126559 1134231 1142654
58715 1142654 1151877 1162103 1172635 1182339 1190729 1197478 1201368 1201082 1196685 1189053 1178139 1163188 1144449
58702 1144449 1123219 1100134 1074689 1046618 1016627 985586 953988 922440 891834 862840 835868
58691 835868 811567 790700 773489 759544 748252 738767 730050 721598 713809 706977 700381 693116 685387
58678 685387 678211 672172 667216 663233 660097 657622 656152 656636 659377 663432 668065 674009 682276 692575
58664 692575 704112 717207 732706 750248 768359 785726 801100 812529 818328 818769 815610 810141
58652H10141p368q637q943q820q723q361p757p547p576o754n001l718l527l289
58638G14120k135o72O17K293M225M971L991K645J783K99k543n306o440o434o306
58623G05108n683m002k060o07J152M029P155R487J1639J4513J7422J9180J9855
58610G97188J9864J8513J5179J0843O784K793j733n916q350r083r215r236r086
58597H18545r006r035q517p165n751m804l679j819K91K410N243Q814J1730J3320
58583H10577J4854J7242J9177J9217J8147J7423J6680J4734J1863R237P079N126
58571I81356L988M419O034Q161J0968J4558J8063K1027K4297K8226L1355L2412
58559A184864L2133L1588L0094K6571K1587J6247J0420L852k217o562r852j3258
$$ plain form
58652 810141 802773 794136 785193 776373 767650 759289 751532 743985 736409 729655 724654 720936 717409 714120
58638 714120 711985 711313 711930 714223 718448 723419 727410 730055 731838 732137 729594 724288 717848 711414 705108
58623 705108 699425 695423 693363 692756 693908 697937 705092 714579 726218 740731 758153 777333 797188
58610 797188 817052 835565 850744 861587 868371 871164 869431 863515 855165 846082 836867 827631 818545
58597 818545 809539 800504 791987 784822 779071 774267 770588 768769 769060 771470 776713 785527 797257 810577
58583 810577 825431 842673 861850 881067 899214 916637 933317 948051 959914 969151 976230 981356
58571 981356 985344 989763 995797 1003958 1014926 1029484 1047547 1068574 1092871 1121097 1152452 1184864
58559 1184864 1216997 1248585 1278679 1305250 1326837 1343084 1353504 1357356 1355139 1348577 1338725 1325467
58547A325467j6325j8083j9079k0359k1497k1578k1125k1269k1928k2492k3270
58536A098462k4577k5465k5015k3805k2530k0542j7304j3975j1709r847p531n554
58524H90608m700l758j424J302K791L473M640N903O161N819N802N577M446L544
58510I30184M148N175M771L300K390K130J594J044J110Q45r85l532n130n930p025
58495I34089q082q203p973q279q241o769m899m087l403j190J792L656M729O689
58481H89829R411J1536J3248J5553J7677J8090J7263J6598J5483J2353P779L561
58469A048381l88n275j0388j3840j5649j7067j7751j6559j4362j2874j1498q487
58457I04243m472j560L20K840N772P403P916Q830R647Q453N457K587J9l419o874
$$ plain form
58547 1325467 1309142 1291059 1271980 1251621 1230124 1208546 1187421 1166152 1144224 1121732 1098462
58536 1098462 1073885 1048420 1023405 999600 977070 956528 939224 925249 913540 903693 896162 890608
58524 890608 885908 882150 880726 882028 884819 888292 892932 898835 904996 910815 916617 922194 926640 930184
58510 930184 934332 939507 944278 947578 949968 952098 953692 954736 955846 956691 955706 952174 947044 941114 934089
58495 934089 926007 917804 909831 901552 893311 886542 881643 877556 874153 872963 874755 878411 883140 889829
58481 889829 899240 910776 924024 939577 957254 975344 992607 1009205 1024688 1037041 1044820 1048381
58469 1048381 1047993 1042718 1032330 1018490 1002841 985774 968023 951464 937102 924228 912730 904243
58457 904243 899771 898211 898531 901371 907143 914546 922462 931292 940939 949392 954849 957436 957455 954036 947162
58442I47162q088p206o481o368n393l569k431j861l41J736K568K462L351M981
58428I20522N303M576N258P727R780J0547J1265J2025J1411R568Q134O969M572
58415A027657J749J004K129K224M39j149j676k651m501n700n934o486p121o192
58401I93792m151l258l595l162k055k402l964m183l024l238n193n985m741m114
58387I40727n277n858m506l287l772m546m299l847l532k017Q82L315M504N591
58373I14078O682O494N595O326Q746J0361J0505J1139J2738J3486J3244J4061
58361A033455J5886J6196J4664J3866J4321J3504J0788Q719Q109O602L582J733
58349A161425K114K285J006L06J154J665J274K205M992P016P312Q341J1218J3677
$$ plain form
58442 947162 939074 931868 925387 919019 913626 910057 907626 905765 905424 907160 909728 912190 915541 920522
58428 920522 925825 930401 935659 943386 953166 963713 974978 987003 998414 1007982 1016116 1023085 1027657
58415 1027657 1029406 1030410 1032539 1034763 1035202 1034053 1032377 1029726 1025225 1019525 1013591 1007105 999984 993792
58401 993792 989641 986383 982788 979626 977571 975169 971205 967022 963998 960760 955567 949582 944841 940727
58387 940727 935450 929592 925086 921799 918027 913481 909182 905335 901803 899786 900668 903983 908487 914078
58373 914078 920760 927254 932849 939175 947921 958282 968787 979926 992664 1006150 1019394 1033455
58361 1033455 1049341 1065537 1080201 1094067 1108388 1121892 1132680 1141399 1149508 1156110 1159692 1161425
58349 1161425 1163539 1165824 1166830 1167136 1168290 1169955 1171229 1173434 1178426 1185442 1192754 1201095 1212313 1225990
58335A225990J4496J5452J7139J7466J6035J5441J6439J6456J4555J3140J3057
58324A395666J1851Q663O031N138M175K867L415N533O004M713N321Q439J0171
58311A477987R242R145J1156J1902J0261R930J2337J3762J2523J2258J4736J6238
58299A621477J4611J3282J4584J5707J5028J5679J8974K0979J9747J9183K1545
58288A810796K2987K0968J9259K0932K3086K3164K3776K6561K8129K6822K6598
58277B073078K9506L1402K9961K9492L2736L5620L5498L6690M1995M6697M7279
58266B469954M8138N3160N8451O0122O1467O5503O8266O6557O4523O5434O4950
58255C146525N9846N5243N5628N7021N5667N5875O1297O7149O9413P2820Q1260
$$ plain form
58335 1225990 1240486 1255938 1273077 1290543 1306578 1322019 1338458 1354914 1369469 1382609 1395666
58324 1395666 1407517 1416180 1422211 1427349 1431524 1434391 1437806 1443339 1449343 1454056 1459377 1467816 1477987
58311 1477987 1487229 1496374 1507530 1519432 1529693 1539623 1551960 1565722 1578245 1590503 1605239 1621477
58299 1621477 1636088 1649370 1663954 1679661 1694689 1710368 1729342 1750321 1770068 1789251 1810796
58288 1810796 1833783 1854751 1874010 1894942 1918028 1941192 1964968 1991529 2019658 2046480 2073078
58277 2073078 2102584 2133986 2163947 2193439 2226175 2261795 2297293 2333983 2375978 2422675 2469954
58266 2469954 2518092 2571252 2629703 2689825 2751292 2816795 2885061 2951618 3016141 3081575 3146525
58255 3146525 3206371 3261614 3317242 3374263 3429930 3485805 3547102 3614251 3683664 3756484 3837744
58244C837744Q9546R3436R8194J08034J17095J20635J24902J35629J47089J53369
58234E025673J59776J71908J84318J91850K00986K17691K35467K48206K62856
58225F898731K86030L10621L29903L51607L83072M16271M43634M74258N17315
58216A0411442N64625O08145O58686P27334Q04830Q80985R67226J076913J201861
58207A7902047J333633J488707J685344J916489K176073K490369K890495L377595
58199C5260752L951069M644580N494978O510063P720741R237230J1200811J3714522
58191I7734746J6877137K0828515K5667920L1344466L7612602M3799078M8253383
58184C22117847M8197367M0936730K6025566O398194j2965290k7841696l6619666
$$ plain form
58244 3837744 3927290 4020726 4118920 4226954 4344049 4464684 4589586 4725215 4872304 5025673
58234 5025673 5185449 5357357 5541675 5733525 5934511 6152202 6387669 6635875 6898731
58225 6898731 7184761 7495382 7825285 8176892 8559964 8976235 9419869 9894127 10411442
58216 10411442 10976067 11584212 12242898 12970232 13775062 14656047 15623273 16700186 17902047
58207 17902047 19235680 20724387 22409731 24326220 26502293 28992662 31883157 35260752
58199 35260752 39211821 43856401 49351379 55861442 63582183 72819413 84020224 97734746
58191 97734746 114611883 135440398 161108318 192452784 230065386 273864464 322117847
58184 322117847 370315214 411251944 437277510 443675704 430710414 402868718 366249052
58177C66249052m0032667l9738958l7249152l3627833k9537552k5329106k1202037
58170A39531747j7371016j4069576j1423412r388587p815351o536956n425453
58163F7501396m427184l554074k815637k177175j614226j172456r11545p95969
58155E0033130o96072n04827k16193J04311L63806M33914J60391n41206j576368
58146D7560886k678656l550369m020141m095030l892441l537760l115401k680237
58138A9990851k274976j923605j625735j372643j162650r94357q56955p39120
58130I040810o39851n60756m95548m37285l88411l53065l26106l00087k76553
58121E263148k60051k46841k30134k11372j96050j83015j67807j52223j40717
$$ plain form
58177 366249052 326216385 286477427 249228275 215600442 186062890 160733784 139531747
58170 139531747 122160731 108091155 96667743 87279156 79463805 72926849 67501396
58163 67501396 63074212 59520138 56704501 54527326 52913100 51740644 50829099 50033130
58155 50033130 49337058 48832231 48616038 48720349 49084155 49518069 49678460 49137254 47560886
58146 47560886 44882230 41331861 37311720 33216690 29324249 25786489 22671088 19990851
58138 19990851 17715875 15792270 14166535 12793892 11631242 10636885 9779930 9040810
58130 9040810 8400959 7840203 7344655 6907370 6518959 6165894 5839788 5539701 5263148
58121 5263148 5003097 4756256 4526122 4314750 4118700 3935685 3767878 3615655 3474938
58112C474938j31312j19465j07242r9595r5189q9776q5057q5198q7803q7187q3769
58101B403345q1818q0721p6825p1305o8055o6031o1489n5608n2337n0807m7161
58090A691188m1858l8118l5321l0775k5860k3675k2915k0605j8551k0255k3903
58079A389352k5202k4852k6365k8782k8611k6916k7388k9087k8042k4553k2265
58068A097289k1422j9519j7192j6901j7220j4938j1472j0721j1946j1221q751
58057I35986q142r462r639q907j0300j3221j3945j2198j1192j1344j0009p230
58045H10397n868o120n491m078m316n756n584m164m496o458p085o410p246r279
58031G28046r280p354p208r614j1297j1021j1168j2386j2144r913q571r151r017
$$ plain form
58112 3474938 3343626 3224161 3116919 3017324 2922135 2832359 2747302 2662104 2574301 2487114 2403345
58101 2403345 2321527 2240806 2163981 2092676 2024621 1958590 1897101 1841493 1789156 1738349 1691188
58090 1691188 1649330 1611212 1575891 1545116 1519256 1495581 1472666 1452061 1433510 1413255 1389352
58079 1389352 1364150 1339298 1312933 1284151 1255540 1228624 1201236 1172149 1144107 1119554 1097289
58068 1097289 1075867 1056348 1039156 1022255 1005035 990097 978625 967904 955958 944737 935986
58057 935986 927844 918382 908743 899836 889536 876315 862370 850172 838980 827636 817627 810397
58045 810397 804529 798409 792918 788840 784524 778768 773184 769020 764524 758066 750981 744571 737325 728046
58031 728046 718766 711412 704204 694590 683293 672272 661104 648718 636574 626661 618090 608939 599922
58018E99922o805m790m653n019m620m204m015k959j357j131k360k882k007j249
58004E51871j029p8J451J830J132J249K282K412J648K076M020N614O466P983R782
57989E98709R636P484N782N315M365K525J439J200j48k741m243l926l792m762
57975F16843n346m932m853n285m563k544j264j347j113n1K55m74m26P81J217K75
57959E87173k54K59R7j311k187j955k520m673o457o599o360o644o329m988m191
57944E33061m551m471l230k436k860k831j312K96R81J936L807N002M599M368N912
57929E38271Q090R085Q980Q594P804O655O154O591O744O009N360N306M981M185
57915F32809L988M357L582J151j199k416l589n406o769p218q100r844j0804j0348
$$ plain form
58018 599922 593117 588327 583674 578655 574035 569831 565816 562857 561500 560369 558009 555127 553120 551871
58004 551871 550842 550764 552215 554045 555177 556426 558708 561120 562768 564844 568864 574478 580944 588927 598709
57989 598709 608345 615829 621611 626926 631291 633816 635255 636455 636307 633566 629323 625397 621605 616843
57975 616843 611497 606565 601712 596427 591864 589320 588056 586709 585596 585545 585800 585326 584900 585681 586898 587173
57959 587173 586919 587178 587275 585964 583777 581822 579302 574629 568172 561573 555213 548569 542240 537252 533061
57944 533061 528510 524039 520809 518373 515513 512682 511370 511666 512647 514583 518390 523392 527991 532359 538271
57929 538271 546361 555446 564426 573020 580824 587479 593633 600224 606968 612977 618337 623643 628624 632809
57915 632809 636797 641154 644736 645887 644688 642272 638683 633277 626508 619290 611190 601346 590542 580194
57901E80194j0417j2248j4100j4181j3441j3374j3308j2080j0498r859r636q727
57889D38325p499o763o090m899l831l464l049j922q29m18R6J427K856L637M203
57874D11780M759M327K517O67o0k03m46l33K64J88j012j956j675j244j718k229
57858D13626j742r70q76r03k81M21P37J652L855O040O782O695P126P966Q458Q934
57842D67520J0003J1103J1365J0957J0284R037P252N975N601M892K957P72o29
57829E57089j882l743n411o049o558p984r505r790r163q700q285p325o310n886
57815D60498n370l881k071j105p82k04N85J090J561K276K519J749Q72R09J310
57800D59956R84J4r63k060l441m262l882l153l110l358l068k583k536k500j965
$$ plain form
57901 580194 569777 557529 543429 529248 515807 502433 489125 477045 466547 456688 447052 438325
57889 438325 430826 424063 417973 413074 409243 405779 402730 400808 399979 399561 399657 401084 403940 407577 411780
57874 411780 416539 420866 423383 424050 423990 423787 423341 423008 423272 423460 422448 420492 418817 417573 415855 413626
57858 413626 411884 410914 410038 409135 408854 409275 410012 411664 415519 421559 428341 435036 442162 450128 458586 467520
57842 467520 477523 488626 499991 510948 521232 530269 537521 543496 549097 553989 556946 557718 557089
57829 557089 555207 551464 546053 540004 533446 525462 515957 506167 497004 488304 480019 472694 466384 460498
57815 460498 455128 451247 449176 448071 447289 447085 447670 448760 450321 452597 455116 456865 457737 458646 459956
57800 459956 460940 460954 459991 457931 454490 450228 446346 443193 440083 436725 433657 431074 428538 426038 424073
57785D24073j704k519l608l728l139k906l121l218l256l363k848j280L51R17P51
57770C91402P56R20J070J835L428M587M322L685M110N085N137M148L012J948Q07
57755D36252J25R8m78k491m670n255m578m161m255m164m162m961o020o343o308
57740C78629o770p024n860l953l137l598l847l184k259j467o61j64l49n30M5O01
57724C36472Oj089j190m53k13m84j40P60J063Q15J206K188K317J170k4m90q02
57707C41112j371j720j631j536j552j410j298j406j008N08K002J828L82m38r3
57692C32369K58J60L06N91lj159j093O79K418K767K479K738L450M136N116O823
57676C62035R042J1566J4687J8602K3221K8951L6556M5933N5855O5038P2599P7707
$$ plain form
57785 424073 422369 419850 416242 412514 409375 406469 403348 400130 396874 393511 390663 389383 389734 390651 391402
57770 391402 392158 393078 394148 395983 399411 403998 408320 412005 416115 421200 426337 430485 433497 435445 436252
57755 436252 436377 436475 435997 433506 428836 423581 419003 414842 410587 406423 402261 397300 391280 384937 378629
57740 378629 371859 364835 358975 355022 351885 348287 344440 341256 338997 337530 336869 336705 336356 335826 335871 336472
57724 336472 336478 335389 334199 333746 333533 333049 332909 333669 334732 335547 336753 338941 341258 342428 342404 341914 341112
57707 341112 339741 338021 336390 334854 333302 331892 330594 329188 328180 328688 330690 332518 332900 332462 332369
57692 332369 332627 332787 333093 333684 333681 332522 331429 332108 334526 337293 339772 342510 345960 350096 355212 362035
57676 362035 371077 382643 397330 415932 439153 468104 504660 550593 606448 671486 744085 821792
57664H21792P9970P9927P7937P2860O3195M8975L0906Q442j8654m6894o9966q3949
57652A064541q9677q9558q4613p5668o4984n4879m5995l8257l2113k7639k3740
57641D37418j9607j5888j3410j1722j0018q418p306o317n068m073l840l846l361
57628C24544k655k412k552k503k174j865j586j119m79J43N35M15l01j054j083
57613C05854m64K5R2K07N45P30P27R85J412J233K36q27j405j714j913j758j394
57596C02571j401j687j471p32m56j005j488j302j050j261j443j220j242k030k914
57581B81869l037k646k430k332j943j410j187j342j716k273k766k731k262k091
57567B51703k414k464j762r97r92j537j923j942j706j140l02L41N65Q07J436K123
$$ plain form
57664 821792 901762 981689 1059626 1132486 1195681 1244656 1275562 1284004 1265350 1218456 1148490 1064541
57652 1064541 974864 885306 800693 725025 660041 605162 559167 520910 488797 461158 437418
57641 437418 417811 401923 388513 376791 366773 358355 351049 344732 339664 335591 331751 327905 324544
57628 324544 321889 319477 316925 314422 312248 310383 308797 307678 307199 307342 307877 308292 307991 306937 305854
57613 305854 305390 305415 305507 305714 306259 306989 307716 308701 310113 311346 311582 310755 309350 307636 305723 303965 302571
57596 302571 301170 299483 298012 297280 296824 295819 294331 293029 291979 290718 289275 288055 286813 284783 281869
57581 281869 278832 276186 273756 271424 269481 268071 266884 265542 263826 261553 258787 256056 253794 251703
57567 251703 249289 246825 245063 244066 243074 241537 239614 237672 235966 234826 234524 234865 235430 236237 237673 239796
57551B39796K359K013J130j62j196j082Q3J127J333J238J438J566J079K63l03
57536B50682n99q19q52o40m98n15l32j7l51j668l074l563l228k782k440k026j654
57519B25624j531j414q90N9J109J933K313K296K388L000L666L524K627J987K126
57504B48817K485K557K570K711K562J844Q96R3n57r42q80p67j224k023k378k328
57488B53436k537k691j791k67L9j261k228j558n11n97j075n15O19Q06l6p53r29
57471B38151r90r01l47J92J5n18n52k51m06r48j055o03k19j19M1L06M43O66J325
57452B34230K053K046J155K2o48m38O90K003K267J152j82n58j98J03L41Q29J158
57435B46025Q04K21J67M84O32P91J281J478P12k47j43P41R64J70m91l02J30O7
$$ plain form
57551 239796 242155 244168 245298 245136 243940 242858 242941 244068 245401 246639 248077 249643 250722 250985 250682
57536 250682 250083 249264 248412 247772 247274 246759 246427 246410 246059 244391 241317 237754 234526 231744 229304 227278 225624
57519 225624 224093 222679 221789 221848 222957 224890 227203 229499 231887 234887 238553 242077 244704 246691 248817
57504 248817 251302 253859 256429 259140 261702 263546 264442 264535 263978 263036 262156 261389 260165 258142 255764 253436
57488 253436 250899 248208 246417 246150 246189 244928 242700 241142 240631 240034 238959 238444 239063 239869 239833 239080 238151
57471 238151 237161 236260 235913 236105 236120 235602 235050 234799 234393 233445 232390 231787 231568 231449 231490 231796 232239 232905 234230
57452 234230 236283 238329 239484 239506 238858 238420 239110 241113 243380 244532 244350 243792 243594 243697 244038 244867 246025
57435 246025 246829 247050 247217 247701 248333 249124 250405 251883 252595 252348 252205 252946 253910 254080 253589 253287 253417 253484
57417B53484m50j086j616j651r16R4N72N76Q82J644K047J479K75p72j092n95J56
57400B53031J86p78j747j632o84K2J63K31L72K06k35m07q8M52J078J746J987J298
57382B55201J00n26n1J106K240K852K654J805J004P68R08J174J783K634K748J469
57366B77869k94j094q02l28l6L71P90P87N69O68Q50M59l56r61j391k023k355j547
57348B71176k8R07J020J271J992K409K168J885J916J825J397J042Q87O50N38J036
57332B92091J677J362K06l61J84N88j70j280j385m51N62J135J425J574J544J331
57316C00032R76O03N41J007J625J818J581J299R45L04k34o6N77R68J162J754K484
57299C17376K404J502Q94J133J679K217L166M368M765M020L251L372L784L550
$$ plain form
57417 253484 253034 251948 250332 248681 247765 247859 248431 249007 249889 251533 253580 255059 255334 254562 253470 252875 253031
57400 253031 253217 252439 250692 249060 248376 248398 248561 248792 249164 249370 249135 248728 248640 249092 250170 251916 253903 255201
57382 255201 255301 254775 254724 255830 258070 260922 263576 265381 266385 267153 268061 269235 271018 273652 276400 277869
57366 277869 277575 276481 275679 275351 275315 275686 276476 277263 277832 278500 279350 279809 279453 278492 277101 275078 272723 271176
57348 271176 271148 272055 273075 274346 276338 278747 280915 282800 284716 286541 287938 288980 289867 290517 291055 292091
57332 292091 293768 295130 295336 294975 295159 295747 295577 294297 292912 292461 293023 294158 295583 297157 298701 300032
57316 300032 301008 301611 302152 303159 304784 306602 308183 309482 310427 310731 310497 310431 311008 311976 313138 314892 317376
57299 317376 319780 321282 322176 323309 324988 327205 330371 334739 339504 343524 346775 350147 353931 357481
57285C57481K966K999L817M615M694M201L974M731O082O617N520L734K636K156
57271D16223J393N64O03J131P57m88j040n14l45j122j434m42M51o3j010q86j77
57254D13601k80j046j189m43L74R07J487K124K506K755L162L567L706L737L710
57239D38678L226K351K012K626L216K877K212K223K681K836K960L724M655M721
57225D80998M071L811M290M904N394O006O472O109N065M329M312M347L851L185
57211E47144L135M037N590P075P845P936Q030Q478Q730Q200P288O882P190P712
57197F45272Q152Q758R813J1213J2464J2912J2331J1395J1146J1735J2344J2455
57185G79990J2458J2715J2952J3066J3564J4622J5600J6163J6883J8037J8791
$$ plain form
57285 357481 360447 363446 367263 371878 376572 380773 384747 389478 395560 402177 407697 411431 414067 416223
57271 416223 417616 418180 418783 419914 420671 420183 419143 418629 418284 417162 415728 415286 415737 415674 414664 413778 413601
57254 413601 413321 412275 411086 410643 411017 411924 413411 415535 418041 420796 423958 427525 431231 434968 438678
57239 438678 441904 444255 446267 448893 452109 454986 457198 459421 462102 464938 467898 471622 476277 480998
57225 480998 485069 488880 493170 498074 503468 509474 515946 522055 527120 531449 535761 540108 543959 547144
57211 547144 550279 554316 559906 566981 574826 582762 590792 599270 608000 616200 623488 630370 637560 645272
57197 645272 653424 662182 671995 683208 695672 708584 720915 732310 743456 755191 767535 779990
57185 779990 792448 805163 818115 831181 844745 859367 874967 891130 908013 926050 944841
57174I44841J8472J7742J7599J7965J8278J8521J8806J8768J8391J8649K0149
57163A148181K1964K2926K3322K4165K5538K6915K8372L0163L1709L2401L2834
57152A448490L3951L5454L6416L6954L7954L9530M1031M2251M3410M4378M5057
57141A884876M6063M7878M9902N1502N3251N5901N8870O1236O3430O6378O9718
57130B509005P2665P5956Q1064Q7937R5297J02750J10641J18278J24246J28326
57120C506165J31407J33990J36555J40667J47521J55878J63749J71602J81515
57111D869049J93624K06260K19363K34806K53223K73476K95633L21861L54145
57102G221440L93928M44224N09099N90854O90738Q12416R61093J138942J345123
$$ plain form
57174 944841 963313 981055 998654 1016619 1034897 1053418 1072224 1090992 1109383 1128032 1148181
57163 1148181 1170145 1193071 1216393 1240558 1266096 1293011 1321383 1351546 1383255 1415656 1448490
57152 1448490 1482441 1517895 1554311 1591265 1629219 1668749 1709780 1752031 1795441 1839819 1884876
57141 1884876 1930939 1978817 2028719 2080221 2133472 2189373 2248243 2309479 2372909 2439287 2509005
57130 2509005 2581670 2657626 2738690 2826627 2921924 3024674 3135315 3253593 3377839 3506165
57120 3506165 3637572 3771562 3908117 4048784 4196305 4352183 4515932 4687534 4869049
57111 4869049 5062673 5268933 5488296 5723102 5976325 6249801 6545434 6867295 7221440
57102 7221440 7615368 8059592 8568691 9159545 9850283 10662699 11623792 12762734 14107857
57093A4107857J580378J846837K142189K457859K782278L099343L383284L603911
57085C5003936L740718L785574L732882L585461L380955L190785L057061K920607
57077F2397979K633721K067299J212384J82817q65838j815652k611836l247155
57069E9953719l736232m093984m324072m422664m391692m246278m010522l710528
57061B7017747l371972l018935k670551k339092k032088j754774j509636j295773
57053I024926j110616r51818q17056p03336o07560n26914m58317l98672l46426
57044C104211l01796k64787k33904k07443j84846j65801j49066j33353j18728
57035A344487j06029r5315q5911p7532p0290o3774n7211n0578m4628l9735l5392
$$ plain form
57093 14107857 15688235 17535072 19677261 22135120 24917398 28016741 31400025 35003936
57085 35003936 38744654 42530228 46263110 49848571 53229526 56420311 59477372 62397979
57077 62397979 65031700 67098999 68311383 68494200 67628362 65812710 63200874 59953719
57069 59953719 56217487 52123503 47799431 43376767 38985075 34738797 30728275 27017747
57061 27017747 23645775 20626840 17956289 15617197 13585109 11830335 10320699 9024926
57053 9024926 7914310 6962492 6145436 5442100 4834540 4307626 3849309 3450637 3104211
57044 3104211 2802415 2537628 2303724 2096281 1911435 1745634 1596568 1463215 1344487
57035 1344487 1238458 1143143 1057232 979700 909410 845636 788425 737847 693219 653484 618092
57024F18092l1034k6653k2301j7608j2167n939J053R136J8632K9107L9091M6434
57012F45843M9181M6832M1322L6464L5542L9077M5186N2093N9537O7143P2311
57001A190531P1540O4667N6661N3834N8312O6841P3821P3521N9814K7719k1409
56990A775852p6823j23441j51277j59838j54402j40311j21119r9698p8815o0823
56980F09305m7698m0738l9348m0624m1332m0254l8109l5640l2730k9187k5344
56969A98301k1651j8310j5457j3158j1005q221m432j07L953P399J0635J4457J9319
56956A61723K4534K8167K7940K2566J2590L44j1020j9112k3485k5255k5427k4087
56944A49478k1235j7687j4453j1619q578n060j386K174N726R508J3777J8851K4801
$$ plain form
57024 618092 587058 560405 538104 520496 508329 502390 503443 512579 531211 560318 599409 645843
57012 645843 695024 741856 783178 819642 855184 894261 939447 991540 1051077 1118220 1190531
57001 1190531 1262071 1326738 1383399 1437233 1495545 1562386 1636207 1709728 1769542 1797261 1775852
56990 1775852 1699029 1575588 1424311 1264473 1110071 969760 848641 748943 670128 609305
56980 609305 561607 520869 481521 440897 399565 359311 321202 285562 252832 223645 198301
56969 198301 176650 158340 142883 129725 118720 110499 106067 105960 109913 117312 127947 142404 161723
56956 161723 186257 214424 242364 264930 277520 277864 266844 247732 224247 198992 173565 149478
56944 149478 128243 110556 96103 84484 75906 70846 69460 71634 77360 86868 100645 119496 144297
56931A44297L1175L7150M1543M2295L6820K4045O232j1939k6258l4897l8183l7625
56919B14655l5065l1844k8323k4481k0766j7793j5488j3251j0920G887G97d655
56906h765l441l125k301p99N45J056R23N69J38j46J82J238K662M217a151F186
56889A4220Q391R721J2694J6581K0376K3680K5822K5089K0041J1381J734o286
56877A83444j1396j3586j3652j2693j1379r552o875l696q36J420L733P041J1785
56864A23758J7735K4333L1129L8108M5668N4038O2180O7048O4367N1395K9661
56853F09420M814j6899l2062m0391m2947m1199l7099l2458k7763k2409j6155r508
56841B95344k735M491J2307K0559K9656M0517N3366O7524Q2391R6860J06918J05531
$$ plain form
56931 144297 175472 212622 254165 296460 333280 357325 363557 351618 325360 290463 252280 214655
56919 214655 179590 147746 119423 94942 74176 56383 40895 27644 16724 7887 797 -4655
56906 -8765 -12206 -15331 -17632 -18431 -17886 -16830 -15907 -15338 -15200 -15346 -15164 -13926 -11264 -7047 -1151 6186
56889 14220 22611 32332 45026 61607 81983 105663 131485 156574 176615 187996 189730 183444
56877 183444 172048 158462 144810 132117 120738 111186 104311 100615 99779 101199 104932 111973 123758
56864 123758 141493 165826 196955 235063 280731 334769 396949 463997 528364 579759 609420
56853 609420 614234 597335 565273 524882 481935 440736 403637 371179 343416 321007 304852 295344
56841 295344 292609 297100 309407 329966 359622 400139 453505 521029 603420 700280 807198 912729
56829I12729Q7237N3350J1976k6921n6487p4514q2243q2431p7831p0526o1958
56818E32381n3063m4172l5148k5886j6558p338J742J0751K0040L0353M2173N4868
56806E10143O6702P5110P6432O6476M3692J2287j9230m3629n8636o5555o6408
56795E97384o3205n8127n2511m6163l8741l1068k4174j7911j1618n436K79O105
56783B54814J2881K0294K7273L3267L7832L9245L5054K4330Q793q223k3282l3856
56771D28422l9181m0435l9472l7323l4170l0290k6228k2314j8709j5720j3433
56760A11147j1431r456p912p026o071m368k541j718j826j880j642j812k564l072
56746D7828k738j915j207q04o86p68p18k64K31J45n04j141j565k040k473k364
$$ plain form
56829 912729 999966 1053316 1065292 1038371 981884 907370 825127 742696 664865 594339 532381
56818 532381 479318 435146 399998 374112 357554 350216 351958 362709 382749 413102 455275 510143
56806 510143 576845 651955 728387 794863 838555 850842 831612 787983 729347 663792 597384
56795 597384 534179 476052 423541 377378 338637 307569 283395 265484 253866 248430 248709 254814
56783 254814 267695 287989 315262 348529 386361 425606 460660 484990 493783 485560 462278 428422
56771 428422 389241 348806 309334 272011 237841 207551 181323 159009 140300 124580 111147
56760 111147 99716 90260 82348 75322 69251 64883 62342 60624 58798 56918 55276 53464 50900 47828
56746 47828 45090 43175 41968 41164 40478 39710 38992 38728 38959 39104 38600 37459 35894 33854 31381 29017
56730B9017j681j095r78q79k51P50J509J721J590J426J180N22n58j290q57M62
56714C0588J460J537J317J441J566J247R25J162J543J339P39M74O45R11J359K095
56698E0348K391J489Ro67l10L6j99n35o30p94j031p85l2M02J27j85P5M75L29k40
56678E0273o06n40l04j21mR0K32M51O26N84L46M5k59n24n47j67M85J150J608J514
56658E4332N50r07j729j264j79M26L65K30L68P57J454K351K791K280J378J097
56642F4300J664K488L142L592L859M110M759N707N981M999L700L381L911M149
56628A19742L767L348L040K421J605J089N87o36k163k564j458j69O3n11r74r58
56612A26229n40J66R11J367J595J896K113J744P95j69q81j547k138k305k050j747
$$ plain form
56730 29017 27336 26241 25263 24384 24133 24883 26392 28113 29703 31129 32309 32831 32273 30983 30126 30588
56714 30588 32048 33585 34902 36343 37909 39156 40081 41243 42786 44125 44864 45338 45983 46894 48253 50348
56698 50348 52739 54228 54237 53570 53260 53296 53097 52562 51932 51138 50107 49322 49290 49692 49819 49634 49709 50184 50513 50273
56678 50273 49667 49127 48823 48702 48698 48788 49020 49471 50097 50681 51027 51072 50813 50289 49742 49575 50060 51210 52818 54332
56658 54332 54882 53975 52246 50982 50803 51229 51594 51824 52192 52949 54403 56754 59545 61825 63203 64300
56642 64300 65964 68452 71594 75186 79045 83155 87914 93621 99602 104601 108301 111682 115593 119742
56628 119742 123509 126857 129897 132318 133923 135012 135599 134963 132800 130236 128778 128609 128672 128161 127187 126229
56612 126229 125689 125855 126766 128133 129728 131624 133737 135481 136276 136107 135226 133679 131541 129236 127186 125439
56596A25439j520j240j064j176j226p77k21k50o78p43m61m97q04n63M32J406J753
56579A17810J589J074K13n33m57M29J424K118K541K458J632O85O04J378K151K651
56563A37767L363M355N055N216N135M973M894N584P383R162R436Q396P467P153
56549B25339O857O565O845P234O574N067M180M184L725K239Q63L63L6o59j125
56534B78287j111j549k993m639n675o313o802o818o495o647p383p820p714p879
56520A98449q384q009o259m313l227k694k321k491l114l160k375j947k479k890
56506A44786k266j308q87p49n87q60j479j235K56J585J673J310J454J598J154
56491A44445Q19J164J390R43Q14J719K458J822P16O74J453J843J688J366M72j143
$$ plain form
56596 125439 123919 122679 121615 120439 119213 118436 118215 117965 117287 116544 116083 115586 114782 114219 114651 116057 117810
56579 117810 119399 120473 120686 120153 119696 120125 121549 123667 126208 128666 130298 130983 131587 132965 135116 137767
56563 137767 141130 145485 150540 155756 160891 165864 170758 176342 183725 192887 202323 210719 218186 225339
56549 225339 232196 238761 245606 252840 259414 264481 268661 272845 276570 278809 279672 280035 280071 279412 278287
56534 278287 277176 275627 272634 267995 262320 256007 249205 242387 235892 229245 221862 214042 206328 198449
56520 198449 190065 182056 175797 171484 168257 165563 163242 160751 157637 154477 152102 150155 147676 144786
56506 144786 142520 141212 140325 139576 138989 138129 136650 135415 135671 137256 138929 140239 141693 143291 144445
56491 144445 145264 146428 147818 148761 149575 151294 153752 155574 156290 156964 158417 160260 161948 163314 163786 162643
56475A62643k102j168O37J432J154J058J294R79J40k55J3K26M2k06k69L8J056
56458A66712K473K997J985N91K12O16P99P65J071J444J330J109J402J776J513
56443A86795R67R42J330J612J939K537K762J997Q29J46j25m03m30J9M12M83R07
56426B02719J817J993P85m95n54r8k55n07k8L27n29j616j263J09P23K09l99p09
56408B02229r56o72N66J665J299J14k27L95Q20Q00R21J021O45M87J303K067J326
56391B13803k26p05l9K42j77j75M93R44J129J853K880L140K768K895L479L300
56375B35604K183J289J124J062Q55Q76R46N96K50N23P42j4r19m69Q89J336N64
56358B47437j16l02p67j378j101j78j9p61j058m07L21P34J217J350L24j052r69
$$ plain form
56475 162643 160541 159373 160010 161442 162596 163654 164948 165927 166067 165812 165825 166051 166093 165887 165618 165656 166712
56458 166712 169185 172182 174167 174758 174970 175586 176385 177150 178221 179665 180995 182104 183506 185282 186795
56443 186795 187762 188704 190034 191646 193585 196122 198884 200881 201710 201856 201731 201328 200898 200917 201329 201812 202719
56426 202719 204536 206529 207314 206819 206265 206167 205912 205405 205377 205704 205175 203559 202296 202405 203128 203337 202938 202229
56408 202229 201273 200601 201167 202832 204131 204245 204018 204413 205233 206033 206954 207975 208620 209107 210410 212477 213803
56391 213803 213577 212872 212833 213075 212898 212723 213216 214160 215289 217142 220022 223162 225930 228825 232304 235604
56375 235604 237787 239076 240200 241262 242117 242993 243939 244535 244785 245308 246050 246036 245117 244648 245537 246873 247437
56358 247437 247321 247019 246252 244874 243773 243595 243576 242815 241757 241350 241671 242405 243622 244972 245296 244244 243275
56341B43275M96J399J000O05R92J321J126J214J905K327K128K093K498K566K071
56326B67016J777J895J698J029P06J050J484J690J811J573P69K86R82J948J781
56311B87495J081J552K937L334K356J495J406J321J151J649K371K085J324J817
56297C13374L195L197J549O46J628K690K334J474J115N74n83j246q46n91j170
56282C27340j242K73K152K640J832R67N79M72N40O88P67J057J931K922L195K919
56266C49032K887L102L118L230L769L821K660J705K783N103O503O947P960R234
56252D11854R115Q189Q764J0823J1953J1618J1849J3241J4026J3876J4845J7397
56240E57550J9143J8904J8632J9727K0800K0626K0192K0128J9059J6271J3302
$$ plain form
56341 243275 243771 245170 246170 246775 247767 249088 250214 251428 253333 255660 257788 259881 262379 264945 267016
56326 267016 268793 270688 272386 273415 274121 275171 276655 278345 280156 281729 282498 282784 283766 285714 287495
56311 287495 288576 290128 293065 296399 298755 300250 301656 302977 304128 305777 308148 310233 311557 313374
56297 313374 316569 319766 321315 321961 323589 326279 328613 330087 331202 331776 331193 329947 329101 328510 327340
56282 327340 326098 326371 328523 331163 332995 333962 334541 335013 335553 336241 337008 338065 339996 342918 346113 349032
56266 349032 351919 355021 358139 361369 365138 368959 371619 373324 376107 381210 387713 394660 402620 411854
56252 411854 420969 429158 437922 448745 460698 472316 484165 497406 511432 525308 540153 557550
56240 557550 576693 595597 614229 633956 654756 675382 695574 715702 734761 751032 764334
56229G64334J1271R208O434L886J801j102m811p332q172r479j2211j4324j4464
56216G25039j4325j5387j6271j5454j3919j2984j2039j0423r147q892q621p813
56204E79764p554p906o981m270k118k097k737k605k604l309l007p57J432J749
56190E37000J319J672K159K028K409L967N101M649L917L984L630K009P03R76J590
56175E77113J383J273J767J400k02p96O73J829Q77l40J65J113Q19M29J354K344
56159E91201K123K181L965N847N877N066N135N544N421N854P451Q409P667P311
56145F69052R068J1291J2216J3161J5494J7515J7656J7905K0698K5132K9448L4488
56133H93124M1366M8480N4174N9727O6569P3345P8848Q4830R2578R9855J04707
$$ plain form
56229 764334 775605 784813 791247 795133 796934 795832 791021 783689 775517 766038 753827 739503 725039
56216 725039 710714 695327 679056 663602 649683 636699 624660 614237 605090 596198 587577 579764
56204 579764 572210 564304 557323 553053 550935 548838 546101 543496 540892 537583 534576 533819 535251 537000
56190 537000 538319 539991 542150 544178 546587 550554 555655 560304 564221 568205 571835 573844 574547 575523 577113
56175 577113 578496 579769 581536 582936 582734 581938 582611 584440 585317 584977 585142 586255 587074 587503 588857 591201
56159 591201 593324 595505 599470 605317 611194 616260 621395 626939 632360 638214 645665 654074 661741 669052
56145 669052 678120 689411 701627 714788 730282 747797 765453 783358 804056 829188 858636 893124
56133 893124 934490 982970 1037144 1096871 1163440 1236785 1315633 1400463 1493041 1592896 1697603
56122A697603J09111J15188J20953J23574J23622J22177J16955J05758R1030P6845
56112B802816O3916N1435M0791L3245K6481J7638P248l427j5767l0587m4717n5068
56100B894004o3027p0948p7801q2616q8380r7504j06770j11847j13461j14062
56090A967588j11932j04278r3136q2516p2388o0883m9565m0997l3820k5746j8629
56079A273698j5112j3132r318m986l061k123P37M111N239N728Q311J1075J1109
56066A272276J0641J3060J6135J5890J4088J4788J6516J5172J1940J0890J1391
56055A422787J0243Q726J0027J2182J1246R069J0237J3705J5142J5171J7299K0139
56043A575973J9883J8248J9779K3348K4511K4041K5875K8848K8944K7534K8852
$$ plain form
56122 1697603 1806714 1921902 2042855 2166429 2290051 2412228 2529183 2634941 2725971 2802816
56112 2802816 2866732 2918167 2958958 2992203 3018684 3036322 3043570 3040143 3024376 2993789 2949072 2894004
56100 2894004 2830977 2760029 2682228 2599612 2511232 2413728 2306958 2195111 2081650 1967588
56090 1967588 1855656 1751378 1658242 1575726 1503338 1442455 1392890 1351893 1318073 1292327 1273698
56079 1273698 1258586 1245454 1236136 1231150 1228089 1225966 1226703 1230814 1236053 1241781 1250092 1261167 1272276
56066 1272276 1282917 1295977 1312112 1328002 1342090 1356878 1373394 1388566 1400506 1411396 1422787
56055 1422787 1433030 1441756 1451783 1463965 1475211 1484280 1494517 1508222 1523364 1538535 1555834 1575973
56043 1575973 1595856 1614104 1633883 1657231 1681742 1705783 1731658 1760506 1789450 1816984 1845836
56032A845836L1617L1764L0983L3572L7443L7503L5526L7096M1265M2934M3010
56021B248549M6139N0791N1912N1100N3716N8282N9371N8570O1658O7365P0091
56010B877544P1154P5887Q2372Q5014Q6297R2590J01317J05229J06373J12243
56000C796020J21163J25789J28092J35933J47575J54946J59629J69725J83604
55991E122476J93242K00827K14873K32749K45197K55268K73761K98646L19018
55982G356057L36671L62685L95327M23611M50322M88118N35290N79941O25835
55973A1553857O87844P64113Q40628R21231J023441J146783J277357J421937J603379
55964B1240570J824510K074046K366786K737611L197625L740316M388541N186635
$$ plain form
56032 1845836 1877453 1909217 1940200 1973772 2011215 2048718 2084244 2121340 2162605 2205539 2248549
56021 2248549 2294688 2345479 2397391 2448491 2502207 2560489 2619860 2678430 2740088 2807453 2877544
56010 2877544 2948698 3024585 3106957 3191971 3278268 3370858 3472175 3577404 3683777 3796020
56000 3796020 3917183 4042972 4171064 4306997 4454572 4609518 4769147 4938872 5122476
55991 5122476 5315718 5516545 5731418 5964167 6209364 6464632 6738393 7037039 7356057
55982 7356057 7692728 8055413 8450740 8874351 9324673 9812791 10348081 10928022 11553857
55973 11553857 12241701 13005814 13846442 14767673 15791114 16937897 18215254 19637191 21240570
55964 21240570 23065080 25139126 27505912 30243523 33441148 37181464 41570005 46756640
55956D6756640O152346P299193Q710034J0526563J2866353J5818051J9504396
55949A27633576K4047556K9452487L5554381M1877522M7137209M8828106M3972678
55942C98503515L1189029J2405125p707060k4363630l5071534l9993296m0684930
55935B94277219l8792940l5535542l1694097k7704959k3793350k0127496j6859576
55928I9769259j4058736j1698289r731319q126739o832455n770137m885738m162035
55920C4503811l574602l079609k652686k298469k012514j769397j555161j377216
55912A6184157j234350j108106r90732q92618q15254p43648o71771o10050n61587
55903H556041n14850m65738m24185l93223l62872l29970l03553k85573k66014
$$ plain form
55956 46756640 52908986 60208179 68918213 79444776 92311129 108129180 127633576
55949 127633576 151681132 181133619 216688000 258565522 305702731 354530837 398503515
55942 398503515 429692544 442097669 434390609 410026979 374955445 334962149 294277219
55935 294277219 255484279 219948737 188254640 160549681 136756331 116628835 99769259
55928 99769259 85710523 74012234 64280915 56154176 49321721 43551584 38665846 34503811
55920 34503811 30929209 27849600 25196914 22898445 20885931 19116534 17561373 16184157
55912 16184157 14949807 13841701 12850969 11958351 11143097 10399449 9727678 9117628 8556041
55903 8556041 8041191 7575453 7151268 6758045 6395173 6065203 5761650 5476077 5210063
55894E210063k42166k23629k13216k01142j83271j67673j57992j47068j32175
55885C541731j20458j14131j05524r1753p9735p2030o1970m7470l5759k9764k3072
55874B760065j2958n372k644R51O919Q381K752l499p311j4458k7853m1734n2366
55861B610873o3606p7022q7043r0801r2935r5873r5047q8290q0619p5289o9226
55850A695122o1622n7816n9965o2489o1307n9452n9273n7349n1662m6036m3097
55839A075054l9948l4741l0408k8370k5576k1110j8603j9021j8262j4906j2947
55828H11162j3830j3412j0026p905r175j0026q445q226j1415j4093j3668j3238
55816F77703j4662j4340j0241o413o076o421m576k604k376j378K095N288O463
$$ plain form
55894 5210063 4967897 4744268 4531052 4329910 4146639 3978966 3820974 3673906 3541731
55885 3541731 3421273 3307142 3201618 3109865 3030130 2958100 2896130 2848660 2812901 2783137 2760065
55874 2760065 2747107 2741735 2739091 2740042 2746961 2755342 2758094 2754595 2747284 2732826 2704973 2663239 2610873
55861 2610873 2547267 2470245 2383202 2292401 2199466 2103593 2008546 1920256 1839637 1764348 1695122
55850 1695122 1633500 1575684 1515719 1453230 1391923 1332471 1273198 1215849 1164187 1118151 1075054
55839 1075054 1035106 1000365 969957 941587 916011 894901 876298 857277 839015 824109 811162
55828 811162 797332 783920 773894 765989 756814 746788 738343 730117 718702 704609 690941 677703
55816 677703 663041 648701 638460 632047 625971 619550 614974 612370 609994 608616 610711 615999 622462
55803F22462Q369J2348J4756J3311J1417J1904J1866Q035K251k607p350j3055
55791F93707j7544j9272k0357k2195k2458j9810j7099j6408j5572j2839j0330
55780D99823r475p843m033j030j048j624m00P55L3m30J209K674J782L87N44P05
55764D82029p38k136k248l159o164q791r313j0057j2714j4602j3263j0765r719
55751C78360r006p172o097p375q764q041o826o977o938n335m380n829p264o294
55737B82062m774m952n072k956l92K35L09J713K608Q18j691k124j751l029m711
55722B56293m337l086l586n124n315m481m284l998k179j33J65k88M76J624J465
55707B23212J023K114L685L700K826K742K701J130j197k863m568p050q471p339
$$ plain form
55803 622462 630831 643179 657935 671246 682663 694567 706433 714468 716719 714112 706762 693707
55791 693707 676163 656891 636534 614339 591881 572071 554972 538564 522992 510153 499823
55780 499823 490348 482505 478472 477442 476394 474770 474370 475125 475158 474728 475937 478611 480393 480780 481324 482029
55764 482029 481291 479155 476907 473748 467584 458793 449480 439423 426709 412107 398844 388079 378360
55751 378360 369354 362182 356085 348710 339946 331905 325079 318102 311164 305829 301449 295620 288356 282062
55737 282062 277288 272336 267264 264308 263916 264151 264460 266173 268781 269599 267908 265784 264033 261004 256293
55722 256293 251956 248870 245284 240160 234845 230364 226080 222082 219903 219770 219935 219647 220123 221747 223212
55707 223212 224235 226349 230034 233734 236560 239302 242003 243133 241936 239073 234505 227455 218984 211645
55693B11645n735o113p084o081l922k903k510j065L13l91j882j415N66J578J570
55678A76571K392L886M339L777L359K556L40j961k417j864k253k913j990k33K15
55663A83804k64L17J722K157J820K326L432L772M009N806Q353R349Q748Q291P933
55648B51575O072K810k39k889o073r063j0126r555r155r165q483p377p040o939
55634A74353n559l339k131k082j846j393j853k923l159k554k374k705k578k031
55620A37826j757j357k15O24j68j680k040j350r63q30q8N97M8r37p18L03N98L57
55602A28250P66J312O63n78q89p24j499k528k027n37j63r45j036j38L11Q6K65
55585A20589N98j98j596j651k57O87L94o5r4j46j11N32J175Q98M29R66J776J472
$$ plain form
55693 211645 205910 199797 192713 186632 182710 179807 177297 176232 176545 176154 174272 172857 173423 175001 176571
55678 176571 178963 182849 187188 190965 194324 196880 197220 195259 192842 190978 188725 185812 183822 183589 183804
55663 183804 183540 183857 185579 187736 189556 191882 195314 199086 203095 208901 217254 226603 235351 243642 251575
55648 251575 257647 260457 260218 257329 251256 242193 232067 222512 213357 204192 195709 188332 181292 174353
55634 174353 168794 165455 163324 161242 159396 158003 156150 153227 150068 147514 145140 142435 139857 137826
55620 137826 136069 134712 134497 135121 134953 133273 131233 129883 128920 128090 128002 128599 128647 127710 126992 127295 127893 128250
55602 128250 129016 130328 130991 130413 129524 128800 127301 124773 122746 122209 122046 121101 120065 119927 120238 120324 120589
55585 120589 121187 120989 119393 117742 117485 118172 118566 118501 118407 118261 118150 118682 119857 120755 121184 122150 123926 125398
55567A25398P93J333K332J888O63R35K387K350L04j335j242p61r61j110p51n96
55551A31627p54m52R2j84j032j228r87j581k720k898k253k269k780k209q10n81
55535A08981j686k081j128n04r33j052k90O1m88n79L33Q19P3p19n45k9J41K43
55517A00617K98k07q74n83N11J176J370K057K713J712n90j909j695j854l136l743
55501I5863k589j209j112j658j875k128k642k436j131LM7j88J78O80Q08J074J826
55484H3511K444K519K481K411J729N44j85k91n99j189j120k72L21K56K10L56J47
55467I3273k02J14P26N09k20q9O76M72p06j066j55M85K85N78J779K377J615P13
55449A01164M56Nr40j321r82j268k316k324o91O51L70l29k50j58o44m99R53K083
$$ plain form
55567 125398 126191 127524 129856 131744 132407 133342 135729 138079 138383 137048 135806 135045 134084 132974 132223 131627
55551 131627 130873 130421 130513 130329 129297 128069 127082 125501 122781 119883 117630 115361 112581 110372 109562 108981
55535 108981 107295 105214 104086 103582 102649 101597 101307 101368 100880 100301 100634 101453 101526 100807 100262 100233 100374 100617
55517 100617 100915 100708 99834 99251 99762 100938 102308 104365 107078 108790 108200 106291 104596 102742 99606 95863
55501 95863 93274 92065 90953 89295 87420 85292 82650 80214 79083 79086 79133 78945 79123 79803 80611 81685 83511
55484 83511 85955 88474 90955 93366 95095 95639 95454 95163 94564 93375 92255 91983 92304 92560 92770 93126 93273
55467 93273 93071 93185 93911 94420 94200 94111 94787 95259 94553 93487 93332 93817 94102 94680 96459 98836 100451 101164
55449 101164 101620 101625 100685 99364 98382 97114 94798 92474 91783 92434 92804 92475 92225 92067 91423 90924 91877 93960
55431I3960J460K22J13Q91J327J241R49K32p07p65L02J167J123J194J975K343
55415A07027J667J263K112L077K935K358K242J954R72L48P67R25k36j402j005
55400A25004J10K36m65q70j195k163l045k690j655j257j407j233j043j605k276
55385A04446j858p76m92j150j554j185o19j84L37P80O91K23m5k1NN6K27K68P4
55366I9223K0K42K98R7K45Q58J044L43m49p24j089k011k611j960n56O19J478K183
55348I7250K143R79l71p38k90O5J25K27K91O1k66m38o37r44j018p66n25k19N84
55329I5513J400R91o50j876j653q40m96l84r0L7n2M23J456J646L63j015j212q29
55311I2732p79o17J20N46qn03JN61O2o27j85O86M46n79p66J36Q97Q79N17J9p58
$$ plain form
55431 93960 95420 95642 95755 96646 97973 99214 100163 100395 99688 98923 99225 100392 101515 102709 104684 107027
55415 107027 108694 109957 112069 115146 118081 120439 122681 124635 125607 125955 126722 127647 127411 126009 125004
55400 125004 125114 125350 124885 124015 122820 120657 117612 114922 113267 112010 110603 109370 108327 106722 104446
55385 104446 102588 101812 101320 100170 98616 97431 96812 96628 96965 97745 98436 98659 98614 98593 98598 98654 98881 99149 99223
55366 99223 99243 99485 99783 99880 100125 100983 102027 102370 101921 101197 100108 98097 95486 93526 92970 93589 95067 97250
55348 97250 99393 100372 100001 99263 98973 99038 99163 99390 99681 99742 99476 99038 98401 97457 96439 95673 95148 94929 95513
55329 95513 96913 97904 97254 95378 93725 92885 92389 92005 91915 91952 91900 92323 93779 95425 95788 94773 93561 92732
55311 92732 91953 91336 91456 92002 91994 91491 91492 92053 92115 91488 91303 91989 92435 91856 91090 91226 92123 93002 93519 93538 92780
55290I2780j397j212l42N32J117J378J104M74K54O03O46N5j96L80P05J08k38O26
55272I7377J426O26q61j030J04Q61O82N00P41Q82P03M70J10m68o32N8Q50Q75N27
55253A03801N22M30l86j275j257o91m54k71M72J154R03L65O68J301Q92m31j281
55236A04462j211q76m84J81N99R9o88o84k37m74j173j047M8R67J188J215J228
55219A03113Q31J33l80q42j584k038j432k20N27P13Q04M49q21k051j765j67J217
55202I6487J729J855J723J071M25N72J041Q17K40M61J299J398M53n11r61j234
55186A06865j264o33J46J12m69n19p2j01n65m84J59M28K52L62N30k06j446j680
55168A01415p58j25l12k14P05J461J405J213J345J223N95J87L82O16N89O44O65
$$ plain form
55290 92780 91383 90171 89829 90361 91478 92856 93960 94434 94688 95291 95937 95992 95796 96176 96881 96989 96751 97377
55272 97377 98803 99429 98568 97538 97642 98503 99185 99685 100426 101308 102011 102481 102591 102123 101491 101549 102399 103274 103801
55253 103801 104323 104753 104367 103092 101835 101144 100690 100419 100891 102045 102948 103313 103981 105282 106174 105743 104462
55236 104462 103251 102375 101891 102072 102671 102770 102082 101398 101161 100687 99514 98467 98515 99482 100670 101885 103113
55219 103113 103944 104077 103697 102855 101271 99233 97801 97581 98108 98821 99625 100074 99253 97202 95437 95270 96487
55202 96487 98216 100071 101794 102865 103290 103862 104903 105720 105960 106421 107720 109118 109571 109060 108099 106865
55186 106865 105601 104968 105114 105226 104757 104238 104166 104065 103500 103016 103175 103603 103855 104217 104747 104541 103095 101415
55168 101415 100657 100532 100220 100006 100711 102172 103577 104790 106135 107358 107953 108140 108522 109138 109727 110371 111036
55151A11036N2p86o48L91Q16J39k65M93J337J060J44l39l46l71l94k72k64m28
55133A11355l64j08k97r49j167o48k95o69j022o21L7K02J20L58O76M87n1k37J85
55114A06992Q19J143R60N41M94J071J667J508P02j1l66o36p51l21M95J060J190
55097A16557J169J006N71K73N41Q67M93j21J19J079J513J064O40O15K04r39j910
55080A23741j885j154l93Q5N4n10q56q9J335J874R48m40j305j724j918j610q26
55063A15327k37k06l34k76j35J11N56O95o9j141j174RJ117J239P83L99J43m5j52
55044A16610n14j313j704p90O77J141O70P27J454J309j47j273r92l87n50p00J87
55027A14405J385J553P92J93K01M86P51P54K60l79l33L93P13oj121j883k291k248
$$ plain form
55151 111036 111088 110302 109654 110045 110861 111000 110735 111228 112565 113625 113769 113430 113084 112713 112319 112047 111783 111355
55133 111355 110991 110883 110586 109637 108470 107822 107527 106858 105836 105215 105252 105454 105574 105932 106608 107095 107044 106807 106992
55114 106992 107811 108954 109914 110455 110949 112020 113687 115195 115897 115886 115520 114884 114133 113812 114307 115367 116557
55097 116557 117726 118732 119303 119576 120117 120984 121477 121356 121475 122554 124067 125131 125771 126386 126590 125651 123741
55080 123741 121856 120702 120309 120394 120448 119938 119082 118993 120328 122202 123150 122710 121405 119681 117763 116153 115327
55063 115327 115090 114884 114550 114274 114139 114250 114806 115501 115432 114291 113117 113126 114243 115482 116265 116664 116807 116762 116610
55044 116610 116096 114783 113079 112289 112966 114107 114777 115504 116958 118267 118120 116847 115855 115468 114918 114218 114405
55027 114405 115790 117343 118135 118328 118529 119015 119766 120520 120780 120401 120068 120461 121174 121168 120047 118164 115873 113625
55009A13625j220N92J942K186K070K178J918R39K03N49J229J103L20k34l76m25
54993A26599l13J22N65O92O65N80K00k76j40O00R71O34N72J392K111J639L80o11
54975A36382j157j507j344l98O20P88K38k57m22m62m08k02M8M40J240K083K087
54958A37769J201M97N72P43M15J36L99O05J79k18L11J452K188K059J233J9r07
54941A48653p26L14Q30J85n66l84K59N38Q01J686K710L026K835K914L316L720
54925A70111M363N574O942P975Q979J0369J1703J2275J2022J1015Q856N519J942
54912B77645j114l991o912q934r346r117r568j0298r958q504p200o688o376n594
54898A74045m244k516r21k27n35q33m03M9l36r37n50O64J557J928K594L749M687
$$ plain form
55009 113625 112405 112997 114939 117125 119195 121373 123291 124230 124433 124982 126211 127314 127634 127400 127024 126599
54993 126599 126286 126408 126973 127665 128330 128910 129110 128834 128694 129294 130265 130899 131471 132863 134974 136613 136993 136382
54975 136382 135225 133718 132374 131976 132596 133384 133622 133365 132943 132481 132073 131871 131919 132359 133599 135682 137769
54958 137769 138970 139467 140039 140782 141197 141333 141732 142337 142516 142298 142609 144061 146249 148308 149541 149560 148653
54941 148653 147927 148241 149071 149256 148690 148306 148565 149103 149904 151590 154300 157326 160161 163075 166391 170111
54925 170111 174474 180048 186990 194965 203944 214313 226016 238291 250313 261328 270184 275703 277645
54912 277645 276531 272540 265628 256694 247348 238231 228663 218365 208407 199903 192703 186015 179639 174045
54898 174045 169801 167285 166364 166137 165602 164769 164366 164415 164079 163142 162592 163256 164813 166741 169335 173084 177771
54881A77771N182N868P107Q495R640J0566J1172J1062J0042Q217N646K463p59
54868B72472l393n366p026q532r789j0638j0808j0080q818p822p299o636n560
54855A70705m691m413m088l070j697o07J25M70J8j140j963j794j314j299j341
54840A43901p98n6J73J20K94L93r4q34j265j533j882j921j481j271j567j315J57
54823A31021J583J464M02NL04J70l45j13Q88J408R95N02L54J3o53q37j09R00J452
54804A39404J445J086O58O20J120J537J254O23L46K75j69q30r89m60L97J379K171
54787A49867K038Q35k09K1Q71R84M50M29J112J648J797K080K384K058J436J808
54771A69609L629N977P861R051R677J0084J0932J2376J3324J2640J0704Q600O171
$$ plain form
54881 177771 182953 188821 195928 204423 214063 224629 235801 246863 256905 265122 270768 273231 272472
54868 272472 269079 263713 256687 248155 238366 227728 216920 206840 198022 190200 182901 176265 170705
54855 170705 166014 161601 157513 154443 152746 152139 152264 152734 152752 151612 149649 147855 146541 145242 143901
54840 143901 143103 143047 143220 143340 143634 144027 143933 143099 141834 140301 138419 136498 135017 133746 132179 130864 131021
54823 131021 132604 134068 134470 134475 134779 134949 134604 134491 135379 136787 137782 138284 138638 138651 137998 137161 137052 137952 139404
54804 139404 140849 141935 142593 143213 144333 145870 147124 147747 148093 148368 148199 147369 146380 145920 146317 147696 149867
54787 149867 151905 152740 152531 152552 153423 154407 154857 155286 156398 158046 159843 161923 164307 166365 167801 169609
54771 169609 173238 179215 187076 196127 205804 215888 226820 239196 252520 265160 275864 284464 290635
54758B90635K471k107n838p831q736r229r204q666q089p600o910o132n704n459
54744B01601m863m045l483k945j919q50n83p91l72P55J675K099K482K694K245
54729A93700J736K417M229N864O888Q101R659J0646J0759J0747J0735R756P425
54716B92662M539J567j944n852q845j0048j0040r746r477r394r658r703q634o680
54702A98747n067m225l439k478k019k160k099j683j721k242k144j128m12q01j541
54687A65588j825j955k198j914p84L91Q60Q11M38m92j554j554l70M85j0r58j053
54670A53906k76P18J529J611L49j542k188j087j2k96q20j31J002Q58m90j546j721
54653A49864j588j383q58l05k65l90J37J183J725J253K62n26p41l51L53Q98J157
$$ plain form
54758 290635 293106 290999 285161 277330 268594 259365 250161 241495 233406 225806 218896 212764 207060 201601
54744 201601 196738 192693 189210 186265 184346 183496 182913 182122 181750 182505 184180 186279 188761 191455 193700
54729 193700 195436 197853 202082 207946 214834 222935 232594 243240 253999 264746 275481 285237 292662
54716 292662 297201 298768 296824 290972 282127 272079 262039 252293 242816 233422 223764 214061 205427 198747
54702 198747 193680 189455 186016 183538 181519 179359 177260 175577 173856 171614 169470 168342 167930 167129 165588
54687 165588 163763 161808 159610 157696 156912 157303 158163 158974 159412 158920 157366 155812 155442 155927 155917 154959 153906
54670 153906 153630 154348 155877 157488 157837 156295 154107 153020 153008 152712 151892 151761 152763 153621 153131 151585 149864
54653 149864 148276 146893 146035 145730 145465 145075 145212 146395 148120 149373 149635 149109 148368 148017 148370 149268 150425
54636A50425J420J644J397P56M66O98O32j63q09m09N82J059O84q3p20p52O6J070
54618A57963R79l96j686j787j236r29n84M46J706K245K094J993K123K141J987
54603A67059J758J165Q1q14p67o6L87K55j15l60k97J44O39O11Q2k08O4L18J75
54584A70111J48N78Q11K52n30n95J27J029J574J286o9j654j923o00O89N86k70
54567A71550n55j83K44P24J285J182P8q38l60P95J094M64kj9j95n57o00m79p02
54548A72926r21m42L25M28P8L12J087J330Q78P59J371J817J486J014J203J955
54532A85606K671K920K420J233J12m2P13J419J410P98m6p95j043p04l59m85o07
54515A95221j18M92K85m96o92j33J79j48k56L81R51O11j63k64N19J360J442P31
$$ plain form
54636 150425 151845 153489 154886 155642 156108 156806 157438 157275 156466 156057 156639 157698 158382 158299 157579 156827 156893 157963
54618 157963 158942 158546 156860 155073 153837 152908 152324 152770 154476 156721 158815 160808 162931 165072 167059
54603 167059 168817 169982 170063 169249 168482 168416 168803 169058 168943 168583 168286 168430 169069 169680 169762 169554 169618 169936 170111
54584 170111 170259 170837 171648 171900 171370 170775 170902 171931 173505 174791 174722 173068 171145 170545 171234 171820 171550
54567 171550 170995 170812 171056 171780 173065 174247 174325 173487 173127 173922 175016 175480 175478 175459 175264 174707 174107 173628 172926
54548 172926 172005 171563 171888 172316 172394 172706 173793 175123 176001 176760 178131 179948 181434 182448 183651 185606
54532 185606 188277 191197 193617 194850 194962 194920 195633 197052 198462 199260 199214 198419 197376 196672 196313 195828 195221
54515 195221 195103 195595 195880 195384 194692 194559 194738 194590 194334 194715 195666 196277 196114 195850 196369 197729 199171 199902
54497A99902j86p41q74q79p85l04L99N40k26j052r80k40K87M81Q60J458J798J846
54479B01304J978K096J766J168R75J259J430J234R27N49o1n55k99N82J274J455
54463B17082J500J554J382J180J468J990J821Q55K03O34J495J709J100K26m50
54448B33749p24n53k70m95j409k471l046k987k463j645q63n48q07j284j532j322
54432B11330o59J30M47N8m90n43l28n39j124j318q92m99n30m67K02J116J574J472
54414B08940J196R67P14M30K71L19M34L82O4m14q94j336j581j111L72K053K492
54397B13298J417K06P8N40N54L56R00J955K258J454N58K54M4n54j010o49K90R81
54379B22930R82M46k17o04n87m59n22n38j08N20O54J95k09j44P4O6p7j14j9J75
$$ plain form
54497 199902 199716 198975 198101 197222 196437 196133 196532 197072 196846 195794 194814 194574 194861 195342 196202 197660 199458 201304
54479 201304 203282 205378 207144 208312 209287 210546 211976 213210 214137 214686 214625 214070 213771 214353 215627 217082
54463 217082 218582 220136 221518 222698 224166 226156 227977 228832 229035 229669 231164 232873 233973 234199 233749
54448 233749 233025 232472 232202 231707 230298 227827 224781 221794 219331 217686 216823 216275 215468 214184 212652 211330
54432 211330 210671 210801 211248 211306 210816 210273 209945 209406 208282 206964 206072 205573 205043 204576 204778 205894 207468 208940
54414 208940 210136 211103 211817 212247 212518 212837 213271 213653 213717 213303 212409 211073 209492 208381 208753 210806 213298
54397 213298 214715 214921 214999 215539 216093 216449 217349 219304 221562 223016 223574 223828 223872 223318 222308 221659 221949 222930
54379 222930 223912 224358 224141 223537 222950 222491 221969 221431 221323 221843 222497 222692 222483 222339 222413 222479 222402 222288 222269 222444
54359B22444M32M86l2j076k103k543k147j064K6K06o84j630j632j062j034j717
54343B06870k206j976j476j164r08n35k42j44j11j96n93j075j154q53o33m67J34
54326A93271J023J267M19p87j350j051l30K69L51p9l72J19J056J424R16K92J30
54309A96568J13j92n77o80n63m17k05L1Q3L6K35N58L66m61j162j113o22k39J14
54290A91873P35J318J238M32m86r86j137j413k078k781k864k152j234o64k59L48
54274A79890P91L66q06j771j910j437o98K07J096J592J621J458J236R26P06O91
54258A83958M61l16j007o45N42J250Q36o4p35j164j372j056l02K41L39M35O61
54241A82062M63l74j179j368j116p81m33l10p41j249p80O96J784J521N39j98p47
$$ plain form
54359 222444 222876 223362 223330 222254 220151 217608 215461 214397 214423 214629 213945 212315 210683 209621 208587 206870
54343 206870 204664 202688 201212 200048 199140 198605 198363 198219 198108 197912 197319 196244 195090 194237 193604 193137 193271
54326 193271 194294 195561 195980 195193 193843 192792 192462 192731 193082 193003 192631 192750 193806 195230 196146 196438 196568
54309 196568 196681 196489 195912 195232 194669 194252 194047 194078 194161 194197 194432 194990 195356 194895 193733 192620 191998 191759 191873
54290 191873 192608 193926 195164 195596 195110 194124 192987 191574 189496 186715 183851 181699 180465 179801 179542 179890
54274 179890 180681 181047 180241 178470 176560 175123 174425 174632 175728 177320 178941 180399 181635 182561 183267 183958
54258 183958 184419 184103 183096 182451 182993 184243 185079 185015 184280 183116 181744 180688 180386 180627 180966 181401 182062
54241 182062 182525 182151 180972 179604 178488 177707 177274 176964 176223 174974 174194 174890 176674 178195 178734 178536 177789
54224A77789j417j663r40P4K41m14q56n19J84O09N17J34K2N87J363J329K98o90
54206A76648p63l13p3J2K82M26M1m30k72L79P90P06L86o2n74p46l75q6n59j351
54186A74066j359l88N89P26K00k86l48p3K29L15K09J07P8O7K28P35J165P93k07
54167A76846o50L2Q64O87k19p36n89m17n11n32l13j13r1j92n05j055j303o47O05
54148A71161J363J052K25j93N4M46M00l5k00L01R18P86lm35m3M92N07K33pm94
54128A76528j219j267j72R15O72l22m07O60J509J354Q78P44O14K46K17Q53J379
54111A83182J037K84K5J99rp35j137o14L03O43K47q2L36J136J403Q51Q6l98q29
54092A85928j489j917j422j70Q72J018M32l50j003j410j480j161m83L80J112J449
$$ plain form
54224 177789 176372 174709 173769 173843 174084 173670 172814 172295 172479 173088 173605 173739 173761 174348 175711 177040 177338 176648
54206 176648 175885 175572 175499 175511 175793 176219 176260 175830 175558 175937 176727 177433 177819 177757 177183 176437 176062 175976 175417 174066
54186 174066 172707 172319 172908 173634 173834 173548 173200 173127 173356 173671 173880 173987 174065 174132 174360 175095 176260 177053 176846
54167 176846 176196 176228 177092 177779 177560 176824 176235 175818 175307 174775 174462 174349 174258 174066 173561 172506 171203 170556 171161
54148 171161 172524 173576 173801 173608 173662 174108 174508 174473 174273 174574 175492 176278 176275 175840 175797 176289 176796 177029 177022 176528
54128 176528 175309 174042 173870 174785 175457 175135 174728 175388 176897 178251 179129 179873 180487 180733 180950 181803 183182
54111 183182 184219 184503 184528 184727 184718 183983 182846 182232 182535 183178 183425 183343 183679 184815 186218 187069 187155 186757 185928
54092 185928 184439 182522 181100 180930 181802 182820 183252 182902 181899 180489 179009 177848 177365 177745 178857 180306
54076A80306J498J594J659J217K63l51N1R96J545J565J573J600J089J8p77o73
54060A93173o1K92J46k45o85j133j425j263m92O41J585J875J574J214J182J302
54044A97680J135N54j62n90l33O93J941K460J944J323J803L402M880N173M367
54029B26270L263K456K060K039K419L154M001M647N009N311N657N706N067L985
54015B81044L202L025K947K468J774J308J129J084J234J590J769J417Q45O81J043
54000C06560J493J731J897K230K839L859N422P328Q994R843R685Q655O868M137
53986C81541K12m562q989j1857j2983j3048j2528j1371r727q241p289o625o108
53973B68425n977o073n480l724j712p03p72r90q11m95l76m11m47m17l28l53p05
$$ plain form
54076 180306 181804 183398 185057 186274 186537 186186 186237 187233 188778 190343 191916 193516 194605 194623 193846 193173
54060 193173 193112 193404 193550 193305 192620 191487 190062 188799 188307 188948 190533 192408 193982 195196 196378 197680
54044 197680 198815 199369 199207 198617 198284 198977 200918 203378 205322 206645 208448 211850 216730 221903 226270
54029 226270 229533 231989 234049 236088 238507 241661 245662 250309 255318 260629 266286 271992 277059 281044
54015 281044 284246 287271 290218 292686 294460 295768 296897 297981 299215 300805 302574 303991 304836 305517 306560
54000 306560 308053 309784 311681 313911 316750 320609 326031 333359 342353 352196 361881 370536 377404 381541
53986 381541 381753 377191 368202 356345 343362 330314 317786 306415 296688 288447 281158 274533 268425
53973 268425 262448 256375 250895 247171 245459 244756 243984 242994 242183 241688 241312 240901 240454 240037 239709 239356 238651
53956B38651j141j003j53O16O09K16K11N67P00N56O36J074J564K081K937M027
53940B52148M772M931M942N323N992O369N941M849M006M319N568O521O388N670
53926C27739N172M786L862K283N14j051k115k296j596p66n23o69n49J6P81J614
53910C37202K333K533K243K205K753L147K870K811L901N305N468M487L831L908
53896C84997L635K540J576J391J255L44r87j868j981j494q07o61j623l115l855
53881C79347l574l369m023m948n286n085m836m609m270l894l564l348l676m854
53867C20011n975n432l100r62p83k070l164l453l544l808l904l484k593j454m53
53852B75832p6l38o64p18r21j601k155j784o65K67M50n5j044k115k438j443K43
$$ plain form
53956 238651 237510 236507 236354 236970 237579 237795 238006 238573 239273 239829 240465 241539 243103 245184 248121 252148
53940 252148 256920 261851 266793 272116 278108 284477 290418 295267 299273 303592 309160 315681 322069 327739
53926 327739 332911 337697 341559 343842 344356 343305 341190 338894 337298 336532 336009 335340 334791 334807 335588 337202
53910 337202 339535 342068 344311 346516 349269 352416 355286 358097 361998 367303 372771 377258 381089 384997
53896 384997 388632 391172 392748 394139 395394 395738 394751 392883 390902 389408 388601 387940 386317 383202 379347
53881 379347 375773 372404 368381 363433 358147 353062 348226 343617 339347 335453 331889 328541 324865 320011
53867 320011 314036 308604 305504 304542 303759 301689 298525 295072 291528 287720 283816 280332 277739 276285 275832
53852 275832 275756 275418 274754 274036 273115 271514 269359 267575 266910 267177 267627 267572 266528 264413 261975 260532 260775
53835B60775J288J107L48o8K35J192K526L690M215M347M949O397Q010Q835Q735
53820C16581Q361Q287Q564R021R547R954R902R177P859O009L433K9l797p380j0388
53805C85159j2751j4159j4180j2902j1006r012p029n280m144l455k508j156j34
53792B87443K47P87K069L288L471L129L406M123M055K962J934J692J867K044K246
53777C24763K159J207k89j198j277j548k488l162k842k276k403k876k934k840
53763C01996l200l543k906j559q42j346k315k990l480l996m117l394k204j439
53749B64665j455j776j821j592j483j603j606j260q60q16j056j163r54n89k29
53734B46402K7j9m38q56p69k09L53O25O47M08r6n22m36P8N60Q65J113J108N31
$$ plain form
53835 260775 262063 263170 263518 263450 263685 264877 267403 271093 275308 279655 284604 291001 299011 307846 316581
53820 316581 324942 333229 341793 350814 360361 370315 380217 389394 397253 403262 406695 406724 402927 395547 385159
53805 385159 372408 358249 344069 331167 320161 311149 304120 298840 294696 291241 288733 287577 287443
53792 287443 287690 288477 290546 293834 297305 300434 303840 307963 312018 314980 316914 318606 320473 322517 324763
53777 324763 326922 328129 327840 326642 325365 323817 321329 318167 315325 313049 310646 307770 304836 301996
53763 301996 298796 295253 292347 290788 289946 288600 286285 283295 279815 275819 271702 268308 266104 264665
53749 264665 263210 261434 259613 258021 256538 254935 253329 252069 251209 250393 249337 248174 247220 246631 246402
53734 246402 246429 246410 245972 245116 244347 244138 244491 245116 245763 246171 246075 245553 245117 245195 245755 246620 247733 248841 249372
53715B49372k99o44m48m50j046j720j815j190J2J549K808L070K394J570J029M62
53699B54654k53n52OJ063K013K669L061L144K974K722K313J594R40R11J200P97
53683B79256n00j626j618p28K44Q97J157J027Q60J076J254M37j203k090j270K28
53667B77401Q54M70o0l95p28r21o39j62j18o02j151j310p93M44J776K161J379
53650B77606M01N7J3k41k96L10R17N96l35q08o55n83p84p01k13R3p8k97j91J57
53630B74968O66J415K188K413J791O66k95n26J06J095J590J305Q66Q98J210J306
53614B91662J243J328J391J153J036J726L005L816L518K546J788J795K554L496
53600C22057L806L146K080J418J330J440J504J493J246O69J69K68Q52J207Q46
$$ plain form
53715 249372 249073 248429 247981 247531 246485 244765 242950 241760 241772 243321 246129 249199 251593 253163 254192 254654
53699 254654 254401 253849 253855 254918 256931 259600 262661 265805 268779 271501 273814 275408 276348 277259 278459 279256
53683 279256 278756 277130 275512 274784 275028 275925 277082 278109 278969 280045 281299 281736 280533 278443 277173 277401
53667 277401 278255 278725 278665 278270 277542 276621 275982 275820 275702 275100 273949 272639 271846 272290 274066 276227 277606
53650 277606 278007 278064 278077 277836 277540 277850 278767 279363 279028 278220 277565 276982 276198 275497 275284 275377 275299 275002 274811 274968
53630 274968 275634 277049 279237 281650 283441 284107 283812 283286 283392 284487 286077 287382 288248 289146 290356 291662
53614 291662 292905 294233 295624 296777 297813 299539 302544 306360 309878 312424 314212 316007 318561 322057
53600 322057 325863 329009 331089 332507 333837 335277 336781 338274 339520 340189 340358 340626 341478 342685 343531
53585C43531j2p35q12k12N60R13P75N35L53Om90p43o75o72q00o31k04k51r49j360
53565C38127q26p7j02p05j098j184j215q42L06J514J749J155P78J009J405J784
53549C41778K369K910K819K166J636J486J426J418J710K165K405K566L016L498
53535C73368L531L519M373N975P084O987O359O199O676P346P882Q270Q682R323
53521D65574J0147J0875J1510J2436J3698J4684J5132J5709J6876J7875J7857
53510F22373J7284J7113J7277J7303J7740J9355K1261K1724K0761K0168K0871
53499H33230K1997K2854K3918K5222K5600K4532K3311K3263K3911K4036K3578
53488A095452K3353K3566K3713K3583K3442K3398K3240K2805K2111K1316K0625
$$ plain form
53585 343531 343519 342784 341972 341760 342320 343233 344008 344543 344896 344902 344412 343669 342994 342322 341522 340891 340687 340436 339487 338127
53565 338127 337301 337224 337122 336417 335319 334135 332920 332078 332384 333898 335647 336802 337580 338589 339994 341778
53549 341778 344147 347057 349876 352042 353678 355164 356590 358008 359718 361883 364288 366854 369870 373368
53535 373368 376899 380418 384791 390766 397850 404837 411196 417395 424071 431417 439299 447569 456251 465574
53521 465574 475721 486596 498106 510542 524240 538924 554056 569765 586641 604516 622373
53510 622373 639657 656770 674047 691350 709090 728445 749706 771430 792191 812359 833230
53499 833230 855227 878081 901999 927221 952821 977353 1000664 1023927 1047838 1071874 1095452
53488 1095452 1118805 1142371 1166084 1189667 1213109 1236507 1259747 1282552 1304663 1325979 1346604
53477A346604K0044J9210J7845J6267J4937J3744J2442J1463J1234J0950R313
53466A504053O513M111K742J295j137l910o046p611r131j0626j2051j3791j6009
53453A438402j8219k0037k1518k2439k2313k1639k1841k3271k4477k4317k3602
53442A194729k3600k4088k4121k3666k3161k2250k0465j8548j7601j7378j6660
53431I63191j5081j3242j1365r142o754m813l262j518L25J613K523M140O849R698
53417I23162J1805J3446J5317J7375J9115K0428K1666K3028K4403K5759K7379
53406A142883K9530L1940L3833L4774L5343L6545L8579M0731M2563M4420M6451
53395A557592M8027M8885M9978N2236N5024N6978N8033N9371O1372O2915O2992
$$ plain form
53477 1346604 1366648 1385858 1403703 1419970 1434907 1448651 1461093 1472556 1483790 1494740 1504053
53466 1504053 1510566 1514677 1517419 1518714 1517577 1513667 1507621 1500010 1490879 1480253 1468202 1454411 1438402
53453 1438402 1420183 1400146 1378628 1356189 1333876 1312237 1290396 1267125 1242648 1218331 1194729
53442 1194729 1171129 1147041 1122920 1099254 1076093 1053843 1033378 1014830 997229 979851 963191
53431 963191 948110 934868 923503 914361 907607 902794 899532 898014 898339 899952 902475 906615 913464 923162
53417 923162 934967 948413 963730 981105 1000220 1020648 1042314 1065342 1089745 1115504 1142883
53406 1142883 1172413 1204353 1238186 1272960 1308303 1344848 1383427 1424158 1466721 1511141 1557592
53395 1557592 1605619 1654504 1704482 1756718 1811742 1868720 1926753 1986124 2047496 2110411 2173403
53384B173403O1982O0812N9705N8328N6670N4993N3213N0936M8098M5126M2346
53373B765612L9512L6128L2161K8120K4346K0490J6077J1329O912K796j842p391
53361B974250j3139j8368k3463k9162l5187m0467m4669m8627n3133n7920o2102
53350B548013o5151o7226o8750o9904p0403o9773o7943o5500o3198o1382n9956
53339A818827n8701n7342n5647n3763n2255n1432n0799m9526m7281m4341m1143
53328A256597l8022l5235l2810l0569k8452k6545k4520k1665j8021j4887j3310
53317I72561j2439j0438p036l956k568k128j068Q57K557L380L917M956O370P415
53303I62380P826Q257R623J2082J4808J6780J7797J8552J9732K1225K2440K3229
$$ plain form
53384 2173403 2235385 2296197 2355902 2414230 2470900 2525893 2579106 2630042 2678140 2723266 2765612
53373 2765612 2805124 2841252 2873413 2901533 2925879 2946369 2962446 2973775 2980687 2983483 2981641 2974250
53361 2974250 2961111 2942743 2919280 2890118 2854931 2814464 2769795 2721168 2668035 2610115 2548013
53350 2548013 2482862 2415636 2346886 2276982 2206579 2136806 2068863 2003363 1940165 1878783 1818827
53339 1818827 1760126 1702784 1647137 1593374 1541119 1489687 1438888 1389362 1342081 1297740 1256597
53328 1256597 1218575 1183340 1150530 1119961 1091509 1064964 1040444 1018779 1000758 985871 972561
53317 972561 960122 949684 942648 938692 936124 933996 932928 933785 936342 939722 943639 948595 954965 962380
53303 962380 970206 978463 988086 1000168 1014976 1031756 1049553 1068105 1087837 1109062 1131502 1154731
53291A154731K4103K5496K7125K8365K9035K9443K9754K9746K9378K9057K9056
53280A465289K8993K8315K6991K5289K3164K0465J7547J4987J2695J0045P026
53269A680806M481K920J686j87k766n370p566r595j1938j4855j8172k1302k3727
53256A574415k5586k7570l0044l2583l4638l6202l7580l8758l9419l9374l8757
53245A193904l7943l7392l7279l7169l6464l5207l3993l2961l1590k9787k8380
53234H15739k7966k7849k6978k5465k4402k4317k4601k4415k3473k1868j9765
53223E44640j7436j5183j3130j1289r886r198r107r085q737q140p601p210o703
53210D11935n797m700m138m566n408n578m768l740l160k879k640k785l577m425
$$ plain form
53291 1154731 1178834 1204330 1231455 1259820 1288855 1318298 1348052 1377798 1407176 1436233 1465289
53280 1465289 1494282 1522597 1549588 1574877 1598041 1618506 1636053 1651040 1663735 1673780 1680806
53269 1680806 1685287 1688207 1689893 1689706 1686940 1681570 1674004 1664409 1652471 1637616 1619444 1598142 1574415
53256 1574415 1548829 1521259 1491215 1458632 1423994 1387792 1350212 1311454 1272035 1232661 1193904
53245 1193904 1155961 1118569 1081290 1044121 1007657 972450 938457 905496 873906 844119 815739
53234 815739 787773 759924 732946 707481 683079 658762 634161 609746 586273 564405 544640
53223 544640 527204 512021 498891 487602 477716 468518 459411 450326 441589 433449 425848 418638 411935
53210 411935 406138 401438 397300 392734 387326 381748 376980 373240 370080 367201 364561 361776 358199 353774
53196C53774m531m032l691l708l626l311l179l394l491l110k548k290k413k657
53182C07793k839k938k972k972k979k938k711k245j674j189q11l64K59P94P73
53167B82987J26o00q68p84p49p17l96j3j31o70r14n80j07K74Q42J409J104k31
53149B79982j361j159j08M82J74n32j203j608j398n70P8q4n25m28j45o07j570
53132B69418j765q18J72J99m75j015j000m25N59J511J949J916J827J706J269P14
53116B75742O71J140J397J164J035J347J451P11m16r75p45l11k29o44j470k400
53100B77468k875k500j570q41p68j183j623j791j693j481j289j245j510k144k837
53085B52118l039k539j749j153p25j61M61P02M47J30J83N07O43L43j23k32J82
$$ plain form
53196 353774 349243 345211 341520 337812 334186 330875 327696 324302 320811 317701 315153 312863 310450 307793
53182 307793 304954 302016 299044 296072 293093 290155 287444 285199 283525 282336 281525 281161 281420 282214 282987
53167 282987 283113 282513 281645 280861 280112 279395 278999 278986 278855 278185 277271 276691 276584 276858 277700 279109 280213 279982
53149 279982 278621 277462 277354 277836 278010 277478 276275 274667 273269 272699 272777 272693 272168 271740 271595 270988 269418
53132 269418 267653 266835 267007 267206 266731 265716 264716 264291 264850 266361 268310 270226 272053 273759 275028 275742
53116 275742 276413 277553 278950 280114 281149 282496 283947 284658 284242 283267 282522 282211 281982 281338 279868 277468
53100 277468 274593 272093 270523 269682 268914 267731 266108 264317 262624 261143 259854 258609 257099 254955 252118
53085 252118 249079 246540 244791 243638 242913 242752 243213 243915 244362 244492 244675 245182 245825 246168 246045 245813 245995
53068B45995O30N33ll34k29j44l36l35K60J050J445J511J534J228J77j177j822
53051B49983j389m28L88P20M23l12p69l89L71N13j60q49q60k96L43O23K58o07
53033B47563j245j083n54m84q48r42o65o40r33q00k1M66j26j263j841j485o33
53016B34466K02O88O45J97k49m64n87p26p62o83o28m83P2R15J373J004l3j405
52998B33542k819l649l206j715l46J38J55L06L63j04p42q69n21k85k51P1Q25J431
52980B22324J333P08K37L81R28J263J083P74Q78J232J098K48n30l65N85J377J423
52963B34977R73N38K84M7k79o31r12j118j169q48r1O18N69k50r17o16L74J041
52945B32590P96j69j342k158k140j354o66q62j617j933j483q04k94J81N98N64
$$ plain form
53068 245995 246625 247158 247155 246821 246592 246448 246112 245777 246037 247087 248532 250043 251577 252805 252982 251805 249983
53051 249983 248594 248166 248554 249274 249697 249385 248616 248227 248598 249111 248951 248102 247242 246946 247289 247912 248170 247563
53033 247563 246318 245235 244681 244197 243349 242407 241742 241102 240169 239369 239348 239814 239688 238425 236584 235099 234466
53016 234466 234668 235356 236001 236198 235949 235485 234898 234172 233410 232727 232099 231616 231688 232603 233976 234980 234947 233542
52998 233542 230723 227074 223868 222153 221807 221945 222100 222406 222769 222665 221923 221054 220533 220248 219997 220068 220893 222324
52980 222324 223657 224365 224602 224983 225911 227174 228257 229031 229909 231141 232239 232487 231957 231592 232177 233554 234977
52963 234977 235950 236488 236772 236819 236540 235909 234997 233879 232710 231862 231771 232389 232958 232708 231791 231175 231549 232590
52945 232590 233386 233217 231875 229717 227577 226223 225557 224695 223078 221145 219662 218858 218564 218745 219343 219907
52929B19907O9l09k43q1j99m87p47r59j016p39l59l68o54n20K01P63O26K79M22
52910B15586R25J150Q66L57p9l64n07n31l50K07R57J193N49j56J89J294J674P60
52892B23720l43n10M7O12J117J689J920J477P54J89m89j550k460k563k074j595
52876B19941j115l45M86R10R90R79O69j38q10m85O64J618J800J519J213R74Q45
52859B29715R39J256J655J991K012J517Q76Q96J693K279J859R10K70j95j018j809
52843B44846j687q74n90j281k018j938j371j171j665k501l093k949k007q95l87
52828B20419n87r53j028p19NJ053J880J867J134M65K83K86Q9k40m55m56k21J53
52810B22975L65K51K22Q45J949K675K504J768J051N68L03K26J33l93j544k940
$$ plain form
52929 219907 219976 219667 219424 219343 219144 218657 217910 216951 215935 215196 214837 214469 213815 213295 213496 214259 214885 215164 215586
52910 215586 216511 217661 218527 218884 218805 218441 217934 217403 217053 217260 218217 219410 219959 219803 219992 221286 222960 223720
52892 223720 223377 222867 222914 223526 224643 226332 228252 229729 230483 230672 230183 228633 226173 223610 221536 219941
52876 219941 218826 218481 218967 219877 220867 221846 222515 222377 221567 221082 221746 223364 225164 226683 227896 228870 229715
52859 229715 230654 231910 233565 235556 237568 239085 239961 240857 242550 244829 246688 247598 247868 247673 246655 244846
52843 244846 243159 242285 241695 240414 238396 236458 235087 233916 232251 229750 226657 223708 221701 220806 220419
52828 220419 219832 218879 217851 217132 217137 218190 220070 221937 223071 223536 223819 224105 224194 223954 223499 223043 222822 222975
52810 222975 223340 223591 223813 224658 226607 229282 231786 233554 234605 235173 235476 235702 235835 235442 233898 230958
52794B30958l897l961l204k124j195m61K31O31K00q70j428q04R8nq56j030p7R12
52776B13118R78M16j21n74r12n93N78J742J959J490J252J351J084K82k80o0M17
52759B22127L16l33p08l09M89R89R82P85O98O29L47r6l91l04R9N89R94J278J465
52740B29646J467J104M07j29Q6J026J859J751P29m20r99r77q05q57j039r29l29
52723B31591L83O74N77N89Q43Q80M34n6j03R0J0m02q72j409k185k958l213k781
52705B22092j938r52k0M95L90J13L87J217J787J459M41o48j373j542j086k35M98
52688B21085P57O11L32J24J18L78P26Q18N94M24O07R70J188J339J730K195K017
52671B36013Q19o85j355r94n80q62j285q24M16J272J109N42L81N91O99O10N06
$$ plain form
52794 230958 227061 223100 219896 217772 216577 216116 216347 216978 217178 216308 214880 214076 214174 214169 213313 212283 212206 213118
52776 213118 214096 214512 214391 213817 212905 212312 212890 214632 216591 218081 219333 220684 221768 222050 221770 221710 222127
52759 222127 222443 222110 221402 221093 221582 222571 223553 224338 225036 225665 226012 225916 225525 225221 225320 225909 226903 228181 229646
52740 229646 231113 232217 232624 232495 232581 233607 235466 237217 237946 237526 236527 235550 234745 233888 232849 231920 231591
52723 231591 231974 232648 233225 233814 234657 235537 235971 235915 235812 235902 235912 235510 234638 233229 231044 228086 224873 222092
52705 222092 220154 219202 219182 219677 220067 220180 220567 221784 223571 225030 225471 224823 223450 221908 220822 220587 221085
52688 221085 221842 222453 222785 222909 223027 223405 224131 224949 225543 225967 226574 227544 228732 230071 231801 233996 236013
52671 236013 236832 236147 234792 233798 233218 232356 231071 230247 230663 231935 233044 233586 233967 234558 235257 235867 236373
52654B36373M03K92L95P84J051Q31L64J98N01J062J584J669R91j18p31m87j91
52637B44971o58j456j581j002n45n34m89k09j12l30k51O10J899K845K973K197
52621B48328P60o84j352j021k54K35K22o3l84p05j106j474j464q79j78j30p89
52604B39062j273r05r3L59L45K73K35J15J33N10Q41N88J2j53J40K49l8k76k65
52585B39859l14m96m10P0N14O27O44Q24J086J249J218Q90M20M20J213K047J863
52568B51724Q59K90O24R21L40o63j192j093p43l47n9j57n60o78k56J13j47o78
52550B48298p12j58M12O05M61J20l19o98r10j031j131j087p62k35L47R49J546
52533B45695K000K132J783Q80l29j230j369r28l79J54P36J098R72P72J154J895
$$ plain form
52654 236373 236776 237068 237463 238247 239298 240129 240493 240691 241192 242254 243838 245507 246498 246380 245649 245162 244971
52637 244971 244313 242857 241276 240274 239729 239195 238706 238497 238385 238055 237804 238414 240313 243158 246131 248328
52621 248328 249088 248404 247052 246031 245777 246012 246234 246171 245787 245082 243976 242502 241038 240159 239981 239851 239062
52604 239062 237789 236884 236791 237150 237495 237768 238003 238118 238251 238761 239602 240190 240202 240049 240189 240438 240400 240124 239859
52585 239859 239545 239049 238639 238709 239223 239850 240494 241318 242404 243653 244871 245761 246181 246601 247814 249861 251724
52568 251724 252583 252873 253497 254418 254758 254095 252903 251810 251067 250720 250661 250504 249944 249266 249010 249123 248976 248298
52550 248298 247586 247428 247840 248445 248906 249026 248707 248009 247099 246068 244937 243850 243088 242853 243200 244149 245695
52533 245695 247695 249827 251610 252490 252161 250931 249562 248634 248255 248409 249145 250243 251215 251987 253141 255036
52517B55036K089J512R73J037J327J390J422J693K019K282K700L130K842J664
52503B81116N50L22M48p3j153j858j932k042k608l205l291k881k332j810j256
52488B57995o16L1N20P80R56J164J159N71m39j135r72j51P50J395J816K122K302
52471B68248K118J359L52m0O13J540J731J371J506K329K938K858K699K854K706
52456B95182J786O63o2q14k120l406l698l009k147j553j219j314j937k517k349
52441B71486j589r26n41p9N08Q86R63Q71M63m58j480j812j243l49J65n1q83j655
52423B64276j460k22Q97Q18j0l08K44Q01Q18O58O50N53K73L01J022K121K994L324
52405B77750L017K189J415J499K654M192N314N827O000O043N996N843N544N099
$$ plain form
52517 255036 257125 258637 259610 260647 261974 263364 264786 266479 268498 270780 273480 276610 279452 281116
52503 281116 281666 281988 282436 282363 281210 279352 277420 275378 272770 269565 266274 263393 261061 259251 257995
52488 257995 257379 257410 257930 258710 259666 260830 261989 262560 262121 260986 260014 259863 260613 262008 263824 265946 268248
52471 268248 270366 271725 272077 272037 272650 274190 275921 277292 278798 281127 284065 286923 289622 292476 295182
52456 295182 296968 297631 297569 296755 294635 291229 287531 284522 282375 280822 279603 278289 276352 273835 271486
52441 271486 269897 268971 268430 268351 268859 269745 270708 271579 272042 271584 270104 268292 267049 266700 266865 266814 265931 264276
52423 264276 262816 262594 263491 264309 264299 263991 264235 265036 265854 266512 267162 267715 267988 268289 269311 271432 274426 277750
52405 277750 280767 282956 284371 285870 288524 292716 298030 303857 309857 315900 321896 327739 333283 338382
52391C38382M689M506M371L745K216j55k856n122o271o260n835n748n827n241
52377C14594l682j830n49N3N35J366K378K899K452J391O80Q09J171Q71o3p56o99
52360C21620l05k58p62j557k266k592k467k121j830j562j147o41j98K82R14J379
52344C06489J240P20N28Q70J221J235J210J375J373Q92L33L26R10J707K519L292
52328C26240L754L770L814M464N474O066O081O137O481O463N600M432L680L123
52314C95579K152R94M88O81P17L52M97J753L256L879L831M148M962N376N017M635
52298D38317M955N757O422O679O473N701M506L395K652K028J270N64J88Q7J47
52283D89141M44Q86J007N65K3JM36Q37J063J376J801J955J660J324J502K193K832
$$ plain form
52391 338382 343071 347577 351948 355693 357909 357754 354898 349776 343505 337245 331410 325662 319835 314594
52377 314594 310912 309082 308533 308586 309121 310487 312865 315764 318216 319607 320287 321096 322267 323138 323075 322319 321620
52360 321620 321315 321057 320295 318738 316472 313880 311413 309292 307462 305900 304753 304112 303914 304196 305110 306489
52344 306489 307729 308449 308977 309847 311068 312303 313513 314888 316261 317153 317486 317812 318722 320429 322948 326240
52328 326240 329994 333764 337578 342042 347516 353582 359663 365800 372281 378744 384344 388776 392456 395579
52314 395579 397731 398725 399213 399894 400611 400963 401460 403213 406469 410348 414179 418327 423289 428665 433682 438317
52298 438317 443272 449029 455451 462130 468603 474304 478810 482205 484857 486885 488155 488719 488907 488994 489141
52283 489141 489585 490471 491478 492043 492066 492067 492503 493340 494403 495779 497580 499535 501195 502519 504021 506214 509046
52266E09046L022L127L839N107N906N427M212L592M169N375O372O697O185M960
52252E77036L726L254L476L622L446L447L790L801K963J638M39m39q64n37L33
52237F09131Q90P60O47J286K387L230L632L734L494L114L304M387N633O215O281
52222F58125O350O288N720M932M498M401M392M701N554O362O348N696N191N039
52208G33597M864M540M176L596K705K082K299K968L306L319L551M059M600N364
52194G85026O489P223O841N978N773O010N526M333L632L672L295K017R74J002
52180H47791J193K60j636l292l956l676k872k240k476l477m235m003l067k047
52166H12267j044L3R44J415J564J594J490J306J331J630J870J899K046K528K952
$$ plain form
52266 509046 512068 515195 519034 524141 530047 535474 539686 543278 547447 552822 559194 565891 572076 577036
52252 577036 580762 584016 587492 591114 594560 598007 601797 605598 608561 610199 610638 610199 609335 608798 609131
52237 609131 610021 610781 611428 612714 615101 618331 621963 625697 629191 632305 635609 639996 645629 651844 658125
52222 658125 664475 670763 676483 681415 685913 690314 694706 699407 704961 711323 717671 723367 728558 733597
52208 733597 738461 743001 747177 750773 753478 755560 757859 760827 764133 767452 771003 775062 779662 785026
52194 785026 791515 798738 805579 811557 817330 823340 828866 833199 836831 840503 843798 845815 846789 847791
52180 847791 848984 849244 847608 844316 840360 836684 833812 831572 829096 825619 821384 817381 814314 812267
52166 812267 811223 811256 812200 813615 815179 816773 818263 819569 820900 822530 824400 826299 828345 830873 833825
52151H33825K788J973Q80Nj76N14J624K386K527K480K729L262L678L498K477J010
52135H65480J3j25j05o68j351j163j99N78J038K109M141O273P728Q689R431R667
52119I11536R302Q885Q713Q235O913N014L095J389j8j090k252m047o033o984o572
52104I36086n877n677n220l476p13J960L939N310O304P280Q583R740R469P188
52090I74896L873P67k001m761p022p944p542o483n073l242j240M98J832K662K614
52075I41834J724R30J062J733K076K089K352K750K576J759R58M88J4o43j171j362
52059I59169j266p45L92J731K409K142J610J599K123K538K221J107k52j193j674
52044I71911k273l276m156m265l664k874k138j459j049j087j279j148p27m12l71
$$ plain form
52151 833825 836613 838586 839466 839471 839295 839809 841433 843819 846346 848826 851555 854817 858495 861993 864470 865480
52135 865480 865493 865368 865263 864595 863244 862081 861882 862460 863498 865607 869748 876021 883749 892438 901869 911536
52119 911536 920838 929723 938436 946671 953584 958598 961693 963082 963064 961974 959722 955675 949642 942658 936086
52104 936086 930209 924532 919312 915836 915123 917083 921022 926332 932636 939916 948499 958239 967708 974896
52090 974896 978769 979536 977535 972774 965752 957808 950266 943783 938710 935468 934228 934726 936558 939220 941834
52075 941834 943558 944488 945550 947283 949359 951448 953800 956550 959126 960885 961843 962331 962345 961702 960531 959169
52059 959169 957903 957158 957550 959281 961690 963832 965442 967041 969164 971702 973923 975030 974778 973585 971911
52044 971911 969638 966362 962206 957941 954277 951403 949265 947806 946757 945670 944391 943243 942516 942104 941733
52029I41733n38j030j953k915l273k887k219j726j540j622j868k088k130j876
52015I14068j062N54K559M002M515M884N952P449Q510Q876Q841Q317O800M130
52001I88395O39l332p368j0639j2358j2625j2167j1352j0066q532p540p645q649
51988H76761r912j0817j1014j0670j0527j1189j2383j3245j3242j2474j1397j0697
51976G39194j1106j2563j3829j3691j2466j1434j0863r646p082l983j436O59L039
51963F34793N648P618Q539Q961R541J0119R889Q192N068J198k491n307p174q614
51949F85980j0149j1506j1663r930o865l732j144J330M178P225J0027J2460J4527
51936F80738J5952J6328J5385J3095R828O558M191K487K68k989o444r193j1392
$$ plain form
52029 941733 941195 940165 938212 935297 932024 929137 926918 925192 923652 922030 920162 918074 915944 914068
52015 914068 913006 913560 916119 920121 924636 929520 935472 942921 951431 960307 969148 977465 984265 988395
52001 988395 989034 985702 978334 967695 955337 942712 930545 919193 909127 900595 893055 885410 876761
51988 876761 866849 856032 845018 834348 823821 812632 800249 787004 773762 761288 749891 739194
51976 739194 728088 715525 701696 688005 675539 664105 653242 643596 636514 632531 631095 631754 634793
51963 634793 640441 648059 656598 665559 675100 685219 695108 703300 708368 709566 707075 701768 694594 685980
51949 685980 675831 664325 652662 642732 635867 632135 630991 632321 636499 643724 653751 666211 680738
51936 680738 696690 713018 728403 741498 751326 757884 762075 764562 764830 761841 755397 746204 734812
51923G34812j3450j4927j5245j4895j4912j5440j5747j5406j4586j3354j1652
51912E75198r919q817q247p339n485k860N2K797M974O556Q140J0199J2173J3010
51898E90432J2438J0969Q716N199M55m485q504j1233j2827j3586j3906j4025j3607
51885E36036j2094r645p160n217l491j386J202L942O520Q937J1579J4876J8580
51872E62679K1620K3168K3552K3541K3009K1108J7613J3241Q770M724J903J178
51860G46106K412M354N925O950P474P106N329J934k920q500j3440j6749j8875
51847G27106k0865k2501k2475k0643j8688j7887j7516j6421j4992j4315j4140
51836E26663j3229j1325r413p936o112l381n38J257J973K518L332L823L273J796
$$ plain form
51923 734812 721362 706435 691190 676295 661383 645943 630196 614790 600204 586850 575198
51912 575198 565279 556462 548215 540876 535391 532531 532583 535380 540354 546910 555050 565249 577422 590432
51898 590432 602870 613839 622555 627754 628209 623724 615220 603987 591160 577574 563668 549643 536036
51885 536036 523942 514297 507137 501920 498429 497043 498245 502187 508707 517644 529223 544099 562679
51872 562679 584299 607467 631019 654560 677569 698677 716290 729531 738301 743025 744928 746106
51860 746106 748518 752872 758797 765747 773221 780327 785656 787590 784670 776170 762730 745981 727106
51847 727106 706241 683740 661265 640622 621934 604047 586531 570110 555118 540803 526663
51836 526663 513434 502109 492696 484760 478648 475267 474729 475986 477959 480477 483809 487632 490905 492701
51822D92701P7j483k912l998m127l070j435J23J733L711N481N977N092L843K938
51807E04651J931J57k198m380n930o807p019o561n585m368l249k618k582k646
51793D52796k095q27N13J362J735J880J940K070K359K514K128J406J038J149R64
51778D70932j18j729l096l864l970l271j815j55J183K336L863O048Q573J0719
51764D85636J1681J1166R775Q346O782M101J0m305p393q988r711r901r533q914
51750D78752q518q225p416n989m622l801l124j956m64M98N08K68Q29K341L939
51735D43020M889N362N783N956N487M696M273M119L366J705m0r57r48l67N42J439
51719D88325J744J315P86P76J099J234J176J258J310O58r44k706l338k248k07
$$ plain form
51822 492701 492778 491295 488383 484385 480258 477188 475753 475876 477609 481320 486801 492778 497870 501713 504651
51807 504651 506582 506739 504541 500161 494231 487424 480405 473844 468259 463891 460642 458024 455442 452796
51793 452796 450701 449874 450387 451749 453484 455364 457304 459374 461733 464247 466375 467781 468819 469968 470932
51778 470932 470814 469085 465989 462125 458155 454884 453069 452914 454097 456433 460296 466344 474917 485636
51764 485636 497317 508483 518258 526604 533386 537487 537497 533192 525799 516811 507100 497199 487666 478752
51750 478752 470234 462009 454593 448604 443982 440181 437057 435101 434637 435135 435643 435911 436740 439081 443020
51735 443020 447909 453271 459054 465010 470497 475193 479466 483585 486951 488656 488616 487659 486711 486344 486886 488325
51719 488325 490069 491384 492170 492946 494045 495279 496455 497713 499023 499681 498737 496031 492693 490445 490238
51704D90238J342J808J956K605L285L038K192K251L803N649O439O177N508M451
51690E40742K780J037K17O18J641K523K754K011L10j826l662m742n008m741m426
51675E30228m247l716k437j281j814m224o860q311q876r220q776o741l855j690
51661D58180m81Q25K523L666L805L905M928O449P329P102O108M746L277K086J549
51646E15997J573J561R96n2j093j855k559l406m043l987l395k901k693k488k512
51631D89143l615n980q479r901j0150r686q530o652m707l391k433j140L40J227
51617D16046J322J107Q26K87m83j252k095l098l749l503k819k668l045k986k097
51602C91793j066m28J30Q97J505J680J835K468L508M695O000P306Q251Q753R155
$$ plain form
51704 490238 491580 493388 495344 497949 501234 504272 506464 508715 512518 518167 524606 530783 536291 540742
51690 540742 543522 544559 544776 545394 547035 549558 552312 554323 554633 552807 549145 544403 539395 534654 530228
51675 530228 525981 522265 519828 518547 516733 512509 505649 497338 488462 479242 470466 463725 459870 458180
51661 458180 457699 458524 461047 464713 468518 472423 477351 483800 491129 498231 504339 509085 512362 514448 515997
51646 515997 517570 519131 520127 520075 518982 517127 514568 511162 507119 503132 499737 496836 494143 491655 489143
51631 489143 485528 479548 471069 461168 451018 441332 432802 426150 421443 418052 415619 414479 414819 416046
51617 416046 417368 418475 419301 419588 419105 417853 415758 412660 408911 405408 402589 399921 396876 393890 391793
51602 391793 390727 390299 390429 391326 392831 394511 396346 398814 402322 407017 413017 420323 428574 437327 446482
51587D46482R559R592R226R149R814J0615J0575R571Q273P230O455N765N086M577
51573E61969M735O191R090J2824J6614K0163K3504K6525K8990L0874L2527L4545
51561H08551L7598M1981M7073N1627N4841N6932N8404N9147N8659N6732N3291
51550A384836M7760L9361K8156J5217J506j2884k7998m2918n5919o5669p1886
51539A239562p4800p4649p1916o7646o2822n7482n1061m3725l6884l1892k8532
51528F38153k5291k1104j6460j2749j0749r921r060p488n618m320l945m077m231
51515E03140m297m269l939l230k550k412k825l327l486l150k423j723j652k370
51501D61487l272l653l592l648l878l750l035k197j660j188l38P94J603J661J074
$$ plain form
51587 446482 456041 465633 474859 484008 493822 504437 515012 524583 532856 540086 546541 552306 557392 561969
51573 561969 566704 572895 581985 594809 611423 631586 655090 681615 710605 741479 774006 808551
51561 808551 846149 888130 935203 986830 1041671 1098603 1157007 1216154 1274813 1331545 1384836
51550 1384836 1432596 1471957 1500113 1515330 1516836 1503952 1475954 1433036 1377117 1311448 1239562
51539 1239562 1164762 1090113 1018197 950551 887729 830247 779186 735461 698577 666685 638153
51528 638153 612862 591758 575298 562549 551800 541879 532819 525331 519713 515393 511448 507371 503140
51515 503140 498843 494574 490635 487405 484855 482443 479618 476291 472805 469655 467232 465509 463857 461487
51501 461487 458215 454562 450970 447322 443444 439694 436659 434462 432802 431614 431276 432070 433673 435334 436408
51486D36408L02k57n23o86r02j001p34k90l10j167k366k931k466j654j505k207
51470D17711k952k962k409k049k218k555k610k231j384o6J432K622L323L788M190
51455D11630M405M367M231M007L473K658J920J429J051R38J547K826M033M763
51441D53278N390O201O856P284Q117R541J0586J0476R828R307Q041M831N38k434
51427E47840l022k415k015j966k009k447l581n090o468p404p513o518m969l878
51413D88545l441k932k078j523j554j531j042o02n76l38O51J781K119J692J178
51398D80349R57J174K038L254L767L075K321L051N208P395Q931J0442J2532J4916
51384E59410J7357K0451K4883L0407L6203M1949M8024N4747O1877O8922P5507
$$ plain form
51486 436408 436710 436453 435930 435244 434342 433341 432607 432317 432007 430840 428474 425543 423077 421423 419918 417711
51470 417711 414759 411797 409388 407339 405121 402566 399956 397725 396341 396275 397707 400329 403652 407440 411630
51455 411630 416035 420402 424633 428640 432113 434771 436691 438120 439171 440109 441656 444482 448515 453278
51441 453278 458668 464869 471725 479009 487126 496667 507253 517729 527557 536864 544905 549736 550274 547840
51427 547840 544818 542403 540388 538422 536413 533966 530385 525295 518827 511423 503910 497392 492423 488545
51413 488545 485104 482172 480094 478571 477017 475486 474444 473842 473266 472928 473579 475360 477479 479171 480349
51398 480349 481306 482480 484518 487772 491539 494614 496935 499986 505194 512589 521520 531962 544494 559410
51384 559410 576767 597218 622101 652508 688711 730660 778684 833431 895308 964230 1039737
51373A039737Q1154Q4896Q5666Q3144P7818O9932N8906M4374K7405R876p282k4352
51361A631274m1303n6863o9519p8616q4090q5901q4412q0706p5777o9801o2800
51350H41486n5511m8785m2518l6081k9724k4627k1460j9649j8275j7055j6114
51339E11687j5296j4193j2592j0623q532o573n018m085l803l919l978l571k715
51326D16789j915j706k050k286j735l85J003J511Q14n70j768k187j774r45l25
51311D02471l01n35k12R54K222K763K791L136L856M082L346K187J205K27j060
51296D27132k326l018l264l648m323m857m932m699m482m370m178l617k583j353
51282C75482l62K64P77J345J759J776J548J547K170L402M713N405N351N228N626
$$ plain form
51373 1039737 1120891 1205787 1291453 1374597 1452415 1522347 1581253 1625627 1653032 1662908 1655626 1631274
51361 1631274 1589971 1533108 1463589 1384973 1300883 1214982 1130570 1049864 974087 904286 841486
51350 841486 785975 737190 694672 658591 628867 604240 582780 563131 544856 527801 511687
51339 511687 496391 482198 469606 458983 450451 443878 438860 434775 430972 427053 423075 419504 416789
51326 416789 414874 413168 411118 408832 407097 406712 407715 409226 410040 409470 407702 405515 403741 402796 402471
51311 402471 402170 401635 401423 402377 404599 407362 410153 413289 417145 421227 424573 426760 427965 428192 427132
51296 427132 424806 421788 418524 414876 410553 405696 400764 396065 391583 387213 383035 379418 376835 375482
51282 375482 375120 375384 376161 377506 379265 381041 382589 384136 386306 389708 394421 399826 405177 410405 416031
51267D16031O081N645M321L195K994L286L312K800J708k4j866k754k411j984k636
51252D37698l971m655m163l115k277j972k275k949l323k901k000j253p52k59K2
51237D01855k66p80p68k02J88Nl91o44p61o22N3J007J452J189R80J418K028K069
51219D07810J681J577J843J831J210M83K35L50L05K6J3O46J635K353K586K735
51203D27319L325M416N529O037N672M794M063L710L281K362J320Q73J085J331
51189D75117J220R46N91p7r09j189o65q3j05l78l14k66r69k192k881k593j958
51172D63295j708j969k526l100l242k640j633r74r78j345j738k019j933j325o98
51157D35467q56j741k299j854r95p17j106j420j162n50n5N9k49r23j751k288k068
$$ plain form
51267 416031 422112 427757 432078 435273 438267 441553 444865 447665 449373 449349 447483 444729 442318 440334 437698
51252 437698 433727 429072 424909 421794 419517 417545 415270 412321 408998 406097 404097 402844 402092 401833 401855
51237 401855 401589 400809 400041 399839 400027 400032 399641 398997 398236 397614 397667 398674 400126 401315 402295 403713 405741 407810
51219 407810 409491 411068 412911 414742 415952 416435 416670 417020 417325 417351 417364 418010 419645 421998 424584 427319
51203 427319 430644 435060 440589 446626 452298 457092 461155 464865 468146 470508 471828 472701 473786 475117
51189 475117 476337 477283 477874 477797 476888 475699 475034 474951 474846 474468 474154 473888 472919 470727 467846 465253 463295
51172 463295 461587 459618 457092 453992 450750 448110 446477 445503 444525 443180 441442 439423 437490 436165 435467
51157 435467 434611 432870 430571 428717 427722 427005 425899 424479 423317 422767 422712 422771 422522 421599 419848 417560 415492
51140D15492j060Q4N17Q3m84m33J67P30R60J013J015R59R43J081J237J240J232
51123D24776J369J374R61N40P89J586K112K119K274L025L910M383M572M789M889
51108D63468M725M647M879M818L687J715l2q39q64n83l99p16j719k864l224k636
51092D74063k083k513l590m036l188j760r69j197j728j699j035l86k86o08p73
51077D48212l19P25J893K631K756K627K761L232L552L270K515J783J360J168J122
51062D79288J304J718K145K411K652L092L706M317M899N539O153O596P046P807
51048E38673Q665Q894Q211P280O874O950P005P057P621Q836J0287J1548J2372
51035F50273J2438J1602J0320R111P649N267K335Q7j120k278m043n753o813p878
$$ plain form
51140 415492 414432 414516 415033 415116 414632 414199 414366 415096 416056 417069 418084 419043 419986 421067 422304 423544 424776
51123 424776 426145 427519 428480 429020 429809 431395 433507 435626 437900 440925 444835 449218 453790 458579 463468
51108 463468 468193 472840 477719 482537 486224 487939 487907 487068 486204 485621 485222 484506 482787 479923 476699 474063
51092 474063 471980 469467 465877 461841 458653 456893 455924 454727 452999 451300 450265 449879 449593 448985 448212
51077 448212 447893 448618 450511 453142 455898 458525 461286 464518 468070 471340 473855 475638 476998 478166 479288
51062 479288 480592 482310 484455 486866 489518 492610 496316 500633 505532 511071 517224 523820 530866 538673
51048 538673 547338 556232 564443 571723 578597 585547 592552 599609 607230 616066 626353 637901 650273
51035 650273 662711 674313 684633 693744 701393 706660 708995 709082 707962 705684 701641 695888 689075 681197
51021F81197r651j1442j2119j1794j1331j0717r260p098n132l561j819M8J255
51008E88576J737K391L518M253M143M069M792N540N048L425K003J655J990K109
50994F35249J472J88j058j444p39L91J070J123J168J979L901O630R342J1272J2348
50979F82892J3102J3891J4502J4652J4406J3867J2820J1004Q579N955L404J058
50967H10132q81k252l202m174n536p208q526q634p363n562m142k936j048J678
50953G50346M310O182P749R629J1429J2379J2711J3530J5374J7607J9481K1134
50941I01861K3164K5556K7511K8381K8421K8400K8675K8919K8815K8450K7731
50930A205884K5847K1913J6137R754L786j511n999r272j1334j3047j5334j8160
$$ plain form
51021 681197 671546 660104 647985 636191 624860 614143 604883 597785 592653 589092 587273 587321 588576
51008 588576 590313 592704 596222 600475 604618 608687 613479 619019 624067 627492 629495 631150 633140 635249
50994 635249 636721 636909 635851 634407 633668 634059 635129 636252 637420 639399 643300 649930 659272 670544 682892
50979 682892 695994 709885 724387 739039 753445 767312 780132 791136 799715 805670 809074 810132
50967 810132 809251 806999 803797 799623 794087 786879 778353 769719 762356 756794 752652 749716 748668 750346
50953 750346 754656 760838 768587 778216 789645 802024 814735 828265 843639 861246 880727 901861
50941 901861 925025 950581 978092 1006473 1034894 1063294 1091969 1120888 1149703 1178153 1205884
50930 1205884 1231731 1253644 1269781 1279535 1283321 1281810 1275811 1266539 1255205 1242158 1226824 1208664
50918A208664k0782k2722k4130k5346k6520k7549k8152k8081k7450k6687k6002
50907I25243k5123k3807k2295k0990j9841j8456j6639j4639j2867j1626j0880
50896G28080j0174q915o979m938l536l082l391l976m153l439k163j346j569k251
50882F68168k449k056j696j668j615j213o12J8P63J645K328K486K253K093K326
50867F70771K886L456L731L634L419L485M018M827N543N944O088O215O595P407
50853G38019Q672J0189J1591J2566J3125J3657J4580J5985J7584J9000K0088K1029
50841I16085K2150K3568K5009K6137K6992K7902K8899K9589K9727K9533K9237
50830A214828K8747K8182K8189K9148L0391L1048L1371L2404L4409L6535L8192
$$ plain form
50918 1208664 1187882 1165160 1141030 1115684 1089164 1061615 1033463 1005382 977932 951245 925243
50907 925243 900120 876313 854018 833028 813187 794731 778092 763453 750586 738960 728080
50896 728080 717906 708991 702012 697074 693538 690456 687065 683089 678936 675497 673334 671988 670419 668168
50882 668168 665719 663663 661967 660299 658684 657471 656859 656877 657640 659285 661613 664099 666352 668445 670771
50867 670771 673657 677113 680844 684478 687897 691382 695400 700227 705770 711714 717802 724017 730612 738019
50853 738019 746691 756880 768471 781037 794162 807819 822399 838384 855968 874968 895056 916085
50841 916085 938235 961803 986812 1012949 1039941 1067843 1096742 1126331 1156058 1185591 1214828
50830 1214828 1243575 1271757 1299946 1329094 1359485 1390533 1421904 1454308 1488717 1525252 1563444
50819A563444L9748M1606M3394M4566M5062M4808M3237L9937L5345L0091K4054
50808A995292J6645P833j648j0921j9397k6775l3126l8805m3895m7916n0350n1239
50796A695698n0855m9095m5730m1022l5713l0435k5532k1162j7176j2960p949
50785A358069k304L223P890J1253J3159J3989J4639J5671J6524J6141J4362J2070
50773A494686R923P564M379N19l272o610r775j3157j6647j9810k2476k5001k7816
50760A372507l0788l3299l4903l5695l5881l5403l4225l2702l1291k9974k8306
50749A010040k5994k3155k0092j7053j4249j1859r879q033n897l234l63J946L289
50736H75467M352O293R229J1820J2770J2339J1912J2373J3494J4744J6000J7297
$$ plain form
50819 1563444 1603192 1644798 1688192 1732758 1777820 1822628 1865865 1905802 1941147 1971238 1995292
50808 1995292 2011937 2019770 2018122 2007201 1987804 1961029 1927903 1889098 1845203 1797287 1746937 1695698
50796 1695698 1644843 1595748 1550018 1508996 1473283 1442848 1417316 1396154 1378978 1366018 1358069
50785 1358069 1355765 1358988 1366878 1378131 1391290 1405279 1419918 1435589 1452113 1468254 1482616 1494686
50773 1494686 1504609 1512173 1516552 1517071 1513799 1507189 1497414 1484257 1467610 1447800 1425324 1400323 1372507
50760 1372507 1341719 1308420 1273517 1237822 1201941 1166538 1132313 1099611 1068320 1038346 1010040
50749 1010040 984046 960891 940799 923746 909497 897638 887759 879726 873829 870595 870232 872178 875467
50736 875467 879819 886112 895341 907161 919931 932270 944182 956555 970049 984793 1000793 1018090
50724A018090J8425J9154J9649K0320K1219K1724K1041J9131J7013J5789J5473
50713A227028J5075J3833J1861R584P299N581N323O693Q610J0001J1206J3362
50701A345456J6579J9678K1714K2922K3968K4902K5206K4426K2488J9718J6770
50690A583827J4181J1862R172N691J669k214n330p353q330q547q097o631l854
50677A576046k16L352O479R699J3582J7866K1759K4926K7855L1239L5220L9331
50665A807138M3144M6704N0198N3316N5323N5792N4951N3124N0283M6462M2225
50654B358660L8255L4696L1279K7897K4627K1370J8027J4929J2558J0789Q899
50643B601986O533M316L322M130O455R495J2612J5826J9601K4074K8593L2229
$$ plain form
50724 1018090 1036515 1055669 1075318 1095638 1116857 1138581 1159622 1178753 1195766 1211555 1227028
50713 1227028 1242103 1255936 1267797 1277381 1284680 1290261 1295584 1302277 1310887 1320888 1332094 1345456
50701 1345456 1362035 1381713 1403427 1426349 1450317 1475219 1500425 1524851 1547339 1567057 1583827
50690 1583827 1598008 1609870 1619042 1624733 1626402 1624188 1618858 1611505 1603175 1594628 1586531 1579900 1576046
50677 1576046 1575830 1579182 1585661 1595360 1608942 1626808 1648567 1673493 1701348 1732587 1767807 1807138
50665 1807138 1850282 1896986 1947184 2000500 2055823 2111615 2166566 2219690 2269973 2316435 2358660
50654 2358660 2396915 2431611 2462890 2490787 2515414 2536784 2554811 2569740 2582298 2593087 2601986
50643 2601986 2608519 2612835 2616157 2620287 2626742 2636237 2648849 2664675 2684276 2708350 2736943 2769172
50631B769172L4587L5871L6362L6132L5152L3359L0693K7206K3011J7942J1702
50620C091189M664j962p367j2149j7351k2845k7705l2135l7793m5428n2992n6984
50608B781142n5586m9891m2307l4395k6611j9513j4372j2195j2587j4272j6705
50597B482708k0558k6423l3718m1292m8495n4988o0139o3511o5635o7314o8250
50586A932385o7336o4400o0633n7055n3413m9089m4282l9631l5171l0438k5411
50575A405526k0750j7022j3978j0745o658j910K622O239Q923J0905J2031J1999
50563A387182J1046R913R097Q603Q415Q771R880J1717J4192J7205K0544K4148
50551A540713K8274L3053L7996M2484M6644N1077N5661N9363O1385O1968O1804
$$ plain form
50631 2769172 2803759 2839630 2875992 2912124 2947276 2980635 3011328 3038534 3061545 3079487 3091189
50620 3091189 3095853 3093891 3086524 3074375 3057024 3034179 3006474 2974339 2936546 2891118 2838126 2781142
50608 2781142 2725556 2675665 2633358 2598963 2572352 2552839 2538467 2526272 2513685 2499413 2482708
50597 2482708 2462150 2435727 2402009 2360717 2312222 2257234 2197095 2133584 2067949 2000635 1932385
50586 1932385 1865049 1800649 1740016 1682961 1629548 1580459 1536177 1496546 1461375 1430937 1405526
50575 1405526 1384776 1367754 1353776 1343031 1336373 1334463 1337085 1343324 1352247 1363152 1375183 1387182
50563 1387182 1398228 1408141 1417238 1425841 1434256 1443027 1452907 1464624 1478816 1496021 1516565 1540713
50551 1540713 1568987 1602040 1640036 1682520 1729164 1780241 1835902 1895265 1956650 2018618 2080422
50540B080422O1274O0446N9464N8563N8064N8410N9880O2283O5325O9138P3854
50529B767123P8848Q3262Q7280R1997R7799J03888J09681J15634J22114J28340
50519C785966J33249J36656J38773J39096J36715J31368J23465J13230J00483
50510D939001Q5142O7319M7110K4749J002k2961m5935o6817q4807r9812j12224
50499D731767j21912j27802j28878j25252j17747j06990r3458p8069o1937m5790
50489C723932l0220j6285n159K767P804J0036Q882L667n811j9015l4626n0953
50477C595019o6988q2755r8130j11574j20931j25584j26962j26752j25223j21781
50467B488339j16533j10569j04757r8893r2308q5082p8229p2533o7564o2219n6115
$$ plain form
50540 2080422 2141696 2202142 2261606 2320169 2378233 2436643 2496523 2558806 2624131 2693269 2767123
50529 2767123 2845971 2929233 3016513 3108510 3206309 3310197 3419878 3535512 3657626 3785966
50519 3785966 3919215 4055871 4194644 4333740 4470455 4601823 4725288 4838518 4939001
50510 4939001 5024143 5091462 5138572 5163321 5164323 5141362 5095427 5028610 4943803 4843991 4731767
50499 4731767 4609855 4482053 4353175 4227923 4110176 4003186 3909728 3831659 3769722 3723932
50489 3723932 3693712 3677427 3672268 3675035 3682839 3692875 3701757 3705424 3699613 3680598 3645972 3595019
50477 3595019 3528031 3445276 3347146 3235572 3114641 2989057 2862095 2735343 2610120 2488339
50467 2488339 2371806 2261237 2156480 2057587 1965279 1880197 1801968 1729435 1661871 1599652 1543537
50456A543537m9892m4165l8883l3941k9726k6496k3756k0858j7922j5487j3547
50445A228864j1584r409p370n748m518l624k939k099q18N93J635K444L742N831
50431A195000Q189J0145J1528J2592J3688J5083J6823J8689K0544K2554K4852
50420A369687K7196K9389L1809L4965L8678M2376M5992M9900N4034N7930O1669
50409A843625O5913P0741P5344P9136Q2451Q5610Q8066Q9064Q8601Q7097Q4574
50398B740222Q0786P5694O9195O0804N0357L8723K6987J5136K372j1380k5142
50387C123754l8191n0657o2496p2677q0051q4398q6049q4929q0802p4147o5945
50376B343412n6668m6362l5822k6705j9950j4736r723m939j735j077k645n626
$$ plain form
50456 1543537 1493645 1449480 1410597 1376656 1346930 1320434 1296678 1275820 1257898 1242411 1228864
50445 1228864 1217280 1207871 1200501 1194753 1190235 1186611 1183672 1181573 1180755 1181348 1182983 1185427 1189169 1195000
50431 1195000 1203189 1213334 1224862 1237454 1251142 1266225 1283048 1301737 1322281 1344835 1369687
50420 1369687 1396883 1426272 1458081 1493046 1531724 1574100 1620092 1669992 1724026 1781956 1843625
50409 1843625 1909538 1980279 2055623 2134759 2217210 2302820 2390886 2479950 2568551 2655648 2740222
50398 2740222 2821008 2896702 2965897 3026701 3077058 3115781 3142768 3157904 3160276 3148896 3123754
50387 3123754 3085563 3034906 2972410 2899733 2819682 2735284 2649235 2564306 2483504 2409357 2343412
50376 2343412 2286744 2240382 2204560 2177855 2157905 2143169 2133446 2128507 2126772 2125695 2123050 2117424
50364B117424r773j5334k2333l0176l7818m4319m9425n3577n7115n9615o0412
50353A677527n9607n7962n5840n2981m9437m5911m2822l9766l6452l3521l1713
50342A171515l0684k9392k7446k5373k3704k2443k1319k0035j8338j6373j4823
50331I21585j4117j3682j2598j0897r549r138r215r030q314p191n942m960m419
50318H02533l886k760j144L33J554K971M503N375N436N738P070Q709R474R449
50304H55355R710J0655J1618J2088J2371J2881J3582J4390J5545J7096J8450J8820
50292A022561J8043J6686J5440J4506J3551J2167J0423Q851P854P315O871O112
50280A160380M153m78q477j8265k6631l1310l2372l0978k7687k2772j7351j2929
$$ plain form
50364 2117424 2107651 2092317 2069984 2039808 2001990 1957671 1908246 1854669 1797554 1737939 1677527
50353 1677527 1617920 1559958 1504118 1451137 1401700 1355789 1312967 1273201 1236749 1203228 1171515
50342 1171515 1140831 1111439 1083993 1058620 1034916 1012473 991154 971119 952781 936408 921585
50331 921585 907468 893786 881188 870291 860742 851604 842389 833359 825045 817854 811912 806952 802533
50318 802533 798647 795887 794743 795076 796630 799601 804104 809479 814915 820653 827723 836432 845906 855355
50304 855355 865065 875720 887338 899426 911797 924678 938260 952650 968195 985291 1003741 1022561
50292 1022561 1040604 1057290 1072730 1087236 1100787 1112954 1123377 1132228 1140082 1147397 1154268 1160380
50280 1160380 1164533 1164055 1155578 1137313 1110682 1079372 1047000 1016022 988335 965563 948212 935283
50268I35283r836p117m115j318O50J973L106L971M319M393M538M524M002L404
50254I47777L609M751O019O760P091P310P332P023O546O020N215L981K589J374
50240A023397K68r78k344l565m433m854m891m853n098n461n304m364l196k450
50226I71874k111j807j423r68j66J151K541L483M226N466P218Q742R693J0719
50212A018638J2658J5663J9308K3232K7361L1722L6138M0125M3208M5655M8500
50201A362208N2422N6617N9529O0631O0749O0502N9232N6001N0984M5161L9010
50190A963046L2287K4966J7717J1230N425m14o967j4443k2631l1148l9568m7457
50178A892043n4389o0017o4017o6027o5709o3101n8777n3566m8087m2608l7126
$$ plain form
50268 935283 925447 918330 914215 912897 913547 915520 918626 922597 926916 931309 935847 940371 944373 947777
50254 947777 951386 956137 962156 968916 976007 983317 990649 997672 1004218 1010238 1015453 1019434 1022023 1023397
50240 1023397 1023665 1022687 1020343 1016778 1012345 1007491 1002600 997747 992649 987188 981884 977520 974324 971874
50226 971874 969763 967956 966533 965565 965399 966550 969091 972574 976800 982266 989484 998226 1007919 1018638
50212 1018638 1031296 1046959 1066267 1089499 1116860 1148582 1184720 1224845 1268053 1313708 1362208
50201 1362208 1414630 1471247 1530776 1591407 1652156 1712658 1771890 1827891 1878875 1924036 1963046
50190 1963046 1995333 2020299 2038016 2049246 2054671 2054257 2047290 2032847 2010216 1979068 1939500 1892043
50178 1892043 1837654 1777637 1713620 1647593 1581884 1518783 1460006 1406440 1358353 1315745 1278619
50167A278619l1462k5611k0230j6519j5116j5261j5596j5641j5973j6918j7860
50156A072432j8039j7383j6121j4139j1368q424o231n025m248l445k775k553k673
50143I60008k791k843l111l760m608n417o252p242q045p955o723n012l658k746
50129H89845j740m20Q18J572J907K083K247K477K811L122L232L276L549L990M193
50114I22962M112M252M991O061O978P629Q123Q530R007R875J1224J2759J4301
50101A030804J6085J8224K0335K2122K3903K6135K8780L1757L5606M0928M7434
50090A342113N4244O1052O8171P5533Q2603Q9386R6515J03898J10156J14034J15769
50079B313474J16238J15308J11926J05702R7524Q8475P8928O8868N8493M7972
$$ plain form
50167 1278619 1247157 1221546 1201316 1184797 1169681 1154420 1138824 1123183 1107210 1090292 1072432
50156 1072432 1054393 1037010 1020889 1006750 995382 986958 980727 975702 971454 968009 965234 962681 960008
50143 960008 957217 954374 951263 947503 942895 937478 931226 923984 915939 907984 901261 896249 892591 889845
50129 889845 888105 887685 888503 890075 891982 894065 896312 898789 901600 904722 907954 911230 914779 918769 922962
50114 922962 927074 931326 936317 942378 949356 956985 965108 973638 982645 992520 1003744 1016503 1030804
50101 1030804 1046889 1065113 1085448 1107570 1131473 1157608 1186388 1218145 1253751 1294679 1342113
50090 1342113 1396357 1457409 1525580 1601113 1683716 1773102 1869617 1973515 2083671 2197705 2313474
50079 2313474 2429712 2545020 2656946 2762648 2860172 2948647 3027575 3096443 3154936 3202908
50069C202908L7007K5149J2352j227j5802l1785m8897o5934q1575r5074j05981
50058B831141j13680j17806j18952j18247j16104j11920j05319r7172q8958q1363
50048A761620p3952o6151n8072n0320m3442l7669l2941k9072k5932k3488k1534
50037A299047j9534j7036j4158j1416r121p289o074n691n852n765n038m131l677
50024A184265l733l997m285m381l887k864k235k776l975m611m396m112m153l995
50010A130865l447l372m465o072p011p016o522n544l727j353O66J875K611L310
49996A090798M142N318O898Q203Q317P337O374N984N438L993K112P25j26j225
49982A154288l081n562q171j0140j0508q907o087l091J3L978R140J4999K1013
$$ plain form
50069 3202908 3239915 3265064 3277416 3276189 3260387 3228602 3179705 3113771 3032196 2937122 2831141
50058 2831141 2717461 2599655 2480703 2362456 2246352 2134432 2029113 1931941 1842983 1761620
50048 1761620 1687668 1621517 1563445 1513125 1469683 1432014 1399073 1370001 1344069 1320581 1299047
50037 1299047 1279513 1262477 1248319 1236903 1227782 1220493 1214419 1208728 1202876 1197111 1192073 1187942 1184265
50024 1184265 1180532 1176535 1172250 1167869 1163982 1161118 1158883 1156107 1152132 1147521 1143125 1139013 1134860 1130865
50010 1130865 1127418 1124046 1119581 1113509 1106498 1099482 1092960 1087416 1083689 1082336 1083002 1084877 1087488 1090798
49996 1090798 1094940 1100258 1107156 1115359 1123676 1131013 1137387 1143371 1148809 1152802 1154914 1155639 1155513 1154288
49982 1154288 1151207 1145645 1137474 1127334 1116826 1107919 1101832 1098741 1098754 1102732 1111872 1126871 1147884
49969A147884K7088L3189L9068M4694N0424N6413O2147O6887P0376P2854P4510
49958A745534P5270P5058P3993P2070O8830O3722N6942M9595M2623L5796K8178
49947B387611J9427R954j51j1482k4324l8022n1743o5014p7052q6360r1987r4561
49935A876296r5286r4329r1267q6525q1233p5729o9527o2808n6720n1834m7310
49924A063728m2146l6456l1067k6476k2717j9692j7162j4791j2496j0422q441
49913H21862o089l265n09J571K859L695M670O333Q587J0495J1378J1921J3308
49900H86816J5466J7203J8114J8907J9643J9098J6609J3301J0547Q258N638K580
49888A052180p50m761r561j3975j6847j8792k1226k3971k5351k4639k2948k1441
$$ plain form
49969 1147884 1174972 1208161 1247229 1291923 1342347 1398760 1460907 1527794 1598170 1671024 1745534
49958 1745534 1820804 1895862 1969855 2041925 2110755 2174477 2231419 2281014 2323637 2359433 2387611
49947 2387611 2407038 2416992 2416841 2405359 2381035 2343013 2291270 2226256 2149204 2062844 1970857 1876296
49935 1876296 1781010 1686681 1595414 1508889 1427656 1351927 1282400 1219592 1162872 1111038 1063728
49924 1063728 1021582 985126 954059 927583 904866 885174 868012 853221 840725 830303 821862
49913 821862 815773 812508 811999 813570 816429 820124 824794 831127 839714 850209 861587 873508 886816
49900 886816 902282 919485 937599 956506 976149 995247 1011856 1025157 1035704 1043962 1049600 1052180
49888 1052180 1051430 1046669 1037108 1023133 1006286 987494 966268 942297 916946 892307 869359 847918
49876H47918j9949j7843j5274j2948j1331j0466j0088r558q270o354m555l278
49864G18004k212j006K90J669L482N945Q699J1179J3198J4947J6622J8161J9165
49851H28143J9194J8363J7390J6702J5740J3677J0628P456M528J519j526l892
49839I47922n337o741q995j1732j3792j4605j4649j4663j4755j4326j2726j0058
49827H05543p329n531m606l691k268o17R32K466M059N480O757Q445J0830J3265
$$ plain form
49876 847918 827969 810126 794852 781904 770573 760107 750019 740461 732191 725837 721282 718004
49864 718004 715792 714786 715076 716745 720227 726172 734871 746050 759248 774195 790817 808978 828143
49851 828143 847337 865700 883090 899792 915532 929209 939837 947293 951821 953340 951814 947922
49839 947922 942585 935844 926849 915117 901325 886720 872071 857408 842653 828327 815601 805543
49827 805543 798214 792683 788077 784386 782118 781501 782433 784899 788958 794438 801195 809640 820470 833735
$$ [...]
##END NTUPLES=NMR SPECTRUM
##END=
