
##TITLE=UV1227_M6_1234-1212_90_7231117_pYZuIHwrQY
##JCAMPDX= 6.0         $$ Bruker NMR JCAMP-DX V2.0
##DATA TYPE= NMR SPECTRUM
##DATA CLASS= NTUPLES
##ORIGIN= BRUKER
##OWNER= Administrator
$$ 1.72 TOPSPIN		Version 2.1
$$ 2013-01-23 23:56:53.183 -0500  Administrator@X
$$ Compression mode = diff/dup
##.OBSERVE FREQUENCY= 400.02188249412
##.OBSERVE NUCLEUS= ^1H
##.ACQUISITION MODE= SIMULTANEOUS (DQD)
##.ACQUISITION SCHEME= undefined
##.AVERAGES= 8
##.DIGITISER RES= 22
##SPECTROMETER/DATA SYSTEM= spect
##.PULSE SEQUENCE= zg30
##.SOLVENT NAME= COFFEE_meoh
##.SHIFT REFERENCE= INTERNAL, COFFEE_meoh, 1, 14.98509
##AUDIT TRAIL= $$ (NUMBER, WHEN, WHO, WHERE, PROCESS, VERSION, WHAT)
$$ ##TITLE= Audit trail, TOPSPIN		Version 2.1
$$ ##JCAMPDX= 5.01
$$ ##ORIGIN= Bruker BioSpin GmbH
$$ ##OWNER= Administrator
$$ $$ E:\/data/COFFEE/nmr/UV1227_M6_1234-1212_90_7231117_pYZuIHwrQY/30/pdata/1/auditp.txt
$$ ##AUDIT TRAIL=  $$ (NUMBER, WHEN, WHO, WHERE, PROCESS, VERSION, WHAT)
(   1,<2013-01-23 23:56:45.105 -0500>,<Administrator>,<X>,<go>,<TOPSPIN 2.1>,
      <created by zg
	started at 2013-01-23 23:55:38.495 -0500,
	POWCHK enabled, PULCHK disabled,
       configuration hash MD5:
       86 BA 57 50 F2 9D 5C 9B 26 00 A9 28 5F 66 2E 89
       data hash MD5: 64K
       99 90 02 E8 0C 95 E2 FE 98 53 11 CE FD C5 1E 99>)
(   2,<2013-01-23 23:56:48.136 -0500>,<Administrator>,<X>,<proc1d>,<TOPSPIN 2.1>,
      <Start of raw data processing
       efp LB = 0 FT_mod = 6 PKNL = 1 PHC0 = 0 PHC1 = 0 SI = 32K 
       data hash MD5: 32K
       3A B8 2A A2 FB A3 D8 81 C1 CA 72 B3 42 B0 D1 48>)
(   3,<2013-01-23 23:56:48.605 -0500>,<Administrator>,<X>,<proc1d>,<TOPSPIN 2.1>,
      <pk PHC0 = 100.5743 PHC1 = 0 
       data hash MD5: 32K
       FA 7C 81 55 0F 9D AD 30 53 C3 C9 50 E1 1E F4 25>)
(   4,<2013-01-23 23:56:48.839 -0500>,<Administrator>,<X>,<proc1d>,<TOPSPIN 2.1>,
      <abs ABSG = 1 
       data hash MD5: 32K
       87 A2 80 8E 76 40 BC 9C 43 23 68 A4 2E DC A8 D0>)
(   5,<2013-01-23 23:56:49.011 -0500>,<Administrator>,<X>,<proc1d>,<TOPSPIN 2.1>,
      <abs ABSG = 2 
       data hash MD5: 32K
       C6 89 8D E6 B7 3D 1E 7A BD 6C FA 88 04 7A CC 58>)
(   6,<2013-01-23 23:56:49.151 -0500>,<Administrator>,<X>,<proc1d>,<TOPSPIN 2.1>,
      <abs ABSG = 3 
       data hash MD5: 32K
       33 8A 9C 93 11 05 B3 FC 5D 81 5A 7D 03 4F 82 29>)
(   7,<2013-01-23 23:56:49.292 -0500>,<Administrator>,<X>,<proc1d>,<TOPSPIN 2.1>,
      <abs ABSG = 4 
       data hash MD5: 32K
       38 4F E0 4B 0B 8B C0 9D 4E 86 9C 80 0E 7A DA B4>)
(   8,<2013-01-23 23:56:49.448 -0500>,<Administrator>,<X>,<proc1d>,<TOPSPIN 2.1>,
      <abs ABSG = 5 
       data hash MD5: 32K
       49 F3 17 65 13 A6 75 45 2C 38 C6 2F 2D 4A 10 49>)
$$ ##END=
$$ 
$$ $$ hash MD5
$$ $$ A1 08 97 27 DA 22 48 E3 DA 16 A6 9B 6A 14 B2 6B
##$RELAX= 
##$RELAX= 
##$RELAX= 
##$RELAX= 
##$RELAX= 
##$RELAX= 
##$RELAX= 
$$ Bruker specific parameters
$$ --------------------------
##$DU= <E:\>
##$EXPNO= 30
$$ [...]
##$TP= (0..7)
150 150 150 150 150 150 150 150
##$TP07= 0
##$TPNAME0= <>
##$TPNAME1= <>
##$TPNAME2= <>
##$TPNAME3= <>
##$TPNAME4= <>
##$TPNAME5= <>
##$TPNAME6= <>
##$TPNAME7= <>
##$TPOAL= (0..7)
0.5 0.5 0.5 0.5 0.5 0.5 0.5 0.5
##$TPOFFS= (0..7)
0 0 0 0 0 0 0 0
##$TUNHIN= 0
##$TUNHOUT= 0
##$TUNXOUT= 0
##$USERA1= <user>
##$USERA2= <user>
##$USERA3= <user>
##$USERA4= <user>
##$USERA5= <user>
##$V9= 5
##$VALIST= <valist>
##$VCLIST= <CCCCCCCCCCCCCCC>
##$VD= 0
##$VDLIST= <DDDDDDDDDDDDDDD>
##$VPLIST= <PPPPPPPPPPPPPPP>
##$VTLIST= <TTTTTTTTTTTTTTT>
##$WBST= 1024
##$WBSW= 4
##$XGAIN= (0..3)
0 0 0 0
##$XL= 0
##$YL= 0
##$YMAX_a= 625791
##$YMIN_a= -534719
##$ZGOPTNS= <>
##$ZL1= 120
##$ZL2= 120
##$ZL3= 120
##$ZL4= 120
##$ABSF1= 14.98509
##$ABSF2= -5.573092
##$ABSG= 5
##$ABSL= 3
##$ALPHA= 0
##$AQORDER= 0
##$ASSFAC= 0
##$ASSFACI= 0
##$ASSFACX= 0
##$ASSWID= 0
##$AUNMP= <proc_prof1d_extract_pilot.lims>
##$AXLEFT= 0
##$AXNAME= <>
##$AXNUC= <1H>
##$AXRIGHT= 0
##$AXTYPE= 0
##$AXUNIT= <>
##$AZFE= 0.1
##$AZFW= 0.1
##$BCFW= 0
##$BC_mod= 0
##$BYTORDP= 0
##$COROFFS= 0
##$CY= 15
##$DATMOD= 1
##$DC= 0
##$DFILT= <>
##$DTYPP= 0
##$F1P= 0
##$F2P= 0
##$FCOR= 0.5
##$FTSIZE= 32768
##$FT_mod= 6
##$GAMMA= 0
##$GB= 0
##$INTBC= 1
##$INTSCL= 1
##$ISEN= 128
##$LB= 0
##$LEV0= 0
##$LPBIN= 0
##$MAXI= 10000
##$MC2= 0
##$MEAN= 0
##$ME_mod= 0
##$MI= 0
##$NCOEF= 0
##$NC_proc= -8
##$NLEV= 6
##$NOISF1= 0
##$NOISF2= 0
##$NSP= 0
##$NTH_PI= 0
##$NZP= 0
##$OFFSET= 14.98509
##$PC= 1
##$PHC0= 100.5743
##$PHC1= 0
##$PH_mod= 1
##$PKNL= yes
##$PPARMOD= 0
##$PPDIAG= 0
##$PPIPTYP= 0
##$PPMPNUM= 2147483647
##$PPRESOL= 1
##$PSCAL= 4
##$PSIGN= 0
##$PYNMP= <proc.py>
##$REVERSE= no
##$SF= 400.02
##$SI= 32768
##$SIGF1= 0
##$SIGF2= 0
##$SINO= 400
##$SIOLD= 32768
##$SPECTYP= <>
##$SREGLST= <1H.CDCl3>
##$SSB= 0
##$STSI= 32768
##$STSR= 0
##$SW_p= 8223.68421052631
##$SYMM= 0
##$S_DEV= 0
##$TDeff= 65536
##$TDoff= 0
##$TI= <>
##$TILT= no
##$TM1= 0
##$TM2= 0
##$TOPLEV= 0
##$USERP1= <user>
##$USERP2= <user>
##$USERP3= <user>
##$USERP4= <user>
##$USERP5= <user>
##$WDW= 1
##$XDIM= 32768
##$YMAX_p= 472562852
##$YMIN_p= -696649
##$CURPLOT= <Network HP LaserJet P1505>
##$CURPRIN= <$Network HP LaserJet P1505>
##$DFORMAT= <normdp>
##$LAYOUT= <+/1D_H.xwp>
##$LFORMAT= <normlp>
##$PFORMAT= <normpl>
##$SURQMSG= 1
$$ End of Bruker specific parameters
$$ ---------------------------------
##NTUPLES= NMR SPECTRUM
##VAR_NAME=  FREQUENCY,     SPECTRUM/REAL,   SPECTRUM/IMAG
##SYMBOL=    X,             R,               I
##VAR_TYPE=  INDEPENDENT,   DEPENDENT,       DEPENDENT
##VAR_FORM=  AFFN,          ASDF,            ASDF
##VAR_DIM=   32768,         32768,           32768
##UNITS=     HZ,            ARBITRARY UNITS, ARBITRARY UNITS
##FACTOR=    0.250966925370066, 1,           1
##FIRST=     8223.43324360094, -81899,       31792
##LAST=      0,             132841,          -68972
##MIN=       0,             -696649,         0
##MAX=       8223.43324360094, 472562852,    0
$$ Real data points
##PAGE= N=1
##DATA TABLE= (X++(R..R)), XYDATA
$$ [...]
19546b71588a4287k4952B18490a20793N0231F6331b21634o3767e1699j66669a07689
19534D98261a33309b9306k02375k6407C8010K17241a30144A00468@b44899j98239
19523d43138a45356A19140a61115e3511F9833e9015A96262c48713a56716E8687
19512B67778a26357H9488a12725Q064r3389A74160G6347c30074a05137A27437
19501A08814B6077E883J09448m7740k4116a16309A79744a14733j03435g1819j26741
19490a98560Q4719A98440a19566A2907a82097A08762b03420I0998a06980j77803
19480b84783A3298K91583b09230B19419J43248e3480p9222j696b9283i907k17824
19469b27731O1409C5158e1050D0916R119f6628F798M7000d5321o3224H8585a93935
$$ plain form
19546 -271588 -14287 -39239 218490 -120793 -70562 66331 -221634 -285401 -51699 -218368 -107689
19534 498261 -133309 -29306 -231681 -258088 38010 255251 -130144 100468 0 -244899 -443138
19523 -443138 -145356 119140 -161115 -53511 69833 -59015 196262 -348713 -156716 58687
19512 267778 -126357 89488 -112725 -104661 -198050 174160 76347 -330074 -105137 127437
19501 108814 26077 5883 115331 67591 43475 -116309 179744 -114733 -218168 -71819 -198560
19490 -198560 -113841 198440 -119566 12907 -182097 108762 -203420 90998 -106980 -284783
19480 -284783 13298 304881 -209230 219419 362667 -53480 -132702 -134398 -29283 -9907 -227731
19469 -227731 -166322 35158 -51050 40916 50035 -66628 6798 53798 -45321 -108545 88585 -193935
19456A30260c7826p4606j41897A87262b81281C20877f0093j2420A94014q3169
19446A10845b95403g5747I5520j7531n435M9402g4038G681a27645A86372H9467
19434a23232L39n3397l9847b3160H4115J0487d0708J4123l45622a9369j58071
19423a77440M1307H3318D45b54569J15726C22092n7731f0119k04635a8351o0916
19412g9267k12596J15052a9373B05362G5830d3924k37846A20521a98125A35865
19401b83214R3208M1455b7035j56565n7682H1294a02423j60253F3607L95725a34952
19389F5748c123r705E2055J17848C4351J77014D8526b966k27661H4471D1758o007
19377C5751a52428j36578g2505n09628A99824J03922l3869G3624b08073f1918
$$ plain form
19456 130260 -37826 -112432 -254329 187262 -281281 320877 -60093 -72513 194014 110845
19446 110845 -295403 -75747 95520 77989 72554 121956 -74038 7681 -127645 186372 89467
19434 -123232 -122893 -176290 -216137 -23160 84115 94602 -40708 -26585 -372207 -19369 -177440
19423 -177440 -136133 83318 445 -254569 -138843 322092 264361 -60119 -264754 -18351 -79267
19412 -79267 -291863 -176811 -19373 205362 75830 -43924 -281770 120521 -198125 135865
19401 -283214 -190006 -148551 -27035 -183600 -241282 81294 -102423 -262676 63607 459332 -134952
19389 65748 -3123 -12828 52055 169903 34351 211365 48526 -2966 -230627 84471 41758 35751
19377 35751 -152428 -289006 -72505 -582133 199824 303746 269877 73624 -208073 -61918
19366A67028b61327g2463B87491c48916J68429A5790i6909B74339j19418m560
19356A50361P1188d8882q3490M6371r2303E3009O750M6887C2069a6947j8990a2818
19343B17649F3107r519a2705k11749e5797A23066b0104C6518d229l01779G5845
19331h7291j59463d4071n14768D1304d4610n0379A42008a12037L6386k19810C9678
19319g7792A17130f3985c027m07255a55267A11894b53591c4450j5582k1578A25824
19307B55987f0599k32207i6952o8163j34676B30194d7749A59729a16364h924A67932
19295A48832a34508n3104f9011A86353c7677J7525j05326q78K6150E1588b69887
19283f1500j50240d8897B72132b30874N3029N3296j47310A42663c6592p3116J9408
$$ plain form
19366 167028 -261327 -72463 287491 -348916 -180487 15790 -96909 274339 154921 150361
19356 150361 221549 -48882 -132372 -86001 -178304 53009 59759 106646 32069 -16947 -35937 -12818
19343 217649 63107 53588 -12705 -224454 -55797 123066 -20104 36518 -4229 -306008 75845
19331 -87291 -246754 -44071 -558839 41304 -44610 -94989 142008 -112037 -75651 -295461 39678
19319 -77792 117130 -63985 -3027 -410282 -155267 111894 -253591 -34450 -50032 -71610 125824
19307 255987 -60599 -292806 -96952 -165115 -299791 230194 -47749 159729 -116364 -8924 167932
19295 148832 -134508 -187612 -69011 186353 -37677 -20152 -125478 -126356 -100206 51588 -269887
19283 -61500 -211740 -48897 272132 -230874 -177845 -124549 -271859 142663 -36592 -109708 -90300
19272i0300k51205I4931b72198a8885k01031c1569l2632I64J7971a8989D7972
19260A3612d01316B7587O3137p519d9951p4140e1699k04500O5208M1910A59142
19248A13968b02790J9897q7261R3242f2670q0379j81592c9619i596A27526q550
19237A18976J55687j9317a56059j2282O5994C2997J36868b14630k4315g0119B4377
19225h6620j81022C3515J23989G6481O7730h5520c1940k23205C83786a91887B13169
19213b0151C23089G846O6082a85536K9234l2071M5339C94226e4800K4009l15664
19202c46455e8559a1878m53928a30738j04516Q3578j36569a23287A63648a10239
19191d5534j5921n3014k92819C875c00388B70084j33083c7455j60699b1311k8637
$$ plain form
19272 -90300 -341505 94931 -272198 -18885 -219916 -31569 -64201 964 18935 -18989 47972
19260 13612 -401316 27587 90724 83205 -49951 -124091 -51699 -256199 -190991 -149081 159142
19248 113968 -202790 -182893 -270154 -176912 -62670 -143049 -324641 -39619 -9596 127526 118976
19237 118976 274663 255346 -156059 -168341 -102347 32997 169865 -214630 -238945 -70119 24377
19225 -86620 -267642 33515 157504 76481 144211 -85520 -31940 -255145 383786 -191887 213169
19213 -20151 323089 7846 73928 -185536 -156302 -188373 -143034 394226 -54800 -30791 -346455
19202 -346455 -58559 -11878 -465806 -130738 -235254 -151676 -288245 -123287 163648 -110239
19191 -45534 -61455 -114469 -407288 3875 -300388 270084 137001 -37455 -198154 -21311 -49948
19180d9948A99635b0174j8380D4170c04484j94069A60953G2130a81777e7225b1341
19168A88594d7056o9658k4720A25367k6157B5904b04057r9347A66334b80386N5741
19157b24645A49048A401c46330a55823D30443c49567I8265c10753K9023I9994
19146b74646E4128k2383a08171A1951N8028a2070H1096a4535C54203c71899g8207
19134f3476A056e1863A11352a95291l4754N9861B1774O7644c87559a74142h096
19122A22805a34491B10152a03273A24702f9718k46979H0375b79812b2771j04557
19112a27328b2915j2452I8392i3751k26429h1589o9219o4382A95798a98746f8311
19100c50018J36298g4766A3597P3482a49737j08800J08598a1550B42250F5458
$$ plain form
19180 -49948 199635 -20174 -38554 44170 -304484 -498553 160953 72130 -181777 -57225 -21341
19168 188594 -47056 -116714 -141434 125367 99210 25904 -204057 -303404 166334 -280386 -224645
19157 -224645 149048 1401 -346330 -155823 430443 -349567 98265 -310753 -281730 99994
19146 -274646 54128 31745 -108171 11951 69979 -12070 81096 -14535 354203 -371899 -78207
19134 -63476 1056 -51863 111352 -195291 -230045 -170184 21774 89418 -387559 -174142 -8096
19122 122805 -134491 210152 -103273 124702 -69718 -316697 80375 -279812 -22771 -127328
19112 -127328 -22915 -35367 98392 -93751 -320180 -81589 -150808 -215190 195798 -198746 -68311
19100 -350018 -213720 -74766 13597 87079 -149737 -258537 -149939 -11550 242250 65458
19089d63829E1069L24490j73677r5002d7832E500c22409D88340A75287a2622l41585
19078c54207a28083o4357H1906d3988A2817K00989m8250G1616K0131b36916B21566
19066a39523r3205Q0835A14857c10359a48288n1464A49821a19557c3132A79661
19055I9221M6939a54566h792A43238a85176n0031G9112a88472n6447i90k3134
19044b4124j41344L6723A7990p936c01308a10647G6633K35424c28321a12226F3922
19032c42259a61744B87090B8410b09777B85J08367c5074j5615H0321j4469g4224
19020c0231r4192k0634A13855b41799L8021K2282K0898j13248g9245b4719n8872
19009h3591a5065j17404M3455m2857p7968A02352c66106F9982h9094K8358j74453
$$ plain form
19089 -463829 51069 375559 201882 106880 -47832 5500 -322409 488340 175287 -12622 -354207
19078 -354207 -128083 -192440 81906 -43988 12817 213806 165556 71616 91747 -236916 221566
19066 -139523 -232728 -151893 114857 -310359 -148288 -199752 149821 -119557 -33132 179661
19055 99221 146160 -154566 -8792 143238 -185176 -235207 79112 -188472 -244919 -990 -24124
19044 -24124 -165468 -128745 17990 10054 -301308 -110647 76633 312057 -328321 -112226 63922
19032 -342259 -161744 287090 28410 -209777 285 108652 -35074 -50689 80321 65852 -74224
19020 -30231 -124423 -145057 113855 -241799 -203778 -181496 -160598 -273846 -79245 -24719 -83591
19009 -83591 -15065 -132469 -89014 -131871 -209839 102352 -366106 69982 -89094 -60736 -235189
18998b35189d753B32580E5814a86048k76951a73913e329j17380L648k34889a12902
18986d5316E0257N4645L4659N8653c1927G4345J23447b79244B33795a64583N9863
18975a04720q5902G8666L23255F9984b8626j91860I3473d7462j38142e6098k2394
18964g8492C76938H3962c19319a18335j01419A83580G3552a19902l7582f2438
18953A31071a05112j76303g2759r3116M4689H9908K05797j26071d14096M6638
18943c67458a08403K2368l3305D7450a06650F9393A2675d19798a14554A95886
18932f8469K4984m9202q0339n5343A33693J27972h1278B29040I0644L330a58398
18920C2600j510J96132F2325k0842Q810a3062j79736b8897n9342j64118J05605
$$ plain form
18998 -235189 -4753 232580 55814 -186048 -462999 -173913 -5329 -122709 -119061 -353950 -112902
18986 -45316 50257 104902 139561 198214 -31927 74345 197792 -279244 233795 -164583 -104720
18975 -104720 -190622 78666 401921 69984 -28626 -220486 93473 -47462 -185604 -56098 -78492
18964 -78492 376938 83962 -319319 -118335 -219754 183580 73552 -119902 -157484 -62438
18953 131071 -105112 -281415 -72759 -165875 -121186 89908 295705 169634 -414096 -367458
18943 -367458 -108403 -86035 -119340 47450 -106650 69393 12675 -419798 -114554 195886
18932 -68469 -43485 -92687 -173026 -228369 133693 261665 -81278 229040 90644 93974 -158398
18920 32600 31090 227222 62325 41483 50293 -13062 -192798 -28897 -88239 -252357 -146752
18909a46752A24524a64158j3310N6083H8408J96912m952C252L4985J06877d1029
18897b893A78531b22594B56544p4863m7908a49542d3127j81702R7643B09296a64830
18885b30080G7926i1548P858A4935Q132j0224R1809a9465j30004k91185A532b20868
18872b39283c1910m550j98796k02628a27679c7689A09293c26721B7570i3277J3478
18861g9799k96990C203K9190K8192c94914H8257a53841e280l2606B3008b15774
18849I6990a26701A83541a80819c9131C89586a84795J3613k8803O4584j1050L8765
18838a07686J0976j89382J04928B38830A06066c3686c530k38758d1678B24989
18827B3532c3312k1911j04410R29P6819g281q3835q6380A33520Q3083Q7795A00253
$$ plain form
18909 -146752 124524 -164158 -177468 -121385 88408 285320 280368 3252 38237 145114 -41029
18897 -2893 178531 -222594 256544 181681 133773 -149542 -43127 -224829 -127186 209296 -164830
18885 -230080 77926 -91548 -83690 14935 23067 12843 104652 -19465 -149469 -440654 1532 -220868
18872 -239283 -31910 -36460 -235256 -437884 -127679 -37689 109293 -326721 27570 -93277 -79799
18861 -79799 -376789 3203 32393 60585 -394914 88257 -153841 -5280 -37886 23008 -215774
18849 96990 -126701 183541 -180819 -39131 389586 -184795 -171182 -199985 -135401 -146451 -107686
18838 -107686 -96710 -286092 -181164 238830 106066 -33686 -3530 -242288 -41678 224989
18827 23532 -33312 -55223 -159633 -158704 -81885 -7281 -91116 -177496 133520 216603 304398 100253
18814b08260k830C7816J03836b36172p3604r1061C03363b11903A46128e8982m9191
18803a08173A79710c328H5114a38430D8732N0856d3526l3518D538c2032B61217
18791a00980n6188C07978a97745C8598J8704d12629c2650C499d0071j17660j90189
18780c47920J52446B9802a25029B35151H4532a26542F5998a90744n4373C19049
18769F6768J65393a75630A97463D157c02456C18988b77667e7024j17906A3256
18758C25844a51801b3153j30132f7808c442j98198D2733e4514J2662B2301J08524
18747A30825E057K79081A01571b07393J00003A10402L9948H19b10384A72896h7501
18735g4161H3421l9950a96173i3533B57095g706F904i9641B85172d35382A18198
$$ plain form
18814 -208260 -211090 37816 141652 -236172 -309776 -400837 303363 -211903 146128 -58982 -108173
18803 -108173 179710 -3328 85114 -138430 48732 99588 -43526 -77044 4538 -32032 261217
18791 -100980 -157168 307978 -197745 38598 57302 -412629 -32650 3499 -40071 -157731 -347920
18780 -347920 -195474 29802 -125029 235151 84532 -126542 65998 -190744 -245117 319049
18769 66768 232161 -175630 197463 4157 -302456 318988 -277667 -57024 -174930 13256
18758 325844 -151801 -23153 -153285 -67808 -3442 -201640 42733 -54514 -41852 22301 130825
18747 130825 5057 284138 101571 -207393 -107390 110402 150350 819 -210384 172896 -87501
18735 -74161 83421 43471 -196173 -93533 257095 -7706 6904 -99641 285172 -435382 118198
18723A78460c76463L388e3887E5516j7893a30873N9597j92561l3976m6276r966
18712c54055A61168a65036k8759A93001a09781p3818G7648C6703b4824l3856j58022
18701b16702P485j84492a64523c2090E0750b7568m5922b4368N429D5852L09730
18690C55582A74692f4293B53030a63539m4861A09951M6133E5936a04254C6850
18679B1333c18497M6856A27443a51607e0148A31243P3612a88406c3536j73603
18669b07139K5085B71614a51818n6187l8242d6472j8081j96138f0216k55101a16962
18657F993a65550k89257b8560A73463J95911a78484C77315a78017F1063J11741
18647A72804k520i4696B92153l4248I4590a93579A11185K70371a07674B74448
$$ plain form
18723 178460 -376463 -373075 -53887 55516 37623 -130873 -71276 -263837 -297813 -344089 -354055
18712 -354055 161168 -165036 -193795 193001 -109781 -183599 77648 36703 -24824 -58680 -216702
18701 -216702 -209217 -393709 -164523 -32090 50750 -27568 -73490 -24368 -18939 45852 355582
18690 355582 174692 -64293 253030 -163539 -208400 109951 156084 55936 -104254 36850
18679 21333 -318497 -271641 127443 -151607 -50148 131243 204855 -188406 -33536 -207139
18669 -207139 -182054 271614 -151818 -208005 -246247 -46472 -64553 -260691 -60216 -315317 -116962
18657 6993 -165550 -454807 -28560 173463 369374 -178484 377315 -178017 61063 172804
18647 172804 170284 -94696 292153 257905 94590 -193579 111185 381556 -107674 274448
18636a74249e4406j48836d632B27320a11204A00741m9091R9526g6527F2782a35956
18624b63146L6286A53718i1408q6866c1546C76741b74645C8316a49060B5671a19971
18612a67386B23572a33441k49010O6269J03654H6096A162d47002a53684q5773
18602b39457N326N4226N9400n7494g1580n2473b7767J0698C65165F9990a62480
18590c40525A44257E1264B221a79193K2010j47311c1964r4768I80M4898d23618
18578a99005J0433D1147J64027a57841B06251R5812f906C34228g2258k1329o5561
18567a59148A13401a90772P9409k9391J3245N2732A42357b3795k75364a19334
18556i2090B33094a36776J2510a3675k71487O0873a1311l94464J70847d8781B1032
$$ plain form
18636 -174249 -54406 -203242 -4632 227320 -111204 100741 51650 151176 -76527 62782 -135956
18624 -263146 -226860 153718 -91408 -178274 -31546 376741 -274645 38316 -149060 25671 -119971
18612 -167386 223572 -133441 -382451 -316182 -212528 86096 1162 -447002 -153684 -239457
18602 -239457 -234131 -179905 -120505 -177999 -71580 -124053 -27767 -17069 365165 69990 -162480
18590 -340525 144257 51264 2221 -179193 -157183 -304494 -31964 -126732 980 45878 -423618
18578 -199005 -188572 41147 205174 -157841 206251 302063 -6906 334228 -72258 -93587 -159148
18567 -159148 113401 -190772 -111363 -140754 -127509 -74777 142357 -23795 -299159 -119334
18556 -92090 233094 -136776 -124266 -13675 -285162 -224289 -11311 -405775 -234928 -48781 21032
18544a07559B10482c33448f3733I1326B2387d64661a03787A4624b94097E4695
18533A19576a26837D3388J29472D7531R2014o4769c11055B08459d74712J33082
18523c41630F4628d01708a33323B24816a63380H659a63909j18766j4201A8766
18512A85484a83721H2082c89794H2730R1796N1578b53399P202h5248A12493i129
18500I4594p481Q9244a97871J270H4607f2215N609J1015j71566Q9611F3773A0629
18487f4587j59392B33011e0234B27766c93951J71382C45218a20240E6986a22247
18476E7538b50726j04211c7458C5717b08265K5823K9848N6184A08522R060a69356
18464f5284K8733n0202j82524B44665D8726b75404D6534J55041E9075k1686a3639
$$ plain form
18544 -107559 210482 -333448 -63733 91326 22387 -464661 -103787 14624 -294097 54695
18533 119576 -126837 43388 172860 47531 139545 74776 -311055 208459 -474712 -341630
18523 -341630 64628 -401708 -133323 224816 -163380 8659 -163909 -282675 -296876 18766
18512 185484 -183721 82082 -389794 82730 174526 226104 -253399 -246197 -85248 112493 -9129
18500 94594 87113 176357 -197871 -196601 84607 -62215 -56606 -45591 -217157 -127546 63773 10629
18487 -64587 -223979 233011 -50234 227766 -393951 -222569 345218 -120240 56986 -122247
18476 57538 -250726 -354937 -37458 35717 -208265 -182442 -152594 -96410 108522 117582 -169356
18464 -65284 -36551 -86753 -269277 244665 48726 -275404 46534 201575 59075 37389 -13639
18452I7742B0366b9818C9291i7264C69527b72128h9596n4683J4925f1932A11501
18440B2177L23794a6986q0343M5530A80797P594b55124e0356p9955k26039J24094
18429b32256P0233q8239h2222j41312A34769F1696a50534m8789N8728o3642A41407
18417F4613a27639F7892A600J59791b09512q222j69651a93080g7030F8424j2224
18406E6200J3899A1775e7116j83171G1503a74846l6911A45751a48260a0824j46736
18395a57560C099a54886m0019g112B55503c29757R2159A99346m6111d8715C4302
18383a81062b3943C7086b8274A27026c22750R2757k33368g6205j46245L1973B25367
18371h0487N359K1623l8275A48629a01004B728b10615C489J11963g9098n5118
$$ plain form
18452 97742 20366 -29818 39291 -97264 369527 -272128 -89596 -144279 -129354 -61932 111501
18440 22177 345971 -16986 -97329 -51799 180797 188391 -255124 -50356 -130311 -356350 -232256
18429 -232256 -162023 -250262 -82222 -223534 134769 61696 -150534 -199323 -140595 -204237 141407
18417 64613 -127639 67892 1600 161391 -209512 -217734 -387385 -193080 -77030 68424 56200
18406 56200 70099 11775 -57116 -240287 71503 -174846 -211757 145751 -148260 -10824 -157560
18395 -157560 3099 -154886 -194905 -7112 255503 -329757 -237598 199346 153235 -48715 34302
18383 -181062 -23943 37086 -28274 127026 -322750 -229993 -463361 -76205 -222450 -190477 225367
18371 -80487 -75128 -53505 -91780 148629 -101004 2728 -210615 3489 115452 -79098 -134216
18360a34216B467b5023B28384a3607n960D5236d6437j71592K6728n1647b5166
18348d0952l6587j5628L7633a4810A09708a51696A20594i3942A19847g4575I30
18336G2376B8976b7514j46209A14609a2140E8160c21649A11111b68940b2674l3406
18325e6080l61969B92379B9095a56145b513A56339b50824J11564B45862b51635
18314d25978B26783c1622q4687A92431a2869C63604b87043C0094o230R8145a38190
18302F1228a86895b7088m2812F7686K8478a70101L5332l3102B68498a32622A95991
18290b42858G1641j3658a79079A81307M0574e6397B24776r4115n3721N7945A0840
18278b24023A07496K7549a70409n386c5115q0769n2232j09458A42738a62437A80137
$$ plain form
18360 -134216 2467 -25023 228384 -13607 -19567 45236 -46437 -218029 -191301 -242948 -25166
18348 -40952 -77539 -93167 -55534 -14810 109708 -151696 120594 -93942 119847 -74575 930
18336 72376 28976 -27514 -173723 114609 -12140 58160 -321649 111111 -268940 -22674 -56080
18325 -56080 -418049 292379 29095 -156145 -2513 156339 -250824 -139260 245862 -251635
18314 -425978 226783 -31622 -116309 192431 -12869 363604 -287043 30094 23864 122009 -138190
18302 61228 -186895 -27088 -69900 67686 96164 -170101 -134769 -167871 268498 -132622 195991
18290 -242858 71641 57983 -179079 181307 221881 -56397 224776 130661 76940 134885 10840
18278 -224023 107496 135045 -170409 -175795 -35115 -115884 -168116 -277574 142738 -162437 180137
18266a92675H4638M1575a53452F8138P829a71188G4534f3319o5748q2632c3184
18254a74963K7147b8596D799a51940P2897F0672n132M0030J0787O5047A3917a19743
18241A56903F6499g9133p4396p2563A79374d44789a04137j33417A34318D7380
18230a30329E2034f3025l45901G3504a13962r6578B00639c3038A09611c20423
18219B2968Q6249k948B2186o585b61075O864B4236f5042j53785K1832d3866A95574
18206A80123D4756c2104k09932a13826m11687i5067b9150I4142f1874k15308J18926
18195a58256a6576l4489A34479b06078C35126H0845K50493c8627d232C4652J35268
18184A69920n0606J62706j20463O469G4136e4940q8407r690H130K1337R7593K2241
$$ plain form
18266 -192675 84638 126213 -153452 68138 75967 -171188 74534 -63319 -129067 -211699 -33184
18254 -174963 -147816 -28596 4799 -151940 -79043 60672 55540 95570 106357 171404 13917 -119743
18241 156903 66499 -79133 -153529 -226092 179374 -444789 -104137 -237554 134318 47380
18230 -130329 52034 -63025 -408926 73504 -113962 -210540 200639 -33038 109611 -320423
18219 22968 109217 106269 22186 15601 -261075 -254211 24236 -65042 -218827 -196995 -43866 195574
18206 180123 44756 -32104 -242036 -113826 -525513 -95067 -29150 94142 -61874 -277182 -158256
18195 -158256 -16576 -51065 134479 -206078 335126 80845 331338 -38627 -4232 34652 169920
18184 169920 119314 282020 161557 168026 74136 -54940 -143347 -153037 8130 29467 127060 149301
18172A49301a96276g5392B99402J9107j51835b57317P5365K0498g6060A07470
18161d17660f3968A17756M1004a36060A31637b0890q0490n6441C16338a47012
18150a48598A91319A3802a95514Q6228j34865A32051b06954A51967p2017a30218
18139A39847P6168a28877c1599j13343C46724B9046h5662A88126F4440J54361
18129B18801h2740j48647A10263J5892c07621I1383a17333j15843A26806c12803
18118b0189j04703k29489a02822D7879J5158J0388j7823A230a39552A42232A0756
18106C10994j54798O161h3881A63674C6518b59656A73461a97491B33939A674Q8438
18095I0112b40267G4812b29709r6624B36546E5274e7017p5711G8939K9455a04658
$$ plain form
18172 149301 -196276 -75392 299402 318509 166674 -257317 -181952 -161454 -76060 107470
18161 -417660 -63968 117756 158760 -136060 131637 -20890 -101380 -157821 316338 -147012
18150 -148598 191319 13802 -195514 -109286 -244151 132051 -206954 151967 79950 -130218
18139 139847 216015 -128877 -31599 -144942 346724 29046 -85662 188126 64440 218801
18129 218801 -82740 -231387 110263 126155 -307621 91383 -117333 -233176 126806 -312803
18118 -20189 -124892 -354381 -102822 47879 63037 73425 55602 1230 -139552 142232 10756
18106 310994 156196 162357 -83881 163674 36518 -259656 173461 -197491 233939 1674 90112
18095 90112 -240267 74812 -229709 -326333 236546 55274 -57017 -132728 78939 108394 -104658
18083B61783A08468e3611j5930B14591e4003F4790j447a58950r2109C6213a85319
18071e3989G3186K1395N5449d1298A86242i987k61247A48420E3273a43853A80310
18059A50822F74J18203b93955D2990P9472a66773m08770B22814H1048J45649H3879
18047c7636I8463c0976E8359f4699j19204N4562l325C4058a02236p0576m2070
18036b14882g3627l67090D154a63920j00911C3197j4562a75124a4187k97549B1737
18024f3608a7037B5585a74244a888n3426k46139a40569C264a84195d7554j82278
18013b29832a1962l6943j74797g7826J4912H0695c0655B71037j24864H679a59455
18001C40993A67544b32509J00139n0257F784J16243l9697b00503H337K8726K62351
$$ plain form
18083 261783 108468 -53611 -69541 214591 -54003 64790 63343 -158950 -251059 36213 -185319
18071 -53989 73186 94581 150030 -41298 186242 -9987 -271234 148420 53273 -143853 180310
18059 150822 674 118877 -293955 42990 122462 -166773 -575543 222814 81048 226697 83879
18047 -37636 98463 -30976 58359 -64699 -183903 -129341 -132666 34058 -102236 -172812 -214882
18036 -214882 -73627 -440717 4154 -163920 -264831 33197 18635 -175124 -14187 -311736 21737
18024 -63608 -17037 25585 -174244 -1888 -55314 -301453 -140569 3264 -184195 -47554 -229832
18013 -229832 -11962 -48905 -223702 -77826 -62914 80695 -30655 271037 146173 8679 -159455
18001 340993 167544 -232509 -132370 -182627 6784 123027 83330 -200503 8337 37063 299414
17990B99414c11348F5443b08638G2192a08711M637p9201E8116a03702M7539A56973
17978C37322c2560k0780j21164f5538G4951b17121P4706r117B9221J86397j1650
17967B03968b28599P4599J9914f6509j98665B05811H872R5065q661K8539c61382
17955a25815A72384E4368f8184B96493A44507a81214I6341c2598F5681M1380a6012
17943b7356A05483b7425q0503j74733c5403B58054F2970f9960j17879b7192f918
17931a0974j22951d1334H6390a95822D8401J50307D9203O3946a08692k11027B65140
17919A93005a21626k04499p2027a80654O9697j02897E5113M48302a23954j38744
17909b62698e4090n2849k1090e2984B33491q5629P0368c1840j21605f8760k06531
$$ plain form
17990 299414 -311348 65443 -208638 72192 -108711 -104074 -183275 58116 -103702 -56163 156973
17978 337322 -32560 -53340 -174504 -65538 74951 -217121 -142415 -151532 29221 215618 203968
17967 203968 -228599 -154000 -134086 -66509 -265174 205811 8872 103937 95276 123815 -361382
17955 -125815 172384 54368 -68184 296493 144507 -181214 96341 -32598 65681 107061 -16012
17943 -27356 105483 -27425 -107928 -282661 -35403 258054 62970 -69960 -187839 -27192 -6918
17931 -10974 -133925 -41334 86390 -195822 48401 198708 49203 113149 -108692 -319719 265140
17919 193005 -121626 -326125 -398152 -180654 -110957 -213854 55113 503415 -123954 -262698
17909 -262698 -54090 -106939 -128029 -52984 233491 147862 218230 -31840 -153445 -68760 -275291
17898b75291A30869R5624A3605J06998h0955m93510d6819q113j25263D4284e1989
17886C24571E4979a52288f1104B5408b94817B2180b02646A99781P9906C5033c2644
17874b7214k24451d9530A9433K9509j1175L57514j44081a5959G3279e74140a80852
17862c1758l7570E7321c2966A264K27841b45335H5517m917c21435K9998a20939
17850I8L75592E7314b47657E22979a30243K5435h238j6443A48133c0862r6306
17839a27168j8230A74068K6565a12176l30405J66150B391a12885j10286J11159
17829a12012F20155a16283j20448J09109D19748d9374k01521E0767a91237C11866
17818d01231A48074D4340b68189A59055L770a28217A72642q4355l8438J3697b06648
$$ plain form
17898 -275291 130869 226493 13605 120603 -80955 -574465 -46819 -54932 -180195 44284 -51989
17886 324571 54979 -152288 -61104 25408 -294817 22180 -202646 199781 279687 35033 -32644
17874 -27214 -251665 -49530 19433 48942 37767 395281 251200 -15959 73279 -574140 -180852
17862 -31758 -69328 57321 -32966 1264 229105 -245335 85517 80600 -321435 -291437 -120939
17850 98 375690 57314 -247657 522979 -130243 -104808 -8238 -24681 148133 -30862 -127168
17839 -127168 -145398 174068 200633 -112176 -442581 -276431 2391 -112885 -223171 -112012
17829 -112012 620155 -116283 -236731 -127622 419748 -49374 -250895 50767 -191237 311866
17818 -401231 148074 44340 -268189 159055 162825 -128217 172642 88287 49849 63546 -206648
17806d5764A25247N7083b24110B15279J5604a52318r8089D01529a29486b2155
17795D2409P0333a15212e0322l56095A21091m3984a75032N3714C26497H7046c18640
17783C71394c7838A52746J15500q7596D8097c25594d3139p9245D3408a78795e5858
17771B43105b5751m3364a0263C3917i7457C45031A00909f6248F3391a09105A63219
17759b9562K615p7629D8983a00909A9257f2285A97548j8676o2848c0708G3951
17747C57259e0935n1485k7283L1025B42234i5423D07421c62032I1170a3540p259
17736b0799A27647B2127L65231j52704a40143B0272a40674l9328j50932C9123
17725g0027A84092g8751E2973a39141r2265h1556B65450F7172K02849a9545r0075
$$ plain form
17806 -45764 125247 182330 -224110 215279 230883 -152318 -250407 401529 -129486 -22155
17795 42409 112742 -115212 -50322 -406417 121091 77107 -175032 -121318 326497 87046 -318640
17783 371394 -37838 152746 268246 180650 48097 -325594 -43139 -122384 43408 -178795 -55858
17771 243105 -25751 -69115 -10263 33917 -97457 345031 100909 -66248 63391 -109105 163219
17759 -29562 -26947 -104576 48983 -100909 19257 -62285 197548 178872 116024 -30708 73951
17747 357259 -50935 -102420 -129703 -98678 242234 -95423 407421 -362032 91170 -13540 -20799
17736 -20799 127647 22127 387358 234654 -140143 20272 -140674 -180002 -330934 39123
17725 -70027 184092 -78751 52973 -139141 -231406 -81556 265450 67172 270021 -19545 -109620
17714a09620k3534A67469C7285J08830N1952r6955b17329F3282c61534d3372B57480
17702B35704j3890q3572M180J27541b3823B41039A02906a56853d9473k23128A02257
17690f5543q0607j39721d3165j77786j3794C80972A62889K50973c14824B47244
17679d9924D59802I9064b48279A27963e3660H7682i4020B02625J49926i3265H292
17667A58930a74991l9256C2967J33122g1532A17269M5949K73040d9071B38865
17656C9234b78374g6505E840i0198c1226k09335N3526c8379n4559H7272a4051
17644B58811A7078J49965b30151B27869c5153k15780K1458B2421O1344g3161r6501
17633a69662p1894I2344g9310c5615n6442g170B73399A9377K04186n7467h6270
$$ plain form
17714 -109620 -133154 167469 37285 146115 198067 101112 -217329 63282 -361534 -43372 257480
17702 235704 221814 138242 142422 269963 -23823 241039 102906 -156853 -49473 -272601 102257
17690 -65543 -146150 -285871 -43165 -220951 -234745 380972 162889 413862 -314824 247244
17679 -49924 459802 99064 -248279 127963 -53660 87682 -94020 202625 352551 -93265 8292
17667 158930 -174991 -214247 32967 166089 -71532 117269 163218 436258 -49071 238865
17656 39234 -278374 -76505 5840 -90198 -31226 -240561 -187035 -38379 -92938 87272 -14051
17644 258811 17078 167043 -230151 227869 -35153 -250933 -229475 22421 83765 -73161 -169662
17633 -169662 -241556 92344 -79310 -35615 -92057 -7170 273399 19377 223563 166096 -86270
17621c03547J27492C42299a41205k06024a49743G4351f0100A07399b39772i7222
17610b193o5797A52562E8222k7173N9844b3941n7977F2506a38695A41522a29263
17598a4576m7353A21974D2519J46847N5128a2156B32730D6463h8064A03633h6151
17586F1401a75180f2558k4022A56872a1590l11491h6692c0470C13462I9832K54902
17575C54734J34384g1705G3867M45761a33620A29946K4269d7975B16714I4155
17564a91229A21402h2834A35157J39704i7067L5422E8980K40729j02610o7965
17554A29134B7805g5139I608J79421G5072B5381l389h9045A60468D8495K8870
17543G7365O6484C8161a63693n7842q123b987A94742a66991L5464B17136M4064
$$ plain form
17621 -303547 -176055 342299 -141205 -347229 -149743 74351 -60100 107399 -239772 -97222
17610 -2193 -67990 152562 58222 31049 90893 -23941 -81918 62506 -138695 141522 -129263
17598 -14576 -61929 121974 42519 189366 244494 -12156 232730 46463 -88064 103633 -86151
17586 61401 -175180 -62558 -86580 156872 -11590 -323081 -86692 -30470 313462 99832 354734
17575 354734 489118 -71705 73867 519628 -133620 129946 154215 -47975 216714 94155
17564 -191229 121402 -82834 135157 274861 -97067 -61645 58980 299709 197099 129134
17554 129134 27805 -75139 9608 189029 75072 25381 21992 -89045 160468 48495 77365
17543 77365 143849 38161 -163693 -221535 -229658 -2987 194742 -166991 -131527 217136 261200
17532B61200a0750A46053m8556R2209a91265b9193A76101a83734A34926E7186
17521C4481a17369a2921j83328f9802k3212A92921H6364Q5022J34018j20198f1300
17509a85672f4601a2443A96437A1210J81359P2961j30898J43360b99711A64153
17498A55176N2178i9464D1653J43300M5945I7197a95892H452K70504c7464C38196
17486A04321a08440C68424A36290m5487K74546C8524J4308K85853h1744A78120
17475b25864D8609L35396C9020K87899g9941D45319f5101A07620B9942b2066k5466
17464d7532C21332C3935J04951K79671A65085o0580B3843b5166B50345G2910d8884
17452B35966A14002O9343I066M4934M0743M56365A09643J29521B8260F309O3843
$$ plain form
17532 261200 -10750 146053 97497 189706 -191265 -29193 176101 -183734 134926 57186
17521 34481 -117369 -12921 -196249 -69802 -93014 192921 86364 171386 305404 185206 -61300
17509 -185672 -64601 -12443 196437 11210 192569 265530 134632 277992 -299711 164153
17498 155176 207354 -99464 41653 184953 230898 97197 -195892 8452 278956 -37464 338196
17486 104321 -108440 368424 136290 90803 365349 38524 52832 338685 -81744 178120
17475 -225864 48609 384005 39020 326919 -79941 445319 -65101 107620 29942 -22066 -47532
17464 -47532 321332 33935 138886 418557 165085 104505 23843 -25166 250345 72910 -48884
17452 235966 114002 183345 9066 54000 94743 551108 109643 239164 28260 6309 70152
17441G0152J95558N8967k0227j12906D9233K37889J17827j8100j14182D1341K53849
17430B95190j01595G7831J80070J23925A31089P4549R7688o9544K13058C6568
17419B33385J54077F0218L52760A92294L9704L20247E4345J50772K68003p1874
17409D01246A00720K07100D6990M6328b93476J43531C82584j34088j8541r1986
17399A37969c62404a16560A63647f1876b0179E0658J52409e5823A41667M5732
17389A87399n0588k1984k8936O8631a26B2855K9129k2114K22988M9011a10989
17377A93483G5079J96079j27543A8972L72736E7644K56256j0625A2665K41071
17367B53736m9448j30n4655h334A50838J412J90508j3682l3466e683l66B8044
$$ plain form
17441 70152 265710 324677 304450 191544 49233 287122 404949 386849 272667 41341 295190
17430 295190 193595 77831 257901 381826 131089 205638 303326 233782 446840 36568
17419 233385 387462 60218 412978 192294 231998 552245 54345 205117 473120 401246
17409 401246 100720 307820 46990 93318 -293476 -149945 382584 248496 229955 137969
17399 137969 -362404 -116560 163647 -61876 -20179 50658 203067 -55823 141667 187399
17389 187399 136811 114827 85891 154522 -126 22855 51984 29870 252858 301869 -110989
17377 193483 75079 271158 143615 18972 391708 57644 313900 303275 12665 253736
17367 253736 204288 204158 149503 -8334 150838 152250 342758 329076 295610 -5683 -6049 28044
17354C0402d3321C53148j63710D492J98200J93871A41631d7258A02293N0301j9610
17343A32984b9867B84476F3293b12492A95728O0685l3845P8055a18008D4872O0610
17332A05482K78145A60316K26741A46318J3336A4167J43216a00974Q885C670K27095
17321B30765n680a4469B60215b37386B21771M3225A29360a68050A14178N7156
17311A71334K4360b27275e9578J6954D64643l1736j58975A28267a37637A9190
17300C76003j12049k1084p5779B3492L08902p6426L6833a8232h384C64268J1696
17289C75964a8065B39227j07128K2013J1068p5905b39238b375A74664J8966C9853
17277C30827C8925a6008A15134K02632m7887n7336L0513L210r8164M7686o1183
$$ plain form
17354 30402 -43321 353148 189438 4492 202692 396563 141631 -47258 102293 152594 132984
17343 132984 -29867 284476 63293 -212492 195728 256413 222568 300623 -118008 44872 105482
17332 105482 383627 160316 387057 146318 159654 14167 157383 -100974 -92089 3670 230765
17321 230765 225085 -14469 260215 -237386 221771 264996 129360 -168050 114178 171334
17311 171334 195694 -227275 -59578 -42624 464643 432907 273932 128267 -137637 19190
17300 376003 263954 242870 167091 23492 332394 255968 292801 -18232 -8384 364268 375964
17289 375964 -18065 239227 132099 154112 165180 89275 -239238 -2375 174664 193630 39853
17277 330827 38925 -16008 115134 317766 269879 212543 243056 246266 148102 195788 134605
17266A34605c7380A48764l1798R191J77521A23631C8266K39816J61338A48789
17255A437L30453f7238A03184i6897B68302j34108J46256Q6487j29700A5218a21422
17243A09585a37177A32046n3525e10085A95873a05975B27745E0240K66004L2475
17233C48719F2055L39171d341B85492Q3829q7107A26576E1287L10848a79622C62484
17221B76123B2799a37065F53970C12333E8822M1972j2885B3770J68144J8405F4911
17209a02661e157C21357N7144j65492M7749B5170O1296A6281J10648K9057b9219
17197C28886L6096L3899F9193J1929j5239K21576a28235B33593a22489C48418
17186f0311E58914A1097L73131A63954l6985b606H4321K12071L1456K94904B49433
$$ plain form
17266 134605 -37380 148764 116966 126157 303678 123631 38266 278082 439420 148789
17255 1437 331890 -67238 103184 -96897 268302 134194 280450 366937 237237 15218 -121422
17243 109585 -137177 132046 78521 -510085 195873 -105975 227745 50240 316244 348719
17233 348719 62055 401226 -4341 285492 369321 282214 126576 51287 362135 -179622 362484
17221 276123 22799 -137065 653970 312333 58822 100794 87909 23770 191914 210319 64911
17209 -102661 -5157 321357 378501 213009 260758 25170 86466 16281 126929 155986 -29219
17197 328886 364982 398881 69193 81122 65883 287459 -128235 233593 -122489 348418
17186 -60311 558914 11097 384228 163954 126969 -2606 84321 296392 327848 622752 249433
17174f730B08470A02950M57860H6540K1280P9838P5207n2650J43632k4931J89759
17163E18675H6920J00503J4887J99389R7513k33304J52360H9682M37741j60042
17153C67381D7464O7526L29122F5963K76580c89608C83145A85802K50421k12921
17143B23302c6405D23345L1107l4479A23215h7049B80764A32535n2938Q3520L31772
17132D94889F9867a21425D05643Q536J31766j09228k4429A98970R4648h7260A20321
17120C14042K24278A80654K26617J30973p2066B22123B8312N87991B48014J90423
17110D38437p0213A03821N01690A68620N46756k34538j52855P5672A47240J88936
17100C36176j52534K67474l908A03504J05761K94921k02873K94232j04745A42717
$$ plain form
17174 -6730 208470 102950 560810 86540 107820 187658 262865 210215 353847 328916 518675
17163 518675 86920 187423 202310 401699 499212 265908 418268 89682 527423 367381
17153 367381 47464 114990 444112 65963 342543 -389608 383145 185802 436223 223302
17143 223302 -36405 423345 454452 419973 123215 -87049 280764 132535 79597 163117 494889
17132 494889 69867 -121425 405643 414179 545945 436717 412288 198970 293618 -87260 120321
17120 314042 538320 180654 407271 538244 466178 222123 28312 616303 248014 438437
17110 438437 368224 103821 605511 168620 715376 480838 327983 403655 147240 336176
17100 336176 183642 451116 447208 103504 209265 504186 301313 595545 490800 142717
17089D18215K8540B11375K95442K7066k17768C0780J10596G0029L05059j6517
17079C58571A77241K17727J48828m3810m4626p0252J3237J4843K54803k03972
17069D64019m1650J38754j91400A10077N45759k0445B65847M47952A94751K89692
17059D84443L03628j91898j30860r9935n3530L07997k7988N4960m2695B12383
17048B65874K64489j53623J46452O4773J60108k53143K12923k06573k17594K12472
17038D96158K57730j77018L917j23908r8928n8395o4010P55290k84734j20006
17028E86096j04220R6464o3253l0330o8968L31000A41182M21578r501k5305P9657
17017F07611k32314q689K73846j32541o5010K97417B63789N33856R2474l43899
$$ plain form
17089 418215 446755 211375 506817 533883 316115 30780 141376 70029 375088 358571
17079 358571 177241 394968 543796 499986 455360 385108 398345 413188 667991 464019
17069 464019 422369 561123 369723 110077 655836 635391 265847 713799 194751 484443
17059 484443 788071 596173 465313 365378 311848 619845 591857 646817 604122 212383
17048 265874 530363 376740 523192 587965 748073 494930 707853 501280 283686 496158
17038 496158 753888 576870 580787 456879 357951 299556 235546 990836 706102 586096
17028 586096 481876 578340 515087 484757 415789 746789 141182 562760 553259 527954 607611
17017 607611 375297 366608 640454 507913 442903 740320 263789 797645 890119 546220
17007E46220p8095L22802k28501M58408n04780J25605j37873J34612J14028r3394
16997F59032P1394R712l13569J74841N3526K2965M8606O5034J08519l28869J63588
16986G34779j58510M3129n0624p3226j35855L77849l53549M69011k69473J58271
16976G41802J01192k55055j09090K90747q0814l0250L58053l70939J05346L38241
16966A089233n17559l6384L42972l34238L00570m1438J47772j3161l69950J73502
16956G41319L38115r2209n9017j21268L44513j32359N4478O4349l10676K41687
16946A068932k6551k04039O2538k00979L10130K16311j50815M59475l48946l07617
16936H78439K88955p3018J2168k52920R4758J89106N7986l34477O87329k09432
$$ plain form
17007 546220 468125 790927 562426 1020834 516054 641659 503786 638398 752426 659032
16997 659032 730426 740138 426569 601410 654936 677901 726507 791541 900060 571191 734779
16986 734779 576269 619398 568774 495548 359693 737542 383993 853004 583531 741802
16976 741802 842994 587939 478849 769596 688782 658532 1016585 645646 750992 1089233
16966 1089233 571674 535290 878262 544024 844594 803156 950928 937767 567817 741319
16956 741319 1079434 987225 928208 806940 1151453 1019094 1073572 1137921 827245 1068932
16946 1068932 1042381 838342 900880 699901 1010031 1226342 1075527 1535002 1186056 878439
16936 878439 1167394 1094376 1106544 853624 948382 1137488 1195474 860997 1548326 1338894
16926A338894m70296O9243K22548q7703M84224m02683L08353m80431Q8466j07885
16916I62730K05298j40496M57175j89171k95626J19478J47173l4q3036L64027
16906A547518K08381l03796L57444l79261L43051R1208m45048M18322K4651o09510
16896A252960R5586L49215l88964L31505m8497J65171J05681j47227j47592L03631
16886A871469l72195K39055P7657N0857L0603j54090O2309j9695J0439J72786
16876A969195J61626j12680p8541R7017l0758L15897L2198j06557k96482N10575
16866B461490k50683M0997M3238N9842L21388j36959m04227K42592N73401n31515
16856B419564L27356o45023O08599K88864n17255K93317K65954l78734M06144
$$ plain form
16926 1338894 868598 937841 1160389 1072686 1556910 1154227 1462580 982149 1070615 962730
16916 962730 1168028 1027532 1484707 1295536 999910 1119388 1266561 1266527 1183491 1547518
16906 1547518 1755899 1452103 1809547 1430286 1773337 1864545 1419497 1837819 1862470 1252960
16896 1252960 1348546 1697761 1308797 1640302 1591805 1756976 1862657 1715430 1567838 1871469
16886 1871469 1499274 1738329 1815986 1866843 1897446 1743356 1805665 1785970 1796409 1969195
16876 1969195 2130821 2018141 1939600 2036617 2005859 2321756 2353954 2247397 1950915 2461490
16866 2461490 2210807 2251804 2295042 2354884 2676272 2539313 2135086 2377678 2951079 2419564
16856 2419564 2746920 2101897 2710496 2999360 2482105 2775422 3041376 2662642 3068786
16847C068786k13217j49963Q43603m49527k67285L59396l0830p7237K02612K99028
16837C585366k12857K4077M34592O1189k83337K9040R8610N34090l16767J68375
16827D122378j54685M36382o24299N13980j71595N07742k37784J60192L9426J32544
16817D724281R6788L34536P762k4985L9203R0863j4009M04922O1462K95616k00634
16806E815805o2065M86265R7054K07322R7943k3686K28794J29440K19834L82893
16796G579599K819J37498L50891k32679M14767M14849O11260k88651q0399L88583
16786I298537J47356O97021J74658J8705J64408L55191O65285J38187N28435M46232
16776A2634015J4927N11899Q65665J03060J56231M65932P91465N88767M66058
$$ plain form
16847 3068786 2855569 2705606 3549209 3099682 2832397 3191793 3160963 3083726 3286338 3585366
16837 3585366 3372509 3396586 3831178 3892367 3609030 3638070 3736680 4270770 3954003 4122378
16827 4122378 3967693 4404075 3779776 4293756 4122161 4629903 4392119 4552311 4591737 4724281
16817 4724281 4821069 5155605 5163367 5138382 5177585 5268448 5254439 5659361 5720823 6016439 5815805
16806 5815805 5753740 6240005 6337059 6544381 6642324 6618638 6847432 6976872 7196706 7579599
16796 7579599 7582418 7719916 8070807 7838128 8252895 8667744 9279004 8990353 8909954 9298537
16786 9298537 9445893 10142914 10317572 10336277 10500685 10855876 11521161 11659348 12187783 12634015
16776 12634015 12648942 13160841 14026506 14129566 14285797 14751729 15543194 16131961 16598019
16767A6598019J044373N3506J104575M7069J229937K70615J146995J023492R43620
16758B3462201L71702J386890P44715J051393J095493J278030J626730J550360
16750C2567514J031059J900651J577085J601962K268780K099516K322998K263181
16742D7632746K224480L060942K691123L361090L410546L525167M067455L733257
16734G3706806M364923M514826N526481M986596N896825O338453O191632O795360
16726A18321902P107573O729618P215235P474900P247375O574495O636115N743364
16718A73050577N004762M242751L031684J774859K66204n03092j915427l150665
16710A81801653m530423m978617o155518o652957o667941p260454p364507p486518
$$ plain form
16767 16598019 17642392 17695898 18800473 18847542 20077479 20348094 21495089 22518581 23462201
16758 23462201 23833903 25220793 25965508 27016901 28112394 29390424 31017154 32567514
16750 32567514 33598573 35499224 37076309 38678271 40947051 43046567 45369565 47632746
16742 47632746 49857226 52918168 55609291 58970381 62380927 65906094 69973549 73706806
16734 73706806 78071729 82586555 88113036 93099632 98996457 105334910 111526542 118321902
16726 118321902 125429475 132159093 139374328 146849228 154096603 160671098 167307213 173050577
16718 173050577 178055339 182298090 185329774 187104633 187370837 186867745 184952318 181801653
16710 181801653 177271230 172292613 166137095 159484138 152816197 145555743 138191236 130704718
16702A30704718p019359o856012p150054n979389o411744n427316n517146m995416
16694H1348282m512078m531887m473554l588700l410931l777858k810268l284747
16686E0958259k311915k428817k494550j929616k235434k101534j387393j617245
16678C4451755j709842j754801j392455j283217j104632j203285j236346p30376
16670B4036801j108532r00359q11505r25449m21348p53227r81439n88670l18422
16661A7227850r25801k56874p07277o87508j12737l86079q48668j40811n82583
16652A2579512L0443p90160L9849o84621n00268p2747k23951m87036j48988j50527
16642I591506l07590l02138k78600j02347J7320l19940o88718j68907J55512l44758
$$ plain form
16702 130704718 123685359 116829347 109679293 103699904 97288160 91860844 86343698 81348282
16694 81348282 76836204 72304317 67830763 64242063 60831132 57053274 54243006 50958259
16686 50958259 48646344 46217527 43722977 41793361 39557927 37456393 36069000 34451755
16678 34451755 32741913 30987112 29594657 28311440 27206808 26003523 24767177 24036801
16670 24036801 22928269 22027910 21216405 20290956 19869608 19116381 18134942 17546272 17227850
16661 17227850 16302049 16045175 15337898 14650390 14537653 14151574 13302906 13162095 12579512
16652 12579512 12609955 11819795 11859644 11175023 10674755 10602008 10378057 9891021 9742033 9591506
16642 9591506 9283916 8981778 8703178 8600831 8618151 8298211 7609493 7440586 7596098 7251340
16632G251340l69604L02312l21458l86330K27291Q1999p66780j10051M0929k28236
16622E721412j17645O721j97888J00904m4541j46639l81214q2597K08374n58215
16612D508672L1571j16551Q9963M2194o8758k66676l02931J38178Q0595k88556
16602C847701j29248J17993m6883j30000j19514k93907k0716K69771j86864K11994
16592C520327k01824l3501o9145l83914K44103m67739K81172K1103M1978m01081
16582B551479K40438Q0304m19729k986L9592r2992q5406J43475r9567q089j86631
16571B159888P8782k8072J11948k45246Q3061r9794O3032j20537J25898J30472
16561B259432j19507N3879q4356K80364n37670J33832K16270n06839J18014k12164
$$ plain form
16632 7251340 6881736 7184048 6862590 6476260 6703551 6785550 6018770 5908719 5949648 5721412
16622 5721412 5603767 5610488 5412600 5513504 5468963 5322324 4941110 4858513 5066887 4508672
16612 4508672 4540243 4423692 4513655 4555849 4487091 4220415 3917484 4055662 4136257 3847701
16602 3847701 3718453 3836446 3789563 3659563 3540049 3246142 3225426 3495197 3308333 3520327
16592 3520327 3318503 3285002 3215857 2831943 3076046 2608307 2889479 2910582 2952560 2551479
16582 2551479 2791917 2872221 2452492 2449506 2489098 2396106 2310700 2454175 2354608 2346519 2159888
16571 2159888 2238670 2210598 2322546 2077300 2160361 2060567 2123599 2003062 2128960 2259432
16561 2259432 2139925 2193804 2109448 2389812 1852142 1985974 2202244 1695405 1813419 1601255
16551A601255O5664p9842L28112k67087J97266l13559J27996K45352m7494k84252
16541A573411J35276K67065k50134n6508m81747L64312L6152k46521l2537j64831
16531A143938P45218m58335O7633l259N769k64175L23867k01578k40149J37658
16521A256587j27205J38889J958J26844k90471J80633l17374R6479k3427j90461
16511H52452K49413j75002M49778J71784n23671J69088j23045r5267K8174N15242
16501A518946n26668L00424k56513R9804j90957K61103l72253Q7274L3984k32873
16491G22271J26539K87R7396J13158J43046k28219P7370m59127j08588N56587
16481A040720k12504J71710m77124M61224J8545J4288k16781J51763l11087K18627
$$ plain form
16551 1601255 1666919 1587077 1915189 1648102 1845368 1531809 1659805 1905157 1857663 1573411
16541 1573411 1708687 1975752 1725618 1669110 1187363 1551675 1587827 1341306 1308769 1143938
16531 1143938 1889156 1430821 1498454 1495195 1500964 1236789 1560656 1359078 1118929 1256587
16521 1256587 1129382 1268271 1270229 1397073 1106602 1287235 969861 1066340 1042913 852452
16511 852452 1101865 926863 1376641 1548425 1024754 1193842 1070797 975530 1003704 1518946
16501 1518946 992278 1292702 1036189 1135993 945036 1206139 833886 921160 955144 722271
16491 722271 848810 849097 946493 1059651 1202697 974478 1051848 592721 484133 1040720
16481 1040720 828216 999926 522802 984026 1002571 1016859 800078 951841 640754 859381
16471H59381k61048J27232J98634l63339J35228J19969m07125P94375E73583J1057
16461E84640J32308k15211J63929j31086K56178j82178j34609J90260k2039k02450
16451D39742J85168J45592j29354J34981B02951O13888k81805k00746R5356m7656
16441C81988L83874j68878J89705l23831j51494L06049j7801J69057k43364K06978
16431G32283k46631j85625K52934J57091j10350J80007l6996B79622K20737K50184
16421G50543j34721J40300l76157L1713L65581l87614K878K016q1687P286J75089
16410D95227O1406j92353J74416A74314N49351D3054J45908K38645k03431J29234
16400C53410K53557k89828q0968M16071B80751J56081O9114k45957p3280K21087
$$ plain form
16471 859381 598333 725565 924199 560860 696088 816057 408932 1203307 573583 584640
16461 584640 716948 501737 665666 534580 790758 608580 473971 664231 642192 439742
16451 439742 624910 770502 641148 776129 202951 816839 535034 334288 429644 381988
16441 381988 765862 596984 786689 462858 311364 617413 599612 768669 525305 732283
16431 732283 485652 300027 552961 710052 599702 779709 742713 279622 500359 750543
16421 750543 615822 756122 379965 411678 777259 389645 392523 394539 312852 320138 495227
16410 495227 556633 364280 538696 174314 723665 43054 188962 427607 224176 353410
16400 353410 606967 317139 236171 652242 280751 436832 505946 259989 186709 407796
16390D07796A65046K22670n7182r9700J98507j03089A62794K98048j66855K53564
16380E47551B11580J83779J66287j90002Q2017j42304Q4531J17140j80131A08555
16369C70644F0496J06039N3510p8193J43554A41697J58434A15866J71199I0059
16358B93115K56245h52C12702j23662J6790J84279A17420J29335P6044L50552
16348F73351k89797A81672a04042D5072M14613A86056L19292j88281j40557J81041
16338C57551A08043L6741M42322k81130J14674r2358J85508B55825q090I2581
16327D36086F4976K98138d0958C88971J20267k17490H7157L38474A47311P5502
16317B22813o8406J30479a87201B89474R8645M8073a3583D20683j05261K00733
$$ plain form
16390 407796 165046 387716 330534 230834 429341 326252 162794 460842 293987 547551
16380 547551 211580 395359 561646 371644 453661 311357 395888 513028 332897 108555
16369 370644 60496 166535 220045 141852 285406 141697 300131 115866 287065 90059
16358 293115 549360 -852 312702 189040 205830 390109 117420 246755 322799 673351
16348 673351 383554 181672 -104042 45072 459685 186056 505348 317067 176510 357551
16338 357551 108043 144784 587106 305976 420650 328292 513800 255825 247735 92581
16327 436086 64976 363114 -40958 388971 509238 291748 87157 425631 147311 222813
16317 222813 154407 284886 -187201 289474 388119 436192 -13583 420683 315422 516155
16307E16155K9276A22098E9315J45233A4426M1995M20147r4319j26015p3353p1914
16296A10967a98547C98201j3685j35780A15838K72568a63119B92540A29849J69156
16286B99005j46014a12647B63344E5863M20207b80596D19171a06273A68466J8102
16276A86568D0884L15431A1665J16797L66254A72931J04105A1586L6762J84473
16266B32821j14212L1184A7585J71173a58705C02526M2451E708M95689E7778K04003
16255B61781B0526M4451K9985J43689l6363o3007K89843B10268Q1504A5532i8428
16243F9394a815A31991Q8624q9554K0683K2312a96420A95469a12908H5694k4298
16232F1396K16140b2996k27835C38423A46784J10409H0730J82206l6180D5384
$$ plain form
16307 516155 545431 122098 59315 204548 14426 56421 476568 382249 256234 182881 110967
16296 110967 -198547 398201 384516 248736 115838 388406 -163119 292540 129849 299005
16286 299005 152991 -112647 263344 55863 476070 -280596 419171 -106273 168466 186568
16276 186568 40884 356315 11665 128462 494716 172931 277036 11586 48348 232821
16266 232821 118609 149793 17585 188758 -158705 302526 344977 5708 501397 57778 261781
16255 261781 20526 64977 94962 238651 202288 139281 429124 210268 291772 15532 -98428
16243 69394 -1815 131991 220615 131061 151744 174056 -196420 195469 -112908 85694 61396
16232 61396 277536 -22996 -250831 338423 146784 257193 80730 262936 226756 45384
16221A64230D1600K80439j51079o0762J97590j26832J47227B8624g9923K7473
16211e2450A65912K5373J68648E6174i067C61415j41744L3795k9146f8922B40296
16199B76115f5941b9227E0500Q0966M4633E5219K01413j13057F5358J55875M034
16188B25267a36126K1358D64589a85662B15734C7851b1865I5497M6372C7078K07944
16177B45022I4114j2035N2898a418p6560B63300a75980A14838C8761J13608a3672
16165C38389M5641j62658e5593A52326c8912D36438b00005L3853A4390K1147L25668
16154C61205c75781C45528E7294k3337R3921Q2135r6158d48480A01507m3975J32060
16143A89592E7816R132J69729a91710b2151E2633i0590m1147k47306b6552B33236
$$ plain form
16221 164230 41600 322039 170960 110198 307788 180956 328183 28624 -79923 -52450
16211 -52450 165912 191285 359933 56174 -9067 361415 219671 253466 224320 -68922 240296
16199 276115 -65941 -29227 50500 131466 176099 55219 256632 143575 65358 221233 225267
16188 225267 -136126 -114768 464589 -185662 215734 37851 -21865 95497 141869 37078 245022
16177 245022 94114 82079 134977 -1418 -77978 263300 -175980 114838 38761 152369 -13672
16165 338389 384030 221372 -55593 152326 -38912 436438 -200005 -166152 14390 35537 361205
16154 361205 -375781 345528 57294 33957 127878 210013 113855 -448480 101507 57532 189592
16143 189592 57816 66948 236677 -191710 -22151 52633 -90590 -131737 -379043 -26552 233236
16131B29531N9856A42956b37476n3812j9836A79153i4844B16910q3508h0696o5404
16120a46100K0075A52405O598l2126C7572a09015C58670A27070a17515B02455
16109B3261h9938B35976E5547K11547j16380E5301a4632A58157K01632j75061
16099A84728q361q4893g6379k15663A65583P8964J15179a21006D18852a17718
16088a47618A16234n1385L8163a95031R0959B1532K15880H953J86443p437d7919
16076A89887J11678I5627J8269m2409a89832B52250F1046P4052B8031c61587A85888
16064d07609C4208a5222k50198n7751B08296B6672d09592c6018r9326A69791K96877
16053D66668A73150b38176A81524l377c34395D6036P0598d99881b26781e8834
$$ plain form
16131 229531 289387 142956 -237476 -291288 -311124 179153 -94844 216910 133402 -80696 -146100
16120 -146100 -126025 152405 159003 126877 37572 -109015 358670 127070 -117515 202455
16109 23261 -89938 235976 55547 267094 150714 55301 -14632 158157 359789 184728
16099 184728 176367 91474 -76379 -292042 165583 244547 359726 -121006 418852 -117718
16088 -147618 116234 64849 103012 -195031 -104072 21532 237412 8953 195396 187959 -47919
16076 189887 301565 95627 113896 71487 -189832 252250 61046 135098 28031 -361587 185888
16064 -407609 34208 -15222 -265420 -323171 208296 26672 -409592 -36018 -135344 169791 466668
16053 466668 173150 -238176 181524 178147 -334395 46036 116634 -499881 -226781 -58834
16042a84276b1378A93144p8122D6041J40519p0129h6030D7906b76168L2995Q5590
16031a57583B06792a32698j15748m0105a41161A20794e3843N347C00930A32824
16020a25169k157N9900j78593N3475B13954b75894g2224o6109c0797l25951J49069
16009b07679d9126A53230b15113j7160R3367o8174L4197m0887A7703O9449d70009
15997h4455D6898a63791A27024J93897a47873D9371J96404b04407C79857C2668
15986e1382p5704a7315k4823A00282j5077A3822J56994K09633A40812a23002E3564
15974b18535j31461c5198A85744a7090A06260a24076A29232J42787A16049c30237
15963a04546q392L2148C120L96038h2970F0714a0593A76175l1858J16263d3420
$$ plain form
16042 -184276 -21378 193144 115022 46041 186560 116431 -86030 47906 -276168 -243173 -157583
16031 -157583 206792 -132698 -248446 -288551 -141161 120794 -53843 -48496 300930 132824
16020 -125169 -127326 -67426 -246019 -192544 213954 -275894 -72224 -138333 -30797 -356748 -207679
16009 -207679 -49126 153230 -215113 -232273 -138906 -207080 -172883 -213770 17703 87152 -470009
15997 -84455 46898 -163791 127024 320921 -147873 49371 245775 -204407 379857 32668
15986 -51382 -127086 -17315 -42138 100282 85205 13822 170816 380449 140812 -123002 53564
15974 -218535 -349996 -35198 185744 -17090 106260 -124076 129232 272019 116049 -330237
15963 -104546 -112938 -80790 3120 399158 -82970 60714 -10593 176175 144317 260580 -43420
15951I1058e5203J6570C5865a56552A16215O3714e1132f317A01152b2583l2817
15940e5400A09591P5522i0320C8493N948a97926B98162D0551O3320l8984K9777
15929I4664O5095a14557A09087J04418n6715a32935A86310F747g2088D57229d1598
15917c5055m4085A4667a54331A85701h537j47975O7450G6169b78303I4799a88876
15905d2157n8872G1841c81469i7524d2110j09258e6381j05367H9700K6999C8993
15893a08621H135b70403a17025m8302I4049a73120r3598h2392l4084P264M1955
15882f7257F4257g471B35566F6626L9472d95392H1783K7173c0559A58007N8141
15871B16148B4638L8183a42312o444A95440f6523J3346H7717a68646F1771I314
$$ plain form
15951 91058 -55203 -38633 35865 -156552 116215 179929 -51132 -6317 101152 -22583 -55400
15940 -55400 109591 185113 -90320 38493 44441 -197926 298162 40551 103871 64887 94664
15929 94664 159759 -114557 109087 213505 156790 -132935 186310 6747 -72088 457229 -41598
15917 -35055 -79140 14667 -154331 185701 -8537 -156512 -89062 76169 -278303 94799 -188876
15905 -42157 -101029 71841 -381469 -97524 -42110 -151368 -56381 -161748 89700 116699 38993
15893 -108621 8135 -270403 -117025 -165327 94049 -173120 -266718 -82392 -116476 -109212 -67257
15882 -67257 64257 -7471 235566 66626 106098 -495392 81783 108956 -30559 158007 216148
15871 216148 24638 62821 -142312 -148756 195440 -66523 -53177 87717 -168646 61771 9314
15859A64903o7437d1496A32903g6170A26426k3794D5225Q9637K1720a34023j22877
15848b56900a1717k513E0019L02182i9525C7818e2057q3552j92888g8459B06289
15836b67377g0229l4210r9426N4725B3227K80461c06461b5072B48500a36133e6974
15824B47292f782k02744h9557p1150A72691J0716f2715a8752m0233j93406B06576
15812a97115f0512j33367A99261b38359B24275c0185k26078h3246j37454b3392
15801b8794A0839M9483h3283a574A10028f2397B16925F67i3606l286D6703b2494
15788b37534l9159A96872B0081J33659d1732j66175q8812N7667O0858j01929J35262
15777a44861J8102L0469m8752G5565a37441C06923b49986C44540d93690B407J17083
$$ plain form
15859 164903 97466 -41496 132903 -76170 126426 102632 45225 134862 156582 -134023 -256900
15848 -256900 -11717 -14230 50019 352201 -99525 37818 -52057 -135609 -328497 -78459 206289
15836 -267377 -70229 -104439 -203865 -149140 23227 303688 -306461 -25072 248500 -136133 -56974
15824 247292 -6782 -209526 -89557 -160707 172691 183407 -62715 -18752 -58985 -252391 206576
15812 -197115 -60512 -193879 199261 -238359 224275 -30185 -256263 -83246 -220700 -23392
15801 -28794 10839 60322 -83283 -1574 110028 -62397 216925 667 -93606 -96892 46703 -22494
15788 -237534 -276693 196872 20081 153740 -41732 -207907 -296719 -239052 -178194 -280123 -144861
15777 -144861 -126759 -96290 -145042 75565 -137441 306923 -249986 344540 -493690 2407 119490
15766A19490b37172G6357a21470j96942h9835j61076f3087j6072n4231B33816
15755a76629N1276A43151c29470a59147q9380N4628A16774b8498E1851K71560
15745C23411b9846k01445g5935A00520i9606D3882B0575Q0864J07729c2079B70396
15733D6978b14581k7039I9892c94347M3964C17451b94019J31781j76354J32348
15723b06244B31505a38821I3714b9633A09164a67709Q2268B07705b24255A32465
15712d40412A87903a02857A75409A6499f3810F9483b45255c9863k29698C28039
15701a45232A09704a52263k9484H4272Q7936i8379l0908J0342j5567A39331f7880
15689C9174c77913F2341b91073c8407p9192k1709A09282i1951a3023E9855a68967
$$ plain form
15766 119490 -237172 76357 -121470 -318412 -89835 -250911 -63087 -79159 -133390 233816
15755 -176629 -125353 143151 -329470 -159147 -248527 -193899 116774 -28498 51851 323411
15745 323411 -29846 -231291 -75935 100520 -99606 43882 20575 101439 209168 -32079 270396
15733 46978 -214581 -241620 99892 -394347 -350383 317451 -294019 -162238 -338592 -206244
15723 -206244 231505 -138821 93714 -29633 109164 -167709 -85441 207705 -224255 132465
15712 -440412 187903 -102857 175409 16499 -63810 69483 -245255 -39863 -269561 328039
15701 -145232 109704 -152263 -181747 84272 172208 -98379 -129287 -118945 -134512 139331 -67880
15689 39174 -377913 62341 -291073 -38407 -117599 -139308 109282 -91951 -13023 59855 -168967
15677C5474A4011b75359E7766a25521B14762a93565M8167B27320H8331c11481
15666I8553i1441K9897D5089J11031k6181m6264f2664J1443D1468b3313j26330
15655a49643L6427A67404a60127H5531C6942D5J81107A8224a64828D9349A7420
15643A61186a71698j88025a9821j32620D4811d23499A27367c35881d141l06534
15633c10675G4814M7641c10312J9688e2685G3059e1452a9912k0227E9890i6980
15621G5880b27121C27559a50320f2334o4944J4715m4528D1029a83834j22367A89165
15609a5080j03285d1694k10658J00680b6488C0369J58629e0461j39575C70472
15598a00009D3383a34890n8250B23324F9740J85484F1843J01934E0857d0776j70071
$$ plain form
15677 35474 14011 -275359 57766 -125521 214762 -193565 -145398 227320 88331 -311481
15666 98553 -91441 -61544 45089 156120 129939 83675 -62664 -51221 41468 -23313 -149643
15655 -149643 -113216 167404 -160127 85531 36942 45 181152 18224 -164828 49349 17420
15643 161186 -171698 -359723 -19821 -152441 44811 -423499 127367 -335881 -4141 -310675
15633 -310675 74814 122455 -310312 -290624 -52685 73059 -51452 -19912 -40139 59890 -96980
15621 75880 -227121 327559 -150320 -62334 -127278 -112563 -157091 41029 -183834 -306201 189165
15609 -15080 -118365 -41694 -252352 -151672 -26488 30369 188998 -50461 -190036 370472
15598 -100009 43383 -134890 -193140 223324 69740 255224 61843 163777 50857 -40776 -210847
15587b10847A028c80767f8023L2023j18831M8341F3674f0679A72729d8734j13730
15576a62464c5411F6107f8872k66763C7308R8118b84638B85706r6849c2881k0354
15565e3235j34438C46122a23491f1449b9877l0741K8198A0479a67167d7621e490
15553c3066a3422o3628B86438g6250l95558d2339C39134d0896A13906E1569b45590
15541A39682c03249g4078A74232E4295e8494o9986C5853b08491a4458m34m853
15530a9745C28707a2777C34104A2084a0216k70644J30895B88534C5404d4907F1502
15518F7044M2927f8115j06042A549J60885B8578b23772d4580I5942b72297J399
15507b70898B87809m4538a47463j59157A06105j8952L06750C4264J853a68204
$$ plain form
15587 -210847 1028 -380767 -68023 -36000 -154831 -106490 63674 -60679 172729 -48734 -162464
15576 -162464 -35411 66107 -68872 -335635 37308 135426 -284638 285706 188857 -32881 -53235
15565 -53235 -187673 346122 -123491 -61449 -29877 -60618 -32420 10479 -167167 -47621 -5490
15553 -33066 -13422 -77050 286438 -76250 -471808 -42339 339134 -40896 113906 51569 -245590
15541 139682 -303249 -74078 174232 54295 -58494 -128480 35853 -208491 -14458 -14892 -19745
15530 -19745 328707 -12777 334104 12084 -10216 -280860 -149965 288534 35404 -44907 61502
15518 67044 109971 -68115 -174157 1549 162434 28578 -223772 -44580 95942 -272297 -270898
15507 -270898 287809 243271 -147463 -306620 106105 87153 393903 34264 36117 -168204
15496a4070p9042d5697H6329a08364F2609i8094B24673G3972K05500f679D22613
15484G5975k8295A9231R1745a67832B5843K6179L4615k9739e0995i988I9659b84772
15471a5218q6478R785l3524O1809n6999G755c7968m7784b8773k93653G990K97299
15459C05289i2318k33183a41167A28894K08024b29918d4309C29449a20473A16104
15448C94822j22341q0706h215r2377d3732j05673C6252i9919P261A49732a80426
15436b51393J23891m552a0244C37884b4783P74l8264e532n3359A7854b22392m0797
15424b63189I467a70542d8679B2858g4132C5421a6525k18946B04230a59143b71
15412F640O8460a83062c3289A42535i4937G5556a14975K6702B71933A22725R1288
$$ plain form
15496 -14070 -93112 -45697 86329 -108364 62609 -98094 224673 73972 279472 -6679 422613
15484 75975 47680 19231 110976 -167832 25843 52022 86637 56898 -50995 -9988 99659 -284772
15471 -15218 -101696 -91911 -125435 -63626 -120625 7755 -37968 -85752 -28773 -322426 7990 305289
15459 305289 -92318 -325501 -141167 128894 336918 -229918 -44309 329449 -120473 116104
15448 394822 272481 191775 -8215 -100592 -43732 -149405 36252 -99919 -92658 149732 -180426
15436 -251393 -127502 -132054 -10244 337884 -24783 -24009 -62273 -5532 -58891 17854 -222392 -263189
15424 -263189 9467 -170542 -48679 22858 -74132 35421 -16525 -235471 204230 -159143 -271
15412 6640 75100 -183062 -33289 142535 -94937 75556 -114975 -88273 271933 122725 214013
15401B14013J64937a3769D8906K48513A18852d7196o5772p3656C8091M26907F9815
15389A63725o6482J30605c9178o7685j403c2556p4914D3045M729P5932R8465b72523
15376a89799e5729D5409c31276H9241d8532I9176c15213D7789J3799a37692m2106
15365a79798I065J15967a8215H2181Q6332K7445b41555A06090k0092b98658j63846
15354d62504A89184K82590j41244a74706b4763C76930j82848a99845Q4411G4493
15343b36930A44995a77658B34884j4355a79607A44675J00150h5331J1267C8034
15332a24466B19400c6233E6234M297e0351C4045J7156b27596C29955d9760C1820
15320C43214A10927D0318b23225B99174d27292L9086A80488b04224b7740n5812
$$ plain form
15401 214013 378950 -13769 48906 297419 118852 -47196 -112968 -186624 38091 464998 69815
15389 163725 97243 227848 -39178 -106863 -108266 -32556 -107470 43045 47774 123706 222171 -272523
15376 -189799 -55729 45409 -331276 89241 -48532 99176 -315213 47789 61588 -137692 -179798
15365 -179798 9065 125032 -18215 82181 168513 195958 -241555 106090 85998 -298658 -462504
15354 -462504 189184 471774 330530 -174706 -24763 376930 194082 -199845 -115434 74493
15343 -236930 144995 -177658 234884 220529 -179607 144675 244825 -85331 -74064 38034
15332 -124466 219400 -36233 56234 60531 -50351 34045 51201 -227596 329955 -49760 31820
15320 343214 110927 40318 -223225 299174 -427292 -388206 180488 -204224 -27740 -83552
15310h3552D42453r5308F256K33225d0939I0394j1734c55372J59560I1572Q228
15299I9800J38330N0343a00661C04969A7310a80447O6600A02350N4599f3435B54281
15287g5789C29002h4647k08484d4022l41092B39646c33862f3979A83056b36761
15276b35227B907a5488k87608A05415b62999A26802A0933c1609C73621j66318
15266B07303a48924O8603K9984l5872A14307a16018j2564A25382J82905j15789
15256A92498C0641A5054J41155a38023A43785m9138P4306m1357M78536J22576
15246G28708M07166J128600J22423l40314k29941m73745F17764F221M97718D2230
15235A59915M957P0050I3916K36242B2912J34538B7272b62222A52723J37662d7306
$$ plain form
15310 -83552 442453 347145 6256 239481 -40939 90394 78660 -355372 -195812 91572 99800
15299 99800 238130 288473 -100661 304969 17310 -180447 -113847 102350 156949 -63435 254281
15287 -75789 329002 -84647 -293131 -44022 -385114 239646 -333862 -63979 183056 -236761
15276 -235227 2907 -15488 -303096 105415 -262999 126802 10933 -31609 373621 207303
15266 207303 -148924 -80321 -50337 -86209 114307 -116018 -128582 125382 308287 192498
15256 192498 30641 15054 156209 -138023 143785 94647 168953 127596 606132 728708
15246 728708 1135874 2264474 2386897 2046583 1816642 1342897 617764 6221 503939 42230
15235 159915 164872 234922 93916 330158 22912 157450 27272 -262222 152723 290385 -47306
15223G2422b76943A21093m366E0525b27606J08190j44764C31241a83407A27859
15212g4203E1623b2211A52466e9453A94943D6783a42609G1098M6885d9712A74009
15200g7013G4545J59402n2973l9418J6027Q1434E9132j7470M9289K76860H3518
15188h7982G5203b5217m2203C1196a72664G6453A9430P5070P7269c88195a02194
15176h7254K2960A08274J25432g4718f552A79647E7311a49448b2554A11949J79894
15165B91843r505A16027K25734A28924c9383A42638C7711N0398J24214f3901C09838
15153A7871c02502f9490B54718p2439n1087n2536J27095j4523b46944O3281H0256
15141B59533j28827a78813L1272B39190q7168D2342J33351a14957c7216n9841
$$ plain form
15223 72422 -276943 121093 116727 50525 -227606 -119416 -264180 331241 -183407 127859
15212 -74203 51623 -22211 152466 -59453 194943 46783 -142609 71098 117983 -49712 174009
15200 -77013 74545 233947 180974 141556 157583 239017 59132 41662 90951 367811 83518
15188 -87982 75203 -25217 -67420 31196 -172664 76453 19430 94500 171769 -388195 -102194
15176 -87254 -64294 108274 233706 -74718 -6552 179647 57311 -149448 -22554 111949 291843
15165 291843 282338 116027 341761 128924 -39383 142638 37711 88109 212323 -63901 309838
15153 17871 -302502 -69490 254718 182279 131192 78656 205751 191228 -246944 -183663 80256
15141 259533 130706 -178813 -147541 239190 152022 42342 175693 -114957 -37216 -97057
15131i7057A361P2014g3034J3769A55566J68675A27162m5372J18451O1051a1313
15119A83728F1672a0465C56353o6101A13384m3902Q8201m4284L68450a22351e1661
15107A0974e7640G5782a30648Q901A65256H762a60616F7587J17987n8996a79550
15095D03628g2902J8342D54233B20162R3093j13016D9320M68495e994E05523k32393
15084B73130j06417R420q7322K4061J47106a16151A7545M41155F7321a8510B931
15072A44894J22297J38870j07802D2598a31769C88440p1894f3126C57513A37571
15061B22999D0877K20280e2178F44605B91905J33360A318a89532I0229K1105N2875
15050A64209L50458A00669J36001D5281J28255M950o0454c0569A11753d0235A1598
$$ plain form
15131 -97057 1361 73375 -73034 -59265 155566 324241 127162 81790 200241 261292 -11313
15119 183728 61672 -10465 356353 290252 113384 69482 157683 113399 481849 -122351 -51661
15107 10974 -57640 75782 -130648 -121747 165256 8762 -160616 67587 185574 126578 -179550
15095 403628 -72902 -54560 454233 220162 313255 200239 49320 517815 -5994 505523 273130
15084 273130 166713 176133 88811 112872 259978 -116151 17545 458700 67321 -18510 2931
15072 144894 267191 406061 298259 42598 -131769 388440 316546 -63126 357513 137571
15061 222999 40877 261157 -52178 644605 291905 425265 1318 -189532 90229 111334 164209
15050 164209 514667 100669 236670 45281 173536 178486 118032 -30569 111753 -40235 11598
15038B76663F1780P1027J28239E789L6393O1947C5454L26124p1277R7829A36748
15026B37846D8964c7943D10768J17491A70711p0692D1051P0241G51L369M8744
15015E2864A9977L98195k03818J69901D1126L00126b57684D36161A65193D653
15004C88187O5313k24187E3950K90693j15983m3350K94649J23256b5855k05092
14994b30947B01032K55016j39924A26041Q9340n7005d6733D43554j28271I5759
14983D36246j33499c48147C8101b7877B11685K08788A09044K34233A7973L79689
14973C97662b6387B74054G3844J6790O2499J6825i6267C12316J6982d3533n8438
14962a01971l2326C80800H5966J25677J70890A52165D5765L9116a52619C03144
$$ plain form
15038 276663 61780 132807 261046 5789 42182 104129 35454 361578 290301 388130 136748
15026 237846 48964 -37943 410768 528259 170711 100019 41051 111292 751 4120 52864
15015 52864 19977 418172 214354 384255 41126 341252 -257684 436161 165193 4653
15004 388187 453500 229313 53950 344643 228660 185310 479959 603215 -25855 -230947
14994 -230947 201032 456048 316124 126041 215381 158376 -46733 443554 315283 95759
14983 436246 302747 -348147 38101 -27877 211685 420473 109044 343277 17973 397662
14973 397662 -26387 274054 73844 90634 153133 169958 -96267 312316 329298 -43533 -101971
14962 -101971 -134297 380800 85966 211643 382533 152165 45765 84881 -152619 303144
14951B76915P2321j03407a44513E02838k13896n0450G9999K25453n8595p7614
14941A69243J00291J98001B30079J06506l8243A30455c0136D60241j18110a00036
14930B51519J02005D6604K56690K91795F8164J76918A09643J77943q7799E9909
14919A71487M119Q384o0454J88600I3493Q6124M1081p1087J62097K17664m0279
14908D89093L9306A02691J04582J92343A76562j1017J53214a64794A59090L18430
14898D77520A97457C1820K55410l9947A19080n2379K90291l2524k5820J09345
14888D07993d8838B90816b9289H0297O08518k27229j57637b0564B81204J12558
14878C93762A64801J49208J87533r5849M746N7447A10462K12922A09713K28990
$$ plain form
14951 276915 349236 245829 -144513 502838 288942 238492 79999 305452 246857 169243
14941 169243 269534 467535 230079 336585 298342 130455 -30136 460241 342131 -100036
14930 251519 353524 46604 303294 595089 68164 245082 109643 287586 199787 59909
14919 171487 175606 183990 123536 312136 93493 179617 220698 149611 311708 529372 489093
14908 489093 528399 102691 207273 399616 176562 165545 318759 -164794 159090 477520
14898 477520 197457 31820 287230 247283 119080 66701 356992 324468 298648 407993
14888 407993 -48838 290816 -29289 80297 688815 461586 303949 -20564 281204 393762
14878 393762 164801 314009 501542 405693 410439 467886 110462 323384 109713 338703
14868C38703R1130A41727K27546M7923k4957r3756L39296B64465c5691D12420
14857C58934J5758r6107I0712K87705J24360j3578A90149L21787A62890J57128
14847C20018J07880R7556o6865e8079B12452J1172K25949j63034L8076j56754
14837A67861K70173j9216A81480L71685A90803K5375L11612j51555J12699J51944
14827F40878A67155M23463j26819B00094O1124K05319A60313O82179C65351j73138
14817A92213J48449J18393j20543J95041p8261j093Q9723K52940k58175j15278
14807D23409B11250L22146k50805p2620J16976J45571J24750j89540j25414A6958
14796D89656o1017m4538L39226j38909k09695L84848C68253J82193k66266R4030
$$ plain form
14868 338703 429833 141727 369273 417196 392239 298483 637779 264465 -35691 412420
14857 358934 374692 278585 90712 378417 502777 489199 190149 511936 162890 320018
14847 320018 427898 525454 458589 -58079 212452 223624 449573 286539 324615 167861
14837 167861 438034 418818 181480 553165 190803 216178 527790 376235 488934 640878
14827 640878 167155 590618 463799 200094 261218 466537 160313 842492 365351 192213
14817 192213 340662 459055 338512 533553 455292 454199 543922 796862 538687 423409
14807 423409 211250 533396 282591 209971 326947 472518 597268 407728 282314 16958
14796 489656 428639 384101 723327 584418 374723 759571 368253 550446 284180 378210
14786C78210J76270k19165J04911M17838k57728n2179K1975K6665B77597K20542
14776D98139J03060K0129r6146J44544l21704K96040j76683J54505B70750M32646
14766G03396Q4342k6177j28881k89697N76396A95770K34489L07066k56554K82332
14756G63103p7566j204j72213k9041J59244p4188M90206l65002o6433B95233K46385
14745E41618M1024j90824J00557M94930m22789J50531B21915K79973J88757m6434
14735F44211l9485k30285J88858o3843J58368K42024l67172J63530K614O3832
14725G62652k81212K74563K66224k65874k93380N2353J70249j36456K43701p4959
14715G17861n1737k06709M56617k18910j35901K79032K98762l92569J5780j67602
$$ plain form
14786 378210 554480 335315 440226 858064 600336 548157 570132 596797 277597 498139
14776 498139 601199 621328 525182 669726 348022 644062 467379 621884 270750 703396
14766 703396 787738 761561 632680 342983 919379 195770 430259 737325 480771 763103
14756 763103 685537 684333 512120 483079 642323 568135 1058341 693339 626906 295233 541618
14745 541618 582642 391818 492375 987305 564516 715047 221915 501888 690645 644211
14735 644211 604726 374441 563299 499456 657824 899848 532676 696206 698820 762652
14725 762652 481440 756003 1022227 756353 462973 515326 685575 549119 792820 717861
14715 717861 666124 459415 916032 697122 561221 840253 1139015 746446 762226 594624
14705E94624K6021K6541K11128N6468j29336J39550k81554M9470j08043M04697
14695I89566j95228N6977k58115L52016q8712j27226j93682J22308L98847m0674
14685A016077p7201j60310J63327k51082O06057l35485j29196J25120K95115n42746
14675G09676J12915J64449k2817j57904J01348J0913j61391N3150J89144j04852
14665H94631j61189o7663N57287m9655j20577m60022J48235j45599L13657m5762
14655H63343K4414j3489J73579k62045K75684k30670O64498p11354J23429M16213
14645A323602n13716M20795j84248N1960L114K00934k57179K9905J73155k38160
14635A010162N9806j25529L98263l14839J06265k0255M62446k66418n33207K64603
$$ plain form
14705 594624 620645 647186 858314 914782 785446 924996 643442 692912 584869 989566
14695 989566 794338 851315 593200 945216 856504 729278 535596 657904 1056751 1016077
14685 1016077 938876 778566 941893 690811 1296868 961383 832187 957307 1252422 709676
14675 709676 822591 987040 964223 806319 907667 918580 757189 810339 999483 894631
14665 894631 733442 665779 1223066 1173411 1052834 592812 741047 595448 909105 863343
14655 863343 887757 874268 1047847 785802 1061486 830816 1495314 783960 907389 1323602
14645 1323602 809886 1230681 1046433 1098393 1101507 1302441 1045262 1075167 1248322 1010162
14635 1010162 1069968 944439 1342702 1027863 1134128 1113873 1576319 1309901 776694 1041297
14625A041297L02082P6811J99027K003m94904K40756n9862l83887J78786J54238
14615A256347N4063k77465K25748j26805J33389j09310O55309m77406N4903j69330
14605A219443k16974O58553p50k47477J79536k64886K80067j86327M821n5038
14595A370968J51174j99208K50219O4329n1336Q1416J40964j82385n7963P7176
14585A645354k8795L506L557L01192l53231J36083P0017o4889P3228R6329j28711
14574A753640J24810N273k30990L9240K98306k27203p346M2374K23760j5185M24116
14563B430795q1619q0549m564Q6915K84933j53860o4368N42922J23614j28052
14553B956167K94299M11628J09840J190805J713316K939220Q640703J7191744
$$ plain form
14625 1041297 1343379 1420190 1619217 1621220 1126316 1367072 1307210 923323 1102109 1256347
14615 1256347 1310410 1032945 1258693 1131888 1265277 1155967 1811276 1333870 1388773 1219443
14605 1219443 1002469 1661022 1660272 1412795 1592331 1327445 1607512 1421185 1426006 1370968
14595 1370968 1522142 1322934 1573153 1637482 1586146 1667562 1808526 1626141 1568178 1645354
14585 1645354 1616559 1620065 1623622 1924814 1571583 1707666 1777683 1712794 1786022 1882351 1753640
14574 1753640 1878450 1883723 1652733 1691973 1990279 1763076 1755730 1798104 2021864 2006679 2430795
14563 2430795 2349176 2268627 2264063 2350978 2635911 2482051 2417683 2960605 3084219 2956167
14553 2956167 3250466 3662094 3771934 4962739 6676055 9615275 18255978 35447722
14545C5447722N828328j7076605A0137497m392071k27807J07228j824662j385744
14537B414441n67112J68044l49570J61474N7159k35841J43457j78280O23877l00518
14527A937131j60468L43134p06j5408j57122L21089O656Q0101k62394J4483L14450
14516B420946l88391M70399j44749J10003K72701p4532j68115p888K44719J3018
14506B748111j86023l1812J27438J62512k65744K82890j40595j18620J91999K04970
14496B975126R03l0726q5340K40664J53190j58136j53049R4918P2570l68950M30157
14485C171327k55365L24848K98927l86232K76821k5170J40842j0382n1809J72974
14475C656781m1039k15798K79169J76314j09014k8051J40377J48441m68249M07774
$$ plain form
14545 35447722 41276050 24199445 10137497 5745426 5517619 5624847 3800185 2414441
14537 2414441 1847329 2015373 1665803 1827277 1884436 1648595 1792052 1613772 2237649 1937131
14527 1937131 1776663 2119797 2119091 2103683 1946561 2267650 2274306 2354407 2092013 2106496 2420946
14516 2420946 2032555 2502954 2358205 2468208 2740909 2666377 2498262 2490374 2735093 2748111
14506 2748111 2562088 2530276 2657714 2820226 2554482 2837372 2696777 2578157 2770156 2975126
14496 2975126 2976029 2945303 2859963 3100627 3253817 3095681 2942632 3037550 3110120 2741170 3171327
14485 3171327 2915962 3240810 3539737 3153505 3430326 3405156 3545998 3535616 3483807 3656781
14475 3656781 3615742 3399944 3679113 3855427 3746413 3718362 3858739 4007180 3538931 3946705
14465C946705J72752J29975k60576K38749R3514P5031j54413J92707r1093k41410
14455D101941L32280K07401R3725n7529k43236J91267J50401J13532J26768k4145
14445D992405Q0402O9554J57886l09465L07313M0743O6718j28451N13638n8523
14435E732220J5474k63594N22288k62887K87569k0275K38891j53939m0715N45580
14425F600612k77255J51785J0172L18868J75017k55467J20793P915P04550j61341
14415G395649J81478N11319l55600j8288L81247k76699N83632j73227J91422K50309
14405H671242n7879K02801L44610l52422K17364M30246l2840L3562J83512M18925
14395A0059121M1016L12811l14591K65212P6798N27642l4689M36956l00164O41642
$$ plain form
14465 3946705 4119457 4249432 3988856 4227605 4321119 4396150 4241737 4434444 4343351 4101941
14455 4101941 4434221 4641622 4735347 4677818 4434582 4625849 4776250 4889782 5016550 4992405
14445 4992405 5072807 5142361 5300247 4990782 5298095 5338838 5405556 5277105 5790743 5732220
14435 5732220 5747694 5484100 6006388 5743501 6031070 6010795 6249686 6095747 6055032 6600612
14425 6600612 6323357 6475142 6485314 6804182 6979199 6723732 6844525 6852440 7556990 7395649
14415 7395649 7577127 8088446 7732846 7714558 8095805 7819106 8402738 8229511 8420933 8671242
14405 8671242 8613363 8816164 9160774 8808352 9025716 9455962 9423122 9456684 9640196 10059121
14395 10059121 10100137 10412948 10098357 10363569 10440367 10968009 10933320 11370276 11070112 11711754
14385A1711754M43401k26466p433P20655J45483L09437Q8116L40447K28353J42349
14375A3896096L17437L94628P2977P69604n4147L63134L34923K5699O06872J55664
14365A6882887P46817L54728L42407K45298L33461Q22362m7754M87465P45524
14356B0913195N62414m2007J058566P587P82951N55517M88650P57535M26227M80028
14346B5990663P48607O70406R13516N04300O60771R17316R79275R30455Q52967
14337C3168276R09907J201644O82601J321979J098372Q84148J248207J126417
14329D1641551J588954J426077J116868K075829J562164J586624J212747K273839
14321E4484653J522694K429961J956063K340031K492165K213628K408777K943745
$$ plain form
14385 11711754 12155155 11928689 11921256 12641911 12787394 13096831 13184947 13525394 13753747 13896096
14375 13896096 14213533 14608161 14681138 15450742 15396595 15759729 16094652 16120351 16727223 16882887
14365 16882887 17629704 17984432 18326839 18572137 18905598 19727960 19680206 20167671 20913195
14356 20913195 21475609 21433602 22492168 22499755 23282706 23838223 24326873 25084408 25510635 25990663
14346 25990663 26739270 27409676 28323192 28827492 29488263 30405579 31384854 32315309 33168276
14337 33168276 34078183 35279827 35962428 37284407 38382779 39266927 40515134 41641551
14329 41641551 43230505 44656582 45773450 47849279 49411443 50998067 52210814 54484653
14321 54484653 56007347 58437308 60393371 62733402 65225567 67439195 69847972 72791717
14313G2791717K921452L317183L183427L416710L483820L913784L861939M504482
14305A01394514M446416N171214M918908N494673O269412O101271O651154P059264
14297A47506826P474409P824075Q756892R010536R749955R977596J1013598J1713990
14289B23027877J2731152J2540740J3438944J4479798J4705572J5545432J5974680
14282C22444195J6489215J6372069J6788211J6619651J6209717J5379053J4581858
14275D34883969J2450682J0043638Q287836N476728J419999p59585m122734k291678
14267D65388855k58276l804702p407073j1899104j4042926j5238794j6396535
14260C96341445j6607505j7001054j6662777j6667999j6351877j6109604j5245260
$$ plain form
14313 72791717 75713169 79030352 82213779 85630489 89114309 93028093 96890032 101394514
14305 101394514 105840930 111012144 115931052 121425725 127695137 133796408 140447562 147506826
14297 147506826 154981235 162805310 171562202 180572738 190322693 200300289 211313887 223027877
14289 223027877 235759029 248299769 261738713 276218511 290924083 306469515 322444195
14282 322444195 338933410 355305479 372093690 388713341 404923058 420302111 434883969
14275 434883969 447334651 457378289 465666125 471142853 472562852 471803267 467680533 465388855
14267 465388855 465130579 461325877 453918804 442019700 427976774 412737980 396341445
14260 396341445 379733940 362732886 346070109 329402110 313050233 296940629 281695369
14253B81695369j5022423j3697293j2438723j1861278j1906626j1270831j1081643
14246A94416552r714908r533205q394936q349376q027639p650226o453200o637462
14238A29655600n903625n008318n780293m870965n146334m205365m110584l627084
14230I1003032l599762l587876l651728l024177l125856l066865k522408k332949
14222F6091411k610228j929912k046395k403428j760333j916688j866222j596741
14214D9961464j385062j264670j599188j701791j228391j201919j132236q11211
14206C9636996j075427j284123j104652j074677j048028o00997o87369j047187
14198C1714536r10245r93169j092520l03227o37853o51452o94214o96375n86846
$$ plain form
14253 281695369 266672946 252975653 240536930 228675652 216769026 205498195 194416552
14246 194416552 184701644 175168439 166773503 158424127 150396488 142746262 136293062 129655600
14238 129655600 123751975 118743657 112963364 108092399 102946065 98740700 94630116 91003032
14230 91003032 87403270 83815394 80163666 77139489 74013633 70946768 68424360 66091411
14222 66091411 63481183 61551271 59504876 57101448 55341115 53424427 51558205 49961464
14214 49961464 48576402 47311732 45712544 44010753 42782362 41580443 40448207 39636996
14206 39636996 38561569 37277446 36172794 35098117 34050089 33449092 32761723 31714536
14198 31714536 30804291 29811122 28718602 28415375 27777522 27126070 26431856 25735481 25148635
14189B5148635n93047n81898p42126m47977m52146q27924m1291m02150p04522
14180B0355554n76585l29787j28500q99348l16183k03942m95360m46424j56412
14171A6803013k83213j63983n86900p021m13273k41236l50389r5285k86025n18465
14161A3857223K55587o18665n12533J72585l7217M170q55992J97199k97366k54210
14151A1910781k65763O9393l50684m91264M2729j2266p53972N52745m93642k7687
14141A0180370j42340k99634m47376r00J57933p0698j80686k93604k13180j1007
14131H678878J1606k27696j59908O3806n86551M4259L4184m0512k12363j27036
14121G478667k94924Q4432k52663P5191K6691m70527L71648l77624j7245N2800
$$ plain form
14189 25148635 24555588 23973690 23231564 22783587 22331441 21503517 21462226 21060076 20355554
14180 20355554 19778969 19449182 19320682 18421334 18105151 17901209 17405849 16959425 16803013
14171 16803013 16519800 16355817 15768917 15761896 15348623 15107387 14756998 14661713 14375688 13857223
14161 13857223 14112810 13494145 12981612 13154197 13116980 13121150 12265158 12462357 12164991 11910781
14151 11910781 11645018 11714411 11363727 10872463 10915192 10902926 10148954 10701699 10208057 10180370
14141 10180370 10038030 9738396 9291020 9290120 9448053 9377355 9196669 8903065 8689885 8678878
14131 8678878 8690484 8462788 8302880 8366686 7780135 7824394 7858578 7818066 7605703 7478667
14121 7478667 7183743 7268175 7015512 7090703 7117394 6646867 7018515 6640891 6623646 6676446
14111F676446m79432J91444l339m64972K25721J15103j90446j64303k56574R2200
14101E741848k67658M4244k25246L16036N4125l14372j6313j12060r5578j4159
14091E110867K0313q6022j64761j88179N21976n80358K80851j59070j73463M4378
14081D626532k87921K19709M4177j70575N2840k30465P2423j16688M2670k56018
14071C996684l6628K33120l57948L76821j01330j94648p6049j38480L51405n08546
14061C544401M79916j99802l12716L2042j30850K58593j31577k02027J58039r5737
14051C400282q083k7753l1595k89368K50630l59281L05209l55052L19788J78326
14041C383103n56761K09699j01272K62704k69733N7042l63357o2551K61987K89181
$$ plain form
14111 6676446 6197014 6388458 6385119 5920147 6145868 6260971 6070525 5906222 5649648 5741848
14101 5741848 5474190 5518434 5293188 5609224 5663349 5348977 5332664 5220604 5125026 5110867
14091 5110867 5131180 5045158 4880397 4692218 5214194 4633836 4914687 4755617 4582154 4626532
14081 4626532 4338611 4558320 4602497 4431922 4484762 4254297 4326720 4210032 4252702 3996684
14071 3996684 3960056 4193176 3835228 4212049 4110719 3916071 3840022 3701542 4052947 3544401
14061 3544401 4024317 3824515 3511799 3543841 3412991 3671584 3540007 3337980 3496019 3400282
14051 3400282 3392199 3364446 3332851 3043483 3294113 2934832 3240041 2884989 3204777 3383103
14041 3383103 2826342 3036041 2934769 3197473 2927740 2984782 2621425 2558874 2820861 3110042
14031C110042m73159J06160K61772j75222J23224m68221M47495k12176k95467
14022B424448Q6135K9472k45560K90321l34382R9435J32821J7013J66043l81209
14012B284537j93053J08467J34067j38224r889j52558Q1166L61405l17536j67522
14002A990860J13401k80860j03141L41380o2474J22494N7662l12600k72308J19397
13992A713811K59565K71715M23410O57005J884302P116262J7426051J2063011
13984D1815132j1851550j4656972p066089k949133o91535q78046l05497j19942
13976C296368m24653l13978K2083j75446J12720o1436j5456r1972J64527l10164
13966B202593K97189r8164m04193L14764n77489J85294K16417l36143j08526K24125
$$ plain form
14031 3110042 2636883 2743043 3004815 2829593 2952817 2484596 2932091 2719915 2424448
14022 2424448 2510583 2540055 2294495 2584816 2250434 2349869 2482690 2499703 2665746 2284537
14012 2284537 2091484 2199951 2334018 2195794 2185905 2033347 2114513 2475918 2158382 1990860
14002 1990860 2104261 1823401 1720260 2061640 1999166 2121660 2179322 1866722 1594414 1713811
13992 1713811 1973376 2245091 2668501 3325506 5209808 12326070 29752121 41815132
13984 41815132 29963582 15306610 8240521 5291388 4599853 3721807 3416310 3296368
13976 3296368 2871715 2557737 2579820 2404374 2517094 2455658 2440202 2348230 2512757 2202593
13966 2202593 2499782 2401618 1997425 2312189 1734700 1919994 2136411 1800268 1691742 1915867
13956A915867l1706J183o9196p8587L33787l17587M6214j50333Q4637j91227J65907
13945A708959k0321K58360l13477j19627j0172K19113k3628L73109m73238R0092
13935A689170k23372k65318R01876n92650J8047j81226K70568m50328N19420J6516
13925A702703n2687l8487j03781m5445k39988K11350j58647j39970K83333L09349
13915A727730k73384N9923P2828k33497m6152r1736M9554K54344n16953L40643
13905A343300J05799k86063J62266k0602k80167M97206l16682K1001K65235m24473
13895A066820J96655P2033j25076p5725M5756n40018O17975J24577M118k97808
13885A089307K9560r5320J57951J40565l68584M42873n19517J69725J22255Q8698
$$ plain form
13956 1915867 1884161 1885344 1816148 1737561 2071348 1753761 1799975 1649642 1734279 1543052 1708959
13945 1708959 1688638 1946998 1633521 1513894 1503722 1722835 1699207 2072316 1599078 1689170
13935 1689170 1465798 1200480 2102356 1509706 1527753 1346527 1617095 1166767 1686187 1702703
13925 1702703 1650016 1611529 1507748 1462303 1222315 1433665 1275018 1135048 1418381 1727730
13915 1727730 1454346 1514269 1587097 1353600 1307448 1215712 1265266 1519610 1002657 1343300
13905 1343300 1449099 1163036 1325302 1304700 1024533 1521739 1205057 1226058 1491293 1066820
13895 1066820 1263475 1335508 1210432 1134707 1180463 640445 1258420 1382997 1387115 1089307
13885 1089307 1118867 1023547 1181498 1322063 953479 1396352 876835 1046560 1168815 1257513
13875A257513l48038L36675m46011J43243L67330j53478l14853J91452R5488Q0216
13865A209537J25378l03690K77890j08906l16925r4474L40152Q2848j15966m39090
13855F56754L91447p9333J05094J16111k19601K83448k41728L0728N3376l37818
13845G58478J01010L54480k84914K25932k23657m4769M5396k3594q423K8261K01083
13834A129283l29079K46489j9279j05699j13780q8791Q8380J45638q1194k40088
13824F31880J60997q9332Q2597J10163j0741k49686M52025n0240j25441q839J5441
13813I18824o6519l543l29309K74947J61564R7744m61668J42515K27535l47401
13803F14689J3621O1593J9311J4428M38303n17326K44252m14336N58752k50867
$$ plain form
13875 1257513 909475 1246150 800139 943382 1310712 1157234 842381 1033833 1129321 1209537
13865 1209537 1334915 1031225 1309115 1200209 883284 788810 1128962 1211810 1095844 656754
13855 656754 1048201 968868 1073962 1190073 970472 1253920 1012192 1042920 1096296 758478
13845 758478 859488 1213968 929054 1154986 931329 886560 931956 908362 899939 928200 1129283
13834 1129283 800204 1046693 1027414 921715 807935 719144 807524 953162 871968 631880
13824 631880 792877 703545 786142 896305 885564 635878 1087903 1037663 912222 903383 918824
13813 918824 852305 848762 519453 794400 955964 1053708 592040 734555 962090 614689
13803 614689 628310 689903 709214 723642 1161945 644619 888871 474535 1033287 782420
13793G82420k47231K91302r8716j78436L17702p5780j84941j7156M09269l49117
13783F49316N6296o473q6745K05146j42656j78331O23138n28312P6860p0714M9761
13772F47286m930m0010M02549m49123m1610K35539C46448J31927m4660j38418
13762B95297M57521q9950p6300j7968R7554N0202j80285L03353j47773m4235B85743
13750D76244J45576p7905k8508j06931J38992J66010J32333A46079J42094L258
13740B91431L94877B99384M58700j99070k47140M68572r3265B90255J64631n679
13730D49207m0154j33131L5577K67956m6703j21732j09904K37177j96880J63538
13720E04951o0529L03707j01762k95244k7094Q4033L3250J23826B64533N93234
$$ plain form
13793 782420 535189 826491 727775 549339 867041 791261 606320 589164 998433 649316
13783 649316 705612 699139 612394 817540 674884 496553 1119691 591379 668239 597525 647286
13772 647286 642356 602346 1004895 555772 514162 749701 346448 478375 433715 295297
13762 295297 752818 662868 586568 568600 666154 716356 536071 839424 691651 647416 285743
13750 476244 621820 543915 515407 408476 547468 713478 845811 146079 288173 291431
13740 291431 686308 299384 758084 559014 311874 780446 687181 290255 454886 449207
13730 449207 409053 275922 311499 579455 532752 411020 301116 538293 341413 504951
13720 504951 444422 748129 646367 351123 324029 408062 441312 565138 264533 857767
13710H57767l39745q6843M44360l60051j01512l8048A77387R1421R8586N66387
13700I33781C51178j54803M31219m0011l108k16956H1116L42366j23869L78246
13690F77859L0652j10636B80889L04469J10962l36246L64636k30291m9005N0431
13680D95845B38368Q33298n14139j73679j88730L41417j80479j74396B3210N81182
13670F04392l00730m4221Q5214L60889l52646J05870j74912K93733J8041K6643
13660F22273B93031l1277j03877K50241O5500K15082n0594o9760j14032J57567
13650F11881j00961q4723K26689k98355J9582L01853k22318J85607B45716O2197
13640C07913J81384m4289K6581L4875A44614K50441M5853j11648J2799K45475
$$ plain form
13710 857767 518022 431179 875539 515488 413976 375928 177387 268808 367394 933781
13700 933781 351178 196375 627594 587583 584475 367519 81116 423482 299613 677859
13690 677859 708511 597875 280889 585358 696320 360074 724710 494419 445414 495845
13680 495845 238368 1071666 557527 383848 195118 536535 356056 181660 23210 604392
13670 604392 303662 259441 344655 705544 352898 458768 283856 577589 595630 622273
13660 622273 293031 261754 157877 408118 473618 688700 638106 568346 454314 611881
13650 611881 510920 426197 652886 354531 374113 675966 453648 639255 245716 307913
13640 307913 489297 445008 471589 506464 144614 395055 440908 329260 342059 587534
13630E87534j32146K6113j11270A13685L81856B46014N6709j4863n0496L15035
13620E52399r1444m8630j04044p0111K73717K0434o4477J12992B21332K23897
13610D45229J99860A34223M89265B88511r1753R1486O7430J2538A58171K94479
13600D52650r7328K92168c6588A83854J12408K07197B37470J86515j90024K52012
13590D85973j12561c123P33F59218C21599N1758j56490O1447J71766j58620J73578
13579D65038N5784m4409o7251j04197J48736k00874J40673J56686k37732A54368
13568F74447k40082j45976n3756q4409J11127F3209J55096M76725C18256J17731
13558D35987j95459j6992n8277K2787l0849J70992o5800P0806J18985J05266k29938
$$ plain form
13630 587534 455388 481501 370231 113685 495541 246014 302723 287860 237364 552399
13620 552399 460955 412325 308281 238170 511887 532321 467844 580836 221332 445229
13610 445229 645089 134223 623488 288511 196758 288244 355674 368212 158171 452650
13600 452650 355322 647490 -36588 183854 296262 503459 237470 423985 233961 485973
13590 485973 373412 -3123 -2390 659218 321599 373357 216867 278314 450080 291460 465038
13579 465038 520822 476413 409162 304965 453701 252827 393500 550186 312454 154368
13568 674447 434365 288389 234633 150224 261351 63209 218305 695030 318256 435987
13558 435987 240528 223536 165259 188046 157197 328189 262389 333195 452180 557446 327508
13547C27508K93986A49831o6059P4446O5676n6972M2574B8585D747J74628f0414
13535A82110K47361j21732D4148L51791A95094J95040q1334A48936K59322a12223
13524A19305N8428l9178L37429k12943H2858J06495p968n6475N7015L53657c0095
13512A11515J19286J16784a279D72894k14493C1446J73260K24789G6880O11877
13502F88757k49237k14307r0878K89803j96796a36962C22612K2622l4933K19406
13492E29707k64349P067J40034p0090C5287J83701j879j07329M22563k15544o482
13481C10317J68877M7256H4857L5048J70939O1802j45018o344O2450M5774B1080
13469D36057A85870J22837H2429K01141n4880A2700K70154K21394j09161k4116
$$ plain form
13547 327508 621494 149831 83772 158218 223894 166922 209496 28585 4747 179375 -60414
13535 182110 429471 307739 44148 395939 195094 390134 308800 148936 408258 -112223
13524 119305 177733 138555 475984 263041 82858 189353 181385 124910 181925 535582 -30095
13512 111515 230801 347585 -1279 472894 258401 31446 204706 429495 76880 688757
13502 688757 439520 225213 134335 424138 227342 -136962 322612 345234 310301 529707
13492 529707 265358 272425 412459 342369 35287 218988 217109 109780 532343 316799 310317
13481 310317 479194 526450 84857 119905 290844 352646 207628 201284 263734 309508 21080
13469 436057 185870 308707 82429 283570 228690 12700 282854 504248 395087 370971
13459C70971J23689k39180k5806G7626K12242K33269l4773i3008A51981d48897
13448E0362K6411d6498C05565m3249Q0722a5411B8007J28141F8611M66078B31223
13436C54354r8025A01650L02859J09316C470J53548J36481J36785A32316K6030
13426A58346M1704m1436K59313o5784a0819C31006h9889A37833a38035C93654
13415D20549G3409L1844I887a3183B68592j00091K7072J36556g478A22807J84796
13404C07603J10015j57397l0896e7824G7590j9987j4432K03125a33298C5344K06619
13393B41963G8002a48976L9927A5090L4431J76364n6829g0510k8117A16998E7616
13381B31077l025j5287A03342n489C8060a57432E30669C909J23556j9658L69322
$$ plain form
13459 370971 494660 255480 229674 77626 289868 523137 488364 -93008 151981 -448897
13448 50362 76773 -46498 305565 262316 343038 -15411 28007 156148 68611 534689 231223
13436 354354 256329 101650 404509 513825 3470 157018 293499 430284 132316 158346
13426 158346 200050 158614 417927 352143 -10819 331006 -89889 137833 -138035 393654
13415 420549 73409 105253 9887 -13183 268592 168501 195573 332129 -7478 122807 307603
13404 307603 417618 260221 229325 -57824 77590 57603 43171 246296 -133298 35344 241963
13393 241963 78002 -148976 -109049 15090 49521 225885 169056 -70510 -98627 116998 57616
13381 231077 228052 212765 103342 97853 38060 -157432 530669 3909 127465 107807 477129
13370D77129i6995i57E9387g9080B10861E1055J21811K6477J23488J63283a8439
13358B31972r2019J15488l2502M9975R6596b56532B56699K0492M7130n958b7732
13346D12233j52329o6054A369J0549L96231F4620K34963A13144N78672G1460J71437
13335B42897C8628K69238j48523K14175A53695R5183j9104n9962k5063J11961
13325B56710f2000B21621L0597C0829J459K72188P0019R602A09125e0556B13270
13313A91740B2041c0662j13026A49333K29648e582A15347L10182A11231N7188
13303A68419b00318B59271p5255K45279B05931c0237B55202O0904e9511B67661
13292A94220b8631k1979j48575C38888g2238C04864m3637p8958A0075J88638K50314
$$ plain form
13370 477129 -96995 -957 59387 -79080 210861 51055 172866 199343 322831 486114 -18439
13358 231972 139953 255441 222939 272914 369510 -256532 256699 277191 324321 318363 -27732
13346 412233 259904 193850 1369 11918 408149 64620 299583 113144 691816 71460 242897
13335 242897 38628 307866 159343 373518 153695 248878 229774 169812 144749 256710
13325 256710 -62000 221621 252218 30829 32288 304476 374495 384097 109125 -50556 213270
13313 191740 22041 -30662 -143688 149333 378981 -5582 115347 425529 111231 168419
13303 168419 -200318 259271 184016 429295 205931 -30237 255202 316106 -59511 267661
13292 194220 -28631 -50610 -199185 338888 -72238 304864 261227 182269 10075 198713 449027
13281D49027j49986F8352P9045J44684a53950A77385a46786c9346B7211b2394
13270A26796e2529k7202B3532N20717k27167c4338A57425n3357J87932n1139A09173
13258E22237k55892i8847A38496b8121E7234f171I3682J35006A9553J2427L116
13247C5096e2794l11712C31699J1831b92544C90228b5008l3499C70266C9570K47646
13236B87216a97695B01701C1076K19257R3607A42100F2204J29314J20456r1369
13226B20605R065K02282A11652P3807c4679C36276j16696A06907L22910a22658
13215b20834C10999j15018K88070c04593B43396h651q8888A05559l7018E956M8855
13204E4811K18463A1240J31100L9120J76777c1265C41271o7780g1099D63213B04494
$$ plain form
13281 449027 299041 68352 147397 292081 -153950 177385 -146786 -39346 27211 -22394
13270 126796 -52529 -79731 23532 544249 317082 -34338 157425 104068 292000 240861 109173
13258 522237 266345 -98847 138496 -28121 57234 -6171 93682 228688 19553 31980 35096
13247 35096 -52794 -364506 331699 343530 -292544 390228 -25008 -58507 370266 39570 287216
13236 287216 -197695 201701 31076 250333 343940 142100 62204 191518 311974 220605
13226 220605 229670 431952 111652 185459 -34679 336276 219580 106907 429817 -122658
13215 -220834 310999 195981 484051 -304593 243396 -8651 -97539 105559 68541 5956 54811
13204 54811 273274 11240 142340 181460 358237 -31265 341271 273491 -71099 463213 204494
13192A52088J93241q9586H2931J1870J45818c14494f0201A27604K55944j33244
13182B50304d3125C35568j07971A12857n106i7484E4150L70175j00149A61184
13171A29037C3791n216h6821j95848K7293A82537f4488A26426G370K52784A4835
13159A39553J13343I5447a17862B97001F1370J75319B0312K84939d4826n0197
13149i5023G9910a32430k2144O1278B10253i2945A76442B8967K84952B4479g715
13137H7158b7298j94854f6431l0843A65212b45096N1197B11846a1982A76204Q7943
13126B64147R0435g5868A07305a61713B00654a60433g0150D0639K02599j1910
13116B31328e415k79374A40167B5522J29428n841M07844c4834B56570A652c4461
$$ plain form
13192 152088 345329 255743 82931 94801 240619 -314494 -60201 127604 383548 250304
13182 250304 -43125 335568 227597 112857 107751 -97484 54150 424325 324176 161184
13171 129037 33791 28575 -86821 -282669 -255376 182537 -64488 126426 7370 260154 14835
13159 139553 252896 95447 -117862 297001 61370 236689 20312 305251 -44826 -95023
13149 -95023 79910 -132430 -154574 -93296 210253 -92945 176442 28967 313919 24479 -7715
13137 87158 -27298 -222152 -66431 -97274 165212 -245096 -193899 211846 -11982 176204 264147
13126 264147 354582 -75868 107305 -161713 200654 -160433 -70150 40639 243238 231328
13116 231328 -5415 -284789 140167 25522 154950 149109 556953 -34834 256570 1652 -34461
13104b21426E5879J83325E8960b27614C6887b34627j1927G4565L33140A53617
13093A25897b94014a0789H2532l6946K26708B53K88047j41539a81373A78734J20333
13082B99067H6322L36130G4669L222A3116E427K51830A19242h0584q2231D72316
13070h2171A32726e3308B5582L5453k6968J68825H5957a35493A34576o5176L20569
13059C89969A75362G4527a68143l2185A27435O0262G5440M92326a71227B03067
13048b27915d4866D39256j30519J034d5815F0981K14864B0113c23216A79488D1431
13036E34148c0427A69490N4030o9453K81457b96935d4613q0844j60382A00158
13025A1332a41937K1972j80995B28201f1521C9645C297J76081b6131E121a02670
$$ plain form
13104 -221426 55879 239204 58960 -227614 36887 -234627 -246554 74565 407705 153617
13093 125897 -294014 -10789 82532 45586 272294 253 288300 146761 -181373 178734 299067
13082 299067 86322 422452 74669 77891 13116 5427 257257 119242 -80584 -162815 472316
13070 -82171 132726 -53308 25582 61035 34067 202892 85957 -135493 134576 69400 389969
13059 389969 175362 74527 -168143 -200328 127435 187697 75440 567766 -171227 203067
13048 -227915 -44866 439256 308737 309771 -45815 60981 275845 20113 -323216 179488 41431
13036 534148 -30427 169490 223520 154067 435524 -296935 -44613 -125457 -285839 100158
13025 11332 -141937 -119965 -300960 228201 -61521 39645 3297 179378 -26131 5121 -102670
13013C11599j12616B57L2970Q8251K93287j03028a39466A17395i5978l6487c9522
13001E741K5045c9212k0498J2082J6635n8882B53866j14927c6937k2449C70922
12989A21048e5815A5033i0924F6369c7069I3482K87974a07304K8840q7620A30666
12977I1883a49533B27250a62530D23979f2870j8389c8276j73167F1540J40336
12967B01876r4414g406C15290b21070B14762f9188C6180a04757L9178A24680a74017
12955A97464G3985K18304j42607J11568H7033O8762Q3133f7072B31372a17730
12944b74000C51987B7011b00452B64433o7057r5496b50041C0983a00586A49788
12933B12522C0909i4053c3962k16466i908j95598b8836j75376O3038A24096o279
$$ plain form
13013 311599 198983 257 33227 121478 414765 311737 -139466 117395 -95978 -132465 -39522
13001 5741 30786 -39212 -59710 -47628 -30993 -89875 253866 138939 -36937 -59386 370922
12989 121048 -55815 15033 -90924 66369 -37069 93482 381456 -107304 -78464 -166084 130666
12977 91883 -149533 227250 -162530 423979 -62870 -81259 -38276 -211443 61540 201876
12967 201876 107462 -7406 315290 -221070 214762 -69188 36180 -104757 -65579 124680 -174017
12955 197464 73985 292289 149682 261250 87033 155795 238928 -67072 231372 -117730
12944 -274000 351987 27011 -200452 264433 197376 101880 -250041 30983 -100586 149788
12933 212522 30909 -94053 -33962 -250428 -9908 -205506 -28836 -204212 -141174 124096 117817
12922A17817N1211J84153i6198J8277I8067M3182b03945A50280d5739j05353C53321
12910A03818c7928B4441a8659A2106M0740K20912A11587b9389l34676E1717P4271
12899A25988K0632J41492B5933P0057d31630A18464R9446A5288J01246a90134
12888G1994b09308j40255B14047r6365K6824B926a20018A04960L936L32275A24099
12876c0236k54953A97465Q4248b3987k0138A36676f0034G0265L0731L59689j06178
12865C54507A73957F4977b1919k2736A98924b53345B03402N6500k3561A10369
12854F7945J39595I7218f495j57401D7016k0231J05887b1463D7028e361I5718
12842H162a46474C7067d4618I5492J03049H2166k1079a51080A37052O8744a45343
$$ plain form
12922 117817 169028 353181 -96198 -77921 98067 141249 -203945 150280 -45739 -151092 353321
12910 103818 -37928 24441 -18659 12106 52846 273758 111587 -29389 -364065 51717 125988
12899 125988 146620 288112 25933 95990 -431630 118464 217910 15288 116534 -190134
12888 71994 -209308 -349563 214047 117682 144506 2926 -120018 104960 108896 441171 124099
12876 -30236 -285189 197465 281713 -23987 -44125 136676 -60034 70265 100996 460685 354507
12865 354507 173957 64977 -21919 -44655 198924 -253345 203402 259902 236341 110369
12854 67945 207540 97218 -6495 -163896 47016 26785 132672 -21463 47028 -5361 95718
12842 8162 -146474 37067 -44618 95492 198541 82166 61087 -151080 137052 205796 -145343
12830a05893d1256A651a14388A01405J49501j4324b03982Q7040A42082o3393N1238
12819A29927J39264O4951c435B30199B7733K02181a7314j58024a5666D11430A15536
12807d2857r4221E9793b54079C3069h305q407A17440a64849f3280n5236l2753
12796a51269P1489k29794J24789a9857E499N2697g2985B33899o3831a87901F2613
12784B51296A23171d75182B09294o9101h9592a8604B12502G9373a01194m7720
12774a48914r0180O6314d7083r678C43918n789A04093J96809q1352g3042A58545
12762A40641o3924l6393P2948D4616a34014d2600G5100c5643j07905f0232a4698
12750A94127d7294j75357M2429G45a52961A39202a62842C9322d7662A66971b9551
$$ plain form
12830 -105893 -41256 1651 -114388 101405 250906 236582 -203982 -116942 142082 78689 129927
12819 129927 269191 334142 -3435 230199 27733 229914 -17314 -175338 -15666 411430 115536
12807 -42857 -137078 59793 -254079 33069 -8305 -16712 117440 -164849 -63280 -118516 -151269
12796 -151269 -79780 -309574 -184785 -19857 5499 58196 -72985 233899 170068 -187901 62613
12784 251296 123171 -475182 209294 140193 -89592 -18604 212502 79373 -101194 -148914
12774 -148914 -239094 -172780 -47083 -56761 343918 338129 104093 300902 219550 -73042 158545
12762 140641 76717 40324 113272 44616 -134014 -42600 75100 -35643 -143548 -60232 -14698
12750 194127 -47294 -222651 -180222 745 -152961 139202 -162842 39322 -47662 166971 -29551
12738A73243a63548A50158e8736C510c07040A31924A3679b06643A30458b4557
12727g961F6967M00Q2155m9476J5230g9467j36492d3558j63676R1254j45608D29206
12714E1469g1744H6147J93415C1453L09131A49718i9756F389K42110j20591J1941
12703A39849m3284c8112j08391f019A52503O5833J00634A01760K17850h9111c0018
12691a84554E0790a01157B75355e0404A71721a21571c1781H787L92644A53558
12680F7990J42897J08818a66195c743C4821L90194A321a9455B4302a58385F6435
12668b0856I4786f1957l6848j6877M5457j6947D23498J07031A75397J43111d5071
12656a00053C95701D2832L1129b28862G4665a57857C02356a57283j0766F6464
$$ plain form
12738 173243 -163548 150158 -58736 3510 -307040 131924 13679 -206643 130458 -24557
12727 -7961 66967 67367 149522 100046 115276 -79467 -215959 -43558 -207234 -115980 -261588 429206
12714 51469 -71744 86147 279562 31453 340584 149718 -99756 6389 248499 127908 139849
12703 139849 96565 -38112 -146503 -6019 152503 218336 318970 101760 319610 -89111 -30018
12691 -184554 50790 -101157 275355 -50404 171721 -121571 -31781 8787 401431 153558
12680 67990 210887 319705 -166195 -3743 34821 425015 1321 -19455 24302 -158385 66435
12668 -20856 94786 -61957 -98805 -115682 -70225 -87172 423498 530529 175397 318508 -45071
12656 -100053 395701 42832 73961 -228862 74665 -157857 302356 -157283 -168049 66464
12645i503j7921j1818k21450i0884m12751A10738M2112e5852C6810L08199h4052
12633A78569c5189D674J56861K3971O2851r5104L004K47308j56789j08619l689
12622A34468E3992h896l9414n8368A44476b9834k6028F9656M2113m933B6671P1094
12610I7765P9388a8494C36604A58316f297A92980C1008N31404B17148H0238l3885
12599D6353J0185J69808J57937j1588i934B54939i2476H5493c6392j58196A85203
12587C91141j45718O9235A35636b81554I5578a6858l02823f3631B21284b1014
12576E5261a58943C305a43204M7691A30440R737a82306E087M68717j93692a89065
12564a39470f1494I8014a93133A857O5786e4030j89179a15480m3646j2363A19507
$$ plain form
12645 -9503 -27424 -39242 -260692 -90884 -503635 110738 152850 -55852 36810 345009 -84052
12633 178569 -35189 4674 161535 185506 248357 153253 156257 403565 246776 138157 134468
12622 134468 53992 -8896 -48310 -106678 144476 -29834 -55862 69656 111769 106836 26671 97765
12610 97765 177153 -18494 336604 158316 -6297 192980 31008 562412 217148 80238 46353
12599 46353 56538 226346 384283 372695 -9934 254939 -92476 85493 -36392 -194588 185203
12587 391141 245423 314658 135636 -281554 95578 -16858 -319681 -63631 221284 -21014
12576 55261 -158943 3305 -143204 -95513 130440 140177 -182306 5087 473804 280112 -189065
12564 -139470 -61494 98014 -193133 1857 67643 -54030 -243209 -115480 -159126 -171489 119507
12552B1024J57079N9964a59977J7506C51262A37313m003K87561b5304A77243b04840
12540F0696a26608o8663A23434e4578E8553f8921m8972B02122b2344m2806j98018
12529b63168c3192k70052d3823A32317C2242b11102A6712a38656C29222Q6199
12519D15421b89094B80472K5984j39073J11274j27098K1177J11712a48805J638
12509a47167A74958B9025K55287M7674b53259B43630a06968J0485H3018a94742
12498c9156C32128a08304A07501r060b45378A29411g6796n7191C12755E2787f0010
12486C34370H699J62290a51323k55500g4441g271l3525p6781B08143b8419Q94
12475b7525B23865a72786j64470J01566A56932D8205d909A7914Q6547h1077B73177
$$ plain form
12552 21024 178103 238067 -159977 -142471 351262 137313 133310 420871 -25304 177243 -204840
12540 60696 -126608 -195271 123434 -54578 58553 -68921 -117893 202122 -22344 -65150 -263168
12529 -263168 -33192 -303244 -43823 132317 32242 -211102 16712 -138656 329222 415421
12519 415421 -289094 280472 306456 167383 278657 151559 172736 284448 -148805 -147167
12509 -147167 174958 29025 284312 331986 -253259 243630 -106968 -96483 83018 -194742
12498 -39156 332128 -108304 107501 98441 -245378 129411 -76796 -133987 312755 52787 -60010
12486 334370 8699 170989 -151323 -406823 -74441 -7271 -40796 -117577 208143 -28419 -27525
12475 -27525 223865 -172786 -337256 -235690 156932 48205 -4909 17914 104461 -81077 273177
12463D3108b88771E4075b27965K2510L8893G5006J61528j725r6960e1724k7158
12452g8882G6637Q9540G6963R6029b70806I8338l3396K47805j32236O2238b08084
12440b3211k0342j33213E8795b08056B85750G4760L7545M3687d2974m2890L8984
12429d6880B30575A12546b688B24645a22766m851B49987g4376H1669J99193j33164
12418A47698J69544A20112L5408A4007b09325c8630D0498b74846F5557c9439i040
12406h1199A78531P2180a18911d7852A4137b57668N0014b9904G1670J73003J31901
12395C76574b8245o1631j58092D3062b11874A43431h5827J0189j79254A77207
12384a4058A38037l0506a48739B70627a62100A82909k4587j7297a6987H8318b94362
$$ plain form
12463 43108 -288771 54075 -227965 -205455 -166562 75006 236534 234809 137849 -51724 -78882
12452 -78882 76637 166177 76963 172992 -270806 98338 64942 312747 180511 242749 -208084
12440 -23211 -43553 -176766 58795 -208056 285750 74760 112305 155992 -42974 -85864 -46880
12429 -46880 230575 112546 -2688 224645 -122766 -127617 249987 -74376 81669 280862 147698
12418 147698 317242 120112 155520 14007 -209325 -38630 40498 -274846 65557 -39439 -9040
12406 -81199 178531 250711 -118911 -47852 14137 -257668 -207654 -29904 71670 244673 376574
12395 376574 -28245 -89876 -247968 43062 -211874 143431 -85827 -75638 -254892 177207
12384 -14058 138037 107531 -148739 270627 -162100 182909 158322 141025 -16987 88318 -294362
12372h3670f857A1091J329Q8867g6785l3139j34730J21667D2346c2827B03771
12360b18789f2345b0694l771C05a66315A4980b19332B79549p8912e5048m77689
12349e32737d5095B72226b476A76529a57571E3514a77319c7526l59215h7681C34449
12337a27008A75180F6588K9971k0674d48193I7941J10079e4568j34823j24550
12327c13941a35056m6036A69633a00194A4238J20694D1819J51393I6462c8414
12316d72934g1707p6452O009B91895I2867f0665J695j20295L6338m6271g679A6854
12303b25965B08401B7491a40988G8000K28715c1694I4862m2822h46o2023J5790
12292d7079F7634B9692A1081d1620A64195p4668b1408p0090A12955L6261Q4555
$$ plain form
12372 -83670 -6857 11091 12420 101287 -76785 -109924 -244654 -122987 42346 -32827 203771
12360 -218789 -62345 -20694 -24465 305 -166315 14980 -219332 279549 200637 -55048 -532737
12349 -532737 -45095 272226 -2476 176529 -157571 53514 -177319 -37526 -396741 -87681 334449
12337 -127008 175180 66588 96559 75885 -448193 97941 208020 -54568 -189391 -313941
12327 -313941 -135056 -181092 169633 -100194 14238 134932 41819 193212 96462 -38414
12316 -472934 -71707 -148159 -142150 291895 92867 -60665 -58970 -179265 -142927 -189198 -7679 16854
12303 -225965 208401 27491 -140988 78000 306715 -31694 94862 52040 -846 -62869 -47079
12292 -47079 67634 29692 11081 -41620 164195 89527 -21408 -91498 112955 149216 233771
12281B33771H9607a51583M8039B00456K66898A44787m5809r519b767B01619j00652
12270A00967a40188G7685J38534b6683q7223C6251a63767A74945c04291A6128
12259B1749c3504B09226b319k65695A38118a86262D5592C669J94338E9286a24718
12247A31151O0962p2831C8407K98328j43458d09495E8317F740a31672D7611j8378
12236B9233J27189k8907b99705E69201h7853n5311B45672j12745j2877D4177N2085
12225I6262O6782F3527K12196c41143c9460A23465j1634A9925J06364K36611j74664
12214A88236a02392A17033a60592L7108C63704c1394A24632Q486K69900A89708
12203C27419a33748C86834A75584B515e786A95507r3801a2334A22530K07756L7023
$$ plain form
12281 233771 89607 -151583 -103544 200456 467354 144787 98978 89459 -2767 201619 100967
12270 100967 -140188 77685 216219 -26683 -113906 36251 -163767 174945 -304291 16128
12259 21749 -33504 209226 -2319 -268014 138118 -186262 45592 3669 198007 59286 -124718
12247 131151 192113 119282 38407 336735 193277 -409495 58317 6740 -131672 47611 29233
12236 29233 156422 127515 -299705 569201 -87853 -143164 245672 132927 120050 44177 96262
12225 96262 163044 63527 275723 -341143 -39460 123465 111831 19925 126289 362900 188236
12214 188236 -102392 117033 -160592 -123484 363704 -31394 124632 133118 403018 189708
12203 327419 -133748 386834 175584 2515 -5786 195507 101706 -12334 122530 330286 367309
12192C67309j61662a8783B87911j26464a47399D3708Q5501k8253b77742J34106
12182a43636a1179n3587H3075a261B5993J04045b26774i5871a381C85418j64903
12171B20515b2177D68376A42452a06041i600A91903r4454a0520C3478K34981f2490
12159A71476a9780q4159F5878A6959K26516p3192g8750b1854C60674j51809b13314
12147b50662D3866b10002I0831c2638A6338h6957C03828g2376l6034q7915A24011
12135B69414b62476a3372o3660B22728j06170b84120c7758G2193g5313A55244
12124A94152K52440c9699k1253C12830a31856D9034J2191d4365o9032o3069g289
12112C73872j17954a85642B37482j11663L39566D4302a82313c672A0517J13027
$$ plain form
12192 367309 205647 -18783 287911 161447 -147399 43708 129209 100956 -277742 -143636
12182 -143636 -11179 -64766 83075 -1261 25993 130038 -226774 -95871 -1381 385418 220515
12171 220515 -22177 468376 142452 -106041 -9600 191903 97449 -10520 33478 268459 -62490
12159 171476 -19780 -103939 65878 16959 243475 170283 -78750 -21854 360674 208865 -213314
12147 -250662 43866 -210002 90831 -32638 16338 -86957 303828 -72376 -108410 -196325 124011
12135 269414 -262476 -13372 -77032 222728 116558 -284120 -37758 72193 -75313 155244
12124 194152 446592 -39699 -60952 312830 -131856 49034 61225 -44365 -113397 -176466 -7289
12112 373872 255918 -185642 237482 125819 465385 44302 -182313 -3672 10517 123544
12102A23544f702G0603R6248f3110p6763N7467F2803h6393c563k82298B11547
12090d1804E8817j7224a40997k46997H310K97271f9821C543K97315m2368N0689
12079C09179F9891M2853a96655A51190C0384g2275j69528C79130E3924f223k61731
12068b67954A257f5832l7614F0472b27786m6419O4152D66100J70709M59663j77869
12057I18603C11757A5512a63n7268F0915f6588r9638C30417g1626B24553H7734
12045b62243J27249b1509j38833B17913h1557C11153a17642K3842j15739R6989
12035a12550d632l1423k3849A529N7191K48028c23166C12948A20777c5865i913
12023I5006a8435D06292d1568C7629J46784a50321j50162C00312a05709H2175
$$ plain form
12102 123544 -6702 70603 166851 -63110 -139873 -82406 62803 -86393 -3563 -285861 211547
12090 -41804 58817 41593 -140997 -387994 8310 305581 -69821 3543 300858 258490 309179
12079 309179 69891 112744 -196655 151190 30384 -72275 -241803 379130 53924 -6223 -267954
12068 -267954 1257 -65832 -103446 60472 -227786 -274205 -210053 466100 636809 1096472 918603
12057 918603 311757 15512 -163 -57431 60915 -66588 -166226 330417 -71626 224553 87734
12045 -262243 -134994 -21509 -160342 217913 -81557 311153 -117642 -93800 -209539 -112550
12035 -112550 -4632 -36055 -59904 1529 58720 306748 -323166 312948 120777 -35865 -9913
12023 95006 -18435 406292 -41568 37629 184413 -150321 -300483 300312 -105709 82175
12012b46602B14164e9338A75437b03428B40725a40760b1910A20147q180L3577
12002A45544g7964A57180b87102B97562c3578A00139J07936b4571F73738H0945
11991G6448d48220E5911b20644c06n3383r0935E8926L5781b14641Q5752c0314
11979g6155A83264a44379j70264A28082a8162k88121a00450C25936c6299q8011
11969a24310G0554b37492f2703G0818g511l56437G9140J15933f4271l65016C1296
11957b2546A31134a77321g7735k11507C92049a38709A45275b05089A14572a00572
11946H540a44252r1470C27419I76L13028a44200A09106R376a67072A95613k8521
11935A67092k8673A1421b2639A8846f0818b9660C2260K79862c5134B756b88363
$$ plain form
12012 -246602 214164 -59338 175437 -203428 240725 -140760 -21910 120147 111967 145544
12002 145544 -77964 157180 -287102 297562 -33578 100139 208075 -24571 673738 80945
11991 76448 -448220 55911 -220644 -306 -53689 -144624 58926 94707 -214641 -128889 -30314
11979 -76155 183264 -144379 -314643 128082 -18162 -306283 -100450 325936 -36299 -124310
11969 -124310 70554 -237492 -62703 70818 -7511 -363948 79140 195073 -64271 -429287 31296
11957 -22546 131134 -177321 -77735 -289242 392049 -138709 145275 -205089 114572 -100572
11946 8540 -144252 -235722 327419 976 314004 -144200 109106 118482 -167072 195613 167092
11935 167092 138419 11421 -22639 18846 -60818 -29660 32260 312122 -35134 2756 -288363
11923a8516j31531L1647A04113d89139c7019C3005b28222A6749J66528C4622a69662
11911g7068b2957n6421k62426A4679K30007r3020k7754f9613k0095b4820o0650
11900h5470D0665J21267a98470O5643k63245D9462a61450M4555j22592B11088
11889g4773j36443a70E0919K20854n2961a57055p9413K4635A83997a98600A01617
11877g0516N150A01007a61570M1272j56836b1907k70444J16803g5882A41854E3094
11865C3249b09126i7205j59592J25224o8115B4292J82820b25455R8616E9551B1366
11853A58609a94952o9241B61461b00099A27133g8760m6847A41437a65301J2540
11843a52761K6835a5175j67454j96948c4493F4435f5743C10064p84d40611G4685
$$ plain form
11923 -18516 -150047 -118400 104113 -489139 -37019 33005 -228222 16749 183277 34622 -169662
11911 -77068 -22957 -79378 -341804 14679 244686 151666 123912 -69613 -89708 -24820 -85470
11900 -85470 40665 161932 -198470 -132827 -396072 49462 -161450 -116895 -239487 211088
11889 -74773 -211216 -170 50919 271773 218812 -157055 -236468 -211833 183997 -198600 101617
11877 -70516 -65366 101007 -161570 -120298 -277134 -21907 -292351 -175548 -75882 141854 53094
11865 33249 -209126 -97205 -256797 -131573 -199688 24292 207112 -225455 -126839 59551 21366
11853 158609 -194952 -264193 261461 -200099 127133 -78760 -125607 141437 -165301 -152761
11843 -152761 -125926 -15175 -182629 -379577 -34493 64435 -65743 310064 309280 -440611 74685
11831f4260D1358K18886q2620a52963A9926a16204p4871C1268M7140b12912e0685
11819A87868a1569k67995j16558H2545a22448b2025H7074B2475K34941d8655J4460
11808c4195k1560a9374j34200A45104f5056F2252J43654c1476A51741b09711G8489
11796d2905k38581B08493K26826a5647k8895C02361l5714d2168B85667r3921b29598
11784g5213F442c53446F8966L9795a60012f5299A99427a42127A91804a6066q6486
11773a02552I2828D2701a99211d8562A63251c5129l78842A58073b6832j15163
11763a41995M6934j328M0987o09118A86637b57885B03550a77986B70220F8727
11752A1619M572c47480G068a4130l27354A07528c33398P1931C59050e9801B28950
$$ plain form
11831 -64260 41358 260244 177624 -152963 19926 -116204 -191075 31268 78408 -212912 -50685
11819 187868 -11569 -279564 -396122 82545 -122448 -22025 87074 22475 257416 -48655 -34195
11808 -34195 -55755 -19374 -153574 145104 -65056 62252 205906 -31476 151741 -209711 78489
11796 -42905 -281486 208493 435319 -15647 -44542 302361 266647 -42168 285667 191746 -229598
11784 -75213 6442 -353446 68966 108761 -160012 -65299 199427 -142127 191804 -16066 -102552
11773 -102552 92828 42701 -199211 -48562 163251 -35129 -413971 158073 -26832 -141995
11763 -141995 -95061 -96389 -55402 -664520 186637 -257885 203550 -177986 270220 68727
11752 11619 16191 -347480 7068 -14130 -341484 107528 -333398 -261467 359050 -59801 228950
11740g2578C65928b20454C2078J72819o8814J56724a02812A7418J40947b54155
11729B14182p4856a92237A28830a08537j52368H5742b68714J09065A73662F5811
11718A24387i3130I9471a65463f9392G7789h3002I391d0908m7405q2568A62535
11706c3126G4213b5747a0321H3596h2797A44628h6072k4104a3369E9595k4052
11695C5543e8333p8012O4557K4764r2124F8506J06717p6743i8440A38981K17300
11684C56281c12089a20850A77934b85579J25378j13724J11541I5531B3074f8762
11673b01084R4353A86057A8702K82772a39768j94343E0286M49926d9593p8984
11663a28577k8562c0950A28301b22966g5870k37793h376C90301B5025b33326P6588
$$ plain form
11740 -72578 365928 -220454 32078 204897 136083 292807 -102812 17418 158365 -254155
11729 214182 139326 -192237 128830 -108537 -260905 85742 -268714 -159649 173662 65811
11718 124387 -93130 99471 -165463 -69392 77789 -83002 9391 -40908 -88313 -170881 162535
11706 -33126 74213 -25747 -10321 83596 -82797 144628 -86072 -110176 -13369 59595 35543
11695 35543 -58333 -136345 -71788 -47024 -139148 68506 175223 98480 -98440 138981 356281
11684 356281 -312089 -120850 177934 -285579 -160201 -273925 -162384 95531 23074 -68762
11673 -201084 -106731 186057 18702 301474 -139768 -334111 50286 500212 -49593 -128577
11663 -128577 -157139 -30950 128301 -222966 -75870 -313663 -8376 390301 25025 -233326 -156738
11652a56738k9843h7923k06547j7036G0812a35882q2358b4579A72945D7524Q2565
11641A30089b23592A84151E5691a8181l419m0236n5736a0657l15232F0577b37276
11629a8210j15554A25926J83139E4982b92814F498N0863Q4312f1769a6685A728
11617a72091H3476b3176j89174P8885K339B85787A11242k1543a0134B42166a56699
11605C29360a54290D8602i1257j9245a713m0411a952B00744f4701j00484A25961
11593C9390Q5854b4658b123j48968B13150p8771K00095c22367J51864A15374C6303
11581A25581h137j43825A006g5975k13233R8698A62190M7223a0336C0285K64837
11570B95122b88769A09J13026J76965j18815g8254I8700m6442M5726K07749r7745
$$ plain form
11652 -156738 -186581 -87923 -294470 -311506 70812 -135882 -218240 -24579 172945 47524 130089
11641 130089 -223592 184151 55691 -18181 -21600 -61836 -117572 -10657 -325889 60577 -237276
11629 -18210 -133764 125926 309065 54982 -292814 6498 57361 141673 -61769 -16685 1728
11617 -172091 83476 -23176 -212350 -133465 -131126 285787 111242 89699 -10134 242166 -156699
11605 329360 -154290 48602 -91257 -110502 -1713 -42124 -1952 200744 -64701 -165185 125961
11593 39390 125244 -24658 -2123 -151091 213150 134379 334474 -322367 -170503 115374 36303
11581 125581 -8137 -151962 1006 -75975 -289208 -190510 162190 209413 -10336 30285 295122
11570 295122 -288769 109 113135 290100 171285 -78254 98700 52258 97984 305733 207988
11559B07988A2765P6976a13857H385Q9835d2826q1808k40170B587L07719a24784
11547c6533n1573j36596A80347E706e5055k97300I0104C9772R1432g1350l18434
11536c89784a53102A97544A4963O8655a26492C44158c00708L9545F3716e7500
11525a59394L5782A73533h5375I0287J4785k425a97964e1437A78536j0804F9071
11513b57243e4781H3180p034Q8997b76748A35230c3226D19903d0899C27946A61679
11501A38042k310K33648a02580B4970K98634B5939J26991o5417Q9291H1043a75983
11489g4663B13341a34978e1015F1660O3516E6272a23900M2251L0661B12254B0955
11477b777A75266a38177A41137K09801j21222Q413p798B4116J71613E0048M27459
$$ plain form
11559 207988 12765 89741 -113857 8385 98220 -42826 -124634 -364804 2587 310306 -124784
11547 -36533 -88106 -224702 180347 5706 -55055 -352355 90104 39772 131204 -71350 -389784
11536 -389784 -153102 197544 14963 83618 -126492 344158 -300708 -261163 63716 -57500
11525 -159394 -123612 173533 -85375 90287 105072 102647 -197964 -51437 178536 167732 69071
11513 -257243 -54781 83180 76146 165143 -276748 135230 -33226 419903 -40899 327946 161679
11501 138042 135732 369380 -102580 24970 323604 25939 152930 87513 176804 81043 -175983
11489 -74663 213341 -134978 -51015 61660 125176 56272 -123900 -81649 -50988 212254 20955
11477 -2777 175266 -138177 141137 350938 229716 238129 230331 24116 195729 50048 477507
11466D77507H706M0245a2429C6872J11533a13412A99219P1424a11999B18936E5548
11454g1723I1456M3590L07504a46049C42933L8469d4751e315l33851a52410C248
11442a36687A15590J44936P1483a07692A98824I3190f8290A87674d6216F981M3270
11431E0251g1813A21899k2419i055G443a28509D4323r520K05015b0429j23685
11420a44114A66672a6245p3685k6121E4029g4535q7669D4801e7315K7711B78223
11408b20677a3971k61959B8189b17018e7735B52271H5127d6181a9510B48525A5501
11396f8354E6100c66075O1683a51394A83a36527D8420K10194M6170E5858K9601
11385H5459h9843k85878K3064B63205j20488b7249G4927l5513c3854A55571b68450
$$ plain form
11466 477507 8706 48951 -12429 36872 148405 -113412 199219 270643 -111999 218936 55548
11454 -71723 91456 135046 442550 -146049 342933 381402 -44751 -5315 -339166 -152410 3248
11442 -136687 115590 260526 332009 -107692 198824 93190 -68290 187674 -46216 6981 50251
11431 50251 -71813 121899 99480 -9055 7443 -128509 44323 34803 239818 -20429 -144114
11420 -144114 166672 -16245 -89930 -116051 54029 -74535 -162204 44801 -57315 -29604 278223
11408 -220677 -13971 -275930 28189 -217018 -57735 252271 85127 -46181 -19510 248525 15501
11396 -68354 56100 -366075 -304392 -151394 183 -136527 48420 258614 304784 55858 85459
11385 85459 -89843 -375721 -352657 263205 142717 -27249 74927 39414 -33854 155571 -268450
11373b99203A59175C3456a96720H7624M2101J95601j21415a13246n5141B2393
11362E0936J22365J16658j02524N265B5026E241h7276B19854f6871n7479p8524
11351b02874E510b13016A48199k8049a91008h4016C12450b10619A51387k9900
11341A21487b82444I0561i414j32995L9103C43543r7327a5861j54594H1328a14421
11329C13222a01342A33073C7063c00107a37917J774A21894K9915p5193a63876
11318B81368c3010A5394f0039C11530a98108A62195a14126a0096r8282j25760
11308b34138B7959c24439D11209j2622j44047f9773a4566j10742M2648k34667
11298c17327J5766h7j54862B06486D9982K07697r9971A1688a30533C24262q9843
$$ plain form
11373 -299203 159175 33456 -196720 87624 129725 325326 203911 -113246 -168387 22393
11362 50936 173301 289959 187435 192700 25026 5241 -87276 219854 -66871 -124350 -202874
11351 -202874 5510 -213016 148199 120150 -191008 -84016 312450 -210619 151387 121487
11341 121487 -282444 90561 -9414 -142409 -103306 343543 246216 -15861 -170455 81328 -114421
11329 313222 -101342 133073 37063 -300107 -137917 -136143 121894 151809 76616 -163876
11318 281368 -33010 15394 -60039 311530 -198108 162195 -114126 -10096 -108378 -234138
11308 -234138 27959 -324439 411209 398587 254540 -69773 -14566 -125308 -82660 -317327
11298 -317327 -301561 -87 -154949 206486 49982 257679 157708 11688 -130533 324262 234419
11287B34419c49581i236B0570c6220C63361C1957c38806f8084G7651J40867i5640
11275A88151I54a5635k50803M7649j33376a36116f2614j21626p9925a31618B3857
11263d29948A45528a29431j66368f8094B37900a61493K0615j41868m229Q0935
11253b06040e4319j67367f950B11110j04892g1618A08105g3479j86518A00044
11242a23126j28405p1001A52620o2870b26204E8696g9265m8062B25221i7008c3067
11230g6845A20461D344a45145C60719a08930E5161b02394H4949a48083A37660
11219a44434b5247r1360B5561J12095b50626C8317b37296A36473a83141L9064
11209a44077A4761K12651c7662j82180H0392i6062r8381G2837M2757h5510j68738
$$ plain form
11287 234419 -349581 -9236 20570 -36220 363361 31957 -338806 -68084 77651 218518 -95640
11275 188151 954 -15635 -266438 -218789 -352165 -136116 -62614 -184240 -264165 -131618 23857
11263 -429948 145528 -129431 -295799 -68094 237900 -161493 -140878 -282746 -286975 -206040
11253 -206040 -54319 -221686 -6950 211110 106218 -71618 108105 -73479 -259997 100044
11242 -123126 -251531 -322532 152620 89750 -226204 58696 -79265 -127327 225221 -97008 -33067
11230 -76845 120461 4344 -145145 360719 -108930 55161 -202394 84949 -148083 137660
11219 -144434 -25247 -116607 25561 137656 -250626 38317 -237296 136473 -183141 -144077
11209 -144077 14761 227412 -37662 -219842 80392 -96062 -194443 72837 115594 -85510 -254248
11198b54248E0588J1807c0728B34641i171B7995c3159A74647f8637j21058j03093
11187b92788e8058A3387K73210e6196A12253b32180L5617A66657a85001a4701
11176a90605A75465e2647j14929B15347B6078o425a90692L6935A38716E5560J83345
11165B38905a55602c4372n4751k17151i5812C91417A59980J59045F5704a2377
11154a60930F6067K0163K09603e8892l8830D9067K3336N9791O8196m7812c59700
11142A2323M11592a81620A34691O8535J9459A4505c42181f1550I1122K3675D2673
11130a38806A89147G2676b93329J8690K1551Q99I5782k8641C1340K7911a73692
11118C33248j58525A9718b34645B34759B2663J13108N0512Q9178c03081C6126
$$ plain form
11198 -254248 50588 62395 -30728 234641 -9171 27995 -33159 174647 -68637 -189695 -292788
11187 -292788 -58058 13387 286597 -56196 112253 -232180 -196563 166657 -185001 -14701
11176 -190605 175465 -52647 -167576 215347 26078 19653 -190692 -153757 138716 55560 238905
11165 238905 -155602 -34372 -89123 -306274 -95812 391417 159980 319025 65704 -12377
11154 -160930 66067 86230 295833 -58892 -97722 49067 72403 132194 200390 152578 -359700
11142 12323 423915 -181620 134691 203226 222685 14505 -342181 -61550 91122 114797 42673
11130 -138806 189147 72676 -293329 -274639 -253088 -252189 95782 67141 31340 59251 -173692
11118 333248 174723 19718 -234645 234759 22663 135771 186283 275461 -303081 36126
11107C71082i6534C94462E0669M39018b99599C3554K58762K1729I8048K00647
11097B98695C1372L70835m3326j59507q5809Q5814I2755K42701a9212A71832M22430
11086E94262B08284n1743a09051J4528A85329J6412J40764A22678k3830K85463
11076C84311A78262K69832B15506n4713D4702e3008A17710K86281J6248L0248
11066D50487n6201m2197j28072Q1974K8388J80616k34051o0520K86794J7398K05808
11055G30424B62384L39170A23403L46518M23398j22583j08627N295P609p9423
11045E95590m5897L66870J08844D49897N84527l21041J20479r1567P5292k38576
11035E79011P0921j20674J10650J40731k91108J5202k3369J07165R7580J22725
$$ plain form
11107 371082 -96534 394462 50669 489687 -299599 33554 292316 314045 98048 298695
11097 298695 31372 402207 358881 199374 113565 199379 92755 335456 -19212 171832 594262
11086 594262 208284 156541 -109051 -94523 185329 201741 342505 122678 98848 384311
11076 384311 178262 448094 215506 160793 44702 -53008 117710 403991 420239 450487
11066 450487 394286 352089 224017 305991 334379 514995 280944 220424 507218 524616 730424
11055 730424 262384 601554 123403 469921 893319 770736 662109 667404 675013 595590
11045 595590 549693 916563 1025407 449897 1034424 713383 833862 742295 817587 579011
11035 579011 649932 529258 639908 780639 489531 504733 481364 588529 686109 808834
11025H08834j16273J05848l79363K75733K89577j94617j28582O5548j14979k09624
11015D02102k4170J58800j92744J55354J50207J0744j79703O1492K13831k42278
11005E13635B50787J66379J86163k9503R3250j99376K11374B75960L1466M50964
10995G58390n6226k15881m4284L19833p9136k7954J84137k74577j09623K04784
10985F59463L1778J72687j26687J49014K55198j62227J86704L9053n9998K52627
10975A397612M76517K01371M36476j03554J91044k03494N6448k39001R6136m20586
10965A888969O306m49186m0696k43008K02963o67534P3967J83283q8579j51365
10955G15120M2222l42330M3231m1144K95450l00191F5467L02812g4240A81933
$$ plain form
11025 808834 692561 798409 419046 694779 984356 789739 661157 726705 611726 402102
11015 402102 377932 536732 343988 499342 649549 660293 480590 542082 755913 513635
11005 513635 250787 417166 603329 573826 667076 467700 679074 275960 307426 758390
10995 758390 702164 486283 441999 761832 682696 654742 838879 564302 454679 659463
10985 659463 691241 863928 737241 886255 1141453 979226 1165930 1204983 1144985 1397612
10975 1397612 1874129 2075500 2511976 2408422 2599466 2395972 2452420 2213419 2309555 1888969
10965 1888969 1895275 1446089 1405393 1162385 1365348 697814 771781 955064 866485 715120
10955 715120 757342 415012 458243 417099 712549 412358 65467 368279 -74240 181933
10944C68813A10363J95454c4588A18203E8830L4121L4337a03929I5405c5081B38163
10932B50778q0055A4287e4398C53759E5284K71389a50414G5153o123c284C10156
10920c26971G5530i7649j51450i9620l48444A38401g385j90286A0136M0092d2367
10908B55386D7876h3304l2086B50039a11810B2048a55757A05826d5214j17144
10898a62358A94768a5073B0664R5108b50152c8475A73324d26921d3726o8057J7216
10887i4567p563j71398E627a41540A88459a7690C4451C026P180e5734j04010M982
10875a54762M256B38609O3703a10403E3655k2109b73118E6791b2752k22623e3337
10863e4704H0319K86779d2890B351J47350A2599J01534a99428f3076C23624a40258
$$ plain form
10944 368813 110363 305817 -34588 118203 58830 92951 127288 -103929 95405 -35081 238163
10932 250778 170723 14287 -54398 353759 55284 326673 -150414 75153 69030 -3284 310156
10920 -326971 75530 -97649 -249099 -99620 -448064 138401 -7385 -197671 10136 50228 -42367
10908 255386 47876 -83304 -115390 250039 -111810 22048 -155757 105826 -45214 -162358
10898 -162358 194768 -15073 20664 115772 -250152 -38475 173324 -426921 -43726 -111783 -94567
10887 -94567 -102130 -273528 5627 -141540 188459 -17690 34451 3026 10206 -55734 -159744 -154762
10875 -154762 -150506 238609 302312 -110403 53655 31546 -273118 56791 -22752 -245375 -53337
10863 -54704 80319 367098 -42890 2351 149701 12599 114133 -199428 -63076 323624 -140258
10851A30758a92167j40891g4999B12958L09117A98814J10884m0280a426A83772
10840H6645k1765L85248B04210c1386I4028K03368D5219a75192A55971a30967
10829e853B8184d9170j2768k11119H1680a88885H8500g1036k41160b1284d334
10817d86843b29770B0395i9396j15996F4410A4058O3291k9728d4405j69076A34899
10805B9983f5584p427B07738b38263J01504N6321I5138i1188l11305g5600o6061
10794a41661L8165A12787Q7555A8670h8764n5460E9122c53627a6542k44734k6406
10783b87682a30486j3686k27156C73718b52237i0383l88624g0963a1251m8532
10773e9783d216l72573J81088k5620a01855I7835K45031A08289d13361a79573
$$ plain form
10851 130758 -192167 -333058 -74999 212958 522075 198814 309698 269418 -1426 183772
10840 86645 64880 450128 204210 -31386 94028 297396 45219 -175192 155971 -130967
10829 -5853 28184 -49170 -61938 -273057 81680 -188885 88500 -71036 -312196 -21284 -4334
10817 -486843 -229770 20395 -99396 -215392 64410 14058 77349 47621 -44405 -213481 134899
10805 29983 -65584 -73011 207738 -238263 -136759 -80438 95138 -91188 -402493 -75600 -141661
10794 -141661 -103496 112787 200342 18670 -88764 -144224 59122 -353627 -16542 -261276 -287682
10783 -287682 -130486 -144172 -371328 373718 -252237 -90383 -479007 -70963 -11251 -59783
10773 -59783 -4216 -376789 -195701 -221321 -101855 97835 342866 108289 -413361 -179573
10762b93926K1803b7320N452D7317L29408B5869i5396k49684B25384a52820I6720
10750a51286j03133A7345b69869B49995a57936A01165a65430h2204B45232a60614
10739A78971d21050A40068b17020B90288b66353j68148A235a6936j72132P90I5289
10727b57294A61384N8195e8811p3011N8638j946k5522d7356B70144a13126j59617
10716b72743i3893k3143K4087B07019j02448C710b3711r96k32045O9433I7588
10704b20955F2347b02214H860e9910E6483E210R5844O616J03797c27532I8355
10692a53399j29643a00753G5721f489j40027r0029J05958M2147m6931E0421c53255
10680a91770N7734G1016J47691d5034r0424O5541B17840H6770a46337C0279h8223
$$ plain form
10762 -293926 -272123 -27320 -21868 47317 376725 25869 -95396 -345080 225384 -152820 96720
10750 -151286 -254419 17345 -269869 249995 -157936 101165 -165430 -82204 245232 -160614
10739 178971 -421050 140068 -217020 290288 -266353 -434501 1235 -16936 -189068 -188278 95289
10727 -257294 161384 219579 -58811 -131822 -73184 -75130 -100652 -47356 270144 -113126 -272743
10716 -272743 -93893 -117036 -92949 207019 104571 3710 -23711 -24707 -256752 -187319 97588
10704 -220955 62347 -202214 8860 -59910 56483 5210 101054 107670 211467 -327532 98355
10692 -153399 -283042 -100753 75721 -6489 -146516 -236545 -130587 -88440 -135371 50421 -353255
10680 -191770 -134036 71016 218707 -45034 -135458 -69917 217840 86770 -146337 30279 -88223
10668A51859d6697j60003Q5651L1659k23460C30733I2444a03872M0274B3382j003
10657B2379Q0121J48086b92474P5826D3762b94758H3144c7629B91967j01282H4032
10645a0668A63353c5119A07370b83331f6139l18488E3508J66031a9229C1683O2578
10634I4261c367C9481a7108q9833f604I412A523a25432A34352l3255j1403l716
10622H5978a77878a9080j84478E7251h0528P632q7825g783j54370j50103J33264
10611a78992K9594d2039m645H9161c00028J18294e8073B94149a8035j23261c7838
10599c6886B78366b58272A19542c30894J52728C10697b2461o3975r4360B1337
10588c36767a26487A65391a96661h1277p8241H8725a9775A04104C1487b4847j94462
$$ plain form
10668 151859 -46697 -206700 -121049 -89390 -312850 330733 92444 -103872 -63598 23382 22379
10657 22379 102500 250586 -292474 -216648 43762 -294758 83144 -37629 291967 190685 84032
10645 -10668 163353 -35119 107370 -283331 -66139 -384627 53508 219539 -19229 31683 94261
10634 94261 -3367 39481 -17108 -106941 -6604 9412 1523 -125432 134352 101097 89694 85978
10622 85978 -177878 -19080 -203558 57251 -80528 -72896 -160721 -7783 -162153 -312256 -178992
10611 -178992 -149398 -42039 -46684 89161 -300028 -181734 -58073 294149 -18035 -141296 -37838
10599 -36886 278366 -258272 119542 -330894 -178166 310697 -22461 -86436 -180796 21337
10588 -336767 -126487 165391 -196661 -81277 -159518 88725 -19775 104104 31487 -24847 -219309
10577b19309a7986q3438p7345A34638b52829l77076a2402q1645A09743a06274
10566b1730A0725J52291a15326B00864a43443E3854d76761D3343j5074D384a15889
10554A04835Q0707a06363B03975g6716j07188Q4362l12335J72368B51830E1000
10543B5550c87793B22623f5836b2733C46122a21649D3208f13996b45388m7051
10533b92439A44493e9598l23580l09107A48161a88631O7741I8809C7937d6413
10522b55712a05326H7455i3164C34342F5621b22930B88725d48452g3038A10545
10511a23607j09745N3897k31541H3612H527g8482o5357b0580k23228r9347k4698
10500c67853C74923E245Q5996J9284A8884b02512O9620j04183A10892b6438r8645
$$ plain form
10577 -219309 -17986 -101424 -178769 134638 -252829 -629905 -12402 -94047 109743 -106274
10566 -21730 10725 163016 -115326 200864 -143443 53854 -476761 43343 28269 4384 -115889
10554 104835 185542 -106363 203975 -76716 -183904 -99542 -411877 -239509 251830 51000
10543 25550 -387793 222623 -65836 -22733 346122 -121649 43208 -613996 -245388 -292439
10533 -292439 144493 -59598 -383178 -692285 148161 -188631 -120890 98809 37937 -46413
10522 -255712 -105326 87455 -93164 334342 65621 -222930 288725 -448452 -73038 110545
10511 -123607 -233352 -179455 -410996 83612 8527 -78482 -143839 -20580 -243808 -343155 -367853
10500 -367853 374923 5245 91241 110525 18884 -202512 -132892 -237075 110892 -26438 -125083
10489a25083j67764I713K67219b47694B01646g591j59315e4289D1864K27071b42824
10477c79372B25645A9772R8462J62086B4642i9854Q754E9178R8223A7570c38232
10465b7516B0229P4202L6283h1722C412J0912h7572A60471K07747F230a65425
10453g0693j20441e3589r4708E1458L09920j22717h455B26368j0591a9831A84013
10441D41389A54905a89242E3241K96673j17159J22703i7471B8423L39097b5038
10430g3935B0947K84851e2816p9453j37949H3372a93062j23925A7246a65224A08589
10418C6965R4523b04454F8140C2958J23943e118l92028D065O9677K91058i8864
10406h7965k61840A85408o9950K56466a6268r7952j90393a01895D78586j36979
$$ plain form
10489 -125083 -292847 9713 276932 -247694 201646 -7591 -166906 -54289 41864 268935 -242824
10477 -379372 225645 19772 118234 280320 24642 -99854 -91100 59178 157401 17570 -338232
10465 -27516 20229 94431 130714 -81722 3412 14324 -87572 160471 368218 6230 -165425
10453 -70693 -191134 -53589 -148297 51458 361378 238661 -8455 226368 215777 -19831 184013
10441 441389 154905 -189242 53241 349914 232755 355458 -97471 28423 367520 -25038
10430 -73935 20947 305798 -52816 -132269 -270218 83372 -193062 -316987 17246 -165224 108589
10418 36965 131488 -204454 68140 32958 156901 -5118 -397146 4065 73742 364800 -98864
10406 -87965 -349805 185408 115458 371924 -16268 -114220 -304613 -101895 478586 341607
10396C41607j32155K21366h9959E3460L4368p260J35044A04076J87017j6352A09486
10384B9761K46685H9221K54778j51171Q0613a35237c8261C106J21806E7015K63153
10373C20168R3300k01447K00890b9268B57461J66702j28988L9778n1138K59915
10363E43730k25021J66861k05535J06240A49723J94463B2883a12750A22867J55920
10353B78787J85667A55763J43795N8175Q9351j41072k4447R830n5883c5007E0733
10341B67862d470m8753A21023h8457H7102Q3341n608R9118a92922A88034F5843
10329B69762c4817j02062e6191a848A4216K29099a09481C23849A42591F2710Q6903
10318A49613A2857a12937j5992N2959C9469O7564b07197J3174f4211A4459e0840
$$ plain form
10396 341607 209452 430818 -89959 53460 87828 80568 215612 104076 291093 274741 109486
10384 29761 276446 89221 343999 192828 273441 -135237 -38261 3106 124912 57015 320168
10373 320168 413468 212021 412911 -29268 257461 424163 295175 334953 283815 543730
10363 543730 318709 485570 280035 386275 149723 344186 22883 -112750 122867 278787
10353 278787 464454 155763 299558 357733 447084 306012 281565 291395 235512 -35007 50733
10341 267862 -4470 -53223 121023 -88457 87102 170443 164835 263953 -192922 188034 65843
10329 269762 -34817 -136879 -56191 -1848 14216 243315 -109481 323849 142591 62710 149613
10318 149613 12857 -112937 -128929 -75970 39469 107033 -207197 -194023 -64211 14459 -50840
10306I4750a79971B0723a56038d7105n5583B66903a07766b1298C61048j69917
10296A91131e422A63613a28552r1846j66343J02352a24324I2918C9253d5829A62255
10284h117B90686C9341K2709b30907A10024b21837d0701k38122J23698A90016
10273G7891K81005j44019L8753q8272N6823k9402l0703a83958A90470n4055a24153
10261h1724K9621C02723b9145B54972o7387F6662c8256B00356c2315B11136m1844
10250A69292b50765M5389M4123B22195c33011b1028G4691a06196d8865j68875
10240b17740h4287A17809j3566e6589A31384b11401R9307H6404a02594B92316
10229I1274Q354c5575k15953J08151A83766A2272b14611D9331P864a31980k58958
$$ plain form
10306 94750 -179971 20723 -156038 -47105 -102688 266903 -107766 -21298 361048 191131
10296 191131 -5422 163613 -128552 -220398 -386741 -284389 -124324 92918 39253 -45829 162255
10284 -8117 290686 39341 62050 -230907 110024 -221837 -40701 -278823 -155125 190016
10273 77891 358896 214877 253630 165358 222181 192779 162076 -183958 190470 136415 -124153
10261 -81724 -52103 302723 -29145 254972 187585 66662 -38256 200356 -32315 211136 169292
10250 169292 -250765 -205376 -161253 222195 -333011 -21028 74691 -106196 -48865 -217740
10240 -217740 -84287 117809 104243 -56589 131384 -211401 -112094 86404 -102594 292316
10229 91274 99628 -35575 -251528 -143377 183766 12272 -214611 49331 57195 -131980 -390938
10218c90938A10223a30259j2504A31231B1213b10385o4171I0688b35143H3970
10207A54260b60511A20247J67281b04848N1245A32573a06836j20362A60319N7224
10197B17543a90717c2655n1363o3941n0971E4845N1121N3916F7987b22457R3234
10186a29223A04221J11626b21312J06939D8748j042K25823a9037A15762a46754
10175A62238K71748A64471L1506O4190g3814j07621A09186j2104b77903a16698
10164a80474h9040m5390I663a97298j94362b673A19416K9820b92924M1812B20743
10152b78721A93513p6248a21232B84a77446l7520A97943a51577A76276b61903
10141d00430e6535L224j33819M5173M9796L5822a3568b868A7587J10503a45298
$$ plain form
10218 -390938 110223 -130259 -142763 131231 21213 -210385 -274556 90688 -235143 83970
10207 154260 -260511 120247 287528 -204848 -153603 132573 -106836 -227198 160319 217543
10197 217543 -190717 -32655 -84018 -147959 -198930 54845 105966 159882 67987 -222457 -129223
10186 -129223 104221 215847 -221312 -114373 48748 47706 273529 -19037 115762 -146754
10175 162238 433986 164471 195977 260167 -73814 -181435 109186 97082 -277903 -116698
10164 -180474 -89040 -134430 9663 -197298 -391660 -2673 119416 149236 -292924 -251112 220743
10152 -278721 193513 117265 -121232 284 -177446 -214966 197943 -151577 176276 -261903
10141 -400430 -56535 -53311 -187130 -141957 -92161 -56339 -13568 -2868 17587 128090 -145298
10129C23724b00370b8752m7294o2906M9915k8720j83587D7823a8301n0584a1249
10117a40754A34899a63728A02888a48614d148j84955M9841l6468H2193J82474
10107B64667G6686P7207J18925a09004k17923B47809f3205l32128B45567B7980
10096c7876a3234A18339k3999b6563n75838i2760d0032H1626b73694g1097j91942
10085b63039a04829B13116c95226J15923G050a11108G526h5335c3541j66420k3233
10074b23194A40939a68957N5160c6127k56801a2306p1090o7044Q276k1991J9039
10063a45116b6007a2958A03362B367O8617l0450K87918a36188C1022A3720a69573
10051b8685j00140e9526a6719k90568B12182C1260a3675A65449f6216j03534a7916
$$ plain form
10129 323724 -200370 -28752 -76046 -138952 -89037 -117757 -301344 47823 -18301 -68885 -11249
10117 -140754 134899 -163728 102888 -148614 -4148 -189103 -139262 -175730 82193 264667
10107 264667 76686 153893 272818 -109004 -326927 247809 -63205 -395333 245567 27980
10096 -37876 -13234 118339 94340 -26563 -602401 -92760 -40032 81626 -273694 -71097 -263039
10085 -263039 -104829 213116 -395226 -279303 7050 -111108 7526 -85335 -33541 -199961 -223194
10074 -223194 140939 -168957 -113797 -36127 -292928 -12306 -83396 -150440 -142164 -164155 -145116
10063 -145116 -26007 -12958 103362 2367 70984 40534 328452 -136188 31022 13720 -169573
10051 -28685 -128825 -59526 -16719 -307287 212182 31260 -13675 165449 -66216 -169750 -17916
10039b73655g5481E2863R0791c8760k36191O8942i0647j42908J16255n0125E8510
10027G3208a84941c8486A2089a45007m9113D0651b66267i897r9004F130K718b33662
10014a00857A67008c63202A6206Q3177M3415e7075Q931k12039B34134A16020b39807
10002b41422h1754m51433b7174k56853D8321b45970i8822A48541b25293j00811
9992c26104b2572A23085a83609a8427B63420a44657j28682m2643d9404j1853q2248
9981a43505c3943A33896f9882j67091B79140d75672f8075k2856J6551n1292j72453
9970b98125C04851K8142F8722j4610b32248J00695H3775d1030j95862A2251h9987
9958B80211b45099E9846a26668H3370L43787a78839G5445a5850l03664R1982B09063
$$ plain form
10039 -273655 -75481 52863 143654 -38760 -274951 -206009 -90647 -233555 -117300 -167425 58510
10027 73208 -184941 -38486 12089 -145007 -194120 40651 -266267 -9897 -108901 6130 8848 -233662
10014 -100857 167008 -363202 16206 99383 142798 -57075 -48144 -260183 234134 116020 -239807
10002 -241422 -81754 -533187 -27174 -284027 48321 -245970 -98822 148541 -225293 -326104
9992 -326104 -22572 123085 -183609 -18427 263420 -144657 -273339 -315982 -49404 -61257 -143505
9981 -143505 -33943 133896 -69882 -236973 279140 -475672 -68075 -90931 -74380 -125672 -298125
9970 -298125 304851 332993 68722 54112 -232248 -131553 83775 -41030 -236892 12251 -89987
9958 280211 -245099 59846 -126668 83370 427157 -178839 75445 -15850 -319514 -227532 209063
9946g465m72189I359b18820m4703A17256a2078n2508C73191f5369D4401b451k29664
9934b32115B78604c51414c3893m0367J519k05225C8668d3360j26301j3427N9807
9923a23281k61979J81524c8297j36855A26855J59786K21276I2370a58270E0145
9912a7055A24498a42880L7957o872C08635A2426M0280h5111j05335Q1355C56204
9900b03309d1951A64574q0300a52622e2216A11338J53822c37989A4677a51187
9889e4326j47763Q1767j49904Q8539d5228D4109b56854a04454k64919B23342h7163
9877a09276A40931D2363b73408N9631o4193C21350j37195E6869c37117f2527k81721
9866c44248F1203b86572G8891C2777O3086e9332j80620B84303a31575D8027b02877
$$ plain form
9946 -7465 -479654 9359 -218820 -263523 117256 -12078 -64586 373191 -65369 44401 -2451 -232115
9934 -232115 278604 -351414 -33893 -74260 -72741 -277966 38668 -43360 -169661 -183088 -123281
9923 -123281 -385260 -203736 -38297 -175152 126855 286641 507917 92370 -158270 50145
9912 -17055 124498 -142880 -104923 -111795 308635 12426 52706 -85111 -190446 -109091 356204
9900 -203309 -41951 164574 84274 -152622 -52216 111338 265160 -337989 14677 -151187
9889 -54326 -202089 -120322 -270226 -181687 -45228 44109 -256854 -104454 -369373 223342 -87163
9877 -109276 140931 42363 -273408 -213777 -277970 321350 184155 56869 -337117 -62527 -344248
9866 -344248 61203 -286572 78891 32777 95863 -59332 -239952 284303 -131575 48027 -202877
9854b00954K7338j32018A21565a974k42662j81349B8165P455b35572f8756J0650
9843e8106I8230C3898J59904a02406F0860e3944m4827q284A4072e8521j39214
9832a97735j40888K4289a49058e2179j03264j44011J06700e4911j87020N0893
9822a91038R2509d4700j76059D5076a18530D3107J17069c42688q6873G217f6706
9810D9235j5778c12570a7901C39396j69686c5671A2315h0828p090G0460a55290
9798A89601b62098J02542A21236b60183K8128a1622o6030r786a293B5167b38276
9786c0057k97170j0519g2237j57466A74265F5148J06099B6529a15495A19755b44241
9774c25780J57389e4553p2609H7027B308J42478d68491h0392F3223b86974I3406
$$ plain form
9854 -200954 -173616 -305634 121565 -1974 -244636 -425985 28165 35620 -235572 -68756 -58106
9843 -58106 98230 33898 193802 -102406 60860 -53944 -98771 -107055 14072 -58521 -197735
9832 -197735 -338623 -314334 -149058 -52179 -155443 -299454 -192754 -54911 -241931 -191038
9822 -191038 -98529 -44700 -220759 45076 -118530 43107 160176 -342688 -429561 7217 -66706
9810 49235 33457 -312570 -17901 339396 169710 -35671 12315 -80828 -87918 70460 -155290
9798 189601 -262098 -159556 121236 -260183 -232055 -11622 -77652 -87438 -1293 25167 -238276
9786 -30057 -327227 -337746 -72237 -229703 174265 65148 171247 26529 -115495 119755 -244241
9774 -325780 -168391 -54553 -127162 87027 2308 144786 -468491 -80392 63223 -286974 93406
9762a78493n6676b8787k33595A93630C7108A8041k728e8513A46336c26971A25030
9750b09837H1111M2579a40749a9403A9866d19265b0243l02131B8397h0080K2587
9739e7493j5493E2300e2942j43799e6207a2145E2062J37797g2364B38372d32876
9727C10268C2273K9763K8818C5492a75381B0623J62279h1684j65307a9357k07069
9716b26426g9666m06927a42954L2849C22860b0478l52155C9017b28500b5040B2255
9704H3519a05918B24167p5053J0028c87015g7659k7281A94476b88019A49911A0089
9692A52821a92359B40087n8496a31381c0720l52794Q4326a6704k06063P5362M3306
9681a04099m6784k31519a63508L8275k26539F9257N7119N7518D3353g4621a6213
$$ plain form
9762 -178493 -235169 -28787 -262382 193630 37108 18041 15313 -58513 146336 -326971 125030
9750 -209837 81111 123690 -140749 -19403 19866 -419265 -20243 -322374 28397 -80080 -57493
9739 -57493 -72986 52300 -52942 -196741 -56207 -12145 52062 189859 -72364 238372 -432876
9727 310268 32273 62036 90854 35492 -175381 20623 182902 -81684 -246991 -19357 -226426
9716 -226426 -79666 -486593 -142954 -110105 322860 -20478 -372633 39017 -228500 -25040 22255
9704 83519 -105918 224167 149114 159142 -387015 -77659 -104940 194476 -288019 149911 10089
9692 152821 -192359 240087 181591 -131381 -30720 -383514 -299188 -16704 -222767 -147405 -104099
9681 -104099 -150883 -382402 -163508 -125233 -351772 69257 126376 183894 43353 -74621 -16213
9669a87699A83968d821m77607a59793k00145a53550B72199B3118j0093i1066l54552
9658d45618I1322a20054j46465k6182j9385J16403B445b09505Q1786r6330H3748
9646C3390L0501N66a22801l7828J5232B39799l0213c4753j40378n6493h2811j48838
9634b31649A93873c27243a12198k812k2919E754d2167j41661A88030a51736e6444
9622A76457a17223e7511A7066J26378b7507I8019a68100O7404d6736C9473c20848
9610A27902E3403a39413L4098C8280a02885B6248g2914k13792Q7540e7516l8403
9599i5919K2933K8386A76195c285k2005l62530n8171a13495B1278J40589k2812
9588A39055h7284e729o0836A21999b76424n08B21954a61031A13108K17337a86282
$$ plain form
9669 -187699 183968 -4821 -482428 -159793 -359938 -153550 272199 23118 13025 -91066 -445618
9658 -445618 91322 -120054 -266519 -292701 -312086 -195683 2445 -209505 -127719 -224049 83748
9646 33390 63891 64457 -122801 -160629 -145397 239799 209586 -34753 -175131 -231624 -82811 -231649
9634 -231649 193873 -327243 -112198 -115010 -137929 5754 -42167 -183828 188030 -151736 -56444
9622 176457 -117223 -57511 17066 143444 -27507 98019 -168100 -100696 -46736 39473 -320848
9610 127902 53403 -139413 -105315 38280 -102885 26248 -72914 -286706 -199166 -57516 -95919
9599 -95919 -72986 -44600 176195 -3285 -25290 -387820 -445991 -113495 21278 161867 139055
9588 139055 -87284 -5729 -66565 121999 -276424 -276932 221954 -161031 113108 330445 -186282
9576C130e3675A28021H445a89111c1119B10975r8974a19721l6915e5136a9750
9564b32997a16423B78246j18846a65230g9990f821k95018h6904J8010A1249d20235
9552b95028d7540m18992b1709C35820J7105F2366J13923e8196B42935j1900r9210
9541A31825b7487j11222b6157k6962m2029j57099A2511e29984C43208a95994q1442
9530b77436d289k67964D08641o8336a62633l3433n7114i7586A96009Q6526p8379
9519B04156e0682p8539g999k4523r8899A32705K05672b42963A98995a83282g2138
9507D426a77434J9785H3684k5830d64l13925E1153M1476c17312K0784a0071m3616
9495e3687a8491j9841l6572c4707l3431j54527J0313h6434q3154p6219c9756k42167
$$ plain form
9576 3130 -53675 128021 8445 -189111 -31119 210975 112001 -119721 -156636 -55136 -19750
9564 -232997 -116423 278246 159400 -165230 -79990 -6821 -301839 -86904 -68894 11249 -420235
9552 -295028 -47540 -466532 -21709 335820 352925 62366 176289 -58196 242935 231035 131825
9541 131825 -27487 -138709 -26157 -53119 -95148 -252247 12511 -529984 343208 -195994 -277436
9530 -277436 -4289 -272253 408641 340305 -162633 -196066 -253180 -97586 196009 282535 204156
9519 204156 -50682 -129221 -7999 -32522 -131421 132705 338377 -242963 198995 -183282 -72138
9507 4426 -177434 -157649 83684 57854 -464 -314389 51153 92629 -317312 -296528 -10071 -53687
9495 -53687 -18491 -38332 -74904 -34707 -68138 -222665 -212352 -86434 -169588 -245807 -39756 -281923
9483b81923Q6222B4542Q4793a93563H1386a81501B38291N5204a59222j54242R6878
9472b16586k41240c2873m8597A85220i5336g698j8105A39932b12789N0219B58403
9460a33100B950g7904n1351j40116A7241L18403b92851a38292B4864b12503h3959
9448B96130A27387h8176a7580p5729B9793d05762M3549a61686D5774h1798o144
9437h7942A51009B1464J50308b4863B5078a30690D8468a22060n6749N0273G8895
9425A26218b93210j13721A10164e39226J48743b3358j70454L3931A38082f7144
9414E2388b51751A16141k8916g6620a265A96529a15528j23200D3656J63981c82571
9402A13382K71566a06670A52189a6335o9282B30902a21697c2685B72899b32033
$$ plain form
9483 -281923 -195701 24542 109335 -193563 81386 -181501 238291 293495 -159222 -313464 -216586
9472 -216586 -457826 -32873 -81470 185220 -95336 -7698 -25803 139932 -212789 -162570 258403
9460 -133100 2950 -77904 -129255 -269371 17241 335644 -292851 -138292 24864 -212503 -83959
9448 296130 127387 -88176 -17580 -93309 29793 -405762 -362213 -161686 45774 -81798 -87942
9437 -87942 151009 21464 171772 -24863 25078 -130690 48468 -122060 -178809 -128536 78895
9425 126218 -293210 -406931 110164 -539226 -390483 -23358 -193812 -159881 138082 -67144
9414 52388 -251751 116141 87225 -76620 -1265 196529 -115528 -238728 43656 207637 -382571
9402 113382 384948 -106670 152189 -16335 -85617 230902 -121697 -32685 272899 -232033
9391b69190b8298j63950B38566E1913c62527J20026C557J48051D1472J71726C1318
9379G2339P0665b33754q9224F5794c27457B3660O8688c6505D6432b2058j24662
9368a46720A3888e506j14087B13014k5187F6540L6379i8005j50769A10675e06570
9356A02500a60235F2938c25792b8689k43686q8377A97551N7765a92808R3052A97499
9344b20593A54785C4220J93902e5978b6915A05657I549a3691j65532P7561k68112
9333c69774J52172n9400J02585A46521a94037G2415N8814D9761a73484D62084
9322a64442C5490L0083J9552C3997a8977D5811c4968A77657d8516n0425E664a64471
9309a25555a2599j03994k2531L0028j81765Q256C4368c074j71331A56084o4244
$$ plain form
9391 -269190 -28298 -192248 238566 51913 -362527 -242501 3557 151608 41472 213198 31318
9379 72339 143004 -233754 -322978 65794 -327457 23660 92348 -36505 46432 -22058 -146720
9368 -146720 13888 -5506 -119593 213014 187827 66540 102919 -98005 -248774 110675 -506570
9356 102500 -160235 62938 -325792 -28689 -272375 -360752 197551 255316 -192808 -99756 197499
9344 -220593 154785 34220 228122 -55978 -26915 105657 9549 -13691 -179223 -101662 -369774
9333 -369774 -217602 -277002 -174417 146521 -194037 72415 131229 49761 -173484 462084
9322 -164442 35490 65573 85125 33997 -18977 45811 -34968 177657 -48516 -98941 5664 -164471
9309 -125555 -12599 -116593 -139124 -109096 -290861 -282605 34368 -3074 -174405 156084 91840
9298I1840a06260p5281A21240c0957E3848a46815a6591A04936c83316a81770H3726
9286c45327D1552d4131k75053c3173j86014a7518B4797f5476l32304J0561J08813
9275b78406A48361a38255C26735a68315B66971C1027J66178m7270d6826b780l51117
9264c53897A0260b9427B3560d7947p1681H9020a95229B72654J9525A40715a90648
9252a78422M4098C3644a88912J2114r3333E5918b34309c3165H1024b96425f6310
9240A4343b6966q2663j24311O0106H9935R2704d56032B38522a39942b5890j41748
9229a67638J8686A21918a33381j82712a27906j16803j16831i108l77174a32676
9218b36105C0493N8851a97217B53904n6022g8542L7402m7137j91562e2827k349
$$ plain form
9298 91840 -106260 -181541 121240 -30957 53848 -146815 -16591 104936 -383316 -181770 83726
9286 -345327 41552 -44131 -319184 -33173 -219187 -17518 24797 -65476 -397780 -387219 -278406
9275 -278406 148361 -138255 326735 -168315 266971 31027 197205 149935 -46826 -2780 -353897
9264 -353897 10260 -29427 23560 -47947 -119628 89020 -195229 272654 292179 140715 -190648
9252 -178422 -134324 33644 -188912 -176798 -270131 55918 -234309 -33165 81024 -296425 -66310
9240 14343 -26966 -109629 -233940 -173834 89935 182639 -456032 238522 -139942 -25890 -167638
9229 -167638 -148952 121918 -133381 -316093 -127906 -244709 -361540 -9108 -386282 -132676
9218 -236105 30493 89344 -197217 253904 197882 -78542 -41140 -88277 -279839 -52827 -55176
9207e5176B53544K086G7234K64165n3812a05044p2111A28303b00577m4187D72391
9195A60710Q2831I4039c34672F6726A144a37678D1583c2085o4319A42964m2862
9184A00102a16708G4807J64611c43879J06661A77300a79305B22625q5789a44349
9173a02321c6369m7665n6249e8105A49588c08387H2299b9864G8753c29152g0534
9161D1548O6047J30682c92062c5114A37146m8575M7137J14515a38635j18212C64301
9149c8315j26925J1127e6426p0277e1571j69352l5942I5169a5536H4394a16134
9137b35298M2622e7410A85902J8382H2981l6730a92495G5262b73535a2862C10259
9125e5986A81614c8415k53890a17591E4164a16326b347H8248a23779B75489a22051
$$ plain form
9207 -55176 253544 255630 77234 341399 287587 -105044 -177155 128303 -200577 -244764 472391
9195 160710 243541 94039 -334672 66726 1144 -137678 41583 -32085 -96404 142964 100102
9184 100102 -116708 74807 239418 -343879 -237218 177300 -179305 222625 136836 -144349
9173 -102321 -36369 -84034 -140283 -58105 149588 -308387 82299 -29864 78753 -329152 -70534
9161 41548 107595 238277 -392062 -35114 137146 88571 135708 250223 -138635 -256847 364301
9149 -38315 -165240 -154113 -56426 -126703 -51571 -220923 -256865 95169 -15536 84394 -116134
9137 -235298 -192676 -57410 185902 204284 82981 46251 -192495 75262 -273535 -12862 310259
9125 -55986 181614 -38415 -292305 -117591 54164 -116326 -2347 88248 -123779 275489 -122051
9113a08537j66369m822q5915A95393J30001g3567J6538k571D7242A2154E480a57321
9100G0173f7040n3413B64149h7018A60893a00279l1157A54275i3394F4129b71461
9088c3395F5763b04938n7632B54448A1343a21566c1761G7629J68935cj8515j17898
9076a36416m39003c014F5959M1171a31008p0714f5331A03505b92050M8877A02678
9064a62747A33638a57188d234r4446L1230l8094D4529A2866a93373m668A34977
9052C13181C9829L5062b09465b4405o8060B44034l1462H655d54209A34679b66445
9040c97746a22660N3485F3394f0576j15356A91175a63854B4499f2425j2144o9547
9029a44116O6235J2366k65590a29556q8783I1032B9801M0515c4679j55928c5144
$$ plain form
9113 -108537 -274906 -279728 -365643 195393 325394 -73567 -57029 -59600 47242 12154 5480 -157321
9100 70173 -67040 -120453 264149 -87018 160893 -100279 -131436 154275 -93394 64129 -271461
9088 -33395 65763 -204938 -262570 254448 11343 -121566 -31761 77629 246564 -3 -18518 -136416
9076 -136416 -575419 -3014 65959 107130 -131008 -201722 -65331 103505 -292050 -243173 102678
9064 -162747 133638 -157188 -4234 -98680 -67450 -105544 44529 12866 -193373 -198041 134977
9052 313181 39829 74891 -209465 -24405 -92465 244034 212572 8655 -454209 134679 -266445
9040 -397746 -122660 -69175 63394 -60576 -175932 191175 -163854 24499 -62425 -74569 -144116
9029 -144116 -77881 -65515 -331105 -129556 -218339 91032 29801 70316 -34679 -190607 -35144
9017a01989E5156a87598G2589b74285b6826A23654k7309K3420A5502J12003a03488
9005c5927B77362c30862C4331l81a87544g7528C52888i0803k21031g8606B40571
8993e7471k13768A03438a98460J8749k58208G8886c34875Q8245e6401j82538B92031
8981b99279a16928A71952h8823B76394a31898r9245B27816c9761C7844b99984
8970B06445a22747c777q0144b4856l6595A65194g1828j78926f3461O228j66142
8959b23375h5537j72580O7576g2006A7651d0582o7786n83795I4957b08103k92069
8948e00172f10j2638l468k45223A43639b0139j46562g8021A82125a81630A64835
8936a00701I1262b6934A12778L0132b91835i9355j16826H8794C1157L52125k5356
$$ plain form
9017 -101989 55156 -187598 72589 -274285 -26826 123654 96345 119765 15502 127505 -103488
9005 -35927 277362 -330862 34331 33950 -187544 -77528 352888 -90803 -311834 -78606 240571
8993 -57471 -271239 103438 -198460 -179711 -437919 78886 -334875 -246630 -56401 -238939 292031
8981 -299279 -116928 171952 -88823 276394 -131898 -231143 227816 -39761 37844 -299984
8970 206445 -122747 -3777 -83921 -24856 -61451 165194 -71828 -250754 -63461 -57233 -223375
8959 -223375 -85537 -258117 -190541 -72006 17651 -40582 -108368 -692163 94957 -208103 -500172
8948 -500172 -610 -13248 -16716 -261939 143639 -20139 -166701 -78021 182125 -181630 164835
8936 -100701 91262 -26934 112778 142910 -291835 -99355 -216181 88794 31157 383282 357926
8925C57926n715L62500K215606P266065N143739o527313B500953H11970k88001
8916E23969A59718P4578a10940k39535d7840A69596a41717B95407j0521J29358
8906D14244B8881a52756C53530a37693D4708e4649C3412c95999B09011E9050A2840
8894e6268A39376b38899G5871a51251B0154a32509D1227a24763c4281o0503j15973
8883b10757D4330a40759k557D36566b43202M944G7403b75997f3824r5322C00552
$$ plain form
8925 357926 352211 714711 2930317 10196382 15340121 8812808 2500953 811970 523969
8916 523969 159718 234296 -110940 -350475 -47840 169596 -141717 295407 284886 414244
8906 414244 28881 -152756 353530 -137693 44708 -54649 33412 -395999 209011 59050 12840
8894 -56268 139376 -238899 75871 -151251 20154 -132509 41227 -124763 -34281 -94784 -210757
8883 -210757 44330 -140759 -143316 436566 -243202 -238258 77403 -275997 -63824 -159146 300552
$$ [...]
##END NTUPLES=NMR SPECTRUM
##END=
