
##TITLE=UV1229_M7_1357-1247_10_7230815_2GDWOkxkEZ
##JCAMPDX= 6.0         $$ Bruker NMR JCAMP-DX V2.0
##DATA TYPE= NMR SPECTRUM
##DATA CLASS= NTUPLES
##ORIGIN= BRUKER
##OWNER= Administrator
$$ 1.72 TOPSPIN		Version 2.1
$$ 2013-01-18 21:13:35.712 -0500  Administrator@X
$$ Compression mode = diff/dup
##.OBSERVE FREQUENCY= 400.02188249412
##.OBSERVE NUCLEUS= ^1H
##.ACQUISITION MODE= SIMULTANEOUS (DQD)
##.ACQUISITION SCHEME= undefined
##.AVERAGES= 64
##.DIGITISER RES= 22
##SPECTROMETER/DATA SYSTEM= spect
##.PULSE SEQUENCE= noesygpps1d.comp
##.SOLVENT NAME= COFFEE_meoh
##.SHIFT REFERENCE= INTERNAL, COFFEE_meoh, 1, 14.96122
##AUDIT TRAIL= $$ (NUMBER, WHEN, WHO, WHERE, PROCESS, VERSION, WHAT)
$$ ##TITLE= Audit trail, TOPSPIN		Version 2.1
$$ ##JCAMPDX= 5.01
$$ ##ORIGIN= Bruker BioSpin GmbH
$$ ##OWNER= Administrator
$$ $$ E:\/data/COFFEE/nmr/UV1229_M7_1357-1247_10_7230815_2GDWOkxkEZ/22/pdata/1/auditp.txt
$$ ##AUDIT TRAIL=  $$ (NUMBER, WHEN, WHO, WHERE, PROCESS, VERSION, WHAT)
(   1,<2013-01-18 21:13:29.884 -0500>,<Administrator>,<X>,<go>,<TOPSPIN 2.1>,
      <created by zg
	started at 2013-01-18 21:02:00.165 -0500,
	POWCHK enabled, PULCHK disabled,
       configuration hash MD5:
       86 BA 57 50 F2 9D 5C 9B 26 00 A9 28 5F 66 2E 89
       data hash MD5: 64K
       6B A3 8B E7 F2 76 9B AA 15 85 FE A6 19 6E 1A D7>)
(   2,<2013-01-18 21:13:32.853 -0500>,<Administrator>,<X>,<proc1d>,<TOPSPIN 2.1>,
      <Start of raw data processing
       efp LB = 0.3 FT_mod = 6 PKNL = 1 PHC0 = 0 PHC1 = 0 SI = 128K 
       data hash MD5: 128K
       B1 C1 AA 0A 55 47 0D EF 30 3E 10 B4 41 55 61 DE>)
(   3,<2013-01-18 21:13:33.915 -0500>,<Administrator>,<X>,<proc1d>,<TOPSPIN 2.1>,
      <pk PHC0 = -83.73779 PHC1 = 0 
       data hash MD5: 128K
       DD A0 96 D7 D5 98 61 E3 79 89 EC A7 DC 9F 15 CB>)
(   4,<2013-01-18 21:13:34.618 -0500>,<Administrator>,<X>,<proc1d>,<TOPSPIN 2.1>,
      <abs ABSG = 1 
       data hash MD5: 128K
       6A 4E 0A E1 A8 21 99 A6 98 98 24 1B 55 2B DD A4>)
(   5,<2013-01-18 21:13:34.790 -0500>,<Administrator>,<X>,<proc1d>,<TOPSPIN 2.1>,
      <abs ABSG = 2 
       data hash MD5: 128K
       87 0B C6 93 F7 CF 06 A0 B0 6F 4B B2 0E D1 FE A7>)
(   6,<2013-01-18 21:13:34.978 -0500>,<Administrator>,<X>,<proc1d>,<TOPSPIN 2.1>,
      <abs ABSG = 3 
       data hash MD5: 128K
       78 32 B9 16 B7 71 CD 06 BD 90 DB F9 98 B0 25 51>)
(   7,<2013-01-18 21:13:35.165 -0500>,<Administrator>,<X>,<proc1d>,<TOPSPIN 2.1>,
      <abs ABSG = 4 
       data hash MD5: 128K
       70 7C 11 D5 F8 35 BF E1 94 E4 D1 A5 B8 7F 8C 51>)
(   8,<2013-01-18 21:13:35.337 -0500>,<Administrator>,<X>,<proc1d>,<TOPSPIN 2.1>,
      <abs ABSG = 5 
       data hash MD5: 128K
       FF 2A 2F 99 3D 15 5C AE 25 A8 9A 96 4D C3 4A 40>)
$$ ##END=
$$ 
$$ $$ hash MD5
$$ $$ F7 B0 40 65 53 3C 9F D6 90 51 1A FB 2F 8D C5 E7
##$RELAX= 
##$RELAX= 
##$RELAX= 
##$RELAX= 
##$RELAX= 
##$RELAX= 
##$RELAX= 
##$RELAX= 
$$ Bruker specific parameters
$$ --------------------------
##$DU= <E:\>
##$EXPNO= 22
$$ [...]
##$TP07= 0
##$TPNAME0= <>
##$TPNAME1= <>
##$TPNAME2= <>
##$TPNAME3= <>
##$TPNAME4= <>
##$TPNAME5= <>
##$TPNAME6= <>
##$TPNAME7= <>
##$TPOAL= (0..7)
0.5 0.5 0.5 0.5 0.5 0.5 0.5 0.5
##$TPOFFS= (0..7)
0 0 0 0 0 0 0 0
##$TUNHIN= 0
##$TUNHOUT= 0
##$TUNXOUT= 0
##$USERA1= <user>
##$USERA2= <user>
##$USERA3= <user>
##$USERA4= <user>
##$USERA5= <user>
##$V9= 5
##$VALIST= <valist>
##$VCLIST= <CCCCCCCCCCCCCCC>
##$VD= 0
##$VDLIST= <DDDDDDDDDDDDDDD>
##$VPLIST= <PPPPPPPPPPPPPPP>
##$VTLIST= <TTTTTTTTTTTTTTT>
##$WBST= 1024
##$WBSW= 4
##$XGAIN= (0..3)
0 0 0 0
##$XL= 0
##$YL= 0
##$YMAX_a= 6045119
##$YMIN_a= -13101876
##$ZGOPTNS= <>
##$ZL1= 120
##$ZL2= 120
##$ZL3= 120
##$ZL4= 120
##$ABSF1= 14.96122
##$ABSF2= -5.596962
##$ABSG= 5
##$ABSL= 3
##$ALPHA= 0
##$AQORDER= 0
##$ASSFAC= 0
##$ASSFACI= 0
##$ASSFACX= 0
##$ASSWID= 0
##$AUNMP= <proc_prof1d_extract.lims>
##$AXLEFT= 0
##$AXNAME= <>
##$AXNUC= <1H>
##$AXRIGHT= 0
##$AXTYPE= 0
##$AXUNIT= <>
##$AZFE= 0.1
##$AZFW= 0.1
##$BCFW= 0
##$BC_mod= 0
##$BYTORDP= 0
##$COROFFS= 0
##$CY= 15
##$DATMOD= 1
##$DC= 0
##$DFILT= <>
##$DTYPP= 0
##$F1P= 0
##$F2P= 0
##$FCOR= 0.5
##$FTSIZE= 131072
##$FT_mod= 6
##$GAMMA= 0
##$GB= 0
##$INTBC= 1
##$INTSCL= 1
##$ISEN= 128
##$LB= 0.3
##$LEV0= 0
##$LPBIN= 0
##$MAXI= 10000
##$MC2= 0
##$MEAN= 0
##$ME_mod= 0
##$MI= 0
##$NCOEF= 0
##$NC_proc= -2
##$NLEV= 6
##$NOISF1= 0
##$NOISF2= 0
##$NSP= 0
##$NTH_PI= 0
##$NZP= 0
##$OFFSET= 14.96122
##$PC= 1
##$PHC0= -83.73779
##$PHC1= 0
##$PH_mod= 1
##$PKNL= yes
##$PPARMOD= 0
##$PPDIAG= 0
##$PPIPTYP= 0
##$PPMPNUM= 2147483647
##$PPRESOL= 1
##$PSCAL= 4
##$PSIGN= 0
##$PYNMP= <proc.py>
##$REVERSE= no
##$SF= 400.020009548503
##$SI= 131072
##$SIGF1= 0
##$SIGF2= 0
##$SINO= 400
##$SIOLD= 131072
##$SPECTYP= <>
##$SREGLST= <1H.CDCl3>
##$SSB= 0
##$STSI= 131072
##$STSR= 0
##$SW_p= 8223.68421052631
##$SYMM= 0
##$S_DEV= 0
##$TDeff= 65536
##$TDoff= 0
##$TI= <>
##$TILT= no
##$TM1= 0
##$TM2= 0
##$TOPLEV= 0
##$USERP1= <user>
##$USERP2= <user>
##$USERP3= <user>
##$USERP4= <user>
##$USERP5= <user>
##$WDW= 1
##$XDIM= 131072
##$YMAX_p= 412011778
##$YMIN_p= -15534
##$CURPLOT= <Network HP LaserJet P1505>
##$CURPRIN= <$Network HP LaserJet P1505>
##$DFORMAT= <normdp>
##$LAYOUT= <+/1D_H.xwp>
##$LFORMAT= <normlp>
##$PFORMAT= <normpl>
##$SURQMSG= 1
$$ End of Bruker specific parameters
$$ ---------------------------------
##NTUPLES= NMR SPECTRUM
##VAR_NAME=  FREQUENCY,     SPECTRUM/REAL,   SPECTRUM/IMAG
##SYMBOL=    X,             R,               I
##VAR_TYPE=  INDEPENDENT,   DEPENDENT,       DEPENDENT
##VAR_FORM=  AFFN,          ASDF,            ASDF
##VAR_DIM=   131072,        131072,          131072
##UNITS=     HZ,            ARBITRARY UNITS, ARBITRARY UNITS
##FACTOR=    0.0627417313425164, 1,          1
##FIRST=     8223.62146879497, 1286,         -64255
##LAST=      0,             2977,            -63377
##MIN=       0,             -15534,          0
##MAX=       8223.62146879497, 412011778,    0
$$ Real data points
##PAGE= N=1
##DATA TABLE= (X++(R..R)), XYDATA
$$ [...]
61597C84267l109l403l011k306j897j942k134k177k061j925j874j916j939j712
61583C52861j129m97l78r99j876k218j689p10LJ55Q8L61J138J971K223J650O50
61566C51604q0j26L24O93O08K74J56L55N07L89L38P38J381J716J612J410J183
61549C63082N58n01j265j035q8O82Q70Q52J064J508K009K505K851K742K127J486
61533C79447J424J990K646K799K241J128k11j414k216k561k513k120j475r16r22
61518C77327j537k124j972j179n52n70p81m38M92J354J588J146K42q47j680j827
61502C68642j333p49m58k55J85P43J046J056J104J290J266O72k74q17l53R06K062
61485C74733K431K210K052K098J830R60j1l92p5N91J370K077K239J463J85n55
$$ y = [384267, 381158, 377755, 374744, 372438, 370541, 368599, 366465, 364288, 362227, 360302, 358428, 356512, 354573, 352861, 351732, 351235, 350857, 349858, 347982, 345764, 344075, 343365, 343368, 343523, 343611, 343972, 345110, 347081, 349304, 350954, 351604, 351524, 351398, 351722, 352415, 353023, 353297, 353453, 353808, 354315, 354704, 355042, 355780, 357161, 358877, 360489, 361899, 363082, 363640, 363139, 361874, 360839, 360751, 361433, 362303, 363155, 364219, 365727, 367736, 370241, 373092, 375834, 377961, 379447, 380871, 382861, 385507, 388306, 390547, 391675, 391464, 390050, 387834, 385273, 382760, 380640, 379165, 378249, 377327, 375790, 373666, 371694, 370515, 369963, 369393, 368612, 368174, 368666, 370020, 371608, 372754, 372996, 372149, 370469, 368642, 367309, 366560, 366102, 365847, 366032, 366775, 367821, 368877, 369981, 371271, 372537, 373209, 372935, 372118, 371765, 372671, 374733, 377164, 379374, 381426, 383524, 385354, 386314, 386303, 385911, 385836, 386427, 387797, 389874, 392113, 393576, 393761, 393206]
61469C93206k90K88K90k53n90l73j5Q3J07L31M57j5q80j316r97n43n84q12n80
61450C87514j9J52k03l60J39Q43J089Q96O98P36J010J520K111K368K104J730J791
61433D04119K315K959L545M057M277L945L174K361J670J013M75M32J095K161K994
61418D40592L116K522J615P67J6o29q14k86L15j39j730l062k911j722q26p15r17
61401D35192j145j556j957j782j026l75k14j92N0L65N86Q88J302J367P45k54j018
61384D30976j240r17j10R27J693J847J551J270J364J979L044M162M769M632M108
61369D60055L769L778L777L305K321J402J253J934K750L101L171L504M109M466
61355E02695M301L898L772M352N785P546Q483P882O361N130M482L768K733J909
$$ y = [393206, 392916, 393204, 393494, 393241, 392651, 392278, 392263, 392346, 392453, 392784, 393241, 393226, 392346, 391030, 390033, 389490, 388906, 388094, 387514, 387495, 387647, 387444, 387084, 387223, 388066, 389155, 390051, 390749, 391485, 392495, 394015, 396126, 398494, 400598, 402328, 404119, 406434, 409393, 412938, 416995, 421272, 425217, 428391, 430752, 432422, 433435, 433910, 434342, 435437, 437598, 440592, 443708, 446230, 447845, 448612, 448628, 447999, 447185, 446899, 447214, 447075, 445345, 442283, 439372, 437650, 436824, 436109, 435192, 434047, 432491, 430534, 428752, 427726, 427351, 427137, 426945, 426995, 427360, 427946, 428834, 430136, 431503, 432248, 431994, 430976, 429736, 428819, 428709, 429636, 431329, 433176, 434727, 435997, 437361, 439340, 442384, 446546, 451315, 455947, 460055, 463824, 467602, 471379, 474684, 477005, 478407, 479660, 481594, 484344, 487445, 490616, 494120, 498229, 502695, 506996, 510894, 514666, 519018, 524803, 532349, 540832, 548714, 555075, 560205, 564687, 568455, 571188, 573097]
61341E73097J612J458J092O00p3j208k472k860k075j187j365k557l929m928n282
61326E49923m673l274k089j888k173j921r78J2P68J620K693L700M421M879N118
61311E56138N357O204Q008J0136J1553J2081J2492J3388J4622J5689J6100J5357
61299F97125J3214J0112O776L498K55k607m576n814p013q271q963q907q836r279
61285F66714r733r489q659p808p057o149n073l988k797j423k71K25M12J133K549
61270F08586L817M131L644L109L013L343L990M958O214P481Q344Q585Q536Q888
61256F86639R911J0779J0145P571M083J055j178l140n007o280o743o965p510q137
61242F85223q242p696o739n398l619j842p93p01j095j445j507j111j93R25J752
$$ y = [573097, 574709, 576167, 577259, 577859, 577786, 576578, 574106, 571246, 569171, 567984, 566619, 564062, 560133, 555205, 549923, 545250, 541976, 539887, 537999, 535826, 533905, 532927, 532939, 533707, 535327, 538020, 541720, 546141, 551020, 556138, 561495, 567699, 575707, 585843, 597396, 609477, 621969, 635357, 649979, 665668, 681768, 697125, 710339, 720451, 727227, 730725, 730980, 728373, 723797, 717983, 710970, 702699, 693736, 684829, 675993, 666714, 656981, 647492, 638833, 631025, 623968, 617819, 612746, 608758, 605961, 604538, 604267, 604492, 604904, 606037, 608586, 612403, 616534, 620178, 623287, 626300, 629643, 633633, 638591, 644805, 652286, 660630, 669215, 677751, 686639, 696550, 707329, 717474, 725045, 729128, 730183, 729005, 725865, 720858, 714578, 707835, 700870, 693360, 685223, 676981, 669285, 662546, 657148, 653529, 651687, 650894, 650193, 649098, 647653, 646146, 645035, 644842, 645767, 647519]
61227F47519K271K841L453L688L601L901M892N849O003N645N666O346P230P914
61213G16819Q319Q313P723O735N822N178M609M031L685L774M185M675N166N851
61199G94885P069R048J1585J4069J5942J7087J7678J7878J7763J7296J6134J3836
61187I70270J0562P270M775K878Q54j400l279m472n468o864q642j0295j1433j2081
61173I32675j2578j3259j4152j4975j5450j5607j5587j5417j5121j4924j4955
61162G70650j4931j4392j3316j2173j1373j0809r979q423o147l734j859n93O48
61149F63569K292M068N413O001N584L844J020j701l219l760m464n704o560o063
61135F60320m309k116j45J345K381L235M288N721P490R616J2149J4791J6946J8326
$$ y = [647519, 649790, 652631, 656084, 659772, 663373, 667274, 672166, 678015, 684018, 689663, 695329, 701675, 708905, 716819, 725138, 733451, 741174, 747909, 753731, 758909, 763518, 767549, 771234, 775008, 779193, 783868, 789034, 794885, 801954, 811002, 822587, 836656, 852598, 869685, 887363, 905241, 923004, 940300, 956434, 970270, 980832, 988102, 992877, 995755, 996609, 995209, 991930, 987458, 981990, 975126, 966484, 956189, 944756, 932675, 920097, 906838, 892686, 877711, 862261, 846654, 831067, 815650, 800529, 785605, 770650, 755719, 741327, 728011, 715838, 704465, 693656, 683677, 675254, 669107, 665373, 663514, 662921, 663569, 665861, 669929, 675342, 681343, 686927, 690771, 691791, 690090, 686871, 683111, 678647, 672943, 666383, 660320, 656011, 653895, 653750, 655095, 657476, 660711, 664999, 670720, 678210, 687826, 699975, 714766, 731712, 750038]
61121G50038J9188J9964K0943K2359K4283K6212K7230K6929K5936K5190K4847
61110A013119K4223K2737K0701J9027J8196J7635J6294J3840J0916Q069M944J042
61098A190743l174o700r363j1906j4673j7052j8485j9240j9750j9836j9196j8112
61086A013256j7091j6089j4697j2914j1124r427p503n128k481J50K667N022P041
61073I31682Q521R521J0501J2038J4196J6340J7813J8833K0205K2160K3942K4889
61061A130641K5359K6142K7290K8142K8393K8502K8948K9567K9831K9526K8914
61050A441255K8364K7940K7283K5863K3498K0665J8232J6742J5959J5183J3965
61039A674949J2423J0869R259P341N287L862L632M262M969N577O580Q184R935
$$ y = [750038, 769226, 789190, 810133, 832492, 856775, 882987, 910217, 937146, 963082, 988272, 1013119, 1037342, 1060079, 1080780, 1099807, 1118003, 1135638, 1151932, 1165772, 1176688, 1184757, 1189701, 1190743, 1187569, 1180869, 1171506, 1159600, 1144927, 1127875, 1109390, 1090150, 1070400, 1050564, 1031368, 1013256, 996165, 980076, 965379, 952465, 941341, 931914, 924411, 919283, 916802, 916952, 919619, 924641, 931682, 940203, 949724, 960225, 972263, 986459, 1002799, 1020612, 1039445, 1059650, 1081810, 1105752, 1130641, 1156000, 1182142, 1209432, 1237574, 1265967, 1294469, 1323417, 1352984, 1382815, 1412341, 1441255, 1469619, 1497559, 1524842, 1550705, 1574203, 1594868, 1613100, 1629842, 1645801, 1660984, 1674949, 1687372, 1698241, 1707500, 1714841, 1720128, 1723990, 1727622, 1731884, 1736853, 1742430, 1749010, 1757194, 1767129]
61026A767129J1493J3260J5718J8586K1182K3450K6056K9470L3597L8469M4714
61015B043124N2923O2850P3723Q5239R7734J11575J27055J45221J68266J98601
61005C166311K37885K87462L49232M25280N17213O27605P62270R28929J131326
60996H433513J363572J607779J831260J982424J996735J824932J472374J015050
60988B1527639N69827K38208O6977M6661J29501K41743K92674J99767p1450m83285
60978B2758262r43209j351463j642773j798070j831655j772813j652975j498802
60970A0266502j329450j157552r92059q39838p05279n89856m92891m12639l46926
60961C400012k93530k50405k15584j87025j63002j42611j25483j11025r8298q6661
$$ y = [1767129, 1778622, 1791882, 1807600, 1826186, 1847368, 1870818, 1896874, 1926344, 1959941, 1998410, 2043124, 2096047, 2158897, 2232620, 2317859, 2415593, 2527168, 2654223, 2799444, 2967710, 3166311, 3404196, 3691658, 4040890, 4466170, 4983383, 5610988, 6373258, 7302187, 8433513, 9797085, 11404864, 13236124, 15218548, 17215283, 19040215, 20512589, 21527639, 22097466, 22335674, 22402651, 22449312, 22578813, 22820556, 23113230, 23312997, 23241547, 22758262, 21815053, 20463590, 18820817, 17022747, 15191092, 13418279, 11765304, 10266502, 8937052, 7779500, 6787441, 5947603, 5242324, 4652468, 4159577, 3746938, 3400012, 3106482, 2856077, 2640493, 2453468, 2290466, 2147855, 2022372, 1911347, 1813049, 1726388]
60951A726388p6116o6972n9426n3529m9171m6056m3863m2431m1562m0800l9732
60940A166730l8363l6886l5239l3295l1267k9423k7629k5648k3726k2174k0532
60929H42548j7985j4707j2058j1103j1477j1960j1675j0509q912p506o585n795
60917G12276m742l791l659m178m241l250j857r56o25m95m91o52p89q66j287k261
60901F78136l290l771l790l865m227m817n585o423p106p706q635r874j0570r960
60887E88517q377o886o175o144o244n901m990m177m317n233n733n203m378l986
60873E10773l581k554j424r94q98k98M61L55l84l59R14K380L165L571L978M059
60857E19164L727L754M584N393N194M206L351K904K515K173K288K906L474L417
$$ y = [1726388, 1650272, 1583300, 1523874, 1470345, 1421174, 1375118, 1331255, 1288824, 1247262, 1206462, 1166730, 1128367, 1091481, 1056242, 1022947, 991680, 962257, 934628, 908980, 885254, 863080, 842548, 824563, 809856, 797798, 786695, 775218, 763258, 751583, 741074, 732162, 724656, 718071, 712276, 707534, 703743, 700084, 695906, 691665, 688415, 686558, 685602, 684977, 684482, 683991, 683339, 682550, 681684, 680397, 678136, 674846, 671075, 667285, 663420, 659193, 654376, 648791, 642368, 635262, 627556, 618921, 609047, 598477, 588517, 580140, 573254, 567079, 560935, 554691, 548790, 543800, 539623, 535306, 530073, 524340, 519137, 514759, 510773, 507192, 504638, 503214, 502220, 501322, 501024, 501485, 501840, 501456, 501097, 502011, 504391, 507556, 511127, 515105, 519164, 522891, 526645, 531229, 536622, 541816, 546022, 549373, 552277, 554792, 556965, 559253, 562159, 565633, 569050]
60843E69050K570J164k70j230j726k312l378m694n904o980p817p817o621n003
60829E19032m326n002o028o150n112l684k807k906l650m295m345m030l924m164
60815D58609m306m038l673l695m051m211l855l272k978l136l435l443k963k160
60801D09393j419j049r86q80n08p1R0pj4K64O81J090J543K037K341K292K090K051
60783D18938K262K633L067L338L090K269J339P64M98K85J80K77K45k44q56j042
60767D37043j026j513k420k791k232j534j427j560j297p76m78l38q0K7k89m89
60751D18820K2N91L2j377j958r97K42M86K24M79Q01o8k025l570l901l756l885
60734D00160l949l484k919k830k895k489j829j623j813j537l70J173K408L135
$$ y = [569050, 571620, 572784, 572514, 571284, 569558, 567246, 563868, 559174, 553270, 546290, 538473, 530656, 524035, 519032, 514706, 509704, 503676, 497526, 492414, 488730, 485923, 483017, 479367, 475072, 470727, 466697, 462773, 458609, 454303, 450265, 446592, 442897, 438846, 434635, 430780, 427508, 424530, 421394, 417959, 414516, 411553, 409393, 407974, 406925, 405939, 405059, 404551, 404480, 404570, 404563, 404549, 404813, 405494, 406584, 408127, 410164, 412505, 414797, 416887, 418938, 421200, 423833, 426900, 430238, 433328, 435597, 436936, 437700, 438198, 438483, 438663, 438940, 439185, 438941, 438085, 437043, 436017, 434504, 432084, 429293, 427061, 425527, 424100, 422540, 421243, 420467, 419989, 419651, 419571, 419598, 419309, 418820, 418842, 419433, 419465, 418088, 416130, 415133, 415375, 415861, 416085, 416564, 417365, 417297, 415272, 411702, 407801, 404045, 400160, 396211, 392727, 389808, 386978, 384083, 381594, 379765, 378142, 376329, 374792, 374422, 375595, 378003, 381138]
60720C81138L368L074K428J935J898K069K005J577J023P27R66J653K287K474K474
60705D11096K784L268L263K596J858J406Q44j04q26o40R0L56k14j156j975k481
60689D20165k446j736q75o66j072j108j83J035J501J125P23R13J575K220K509
60674D23680K418K228K263K420K063P16j231k842l677m069m315m094l037j570
60660D10953o17n38p88p03k65Q1P6j21j51L18J375K626L360L195K473J768J186
60643D24228M64m08j087j425j632j833j809j400r04q08j260j883k098j639p79
60628D05727p8K73O31J282J874J813J085K55k21k89pM79P00K34n95r01l27N49
60610D12484J005Q98M68k5k38P1N52N48R8mM57N40m55j641j521O0J758K460K338
$$ y = [381138, 384506, 387580, 390008, 391943, 393841, 395910, 397915, 399492, 400515, 401242, 402208, 403861, 406148, 408622, 411096, 413880, 417148, 420411, 423007, 424865, 426271, 427115, 427011, 426185, 425545, 425635, 425991, 425777, 424621, 422646, 420165, 417719, 415983, 415108, 414442, 413370, 412262, 412079, 413114, 414615, 415740, 416463, 417376, 418951, 421171, 423680, 426098, 428326, 430589, 433009, 435072, 435788, 434557, 431715, 428038, 423969, 419654, 415560, 412523, 410953, 410336, 409798, 409010, 408307, 408042, 408123, 408199, 408078, 407927, 408245, 409620, 412246, 415606, 418801, 421274, 423042, 424228, 424692, 424284, 423197, 421772, 420140, 418307, 416498, 415098, 414194, 413386, 412126, 410243, 408145, 406506, 405727, 405649, 405922, 406553, 407835, 409709, 411522, 412607, 412862, 412641, 412352, 412345, 412824, 413524, 413758, 413163, 412262, 411935, 412484, 413489, 414387, 414855, 414830, 414592, 414663, 415215, 415763, 415861, 415857, 416314, 416854, 416399, 414758, 413237, 413297, 415055, 417515, 419853]
60591D19853K139K121K091K008K151K648L104K924K057J149P55O58L91J31L87
60576D44567J009J392J616K381L625M292L923L467L940N218O819Q817J1137J2868
60562E15071J3291J2876J2277J1124Q938O403M427K592J3k778m377m637m656m774
60548E65790m240k935j824j319p13L90J463K395M041O752R538J1513J3136J5223
60534F19210J7657J9939K2106K4166K5320K4723K2541J9435J5459J0379M769j56
60522H25548l803o589r023j0992j2084j2271j2013j1730j1292j0204q401o570
60510G10576n349m471l229j553L7J429L067N109P264R655J2972J7496K2600K7508
60496H03111L1972L6041L9826M3672M7747N1271N2941N2395N0420M7494M3107
$$ y = [419853, 421992, 424113, 426204, 428212, 430363, 433011, 436115, 439039, 441096, 442245, 443000, 443658, 444049, 444180, 444567, 445576, 446968, 448584, 450965, 454590, 458882, 462805, 466272, 470212, 475430, 482249, 491066, 502203, 515071, 528362, 541238, 553515, 564639, 573577, 579980, 584407, 586999, 587012, 584234, 579857, 575220, 570564, 565790, 561550, 558615, 556791, 555472, 554759, 555149, 556612, 559007, 563048, 569800, 579338, 590851, 603987, 619210, 636867, 656806, 678912, 703078, 728398, 753121, 775662, 795097, 810556, 820935, 825704, 825548, 821745, 815156, 806133, 795141, 783057, 770786, 758773, 747043, 735751, 725547, 717146, 710576, 705227, 700756, 697527, 695974, 696011, 697440, 700507, 705616, 712880, 722535, 735507, 753003, 775603, 803111, 835083, 871124, 910950, 954622, 1002369, 1053640, 1106581, 1158976, 1209396, 1256890, 1299997]
60485A299997L7000K9978K2856J5461P418r52r257j7755k6605l5065m2314m8441
60473A232321n3731n7550n8959n7998n5514n2018m7679m3077l8922l5177l1299
60462G00397k7285k3702k0775j8222j5930j4023j2348j0576q855p688p087o475
60450E27431n525m520l818l437l269l317l536l717l599l016k056j163q12r28r83
60435D83735q02p58r30p90k05K9o85j680j968j736j891k434k428j448q5J013J715
60418D68652J948J610J101J115J668J981J636J115J009J243J430J467J423J262
60404D88660R91Q06Q17Q80Q00O02N18Q46J728K831L458L254K662K314K269K256
60388E15692K354K742L040K710K057K089L183M535N155M823L993L240K987L223
$$ y = [1299997, 1336997, 1366975, 1389831, 1405292, 1412710, 1411758, 1402501, 1384746, 1358141, 1323076, 1280762, 1232321, 1178590, 1121040, 1062081, 1004083, 948569, 896551, 848872, 805795, 766873, 731696, 700397, 673112, 649410, 628635, 610413, 594483, 580460, 568112, 557536, 548681, 540993, 533906, 527431, 521906, 517386, 513568, 510131, 506862, 503545, 500009, 496292, 492693, 489677, 487621, 486458, 485646, 484718, 483735, 482933, 482175, 481245, 480455, 480250, 480279, 479594, 477914, 475946, 474210, 472319, 469885, 467457, 466009, 465924, 466937, 468652, 470600, 472210, 473311, 474426, 476094, 478075, 479711, 480826, 481835, 483078, 484508, 485975, 487398, 488660, 489651, 490457, 491274, 492154, 492954, 493556, 494074, 494920, 496648, 499479, 502937, 506191, 508853, 511167, 513436, 515692, 518046, 520788, 523828, 526538, 528595, 530684, 533867, 538402, 543557, 548380, 552373, 555613, 558600, 561823]
60374E61823L370K873K004J557J745J977J861J698J792J933J832J552J213Q21
60360E88051O46J155K209K957K995L079M134N956P555Q475R111R796J0229R878
60346F66226Q600O719M690K755Q60j091k958m531n848p061q007q323q037p547
60332F36447o861n575l896k996l609m830n147m422l853m116m478m117l282k615
60318E76650k024r95L44J369K008K933M570O554Q339R832J1169J2271J3015J3425
60304F59460J3456J2912J1961J1300J1246J0991R429O601L594J016j665n002q551
60291G36748j1376j3108j4006j4314j4056j3290j2180j0911r700q759q027p171
60279E99850o088n159m810m989n244n145m525l614k973k977l203k839j833j102
$$ y = [561823, 565193, 568066, 570070, 571627, 573372, 575349, 577210, 578908, 580700, 582633, 584465, 586017, 587230, 588051, 588697, 589852, 592061, 595018, 598013, 601092, 605226, 611182, 618737, 627212, 636323, 646119, 656348, 666226, 674826, 681545, 686235, 688990, 689850, 688759, 685801, 681270, 675422, 668361, 660354, 652031, 643994, 636447, 629586, 624011, 620115, 617119, 613510, 608680, 603533, 599111, 595258, 591142, 586664, 582547, 579265, 576650, 574626, 573631, 573975, 575344, 577352, 580285, 584855, 591409, 599748, 609580, 620749, 633020, 646035, 659460, 672916, 685828, 697789, 709089, 720335, 731326, 740755, 747356, 750950, 751966, 750301, 745299, 736748, 725372, 712264, 698258, 683944, 669888, 656598, 644418, 633507, 623807, 615048, 607021, 599850, 593762, 588603, 583793, 578804, 573560, 568415, 563890, 560276, 557303, 554326, 551123, 548284, 546451, 545349]
60265E45349j254j742j687j057m61j78k3J29K45L76N03M27K12L79J192K060K248
60248E46718J868J584J521J204L96n78j293j545j347r98r37j123j001m37j27m25
60232E43480m99M18J570J689J032J049K129L171L460L549L909M131L963L984M505
60217E81540M928M951N366O783Q339Q720P881O842O281O187O502P175P721P557
60203F76773O769N915N239M597M001L572L063K065P32k47n02l82m66j026k077
60188G08026l504m971n984o262o005n673n498n288m754l993l507l541l605l032
60174F42409j953j232j329j698j653j316j299j682j891j541q98m03r9K09M37K59
60158F26320l49q77q44m47k80l86j00R59K204K820K834K853K972K681J872J184
$$ y = [545349, 544095, 542353, 540666, 539609, 539148, 538970, 538947, 539076, 539321, 539697, 540200, 540627, 540839, 541218, 542410, 544470, 546718, 548586, 550170, 551691, 552895, 553291, 552713, 551420, 549875, 548528, 547530, 546593, 545470, 544469, 544032, 543905, 543480, 542981, 543399, 544969, 546658, 547690, 548739, 550868, 554039, 557499, 561048, 564957, 569088, 573051, 577035, 581540, 586468, 591419, 596785, 603568, 611907, 620627, 628508, 635350, 641631, 647818, 654320, 661495, 669216, 676773, 683542, 689457, 694696, 699293, 703294, 706866, 709929, 711994, 712726, 712479, 711977, 711595, 711129, 710103, 708026, 704522, 699551, 693567, 687305, 681300, 675627, 670129, 664841, 660087, 656094, 652587, 649046, 645441, 642409, 640456, 639224, 637895, 636197, 634544, 633228, 631929, 630247, 628356, 626815, 625917, 625514, 625415, 625624, 626061, 626320, 625971, 625094, 624250, 623803, 623523, 623137, 623037, 623996, 626200, 629020, 631854, 634707, 637679, 640360, 642232, 643416]
60142F43416J212J787K357K606K580K570K983L948M996N557N779O222O754O549
60128F99316N391M196L682L305K199O16l76l53J99Q61J721K730L338L079K123
60113G32027J070M57M93R28J116N79l93j040j237j806l375n263o077n390m229
60098G07860l720l787l599k823j876j157o84m69n40n28J24J247J880J471N52j27
60082F93824n45r82j334j501j909k862l872m377m720n456o224o274n874n988o647
60067F35259o877o298n662n548n655n677n828n988n421l897k326j579j392j043
60053E72068m79p6K16P87J691K534K941K918K891L487M819O067O284N537M589
60038F16274L576K012J17j091j334j584k493l383l529l367l581l943m010m163
$$ y = [643416, 644628, 646415, 648772, 651378, 653958, 656528, 659511, 663459, 668455, 674012, 679791, 686013, 692767, 699316, 704707, 708903, 712585, 715890, 718089, 718705, 718329, 717976, 718175, 719036, 720757, 723487, 726825, 729904, 732027, 733097, 733554, 734047, 734975, 736091, 736670, 736277, 735237, 734000, 732194, 728819, 723556, 717479, 712089, 707860, 704140, 700353, 696754, 693931, 692055, 690898, 690214, 689745, 689205, 688677, 688801, 690048, 691928, 693399, 693951, 693824, 693279, 692297, 690963, 689462, 687553, 684691, 680819, 676442, 671722, 666266, 660042, 653768, 647894, 641906, 635259, 628382, 622084, 616422, 610874, 605219, 599542, 593714, 587726, 582305, 578408, 576082, 574503, 573111, 572068, 571589, 571513, 571729, 572516, 574207, 576741, 579682, 582600, 585491, 588978, 593797, 599864, 606148, 611685, 616274, 619850, 621862, 621979, 620888, 619554, 617970, 615477, 612094, 608565, 605198, 601617, 597674, 593664, 589501]
60024E89501m913n842o270o448p026p795p995p561p056o594n830m888m305m091
60010E02887l706l001k436k265k144j735j149o56l41r0K88Q46J278J246R84J203
59994D91209K033K750K868K852L160L263K501J378J035J724K616K957K616J710
59980E24672M55o73j334j778k385k997l258l262l254l009k263j372q54n45n5L48
59964D98436K66K04R94K332K985K521J773J483J466J309R77N34Rk75K4N90P39
59947E16367M63L31L53j25j175j942j925j706j923k294k230j793j467j416j422
59932D98096j208m70J012K940M529N278N432N575N990O550O822O235M580K440
59918E53801P09l41j097j750j961j463m34Q23K015K705K643K301K404K838K804
$$ y = [589501, 584588, 578746, 572476, 566028, 559002, 551207, 543212, 535651, 528595, 522001, 516171, 511283, 506978, 502887, 499181, 496180, 493744, 491479, 489335, 487600, 486451, 485795, 485454, 485364, 485652, 486498, 487776, 489022, 490006, 491209, 493242, 495992, 498860, 501712, 504872, 508135, 510636, 512014, 513049, 514773, 517389, 520346, 522962, 524672, 525127, 524454, 523120, 521342, 518957, 515960, 512702, 509440, 506186, 503177, 500914, 499542, 498688, 498143, 498088, 498436, 498702, 498906, 499900, 502232, 505217, 507738, 509511, 510994, 512460, 513769, 514746, 515280, 515289, 515014, 515038, 515628, 516367, 516830, 517161, 517514, 517389, 516214, 514272, 512347, 510641, 508718, 506424, 504194, 502401, 500934, 499518, 498096, 496888, 496418, 497430, 500370, 504899, 510177, 515609, 521184, 527174, 533724, 540546, 546781, 551361, 553801, 554510, 554169, 553072, 551322, 549361, 547898, 547464, 548287, 550302, 553007, 555650, 557951, 560355, 563193, 565997]
59903E65997K118J499J336J144O21L43P96J502J756J593J401J228J178J836L384
59888E87732M836N033M155L394L396L892M672N860P169P848P720P496P676P813
59874F68692P249O044M636L116J425o4q84j240j715k302k435k113k135k800l217
59859F72257k638j861k247l682m641m248l124k035q58N14J468J667K002L461N657
59844F61692P373Q114Q127P385N689L644K327J986J940J864K192L099L964M156
59830G23552L615K524J061l70j340j989k765l561l887l939m574n888o817o631
59816F88991n998n968o530o806o299n308m479m246m541m740m273l444l195l827
59802F19337m476m214l213k381k247k591k932k967k726k509k547k671k581k381
$$ y = [565997, 568115, 569614, 570950, 572094, 572715, 573058, 573854, 575356, 577112, 578705, 580106, 581334, 582512, 584348, 587732, 592568, 597601, 601756, 605150, 608546, 612438, 617110, 622970, 630139, 637987, 645707, 653203, 660879, 668692, 675941, 681985, 686621, 689737, 691162, 691098, 690214, 688974, 687259, 684957, 682522, 680409, 678274, 675474, 672257, 669619, 667758, 665511, 661829, 657188, 652940, 649816, 647781, 646923, 647437, 648905, 650572, 652574, 656035, 661692, 669065, 677179, 685306, 692691, 698380, 702024, 704351, 706337, 708277, 710141, 712333, 715432, 719396, 723552, 727167, 729691, 730752, 730382, 729042, 727053, 724288, 720727, 716840, 712901, 708327, 702439, 695622, 688991, 682993, 677025, 670495, 663689, 657390, 652082, 647603, 643357, 638816, 634076, 629803, 626359, 623164, 619337, 614861, 610647, 607434, 605053, 602806, 600215, 597283, 594316, 591590, 589081, 586534, 583863, 581282, 578901]
59788E78901k429k654k576k092j653j516j386r93m51J16P45J220J171Q71J162
59773E68436K276L390L800L836M091M395M308M057M243M878N348N213M579L880
59759F26730L587L891M372M345L790L500L970M611M579L907L268L001K989L193
59745F79733L702M355M834N010M897M427L608K734K151J975K158K599K942K713
59731G27838J907J120Q27R36J152J334J270Q09M13R02K201L100K778J758P73m09
59715G48709k081l359l126j768p43o48q42r02j170j730k005j738j461j525j453
59700G24158p99KJ04o81j661j913j088J84P43N8j090j559j274j130j558j980j909
59683G08607j749k124k914l439l247k465j689j755l160n312o837o958o284n818
$$ y = [578901, 576472, 573818, 571242, 569150, 567497, 565981, 564595, 563602, 563151, 563267, 564012, 565232, 566403, 567274, 568436, 570712, 574102, 577902, 581738, 585829, 590224, 594532, 598589, 602832, 607710, 613058, 618271, 622850, 626730, 630317, 634208, 638580, 642925, 646715, 650215, 654185, 658796, 663375, 667282, 670550, 673551, 676540, 679733, 683435, 687790, 692624, 697634, 702531, 706958, 710566, 713300, 715451, 717426, 719584, 722183, 725125, 727838, 729745, 730865, 731692, 732628, 733780, 735114, 736384, 737193, 737606, 738508, 740709, 743809, 746587, 748345, 749118, 748709, 746628, 743269, 740143, 738375, 737632, 736984, 736142, 735240, 734070, 732340, 730335, 728597, 727136, 725611, 724158, 723359, 723361, 723465, 722784, 721123, 719210, 718122, 718306, 719049, 719107, 718017, 716458, 715184, 714054, 712496, 710516, 708607, 706858, 704734, 701820, 698381, 695134, 692669, 690980, 689225, 686065, 680753, 673916, 666958, 660674, 654856]
59669F54856n674n366m887m719m755m176k677j086l10j81L4M04M76L85Q85K081
59653F25290L067L227L081L192L011J737j76j504k025k639l732m614m837m935
59639F18143n288n318m515l452k913k695k110j215o75o85q72j057j424k056k855
59624E81013l806m730n046m358l189k454k419k656k860l052l069k624j863j302
59610E37585j124r96n78K06J266K305K757K352J611J336J636J946J858J421P71
59595E54352J48M3P26J657K082K065K204K389J909Q40K25M87O38k15j406j631
59579E66513q36k53o76j572j930j449o14J6K08l3o38j386j770j331k43O82Q40
59562E55528M54R3j41m45o49l49K47M17Ok83P1O64Q69P57P64R03R06R43J584L106
$$ y = [654856, 649182, 643816, 638929, 634210, 629455, 625279, 622602, 621516, 621206, 621025, 621059, 621463, 621939, 622324, 623209, 625290, 628357, 631584, 634665, 637857, 640868, 642605, 642429, 640925, 638900, 636261, 632529, 627915, 623078, 618143, 612855, 607537, 603022, 599570, 596657, 593962, 591852, 590637, 589962, 589277, 588405, 587348, 585924, 583868, 581013, 577207, 572477, 567431, 563073, 559884, 557430, 555011, 552355, 549495, 546443, 543374, 540750, 538887, 537585, 536461, 535465, 534887, 535093, 536359, 538664, 541421, 543773, 545384, 546720, 548356, 550302, 552160, 553581, 554352, 554500, 554543, 555269, 556926, 559008, 561073, 563277, 565666, 567575, 568415, 568640, 569127, 569765, 569550, 568144, 566513, 565677, 565424, 564748, 563176, 561246, 559797, 559183, 559199, 559407, 559374, 558736, 557350, 555580, 554249, 554006, 554688, 555528, 555982, 556075, 555934, 555489, 554840, 554491, 554738, 555155, 555161, 554878, 554949, 555613, 556482, 557239, 558003, 558906, 559812, 560755, 562339, 565445]
59542E65445N254P657J0122J2483J4526J6093J6996J6814J5063J1710P400L089
59530G02652m72k951m285m515l739k238n76O41J156J196J052O81j15j298k592
59515F84597l910n409p042q315q739q435q007p777p472o746n804n174m985m768
59501E92014m073l114k604k933l643l847l192k238j693j440p94L24J056Q53L57
59486E65033M77J025J184J023J467K645L452L168K556K705L524M279M890N674
59472F03102O232N803M642L933M039L890K630J045N46J247J896J695J295J718
59458F43713K891L844M163M522N670P305Q461Q642Q141P396O534N567M511L189
59444G24549J366p16k381l377m233n482o763p170o320m707l126j995j250o23L
$$ y = [565445, 570699, 578356, 588478, 600961, 615487, 631580, 648576, 665390, 680453, 692163, 699563, 702652, 702180, 699229, 694944, 690429, 686690, 684452, 683876, 684517, 685673, 686869, 687921, 688602, 688487, 687189, 684597, 680687, 675278, 668236, 659921, 651182, 642747, 634740, 626963, 619491, 612745, 606941, 601767, 596782, 592014, 587941, 584827, 582223, 579290, 575647, 571800, 568608, 566370, 564677, 563237, 562443, 562767, 563823, 564676, 565033, 565510, 566535, 567719, 568742, 570209, 572854, 576306, 579474, 582030, 584735, 588259, 592538, 597428, 603102, 609334, 615137, 619779, 623712, 627751, 631641, 634271, 635316, 635862, 637109, 639005, 640700, 641995, 643713, 646604, 650448, 654611, 659133, 664803, 672108, 680569, 689211, 697352, 704748, 711282, 716849, 721360, 724549, 725915, 725199, 722818, 719441, 715208, 709726, 702963, 695793, 689473, 684766, 681640, 679645, 678395, 677772, 677775]
59429F77775N85J210K255L965N974P613Q791J0143J2204J4752J7066J8582J9230
59416H00145J9511K0217K1763K3734K5336K5988K4999K1166J3829M400m235j0112
59404I86741j3193j3954j2312q498l722P80M445O421N193K49o674j3170j8243
59391I14063k1871k3575k2891k0746j8642j6783j4341j1432r235q155p275n976
59379G33141m761m100l541k560j415n66M4O91J301J573J405J028R38J618K925
59364G27721M060M583N063O090P129P337P123P705R276J0918J2286J3999J5997
59351H39287J7028J6478J5627J6059J7569J8484J7671J5431J2725J0205P981N836
59339A010381L551J048j671m574p427r892j2027j4320j6774j8471j8790j8544
$$ y = [677775, 678360, 679570, 681825, 685790, 691764, 699377, 708168, 718311, 730515, 745267, 762333, 780915, 800145, 819656, 839873, 861636, 885370, 910706, 936694, 961693, 982859, 996688, 1001088, 996853, 986741, 973548, 959594, 947282, 938784, 935062, 935842, 940287, 946708, 951901, 952150, 945476, 932306, 914063, 892192, 868617, 845726, 824980, 806338, 789555, 775214, 763782, 754547, 746392, 739117, 733141, 728380, 724280, 720739, 718179, 716764, 716198, 716242, 716933, 718234, 719807, 721212, 722240, 723178, 724796, 727721, 731781, 736364, 741427, 747517, 754646, 761983, 769106, 776811, 786087, 797005, 809291, 823290, 839287, 856315, 872793, 888420, 904479, 922048, 940532, 958203, 973634, 986359, 996564, 1004545, 1010381, 1013932, 1014980, 1013309, 1008735, 1001308, 991416, 979389, 965069, 948295, 929824, 911034, 892490]
59327H92490j8945j9741j9559j7986j6103j4898j4247j3729j3254j2552j1100
59316G20376r067p437o784o674o572o439o101n108l650k665k480k263j375k73
59302F53488O24J964M388P273R528J1095J2673J4275J4954J3750J0340N148o37
59289G58863n483q636j0473j1393j0930q663n424k705j084m1Q90J730K756M675
59275G04082P709J0998J3343J4366J4757J5355J6152J6389J5612J4302J3066J1637
59263H67768R322O332L818K418J561M05j237l194n308p123p978p869p595p609
59249H43711p422o643n770n220m347k386J07J715J922J564J633K259K906K981
59235H27010K271J055k20j536l231n216o761p430p766q472r394r925j0047j0262
$$ y = [892490, 873545, 853804, 834245, 816259, 800156, 785258, 771011, 757282, 744028, 731476, 720376, 711309, 703872, 697088, 690414, 683842, 677403, 671302, 666194, 662544, 659879, 657399, 655136, 653761, 653488, 654112, 656076, 660464, 667737, 677265, 688360, 701033, 715308, 730262, 744012, 754352, 759500, 758863, 753380, 744744, 734271, 722878, 711948, 703285, 697861, 695156, 694072, 694031, 694921, 696651, 699407, 704082, 711791, 722789, 736132, 750498, 765255, 780610, 796762, 813151, 828763, 843065, 856131, 867768, 877090, 883422, 887240, 889658, 891219, 891624, 890387, 887193, 881885, 874762, 866784, 858915, 851320, 843711, 836289, 829646, 823876, 818656, 814309, 811923, 812030, 813745, 815667, 817231, 818864, 821123, 824029, 827010, 829281, 830336, 830116, 828580, 825349, 820133, 813372, 805942, 798176, 789704, 780310, 770385, 760338, 750076]
59221G50076j0642j0663j0037r137q428p841o943n594m236l363k789j833m36M13
59207F68547j4q96q08K46R03N84L00R31J903K296K189K107J953J458R90J006J171
59190F84866Q88K59k33n60r27j095p89m30o24j199j379p75L34J422J952J613Q32
59173F84155O59J486K479K789K748L096L642L706L400L402L666L488K740K037
59159G23493J567O95j037l173m897n855o306o755p475q141q105p270o351n992
59145F54398o014n956n929o259o714o763o362n897n486m906m034k960j900j300
59131E83918j492j957j538K2J531K018K107K895M211N179N848O900Q133Q661Q598
59116F35034R129J0748J2568J3659J4029J4030J3701J3046J2188J0992R207P176
$$ y = [750076, 739434, 728771, 718734, 709597, 701169, 693328, 686385, 680791, 676555, 673192, 670403, 668570, 668134, 668547, 668533, 667637, 666829, 667075, 667978, 668562, 668862, 669793, 671696, 673992, 676181, 678288, 680241, 681699, 682689, 683695, 684866, 685754, 686013, 685780, 685220, 684293, 683198, 682409, 681979, 681355, 680156, 678777, 678002, 678336, 679758, 681710, 683323, 684155, 684814, 686300, 688779, 691568, 694316, 697412, 701054, 704760, 708160, 711562, 715228, 718716, 721456, 723493, 725060, 725755, 724718, 721545, 716648, 710793, 704487, 697732, 690257, 682116, 674011, 666741, 660390, 654398, 648384, 642428, 636499, 630240, 623526, 616763, 610401, 604504, 599018, 594112, 590078, 587118, 585218, 583918, 582426, 580469, 578931, 578953, 580484, 582502, 584609, 587504, 591715, 596894, 602742, 609642, 617775, 626436, 635034, 644163, 654911, 667479, 681138, 695167, 709197, 722898, 735944, 748132, 759124, 768331, 775507]
59104G75507N695N028M628L923K737J007j185l197m209m256m215m669n295n467
59090G66032m904l680k228j361j610k465k854k491k162k622l809n144o031o060
59076G18611n371m837n217o130o555o283o059o213o122n323m304l733l506l117
59062F45841k432j721j207r95j158j629k123k316k084j587j265j516k147k389
59048F21272j845j061p71q65p11k04J83K67L14M28L34j59r15j597j712r19L13
59031F12352Q74N04M88J987M310N905O630P622R187J0302J0374J0082J0103J0109
59017G00829R516Q241O382L983J475m41j679k743l697m030l689l193k581j267
59003G07106O96K298L015L563M665N942O581O343N458M290L522L766M508M358
$$ y = [775507, 781202, 786230, 790858, 794781, 797518, 798525, 797340, 794143, 789934, 785678, 781463, 776794, 771499, 766032, 761128, 757448, 755220, 753859, 752249, 749784, 746930, 744439, 742277, 739655, 735846, 730702, 724671, 718611, 713240, 708403, 703186, 697056, 690501, 684218, 678159, 671946, 665824, 660501, 656197, 652464, 648958, 645841, 643409, 641688, 640481, 639486, 638328, 636699, 634576, 632260, 630176, 628589, 627324, 625808, 623661, 621272, 619427, 618366, 617595, 616730, 616019, 615815, 615998, 616265, 616579, 617007, 617341, 617182, 616267, 614670, 612958, 612039, 612352, 613226, 613730, 614218, 616205, 620515, 626420, 633050, 640672, 649859, 660161, 670535, 680617, 690720, 700829, 710345, 718586, 724968, 728951, 730426, 729985, 728306, 725563, 721866, 717836, 714147, 710954, 708373, 707106, 707802, 710100, 713115, 716678, 721343, 727285, 733866, 740209, 745667, 749957, 753479, 757245, 761753, 766111]
58989G66111K861J174L29j24r76j867j958j407j080j179j155o11N10K332M763
58974G67723P042Q351Q829R326J0290J1459J2489J3266J3650J3455J2759J1873
58962I00512J1027J0319R758R103P853N779L255P56j773m675p883j0921j3472
58949I19638j5562j7149j7922j7683j6760j5824j5282j4887j4053j2502j0513
58938G51501q527o759n292m174l206k001n85M69Q49R82J222J098R9j280k135k412
58922G19849k661k832k470j824j605j631j061q4N7r45j723j165J66J235K082L251
58906G08639M594N658O675Q263J0424J2573J4235J5205J5445J5272J5279J5578
58894H47840J5601J5041J4490J4725J5838J7529J9578K1551K2611K2316K1153
$$ y = [766111, 768972, 770146, 770475, 770351, 769375, 767508, 765550, 764143, 763063, 761884, 760729, 760118, 760628, 762960, 767723, 774765, 783116, 791945, 801271, 811561, 823020, 835509, 848775, 862425, 875880, 888639, 900512, 911539, 921858, 931616, 940719, 948572, 954351, 957606, 958362, 956589, 951914, 944031, 933110, 919638, 904076, 886927, 869005, 851322, 834562, 818738, 803456, 788569, 774516, 762014, 751501, 742974, 736215, 730923, 726749, 723543, 721542, 720957, 721426, 722275, 723257, 724479, 725577, 725676, 724396, 722261, 719849, 717188, 714356, 711886, 710062, 708457, 706826, 705765, 705681, 705738, 704793, 703070, 701905, 702071, 703306, 705388, 708639, 713233, 718891, 725566, 733829, 744253, 756826, 771061, 786266, 801711, 816983, 832262, 847840, 863441, 878482, 892972, 907697, 923535, 941064, 960642, 982193, 1004804, 1027120, 1048273]
58883A048273J9696J7651J4422J0219N913K013j618n216q748j1954j4436j5847
58871A060368j6273j6141j5534j4052j1687r410q346q601r289r501r027q303p988
58858I16216q388r157r709r954j0290j0852j1272j1233j0757r906q772p843p705
58845G90378q177q448q273q349r165j0235j0786j0575r723q423p208o743o932
58832F77341o883o166n346m840m107k619q81K97R36J581K336K954L492M112M573
58817F66780M570M320M252M320M109L435K477J527Q64N97M31j8o03q33q02j207
58801F94219k219l089l264l054k907k802k896l848n762p530q051p500o676n694
58787F28927m144k105j46J433K644L409L691L796M021M280M417M508M456L812
$$ y = [1048273, 1067969, 1085620, 1100042, 1110261, 1116174, 1118187, 1116569, 1111353, 1102605, 1090651, 1076215, 1060368, 1044095, 1027954, 1012420, 998368, 986681, 977271, 968925, 960324, 951035, 941534, 932507, 924204, 916216, 907828, 898671, 888962, 879008, 868718, 857866, 846594, 835361, 824604, 814698, 805926, 798083, 790378, 782201, 773753, 765480, 757131, 747966, 737731, 726945, 716370, 706647, 698224, 691016, 684273, 677341, 670458, 664292, 658946, 654106, 649999, 647380, 646499, 646796, 647732, 649313, 651649, 654603, 658095, 662207, 666780, 671350, 675670, 679922, 684242, 688351, 691786, 694263, 695790, 696654, 697251, 697682, 697664, 697061, 696228, 695426, 694219, 692000, 688911, 685647, 682593, 679686, 676884, 673988, 670140, 664378, 656848, 648797, 641297, 634621, 628927, 624783, 622678, 622532, 623965, 626609, 630018, 633709, 637505, 641526, 645806, 650223, 654731, 659187, 662999]
58773F62999K392P17o49j732k758l654m347n018n704o117o165o038n586m404k866
58758F11070k039k090j779k58J567K374K182J833J492Q34J46J67J064K450M024
58743F23037N512O393O488O419O797P347P538P539P773Q029P903P616P639P839
58729G23869P808P633P587P410O726N782N057M497L805L169L024L384M043M965
58715G98759O001O653O688O401N823M409K110p3j415k548m420o905r327j1608
58701H00548j3913j5878j7192j8259j9330j9705j8852j7523j6617j5690j3902
58690F13687j1729j0303r542q443o853n552m811m294m059m306m317l104j198k40
58676E34936p22j296o87Q72K409L496M374N481P075Q903J0350J1319J2591J4598
$$ y = [662999, 665391, 666108, 665459, 663727, 660969, 657315, 652968, 647950, 642246, 636129, 629964, 623926, 618340, 613936, 611070, 609031, 606941, 605162, 604904, 606471, 608845, 611027, 612860, 614352, 615186, 615332, 615499, 616563, 619013, 623037, 628549, 634942, 641430, 647849, 654646, 661993, 669531, 677070, 684843, 692872, 700775, 708391, 716030, 723869, 731677, 739310, 746897, 754307, 761033, 766815, 771872, 776369, 780174, 783343, 786367, 789751, 793794, 798759, 804760, 811413, 818101, 824502, 830325, 834734, 836844, 836771, 835356, 832808, 828388, 821483, 812156, 800548, 786635, 770757, 753565, 735306, 715976, 696271, 677419, 659896, 643279, 627589, 613687, 601958, 591655, 582113, 573670, 566817, 561265, 556454, 552160, 548101, 543795, 539478, 536374, 535176, 534936, 534214, 532918, 532231, 533103, 535512, 539008, 543382, 548863, 555938, 564841, 575191, 586510, 599101, 613699]
58662F13699J6279J6066J3684J0129O154J868k384n811p975r089r503r499r446
58649F24172r536r481q941p985o799n421m145l452l120k238o99L66L87L77J156
58634E64641J812J238J10k71j28m50r01l00J270K604L372M255N355O014O138O314
58618F01073O712P006P135P031O177M617L566L715L740K252J98o38o84j742l683
58603F46475m529l785l094l361l627l238k948l151l019k118j186o36J23J364K545
58588F15815L592N163P201Q758R647J0744J2188J2861J2168J0917R925R120Q406
58575G36505Q091Q043P701P275P624Q767R855J0791J2361J4667J6991J9334K2412
58562H90417K5900K8397K9379K9444K8395K5128J9840J4438J0043N895J349k825
$$ y = [613699, 629978, 646044, 659728, 669857, 676011, 677879, 675495, 669684, 661709, 652620, 643117, 633618, 624172, 614636, 605155, 596214, 588229, 581430, 576009, 571864, 568412, 565292, 563054, 562355, 562721, 563108, 563485, 564641, 566453, 567691, 567801, 567530, 567402, 566952, 566051, 565751, 567021, 569625, 572997, 577252, 582607, 588621, 594759, 601073, 607785, 614791, 621926, 628957, 635134, 639751, 643317, 647032, 650772, 653024, 653222, 652584, 651900, 650158, 646475, 641946, 638161, 635067, 631706, 628079, 624841, 621893, 618742, 615723, 613605, 612419, 611783, 611906, 613270, 615815, 619407, 624570, 631771, 640529, 650176, 660920, 673108, 685969, 698137, 709054, 718979, 728099, 736505, 744596, 752639, 760340, 767615, 775239, 784006, 793861, 804652, 817013, 831680, 848671, 868005, 890417, 916317, 944714, 974093, 1003537, 1031932, 1057060, 1076900, 1091338, 1101381, 1107276, 1108625, 1105800]
58550A105800n864p960r136q905p789p476q614j0027j0890j2009j4173j6819j9173
58537I66965k1180k2518k2313k0686j9019j7947j6581j4453j2469j1137r614p487
58525G71561n788n191m867m173l801m133m106l031j962j980k456k388k064k180
58511G23441k470k512k690l232l396k735j992j734j354m93j11r34k019k075j215
58496F94479k69M99J032R25L05J95J087K192K881L640M832N900O698Q107J0344
58481G42847J2145J2742J3157J4329J5435J5370J4477J3408J1553Q131L745m23
58469H76916l990o839q408q690q792r282r114p383m898k859j081J147L633N858
58455H16218P945R907J1095J1341J1432J1419R935O383K253r32l500o111p948
$$ y = [1105800, 1099936, 1091976, 1082840, 1073935, 1066146, 1058670, 1050056, 1040029, 1029139, 1017130, 1002957, 986138, 966965, 945785, 923267, 900954, 880268, 861249, 843302, 826721, 812268, 799799, 788662, 779048, 771561, 765773, 760582, 755715, 751542, 747741, 743608, 739502, 736471, 734509, 732529, 730073, 727685, 725621, 723441, 720971, 718459, 715769, 712537, 709141, 706406, 704414, 702680, 701326, 700833, 700722, 699788, 697769, 695694, 694479, 694210, 694709, 695741, 696666, 696971, 697166, 698253, 700445, 703326, 706966, 711798, 717698, 724396, 732503, 742847, 754992, 767734, 780891, 795220, 810655, 826025, 840502, 853910, 865463, 873594, 877339, 876916, 872926, 866087, 857679, 848989, 840197, 830915, 821801, 814418, 809520, 806661, 805580, 806727, 810360, 816218, 824163, 834070, 845165, 856506, 867938, 879357, 889292, 895675, 897928, 896996, 893496, 887385, 879437]
58442H79437q137p579p579p748o931n349m166l661l240k549j507K3J636K459K597
58427H27706L374N250O954P472P382P207O217M019J684K1j586l442m533m628n317
58412H57780p353q916q402p041o773p338p512p522p924p660n586k720p62M37J928
58397G74636L335L607L068K825L036L388M096M899M518K709J364J860L022L463
58383H19826L981N553O934O661N721N802O502O731P179Q697R817Q708O363N116
58369I13591N243N608O376Q195R944J0131R651J0351J1835J2261J1493J0821J0380
58356A035880R342P908O787N570L781K390K204K038P59l86J59J548K332L224N303
58341A088839P325P826Q129J0137J2750J3800J3910J5035J6656J6956J6327J6121
$$ y = [879437, 871300, 863721, 856142, 848394, 841463, 836114, 831948, 828287, 825047, 822498, 820991, 821014, 822650, 825109, 827706, 831080, 836330, 843284, 850756, 858138, 865345, 871562, 875581, 877265, 877286, 875700, 872258, 867725, 863097, 857780, 850427, 841511, 833109, 826068, 819295, 811957, 804445, 796923, 788999, 781339, 775753, 773033, 772271, 772708, 774636, 777971, 781578, 784646, 787471, 790507, 793895, 797991, 802890, 807408, 810117, 811481, 813341, 816363, 819826, 823807, 829360, 836294, 842955, 848676, 854478, 860980, 867711, 874890, 883587, 893404, 902112, 908475, 913591, 918834, 924442, 930818, 939013, 948957, 959088, 968739, 979090, 990925, 1003186, 1014679, 1025500, 1035880, 1045222, 1053130, 1059917, 1065487, 1069268, 1071658, 1073862, 1075900, 1076659, 1076273, 1076432, 1077980, 1080312, 1083536, 1088839, 1096164, 1103990, 1112119, 1122256, 1135006, 1148806, 1162716, 1177751, 1194407, 1211363, 1227690, 1243811]
58329A243811J5365J2451Q840P252P249O377M611L795L760K944J965K652M294
58316A325366M814M756O206Q516R289Q808R407J1048J1714J1559J2541J4359J4955
58303A453338J4651J5575J7398J7789J6803J6716J7766J8147J7865J8611K0099
58292A644758K0537K0235K0887K1953K1777K1382K2854K4975K5021K3885K4600
58281A892864K6680K7082K5972K6262K8011K8676K8482L0092L3233L5159L6154
58270B218667L9155M4038M7807N0232N3791N8227O0800O1713O3682O6403O7141
58259B831656O6340O6757O7638O6051O3183O2851O4498O4563O3964O6819P2397
58248C556717P6121P8203Q3184R1085R7347J01542J07681J15749J21801J26628
$$ y = [1243811, 1259176, 1271627, 1280467, 1287719, 1294968, 1301345, 1305956, 1309751, 1313511, 1316455, 1318420, 1321072, 1325366, 1330180, 1334936, 1341142, 1349658, 1358947, 1367755, 1377162, 1388210, 1399924, 1411483, 1424024, 1438383, 1453338, 1467989, 1483564, 1500962, 1518751, 1535554, 1552270, 1570036, 1588183, 1606048, 1624659, 1644758, 1665295, 1685530, 1706417, 1728370, 1750147, 1771529, 1794383, 1819358, 1844379, 1868264, 1892864, 1919544, 1946626, 1972598, 1998860, 2026871, 2055547, 2084029, 2114121, 2147354, 2182513, 2218667, 2257822, 2301860, 2349667, 2399899, 2453690, 2511917, 2572717, 2634430, 2698112, 2764515, 2831656, 2897996, 2964753, 3032391, 3098442, 3161625, 3224476, 3288974, 3353537, 3417501, 3484320, 3556717, 3632838, 3711041, 3794225, 3885310, 3982657, 4084199, 4191880, 4307629, 4429430, 4556058]
58238D556058J35120J46611J55310J60923J69086J80635J90632J98871K10792
58229F104038K26762K41329K54398K71876K93912L14258L32860L56803L87024
58220H783260M16946M46156M81851N24630N67332O10449O63532P28522P97821
58211A4020499Q71924R61741J070038J189346J322482J485235J684049J912655
58203B4517969K176371K496383K884177L338427L876141M540484N371287O399758
58195E5600997P678723R277931J1241532J3605466J6475684K0011672K4258032
58188A58150037K8995046L3722972L7637307L9526916L7920821L1787600K1405842
58181C89146541Q553432m301210j5150486k3061788k8047391l0609275l1356977
$$ y = [4556058, 4691178, 4837789, 4993099, 5154022, 5323108, 5503743, 5694375, 5893246, 6104038, 6330800, 6572129, 6826527, 7098403, 7392315, 7706573, 8039433, 8396236, 8783260, 9200206, 9646362, 10128213, 10652843, 11220175, 11830624, 12494156, 13222678, 14020499, 14892423, 15854164, 16924202, 18113548, 19436030, 20921265, 22605314, 24517969, 26694340, 29190723, 32074900, 35413327, 39289468, 43829952, 49201239, 55600997, 63279720, 72557651, 83799183, 97404649, 113880333, 133892005, 158150037, 187145083, 220868055, 258505362, 298032278, 335953099, 367740699, 389146541, 397699973, 393398763, 378248277, 355186489, 327139098, 296529823, 265172846]
58174B65172846l0793070k9250839k6970884k4216261k1285840j8428376j5787544
58167I8440032j3430445j1385156r641332q157341o894833n834293m954070m219418
58159C3923144l601816l089012k667735k314965k014000j762143j555094j379024
58151A5539355j224473j093313r85176q90418q02512p24709o58614n97993n39374
58142H022773m87350m44055m04028l64510l30537l04826k82457k60326k42364
58133D902320k30577k19951k07098j95334j86684j77069j64107j51797j42960
58124C226743j34391j23855j14708j09215j04136r7106r0866q7283q3378p7253
58114B204552p1781o8746o5277n9720n5217n3798n2597m9431m6539m5435m3632
$$ y = [265172846, 234379776, 205128937, 178158053, 153941792, 132655952, 114227576, 98440032, 85009587, 73624431, 63983099, 55825758, 48930925, 43096632, 38142562, 33923144, 30321328, 27232316, 24564581, 22249616, 20235616, 18473473, 16918379, 15539355, 14314882, 13221569, 12236393, 11345975, 10543463, 9818754, 9160140, 8562147, 8022773, 7535423, 7091368, 6687340, 6322830, 5992293, 5687467, 5405010, 5144684, 4902320, 4671743, 4451792, 4244694, 4049360, 3862676, 3685607, 3521500, 3369703, 3226743, 3092352, 2968497, 2853789, 2744574, 2640438, 2543332, 2452466, 2365183, 2281805, 2204552, 2132771, 2064025, 1998748, 1939028, 1883811, 1830013, 1777416, 1727985, 1681446, 1636011, 1592379]
58103A592379l9950l7527l7994l7992l5073l1902l0984l0341k8120k6572k7489
58092A228435k8292k6550k4239k3754k3694k2150k0379j9726j8682j6244j4652
58081I90073j5548j6971j7119j7406j8893j9492j7878j6494j7370j8490j7482
58070G96930j5593j4806j4316j3022j2243j2822j2668j0394q287q489r255q253
58058F56782o615o408o879o524o307p513q790q513p806q164q364o808m771m278
58044E59042m769m738m652n477o256n960n745o770p712p049n834n607n557m503
58030D78413l622m453n971o391o181o666p285o818n790n303m952m122l550l598
58016D03711k933j076j7r18j689m36J061M03j258j386m32n00j291j043j92m69
$$ y = [1592379, 1552429, 1514902, 1476908, 1438916, 1403843, 1371941, 1340957, 1310616, 1282496, 1255924, 1228435, 1200143, 1173593, 1149354, 1125600, 1101906, 1079756, 1059377, 1039651, 1020969, 1004725, 990073, 974525, 957554, 940435, 923029, 904136, 884644, 866766, 850272, 832902, 814412, 796930, 781337, 766531, 752215, 739193, 726950, 714128, 701460, 691066, 682779, 674290, 665035, 656782, 650167, 643759, 636880, 630356, 624049, 616536, 607746, 599233, 591427, 583263, 574899, 568091, 563320, 559042, 554273, 549535, 544883, 539406, 533150, 527190, 521445, 514675, 506963, 499914, 494080, 488473, 482916, 478413, 474791, 470338, 464367, 457976, 451795, 445129, 437844, 431026, 425236, 419933, 414981, 410859, 407309, 403711, 400778, 399702, 399685, 398767, 397078, 396642, 397703, 398106, 396848, 395462, 395030, 394530, 393239, 392196, 392004, 391535]
58000C91535j331p64J027J988J826K102L004K994J567j35j452k605l280k935k232
57985C91309k259k702k638k459l097m048m236m087m659n429n062l823l092l006
57971C40712k587j699j023n09L15J019R50N84O22O03rm28QJ79j001k335k110j051
57953C32240j097k127k486j983j813k024j622q50r07j500j096N30K151L348M800
57938C25564O422P324P673Q517R773J0290R915R630R611Q946P327N334L079K34
57924D29639k729m947o651q584j0266j0556r756r312r590r656r128q468p571n852
57910C16573l701k163j267k57O81O95P9O9Q21J289J023N05j55j177j971j684p42
57893C08618k01J43J239K742L399L237L398L988M147M123N049O558O867N511L962
$$ y = [391535, 390204, 389440, 390467, 392455, 394281, 396383, 399387, 402381, 403948, 403813, 402361, 399756, 396476, 393541, 391309, 389050, 386348, 383710, 381251, 378154, 374106, 369870, 365783, 361124, 355695, 350633, 346810, 343718, 340712, 338125, 336426, 335403, 334894, 335209, 336228, 337178, 337762, 338384, 338987, 338978, 338550, 338558, 338737, 337736, 335401, 333291, 332240, 331143, 329016, 326530, 324547, 322734, 320710, 319088, 318238, 317331, 315831, 314735, 315265, 317416, 320764, 325564, 331986, 339310, 346983, 355500, 365273, 375563, 385478, 395108, 404719, 413665, 420992, 426326, 429405, 429639, 426910, 421963, 415312, 406728, 396462, 385906, 376150, 366838, 357248, 347592, 338464, 329996, 322425, 316573, 312872, 310709, 309442, 309185, 309866, 310561, 310640, 310709, 311530, 312819, 313842, 314347, 314192, 313015, 311044, 309360, 308618, 308417, 308560, 309799, 312541, 315940, 319177, 322575, 326563, 330710, 334833, 339882, 346440, 353307, 358818, 362780]
57878C62780L142K403J328N12k3j167k917l996l972l934m449m584l735k736k323
57863C36329j976j156l45l4J31N54J108J852L173M709N389M921M157L669L150
57848C65631K486K071J764Q90l53q97n84n32j271j892j570o20L45J108J359Q15
57832C68750J60N06J614K149J859J828K252J875L77o50j46O83L01r77j977k564
57816C76040l209l683l590l422l871m674n176n514o394p975r647j0587j0250q817
57802B89231p407p108p607p540o339m765l484k356j383j109j515j704j253p84
57788B34877o41j93R80K220K830K989L103L268L806N206O966P662O887O011O279
57773B92250P217P671P325O409M952L178J783R91P2j450l025l997m404m289l314
$$ y = [362780, 365922, 368325, 369653, 370165, 370142, 368975, 366058, 362062, 358090, 354156, 349707, 345123, 341388, 338652, 336329, 334353, 333197, 332852, 332818, 332949, 333503, 334611, 336463, 339636, 344345, 349734, 354655, 358812, 362481, 365631, 368117, 370188, 371952, 372842, 372489, 371592, 371008, 370476, 369205, 367313, 365743, 365123, 365468, 366576, 367935, 368750, 368910, 369416, 371030, 373179, 375038, 376866, 379118, 380993, 381370, 380720, 380574, 381257, 381558, 380581, 378604, 376040, 372831, 369148, 365558, 362136, 358265, 353591, 348415, 342901, 336507, 328532, 318885, 308298, 298048, 289231, 281824, 274716, 267109, 259569, 253230, 248465, 244981, 242625, 241242, 240133, 238618, 236914, 235661, 234877, 234236, 234043, 235023, 237243, 240073, 243062, 246165, 249433, 253239, 258445, 265411, 273073, 279960, 285971, 292250, 299467, 307138, 314463, 320872, 325824, 329002, 330785, 331776, 331848, 330398, 327373, 323376, 318972, 314683, 311369]
57758C11369j769q80j266j989j972j325n91L51J687K861L277L084K650K120J927
57743C19534K659L746L552J615m73j327j544k176k780k475j762j695k107k188
57729C12579k051k226k216j180K94O98k40j210j107o5J169J931J857J152N44L45
57713C10274N7n37o79J27R51O99j48k97L06N28j32j029j537j618j283n62J03K45
57695C05468J17K08K78k62j282k115k565k875k965k622k221k274k427j829l95
57680B82239J172K471L676M992O691R424J3517J8178K2458K6840L2776M0681M9477
57667E14592N8047O5800P1359P1885O4619M8892K6609J421k2447m1525n4218o0816
57655G44218o2535o0750n6772n1584m5580l8919l2175k6224k1552j8085j5596
$$ y = [311369, 309600, 308720, 307454, 305465, 303493, 302168, 301577, 301928, 303615, 306476, 309753, 312837, 315487, 317607, 319534, 322193, 325939, 329491, 331106, 330633, 329306, 327762, 325586, 322806, 320331, 318569, 316874, 314767, 312579, 310528, 308302, 306086, 304906, 305200, 305898, 305658, 304448, 303341, 303276, 304445, 306376, 308233, 309385, 309929, 310274, 310331, 309794, 309115, 309242, 310193, 310892, 310744, 310447, 310753, 311281, 311149, 310120, 308583, 306965, 305682, 305120, 305223, 305468, 305585, 305793, 306071, 305809, 304527, 302412, 299847, 296972, 294007, 291385, 289164, 286890, 284463, 282634, 282239, 283411, 285882, 289558, 294550, 301241, 310665, 324182, 342360, 364818, 391658, 424434, 465115, 514592, 572639, 638439, 709798, 781683, 846302, 895194, 921803, 923224, 900777, 859252, 805034, 744218, 681683, 620933, 564161, 512577, 466997, 428078, 395903, 369679, 348127, 330042, 314446]
57644C14446j3819j2261j0416q254o187m566l458k707k010j186o12r51k103k901
57630B43015k424j185m09n72j257j997k513k428j612o77m17q17j235j360j392
57615B22720j449j498j720k247k695k528j823j104n43L4M95M68l0n04o20m61k79
57598B06216l02o01q73o63j55j78j023j851j951j905k585l537l538k493j684k031
57582A80846l071l771l592k693j665j168j298j420j030n52o94j352j802j747j467
57567A53524j120o60k36l2J16K78k8j070k028j786l90J124K065K355J842N01p61
57550A53694p56M12J382J314P66O30J095J880K694L178L098K741K570K496K151
57535A79345J710J560J280j3k106l569l498k546j847j637j446r71l09K83N60M97
$$ y = [314446, 300627, 288366, 277950, 269696, 263509, 258943, 255485, 252778, 250768, 249582, 248970, 248019, 245916, 243015, 240591, 239406, 238997, 238425, 237168, 235171, 232658, 230230, 228618, 227941, 227524, 226707, 225472, 224112, 222720, 221271, 219773, 218053, 215806, 213111, 210583, 208760, 207656, 207113, 207147, 207642, 208110, 208080, 207576, 206956, 206495, 206216, 205914, 205313, 204440, 203777, 203622, 203444, 202421, 200570, 198619, 196714, 194129, 190592, 187054, 184561, 182877, 180846, 177775, 174004, 170412, 167719, 166054, 164886, 163588, 162168, 161138, 160586, 159892, 158540, 156738, 154991, 153524, 152404, 151744, 151508, 151476, 151592, 151870, 151842, 150772, 148744, 146958, 146568, 147692, 149757, 152112, 153954, 154455, 153694, 152938, 153350, 154732, 156046, 156812, 157442, 158537, 160417, 163111, 166289, 169387, 172128, 174698, 177194, 179345, 181055, 182615, 183895, 183882, 181776, 178207, 174709, 172163, 170316, 168679, 167233, 166262, 165953, 166236, 166796, 167293]
57519A67293M65Q45J480J900K108K620L695M952N769N769N051M250M075M408M252
57504B18932L062J585P35K35p17k011k814k820k329j481m85j65r98j993j894j145
57488B05697j150j882j941j068o47j311j848j234k14J04j14j06J09R0j14j77q5
57471A94109J23N72J144J433J491J773K097J653L98n55m45J64N56R75J853K783
57455B10124L058K655J958J102K17k17J63J112K078K601K378J545R79J447K417
57440B33617K625J988J755K513L315L322L079L316L694L503K743J747O26j91J30
57425B67782J531K627K437J696J604K185K801L367L965M064L273K292K028K314
57411C03966K477K589L069L558L311K491K018K281K797K925K340J158J75L98J716
$$ y = [167293, 167758, 168603, 170083, 171983, 174091, 176711, 180406, 185358, 191127, 196896, 201947, 206197, 210272, 214680, 218932, 221994, 223579, 224314, 224549, 223832, 221821, 219007, 216187, 213858, 212377, 211892, 211727, 210729, 208736, 206842, 205697, 204547, 202665, 200724, 199656, 199009, 197698, 195850, 194616, 194402, 194506, 194392, 194286, 194395, 194485, 194371, 194194, 194109, 194232, 194804, 195948, 197381, 198872, 200645, 202742, 204395, 204793, 204238, 203793, 203957, 204513, 205488, 207341, 210124, 213182, 215837, 217795, 218897, 219114, 218897, 219060, 220172, 222250, 224851, 227229, 228774, 229753, 231200, 233617, 236242, 238230, 239985, 242498, 245813, 249135, 252214, 255530, 259224, 262727, 265470, 267217, 267843, 267652, 267782, 269313, 271940, 274377, 276073, 277677, 279862, 282663, 286030, 289995, 294059, 297332, 299624, 301652, 303966, 306443, 309032, 312101, 315659, 318970, 321461, 323479, 325760, 328557, 331482, 333822, 334980, 335155, 335553, 337269]
57396C37269K669K312J607J953L058L445K696J898J948K575L126L412L590L811
57382C75369M103M234L873L208K980L517M198M472M712N310N536M415K425J264
57368D29616J835L326M372M472M135M066M397M554M115L640M164N683O979P226
57354D92580O939O820O635N990N329N218N371N320N487O466P704Q020P148N906
57340E80933N089M965N548O486P022O785O339O338O581O549O320O237O274O419
57326F67885O981P746P676O429N330N666O794P207O743O331O227O070O180P114
57312G60379Q246Q446P941P968Q668R007Q744Q836R657J0454J0864J1442J2254
57299H82906J2423J1579J0550J0032R783R586R839J0602J1112J0911J0560J0665
$$ y = [337269, 339938, 342250, 343857, 345810, 348868, 352313, 355009, 356907, 358855, 361430, 364556, 367968, 371558, 375369, 379472, 383706, 387579, 390787, 393767, 397284, 401482, 405954, 410666, 415976, 421512, 425927, 428352, 429616, 431451, 434777, 439149, 443621, 447756, 451822, 456219, 460773, 464888, 468528, 472692, 478375, 485354, 492580, 499519, 506339, 512974, 518964, 524293, 529511, 534882, 540202, 545689, 552155, 559859, 567879, 575027, 580933, 586022, 590987, 596535, 603021, 610043, 616828, 623167, 629505, 636086, 642635, 648955, 655192, 661466, 667885, 674866, 682612, 690288, 696717, 702047, 707713, 714507, 721714, 728457, 734788, 741015, 747085, 753265, 760379, 768625, 777071, 785012, 792980, 801648, 810655, 819399, 828235, 837892, 848346, 859210, 870652, 882906, 895329, 906908, 917458, 927490, 937273, 946859, 956698, 967300, 978412, 989323, 999883, 1010548]
57287A010548J0984J1119J1309J1939J2865J3709J4375J4951J5536J6406J7822
57276A161563J9496K0764K1410K1835K2390K3077K3827K4510K4804K4634K4553
57265A412863K4894K4970K3991K2493K1708K1708K1426K0488J9750J9835K0380
57254A654506K0986K1757K2511K2589K1876K1133K0956K1267K1970K3135K4292
57243A896978K4620K4196K4100K4900K5986K6694K7130K7500K7654K7742K8409
57232B185909K9784L1085L1660L1662L1380L0702K9697K8901K8618K8530K8364
57221B516292K8236K8157K7893K7551K7608K8145K8772K9361L0126L0982L1672
57210B834795L2516L4058L5951L7271L7948L8838M0276M1673M2639M3286M3419
$$ y = [1010548, 1021532, 1032651, 1043960, 1055899, 1068764, 1082473, 1096848, 1111799, 1127335, 1143741, 1161563, 1181059, 1201823, 1223233, 1245068, 1267458, 1290535, 1314362, 1338872, 1363676, 1388310, 1412863, 1437757, 1462727, 1486718, 1509211, 1530919, 1552627, 1574053, 1594541, 1614291, 1634126, 1654506, 1675492, 1697249, 1719760, 1742349, 1764225, 1785358, 1806314, 1827581, 1849551, 1872686, 1896978, 1921598, 1945794, 1969894, 1994794, 2020780, 2047474, 2074604, 2102104, 2129758, 2157500, 2185909, 2215693, 2246778, 2278438, 2310100, 2341480, 2372182, 2401879, 2430780, 2459398, 2487928, 2516292, 2544528, 2572685, 2600578, 2628129, 2655737, 2683882, 2712654, 2742015, 2772141, 2803123, 2834795, 2867311, 2901369, 2937320, 2974591, 3012539, 3051377, 3091653, 3133326, 3175965, 3219251, 3262670]
57199C262670M2726M1869M1962M2829M3284M3283M4085M5941M7389M7514M7090
57188C750642M6716M5586M3211M0778L9536L9180L9055L9627M1435M3568M4592
57177D213926M4214M2987M1123L8678L6118L3830L1726K9977K9311K9801L0457
57166D602148L0698L1178L2304L3232L3313L3351L4294L5661L6450L6674L6828
57155D976131L6721L6008L5158L4757L4543L4046L3475L3115L2616L1701L0724
57144E348995K9830K8538K6867K5671K5133K4197K2422K0873K0186J9205J6888
57133E608805J4056J1901J0128Q199P095Q101J0978J4960K0505K8379L7983M8128
57121E829218N8479O8731P7436Q3397Q7299R0542R3512R6447J00838J08421J19839
$$ y = [3262670, 3305396, 3347265, 3389227, 3432056, 3475340, 3518623, 3562708, 3608649, 3656038, 3703552, 3750642, 3797358, 3842944, 3886155, 3926933, 3966469, 4005649, 4044704, 4084331, 4125766, 4169334, 4213926, 4258140, 4301127, 4342250, 4380928, 4417046, 4450876, 4482602, 4512579, 4541890, 4571691, 4602148, 4632846, 4664024, 4696328, 4729560, 4762873, 4796224, 4830518, 4866179, 4902629, 4939303, 4976131, 5012852, 5048860, 5084018, 5118775, 5153318, 5187364, 5220839, 5253954, 5286570, 5318271, 5348995, 5378825, 5407363, 5434230, 5459901, 5485034, 5509231, 5531653, 5552526, 5572712, 5591917, 5608805, 5622861, 5634762, 5644890, 5653089, 5660184, 5668285, 5679263, 5694223, 5714728, 5743107, 5781090, 5829218, 5887697, 5956428, 6033864, 6117261, 6204560, 6295102, 6388614, 6485061, 6585899, 6694320, 6814159]
57110F814159J35578J56713J83216K13280K46038K83423L27973L81153M45818
57101I187351N27792O32562P62542R20027J110180J338483J608430J925040K297171
57092B0309578K731461L225818L771418M356270M961622N559434O119797O616735
57084E7652133P022258P305992P453622P471555P341335O964819O191966M942525
57076A12346205L306628J513991j97509j687675k924510l937078m771398n464504
57068I8184150o028958o452500o715380o808118o734912o510354o160533n723026
57060D7050369n237624m735482m237724l760045l313777k904384k533567k202915
57052A8124851j913463j663154j447630j263067j106249r73005q58782p60276
$$ y = [6814159, 6949737, 7106450, 7289666, 7502946, 7748984, 8032407, 8360380, 8741533, 9187351, 9715143, 10347705, 11110247, 12030274, 13140454, 14478937, 16087367, 18012407, 20309578, 23041039, 26266857, 30038275, 34394545, 39356167, 44915601, 51035398, 57652133, 64674391, 71980383, 79434005, 86905560, 94246895, 101211714, 107403680, 112346205, 115652833, 117166824, 116969315, 115281640, 112357130, 108420052, 103648654, 98184150, 92155192, 85702692, 78987312, 72179194, 65444282, 58933928, 52773395, 47050369, 41812745, 37077263, 32839539, 29079494, 25765717, 22861333, 20327766, 18124851, 16211388, 14548234, 13100604, 11837537, 10731288, 9758283, 8899501, 8139225]
57044H139225o74895n99588n31926m71540m18847l73052l32755k97557k67395
57035D171670k40997k16653j93881j73003j53608j34876j16766r9551q2598o4918
57025B694819m6460k8032j0964J773N342l618k3304m7793p1558r1573j05997j13467
57013B159168j14499j11529j06525r9611r0741q1332p3170o6540o0528n4622m9132
57002A250939m4388m0245l6441l2989l0191k8346k7309k6378k4960k3221k1688
56991I14783k0275j8327j5629j2640r575o059j935K223N834Q790J0746J0578P314
56978H75828J394n553j1970j7065k0647k2849k3912k3854k2526k0197j7660j5336
56966F75653j2724r288n526k409kK606O094J0313J4855J9348K2966K4332K2346
$$ y = [8139225, 7464330, 6864742, 6332816, 5861276, 5442429, 5069377, 4736622, 4439065, 4171670, 3930673, 3714020, 3520139, 3347136, 3193528, 3058652, 2941886, 2842335, 2759737, 2694819, 2648359, 2620327, 2609363, 2611136, 2616478, 2612860, 2589556, 2541763, 2470205, 2378632, 2272635, 2159168, 2044669, 1933140, 1826615, 1727004, 1636263, 1554931, 1481761, 1415221, 1354693, 1300071, 1250939, 1206551, 1166306, 1129865, 1096876, 1066685, 1038339, 1011030, 984652, 959692, 936471, 914783, 894508, 876181, 860552, 847912, 838337, 832278, 830343, 832566, 838400, 847190, 857936, 868514, 875828, 877222, 871669, 859699, 842634, 821987, 799138, 775226, 751372, 728846, 708649, 690989, 675653, 662929, 653641, 648115, 645706, 645704, 648310, 654404, 664717, 679572, 698920, 721886, 746218, 768564]
56953G68564J6872Q618j148j0731j8550k3893k6943k8030k7378k5467k2917j9795
56941E89202j5770j1202p209m240j326K619P466J2517J7824K3852L0156L5252
56929F79141L7656L6340L0490J9959O125q428k1383l1484l8127m1034m0636l8102
56917E90517l4718l1349k8468k6036k3375j9851j5870j2627j0696r486q315p293
56905C62433o767o480n813m545k898j219R7P01P70J038K024L501N120P153J0055
56890C65170J3619J7185K0544K4041K7760L1052L2932L2462K8900K2031J2738
56879F28434K868n758j2198j6362j8512j8956j7955j5673j2299q203l718J249
56867E02917P051J3551J9944K5779L1841L9518M9183N9606O8813P4843P5523O8531
$$ y = [768564, 785436, 794054, 792906, 782175, 763625, 739732, 712789, 684759, 657381, 631914, 608997, 589202, 573432, 562230, 555021, 550781, 549455, 552074, 559540, 572057, 589881, 613733, 643889, 679141, 716797, 753137, 783627, 803586, 809711, 801283, 779900, 748416, 710289, 669255, 628619, 590517, 555799, 524450, 495982, 469946, 446571, 426720, 410850, 398223, 387527, 378041, 369726, 362433, 355666, 349186, 343373, 338828, 335930, 334711, 334808, 335509, 336279, 337317, 339341, 342842, 347962, 355115, 365170, 378789, 395974, 416518, 440559, 468319, 499371, 532303, 564765, 593665, 615696, 628434, 631302, 625544, 613346, 596984, 578472, 559516, 541561, 525888, 513589, 505386, 501668, 502917, 509968, 523519, 543463, 569242, 601083, 640601, 689784, 749390, 818203, 893046, 968569, 1037100]
56855A037100N2872L0506N921j6282l3459m5061n1545n3533n1554m6184l8310
56844G90471k9177j9870j0626r58R502K0633L2415M5373O0066P6340R3224J08951
56832A176344J20480J23425J13565Q9376N3454J1759k8716o2307q6029r9511j04068
56821A307772j01795r4990q5569p4513o2116m8873l5736k3301j1181J390J4651
56810G85739K8388M2514N6951P0803Q1893Q7011Q2779O7139M1044Q879k3252n0174
56798A279714o9219q0141q4192q3108p8391p1160o2407n2980m3350l3765k4704
56787E96297j6635r262j669O585J5220K4044L2969M0736M4728M2830L4893K1948
56775H32684N267j2914k9097m0564m7270n0658n1394m9533m6008m2156l8125l3316
$$ y = [1037100, 1089972, 1120478, 1126399, 1110117, 1076658, 1031597, 980052, 926519, 874965, 828781, 790471, 761294, 741424, 730798, 729840, 739342, 759975, 792390, 837763, 897829, 974169, 1067393, 1176344, 1296824, 1420249, 1533814, 1623190, 1676644, 1688403, 1659687, 1597380, 1511351, 1411840, 1307772, 1205977, 1110987, 1025418, 950905, 888789, 839916, 804180, 780879, 769698, 771088, 785739, 814127, 856641, 913592, 984395, 1066288, 1153299, 1236078, 1303217, 1344261, 1353140, 1329888, 1279714, 1210495, 1130354, 1046162, 963054, 884663, 813503, 751096, 698116, 654766, 621001, 596297, 579662, 570400, 568731, 575316, 590536, 614580, 647549, 688285, 733013, 775843, 810736, 832684, 837951, 825037, 795940, 755376, 708106, 657448, 606054, 556521, 510513, 468357, 430232, 396916]
56763C96916k8194k3980k0809j7807j4915j2923j1665r994p821o412o234o138
56751B30024n296m316l790l262k533k450l401m237l774k432j349q13m89l56n00
56736A91026o30o11p65j036p74L3L13m61j233r34j52r4n87m46P10K039K632K227
56718A91257J081m4j86P57J699J754J384J447J818J880J804K192K840K945K338
56703B14966J507O65k57q44m95M98J078P79K08j7kj33l90m69k30J58L83L17K34
56684B17956M99R92J198R48O49N34K89k49o04l32L55J085J886K682K883K157J209
56667B34137J041J715K472K785K691K400K191K458L342M470N424O177O700O613
56653B84616N753M658L955L590L214K875K789K724K211J147k10j622k895l846
$$ y = [396916, 368722, 344742, 323933, 306126, 291211, 278288, 266623, 256629, 248808, 242396, 236162, 230024, 224728, 220412, 216622, 213360, 210827, 208377, 204976, 200739, 196965, 194533, 193184, 192371, 191882, 191526, 191026, 190396, 189785, 189020, 187984, 187210, 187243, 187556, 187095, 185862, 184928, 184776, 184682, 184095, 183649, 184359, 186398, 189030, 191257, 192338, 192294, 192108, 192865, 194564, 196318, 197702, 199149, 200967, 202847, 204651, 206843, 209683, 212628, 214966, 216473, 217138, 216881, 216037, 215542, 216040, 217118, 217897, 218105, 218088, 218086, 217953, 217563, 217094, 216864, 217022, 217405, 217722, 217956, 218455, 219447, 220645, 221593, 222242, 222776, 223065, 222816, 222212, 221880, 222235, 223320, 225206, 227888, 230771, 232928, 234137, 235178, 236893, 239365, 242150, 244841, 247241, 249432, 251890, 255232, 259702, 265126, 271303, 278003, 284616, 290369, 295027, 298982, 302572, 305786, 308661, 311450, 314174, 316385, 317532, 317322, 315700, 312805, 308959]
56639C08959m631n692p081q277q909r150r161q777q111p691p582p134o086n138
56625B05539m868m868m574m094l576k683j486q85j251j498n77R00J701J779J823
56610A81382J683P30o10j097l68Q22J773K284K123J275N14O36J207J104K36l35
56594A93359J6P49J072P47L1n29l21N80J148O49k09k12N98J093P89L23L08O86
56576B00877J190J594J510P68j5M4J010K203L168L940M531M921N303N749N880
56561B42673N547N407O089P179P801P793P462O738N457M073L164K549J850J317
56547C15099J214R38p6j158j346j010j184j742j690r93n64o88q93j305k529m128
56531B97945m706l840k657k165k194k199k058j799j382r86p31k50O85J371J012
$$ y = [308959, 304328, 298636, 291555, 283278, 274369, 265219, 256058, 247281, 239170, 231479, 223897, 216763, 210677, 205539, 200671, 195803, 191229, 187135, 183559, 180876, 179390, 178505, 177254, 175756, 175179, 176079, 177780, 179559, 181382, 183065, 183795, 183185, 182088, 181720, 182542, 184315, 186599, 188722, 189997, 190511, 191147, 192354, 193458, 193694, 193359, 193375, 194124, 195196, 195943, 195974, 195445, 195124, 195704, 196852, 197501, 197292, 197080, 197678, 198771, 199560, 199883, 200191, 200877, 202067, 203661, 205171, 205939, 205924, 205968, 206978, 209181, 212349, 216289, 220820, 225741, 231044, 236793, 242673, 248220, 253627, 259716, 266895, 274696, 282489, 289951, 296689, 302146, 306219, 309383, 311932, 313782, 315099, 316313, 317251, 317175, 316017, 314671, 313661, 312477, 310735, 309045, 308052, 307488, 306800, 305907, 304602, 302073, 297945, 293239, 289399, 286742, 284577, 282383, 280184, 278126, 276327, 274945, 273959, 273228, 272978, 273663, 275034, 276046]
56516B76046M6m72n24r88k071l143l905m490m629l985l146k985l243l063k558
56501B36890k428k386j680q78j205k271k384j238k49k1M16J422J915J431J041
56486B28375J345J400O30R6P18J704J877J347P74J33p36j313j114m50K70J098
56470B36154J839J736N95p12j434j738j833j412n49p7l70o98m10J56M81O29O26
56453B32983J25p15r39q1J065J521J184N39P9L12J395K521K651J958J468J295
56437B47361N96n43q71J0R38J002O07J72n60j316j027K75R38L2j187j260n20k
56419B44645L15R34J549J606J354J302J355J297J312J369J029M12K80O08L72n89
56403B59150r77j69N24n6j005q44J71O59K06m35o61m15K50J137J850K326K852
$$ y = [276046, 276092, 275620, 275096, 274108, 272037, 268894, 264989, 260499, 255870, 251885, 248739, 245754, 242511, 239448, 236890, 234462, 232076, 230396, 229518, 228313, 226042, 223658, 222420, 222171, 222150, 222566, 223988, 225903, 227334, 228375, 229720, 231120, 231750, 231846, 232564, 234268, 236145, 237492, 238266, 238399, 237663, 236350, 235236, 234786, 235056, 236154, 237993, 239729, 240324, 239612, 238178, 236440, 234607, 233195, 232646, 232569, 232199, 231501, 231091, 231247, 231728, 232357, 232983, 233108, 232393, 231454, 231373, 232438, 233959, 235143, 235682, 235761, 236073, 237468, 239989, 242640, 244598, 246066, 247361, 247957, 247414, 246543, 246553, 247491, 248493, 249100, 249272, 248712, 247396, 246369, 246644, 247582, 247614, 246427, 245167, 244647, 244645, 244960, 245894, 247443, 249049, 250403, 251705, 253060, 254357, 255669, 257038, 258067, 258479, 258759, 259367, 259739, 259150, 258173, 258004, 258528, 258472, 257467, 256623, 256794, 257453, 257659, 257224, 256563, 256148, 256398, 257535, 259385, 261711, 264563]
56386B64563L335L432L538M494N996O745O467O203O212N422L642K232J723P70
56372C24774j260k800k655k115k684l480k968j711j277j546j338p20n71o15L3
56357B99067R20Q37j2k68M34J191J511J728J898J659J135Q60Q96Q62O43L26j08
56340C13579l91kQ38J107O12N55J594K588K407J739J797K328K355J961J869K010
56324C36946J947J975K551L182L115K492J840J217O74O16Q81O04p2L23K174L626
56308C64091L246K169K016K297J837J263J901L319M200M687N708O775O640N538
56294D15687M789M666M508M340M618M941M750M708N730P262Q146Q418Q668Q582
56280D99813P875P618Q649R700R227Q194Q654J0453J1716J2037J2660J3882J4778
$$ y = [264563, 267898, 271330, 274868, 279362, 285358, 292103, 298570, 304773, 310985, 316407, 320049, 322281, 324004, 324774, 323514, 320714, 318059, 315944, 313260, 309780, 306812, 305101, 303824, 302278, 300940, 300220, 299649, 299034, 299067, 299987, 300824, 300812, 300544, 300978, 302169, 303680, 305408, 307306, 308965, 310100, 310960, 311856, 312718, 313361, 313687, 313579, 313188, 313186, 314024, 315131, 315743, 316298, 317892, 320480, 322887, 324626, 326423, 328751, 331106, 333067, 334936, 336946, 338893, 340868, 343419, 346601, 349716, 352208, 354048, 355265, 355939, 356555, 357436, 358040, 357968, 358291, 360465, 364091, 367337, 369506, 371522, 373819, 375656, 376919, 378820, 382139, 386339, 391026, 396734, 403509, 410149, 415687, 420476, 425142, 429650, 433990, 438608, 443549, 448299, 453007, 458737, 465999, 474145, 482563, 491231, 499813, 507688, 515306, 523955, 533655, 542882, 551076, 559730, 570183, 581899, 593936, 606596, 620478, 635256]
56267F35256J5338J6542J8394J9989K1499K3975K7237L0044L2284L5090L8794
56256I14442M2824M7553N4142O2420P0874P8890Q7279R6392J05561J14434J23286
56245A798097J31725J38682J43741J47138J48413J46498J41087J32626J21189
56236C049196J06518Q8857O8568M5578K0522m351k7003m7547o6818q4024r7789
56225C051707j08537j17613j24661j28234j28487j27053j24612j20768j15926
56216A955816j11045j05735r8912r1135q4184p8424p2728o6846o1708n7412n2962
56205A074725m8026m3197l8635l4172l0440k8071k6235k3748k1045j9171j7637
56194G44348j5378j3120j2253j2120j0905q678p047o231n191m146m205m758m052
$$ y = [635256, 650594, 667136, 685530, 705519, 727018, 750993, 778230, 808274, 840558, 875648, 914442, 957266, 1004819, 1058961, 1121381, 1192255, 1271145, 1358424, 1454816, 1560377, 1674811, 1798097, 1929822, 2068504, 2212245, 2359383, 2507796, 2654294, 2795381, 2928007, 3049196, 3155714, 3244571, 3313139, 3358717, 3379239, 3374888, 3347885, 3300338, 3233520, 3149496, 3051707, 2943170, 2825557, 2700896, 2572662, 2444175, 2317122, 2192510, 2071742, 1955816, 1844771, 1739036, 1640124, 1548989, 1464805, 1386381, 1313653, 1246807, 1185099, 1127687, 1074725, 1026699, 983502, 944867, 910695, 880255, 852184, 825949, 802201, 781156, 761985, 744348, 728970, 715850, 703597, 691477, 680572, 671894, 664847, 658616, 653425, 649279, 645074, 640316, 636264]
56181F36264k281j348j647j674q44j57l3J05K10j10j3J445L106L241K659L369
56165F42292M855M883L673L733N604P194P564Q044R265J0301J1186J3066J5470
56152G47130J6536J6437J7515K0471K3470K5496K7713L1045L5281M0941M9085
56141A051120N8958O8773P8931R1292J05091J16870J24650J28805J28701J22426
56131B075617J10589R6865Q3951P2216O2455N6000N1374M4785L5014K4262J3608
56120B726736J736j0826k0632k6228l0452l6299m4064n3841o6879q2425r6755
56109B260071j07243j14340j18244j17207j10941j02189r3037q2827p1278o0370
56099A282395n1326m2959l4641k7805k2934j8302j3323r865q639p553n241k973
$$ y = [636264, 633983, 632635, 630988, 629314, 628470, 628313, 628280, 628385, 628595, 628485, 628472, 629917, 633023, 636264, 638923, 642292, 647147, 652030, 655703, 659436, 665040, 672234, 679798, 687842, 697107, 707408, 718594, 731660, 747130, 763666, 780103, 797618, 818089, 841559, 867055, 894768, 925813, 961094, 1002035, 1051120, 1110078, 1178851, 1257782, 1349074, 1454165, 1571035, 1695685, 1824490, 1953191, 2075617, 2186206, 2283071, 2367022, 2439238, 2501693, 2557693, 2609067, 2653852, 2688866, 2713128, 2726736, 2728472, 2717646, 2697014, 2670786, 2640334, 2604035, 2559971, 2506130, 2439251, 2356826, 2260071, 2152828, 2038488, 1920244, 1803037, 1692096, 1589907, 1496870, 1414043, 1342765, 1282395, 1231069, 1188110, 1153469, 1125664, 1102730, 1084428, 1071105, 1061240, 1052601, 1045048, 1039807, 1036834]
56087A036834j573K50K847M303L883L570M597N646N942O862Q972J0699J1361J2277
56073A116470J3744J4360J4259J5384J7521J8055J6708J6314J7767J8552J7541
56062A296675J6714J6808J5929J3911J3289J4348J4112J1886J0758J1857J2419
56051A448706J1449J1892J4902J7388J7693J8300K0473K1644K0820K1031K3656
56040A647954K5741K5682K6080K8140K9032K7665K7363K9831L2256L3255L5548
56029A968547L9874M2710M3095M4958M9430N1956N0657N0165N3157N5596N4863
56018B505008N4904N8416O1544O1573O2398O6820P0967P1976P3772P9351Q4907
56007C251636Q7494R0774R7161J02278J03663J06723J15278J24412J29791J35504
$$ y = [1036834, 1035261, 1035511, 1038358, 1042661, 1046544, 1050114, 1054711, 1060357, 1066299, 1073161, 1082133, 1092832, 1104193, 1116470, 1130214, 1144574, 1158833, 1174217, 1191738, 1209793, 1226501, 1242815, 1260582, 1279134, 1296675, 1313389, 1330197, 1346126, 1360037, 1373326, 1387674, 1401786, 1413672, 1424430, 1436287, 1448706, 1460155, 1472047, 1486949, 1504337, 1522030, 1540330, 1560803, 1582447, 1603267, 1624298, 1647954, 1673695, 1699377, 1725457, 1753597, 1782629, 1810294, 1837657, 1867488, 1899744, 1932999, 1968547, 2008421, 2051131, 2094226, 2139184, 2188614, 2240570, 2291227, 2341392, 2394549, 2450145, 2505008, 2559912, 2618328, 2679872, 2741445, 2803843, 2870663, 2941630, 3013606, 3087378, 3166729, 3251636, 3339130, 3429904, 3527065, 3629343, 3733006, 3839729, 3955007, 4079419, 4209210, 4344714]
55997D344714J45355J55077J61042J67913J79496J90885J98111K06583K21138
55988E970314K36965K49419K63379K83544L05236L24488L46960L76833M07683
55979H764821M34905M65889N06815N51399N94382O43351P04757P72081Q41382
55970A4279782R23830J028138J146355J273211J422948J609621J829066K079792
55962B5592743K382326K756815L203530L730444M378412N194468O207798P460381
55954F0906917R026586J0967096J3310336J6134362J9610722K3861040K8752875
55947A82569934L3847303L8415951M1330581M1037206L6089172K6147259J2574372
55940D12011778k063314j5211152k5262103l1716559l4856075l5366964l4039802
$$ y = [4344714, 4490069, 4645146, 4806188, 4974101, 5153597, 5344482, 5542593, 5749176, 5970314, 6207279, 6456698, 6720077, 7003621, 7308857, 7633345, 7980305, 8357138, 8764821, 9199726, 9665615, 10172430, 10723829, 11318211, 11961562, 12666319, 13438400, 14279782, 15203612, 16231750, 17378105, 18651316, 20074264, 21683885, 23512951, 25592743, 27975069, 30731884, 33935414, 37665858, 42044270, 47238738, 53446536, 60906917, 69933503, 80900599, 94210935, 110345297, 129956019, 153817059, 182569934, 216417237, 254833188, 296163769, 337200975, 373290147, 399437406, 412011778, 409948464, 394737312, 369475209, 337758650, 302902575, 267535611, 233495809]
55933B33495809l1546146k8367184k4872036k1385639j8151445j5285761j2816469
55926H1071129j0742657r036552p631985o458587n478064m668427l996024l427646
55918B9631187k951225k561018k236752j956816j717463j520324j353921j204453
55910A4129215j072527r62908q68773p80943p02004o37136n80834n25916m76052
55901G522122m36790m03264l68769l36634l12098k90954k67467k45222k29234
55892D631690k15361j98128j81207j69657j59491j45348j31200j22902j16977
55883C191419j07160r5728q8098q2197p3450o4920o2499o4582o5836o6710p0274
55872B349965p4140p4297p2955p4077p5176p1764o5960o2638o0776n6537n1212
$$ y = [233495809, 201949663, 173582479, 148710443, 127324804, 109173359, 93887598, 81071129, 70328472, 61291920, 53659935, 47201348, 41723284, 37054857, 33058833, 29631187, 26679962, 24118944, 21882192, 19925376, 18207913, 16687589, 15333668, 14129215, 13056688, 12093780, 11225007, 10444064, 9742060, 9104924, 8524090, 7998174, 7522122, 7085332, 6682068, 6313299, 5976665, 5664567, 5373613, 5106146, 4860924, 4631690, 4416329, 4218201, 4036994, 3867337, 3707846, 3562498, 3431298, 3308396, 3191419, 3084259, 2988531, 2900433, 2818236, 2744786, 2679866, 2617367, 2552785, 2486949, 2420239, 2349965, 2275825, 2201528, 2128573, 2054496, 1979320, 1907556, 1841596, 1778958, 1718182, 1661645, 1610433]
55861A610433m8240m6000m1244l6296l5179l5773l3506k9652k8549k9407k8490
55850A218097k6704k7530k9749k9462k7369k7050k7993k7061k5017k4915k5740
55839I19507k4178k1114k0006k0273j8590j5427j4074j4356j3251j0832r841j0248
55827G27317r584p884p103o698m857l064m233p337q877q694r299j0513r959q068
55813F21147p514q090o989l878j178L25J950L678M376M830O614Q596Q558P387
55799F39812P594Q518P176L287o49l668o844j0012j1854j2763j4105j5175j4350
55786E76967j2403j1226j0350q332o453p037r085r590q368p634p539o182l492
55773D69276j065J309N049R098J0660R284O689L192j894p007r572j0154j1478
$$ y = [1610433, 1562193, 1516193, 1474949, 1438653, 1403474, 1367701, 1334195, 1304543, 1275994, 1246587, 1218097, 1191393, 1163863, 1134114, 1104652, 1077283, 1050233, 1022240, 995179, 970162, 945247, 919507, 895329, 874215, 854209, 833936, 815346, 799919, 785845, 771489, 758238, 747406, 737565, 727317, 717733, 709849, 702746, 696048, 691191, 688127, 683894, 676557, 667680, 658986, 649687, 639174, 629215, 621147, 613633, 605543, 598554, 594676, 593498, 593823, 595773, 599451, 603827, 608657, 615271, 623867, 632425, 639812, 647406, 655924, 663100, 666387, 665738, 662070, 655226, 645214, 633360, 620597, 606492, 591317, 576967, 564564, 553338, 542988, 534656, 528203, 521166, 512081, 502491, 494123, 486489, 478950, 472768, 469276, 468211, 469520, 474569, 483667, 494327, 503611, 510300, 513492, 511598, 504591, 495019, 484865, 473387]
55760D73387j3602j4055j2446j0977j0283q781o363m987n187n472n401o003o987
55747C62843o924o249o750q082q144o930o453o755n733l252j758k152k569j974
55733B89118j681k384k714j819o89j23K07J20j155k997l771l468l595m280m124
55718B56645k975k198j997j229j2K97p0O63K586L780L588L422L819L496K033P87
55702B72635M43Mj090k115k809l801m948n382n333n696n867m506k278j189j185
55687B26883l72J375K114J452J290K334L053K829L128M492N297M643L802L639
55673B65959L158J847R23R76P53m74j470j322j014j489j957j464m01N47J409K123
55657B68104K305K426L454M813M701K969J560J424J174l50k339l803n050o365
$$ y = [473387, 459785, 445730, 433284, 422307, 412024, 403243, 396880, 391893, 386706, 381234, 375833, 369830, 362843, 355919, 349670, 342920, 334838, 326694, 319764, 313311, 306556, 300823, 297571, 295813, 293661, 291092, 289118, 287437, 285053, 282339, 280520, 279831, 279708, 279915, 280035, 278880, 275883, 272112, 268644, 265049, 260769, 256645, 253670, 251472, 249475, 248246, 248234, 248531, 248461, 249124, 251710, 255490, 259078, 262500, 266319, 269815, 271848, 272635, 273078, 273082, 271992, 269877, 267068, 263267, 258319, 252937, 247604, 241908, 236041, 231535, 229257, 228068, 226883, 226511, 227886, 230000, 231452, 232742, 235076, 238129, 240958, 244086, 248578, 253875, 258518, 262320, 265959, 269117, 270964, 271887, 272863, 273616, 273142, 271672, 270350, 269336, 267847, 265890, 264426, 264025, 264572, 265981, 268104, 270409, 272835, 276289, 281102, 285803, 288772, 290332, 291756, 292930, 292580, 290241, 286438, 281388, 275023]
55643B75023p082p002p048p562p690p137o782o868o449n392m911n253m897l098
55629A87852j375j230k079k507k165j406m89M5m55j563k081j908k031k446k030
55614A64132r13p84k114l209k909k159j933j628o86Q0N3k2L69L10q87k279k689
55597A42732k223j508o84L2P7l89n03j88k40n81k03P06O47n96j294n35M21N03
55579A36174M32R45J343J089R60J423J639J153Q59J218J339R04J016K028K539
55564A55061J807J048J015N16j052j951q32P44P03l98q18o48j055j766j618p22
55548A50034l0M26R44Q01n86j971j738l54M69M62P03J366J486P45j23o23q31p11
55530A50469l08k72j033j871j984j904k605l754m234m030m157m869n237m580l316
$$ y = [275023, 267941, 260939, 253891, 246329, 238639, 231502, 224720, 217852, 211403, 206011, 201100, 195847, 190950, 187852, 186477, 185247, 183168, 180661, 178496, 177090, 176601, 176646, 176191, 174628, 172547, 170639, 168608, 166162, 164132, 163219, 162435, 160321, 157112, 154203, 152044, 150111, 148483, 147797, 147877, 147930, 147908, 148277, 148587, 147700, 145421, 142732, 140509, 139001, 138317, 138349, 138426, 138037, 137534, 137346, 137106, 136525, 136322, 137028, 137675, 137079, 135785, 135250, 135671, 136174, 136606, 137551, 138894, 139983, 140943, 142366, 144005, 145158, 146017, 147235, 148574, 149478, 150494, 152522, 155061, 156868, 157916, 158931, 159447, 158395, 156444, 155612, 156356, 157059, 156661, 155843, 155195, 154140, 152374, 150756, 150034, 150004, 150430, 151374, 152175, 151589, 149618, 147880, 147526, 147995, 148457, 149160, 150526, 152012, 152757, 152634, 152011, 151180, 150469, 150161, 149889, 148856, 146985, 145001, 143097, 140492, 136738, 132504, 128474, 124317, 119448, 114211, 109631, 106315]
55515A06315k347k279l093m018l961k647r63K38J095K091L136L912M461M822M706
55500A11468M094L493L116K592J854J390J218O27m85j134p98k53k55m38l39l38
55484A25812p55j086r87r35j136r33j02M38J11l31j88M4j59l27j39k59r99j419
55466A16650r00k92l44l91J98O63L23m8K38L15n54j230n09O54P09J08K05O17L7
55447A16449j100j185k29K41j28j05P39J366J202R41R73O81k80j273j689j615
55431A14988j282p80l70k15J21J010J835J696Q36L21N33R94J431J872J988J431
55415A26409P37P98J502J883J529Q98L67j36o62j158j689k112j873q95j72o25
55399A24801j771k423k239j709j109m12J74M83P94J121P41n94j702j353q3N95
$$ y = [106315, 103968, 101689, 98596, 94578, 90617, 87970, 87007, 87245, 88340, 90431, 93567, 97479, 101940, 106762, 111468, 115562, 119055, 122171, 124763, 126617, 128007, 129225, 129852, 129367, 128233, 127435, 127182, 126927, 126489, 126150, 125812, 125057, 123971, 122984, 122049, 120913, 119980, 119878, 120316, 120427, 120096, 119908, 119952, 119793, 119466, 119327, 119068, 118069, 116650, 115750, 115458, 115114, 114723, 114921, 115584, 115907, 115859, 116097, 116412, 115858, 114628, 114119, 114773, 115482, 115590, 115795, 116412, 116449, 115349, 114164, 113935, 114176, 114048, 113943, 114682, 116048, 117250, 118191, 119164, 119845, 119565, 118292, 116603, 114988, 113706, 112926, 112556, 112341, 112462, 113472, 115307, 117003, 117839, 118160, 118693, 119687, 121118, 122990, 124978, 126409, 127146, 127944, 129446, 131329, 132858, 133756, 134123, 133987, 133325, 132167, 130478, 128366, 126493, 125598, 125426, 124801, 123030, 120607, 118368, 116659, 115550, 115138, 115312, 115795, 116589, 117710, 118451, 117857, 116155, 114802, 114719, 115314]
55383A15314K86j42j35Q3L35O02N70j2o99r47r43j066j082p51n64q40q96j97L74
55364A09290k51j579k273k021j347l03J200K326K207J444J217J399J121O47R27
55349A14004J630J482M12m16o77j195k134k539j991j154n17P0M65K31k92k22M25
55332A07582Q00O99P03Q48N71k8k72k36n65r82n32N89J039L52m86p21o19l45L98
55313A08795J284J438R43Q47J342J397O55N8R7n1q97j607j398p24k77L7M36N67
55295A12942K53JJ15J82k6j05J34K72J73K51M82K59l31l25M79R82N20n2J37N81
55275A16924M11j58m38m62o22p53n14j16J04L15O77P91L86j6J68O40P30L67r0
55256A18344n87j233j729j575p60J60N24L7r22j362n79Q99J790J596J037Q59R51
$$ y = [115314, 115600, 115458, 115323, 115406, 115741, 116343, 116913, 116901, 116202, 115255, 114312, 113246, 112164, 111413, 110849, 110009, 109113, 108916, 109290, 109039, 107460, 105187, 103166, 101819, 101516, 102716, 105042, 107249, 108693, 109910, 111309, 112430, 113077, 114004, 115634, 117116, 117528, 117112, 116435, 115240, 113106, 110567, 108576, 107422, 106905, 106975, 107440, 107671, 107379, 107157, 107582, 108382, 109081, 109784, 110632, 111203, 111175, 110903, 110667, 110102, 109120, 108588, 109177, 110216, 110568, 110082, 109361, 108742, 108397, 108795, 110079, 111517, 112460, 113307, 114649, 116046, 116701, 116759, 116856, 116805, 115908, 114301, 112903, 112179, 111902, 111939, 112375, 112942, 113195, 113196, 113311, 113493, 113467, 113362, 113496, 113768, 113941, 114192, 114674, 114933, 114602, 114277, 114756, 115738, 116258, 116206, 116343, 116924, 117335, 117177, 116739, 116277, 115655, 114902, 114388, 114272, 114376, 114691, 115368, 116159, 116545, 116529, 116697, 117337, 118067, 118434, 118344, 117757, 116524, 114795, 113220, 112460, 112620, 113144, 113181, 112259, 110897, 110318, 111217, 113007, 114603, 115640, 116499, 117450]
55239A17450Q77N46m2r48j848k090j556q87n00p5O28J176J100N85L9m73r87j335
55221A11660j401j275q91j11O94P94J29m94m68o6K58N06P08N69on50o57n09l82
55202A08508j68K89P43Q19M93P6rM92J288J609J113M58L18L08k32p88l47O83P65
55183A16418l97j282q14K18O37M33J32k33o16m96J95O16K85p0J87M88J77j62L51
55164A16067J350J776J443R18L61l61q02l79M83P25J87k86k16m0j19j20K19M41
55146A21647j8r52j572j415q46n49p42r21n53K30Q18R19P89P00N76K63k08o98
55128A17468j029r48m10J58K97Q7j03l19p86j172q80o2M62M19K66J96j37o36n64
55109A12307K77J106J366J424J610J487P98K09L31O62L79l57p01l55K47P47J169
$$ y = [117450, 118327, 118873, 118831, 117883, 116035, 113945, 112389, 111502, 111002, 110927, 111555, 112731, 113831, 114416, 114455, 113982, 112995, 111660, 110259, 108984, 108093, 107982, 108676, 109470, 109599, 109105, 108637, 108571, 108829, 109335, 110043, 110612, 110606, 110056, 109399, 108890, 108508, 108340, 108629, 109372, 110191, 110684, 110760, 110751, 111243, 112531, 114140, 115253, 115711, 116029, 116337, 116105, 115317, 114970, 115653, 116418, 116021, 114739, 113925, 114143, 114780, 115213, 115345, 115112, 114496, 114000, 114195, 114811, 115096, 115026, 115213, 115701, 115878, 115716, 116067, 117417, 119193, 120636, 121554, 121915, 121554, 120752, 120373, 120856, 121581, 121768, 121482, 121266, 121226, 121107, 120987, 121206, 121647, 121629, 120677, 119105, 117690, 116844, 116295, 115553, 114632, 114079, 114309, 115127, 116046, 116835, 117535, 118111, 118374, 118166, 117468, 116439, 115491, 115081, 115239, 115536, 115623, 115520, 115201, 114415, 113243, 112363, 112301, 112763, 113182, 113448, 113644, 113507, 112871, 112307, 112584, 113690, 115056, 116480, 118090, 119577, 120375, 120584, 120915, 121577, 121956, 121599, 120898, 120543, 120790, 121537, 122706]
55092A22706J580J922K074J849J147K69l07n18o17m68L08J323J523O44l04m69
55076A32662k52l06l73J28R31J249Q52J75l18l44K08R76J238P93K66J51P9m36
55058A37679j123j403j271j101j020r76j010j025p71l44k02l38j79L54N22K7l15
55041A27504J39P87P98L57P2j02m01m71j33j31r62j652j066J20K85n75q03K87
55023A24053J349J043j48q29n23J78O40P27N75L87L34M32N52N75M10kn19p79o35
55004A27820l95l56l57r6K91M51L79L87O03R01J162J292J147Q17O75Q43Q80M35
54986A36879o0L9N85P56J03r67j727j755j040L6Q76J098R15Q20R76J106R21N15
54968A40076L51Q54J888K633K300J021k11n82j47M89P59M40k17o33m91j58j02
$$ y = [122706, 124286, 126208, 128282, 130131, 131278, 131547, 131240, 130722, 130105, 129637, 129945, 131268, 132791, 133435, 133131, 132662, 132410, 132104, 131731, 131859, 132790, 134039, 134891, 135066, 134748, 134404, 134612, 135588, 136826, 137619, 137885, 138036, 138115, 137679, 136556, 135153, 133882, 132781, 131761, 130785, 129775, 128750, 127979, 127635, 127433, 127095, 126916, 127270, 127792, 127819, 127504, 127643, 128430, 129228, 129585, 129657, 129555, 129154, 128683, 128550, 128419, 127457, 125805, 124739, 124859, 125144, 124569, 123766, 124053, 125402, 126445, 126297, 125468, 124945, 125123, 125763, 126490, 127065, 127452, 127786, 128218, 128770, 129345, 129755, 129753, 129234, 128455, 127820, 127425, 127069, 126712, 126616, 126907, 127358, 127737, 128124, 128727, 129628, 130790, 132082, 133229, 134046, 134721, 135564, 136444, 136879, 136819, 136858, 137443, 138199, 138302, 137335, 135608, 133853, 132813, 132849, 133725, 134823, 135738, 136558, 137534, 138640, 139561, 140076, 140427, 141281, 143169, 145802, 148102, 149123, 148912, 148330, 148183, 148672, 149431, 149871, 149654, 149021, 148530, 148372, 148270]
54951A48270j41J25L92J16m03l87l6l19j240j636r59k2N63J232K176K545J834
54934A52110Q63M27J91j60J70J731L528M319M416M878N772O524P186P964Q175
54919B08094P133N532M435L423J293j776m305n620o350o889o834o085n234m643
54905A82174m176l884l951m010l522k759k381k219j539m64N8k30n28j99O07J601
54889A54578K589L055K579J750J759K947M545N808O558O774O620O705P285P390
54875B20942N927L428J474M63o40k353l968m997n847o667o903o457o095o164o072
54860A76071n508m969m663l980k720j657j215p03L43J081N61p83j763j978j944
54845A46173k100k406k540k116j052%J64n10j077j080j010j087o63N59J650J681
$$ y = [148270, 148129, 148254, 148646, 148762, 148359, 147972, 147936, 147617, 146377, 144741, 143782, 143760, 144323, 145555, 147731, 150276, 152110, 152973, 153400, 153591, 153431, 153601, 155332, 158860, 163179, 167595, 172473, 178245, 184769, 191955, 199919, 208094, 215227, 220759, 225194, 228617, 229910, 228134, 223829, 218209, 211859, 204970, 198136, 192051, 186817, 182174, 177998, 174114, 170163, 166153, 162631, 159872, 157491, 155272, 153733, 153269, 153327, 153097, 152569, 152370, 152977, 154578, 157167, 160222, 162801, 164551, 166310, 169257, 173802, 179610, 186168, 192942, 199562, 206267, 213552, 220942, 226869, 230297, 231771, 232234, 231594, 229241, 225273, 220276, 214429, 207762, 200859, 194402, 188307, 182143, 176071, 170563, 165594, 160931, 156951, 154231, 152574, 151359, 150656, 150999, 152080, 152641, 151858, 150095, 148117, 146173, 144073, 141667, 139127, 137011, 135959, 135959, 136123, 135613, 134536, 133456, 132446, 131359, 130696, 131255, 132905, 134586]
54829A34586J060P81R66J007P02L70J23j79m60n32n45p31q77n31L09J120J421
54812A38590J122N00jl9L02O03N63K29k23n81n75j28L67M61K81K12J19m46j212
54793A40144j216q9J394K298K500K421K348K286K041J304J47o47m09L56N72K95
54777A55745P08K263L893M548M492M515M840N432O498P901Q796Q576P602O383
54763B32192M773K604L51j548l378n319o652o700n952n404n199m886m509m440
54749A85933m463l995l123k424j977j432j010j370k322k631j525K69J390J363
54735A62683Q37O37R50J456J968K675L691M660N130N275N675O370O741O452N869
54720B21069N204L982J848o67k762m268n407o138o364o372o417o198n451m615
$$ y = [134586, 135646, 136427, 137393, 138400, 139102, 139472, 139595, 139416, 138956, 138424, 137879, 137148, 136271, 135740, 136049, 137169, 138590, 139712, 140212, 140211, 140172, 140474, 141077, 141640, 141869, 141646, 141065, 140490, 140362, 140729, 141190, 141471, 141683, 141802, 141356, 140144, 138928, 138839, 140233, 142531, 145031, 147452, 149800, 152086, 154127, 155431, 155578, 154931, 154522, 154878, 155450, 155745, 156453, 158716, 162609, 167157, 171649, 176164, 181004, 186436, 192934, 200835, 209631, 218207, 225809, 232192, 236965, 239569, 239920, 238372, 234994, 229675, 223023, 216323, 210371, 204967, 199768, 194882, 190373, 185933, 181470, 177475, 174352, 171928, 169951, 168519, 167509, 166139, 163817, 161186, 159661, 159930, 161320, 162683, 163520, 164157, 165107, 166563, 168531, 171206, 174897, 179557, 184687, 189962, 195637, 202007, 208748, 215200, 221069, 226273, 230255, 232103, 231436, 228674, 224406, 218999, 212861, 206497, 200125, 193708, 187510, 182059, 177444]
54706A77444m207l880k982j749j062j052r84n33k79o91j423j956k240k316j963
54691A50127j167n35o06j079j228r01o15o56o20l5Q81J443J332Q70M36Pn64j028
54673A46062r76n08k28n32j133j403j012j59N95P43L17j00j02j0k72n77k36O00
54655A41069R72M93j04j78o5k60m55j37M14N73M08M76P60O98K14l6L89J023J052
54636A47306K45q10j252p43J69N96L35P2L75R24J004M65l23j031j456j294n08
54619A44074K92M08Nj79P5K02j71o64p90o18m69l19J15Q41J480J651J327Q42N45
54600A48647M50K50k26o73o93l68j48j36P8P22J303J149K95n01p11n94o97j041
54582A47106j161p97k32J35J94M1j99k98jN79R05O72K87K68M61L46p2k74j42j90
$$ y = [177444, 173237, 169357, 166375, 164626, 163564, 162512, 161528, 160995, 160716, 160025, 158602, 156646, 154406, 152090, 150127, 148960, 148425, 147819, 146740, 145512, 144611, 143996, 143340, 142720, 142685, 143566, 145009, 146341, 147211, 147647, 147654, 147090, 146062, 145086, 144578, 144350, 143818, 142685, 141282, 140270, 140111, 140706, 141449, 141766, 141666, 141564, 141554, 141282, 140705, 140469, 141069, 142041, 142534, 142430, 142252, 142187, 141927, 141472, 141335, 141749, 142322, 142730, 143206, 143966, 144664, 144878, 144842, 145231, 146254, 147306, 147551, 146741, 145489, 144746, 144915, 145511, 145846, 145918, 146293, 147217, 148221, 148686, 148363, 147332, 145876, 144582, 144074, 144366, 144774, 144779, 144600, 144675, 144877, 144706, 144042, 143252, 142634, 142165, 141846, 141961, 142802, 144282, 145933, 147260, 148102, 148647, 149097, 149347, 149121, 148448, 147755, 147387, 147239, 147103, 147181, 147903, 149206, 150355, 150650, 150149, 149438, 148844, 148147, 147106, 145945, 145148, 144916, 145051, 145245, 145286, 145087, 144789, 144788, 145367, 146272, 146944, 147231, 147499, 147960, 148306, 148234, 147960, 147818, 147628]
54562A47628p73j482j610q83L58J443J820J518J182J323J651J535R93N86M84L42
54546A56115J73M56J173J500R29j1n86p90r05p21J9Q69J053N08j23l97m59n25
54528A58278n24l64k69o01j369j992j748n59P22J164P39J75q7k44m69n15k24J79
54510A52292M81P37Q97O66L3n27n74j52M61J006J134O06k23o64o13n76p21n79
54492A53684mM44M36L79N66N86J42l27m49n93r55p70N86K248K660J496m1o66p2
54473A59350J231K325K360J275%n40l39J45Q42J723K123J398O4o86n18k29m44
54456A70080q92j117j187j365j589j565j169n42O5M95P83R55P56mq67r75j86O76
54438A62352R58R48J072J039M82k12m46l32k70j40L16P09N33J20J38M26K53m00
$$ y = [147628, 146855, 145373, 143763, 142880, 143238, 144681, 146501, 148019, 149201, 150524, 152175, 153710, 154703, 155289, 155773, 156115, 156288, 156744, 157917, 159417, 160346, 160335, 159749, 158959, 158054, 157333, 157352, 158221, 159274, 159782, 159659, 159262, 158803, 158278, 157754, 157390, 157121, 156520, 155151, 153159, 151411, 150852, 151574, 152738, 153477, 153652, 153565, 153321, 152852, 152337, 152113, 152292, 152773, 153510, 154407, 155073, 155106, 154579, 154005, 153853, 154314, 155320, 156454, 157060, 156837, 156173, 155560, 154984, 154263, 153684, 153680, 154124, 154560, 154939, 155505, 156091, 156233, 155906, 155457, 154864, 153909, 153139, 153725, 155973, 158633, 160129, 160088, 159422, 159350, 160581, 162906, 165266, 166541, 166541, 166001, 165662, 165807, 166649, 168372, 170495, 171893, 171957, 171271, 170753, 170524, 170080, 169188, 168071, 166884, 165519, 163930, 162365, 161196, 160654, 160719, 161214, 161997, 162952, 163708, 163704, 162837, 161862, 161676, 162352, 163310, 164258, 165330, 166369, 166851, 166639, 166193, 165861, 165591, 165451, 165767, 166476, 167009, 167129, 167267, 167693, 167946, 167546]
54420A67546p79n22p9N5j91p00j244j383r04k55M4J92O14J094J129Q99R63J232
54402A67711J174Q98R65J265J130N64L17O06P81N09K68M09N86M90L94N78Q49R03
54384A80397O43lr47j613j407o10o1Q6M70J255J723J403P95N88Q98J619K695L720
54366A91651M001L505L083L265L533L241K597K152J828J090k63j939l483m413
54352B09848m376l548k587j966j645j596k064k998l653l267j921m12M90N10q5
54337A80730o48o93m67o95j564k313k135j137j36K92L40N91J254J822J586N97
54321A77424k41l33j72m52q30m33O48J341J094M26j50q32j771k478k460j877j114
54304A67790k24P75J517J609J035M0r73j412q93J29O43K44m75p79n22R3Q40J388
$$ y = [167546, 166767, 166245, 166166, 166221, 166030, 165330, 164086, 162703, 161799, 161544, 161588, 161780, 162394, 163488, 164617, 165516, 166479, 167711, 168885, 169783, 170748, 172013, 173143, 173707, 174024, 174630, 175411, 175920, 176188, 176597, 177183, 177673, 178067, 178645, 179494, 180397, 181040, 181037, 180090, 178477, 177070, 176460, 176399, 176485, 176955, 178210, 179933, 181336, 182131, 182719, 183617, 185236, 187931, 191651, 195652, 199157, 202240, 205505, 209038, 212279, 214876, 217028, 218856, 219946, 219683, 217744, 214261, 209848, 205472, 201924, 199337, 197371, 195726, 194130, 192066, 189068, 185415, 182148, 180227, 179815, 180305, 180815, 180730, 180082, 179389, 178922, 178227, 176663, 174350, 172215, 171078, 170942, 171234, 171574, 172165, 173419, 175241, 176827, 177424, 177183, 176850, 176678, 176226, 175396, 174963, 175611, 176952, 178046, 178472, 178322, 177490, 175719, 173241, 170781, 168904, 167790, 167566, 168341, 169858, 171467, 172502, 172542, 171569, 170157, 169264, 169393, 170036, 170280, 169805, 169026, 168504, 168597, 169437, 170825]
54286A70825J458J233J082Q79L21j46K98J411J925J375Q15J124J698J590R78O02
54270A87468N03L32K75O01P91K05o85q38k43J17j14j05P45J719J682O32l16l49
54252A92420J36K08l30q46r59j112j637j911j180J12P64M98J44R0l04j286j891
54235A82916j303r5O35O90N53L60rk77p0M04O95P85R01R33P62P03R79J074M27
54216A91063n81j021o88k12j31m61j030j557j561q80j57k14r75j612j617j166
54200A77200n29J72O90P65N78O01Q69R65O49J02m84j016j255r60m03j98m69n93
54182A76684L5J207K042J828P38j93lJ136J957J485J18r67j194r40p30o71o38
54165A81894n33k89N0K30K0m36p33o17j56M06P48O47K15j64l52n97r72j047n21
$$ y = [170825, 172283, 173516, 174598, 175477, 175798, 175652, 175950, 177361, 179286, 180661, 181476, 182600, 184298, 185888, 186866, 187468, 187971, 188303, 188578, 189179, 189970, 190175, 189490, 188652, 188409, 188526, 188412, 188307, 189052, 190771, 192453, 193085, 192769, 192420, 192556, 192764, 192434, 191588, 190629, 189517, 187880, 185969, 184789, 184901, 185665, 186163, 186307, 186397, 186093, 184807, 182916, 181613, 181518, 182153, 182843, 183396, 183756, 183747, 183470, 183400, 183804, 184499, 185284, 186185, 187118, 187880, 188583, 189562, 190636, 191063, 190482, 189461, 188773, 188561, 188430, 187969, 186939, 185382, 183821, 182941, 182784, 182570, 181595, 179983, 178366, 177200, 176671, 176843, 177533, 178298, 178876, 179477, 180346, 181311, 181960, 182062, 181578, 180562, 179307, 178347, 177944, 177746, 177277, 176684, 176719, 177926, 179968, 181796, 182534, 182341, 182338, 183474, 185431, 186916, 187034, 186067, 184873, 183933, 183203, 182532, 181894, 181361, 181072, 181122, 181352, 181372, 180936, 180203, 179586, 179430, 179836, 180584, 181231, 181446, 181282, 180930, 180333, 179361, 178314, 177793]
54146A77793K09N65O23Q51J264J332P58r1n93m17K50P94O84J17j36L15R45J107
54128A86370R14Q25Q08M92k9k35R6O84J240J689J950J999K065K356K666K662K432
54111B08984K352K526K770L023L356L741M225N105O430P456P279N928M288K945
54097B70408J701K13j401k702l283k958k027j336j607k684l811m568n088n415
54083B35442n343m880m341l804k967j732n20J81K88N2k71n24p10r54j208j097
54067B07612l88M69P02J11p23j085p09J66R74J139O47J81L39Q69J126J068J205
54050B13703J682K070K113K047K100K179K288K671L360M002M351M559M859N262
54036B57246N662N915N828N454N320N853O629O734N936M899M161L577K948K505
$$ y = [177793, 178002, 178567, 179190, 180041, 181305, 182637, 183395, 183304, 182711, 182294, 182544, 183338, 184022, 184139, 184003, 184318, 185263, 186370, 187284, 188109, 188917, 189409, 189380, 189145, 189241, 189925, 191165, 192854, 194804, 196803, 198868, 201224, 203890, 206552, 208984, 211336, 213862, 216632, 219655, 223011, 226752, 230977, 236082, 242512, 249968, 257247, 263175, 267463, 270408, 272109, 272322, 270921, 268219, 264936, 261978, 259951, 258615, 257008, 254324, 250513, 245945, 240857, 235442, 230099, 225219, 220878, 217074, 214107, 212375, 211855, 212036, 212324, 212376, 212105, 211581, 210871, 209917, 208709, 207612, 207224, 207693, 208395, 208506, 207783, 206698, 205989, 206155, 207129, 208268, 208915, 209096, 209435, 210304, 211430, 212498, 213703, 215385, 217455, 219568, 221615, 223715, 225894, 228182, 230853, 234213, 238215, 242566, 247125, 251984, 257246, 262908, 268823, 274651, 280105, 285425, 291278, 297907, 304641, 310577, 315476, 319637, 323214, 326162, 328667]
54022C28667K396K249J732J056N10q2r56j788k063j921k073k847l695l885l458
54007C13842l275m006n211n732n081m118l980m645n065m626l760l105k720k398
53993B56120k201k258k400k338k000j475q96n52p32j199j234n23L40O24M41M83
53977B40200R75J403J242N99L5P8Q73K137L383M404N517P165R325J1577J3678
53962C02591J5661J7254J7473J5269J0637M828n62m677p583r657j1059j1716j1564
53949C26895j0736r518q164o663m850k840j150j36N29J452K691L785M537N188
53935C01020N707N546M492L175K378K165K180K361K814L283L371L133K962L007
53921C47594L151L455M072M818N278N358N385N651O236P077P924Q300P979P307
$$ y = [328667, 331063, 333312, 335044, 336100, 336610, 336528, 335572, 333784, 331721, 329800, 327727, 324880, 321185, 317300, 313842, 310567, 306561, 301350, 295618, 290537, 286419, 282439, 277794, 272729, 268103, 264343, 261238, 258518, 256120, 253919, 251661, 249261, 246923, 244923, 243448, 242552, 242000, 241268, 240069, 238835, 238312, 238652, 239276, 239717, 240200, 241175, 242578, 243820, 244419, 244454, 244532, 245405, 247542, 250925, 255329, 260846, 268011, 277336, 288913, 302591, 318252, 335506, 352979, 368248, 378885, 383713, 383151, 378474, 370891, 361234, 350175, 338459, 326895, 316159, 306641, 298477, 291814, 286964, 284124, 282974, 282838, 283367, 284819, 287510, 291295, 295832, 301020, 306727, 312273, 316765, 319940, 322318, 324483, 326663, 329024, 331838, 335121, 338492, 341625, 344587, 347594, 350745, 354200, 358272, 363090, 368368, 373726, 379111, 384762, 390998, 398075, 405999, 414299, 422278, 429585]
53907D29585O750O160M976L036Q57q63j741j844j694j905k516k903k737k568l057
53892D29536l974m668n139n902o952p764q185q569q956q951q472p953p608p176
53878C29267o505n772n019m096l228k944l270l602l621l644l853l861l357k694
53864B73801k353k334k389k504k843l432m071m375l841k349n82M43L85k43q52
53849B42461j222j244q91m82m15m63k2Q24J155L91r46j815j622m59J008J769J250
53832B39277Q7m26J41R53J058L61o17j279j110k5J266J902J904J844J618P02m06
53815B47250m20O94J355P74K29J010K337K697K180K036K580L061L222L597M391
53800B76993N238N981O684O938O266N199M889N517N965N323L925K649J914J572
$$ y = [429585, 436335, 442495, 447471, 450507, 451364, 450501, 448760, 446916, 445222, 443317, 440801, 437898, 435161, 432593, 429536, 425562, 420894, 415755, 409853, 402901, 395137, 386952, 378383, 369427, 360476, 352004, 344051, 336443, 329267, 322762, 316990, 311971, 307875, 304647, 301703, 298433, 294831, 291210, 287566, 283713, 279852, 276495, 273801, 271448, 269114, 266725, 264221, 261378, 257946, 253875, 249500, 245659, 243310, 242728, 243171, 243556, 243313, 242461, 241239, 239995, 239104, 238622, 238207, 237744, 237722, 238546, 239701, 240092, 239146, 237331, 235709, 235250, 236258, 238027, 239277, 239364, 238938, 239079, 240032, 241090, 241451, 240834, 239555, 238445, 238420, 239686, 241588, 243492, 245336, 246954, 247656, 247250, 246830, 247524, 248879, 249653, 249882, 250892, 253229, 255926, 258106, 260142, 262722, 265783, 269005, 272602, 276993, 282231, 288212, 294896, 301834, 308100, 313299, 318188, 323705, 329670, 334993, 338918, 341567, 343481, 345053]
53786C45053J315R19L86l3k49o27j545k832m014m886n395n297m569l894m065m930
53770C05337n579n484m882m133l394k868k740k760k461j846j397j401j755k385
53756B62252l205l752l465k473j521j066r03p40n74m18j77M2k8l41n51n44n33
53739B42003n51l60J08N98R48J157J122P64M25N13P39L94m76r47n06J90L24O0
53721B46505J46P83J554K117K433K429J933R95k4o92p04K0J151K076K450K545
53705B65717K816L240L401L172K938L037L266L190K773K467K603K989L165K965
53691C07739K536J996J365Q18O51Q98J260J463J393Q40l55j674k054j135R8M80
53675C16319J45J05O90J214J156Q24O30M74J47j62k16j46j86k79k52j36q0j39
$$ y = [345053, 346368, 347287, 347673, 347640, 347391, 346764, 345219, 342387, 338373, 333487, 328092, 322795, 318226, 314332, 310267, 305337, 299758, 294274, 289392, 285259, 281865, 278997, 276257, 273497, 271036, 269190, 267793, 266392, 264637, 262252, 259047, 255295, 251830, 249357, 247836, 246770, 245867, 245127, 244553, 244135, 243958, 244000, 243972, 243631, 243080, 242536, 242003, 241452, 241092, 241200, 241798, 242746, 243903, 245025, 245789, 246214, 246727, 247466, 247860, 247384, 246437, 245931, 246121, 246445, 246505, 246651, 247434, 248988, 251105, 253538, 255967, 257900, 258895, 258871, 258179, 257475, 257495, 258646, 260722, 263172, 265717, 268533, 271773, 275174, 278346, 281284, 284321, 287587, 290777, 293550, 296017, 298620, 301609, 304774, 307739, 310275, 312271, 313636, 314454, 315105, 316003, 317263, 318726, 320119, 320959, 320604, 318930, 316876, 315741, 315839, 316319, 316464, 316569, 317259, 318473, 319629, 320453, 321083, 321557, 321704, 321542, 321326, 321180, 320994, 320715, 320463, 320327, 320247, 320108]
53657C20108l55q04j411j923k151k010j329NJ506K232J767P69J65J12J16m9j09
53640C16639J75P10J367K110K737K912K625K333K384K544K402K054K026K546L250
53625C48814L702L892M031M172M243M286M386M415M178L740L352L077K755K315
53611D01358J871J550J471J834K621L284L188K468J899J896K115K243K477K891
53597D33166K977K339J413Q48O06K15l53p47r02r87q96m19J40K10k27o80r66j331
53579D34406j751j816j486j270j424j606j573j653k124k626k668k332k047j928
53565D08102j735j306o79Q0Q18J182R22K62l00n61p42j022j206r57k77M13P12
53548D03706O62O14P77J028J237J472J742J796J490J193J442K215K860K904K616
$$ y = [320108, 319753, 318949, 317538, 315615, 313464, 311454, 310125, 310130, 311636, 313868, 315635, 316404, 316569, 316681, 316797, 316748, 316639, 316814, 317524, 318891, 321001, 323738, 326650, 329275, 331608, 333992, 336536, 338938, 340992, 343018, 345564, 348814, 352516, 356408, 360439, 364611, 368854, 373140, 377526, 381941, 386119, 389859, 393211, 396288, 399043, 401358, 403229, 404779, 406250, 408084, 410705, 413989, 417177, 419645, 421544, 423440, 425555, 427798, 430275, 433166, 436143, 438482, 439895, 440743, 441349, 441564, 441211, 440464, 439562, 438575, 437679, 437260, 437400, 437610, 437383, 436703, 435737, 434406, 432655, 430839, 429353, 428083, 426659, 425053, 423480, 421827, 419703, 417077, 414409, 412077, 410030, 408102, 406367, 405061, 404382, 404462, 405280, 406462, 407384, 407646, 407346, 406785, 406043, 405021, 403815, 402858, 402581, 402994, 403706, 404368, 404982, 405759, 406787, 408024, 409496, 411238, 413034, 414524, 415717, 417159, 419374, 422234, 425138, 427754]
53533D27754K655L231L898M176M232M770O107P595Q332Q272Q225Q706R382R905
53519E17240J0565J1664J2783J3389J3722J4369J5214J5678J5868J6544J7972
53508F75008J9535K0649K1346K1767K1835K1622K1431K1235K0693J9932J9661
53497I04714K0132K0669K0666K0416K0324J9964J8675J6791J5473J5386J6167
53486A109377J7136J7948J8442J8368J7547J6217J5043J4747J5530J6753J7381
53475A294489J6940J5830J4627J3337J1639R575P584N953M543K985R38j749m830
53462A391861p654r622j0605j0924j1030j1370j2217j3380j4224j4391j4322j4704
53450A247418j5570j6364j6876j7481j8344j8912j8556j7459j6422j5972j5939
$$ y = [427754, 430409, 433640, 437538, 441714, 445946, 450716, 456823, 464418, 472750, 481022, 489247, 497953, 507335, 517240, 527805, 539469, 552252, 565641, 579363, 593732, 608946, 624624, 640492, 657036, 675008, 694543, 715192, 736538, 758305, 780140, 801762, 823193, 844428, 865121, 885053, 904714, 924846, 945515, 966181, 986597, 1006921, 1026885, 1045560, 1062351, 1077824, 1093210, 1109377, 1126513, 1144461, 1162903, 1181271, 1198818, 1215035, 1230078, 1244825, 1260355, 1277108, 1294489, 1311429, 1327259, 1341886, 1355223, 1366862, 1376437, 1384021, 1389974, 1394517, 1397502, 1398440, 1396691, 1391861, 1384207, 1374585, 1363980, 1353056, 1342026, 1330656, 1318439, 1305059, 1290835, 1276444, 1262122, 1247418, 1231848, 1215484, 1198608, 1181127, 1162783, 1143871, 1125315, 1107856, 1091434, 1075462, 1059523]
53439A059523j5784j5077j3605j1421q949o839n500m788m232l502k562j454k42
53426I65568Q75J683K278L102M377N802O939P873R091J0755J2455J3746J4729
53413A059273J5841J7251J8652J9721K0566K1578K2907K4257K5350K6364K7630
53402A299390K9002L0013L0764L2093L4515L7378L9605M1020M2349M4021M5676
53391A705826M6915M7847M8643M9139M9239M9331M9784N0319N0260M9325M7758
53380B244386M5849M3667M1217L8558L5712L2735K9841K7221K4654K1578J7695
53369B603113J3323R024N003J012l311q231j3884k0165k6505l2069l6328l9400
53357B451582m1668m3357m4598m5610m6424m6600m5712m4045m2348m0894l9365
$$ y = [1059523, 1043739, 1028662, 1015057, 1003636, 994687, 987848, 982348, 977560, 973328, 969826, 967264, 965810, 965568, 966443, 968126, 970404, 973506, 977883, 983685, 990624, 998497, 1007588, 1018343, 1030798, 1044544, 1059273, 1075114, 1092365, 1111017, 1130738, 1151304, 1172882, 1195789, 1220046, 1245396, 1271760, 1299390, 1328392, 1358405, 1389169, 1421262, 1455777, 1493155, 1532760, 1573780, 1616129, 1660150, 1705826, 1752741, 1800588, 1849231, 1898370, 1947609, 1996940, 2046724, 2097043, 2147303, 2196628, 2244386, 2290235, 2333902, 2375119, 2413677, 2449389, 2482124, 2511965, 2539186, 2563840, 2585418, 2603113, 2616436, 2625460, 2630463, 2631475, 2628164, 2619933, 2606049, 2585884, 2559379, 2527310, 2490982, 2451582, 2409914, 2366557, 2321959, 2276349, 2229925, 2183325, 2137613, 2093568, 2051220, 2010326, 1970961]
53346A970961l7748l6690l6589l6944l7070l6952l6898l6760l6154l5135l3951
53335A570070l2432l0306k8005k6355k5422k4353k2483k0019j7452j5062j3174
53324A315007j2343j2751j3772j4585j4926j5009j4931j4527j3740j2781j1917
53313A163725j1186j0349r136p601o140n075m353l732l079k233q91R95K905M238
53299A108088N075O039P480R239J1076J2931J4730J6408J8063J9655K0733K0955
53287A270472K0792K1036K1663K1877K1346K0609K0074J9355J7983J6088J4027
53276A485322J1914R840Q011O236L849O72k451m639o070p572r467j1452j3398
53263A470795j5551j7985k0351k2270k3651k4588k5189k5576k5839k6002k6042
$$ y = [1970961, 1933213, 1896523, 1859934, 1822990, 1785920, 1748968, 1712070, 1675310, 1639156, 1604021, 1570070, 1537638, 1507332, 1479327, 1452972, 1427550, 1403197, 1380714, 1360695, 1343243, 1328181, 1315007, 1302664, 1289913, 1276141, 1261556, 1246630, 1231621, 1216690, 1202163, 1188423, 1175642, 1163725, 1152539, 1142190, 1133054, 1125453, 1119313, 1114238, 1109885, 1106153, 1103074, 1100841, 1099950, 1100945, 1103850, 1108088, 1113163, 1119202, 1126682, 1135921, 1146997, 1159928, 1174658, 1191066, 1209129, 1228784, 1249517, 1270472, 1291264, 1312300, 1333963, 1355840, 1377186, 1397795, 1417869, 1437224, 1455207, 1471295, 1485322, 1497236, 1507076, 1515087, 1521323, 1525172, 1525844, 1523393, 1518754, 1512684, 1505112, 1495645, 1484193, 1470795, 1455244, 1437259, 1416908, 1394638, 1370987, 1346399, 1321210, 1295634, 1269795, 1243793, 1217751]
53252A217751k5914k5481k4639k3520k2456k1649k1092k0830k0980k1435k1830
53241I67925k1894k1626k1087k0391j9878j9852k0048j9845j9069j8127j7229
53230G48879j6035j4348j2597j1264j0279r395q733q512q522q296p746p304p565
53217F18283q827j0730j2280j2727j2446j2502j3210j3670j3052j1638j0236r177
53205D77788q381p895p709p483p024o690o774o835o319n532n352o037p017p699
53191C81041p979p905p406o479n366m432l911l738l535l005k323j947j994k191
53177C18830k476k994l476l274k415j770j798j897j575j411k020k763k608j736
53163B86617j193j199r87k72K29k5p07j287j678j859j599r32l30q7N3L43N21J58
$$ y = [1217751, 1191837, 1166356, 1141717, 1118197, 1095741, 1074092, 1053000, 1032170, 1011190, 989755, 967925, 946031, 924405, 903318, 882927, 863049, 843197, 823149, 803304, 784235, 766108, 748879, 732844, 718496, 705899, 694635, 684356, 674961, 666228, 657716, 649194, 640898, 633152, 625848, 618283, 609456, 598726, 586446, 573719, 561273, 548771, 535561, 521891, 508839, 497201, 486965, 477788, 469407, 461512, 453803, 446320, 439296, 432606, 425832, 418997, 412678, 407146, 401794, 395757, 388740, 381041, 373062, 365157, 357751, 351272, 345906, 341474, 337563, 333825, 330290, 327285, 324962, 323015, 321021, 318830, 316354, 313360, 309884, 306610, 304195, 302425, 300627, 298730, 297155, 295744, 293724, 290961, 288353, 286617, 285424, 284225, 283238, 282966, 283195, 283170, 282463, 281176, 279498, 277639, 276040, 275108, 274778, 274691, 274744, 275087, 275608, 275766]
53145B75766p03j519j789j445p85j24N04J149J628J624J214Q05M74j51j050j492
53129B74106r81qP13J196J812K392K528K294J936J242J41m82L33K042K974K348
53113B94586J076L70M61Q18Q61K00j133k436k966k800k553k284j608p95p05j346
53097B79746j572p30K96L41m85j152j103o22k29l09r86j917k361j968j145m19
53081B65385K46J064J721J576N26p26j295q67Q1O79M63k12o61p18p68j054j337
53064B64103j327j028o00k03k8r3n0L88Q83R31P41J014J763K128J625P79K25p2
53046B71179k80j22N97J418J797J759J493Q26k96j233j303p22k33KM26J057J223
53029B77588M91o45j306j193q11p59j015r43j37R25J347R17L12J32J89L6k60k58
$$ y = [275766, 275063, 273544, 271755, 270310, 269525, 269401, 269905, 271054, 272682, 274306, 275520, 276325, 276799, 276648, 275598, 274106, 273125, 273117, 273830, 275026, 276838, 279230, 281758, 284052, 285988, 287230, 287371, 286889, 287222, 289264, 292238, 294586, 295662, 296032, 296493, 297311, 298172, 298372, 297239, 294803, 291837, 289037, 286484, 284200, 282592, 281797, 281092, 279746, 278174, 277444, 277740, 278081, 277596, 276444, 275341, 274719, 274490, 274181, 273195, 271278, 268917, 266949, 265804, 265385, 265631, 266695, 268416, 269992, 270518, 269792, 268497, 267630, 267711, 268390, 268853, 268641, 267980, 267262, 266494, 265440, 264103, 262776, 261748, 261148, 260945, 260917, 260824, 260774, 261162, 262045, 262976, 263717, 264731, 266494, 268622, 270247, 271026, 271251, 271179, 270899, 270777, 271374, 272792, 274589, 276348, 277841, 278667, 278371, 277138, 275835, 275113, 274880, 274882, 275308, 276365, 277588, 278079, 277434, 276128, 274935, 274124, 273365, 272350, 271407, 271270, 272195, 273542, 274459, 274771, 274903, 275092, 275128, 274868, 274610]
53011B74610J72P49J170J301J146Q36N80L69o4q20j537j744j336n58K95R10J010
52994B77089O31J94P4K45M62O22P34Q35J023J373J678J601J146O93M28K21J02
52977B89151L06O40M78k15n47J05J111J561J605J953K471K288J233J84j26J68
52961C02366O49J120J231M82r65k116k284j907j742j729j363p63n39o87n39P5
52945B91289L45l06j196j247n10m2l65q44q23n66n93p25m91q9j14m69l82L48R15
52926B84135O35j53o62o81m95k57O2K74J11l19o39p59r37j226j283q11l2N13M95
52907B77971L0n08p76o25k19Nl07q89r49j57P04O20j12j27J000K012J850J360
52889B80883J911L034K997J510J83L5J28n66j407j256l64J25n7k33m9K19M06N87
$$ y = [274610, 274782, 275531, 276701, 278002, 279148, 279984, 280564, 280933, 280869, 280049, 278512, 276768, 275432, 274874, 275169, 276079, 277089, 277720, 277914, 277988, 278233, 278695, 279317, 280051, 280886, 281909, 283282, 284960, 286561, 287707, 288400, 288828, 289049, 289151, 289457, 290097, 290575, 290360, 289813, 289918, 291029, 292590, 294195, 296148, 298619, 300907, 302140, 302324, 302198, 302366, 303015, 304135, 305366, 305848, 304883, 302767, 300483, 298576, 296834, 295105, 293742, 292979, 292440, 291753, 291214, 291289, 291634, 291328, 290132, 288885, 288375, 288333, 287968, 287124, 286301, 285735, 285142, 284417, 283926, 283837, 283723, 283254, 282872, 283220, 284135, 284770, 284617, 283955, 283274, 282779, 282522, 282584, 282858, 282969, 282650, 282011, 281252, 280315, 279089, 277806, 276995, 276963, 277476, 277971, 278001, 277493, 276717, 276092, 275873, 275878, 275571, 274682, 273733, 273576, 274280, 274900, 274788, 274661, 275661, 277673, 279523, 280883, 282794, 285828, 288825, 290335, 290518, 290553, 290681, 290115, 288708, 287452, 287088, 287213, 287156, 286923, 286874, 287093, 287499, 288086]
52871B88086N90L07K68J114K500L407L469L210K881K009M05j158j776j461r70
52856C02881q94j277j871k462l006l590m198m574m475m035l621l344k985k334
52842B60215j412l72N24R37P55L82L50O99R95R77Q20O79M35M2k35k17j87n34j119
52823B63734j333q21J00Q47J169J213J156J054J032J274J687J916J865J855K042
52808B78790J984J303L98j25m54j284k585l497l576l295l039k452j266l1N41M26
52792B61838J6n19j002r88l65K05P1n02p92o07k11L26J074J751J986J808J409
52775B65498P09k51r19r29p74j054j375r32J28Q21P25K72k20q61j396j173j54
52758B58115Q19J117R27N95O4o16r44o08M1M83O94J021J719K769L825M303L938
$$ y = [288086, 288676, 288983, 289251, 290365, 292865, 296272, 299741, 302951, 305832, 307841, 308246, 307088, 305312, 303851, 302881, 301987, 300710, 298839, 296377, 293371, 289781, 285583, 281009, 276534, 272499, 268878, 265534, 262549, 260215, 258803, 258431, 258955, 259892, 260647, 261029, 261379, 262078, 263073, 264050, 264870, 265549, 265984, 266026, 265791, 265574, 265387, 264853, 263734, 262401, 261580, 261680, 262527, 263696, 264909, 266065, 267119, 268151, 269425, 271112, 273028, 274893, 276748, 278790, 280774, 282077, 282475, 282350, 281896, 280612, 278027, 274530, 270954, 267659, 264620, 262168, 260902, 260871, 261412, 261838, 261854, 261335, 260333, 259345, 258980, 259185, 259256, 258754, 257962, 257355, 257144, 257470, 258544, 260295, 262281, 264089, 265498, 266207, 265956, 265037, 264108, 263334, 262280, 260905, 259973, 260101, 260922, 261647, 261919, 261699, 260838, 259442, 258269, 258115, 258934, 260051, 260978, 261573, 261637, 261021, 260077, 259469, 259510, 259993, 260687, 261708, 263427, 266196, 270021, 274324, 278262]
52741B78262L216K784K488J650L20n55m11J79L95J43j79k53J35J081K147K439
52725B93841J613L40n33r12j232j703k248k730k865k233q41N45J030M21o41j203
52709B80649o45P85J942J816O99j77k27p6l32o35m87j45j05k08p7J12N2K8M10
52690B83379P59L27o93j370j308r69p14l91M9L06K67J80J32p8l59k99P3J22m32
52671B78981r80q82m12l08p40j215j293q71P4J418K573K786K032J206J154J756
52655B85279K271K393K486K744K675J784M81k50j00J78j72r49j391j303j212j443
52639B93471j554r07M48J718K155J703R43M82N02Q24J274J817K302K343J618L16
52623C09455q91j387j139p06p51j502k610l426l502k780j530j87P59R61M77j93
$$ y = [278262, 281478, 284262, 286750, 288400, 288720, 288165, 287754, 287933, 288328, 288471, 288292, 288039, 288174, 289255, 291402, 293841, 295454, 295794, 295261, 294349, 293117, 291414, 289166, 286436, 283571, 281338, 280497, 281042, 282072, 282493, 281852, 280649, 280004, 280789, 282731, 284547, 285246, 285069, 284842, 284766, 284434, 283799, 283312, 283167, 283062, 282854, 282777, 282889, 282941, 282969, 283379, 284138, 284465, 283772, 282402, 281094, 280125, 279411, 279020, 279069, 279375, 279642, 279822, 279954, 279876, 279517, 279218, 279291, 279413, 278981, 278001, 277119, 276707, 276399, 275659, 274444, 273151, 272280, 272354, 273772, 276345, 279131, 281163, 282369, 283523, 285279, 287550, 289943, 292429, 295173, 297848, 299632, 300113, 299863, 299763, 299941, 299769, 298820, 297429, 296126, 294914, 293471, 291917, 291010, 291458, 293176, 295331, 297034, 297977, 298459, 298961, 299785, 301059, 302876, 305178, 307521, 309139, 309455, 308564, 307177, 306038, 305332, 304581, 303079, 300469, 297043, 293541, 290761, 289231, 289044, 289803, 290764, 291241, 291048]
52607B91048m41q9M47N56J29k91j82K74M65K67J39K43P7n34p71J11J433J833J199
52588B95913Q00J327J871J364J63n63l96J54N90P46N27P1n1N19J134Q00m01j305
52570C03263j179n37k43m50q02j097j315j301r63n75m52l96J34J272K418K782
52554C00559K063O56o68j201p19L25J054Q79Kq50j225j350j629j988j967j365
52538B92576m88K38O33P14N89M60M61M16J29p7L45J224J546P11n48j070o59l3
52520B97167K90L65L13J78K95R92J848K000J387R79J466K323K658K383J977J523
52504C18144O67o20j845k546k684k462k072j610j036k94M11O00O2p67j223j175
52488C01550r91r28q49n94k93j89l48n63m80R1Q84J335J213R22R35J088Q92L92
$$ y = [291048, 290607, 290518, 290965, 291521, 291650, 291359, 291177, 291451, 291916, 292183, 292322, 292565, 292642, 292108, 291337, 291448, 292881, 294714, 295913, 296713, 298040, 299911, 301275, 301438, 300875, 300479, 300633, 301223, 301969, 302496, 302567, 302516, 303035, 304169, 304969, 304568, 303263, 302084, 301547, 301304, 300854, 300052, 298955, 297640, 296339, 295376, 294801, 294349, 293953, 294087, 295359, 297777, 300559, 302622, 303278, 302610, 301409, 300690, 301015, 302069, 302948, 302950, 302100, 300875, 299525, 297896, 295908, 293941, 292576, 292088, 292326, 292959, 293673, 294262, 294722, 295183, 295599, 295728, 295651, 295996, 297220, 298766, 299477, 298929, 297859, 297200, 297167, 297457, 297822, 298135, 298313, 298608, 299600, 301448, 303448, 304835, 305814, 307280, 309603, 312261, 314644, 316621, 318144, 318811, 318191, 316346, 313800, 311116, 308654, 306582, 304972, 303936, 303642, 304053, 304653, 304715, 303948, 302725, 301550, 300559, 299631, 298782, 298188, 297895, 297706, 297358, 296795, 296315, 296406, 297290, 298625, 299838, 300760, 301695, 302783, 303675, 304067]
52470C04067K23P70J693K405K664K551K295K272K778L488L467K121K1j583k028
52455C27204j770j701k163k731k852k584k535l015l446k990j700n51k50n02o87
52440B97727p24q30q45m37K47O65N92L00J17J59M53Q90J097Q36M16L25M93M61
52422C01942K21K88Q43J401J543J426J313J117Q12P98J404K308K957L405M248
52407C26026N820P758R382J0271J0452J0078R063P078M070P05k034l723m725n541
52393C84680o274o827p157p108o372m920l222j899j276j311j646j670j069l39
52379C33590k44o54n80L91J453J838J976K688L824M481M285L662L094K735K580
52364C65119K412J774N65n61r78r25j006j135p93j9O44J070J569K106K283K056
$$ y = [304067, 304290, 305060, 306753, 309158, 311822, 314373, 316668, 318940, 321718, 325206, 328673, 330794, 330815, 329232, 327204, 325434, 323733, 321570, 318839, 315987, 313403, 310868, 307853, 304407, 301417, 299717, 299166, 298916, 298414, 297727, 297003, 296173, 295328, 294891, 295138, 295803, 296395, 296695, 296812, 296971, 297424, 298314, 299411, 300247, 300663, 300988, 301481, 301942, 302163, 302451, 303294, 304695, 306238, 307664, 308977, 310094, 310906, 311704, 313108, 315416, 318373, 321778, 326026, 331846, 339604, 348986, 359257, 369709, 379787, 388850, 395928, 399998, 400703, 398669, 394946, 390221, 384680, 378406, 371579, 364422, 357314, 350942, 346022, 342800, 340901, 339625, 338314, 336668, 334998, 333929, 333590, 333346, 332692, 332112, 332503, 333956, 335794, 337770, 340458, 344282, 348763, 353048, 356710, 359804, 362539, 365119, 367531, 369305, 369870, 369309, 368331, 367406, 366400, 365265, 364472, 364453, 365097, 366167, 367736, 369842, 372125, 374181]
52348C74181J738J339P13K42N18J389K134K597L196L866M037L800L928M529M801
52333D13008M545M705N832P143P801Q110Q604Q967Q862Q993J0132J1712J2536
52320E20950J2541J2673J3254J3650J3475J3155J3131J3376J3840J4611J5498
52309F70154J6080J6309J6545J6972J7501J8214J9193J9938J9714J8660J7788
52298H67068J7609J7401J6258J4229J1960R729P408N126L268J863N80p12j700
52285I70087k196k544l222m202m921m909m275l488k856k311j637p85J00Q18J280
52270I34939J524J696J944K349K942L713M578N440O348P498Q958J0481J1738J2578
52256A016726J2999J3075J3114J3609J4658J5642J5859J5226J4049J2390J0233
$$ y = [374181, 375919, 377258, 377971, 378213, 378731, 380120, 382254, 384851, 388047, 391913, 395950, 399750, 403678, 408207, 413008, 417553, 422258, 428090, 435233, 443034, 451144, 459748, 468715, 477577, 486570, 496702, 508414, 520950, 533491, 546164, 559418, 573068, 586543, 599698, 612829, 626205, 640045, 654656, 670154, 686234, 702543, 719088, 736060, 753561, 771775, 790968, 810906, 830620, 849280, 867068, 884677, 902078, 918336, 932565, 944525, 954254, 961662, 966788, 970056, 971919, 972499, 971787, 970087, 967891, 965347, 962125, 957923, 953002, 948093, 943818, 940330, 937474, 935163, 933526, 932741, 932841, 933659, 934939, 936463, 938159, 940103, 942452, 945394, 949107, 953685, 959125, 965473, 972971, 981929, 992410, 1004148, 1016726, 1029725, 1042800, 1055914, 1069523, 1084181, 1099823, 1115682, 1130908, 1144957, 1157347, 1167580]
52245A167580Q046O370N019L501K127J695J920J325p74l201m582n152n984p162
52231A170728p752p346o481n709n146m934n290n952o320o271o261o465o428n740
52217A084633m612l459k368j185L4R84J353J161R00J268K452L768M335M095L906
52202A097265M535N886P178P729P484O960O740O934P200P228P000O521N695M687
52188A189042L956L580K870J160j227l282m521n338o206p041p451p309o872o489
52174A144872o262n960n340m604m255m422m592m231l314k093p86K09M56K38O05
52159A100521J900K879K188L80p24m92p5m03q54m41O05J365J626J889K306K400
52143A115070J865J032L69o6n15j069j490j540j273r28n30K03J414K797L953M932
$$ y = [1167580, 1175626, 1181996, 1187015, 1190516, 1192643, 1194338, 1196258, 1197583, 1196809, 1193608, 1189026, 1183874, 1177890, 1170728, 1162976, 1155630, 1149149, 1143440, 1138294, 1133360, 1128070, 1122118, 1115798, 1109527, 1103266, 1096801, 1090373, 1084633, 1080021, 1076562, 1074194, 1073009, 1073043, 1074027, 1075380, 1076541, 1077441, 1078709, 1081161, 1084929, 1089264, 1093359, 1097265, 1101800, 1107686, 1114864, 1122593, 1130077, 1137037, 1143777, 1150711, 1157911, 1165139, 1172139, 1178660, 1184355, 1189042, 1192998, 1196578, 1199448, 1200608, 1199381, 1196099, 1191578, 1186240, 1180034, 1172993, 1165542, 1158233, 1151361, 1144872, 1138610, 1132650, 1127310, 1122706, 1118451, 1114029, 1109437, 1105206, 1101892, 1099799, 1099013, 1099222, 1099678, 1099916, 1100521, 1102421, 1105300, 1107488, 1107868, 1107144, 1106652, 1106577, 1106174, 1105320, 1104879, 1105484, 1106849, 1108475, 1110364, 1112670, 1115070, 1116935, 1117967, 1118336, 1118270, 1117755, 1116686, 1115196, 1113656, 1112383, 1111455, 1110925, 1111128, 1112542, 1115339, 1119292, 1124224]
52127A124224O096P575R126J0556J1938J3393J4861J6160J7115J7699J8102J8527
52115A285372J8864J8748J8195J7728J7646J7550J7069J6663J7059J8072J8647
52104A481613J8120J6890J5762J5112J4747J4189J3015J1174Q939O367L183n08
52092A618603l798n939p368q981j0697j1629j1590j1399j1633j1959j1948j1667
52080A499995j1193j0342r189q150p240o001m436l234k743k436j789q93J99J817
52066A434365L838N398O184P143R091J1298J2565J2983J3584J4520J4890J4198
52054A560057J2911J1459R727P739N908M298K422J13k059l634m935o470q150r475
52040A579911j0142j0114r551q990r151j0074j0860j0884j0838j1815j3600j4826
$$ y = [1124224, 1130320, 1137895, 1147021, 1157577, 1169515, 1182908, 1197769, 1213929, 1231044, 1248743, 1266845, 1285372, 1304236, 1322984, 1341179, 1358907, 1376553, 1394103, 1411172, 1427835, 1444894, 1462966, 1481613, 1499733, 1516623, 1532385, 1547497, 1562244, 1576433, 1589448, 1600622, 1609561, 1615928, 1619111, 1618603, 1614805, 1608866, 1601498, 1592517, 1581820, 1570191, 1558601, 1547202, 1535569, 1523610, 1511662, 1499995, 1488802, 1478460, 1469271, 1461121, 1453881, 1447880, 1443444, 1440210, 1437467, 1435031, 1433242, 1432349, 1432548, 1434365, 1438203, 1443601, 1449785, 1456928, 1466019, 1477317, 1489882, 1502865, 1516449, 1530969, 1545859, 1560057, 1572968, 1584427, 1594154, 1601893, 1607801, 1612099, 1614521, 1614634, 1612575, 1608941, 1604006, 1597536, 1589386, 1579911, 1569769, 1559655, 1550104, 1541114, 1531963, 1521889, 1511029, 1500145, 1489307, 1477492, 1463892, 1449066]
52028A449066j4891j4744j5343j6268j6553j6197j5860j5552j4740j3622j3059
52017A282237j3041j2443j0825r429r515j0566j1101j0730j0330j0548j1238j2240
52005A150231j3691j5331j6456j6772j6635j6296j5611j4633j3857j3535j3376
51994I84038j3107j2870j2878j3230j4121j5674j7342j8155j7838j7178j7068
51983H14577j7610j8344j8780j8595j7842j7146j7044j7024j5894j3337j0281
51972F32680p561n047k506l08J304K820M564N843N868M998M205L673K707Q26j676
51957F52390m130n901o620o481o030n421m263k560j140n06Q2J629M055O581R016
51942F30701J1721J4628J7337J9982K3042K6291K8817L0130L0457K9838K7660
$$ y = [1449066, 1434175, 1419431, 1404088, 1387820, 1371267, 1355070, 1339210, 1323658, 1308918, 1295296, 1282237, 1269196, 1256753, 1245928, 1236499, 1226984, 1216418, 1205317, 1194587, 1184257, 1173709, 1162471, 1150231, 1136540, 1121209, 1104753, 1087981, 1071346, 1055050, 1039439, 1024806, 1010949, 997414, 984038, 970931, 958061, 945183, 931953, 917832, 902158, 884816, 866661, 848823, 831645, 814577, 796967, 778623, 759843, 741248, 723406, 706260, 689216, 672192, 656298, 642961, 632680, 625119, 620072, 617566, 617258, 618562, 621382, 625946, 631789, 637657, 642655, 646860, 650533, 653240, 654066, 652390, 648260, 642359, 635739, 629258, 623228, 617807, 613544, 610984, 609844, 609338, 609420, 611049, 615104, 621685, 630701, 642422, 657050, 674387, 694369, 717411, 743702, 772519, 802649, 833106, 862944, 890604]
51931H90604K3356J6922Q777m07r610j7780k4405k9439l2772l4239l4025l2533
51919G24449k9956k6586k3295k0908j9127j6843j3671j0459q050o263m381k114
51907E42796K18K036K841K548J666P96k7j115k460l837n364p257r023r795r590
51892E04433r381r604r521q430o757n300m022k312l1K325M260N610O464P135Q031
51877D82900R114R781R515Q452P035N459L755K016K27j733l508m225l615k696
51863E22477k581k932k465q96N72Q65L16o3P2L18L04p9r97k566m385n691o187
51846D96082o357o763p267p235o374n051l803k838k113j632j435j444j491j445
51832D40834j124k72J128K586L385L243K526J767J123L40q07k082k767k329j103
$$ y = [890604, 913960, 930882, 939659, 939252, 929642, 911862, 887457, 858018, 825246, 791007, 756982, 724449, 694493, 667907, 644612, 623704, 604577, 587734, 574063, 563604, 555554, 549291, 544910, 542796, 543014, 545050, 547891, 550439, 552105, 552901, 552874, 551759, 549299, 545462, 540098, 532841, 523818, 514023, 504433, 495052, 485448, 475927, 467497, 460740, 455440, 451418, 449106, 449075, 451400, 455660, 461270, 467734, 474869, 482900, 492014, 501795, 511310, 519762, 526797, 532256, 536011, 538027, 538254, 536521, 533013, 528788, 525173, 522477, 519896, 516964, 514499, 513603, 514175, 515040, 515356, 515293, 515365, 515683, 515987, 515908, 514911, 512345, 507960, 502269, 496082, 489725, 482962, 475695, 468460, 462086, 457035, 453232, 450394, 448281, 446649, 445214, 443770, 442279, 440834, 439710, 439438, 440566, 443152, 446537, 449780, 452306, 454073, 455196, 455536, 454729, 452647, 449880, 447551, 446448]
51817D46448p0K57L43P04R82N14m18q26m98l04p93j376j384j141j174j131l92
51800D39741O55J054Q21Q95J492J666Q93M4L9L98R6o98q08J49J196J390Q97L64
51782D50284J3k88n26n98m41J98J649L579M922N120M991N629O853P513P130O209
51766E02237N037L231Q34j200k260l042m474o231p192p030o519o282o094n581
51752D55434m952m688m856n076m966m394l359j928l55Q68J321J153J051J485K151
51737D28889K517K754L496M572M756L267R77n26p15l62j89p8L56R92J403J444
51721D53553J368J418J474J167L77m53p49n58n10r19j338j258q16l48K47J250
51705D53905K409L064K854J930O97k89n08m4K93pl20K56J536K424K333J573N03
$$ y = [446448, 446378, 446635, 446978, 447682, 448664, 449178, 448760, 447934, 447436, 447132, 446339, 444963, 443579, 442438, 441264, 440133, 439741, 440396, 441450, 442271, 443166, 444658, 446324, 447217, 447261, 447300, 447698, 447794, 447096, 446288, 446437, 447633, 449023, 449920, 450284, 450297, 450009, 449483, 448885, 448444, 448642, 450291, 453870, 458792, 463912, 468903, 474532, 481385, 488898, 496028, 502237, 507274, 510505, 511339, 510139, 507879, 504837, 500363, 494132, 486940, 479910, 473391, 467109, 461015, 455434, 450482, 445794, 440938, 435862, 430896, 426502, 423143, 421215, 420860, 421728, 423049, 424202, 425253, 426738, 428889, 431406, 434160, 437656, 442228, 446984, 450251, 451228, 450702, 449987, 449625, 449436, 449358, 449714, 450706, 452109, 453553, 454921, 456339, 457813, 458980, 459357, 458904, 458155, 457597, 457087, 456168, 454830, 453572, 452756, 452408, 452655, 453905, 456314, 459378, 462232, 464162, 464859, 464570, 464062, 464018, 464311, 464304, 463984, 464240, 465776, 468200, 470533, 472106, 472609]
51688D72609q72k330l343l778l992m083l804l359l406l892l788k482p91P5N9N7
51672D32880O12J427K010K265K457K944L822M705M980M522L819L197K373J053
51658D73066l59j174j279j179j188r61K26K781O196R003R686P921M777J498j511
51643E07503m287o476p489p305o511n573m576l644l124l099l161k848k161j516
51629D45733j288j533k035k497k654k387j842j458j673k462l298l715l809l896
51615D11186l940l687l255l014k868k267j204n06p09j155p57O21K162L279M159
51600C98045N110O010O638P214Q259R955J1719J2429J1223Q221M500J211j229
51587D89305l067m499n361n399m676l484j988n0K495N445Q206J0295J1699J2630
$$ y = [472609, 471737, 469407, 466064, 462286, 458294, 454211, 450407, 447048, 443642, 439750, 435962, 433480, 432689, 432764, 432823, 432880, 433492, 434919, 436929, 439194, 441651, 444595, 448417, 453122, 458102, 462624, 466443, 469640, 472013, 473066, 472707, 471533, 470254, 469075, 467887, 466926, 467152, 469933, 476129, 485132, 494818, 502739, 507516, 509014, 507503, 503216, 496740, 489251, 481946, 475435, 469862, 465286, 461642, 458518, 455419, 452258, 449410, 447249, 445733, 444445, 442912, 440877, 438380, 435726, 433339, 431497, 430039, 428366, 425904, 422606, 418891, 415082, 411186, 407246, 403559, 400304, 397290, 394422, 392155, 390951, 390445, 389736, 388581, 387824, 388445, 390607, 393886, 398045, 403155, 409165, 415803, 423017, 431276, 441231, 452950, 465379, 476602, 484823, 489323, 490534, 489305, 486238, 481739, 476378, 470979, 466303, 462819, 460831, 460781, 463276, 468721, 476927, 487222, 498921, 511551]
51573E11551J3126J3238J3421J4158J5119J5300J4253J2729J1736J1476J1726
51562F57833J2835J5486J9593K4125K8204L1660L4285L5151L3306K8926K3187
51551I44591J7040J0608L817k927r134j4878k0450k5506k9133l0909l1367l1150
51539G80602l0206k8188k5270k1987j8635j5398j2851j1600j1444j1523j1348
51528E82152j1047j0633r803q696q032q122q350q108p645p466p394o952o212n621
51514D68071n205m615l875l449l556l898m089l966l515k846k244j892j607j198
51500D22116q86r73j152p40L08J157J076L01l15j95N77J541K229K423K232J880
51484D31579J370N24n86j432j495q43j04J17l30j210k175k876l063k759k409k555
$$ y = [511551, 524677, 537915, 551336, 565494, 580613, 595913, 610166, 622895, 634631, 646107, 657833, 670668, 686154, 705747, 729872, 758076, 789736, 824021, 859172, 892478, 921404, 944591, 961631, 972239, 976056, 973129, 963995, 949117, 928667, 903161, 874028, 843119, 811752, 780602, 750396, 722208, 696938, 674951, 656316, 640918, 628067, 616467, 605023, 593500, 582152, 571105, 560472, 550669, 541973, 533941, 525819, 517469, 509361, 501716, 494250, 486856, 479904, 473692, 468071, 462866, 458251, 454376, 450927, 447371, 443473, 439384, 435418, 431903, 429057, 426813, 424921, 423314, 422116, 421230, 420257, 419105, 418365, 418673, 419830, 420906, 421207, 420892, 420697, 421274, 422815, 425044, 427467, 429699, 431579, 432949, 433473, 432887, 431455, 429960, 429117, 429013, 429130, 428800, 427590, 425415, 422539, 419476, 416717, 414308, 411753]
51468D11753l276m058m369m273m202m230l931k992j670m89K98P40R32R34R04J052
51452C83123J461J997K427K705L165M369O492Q915J0739J1667J2091J2234J1751
51439D73136J0413Q770P625P038O397N368M293L406K145l30l977p643j0068j0966
51425D95607j0906j0445r711q807q046p514o744n323l580k283j754j690j696j593
51411D15515j255o97k59k74m43p5R83K100K639K617K447K490K945L742M417M543
51395D41435M354M499N112N724O173O941Q331R975J1471J2938J4633J6564J8876
51382E67026K1956K5730K9465L2790L6314M0617M5140M8676N0462N0167M7333
51371I95676M1715L3885K4797J4878M271o348j6012k4359l1629l7750m2197m4750
$$ y = [411753, 408477, 404419, 400050, 395777, 391575, 387345, 383414, 380422, 378752, 378263, 378561, 379301, 380233, 381167, 382071, 383123, 384584, 386581, 389008, 391713, 394878, 399247, 405739, 414654, 425393, 437060, 449151, 461385, 473136, 483549, 492319, 499944, 506982, 513379, 518747, 523040, 526446, 528591, 528261, 524284, 516641, 506573, 495607, 484701, 474256, 464545, 455738, 447692, 440178, 433434, 428111, 424531, 422248, 420494, 418804, 417108, 415515, 414260, 413563, 413304, 413030, 412587, 412512, 413495, 415595, 418234, 420851, 423298, 425788, 428733, 432475, 436892, 441435, 445789, 450288, 455400, 461124, 467297, 474238, 482569, 492544, 504015, 516953, 531586, 548150, 567026, 588982, 614712, 644177, 676967, 713281, 753898, 799038, 847714, 898176, 948343, 995676, 1037391, 1071276, 1096073, 1110951, 1115222, 1108874, 1092862, 1068503, 1036874, 999124, 956927, 912177]
51359I12177m5797m5806m4961m3351m1042l7945l4106l0032k6391k3348k0536
51348E18862j7619j4550j1497q872p238o694o541n993n000l959k853j398J98J314
51334D28160J774J903J751R28o19k193k968k794k256k182k968m114m586l942k852
51319D03042k186j961j718j423j287r64N6J397K105K035J993K293K116P92j056
51304D05234k124j881r37l13o00j567k382k401j786j140p51n03k99p5M29J281
51288C90185J871J569P37M23J022K004K948L948M908N312N045M559M054L192K036
51273D33813J339J488J856J781J459J357J390J264J104J091R40L30n36j270j889
51258D45517k567l218l763m405n135n402m880m059l523l031k068r97p79j521k180
$$ y = [912177, 866380, 820574, 775613, 732262, 691220, 653275, 619169, 589137, 562746, 539398, 518862, 501243, 486693, 475196, 466324, 459086, 452392, 445851, 439858, 434858, 430899, 428046, 426648, 426846, 428160, 429934, 431837, 433588, 434516, 433897, 431704, 428736, 425942, 423686, 421504, 418536, 414422, 409836, 405894, 403042, 400856, 398895, 397177, 395754, 394467, 393503, 393559, 394956, 397061, 399096, 401089, 403382, 405498, 406290, 405234, 403110, 401229, 400292, 399979, 399379, 397812, 395430, 393029, 391243, 390103, 389352, 388849, 388550, 388475, 388904, 390185, 392056, 393625, 394362, 394785, 395807, 397811, 400759, 404707, 409615, 414927, 419972, 424531, 428585, 431777, 433813, 435152, 436640, 438496, 440277, 441736, 443093, 444483, 445747, 446851, 447942, 448882, 449212, 448676, 447406, 445517, 442950, 439732, 435969, 431564, 426429, 421027, 416147, 412088, 408565, 405534, 403466, 402469, 401690, 400169, 397989]
51243C97989j865q51LL54N45R38J466J891K220K625K988K812J879P38J24k2l96
51226D13438j238j963k053j739j430j046l57M21R23J227J609J894J578O26k31
51211D11659k18O60J546J613J033Q81J854L331M140M005L605L285K631J510O44
51196D42179N65P94N96O5k59l92p65j365j669j327m58N62J266J265P46M70Q97
51179D43170J507J519R61M94L86K64j96r12j631k138k220j883j544j640k048k207
51163D31882j778r22o6L70J75m07q28q75q99j183j429j327j199j507j985j927
51147D16095j261o77o38q26p48l86n0J47M31J042J823K209J839J168J098J776
51131D23042K303J959J147O27L62j5j10P60K112K492J423J91J57J040J649J694
$$ y = [397989, 396124, 395273, 395276, 395630, 396175, 397113, 398579, 400470, 402690, 405315, 408303, 411115, 412994, 413732, 413856, 413834, 413438, 412200, 410237, 408184, 406445, 405015, 403969, 403612, 404033, 404956, 406183, 407792, 409686, 411264, 411890, 411659, 411441, 412101, 413647, 415260, 416293, 417174, 419028, 422359, 426499, 430504, 434109, 437394, 440025, 441535, 442179, 442744, 443538, 444134, 444199, 443940, 443548, 442783, 441418, 439749, 438422, 437964, 438526, 439792, 441057, 441803, 442273, 443170, 444677, 446196, 447157, 447651, 448037, 448301, 448105, 447193, 445562, 443424, 441204, 439321, 437777, 436137, 434089, 431882, 430104, 429182, 429116, 429486, 429661, 429254, 428426, 427551, 426652, 425469, 424040, 422713, 421514, 420007, 418022, 416095, 414834, 414157, 413519, 412693, 411945, 411559, 411509, 411656, 412087, 413129, 414952, 417161, 419000, 420168, 421266, 423042, 425345, 427304, 428451, 429078, 429440, 429425, 429315, 430075, 432187, 434679, 436102, 436293, 436450, 437490, 439139, 440833]
51115D40833J981K927L747L480K301J296J054J060O47R4K76J381K605L151K990
51100D69823K511J960J507J310J181O69j52n43j37L87K70k99p02r02j195j357
51084D74331r80l26K3J29L88N02j48j177j357l04R85J539J508J474J608J894K516
51067D82605L534M666N737O910Q237R622J1334J3822J6744J8901J9540J9014J7815
51054F38481J5796J2914J0004Q018P008O478O209O030N370L864K076P51l36j991
51040G20672m236o182p222p561p495o939n940n035m824n515o978q882j0582j1356
51026F21925j0958r811q468p077n390l171n53J875L540M575N811P715R656J0709
51012F20378J0979J1443J2477J3317J3160J2097J0604Q835O936N455M715M098
$$ y = [440833, 442814, 445741, 449488, 452968, 455269, 456565, 457619, 458679, 459326, 459420, 459696, 461077, 463682, 466833, 469823, 472334, 474294, 475801, 477111, 478292, 478961, 478809, 478266, 478129, 478516, 478786, 478487, 477785, 476883, 475688, 474331, 473351, 473025, 473048, 473177, 473565, 474067, 473919, 472742, 471385, 471081, 472066, 473605, 475113, 476587, 478195, 480089, 482605, 486139, 490805, 496542, 503452, 511689, 521311, 532645, 546467, 563211, 582112, 601652, 620666, 638481, 654277, 667191, 677195, 685213, 692221, 698699, 704908, 710938, 716308, 720172, 722248, 722999, 722663, 720672, 716436, 710254, 703032, 695471, 687976, 681037, 675097, 670062, 665238, 659723, 652745, 643863, 633281, 621925, 610967, 601156, 592688, 585611, 580221, 577050, 576497, 578372, 581912, 586487, 592298, 600013, 609669, 620378, 631357, 642800, 655277, 668594, 681754, 693851, 704455, 713290, 720226, 725681, 730396, 734494]
51000G34494K723O70j126k205l034m016m780m781m036k857j371J76J162J375J753
50985G14147L513O530R440J1390J2854J4366J5436J5462J5049J5370J6532J7568
50973H67657J8021J8639K0298K3071K6669L0999L5747L9978M2921M4978M7343
50962A216321N0648N4357N7455N9311N9849N9284N7845N5620N2590M8796M4424
50951A816500L9654L4636K9750K5614K2514K0021J7514J5045J3291J2656J2741
50940B059936J2720J1934J0071P171L759N74k114m838q320j2649j7301k1820k6164
50927B012959l0425l4597l8717m2975m7465n1908n5718n8329n9415n9061n7731
50916A476618n5967n3941n1407m8166m4409m0468l6470l2471k8759k5721k3465
$$ y = [734494, 737217, 737887, 736761, 734556, 731522, 727506, 722726, 717945, 713909, 711052, 709681, 709857, 711019, 712394, 714147, 717660, 724190, 733630, 745020, 757874, 772240, 787676, 803138, 818187, 833557, 850089, 867657, 885678, 904317, 924615, 947686, 974355, 1005354, 1041101, 1081079, 1124000, 1168978, 1216321, 1266969, 1321326, 1378781, 1438092, 1497941, 1557225, 1615070, 1670690, 1723280, 1772076, 1816500, 1856154, 1890790, 1920540, 1946154, 1968668, 1988689, 2006203, 2021248, 2034539, 2047195, 2059936, 2072656, 2084590, 2094661, 2101832, 2105591, 2106165, 2104051, 2099213, 2090893, 2078244, 2060943, 2039123, 2012959, 1982534, 1947937, 1909220, 1866245, 1818780, 1766872, 1711154, 1652825, 1593410, 1534349, 1476618, 1420651, 1366710, 1315303, 1267137, 1222728, 1182260, 1145790, 1113319, 1084560, 1058839, 1035374]
50905A035374k1815k0618j9676j8488j6561j4095j2014j1022j0841j0589r624
50894H70031p909n817l840k328j297n13R9M02M24N03Q88J482K162K984L842M367
50878H65480M549N084O503Q344R731J0634J1731J3197J4411J5041J5650J6881
50866I97236J8567K0097K1269K2433K4045K6398K9508L3015L6428L9765M3687
50855A312448M8802N4995O1713O8638P5776Q3082R0359R7460J04284J10640J16397
50844B224594J21702J26748J31253J34329J34905J32303J26448J17775J06882
50835C356939R4218Q0110O5082M9983L5631K2518J1026J778m588p929q660p250
50823C688858l910J121P171J3114J7646J9602J8272J3586N927m350j7114l2088
$$ y = [1035374, 1013559, 992941, 973265, 954777, 938216, 924121, 912107, 901085, 890244, 879655, 870031, 862122, 856305, 852465, 850137, 848840, 848327, 848426, 848828, 849252, 849755, 850643, 852125, 854287, 857271, 861113, 865480, 870029, 875113, 881616, 889960, 899691, 910325, 922056, 935253, 949664, 964705, 980355, 997236, 1015803, 1035900, 1057169, 1079602, 1103647, 1130045, 1159553, 1192568, 1228996, 1268761, 1312448, 1361250, 1416245, 1477958, 1546596, 1622372, 1705454, 1795813, 1893273, 1997557, 2108197, 2224594, 2346296, 2473044, 2604297, 2738626, 2873531, 3005834, 3132282, 3250057, 3356939, 3451157, 3531267, 3596349, 3646332, 3681963, 3704481, 3715507, 3717285, 3712697, 3704768, 3696108, 3688858, 3684948, 3686069, 3693240, 3706354, 3724000, 3743602, 3761874, 3775460, 3781387, 3777037, 3759923, 3727835]
50811C727835m8500o5361q1942r7711j11889j23487j31966j37478j40241j40101
50801B649159j37023j31704j25100j17472j08500r8282q7607p7079o6702n6568
50791A643122m7288l9291l2211k5598j9796j5401j2169r250o437m382l560l633
50779A424106m093m856n932p106q227r438j0780j1886j2446j2744j3402j4732
50767A308464j6437j7906j8697j8910j9093j9535j9738j9012j7550j6285j5519
50756A109782j4384j2058q949o104l907j953J66K646N731R409J2971J5688J7924
50743A126962K0813K4650K8442L1364L3871L6886M0499M4153M7617N1053N4374
50732A540684N7306N9952O2625O5094O6744O7466O7755O7695O6649O4292O1146
$$ y = [3727835, 3679335, 3613974, 3532032, 3434321, 3322432, 3198945, 3066979, 2929501, 2789260, 2649159, 2512136, 2380432, 2255332, 2137860, 2029360, 1931078, 1843471, 1766392, 1699690, 1643122, 1595834, 1556543, 1524332, 1498734, 1478938, 1463537, 1451368, 1442118, 1435681, 1431299, 1427739, 1424106, 1420013, 1415157, 1409225, 1402119, 1393892, 1384454, 1373674, 1361788, 1349342, 1336598, 1323196, 1308464, 1292027, 1274121, 1255424, 1236514, 1217421, 1197886, 1178148, 1159136, 1141586, 1125301, 1109782, 1095398, 1083340, 1074391, 1068287, 1064380, 1062427, 1062593, 1065239, 1070970, 1080379, 1093350, 1109038, 1126962, 1147775, 1172425, 1200867, 1232231, 1266102, 1302988, 1343487, 1387640, 1435257, 1486310, 1540684, 1597990, 1657942, 1720567, 1785661, 1852405, 1919871, 1987626, 2055321, 2121970, 2186262, 2247408]
50721B247408N7584N2891M6110L7361K7560J7194O292m456j3640k0342k4637k6674
50709B402651k6138k3018j8143j2405o102M28O191J0276J2693J3755J3019R680
50697B382887L677m419j4321k5874l8055m9165n8309o5785p1788p5603p6560p5093
50685A831592p2204o8284o3072n6463m8855m0802l2826k5467j9026j3240p457
50674A383896j249N254J1529J6980K1204K4141K6077K7312K7788K7078K4896K1668
50662A616574J8511J6414J5389J4669J3767J2909J2315J1571J0320R076Q595Q578
50650A768688P983O711O144P548J0573J3871J6673J9175K1743K4444K7296L0392
50638A961241L3592L6427L8433L9486L9717L9295L8310L6916L5482L4549L4492
$$ y = [2247408, 2304992, 2357883, 2403993, 2441354, 2468914, 2486108, 2492400, 2487944, 2474304, 2453962, 2429325, 2402651, 2376513, 2353495, 2335352, 2322947, 2316845, 2317273, 2323464, 2333740, 2346433, 2360188, 2373207, 2382887, 2386564, 2382145, 2367824, 2341950, 2303895, 2254730, 2196421, 2130636, 2058848, 1983245, 1906685, 1831592, 1759388, 1691104, 1628032, 1571569, 1522714, 1481912, 1449086, 1423619, 1404593, 1391353, 1383896, 1382647, 1387901, 1399430, 1416410, 1437614, 1461755, 1487832, 1515144, 1542932, 1570010, 1594906, 1616574, 1635085, 1651499, 1666888, 1681557, 1695324, 1708233, 1720548, 1732119, 1742439, 1751515, 1760110, 1768688, 1776671, 1783382, 1789526, 1797074, 1807647, 1821518, 1838191, 1857366, 1879109, 1903553, 1930849, 1961241, 1994833, 2031260, 2069693, 2109179, 2148896, 2188191, 2226501, 2263417, 2298899, 2333448, 2367940]
50627B367940L5184L6002L5974L3771K7840J7209K505j3907k8899l9882m5624
50616B428113m6483m3986l9750l4539k8392k1534j4819r159m944k061k98L65m18
50603B182095l246q329j4983k2055k8898l5526m1942m7807n2789n6716n9318o0362
50591A750124o0149n9323n8041n5936n3022m9974m7194m4303m0905l7222l3568
50580A210487k9784k5811k2170j9213j6363j2860q936n465k686l3K826N548P769
50567A083309R618J1340J2904J4234J5467J6857J8501K0284K1932K3186K4086
50556A271718K5057K6533K8478L0379L1662L2165L2256L2495L2940L2910L1717
50545A608310K9627K7671K6526K6111K6308K7399K9460L1992L4562L7358M0645
$$ y = [2367940, 2403124, 2439126, 2475100, 2508871, 2536711, 2553920, 2556425, 2542518, 2513619, 2473737, 2428113, 2381630, 2337644, 2297894, 2263355, 2234963, 2213429, 2198610, 2189451, 2184507, 2182446, 2182148, 2182513, 2182095, 2178849, 2170520, 2155537, 2133482, 2104584, 2069058, 2027116, 1979309, 1926520, 1869804, 1810486, 1750124, 1689975, 1630652, 1572611, 1516675, 1463653, 1413679, 1366485, 1322182, 1281277, 1244055, 1210487, 1180703, 1154892, 1132722, 1113509, 1097146, 1084286, 1075350, 1069885, 1067199, 1067166, 1069992, 1075540, 1083309, 1092927, 1104267, 1117171, 1131405, 1146872, 1163729, 1182230, 1202514, 1224446, 1247632, 1271718, 1296775, 1323308, 1351786, 1382165, 1413827, 1445992, 1478248, 1510743, 1543683, 1576593, 1608310, 1637937, 1665608, 1692134, 1718245, 1744553, 1771952, 1801412, 1833404, 1867966, 1905324, 1945969]
50534A945969M4227M7853N1753N6267O1333O6823P2856P9263Q5276R0396R5106
50523B697122R9925J04174J06507J06379J04042R9410R2003Q2054P0572N7963
50513C620151M3542K6902R047q450k4989m1039n6877p1679q3891r2270r6503r6989
50501C126955r4212q8466q0083o9511n7021m2774k7382j2020K392J5716K7808
50490B701402L7647M3764M5304M2085L4039K1293M766j4018l3719n3254p1296
50479B758013q6467r7997j05711j09475j09398j06464j02070r6845r0671q3943
50469A768972p7845p3002o8670o3756n8142n2480m7210m2291l7561l2877k8044
50458A187094k2958j7750j2688q102m361j594N99K852N362P840J0079J2147J3981
$$ y = [1945969, 1990196, 2038049, 2089802, 2146069, 2207402, 2274225, 2347081, 2426344, 2511620, 2602016, 2697122, 2797047, 2901221, 3007728, 3114107, 3218149, 3317559, 3409562, 3491616, 3562188, 3620151, 3663693, 3690595, 3699642, 3691192, 3666203, 3625164, 3568287, 3496608, 3412717, 3320447, 3223944, 3126955, 3032743, 2944277, 2864194, 2794683, 2737662, 2694888, 2667506, 2655486, 2657878, 2673594, 2701402, 2739049, 2782813, 2828117, 2870202, 2904241, 2925534, 2930300, 2916282, 2882563, 2829309, 2758013, 2671546, 2573549, 2467838, 2358363, 2248965, 2142501, 2040431, 1943586, 1852915, 1768972, 1691127, 1618125, 1549455, 1485699, 1427557, 1375077, 1327867, 1285576, 1248015, 1215138, 1187094, 1164136, 1146386, 1133698, 1125596, 1121235, 1119641, 1120240, 1123092, 1128454, 1136294, 1146373, 1158520, 1172501]
50445A172501J5436J6813J8742K1278K3585K4742K4426K2624J9370J5111J0817
50434A385445P197M214J687j39j096j704k594l564l832l072j649QJ789L591N309
50419A391590P209R914J3755J8333K3003K7565L2307L7407M2475M6802N0060N2685
50407A753105N5382N8267O0509O0957N9094N5394N0812M5916M0517L4024K6091
50396B300068J6836O585m362j5677k6946l7725m7411n5126o0215o2917o4048o3850
50384A885212o1747n7518n1968m5828l8782l0460k1803j4204p625q18O500J2901
50372A573860J6903J8278J7426J4433R336K490n764j5029k4064l1051l5302l7904
50360A503612l9945m0931l9710l6368l2161k8070k4385k1355j9305j8246j8203
$$ y = [1172501, 1187937, 1204750, 1223492, 1244770, 1268355, 1293097, 1317523, 1340147, 1359517, 1374628, 1385445, 1392642, 1396856, 1398543, 1398404, 1397308, 1395604, 1393010, 1389446, 1385614, 1382542, 1380893, 1380901, 1382690, 1386281, 1391590, 1398799, 1408713, 1422468, 1440801, 1463804, 1491369, 1523676, 1561083, 1603558, 1650360, 1700420, 1753105, 1808487, 1866754, 1927263, 1988220, 2047314, 2102708, 2153520, 2199436, 2239953, 2273977, 2300068, 2316904, 2323489, 2319127, 2303450, 2276504, 2238779, 2191368, 2136242, 2076027, 2013110, 1949062, 1885212, 1823465, 1765947, 1713979, 1668151, 1629369, 1598909, 1577106, 1562902, 1555277, 1554459, 1560959, 1573860, 1590763, 1609041, 1626467, 1640900, 1650236, 1652726, 1646962, 1631933, 1607869, 1576818, 1541516, 1503612, 1463667, 1422736, 1383026, 1346658, 1314497, 1286427, 1262042, 1240687, 1221382, 1203136, 1184933]
50349A184933j9731k3174k7466l0682l1912l1784l0927k8929k5304k0791j6838
50338H97395j4096j2051r948p583n114k715o17Q20J515J982K872M128M992N055
50324H66635M914N419O561P604Q176Q537Q807Q656Q056P654P914Q347Q142P286
50310I72708O416N824N140M112L154K942L641M718N435N497N273N301N672O055
50296A041888O244O371O528O582O481O330O018N001K855k32l625o613q493q733
50282A066602p486n649m119l122k427j720n36J653M636P222Q360Q399Q622R651
50268A090086J0947J1799J2154J2396J2841J3651J4845J6229J7510J8632J9698
50257A250788K0576K0902K0526J9623J8307J6575J4747J3523J3242J3359J2922
$$ y = [1184933, 1165202, 1142028, 1114562, 1083880, 1051968, 1020184, 989257, 960328, 935024, 914233, 897395, 883299, 871248, 861300, 853717, 848603, 845888, 845271, 846091, 847606, 849588, 852460, 856588, 861580, 866635, 871549, 876968, 883529, 891133, 899309, 907846, 916653, 925309, 933365, 941019, 948933, 957280, 965422, 972708, 979124, 984948, 990088, 994200, 997354, 1000296, 1003937, 1008655, 1014090, 1019587, 1024860, 1030161, 1035833, 1041888, 1048132, 1054503, 1061031, 1067613, 1074094, 1080424, 1086442, 1091443, 1094298, 1094066, 1090441, 1083828, 1075335, 1066602, 1059116, 1053467, 1049348, 1046226, 1043799, 1042079, 1041543, 1043196, 1047832, 1055054, 1063414, 1071813, 1080435, 1090086, 1101033, 1112832, 1124986, 1137382, 1150223, 1163874, 1178719, 1194948, 1212458, 1231090, 1250788, 1271364, 1292266, 1312792, 1332415, 1350722, 1367297, 1382044, 1395567, 1408809, 1422168, 1435090]
50246A435090J1475R124N911J591l774r342j3910j6783j8073j8166j7220j5213
50234A350710j2256q761n446l324l380n894j0160j4997j9462k3014k5346k6558
50222A192112k7173k7521k7253k5924k3894k2044k0656j9260j7582j5932j4597
50211I50276j3525j2732j2286j1788j0684r437r300j0443j1230j0181p911o165
50199H24594n580n423n141m964n069n176n151n178n171m716l796k980k709k836
50185G60704l034l198l254k985k270j272k60N58J079J366J598J757J509P80J69
50170G53247L86J355K314K757K810K756K672K608K703L024L546M240M985N493
50156G94896N767O404P955J0106J2039J3553J5191J7214J9150K0648K2112K4131
$$ y = [1435090, 1446565, 1455689, 1461600, 1463191, 1459417, 1450075, 1436165, 1419382, 1401309, 1383143, 1365923, 1350710, 1338454, 1329693, 1324247, 1320923, 1317543, 1311649, 1301489, 1286492, 1267030, 1244016, 1218670, 1192112, 1164939, 1137418, 1110165, 1084241, 1060347, 1038303, 1017647, 998387, 980805, 964873, 950276, 936751, 924019, 911733, 899945, 889261, 879824, 870524, 860081, 848851, 838670, 830759, 824594, 819014, 813591, 808450, 803486, 798417, 793241, 788090, 782912, 777741, 773025, 769229, 766249, 763540, 760704, 757670, 754472, 751218, 748233, 745963, 744691, 744431, 744989, 746068, 747434, 749032, 750789, 752298, 753078, 753247, 753633, 754988, 757302, 760059, 762869, 765625, 768297, 770905, 773608, 776632, 780178, 784418, 789403, 794896, 800663, 807067, 815022, 825128, 837167, 850720, 865911, 883125, 902275, 922923, 945035, 969166]
50144I69166K6667K9247L1651L3944L6007L7488L8302L8820L9451M0135M0494
50133A361372M0406M0191M0004L9268L6971L2530K6004J7606P595l305j3923k3499
50121A601220l1932l8962m3739m5847m6126m5712m4620m2153l8439l4656l1674
50110A157360k9302k6999k4646k2435k0598j9406j8911j8616j7875j6685j5540
50099I26347j4523j3188j1407r662q322p199o070n050m196l263k218j469j306
50086H38474j393j170m41O13J703K547L012L318L802M462N103N861P012Q303R119
50071H90325R434R882J0621J0853J0011Q661P681P046O157M871L496K065M18j068
50057I80453j706j508j383k021l146m027m368m370m213l907l449k798j708Q2K349
$$ y = [969166, 995833, 1025080, 1056731, 1090675, 1126682, 1164170, 1202472, 1241292, 1280743, 1320878, 1361372, 1401778, 1441969, 1481973, 1521241, 1558212, 1590742, 1616746, 1634352, 1641947, 1638642, 1624719, 1601220, 1569288, 1530326, 1486587, 1440740, 1394614, 1348902, 1304282, 1262129, 1223690, 1189034, 1157360, 1128058, 1101059, 1076413, 1053978, 1033380, 1013974, 995063, 976447, 958572, 941887, 926347, 911824, 898636, 887229, 877567, 869245, 862046, 855976, 850926, 846730, 843467, 841249, 839780, 838474, 837081, 835911, 835470, 836083, 837786, 840333, 843345, 846663, 850465, 854927, 860030, 865891, 872903, 881206, 890325, 899759, 909641, 920262, 931115, 941126, 949787, 957468, 964514, 970671, 975542, 979038, 981103, 981521, 980453, 978747, 977239, 975856, 973835, 970689, 966662, 962294, 957924, 953711, 949804, 946355, 943557, 941849, 941931, 944280]
50042I44280M406N881P210R031J1159J2676J3161J3377J4423J6489J8775K0449
50030A091317K1246K1413K1439K1719K2222K2569K2640K2856K3550K4338K4538
50019A339847K3886K2474K0363J7742J5112J2726J0285P821O337O455O819N082
50007A494949N26n464j1549j7719k4084k9762l3823l6412l8085l8761l8100l6340
49995A185376l3990l1154k7802k4373k1579j9872j9399j9941k0631k0369j9072
49984I27194j7848j7420j7119j6058j4568j3554j3056j2354j1103r538p891o421
49972G70264n630n576n330m061k326j356j282j165o31k71m03m92q3P17J938M016
49956G48329O845R352J0590J0671J0200R337P945O197M476K967J708P71M1r61
$$ y = [944280, 948686, 954567, 961777, 970808, 981967, 994643, 1007804, 1021181, 1035604, 1052093, 1070868, 1091317, 1112563, 1133976, 1155415, 1177134, 1199356, 1221925, 1244565, 1267421, 1290971, 1315309, 1339847, 1363733, 1386207, 1406570, 1424312, 1439424, 1452150, 1462435, 1470256, 1476593, 1483048, 1489867, 1494949, 1495475, 1490011, 1478462, 1460743, 1436659, 1406897, 1373074, 1336662, 1298577, 1259816, 1221716, 1185376, 1151386, 1120232, 1092430, 1068057, 1046478, 1026606, 1007207, 987266, 966635, 946266, 927194, 909346, 891926, 874807, 858749, 844181, 830627, 817571, 805217, 794114, 784576, 776685, 770264, 764634, 759058, 753728, 749667, 747341, 745985, 744703, 743538, 742907, 742636, 742233, 741741, 741658, 742375, 744313, 748329, 755174, 764526, 775116, 785787, 795987, 805324, 813269, 819466, 823942, 826909, 828617, 829388, 829429, 828468]
49942H28468k638m843o988q529r229r318r487j0339j1556j2003j1023r358q344
49929G14813q430q863q723p833o609n431m362l267k015o32O84J691K306K662K941
49914F68932L217L438L553L663L986M700N811P136Q493R800J0993J1796J1782
49901G57300J0799R323Q036P084N993M474K866J436k79k826n807q198r622j0581
49887G69998j1413j1839j1720j1420j1081j0277q945p867p616p642p099o109n374
49874F51596n014m568l864l089k218j211n05m04k12J051L150M929O155P868J0542
49859F64206J3001J3892J3359J2521J1825J0935R791Q870Q296P450N691L159O18
$$ y = [828468, 825830, 820987, 813999, 805470, 796241, 786923, 777436, 767097, 755541, 743538, 732515, 723157, 714813, 706383, 697520, 688797, 680964, 674355, 668924, 664562, 661295, 659280, 658648, 659332, 661023, 663329, 665991, 668932, 672149, 675587, 679140, 682803, 686789, 691489, 697300, 704436, 712929, 722729, 733722, 745518, 757300, 768099, 777422, 785458, 792542, 798535, 803009, 805875, 807311, 807032, 804206, 798399, 790201, 780579, 769998, 758585, 746746, 735026, 723606, 712525, 702248, 693303, 685436, 677820, 670178, 663079, 656970, 651596, 646582, 642014, 638150, 635061, 632843, 631632, 631127, 630723, 630511, 631562, 634712, 639641, 645796, 653664, 664206, 677207, 691099, 704458, 716979, 728804, 739739, 749530, 758400, 766696, 774146, 779837, 782996, 783614]
$$ [...]
##END NTUPLES=NMR SPECTRUM
##END=
