
##TITLE=UV1231_M7_1357-1247_30_7230727_dpX2DbCiSP
##JCAMPDX= 6.0         $$ Bruker NMR JCAMP-DX V2.0
##DATA TYPE= NMR SPECTRUM
##DATA CLASS= NTUPLES
##ORIGIN= BRUKER
##OWNER= Administrator
$$ 1.72 TOPSPIN		Version 2.1
$$ 2013-01-18 20:24:20.882 -0500  Administrator@X
$$ Compression mode = diff/dup
##.OBSERVE FREQUENCY= 400.02188249412
##.OBSERVE NUCLEUS= ^1H
##.ACQUISITION MODE= SIMULTANEOUS (DQD)
##.ACQUISITION SCHEME= undefined
##.AVERAGES= 8
##.DIGITISER RES= 22
##SPECTROMETER/DATA SYSTEM= spect
##.PULSE SEQUENCE= zg30
##.SOLVENT NAME= COFFEE_meoh
##.SHIFT REFERENCE= INTERNAL, COFFEE_meoh, 1, 14.98509
##AUDIT TRAIL= $$ (NUMBER, WHEN, WHO, WHERE, PROCESS, VERSION, WHAT)
$$ ##TITLE= Audit trail, TOPSPIN		Version 2.1
$$ ##JCAMPDX= 5.01
$$ ##ORIGIN= Bruker BioSpin GmbH
$$ ##OWNER= Administrator
$$ $$ E:\/data/COFFEE/nmr/UV1231_M7_1357-1247_30_7230727_dpX2DbCiSP/20/pdata/1/auditp.txt
$$ ##AUDIT TRAIL=  $$ (NUMBER, WHEN, WHO, WHERE, PROCESS, VERSION, WHAT)
(   1,<2013-01-18 20:24:12.851 -0500>,<Administrator>,<X>,<go>,<TOPSPIN 2.1>,
      <created by zg
	started at 2013-01-18 20:23:06.835 -0500,
	POWCHK enabled, PULCHK disabled,
       configuration hash MD5:
       86 BA 57 50 F2 9D 5C 9B 26 00 A9 28 5F 66 2E 89
       data hash MD5: 64K
       20 A9 2E 4B A6 AC 39 E3 D4 EB 64 44 8F DB 42 8F>)
(   2,<2013-01-18 20:24:15.882 -0500>,<Administrator>,<X>,<proc1d>,<TOPSPIN 2.1>,
      <Start of raw data processing
       efp LB = 0 FT_mod = 6 PKNL = 1 PHC0 = 0 PHC1 = 0 SI = 32K 
       data hash MD5: 32K
       7F 11 1A 67 26 34 A9 3C 26 4C 6E CD BF F7 B9 02>)
(   3,<2013-01-18 20:24:16.335 -0500>,<Administrator>,<X>,<proc1d>,<TOPSPIN 2.1>,
      <pk PHC0 = 95.96008 PHC1 = 0 
       data hash MD5: 32K
       B7 E0 CD 8C F9 C5 C6 AC 13 D1 D8 B3 68 28 2F A6>)
(   4,<2013-01-18 20:24:16.554 -0500>,<Administrator>,<X>,<proc1d>,<TOPSPIN 2.1>,
      <abs ABSG = 1 
       data hash MD5: 32K
       AD F5 B4 CE 19 B9 DE B4 E5 5F 1F F7 4D 79 0B 81>)
(   5,<2013-01-18 20:24:16.710 -0500>,<Administrator>,<X>,<proc1d>,<TOPSPIN 2.1>,
      <abs ABSG = 2 
       data hash MD5: 32K
       DA B4 05 23 75 1B C8 96 93 C9 B1 F6 0F D3 38 6F>)
(   6,<2013-01-18 20:24:16.835 -0500>,<Administrator>,<X>,<proc1d>,<TOPSPIN 2.1>,
      <abs ABSG = 3 
       data hash MD5: 32K
       BA 94 38 4D FE 1A B9 81 5A DB C9 1B F8 2E 02 1F>)
(   7,<2013-01-18 20:24:16.992 -0500>,<Administrator>,<X>,<proc1d>,<TOPSPIN 2.1>,
      <abs ABSG = 4 
       data hash MD5: 32K
       63 05 5D FB 18 25 B1 95 97 0D A2 6C 0D 55 5C 14>)
(   8,<2013-01-18 20:24:17.132 -0500>,<Administrator>,<X>,<proc1d>,<TOPSPIN 2.1>,
      <abs ABSG = 5 
       data hash MD5: 32K
       30 86 5F C7 00 8E 76 0B DA D5 FA 10 49 F4 A6 27>)
$$ ##END=
$$ 
$$ $$ hash MD5
$$ $$ 97 32 CD 04 5F 8D C2 6A 35 65 8B B6 13 BD 0F 2C
##$RELAX= 
##$RELAX= 
##$RELAX= 
##$RELAX= 
##$RELAX= 
##$RELAX= 
##$RELAX= 
$$ Bruker specific parameters
$$ --------------------------
##$DU= <E:\>
##$EXPNO= 20
$$ [...]
150 150 150 150 150 150 150 150
##$TP07= 0
##$TPNAME0= <>
##$TPNAME1= <>
##$TPNAME2= <>
##$TPNAME3= <>
##$TPNAME4= <>
##$TPNAME5= <>
##$TPNAME6= <>
##$TPNAME7= <>
##$TPOAL= (0..7)
0.5 0.5 0.5 0.5 0.5 0.5 0.5 0.5
##$TPOFFS= (0..7)
0 0 0 0 0 0 0 0
##$TUNHIN= 0
##$TUNHOUT= 0
##$TUNXOUT= 0
##$USERA1= <user>
##$USERA2= <user>
##$USERA3= <user>
##$USERA4= <user>
##$USERA5= <user>
##$V9= 5
##$VALIST= <valist>
##$VCLIST= <CCCCCCCCCCCCCCC>
##$VD= 0
##$VDLIST= <DDDDDDDDDDDDDDD>
##$VPLIST= <PPPPPPPPPPPPPPP>
##$VTLIST= <TTTTTTTTTTTTTTT>
##$WBST= 1024
##$WBSW= 4
##$XGAIN= (0..3)
0 0 0 0
##$XL= 0
##$YL= 0
##$YMAX_a= 609602
##$YMIN_a= -517692
##$ZGOPTNS= <>
##$ZL1= 120
##$ZL2= 120
##$ZL3= 120
##$ZL4= 120
##$ABSF1= 14.98509
##$ABSF2= -5.573092
##$ABSG= 5
##$ABSL= 3
##$ALPHA= 0
##$AQORDER= 0
##$ASSFAC= 0
##$ASSFACI= 0
##$ASSFACX= 0
##$ASSWID= 0
##$AUNMP= <proc_prof1d_extract_pilot.lims>
##$AXLEFT= 0
##$AXNAME= <>
##$AXNUC= <1H>
##$AXRIGHT= 0
##$AXTYPE= 0
##$AXUNIT= <>
##$AZFE= 0.1
##$AZFW= 0.1
##$BCFW= 0
##$BC_mod= 0
##$BYTORDP= 0
##$COROFFS= 0
##$CY= 15
##$DATMOD= 1
##$DC= 0
##$DFILT= <>
##$DTYPP= 0
##$F1P= 0
##$F2P= 0
##$FCOR= 0.5
##$FTSIZE= 32768
##$FT_mod= 6
##$GAMMA= 0
##$GB= 0
##$INTBC= 1
##$INTSCL= 1
##$ISEN= 128
##$LB= 0
##$LEV0= 0
##$LPBIN= 0
##$MAXI= 10000
##$MC2= 0
##$MEAN= 0
##$ME_mod= 0
##$MI= 0
##$NCOEF= 0
##$NC_proc= -8
##$NLEV= 6
##$NOISF1= 0
##$NOISF2= 0
##$NSP= 0
##$NTH_PI= 0
##$NZP= 0
##$OFFSET= 14.98509
##$PC= 1
##$PHC0= 95.96008
##$PHC1= 0
##$PH_mod= 1
##$PKNL= yes
##$PPARMOD= 0
##$PPDIAG= 0
##$PPIPTYP= 0
##$PPMPNUM= 2147483647
##$PPRESOL= 1
##$PSCAL= 4
##$PSIGN= 0
##$PYNMP= <proc.py>
##$REVERSE= no
##$SF= 400.02
##$SI= 32768
##$SIGF1= 0
##$SIGF2= 0
##$SINO= 400
##$SIOLD= 32768
##$SPECTYP= <>
##$SREGLST= <1H.CDCl3>
##$SSB= 0
##$STSI= 32768
##$STSR= 0
##$SW_p= 8223.68421052631
##$SYMM= 0
##$S_DEV= 0
##$TDeff= 65536
##$TDoff= 0
##$TI= <>
##$TILT= no
##$TM1= 0
##$TM2= 0
##$TOPLEV= 0
##$USERP1= <user>
##$USERP2= <user>
##$USERP3= <user>
##$USERP4= <user>
##$USERP5= <user>
##$WDW= 1
##$XDIM= 32768
##$YMAX_p= 462423259
##$YMIN_p= -726678
##$CURPLOT= <Network HP LaserJet P1505>
##$CURPRIN= <$Network HP LaserJet P1505>
##$DFORMAT= <normdp>
##$LAYOUT= <+/1D_H.xwp>
##$LFORMAT= <normlp>
##$PFORMAT= <normpl>
##$SURQMSG= 1
$$ End of Bruker specific parameters
$$ ---------------------------------
##NTUPLES= NMR SPECTRUM
##VAR_NAME=  FREQUENCY,     SPECTRUM/REAL,   SPECTRUM/IMAG
##SYMBOL=    X,             R,               I
##VAR_TYPE=  INDEPENDENT,   DEPENDENT,       DEPENDENT
##VAR_FORM=  AFFN,          ASDF,            ASDF
##VAR_DIM=   32768,         32768,           32768
##UNITS=     HZ,            ARBITRARY UNITS, ARBITRARY UNITS
##FACTOR=    0.250966925370066, 1,           1
##FIRST=     8223.43324360094, 78612,        -175474
##LAST=      0,             -18882,          -148384
##MIN=       0,             -726678,         0
##MAX=       8223.43324360094, 462423259,    0
$$ Real data points
##PAGE= N=1
##DATA TABLE= (X++(R..R)), XYDATA
$$ [...]
$$ plain form
19575 192799 -331021 -142095 -29892 136914 9070 -61818 67417 293149 327999 -244004 -121132
19563 8366 56054 16279 -161252 -52190 -57472 -60440 -327949 -59847 -2324 -123535 -224959 -215960
19551 -215960 302701 -13680 -93181 -447608 -342079 -43147 -75817 -167739 -259997 -52558 177663
19539 -196657 -41248 -246245 -110700 -35499 -159509 42626 -176413 88506 36022 238476
19529 238476 384174 -60226 -2955 -216769 -430295 -273685 -89340 7452 -188224 -143433 -26227
19517 -183147 8040 122679 -36 -98364 -176625 -67771 74729 246840 -325083 -145576 1280 -3311
19504 -155368 -121192 -97479 132202 -141767 67630 -125103 -172981 -30771 -371307 -53140 29227
19492 -217585 10092 264336 32429 -63985 -213832 -123296 -67142 -215787 217875 -39273 92349
$$ packed form
19575A92799c31021a42095b9892A36914I070f1818F7417K25732L4850b44004a21132
19563H366M7688A6279a61252e2190n282k968k67509e9847b324j21211j01424Q999
19551b15960C02701a3680p9501l54427J05529d3147l2670r1922r2258e2558A77663
19539a96657d1248k04997a10700c5499j24010D2626a76413H8506C6022K02454
19529B38476J45698f0226b955k13814k13526J56610h9340G452a88224M4791b6227
19517a83147H040J14639c6r8328p8261f7771G4729J72111c25083a45576A280c311
19504a55368L4176K3713A32202a41767F7630a25103m7878c0771l40536e3140B9227
19492b17585A0092K54244C2429f3985j49847R0536N6154j48645B17875c9273I2349
$$ plain form
19480 -352140 -259430 339901 -450038 153537 -99727 -421066 -51246 -77677 38 -160987 73304
19468 147043 -55458 101956 -338660 47338 -146506 -100814 -161312 -78642 20456 36131 126904
19457 126904 8270 -258396 -21252 84970 18348 168556 -12250 -477506 -297452 447252 -291187
19445 -39102 13127 -98732 -58452 -237643 -218800 31403 -85978 86909 90388 79794 -276595
19433 269736 -8787 -83257 61126 60718 -15551 -56610 -93557 -31401 -263646 -89479 447895 143099
19420 -99849 -144718 145645 131847 -175277 32326 219319 -139 163678 -389714 -38347 -142519
19409 -142519 138736 193383 -226523 16659 76418 1961 15007 177410 -475372 -392312 -53052
19397 -124871 52212 15842 -13438 87356 63241 -32790 -174855 60408 -42086 18026 44568
$$ packed form
19480c52140R2710C39901d50038A53537i9727l21339e1246k6431C8a60987G3304
19468A47043e5458A01956c38660D7338a46506M5692o0498g8642B0456J5675R0773
19457A26904H270b58396b1252H4970A8348J50208a2250m65256J80054D47252b91187
19445c9102A3127i8732M0280j79191J8843C1403h5978H6909L479j0594b76595
19433B69736h787p4470F1126m08a5551m1059l6947c1401k32245h9479D47895A43099
19420i9849m4869A45645j3798a75277C2326J86993a39A63678c89714c8347j04172
19409a42519A38736N4647b26523A6659N9759A961J3046J62403d75372Q3060e3052
19397a24871E2212A5842a3438H7356k4115c2790j42065F0408d2086A8026K6542
$$ plain form
19386 44568 265310 -93561 70244 -68120 -113875 -33184 -93697 84879 10730 -208751 253136
19374 95355 -156971 -351561 -114991 20410 -64796 -232566 -239124 -127472 -81743 -129531 106571
19362 -390284 -174675 -96736 -5255 -142065 -112317 -311970 118219 -184906 -237255 -57088 -40676
19351 -40676 -247232 176551 -62289 -36629 22436 -293788 1284 -290249 57863 97401 -227521
19339 -178433 -136037 214139 -212686 53568 -19368 -257381 -39995 5656 -185678 -522191 279995
19327 -290102 88127 178375 -92325 210616 -94811 230202 291089 -328533 -132540 -87449 3707
19315 152411 32471 -162840 238518 25027 -139801 -89156 126445 -69158 348076 124638
19304 -45404 125446 223159 -184955 -178930 -67209 -52321 -243467 283348 -23753 -441545 55291
$$ packed form
19386D4568K20742i3561G0244f8120m5755c3184o0513H4879A0730b08751B53136
19374I5355a56971j94590a14991B0410f4796j67770o558J11652M5729m7788A06571
19362c90284a74675P7939e255j36810K9748j99653A18219a84906n2349e7088J6412
19351d0676k06556A76551f2289K5660B2436b93788A284b90249E7863L9538b27521
19339a78433M2396B14139b12686E3568a9368k38013c9995E656a85678l36513B79995
19327b90102H8127R0248i2325B10616i4811B30202O0887c28533a32540M5091C707
19315A52411C2471a62840B38518B5027a39801N0645A26445f9158C48076A24638
19304d5404A25446R7713a84955O025f7209J4888j91146B83348b3753m17792E5291
$$ plain form
19292 -205390 126808 -69977 -11788 24815 -136199 -259655 -55957 -198675 222419 1971 -41392
19280 -139403 -120435 83923 -341668 -409124 192992 -1622 -44283 -264023 111685 -41704 -168228
19269 -168228 108228 230382 -71595 143861 186912 -89273 48172 212927 -395193 -135890
19258 -183919 182079 -12395 136504 519693 -29104 -332966 -287826 -215783 30706 11891 -317872
19246 10982 -207007 -67292 74781 -31716 -307998 -108307 -230059 87960 -190557 -213399 -8313
19234 -418261 31127 147062 -87161 186544 -279839 -162133 -418385 -93685 128598 -138463
19223 -12285 -156380 -276246 -263993 -181520 -221707 137237 18204 -204743 -115015 77513 -500732
19211 -240167 135653 106843 88933 49072 57713 -107049 -192922 162949 414873 -473676 -134631
$$ packed form
19292b05390A26808f9977a1788B4815a36199j23456e5957j42718B22419A971d1392
19280a39403J8968H3923c41668o7456A92992a622m2661k19740A11685d1704j26524
19269a68228A08228J22154g1595A43861M3051h9273D8172J64755c95193a35890
19258a83919A82079a2395A36504L83189b9104l03862M5140P2043C0706A1891c17872
19246A0982b07007f7292G4781c1716k76282a08307j21752H7960a90557k2842h313
19234d18261C1127J15935h7161A86544b79839J17706k56252i3685A28598a38463
19223a2285j44095j19866J2253Q2473m0187A37237A8204b04743Q9728G7513e00732
19211b40167A35653k8810j7910l9861Q641a07049q5873A62949K51924d73676a34631
$$ plain form
19199 -190055 87053 105559 -80066 221367 -62487 -126143 -159435 127620 -93642 152104 -172902
19187 44782 -9431 179593 -231271 -93948 10599 43094 -55434 80283 -100020 118191 169459
19176 169459 -60565 -98507 24601 -226655 -445160 -44619 83417 -128354 -144866 124376 220037
19165 220037 -246057 -48056 -8336 -237984 -153973 -69216 340892 99677 283804 -90466 -26852
19153 -155324 51764 205196 -93516 -158580 213762 -9471 -101680 -95476 29759 50763 -197924
19141 -80634 -51379 -104927 9308 -69174 8182 -95472 -84573 229012 -283859 71896 -106580
19129 -47521 170756 273831 148780 -386535 -102943 -104393 -31077 106382 247145 136252
19119 136252 -253332 104725 -67293 -165810 47400 92106 -271145 -52228 -189087 -44245 69383
$$ packed form
19199a90055H7053J8506h0066B21367f2487o3656l3292A27620i3642A52104a72902
19187D4782i431A79593b31271i3948A0599L2495e5434H0283a00020A18191N1268
19176A69459f0565l7942B4601b26655k18505d4619H3417a28354j6512A24376R5661
19165B20037b46057d8056h336k29648Q4011f9216C40892I9677J84127i0466b6852
19153a55324E1764J53432i3516o5064B13762i471r2209O204B9759K1004a97924
19141h0634K9255n3548I308f9174H182i5472J0899B29012b83859G1896a06580
19129d7521A70756J03075j25051c86535a02943j450c1077A06382J40763j10893
19119A36252b53332A04725f7293r8517D7400M4706b71145e2228j36859d4245F9383
$$ plain form
19107 17795 -2440 204020 641 5453 -186210 26671 112029 -115713 -519111 350409 32817
19095 -45019 -85687 -165075 -202348 -167924 -303184 27445 -4623 122124 36809 -191348 -118152
19084 -118152 119260 -41567 -162547 -250603 -147019 326936 -125135 -125282 -410836 -251244
19074 -251244 -23058 133904 60095 -44121 -147325 122973 -208962 -315976 -69563 211446
19063 -104121 1927 34252 -37588 -55801 63927 -141875 25738 192480 -105929 -148575 -183916
19052 -183916 116498 -207770 -33206 -152549 -395190 98816 -169934 -104044 -366054 -526757
19042 -526757 65480 123793 -3854 19355 100543 58605 5095 -109602 117537 -91814 -153841
19031 -153841 32856 296703 39364 65522 -106629 18604 201489 64981 -43644 222020 -45143
$$ packed form
19107A7795b440B04020F41M812a86210B6671Q5358a15713m03398C50409C2817
19095d5019m0668p9388l7273L4424j35260B7445d623A22124C6809a91348P3196
19084a18152A19260d1567j20980q8056J03584C26936a25135j47k85554J59592
19074b51244b3058A33904F0095d4121j03204A22973b08962j07014f9563B11446
19063a04121A927L2325c7588j8213F3927a41875B5738J66742a05929m2646l5341
19052a83916A16498b07770c3206j19343k42641I8816a69934O5890k62010j60703
19042e26757F5480N8313c854A9355Q1188m1938E095a09602A17537i1814o2027
19031a53841C2856K63847C9364K6158a06629A8604J82885F4981d3644B22020d5143
$$ plain form
19019 116102 -61677 -12918 -111779 245557 222278 -279340 -42348 52822 -322446 -32277 16849
19007 -79621 -440318 -147402 263847 -120258 -21521 329358 -267020 -288237 193860 -335931
18996 -75215 -81653 19605 198286 -195417 16372 98330 230483 -22643 -47932 -535710 -72206
18984 -19072 70122 -159783 -33333 -57651 -300079 -121142 -323179 -194481 367381 79901
18973 242260 -254623 182564 -63266 -245018 209743 225410 -63724 -186474 -177529 -187801 -147219
18962 -147219 16007 -300776 -92838 120329 188588 -92968 -22680 -62144 -13888 -245993 334797
18950 -326146 -205772 4608 -169034 -227055 -77978 94485 -140513 -304191 -117650 63406 -308111
18938 -100794 33159 56665 -287010 -174107 12775 -25172 -331920 -37679 -91389 66382 6959
$$ packed form
19019A16102f1677a2918r8861B45557k3279b79340d2348E2822c22446c2277A6849
19007g9621l60697a47402B63847a20258b1521C29358b67020k1217A93860c35931
18996g5215o438A9605J78681a95417A6372Q1958J32153b2643k5289m87778g2206
18984a9072G0122a59783c3333k4318k42428a21142k02037J28698C67381G9901
18973B42260b54623A82564f3266j81752B09743J5667f3724j22750Q945j0272M0582
18962a47219A6007c00776i2838A20329O8259i2968b2680l9464a3888k32105C34797
18950c26146J20374D608a69034n8021g7978I4485a40513j63678a17650F3406c08111
18938a00794C3159K3506b87010J12903A2775b5172l06748c7679n3710F6382F959
$$ plain form
18926 -313273 -94341 71188 75293 116950 -51899 51018 -133038 -336661 29759 108150 -107191
18914 211943 -457717 119682 -119614 -53932 -146125 -14172 -135877 12469 215846 88876
18903 -83955 -75318 -112846 -175255 -250553 104524 184485 395969 286723 -111713 -61292 93770
18891 246210 -28677 -227731 205819 136961 151645 153587 -550510 -257319 189266 -135916
18880 -86267 -63537 17848 -194815 228246 -1180 76659 140394 -329669 194790 111169 107231
18869 107231 -256246 -89644 -18319 211877 178131 64804 -61413 -17909 -116958 5111 -9958
18857 -117749 -469 34407 52372 -172345 -35760 -164424 153827 -157139 -274166 119247 216899
18846 216899 -167442 -81683 150473 236855 -163317 -206010 -216606 119259 -143374 170447
$$ packed form
18926c13273i4341G1188M105M1657e1899E1018a33038k03623B9759P8391a07191
18914B11943d57717A19682a19614e3932r2193a4172j21705A2469K03377H8876
18903h3955Q637l7528o2409p5298A04524P9961K11484j09246a11713N0421I3770
18891B46210b8677j99054B05819o8858J4684J942e50510b57319A89266a35916
18880h6267K2730A7848a94815B28246a180G6659O3735c29669A94790q3621l938
18869A07231b56246h9644a8319B11877l3746F4804f1413a7909r9049E111i958
18857a17749d69C4407J7965a72345c5760j28664A53827a57139j17027A19247R7652
18846B16899a67442h1683A50473Q6382a63317m2693j0596A19259a43374A70447
$$ plain form
18835 23677 217689 16476 35953 -49037 -28975 -3946 -27859 -22547 20934 149898 -126056
18823 -116943 79827 241688 32625 44396 197892 8786 267840 155703 159916 -78039 -487387
18812 -487387 136675 -177815 -70329 10347 25135 22101 201936 -129817 127699 -154062
18801 67531 -129798 -24315 472945 -142500 -331621 166691 -97725 -39185 -138143 -227480 224009
18789 -259247 -572447 16867 -103029 -206377 -211844 -127619 -241664 -37666 60009 -23645 -142619
18778 -142619 -232193 -209633 221982 -261294 -66055 79209 -200441 -76034 -86188 -258916 -105064
18766 -216869 -163301 76972 -231481 -23864 84623 256 -156302 -24237 -138467 69195 -4496
18754 -111058 204855 122040 105068 -215268 -166246 -212601 -222696 -235808 -373176 -75729 64161
$$ packed form
18835B3677J94012A6476J9477d9037K0062c946k3913N312B0934J28964a26056
18823a16943G9827J61861C2625J1771J53496H786K59054j12137M213g8039m09348
18812d87387A36675a77815g0329A0347J4788l034J79835a29817A27699a54062
18801F7531a29798b4315D72945a42500j89121A66691i7725c9185r8958q9337B24009
18789b59247l13200A6867a03029j03348n467Q4225j14045c7666F0009b3645j18974
18778a42619q9574K2560B21982b61294f6055G9209b00441g6034j0154j72728a05064
18766b16869N3568G6972b31481b3864H4623B56a56302b4237j14230F9195d496
18754a11058B04855q2815j6972b15268M9022m6355j0095j3112j37368g5729F4161
$$ plain form
18742 366953 343558 -93337 138474 27041 -69604 146609 -230376 -160470 -24544 -192478 -22144
18730 -62229 -271018 -268386 -114363 -39028 -54778 219334 84429 332920 150782 -337760 -3638
18718 322172 100615 127404 -379345 -15472 -242995 -75858 -325951 89559 -134737 243373
18707 -447514 -134052 -4256 147998 -52889 -94455 -23026 178630 282593 -150354 47849 -165457
18695 -79185 -122137 229512 -282642 -294220 -443296 -244965 170328 115537 -332282 -191473
18685 -191473 -12856 290674 138294 -50036 -211615 -135392 -277089 -129973 218015 -155220
18674 -250908 204937 110421 -80458 -67691 204870 -47994 -253870 -56486 94468 -238179 -244671
18663 -244671 -401102 -147497 -25949 -284353 -209905 112445 -195596 159894 86791 243406
$$ packed form
18742C66953k3395i3337A38474B7041f9604A46609b30376O9906b4544j67934b2144
18730f2229k08789K632a14363c9028j5750B19334H4429K48491A50782c37760c638
18718C22172A00615K6789c79345a5472k27523g5858k50093H9559a34737B43373
18707d47514a34052d256A47998e2889m1566b3026A78630J03963a50354D7849a65457
18695g9185m2952B29512b82642j1578j49076J98331A70328n4791c32282J40809
18685a91473a2856B90674A38294e0036j61579P6223j41697a29973B18015a55220
18674b50908B04937r4516h0458J2767B04870d7994k05876e6486I4468b38179o492
18663b44671j56431a47497b5949k58404P4448A12445a95596A59894p3103J56615
$$ plain form
18653 243406 50948 216174 -60331 -119788 46297 -55288 -337964 -62173 43252 24034 -62354
18641 121214 191660 -157679 396968 -661 -157953 114178 182518 95694 65019 -17605 -139917
18630 -139917 328391 153858 107782 54746 -157291 -197911 83766 61481 -215565 -198405 -60771
18618 -297349 189175 -97333 -238240 -298323 -150556 193924 -18519 -55557 -137626 77597 -157471
18606 139554 -376760 -126855 -240838 52844 -173202 102255 37101 -165554 -383423 -84366
18595 -263584 -142947 97786 64693 111766 -59024 -141489 -173825 17013 -144229 -163995 210170
18583 -341414 -455936 121050 -29368 -213244 -4930 122383 117087 23974 -291713 353326 -297358
18571 8216 -146958 1712 132958 -517112 79902 -38019 198070 21201 -83380 23748 -152723
$$ packed form
18653B43406E0948J65226f0331n9457D6297e5288k82676f2173D3252j9218f2354
18641A21214P0446a57679C96968f61j57292A14178O8340q6824l0675a7605j22312
18630a39917C28391A53858m6076n3036a57291m0620H3766k2285b15565J7160f0771
18618b97349A89175i7333j40907o0083J47767A93924a8519l7038q2069G7597a57471
18606A39554c76760a26855j13983E2844a73202A02255C7101a65554k17869h4366
18595b63584J20637I7786l3093M7073e9024q2465l2336A7013a44229j9766B10170
18583c41414j14522A21050b9368j83876d930A22383n296B3974b91713C53326b97358
18571H216a46958A712J31246e17112G9902c8019A98070B1201h3380B3748a52723
$$ plain form
18559 -87459 47068 -33704 30323 -362117 37374 -60596 191491 -52836 -25124 -341051 46502
18547 97399 -215185 -36928 -112845 64953 139212 -11659 305575 290698 -65289 28930 -214711
18535 181510 -49760 82653 50750 47178 -218139 -75501 53968 -102497 -9742 166423 -140511
18523 -540755 -238272 -49809 43294 -32312 214398 -210878 18827 -26655 -97191 46066 -61998
18511 -249554 -35652 510 -10325 -8415 164900 243956 203226 202346 164085 -196151 136761 68185
18498 -84738 140351 -388194 -21205 50028 105055 17244 -139662 -282692 -78752 -119422 36353
18486 46388 -146353 67311 147237 -46579 150884 -160851 -137058 171605 -61649 -74848 -49882
18475 -49882 149943 5153 -170019 -107667 -404018 -13206 -59327 -48773 22685 -235989 72642
$$ packed form
18559h7459D7068c3704C0323c62117C7374f0596A91491e2836b5124l15927D6502
18547I7399b15185c6928p5917F4953P4259a1659C05575j4877f5289B8930b14711
18535A81510d9760H2653l1903l572b18139g5501E3968a02497i742A66423a40511
18523e40755b38272d9809D3294c2312B14398b10878A8827b6655p0536D6066f1998
18511b49554c5652E10a0325J910A64900P9056m0730q80l8261a96151A36761F8185
18498h4738A40351c88194b1205E0028N5027A7244a39662j43030g8752m0670C6353
18486D6388a46353F7311P9926d6579A50884a60851K3793A71605f1649j3199K4966
18475d9882A49943E153a70019O2352k96351a3206m6121J0554B2685b35989G2642
$$ plain form
18463 147196 -40090 -169003 -151475 -148087 -361528 -172730 -18267 185414 328196 -380725
18452 44877 -31981 78417 -167216 -291170 -80121 114802 174390 -200305 -75678 109123 154016
18441 154016 -122807 286340 -84115 144815 140657 -32621 -17932 -119230 -295101 -61604 -145138
18430 -145138 69753 -215857 181139 -36367 -33213 -15036 -234372 -125312 -72172 152760 70626
18418 -345536 119089 -168957 72137 -8342 -35896 78059 -8997 75216 -22059 -53158 75387
18406 -26493 266255 63533 158699 2188 135970 28031 6928 -111600 -57870 -285450 -24408
18394 -84838 -181231 365070 -242800 -210324 136789 -91484 114280 225179 -51589 145455
18383 -200850 -128038 -256822 -308660 181743 -237565 52374 108113 31869 -93614 -132213 -334493
$$ packed form
18463A47196d0090j28913J7528L388k13441a72730a8267A85414J42782c80725
18452D4877c1981G8417a67216j23954h0121A14802N9588b00305g5678A09123M4893
18441A54016a22807B86340h4115A44815m158c2621J4689j01298j75871f1604q3534
18430a45138F9753b15857A81139c6367L154a5036k19336J09060N3140A52760G0626
18418c45536A19089a68957G2137h342k7554G8059h997G5216b2059l1099G5387
18406b6493B66255F3533R5166B188J33782B8031F928a11600N3730k27580b4408
18394h4838r6393C65070b42800L2476A36789i1484A14280J10899e1589A45455
18383b00850P2812j28784n1838A81743b37565E2374N5739C1869i3614l8599k02280
$$ plain form
18372 -334493 -13374 -44471 113286 -270903 -358773 71885 -154942 95369 -20454 -139116 -112231
18361 -112231 176785 -223143 -158759 9540 -426434 -213086 -226426 -236194 -251952 383304 -158192
18349 -42175 -52208 101651 -98751 126857 -401498 -2802 85885 -174227 -319688 -223150 182189
18337 41599 -59223 -25172 -50282 -107081 21040 -271402 155853 -184379 -121289 75835 65215
18326 65215 -55582 60056 38248 61300 136662 -217412 -155093 -484304 59319 -197932 236217
18314 107523 30330 -80223 -21144 130486 67923 -74641 -35415 157672 106178 -222053 149013
18302 -163134 42955 -11364 160810 106261 -223888 -92951 -185991 284501 -133947 -24260 -349158
18291 -349158 -10188 -86385 -438969 -425019 -346326 66625 -113946 -132549 -164187 208788 -190155
$$ packed form
18372c34493a3374l1097A13286b70903q7870G1885a54942I5369b0454j18662K6885
18361a12231A76785b23143O4384I540d26434b13086j3340r768j5758C83304a58192
18349d2175j0033A01651i8751A26857d01498b802H5885a74227j45461R6538A82189
18337D1599e9223b5172k5110n6799B1040b71402A55853a84379O3090G5835j0620
18326F5215e5582F0056k1808K3052P5362b17412O2319l29211E9319a97932B36217
18314A07523C0330h0223b1144A30486o2563g4641c5415A57672n1494b22053A49013
18302a63134D2955a1364A60810n4549b23888i2951r3040B84501a33947b4260l24898
18291c49158a0188p6197l52584J3950P8693F6625a13946j8603l1638B08788a90155
$$ plain form
18279 25785 -49085 -287785 -28761 34091 109969 -144754 -119202 -257518 -247826 -9752 268302
18267 -556084 -62257 18163 -130750 -103897 -52869 167866 20239 148904 -101046 -4199 -43412
18256 -43412 -140408 124106 119888 43189 90549 -30582 11653 -244829 -354445 53442 54728
18245 54728 -69438 36819 57637 -12600 9610 -127956 316178 66857 -79644 -125865 -155322
18234 -155322 -45624 210521 -120787 -63995 -51189 4560 -497035 106382 -121720 133117
18223 260471 28782 -131395 61176 218950 -201023 27068 67470 -100454 -124063 -292612
18213 -292612 -844 -40801 181469 83457 127525 -125952 186091 -21331 -170834 -30143 -246829
18202 -246829 16367 172190 -147455 -304288 65541 -67231 -92028 30888 324702 -94660 198354
$$ packed form
18279B5785d9085k38700b8761C4091P5878a44754K5552j38316R692i752B68302
18267e56084f2257A8163a30750K6853N1028A67866B0239J28665a01046d199l9213
18256d3412r6996A24106m218D3189M7360c0582A1653b44829j09616E3442J286
18245E4728f9438C6819K0818a2600I610a27956C16178F6857g9644m6221k9457
18234a55322d5624B10521a20787N6792J2806D560d97035A06382a21720A33117
18223B60471B8782a31395F1176J57774b01023B7068M0402a00454k3609j68549
18213b92612h44l9957A81469H3457M4068a25952A86091b1331j49503c0143k16686
18202b46829A6367J55823a47455j56833F5541f7231k4797C0888K93814i4660A98354
$$ plain form
18190 123572 30106 77691 -164791 119322 -117222 -122276 -316023 -169465 -346971 -25527
18179 -18411 -200347 -109080 -192812 394667 152011 91054 -320666 5576 32343 -117086 115874
18167 -170260 -133845 43875 -430830 -365 -48684 39922 -76203 58251 53863 -180465 -66584 430003
18154 220051 28845 -142869 -113480 78168 -169416 -210237 -105133 45239 61600 -241516 143279
18142 139034 203371 -241605 122323 -349962 -234751 28949 -115302 -107837 148430 92829
18132 92829 73727 -22320 -399411 2715 -199432 18588 28920 233194 172397 -134142 190390
18120 -190078 -244049 -6502 -122381 219662 -154939 68437 -24548 -121242 119259 142967 -180970
18108 -196711 -81880 -139898 210549 -32137 234562 69328 -163826 235627 -66729 -105421 -49847
$$ packed form
18190A23572C0106M7585a64791A19322a17222n054j93747J46558j77506b5527
18179a8411j81936R1267q3732C94667A52011o0957c20666E576K6767a17086A15874
18167a70260L6415D3875d30830c65m8319C9922g6203E8251m388a80465f6584D30003
18154B20051B8845a42869K9389G8168a69416m0821J05104D5239J6361b41516A43279
18142A39034O4337b41605A22323c49962J15211B8949a15302P465A48430n5601
18132I2829j9102b2320l77091B715a99432A8588J0332K04274o0797a34142A90390
18120a90078n3971f502j15879B19662a54939F8437b4548r6694A19259K3708a80970
18108a96711h1880n8018B10549c2137B34562F9328a63826B35627f6729l8692d9847
$$ plain form
18096 6622 -61780 300104 -188584 75910 -127201 158832 87369 -97562 217470 97845 -4379
18084 19262 -238350 407303 -132007 -292578 -29464 -91377 -248177 94561 -24630 61792 -33428
18072 -83636 -214076 -106897 344641 -220777 198015 -239149 19333 340452 -151331 -207508
18062 -207508 38442 160327 62814 44301 -175519 33033 -204457 -30441 -171753 -136094 -188839
18051 -188839 169991 -94625 -330 -142307 226090 -250833 120520 -150198 23778 2303 45326
18040 45326 -286015 125939 -276847 -39973 218008 -108445 -189921 -61938 196650 101774
18030 101774 -58397 8359 -200610 -323609 96670 -246542 171869 22179 -42812 -148564 -47446
18018 -79554 506393 197702 -38923 13165 -240090 50543 -327977 202801 -154724 -88544
$$ packed form
18096F622f1780C00104a88584G5910a27201A58832p1463i7562B17470I7845d379
18084A9262b38350D07303a32007j60571b9464o1913j56800I4561b4630F1792c3428
18072h3636j30440a06897C44641b20777A98015b39149A9333L21119a51331n6177
18062b07508C8442J21885F2814j8513a75519C3033b04457c0441j41312L5659n2745
18051a88839A69991i4625c30j41977B26090b50833A20520a50198B3778B303M3023
18040D5326b86015A25939b76847c9973B18008a08445q1476f1938A96650r4876
18030A01774e8397H359b00610j22999I6670b46542A71869B2179d2812j05752d7446
18018g9554E06393A97702c8923A3165b40090E0543c27977B02801a54724O6180
$$ plain form
18008 -88544 -138735 138689 56868 10653 -200027 106440 -79966 -36304 325282 -54517 285324
17996 -384197 -317464 -83799 64112 8262 -141549 85678 132007 -135936 -380849 320043 102287
17984 -228594 317267 -79902 -62925 584 -212525 34964 39635 201981 -116658 99082 -39708
17972 -200194 -193338 -217116 -245215 -130589 90982 222958 -90497 27494 234245 -244479 128948
17960 146656 -101144 -189245 -12712 -167172 -295189 248075 -34127 13925 147957 -22846
17949 267046 -86244 -205172 -76731 135788 -119931 -128197 -151031 225210 -93438 -209636 322854
17937 -120764 50717 -247471 -263289 -40364 -111393 -344298 99991 -97639 44750 4106 152095
17926 152095 -37377 -61049 -217203 37522 -73500 -82717 -4768 -200759 7280 211704 90850
$$ packed form
18008h8544n0191A38689E6868A0653b00027A06440g9966c6304C25282e4517B85324
17996c84197O6733h3799F4112H262a41549H5678M6329a35936k44913C20043A02287
17984b28594C17267g9902J6977E84b12525C4964M671J62346a16658I9082c9708
17972b00194O856k3778k8099J14626I0982J31976i0497B7494K06751b44479A28948
17960A46656a01144q8101a2712j54460j28017B48075c4127A3925J34032b2846
17949B67046h6244j18928g6731A35788a19931q266k2834B25210i3438j16198C22854
17937a20764E0717b47471j5818d0364p1029k32905I9991i7639D4750D106J47989
17926A52095c7377k3672j56154C7522g3500r217d768j95991G280K04424I0850
$$ plain form
17914 -197262 48303 140242 44328 210033 -33653 -205896 -73598 44480 31909 380107 -78248
17902 -205089 -324201 29483 -336721 13150 -25100 -95757 131803 -88897 11198 65249 13417
17890 -224648 403428 51173 60459 35855 134975 -95746 205157 -34153 -170572 396727 -153590
17878 -410450 188652 -26614 230868 144476 48414 -72459 29026 6637 -69504 -205788 5093
17866 1601 -343571 -326761 -377970 35041 -66957 11650 53660 -262603 149207 -11973 29100
17854 -12643 155920 -226955 -13644 -156560 165476 56593 31003 232803 -304219 280265
17843 -112806 132289 25043 -58408 239243 125350 188006 192322 148268 -90472 -68497 20722
17831 -183487 66666 -173652 -432445 87005 -228132 -123453 -76827 29111 -314950 -243076
$$ packed form
17914a97262D8303R1939D4328J65705c3653j72243g3598D4480j2571L48198g8248
17902b05089j19112B9483c36721A3150b5100p0657A31803h8897A1198N4051A3417
17890b24648D03428E1173R286k4604R9120i5746B05157c4153j36419C96727a53590
17878d10450A88652b6614B30868q6392D8414g2459B9026F637f9504j36284E093
17866A601c43571J6810n1209C5041f6957A1650M2010b62603A49207a1973B9100
17854a2643A55920b26955a3644j42916A65476E6593k5590K01800c04219B80265
17843a12806A32289B5043e8408B39243j13893O2656M316m4054i0472K1975B0722
17831a83487F6666a73652k58793H7005b28132J04679M6626B9111c14950P1874
$$ plain form
17821 -243076 -7431 -169189 15195 213458 119952 119284 -122063 -17384 -137837 96630 71091
17810 71091 14675 -68954 -18130 -62804 162824 -81082 109755 -297851 207908 -39172 -84201
17799 -84201 48538 106784 50886 268658 -279718 -6954 -141074 -223152 139238 127984 119254
17788 119254 -224963 -87847 -56079 267178 339754 366840 103641 111189 -27423 -251951 336394
17776 -116555 -410701 -31849 114992 -20051 12037 33436 41492 98203 130247 60632 90864
17765 90864 62191 -21424 -135312 208944 87364 -61310 155608 2374 -470965 316971 77115
17753 193043 163541 128492 4154 -9093 -231810 -165835 30209 -53954 75464 81568 47227 -169567
17740 112687 -66595 -35638 -97870 -189423 44810 8358 91102 2515 119491 77346 236398
$$ packed form
17821b43076g431j61758A5195J98263r3506o68a22063a7384j20453I6630k5539
17810G1091A4675f8954a8130m4674A62824h1082A09755b97851B07908c9172m5029
17799h4201D8538N8246E0886K17772b79718f954j34120q2078A39238j1254q730
17788A19254b24963h7847L1768B67178P2576K7086A03641P548b7423k24528C36394
17776a16555k94146c1849A14992b0051A2037K1399Q056N6711L2044F0632L0232
17765I0864k8673b1424j13888B08944H7364f1310A55608B374d70965C16971G7115
17753A93043k9502l5049D154i093k22717O5975C0209e3954G5464O104l4341a69567
17740A12687f6595L0957o2232r1553D4810H358Q2744B515J16976m2145J59052
$$ plain form
17729 236398 -50957 -127401 139630 -126594 360537 -203234 131893 51607 158925 -72335
17718 78897 -208748 -217216 -316213 -38330 325356 -27606 -156590 -12088 -34565 74504 76203
17707 76203 174210 341978 -256509 -76907 128030 -184033 147072 -294062 -67116 -398130
17697 -398130 7809 107716 201238 127857 -37458 280380 -207203 -11240 63844 334677 -30594
17685 -11638 196840 -159956 -95362 130936 142432 -53275 334014 -204352 129341 54958
17674 -65462 -163148 -2384 -144755 -242065 174805 491055 251903 42910 113244 175324 14934
17662 76173 -71559 -33425 -321237 250817 80808 138627 131396 23644 81521 -171349 148651
17650 163604 296687 -160428 -4202 40348 -211809 -75068 265820 -116320 -17774 79337 54298
$$ packed form
17729B36398e0957p6444A39630a26594C60537b03234A31893E1607J07318g2335
17718G8897b08748q468r8997c8330C25356b7606j28984a2088k2477G4504J699
17707G6203R8007J67768b56509g6907A28030a84033A47072b94062f7116l31014
17697c98130G809R9907R3522p3381c7458B80380b07203a1240F3844K70833c0594
17685a1638A96840a59956O4594A30936J1496e3275C34014b04352A29341E4958
17674f5462r7686b384j42371r7310A74805L16250k39152D2910P0334O2080A4934
17662G6173g1559c3425k87812B50817H0808N7819p231B3644N7877a71349A48651
17650A63604J33083a60428d202D0348b11809g5068B65820a16320a7774G9337k5039
$$ plain form
17639 54298 -101292 -183737 -82581 -115188 131857 28565 -90843 102772 -19326 56284 233945
17628 233945 166439 136107 -27496 -88216 49986 28360 76110 -75623 -24002 89568 -112284
17616 113202 125276 209684 47631 -313514 466856 37021 199214 199769 72554 -124579 684
17604 199869 -96549 -74478 -33592 191693 7607 -14382 283867 123033 372304 106796 27926
17592 17330 289709 214537 105481 8455 89287 -141388 281674 137333 192759 83871 11880
17580 -251128 -74196 49274 -128277 411278 -76806 273610 169000 256907 -240191 -232749 152904
17568 62496 49612 68987 -18536 44764 -41524 -144600 -85726 334846 29460 131566 -254406
17556 117760 32893 318783 8831 -235081 -106020 102517 180824 169058 87964 26986 -121199
$$ packed form
17639E4298a01292q2445h2581l2607A31857B8565i0843A02772a9326E6284J77661
17628B33945o7506l0332b7496o0720D9986k1626M7750g5623b4002H9568a12284
17616A13202J2074Q4408D7631c13514D66856C7021J62193N55G2554a24579F84
17604A99869i6549K2071c3592A91693G607a4382B83867A23033K49271A06796B7926
17592A7330K72379p5172A05481H455Q0832a41388B81674A37333N5426H3871A1880
17580b51128g4196D9274a28277D11278g6806B73610j04610Q7907b40191P442A52904
17568F2496j2884J9375a8536D4764d1524j03076N8874C34846B9460J02106b54406
17556A17760C2893K85890H831b35081a06020A02517P8307j1766q1094B6986a21199
$$ plain form
17544 262442 169504 13226 285230 134112 -47141 -77049 504314 -65616 -55865 194143 72856
17532 348335 96902 102571 32988 202459 -18530 -166414 60379 289112 85228 67146 336894
17521 336894 126055 -11102 -36296 -60688 127715 -223310 -101601 -140251 88630 309422
17511 309422 71032 -21985 160684 196367 125429 80361 177521 -21266 -93726 -55190 345505
17499 31192 9085 -124459 188670 -69947 14094 309763 103359 -76891 -221212 30664 173101
17488 173101 -56554 321284 278517 -59496 199186 -77417 223036 -81990 72736 84903 465553
17477 465553 -28563 108482 -174503 83493 -98898 -24139 241302 -9724 152447 136563 167088
17466 167088 234738 -60167 -2381 369269 76515 -48333 536462 155611 33758 258504 170173
$$ packed form
17544B62442r2938A3226K72004A34112d7141k9908E04314f5616R751A94143G2856
17532C48335I6902N669C2988J69471a8530j47884F0379K28733H5228j8082K69748
17521C36894A26055a1102k5194k4392A27715b23310a01601l8650H8630K20792
17511C09422G1032b1985A60684L5683p0938m5068R7160b1266p2460L8536C45505
17499C1192I085a24459A88670f9947A4094K95669A03359g6891j44321C0664J42437
17488A73101e6554C21284m2767e9496A99186g7417B23036h1990G2736J2167L80650
17477D65553b8563A08482a74503H3493i8898b4139B41302i724A52447j5884L0525
17466A67088O7650f0167b381C69269G6515d8333E36462A55611C3758K24746q8331
$$ plain form
17455 170173 29831 -82825 171708 218409 217944 93129 221384 235024 283646 477711 101733
17443 332217 -182341 139640 376075 261135 123188 -71350 323065 188544 -235224 123137
17432 14913 157547 -145126 356101 -9897 92209 330693 -44578 -66842 288404 136400 197867
17421 197867 -166333 21854 -32135 267416 246834 149259 272605 153565 363310 106111
17410 90632 2557 98664 289596 282407 254102 -100872 48010 327199 121267 228423 -9318
17398 121474 98334 330474 31790 75470 -177438 210059 107965 330758 -7142 406782
17387 200687 -3540 53071 -33134 267801 -23674 111480 359756 307609 -23619 200840 -66147
17375 242585 269923 368261 59906 40778 21219 145232 34586 -68277 217943 -179942 298478
$$ packed form
17455A70173B9831h2825A71708M6701m65I3129J28255J3640M8622J94065A01733
17443C32217a82341A39640K36435j14940A23188g1350C23065j34521b35224A23137
17432A4913J42634a45126C56101i897I2209K38484d4578k2264B88404A36400O1467
17421A97867a66333B1854c2135B67416k0582r7575J23346j19040K09745A06111
17410I0632B557R6107J90932p189k8305a00872D8010K79189A21267J07156i318
17398A21474k3140K32140C1790M3680a77438B10059j02094K22793g142D06782
17387B00687c540E3071c3134B67801b3674A11480K48276n2147b3619B00840f6147
17375B42585K7338R8338E9906j9128j9559J24013C4586f8277B17943a79942B98478
$$ plain form
17363 -69449 96332 392320 194232 208440 28553 -46148 -217072 205358 31739 241903 297792
17352 297792 94529 106715 264472 431447 203221 79092 47330 -183847 57973 132502 94155
17341 94155 -12959 2675 207786 275973 244340 152172 36681 210056 234759 225358 248265 178441
17329 178441 -268385 200624 244277 126542 17781 -170534 74238 -10516 129730 87251
17319 87251 200353 330509 -31272 -189492 256987 109711 375267 306958 60465 111108
17309 111108 4460 234446 -20237 420745 -26782 266010 223711 360947 202898 -7592 77586
17297 -16271 79616 265801 167695 255014 393227 213247 204138 31263 71336 370350 266769
17286 266769 250575 -50397 1710 661169 64727 -278696 -79247 63709 12578 255387 160189
$$ packed form
17363f9449I6332K95988A94232J4208B8553d6148j70924B05358C1739K10164N5889
17352B97792I4529J2186J57757J66975B03221G9092l1762a83847E7973P4529l8347
17341I4155a2959B675K05111O8187l1633r2168C6681J73375K4703r401K2907o9824
17329A78441b68385B00624M3653j17735A7781a70534G4238a0516A29730m2479
17319H7251J13102J30156c1272j58220B56987A09711K65556o8309F0465N0643
17309A11108D460K29986b0237D20745b6782B66010m2299J37236j58049g592G7586
17297a6271G9616J86185r8106Q7319J38213j79980r109C1263M0073K99014j03581
17286B66769j6194e0397A710O59459F4727b78696g9247F3709A2578K42809r5198
$$ plain form
17275 160189 374336 385475 300096 300224 540457 265399 281174 -20552 121727 590704 156558
17263 49841 379883 15701 504899 84391 -50923 333720 55004 59864 82965 -171120 193265
17251 36844 33365 364941 337570 189759 470334 4178 105339 52453 343661 205543 404453
17240 404453 229134 197000 66165 22286 579752 42005 248888 21727 472150 204882
17229 116418 401646 275226 365860 290036 108405 24093 184558 378599 80117 358825
17219 358825 45638 259427 -116995 266357 164453 456962 261042 30051 -12441 383606
17208 442490 277482 126319 256229 83828 194167 70938 400616 319510 393175 269099
17198 269099 194124 -29895 494729 345872 426859 348394 437050 -155642 187764 134010 291493
$$ packed form
17275A60189K14147J1139q5379J28K40233B65399J5775b0552A21727M68977A56558
17263D9841L30042A5701M89198H4391e0923C33720E5004M860K3101a71120A93265
17251C6844l479L31576k7371j47811K80575D178J01161E2453K91208j38118J98910
17240D04453j75319l2134F6165B2286N57466D2005K06883B1727M50423B04882
17229A16418K85228j26420R0634p5824A08405B4093J60465J94041H0117K78708
17219C58825D5638K13789a16995B66357j01904K92509j95920C0051a2441C83606
17208D42490j65008A26319J29910H3828J10339G0938L29678q1106P3665j24076
17198B69099p4975b9895D94729j48857Q0987p8465Q8656a55642A87764n3754J57483
$$ plain form
17187 291493 218414 407175 50768 340876 -175499 -109602 385646 141973 311050 338973
17177 338973 422608 529790 -9259 370612 472974 156735 574045 203270 157041 102057
17167 102057 229086 250377 376669 444904 340738 324472 459895 188360 291994 396535
17157 396535 450451 368573 119591 -14212 198646 441349 207134 271635 210426 94678 49648
17146 49648 224397 534375 378873 266359 224501 333341 407000 278047 443880 369330
17136 369330 31191 376025 533814 539712 18680 372445 355742 245187 295962 184657 317231
17125 317231 602869 472745 236235 577612 20644 274900 490287 264549 379949 687065
17115 687065 58266 284574 388335 337093 375386 358551 402856 -4959 467140 435168 523244
$$ packed form
17187B91493p3079J88761E0768K90108a75499O5897C85646A41973J69077K7923
17177C38973Q3635J07182i259C70612J02362A56735M17310B03270m6229n4984
17167A02057J27029K1291J26292O8235j04166j6266J35423A88360J03634J04541
17157C96535N3916q1878A19591a4212A98646K42703B07134O4501o1209I4678m5030
17146D9648J74749L09978j55502j12514m1858J08840P3659j28953J65833p4550
17136C69330C1191L44834J57789N898A8680L53765j6703j10555N0775j11305J32574
17125C17231K85638j30124B36235L41377B0644K54256K15387k25738J15400L07116
17115F87065E8266K26308J03761n1242L8293j6835M4305d959D67140l1972Q8076
$$ plain form
17104 523244 386014 856185 465529 481253 454732 292518 180171 -75406 350222 408380
17094 408380 466089 319118 460943 574277 309197 623619 454314 333256 883902 399550
17083 345029 541362 277886 283809 588160 419181 589006 396720 535281 584379 671119
17073 671119 568923 196466 334140 395766 413266 427184 469269 239802 634055 599432
17063 599432 572199 308010 497582 348345 419771 507336 326224 436199 544500 479376
17053 479376 751366 397415 224117 616141 515231 673501 738724 502489 539099 489102
17043 489102 635389 806175 715860 482774 566239 587174 314585 612233 202810 579525
17033 579525 615154 501086 765791 577510 705159 499557 592682 527897 566005 617070
$$ packed form
17104E23244j37230M70171l90656J5724k6521j62214j12347g5406C50222N8158
17094D08380N7709j46971J41825J13334k65080L14422j69305j21058N50646C99550
17083C45029J96333k63476N923L04351j68979J69825j92286J38561M9098Q6740
17073F71119j02196A96466J37674O1626J7500J3918M2085k29467L94253l4623
17063E99432k7233k64189J89572j49237P1426Q7565j81112J09975J08301o5124
17053D79376K71990l53951j73298L92024j00910J58270O5223k36235L6610m9997
17043D89102J46287J70786r0315k33086Q3465K0935k72589K97648B02810L76715
17033E79525L5629j14068K64705j88281J27649k05602R3125o4785L8108N1065
$$ plain form
17023 617070 744694 874841 599821 648475 510521 648263 892415 582811 742630 586039
17013 586039 674112 745543 670509 822948 1173042 677054 1038093 915792 780863 437267
17003 437267 672567 817892 542092 574150 752040 502517 780225 622908 1028807 837362
16993 837362 698358 872496 645977 1054788 923352 612458 917084 911622 483846 790779
16983 790779 690397 1044794 906614 896840 1119687 653252 981091 757608 847690 750963
16973 750963 987074 512197 752009 760308 746662 1258442 709701 791332 976376 790274
16963 790274 853577 778704 1047500 1038447 1006085 1012128 907196 1252595 1129408 1200416 991349
16952 991349 1196086 1203454 915914 1088340 864441 1298590 1232780 1518401 1031419 1143378
$$ packed form
17023F17070J27624J30147k75020M8654j37954J37742K44152l09604J59819j56591
17013E86039Q8073P1431p5034J52439L50094m95988L61039j22301j34929l43596
17003D37267K35300J45325k75800L2058J77890k49523K77708j57317M05899j91445
16993H37362j39004J74138k26519M08811j31436l10894L04626n462m27776L06933
16983G90779j00382L54397j38180r774K22847m66435L27839k23483R0082r6727
16973G50963K36111m74877K39812Q299j3646N11780n48741Q1631J85044j86102
16963G90274O3303p4873K68796r053l2362O043j04932L45399j23187P1008k09067
16952I91349K04737P368k87540J72426k23899M34149o5810K85621m86982J11959
$$ plain form
16942 1143378 1281741 1103185 1402513 1289776 1146985 1151320 1017403 1239239 1118352 1179246
16932 1179246 1339909 1133542 1354095 1261958 1202158 1271070 1580648 1708819 1420683 1195355
16922 1195355 1459257 1414465 1578613 1463692 1451422 1375940 1722160 1678795 1515398 1247151
16912 1247151 1149921 1434933 1688388 1614312 1533771 1517086 1612088 1804973 1508376 1784923
16902 1784923 1566516 1624603 1570053 1599460 2051183 1853092 2031693 2094454 2107435 1798338
16892 1798338 2108081 1944073 2149106 1754068 1673905 1738977 1778371 2192510 2189398 2164298
16882 2164298 1904094 2140403 2092896 2002663 2318928 2294836 2283412 2535200 2365022 2364413 2509468
16871 2509468 2303403 2148330 2445590 2663081 2828433 2494021 2425477 2667493 2595273 2440490
$$ packed form
16942A143378J38363j78556K99328j12737j42791M335j33917K21836j20887O0894
16932A179246J60663k06367K20553r2137n9800O8912L09578J28171k88136k25328
16922A195355K63902m4792J64148j14921j2270p5482L46220m3365j63397k68247
16912A247151r7230K85012K53455p4076q0541j6685R5002J92885k96597K76547
16902A784923k18407N8087n4550K9407M51723j98091J78601O2761J2981l09097
16892A798338L09743j64008K05033l95038q0163O5072L9394M14139l112k5100
16882B164298k60204K36309m7507r0233L16265k4092j1424K51788j70178o09J45055
16871B509468k06065j55073K97260K17491J65352l34412o8544K42016p2220j54783
$$ plain form
16861 2440490 2772380 2987247 3060677 3210766 2553546 3091613 2810139 3033513 3138308 2997915
16851 2997915 3469571 3296437 3278923 3202828 3309738 3765667 3083083 3676263 3353670 3491525
16841 3491525 3778695 3638385 3815260 4151099 4144070 3817060 3986396 4141095 4129630 4441040
16831 4441040 4516595 4527950 4404075 4549167 4699162 4754527 4869631 4565830 5147375 5330015
16821 5330015 5099686 5061498 5197839 5452774 5631624 5453329 5708946 6053458 6035854 6340679
16811 6340679 6194198 6283442 6206126 6854242 6650757 6839659 6757380 6924758 7186900 7709329
16801 7709329 7643342 7976869 7720883 7913002 8285803 8677139 8701486 8886595 9227887 9406870
16791 9406870 9510296 10172012 10056025 10590528 10367609 11265919 11531253 11466968 11998761 12431954
$$ packed form
16861B440490L31890K14867P3430J50089o57220N38067k81474K23374J04795j40393
16851B997915M71656j73134j7514p6095J06910M55929o82584N93180l22593J37855
16841C491525K87170j40310J76875L35839p029l27010J69336J54699j1465L11410
16831D441040P5555J1355j23875J45092J49995N5365J15104l03801N81545J82640
16821E330015k30329l8188J36341K54935J78850j78295K55617L44512j7604L04825
16811F340679j46481Q9244p7316O48116k03485J88902q2279J67378K62142N22429
16801G709329o5987L33527k55986J92119L72801L91336K4347J85109L41292J78983
16791I406870J03426O61716j15987N34503k22919Q98310K65334o4285N31793M33193
$$ plain form
16781 12431954 12476558 12893230 13121190 13647727 14122612 14357332 14945992 15412306 15628207
16772 15628207 16123736 16448935 17325842 18203004 18699054 18934601 19999657 20658931 21310935
16763 21310935 21905524 22887379 23322117 24383908 25494788 26574783 27634318 28611052 30051580
16754 30051580 31263995 32297495 33707145 35274246 36827975 38428467 40280614 42083547
16746 42083547 44015634 45982485 48704034 51049793 53401371 56096703 59239380 62166615
16738 62166615 65759404 69360433 73221644 77114232 81245331 85523970 90383967 95534360
16730 95534360 100885055 106457862 112006802 117628566 123449734 129578621 135322784 141267813
16722 141267813 146796968 152144479 156950388 161117656 164887650 167379099 169426048 170120112
$$ packed form
16781A2431954M4604M16672K27960N26537M74885K34720N88660M66314K15901
16772A5628207M95529L25199Q76907Q77162M96050K35547J065056O59274O52004
16763B1310935N94589R81855M34738J061791J110880J079995J059535R76734J440528
16754C0051580J212415J033500J409650J567101J553729J600492J852147J802933
16746D2083547J932087J966851K721549K345759K351578K695332L142677K927235
16738F2166615L592789L601029L861211L892588M131099M278639M859997N150393
16730I5534360N350695N572807N548940N621764N821168O128887N744163N945029
16722A41267813N529155N347511M805909M167268L769994K491449K046949O94064
$$ plain form
16714 170120112 169902686 169187056 167128363 164331530 160309728 155726455 150890175 145863543
16706 145863543 139711611 133769013 127646400 121651544 115755715 109837113 104121066 98425981
16698 98425981 93405417 88434969 83583595 78869529 74462112 70558749 67097882 63413407
16690 63413407 59921428 56687757 54087658 51342919 48815354 46092094 44080633 41769606
16682 41769606 40286508 38300604 36697760 34906527 33093709 32050158 30625796 29242157
16674 29242157 28372111 26884101 25952205 24661533 23845668 22962307 22305002 20942774 20331480
16665 20331480 19846993 19125453 18296238 17533805 17137740 16359799 15849533 15459644 15081576
16656 15081576 14607281 13955432 13604649 13159164 12957616 12305187 11866057 11486646 11313696
$$ packed form
16714A70120112k17426p15630k058693k796833m021802m583273m836280n026632
16706A45863543o151932n942598o122613n994856n895829n918602n716047n695085
16698I8425981n020564m970448m851374m714066m407417l903363l460867l684475
16690F3413407l491979l233671k600099k744739k527565k723260k011461k311027
16682D1769606j483098j985904j602844j791233j812818j043551j424362j383639
16674B9242157q70046j488010r31896j290672q15865q83361o57305j362228o11294
16665B0331480m84487p21540q29215p62433l96065p77941n10266l89889l78068
16656A5081576m74295o51849l50783m45485k01548o52429m39130l79411j72950
$$ plain form
16647 11313696 11196381 11045034 10417983 10289177 9892278 9604306 9077083 8953706 8783919
16638 8783919 8395066 8317158 8440901 7880612 7836755 7720985 7605183 7071354 7223666 6839456
16628 6839456 6709395 6497831 6364790 6365565 6109261 6184892 5839001 5488298 5638250 5346128
16618 5346128 5411497 5476750 5286180 5070983 4991625 4548160 4874333 4630274 4409615 4305657
16608 4305657 4298160 4390129 4258806 4357734 4126112 3704179 3772280 4078172 3543469 3835941
16598 3835941 3749050 3382533 3315898 3657042 3248317 3429605 3457287 3157055 3294931 3157048
16588 3157048 3050052 2972667 2816287 3015747 3162322 2958940 2864009 2766991 2802727 2580957
16578 2580957 2327215 2278776 2712183 2361663 2302260 2552068 2564733 2439168 2060114 2392253
$$ packed form
16647A1313696j17315j51347o27051j28806l96899k87972n27223j23377j69787
16638H783919l88853p7908J23743n60289m3857j15770j15802n33829J52312l84210
16628F839456j30061k11564j33041P75k56304P5631l45891l50703J49952k92122
16618E346128O5369O5253j90570k15197p9358m43465L26173k44059k20659j03958
16608D305657p497R1969j31323R8928k31622m21933O8101L05892n34703K92472
16598C835941q6891l66517o6635L41144m08725J81288K7682l00232J37876j37883
16588C157048j06996p7385j56380J99460J46575k03382r4931r7018L5736k21770
16578B580957k53742m8439M33407l50520n9403K49808J2665j25565l79054L32139
$$ plain form
16568 2392253 2265239 2313355 2285966 2183576 2022294 2148965 1933132 1927777 2048309 2031467
16558 2031467 2205051 1998077 1880401 2064606 2037263 1687016 2098787 1636959 1336608 1990619
16548 1990619 1570742 1466665 1677144 1367038 1480264 1950939 1685989 1290093 1607690
16539 1607690 1862496 1796655 1679688 1524670 1424822 1613437 1594226 1703559 1420895 1430274
16529 1430274 1578927 1479020 1395088 1273279 1231599 1239498 1231860 1268476 1202608 995795 1200694
16518 1200694 1443576 1453006 1067435 1054763 1056895 1364810 1259945 1172483 1027515 909727
16508 909727 1193504 1086843 1110708 1052393 1063710 979951 835907 768890 926006 1075925
16498 1075925 868369 772233 838913 981473 813725 881645 812275 960325 783399 1079618
$$ packed form
16568B392253j27014M8116k7389j02390j61282J26671k15833n355J20532j6842
16558B031467J73584k06974j17676J84205k7343l50247M11771m61828l00351O54011
16548A990619m19877j04077K10479l10106J13226M70675k64950l95896L17597
16539A607690K54806o5841j16967j55018r9848J88615j9211J09333k82664R379
16529A430274J48653r9907q3932j21809m1680P899p638L6616o5868k06813K04899
16518A200694K42882R430l85571j2672K132L07915j04865q7462j44968j17788
16508I09727K83777j06661K3865n8315J1317q3759j44044o7017J57116J49919
16498A075925k07556r6136O6680J42560j67748O7920o9370J48050j76926K96219
$$ plain form
16488 1079618 1160002 719854 662502 626517 754262 819503 881300 576086 917656 991162
16478 991162 828003 809574 845936 673339 769007 909482 816191 625177 781801 948412
16468 948412 720710 669814 576541 477027 550342 633761 780708 543652 412357 664415
16458 664415 568663 671613 799887 613796 571236 740490 516199 374689 624960 428670
16448 428670 382084 501729 449098 438310 556157 661728 240770 573326 318483 557065
16438 557065 751719 533734 265275 790201 640450 246348 365221 590342 352254 419744
16428 419744 501742 402604 565093 673256 377703 520349 583185 363455 476119 564357
16418 564357 549170 378608 226626 399086 392044 666283 456258 431183 485302 475522 638058
$$ packed form
16488A079618Q0384m40148n7352l5985J27745O5241O1797l05214L41570P3506
16478I91162j63159j8429L6362j72597R5668J40475r3291j91014J56624J66611
16468I48412k27702n0896r3273r9514P3315Q3419J46947k37056j31295K52058
16458F64415r5752J02950J28274j86091m2560J69254k24291j41510K50271j96290
16448D28670m6586J19645n2631j0788J17847J05571B40770L32556k54843K38582
16438E57065J94654k17985B65275N24926j49751B46348J18873K25121k38088O7490
16428D19744Q1998r9138J62489J08163k95553J42646O2836k19730J12664Q8238
16418E64357j5187j70562j51982J72460p042K74239k10025k5075N4119r780J62536
$$ plain form
16407 638058 349956 512367 269584 504969 388150 309810 331638 469413 410710 510642
16397 510642 414290 229796 275843 674936 210472 319034 281002 188201 456266 528850
16387 528850 357066 103097 575670 179631 282595 318642 160331 213849 329265 246604
16377 246604 385443 335957 249458 353646 625355 63485 395399 492472 437908 376235 294502
16366 294502 267129 328721 533457 405558 266089 219187 232676 162543 520370 -20904 507440
16354 231591 332042 320440 415034 502602 257574 441038 129931 271935 599911 347488
16344 347488 201556 319631 345626 188794 298032 148909 295224 98025 148013 309363
16334 309363 155012 222008 405594 550837 234588 109441 -91303 363362 -35557 402918
$$ packed form
16407F38058k88102J62411k42783K35385j16819p8340K1828J37775n8703R9932
16397E10642r6352j84494M6047L99093B10472J08562l8032r2801K68065P2584
16387E28850j71784A03097M72573A79631J02964L6047j58311N3518J15416q2661
16377B46604J38839m9486q6499J04188K71709F3485L31914R7073n4564o1673q1733
16366B94502k7373O1592K04736j27899j39469m6902J3489p0133L57827b0904E07440
16354B31591J00451j1602R4594Q7568k45028J83464A29931J42004L27976k52423
16344C47488j45932J18075K5995j56832J09238A48909J46315I8025M9988J61350
16334C09363j54351O6996J83586J45243B34588A09441i1303C63362c5557D02918
$$ plain form
16323 334074 48106 206910 257457 658419 239549 203902 391937 -63413 186058 167378
16313 167378 129911 68627 316619 216868 269782 249858 40099 -14634 263795 204734 69234
16301 332260 183765 -71002 161421 105171 171666 -80953 190413 473561 66974 227920
16291 227920 -220138 133637 197733 125788 377470 125379 297778 146865 541447 139667
16280 101732 507537 249999 465177 281851 -168670 532888 400195 275449 223766 210393
16270 210393 460937 308430 253987 222273 208218 198024 84764 47397 -130554 205060 -34176
16258 -109179 17537 328106 157248 234204 164229 -222795 144195 43627 -217833 262755
16247 211026 -249776 343521 186172 365161 47930 -208878 64142 89969 -98442 -162074
$$ packed form
16323C34074D8106J58804N0547M00962B39549l5647J88035f3413A86058j8680
16313A67378l7467o1284K47992r9751N2914j9924D0099a4634B63795n9061F9234
16301C32260j48495g1002A61421n6250O6495h0953A90413K83148F6974J60946
16291B27920b20138A33637O4096p1945K51682A25379J72399A46865L94582A39667
16280A01732M05805B49999K15178j83326a68670E32888j32693j24746n1683j3373
16270B10393K50544j52507n4443l1714j4055j0194H4764l7367a30554B05060c4176
16258a09179A7537L10569A57248P6956o9975b22795A44195D3627b17833B62755
16247B11026b49776C43521j57349J78989D7930b08878F4142K5827i8442o3632
$$ plain form
16237 -162074 350517 146257 86777 88732 46112 362938 184050 287580 135486 224290
16227 224290 -153373 -74835 -85075 -243080 111953 -166710 293045 -15511 190322 233208
16217 233208 -9194 123227 342755 448956 -139565 241413 -251754 -124447 -164039 171932
16206 68261 117335 359594 202711 60872 206781 160460 145088 149926 216964 123675 36422
16194 -151690 182654 169618 -10163 109931 264153 194052 19051 -180577 110010 -77790
16183 -20228 -36235 -303772 24702 -58122 165410 -98644 249902 -116230 16798 22286 95625
16172 95625 214992 -168506 -60020 223624 -210184 178612 111904 -273209 162605 61830
16161 77067 246372 286273 -158362 -98734 40634 218748 440162 94102 28595 187970 203632
$$ packed form
16237a62074C50517A46257n9480J955m2620L16826j78888J03530A35486Q8804
16227B24290a53373g4835j0240j58005A11953a66710B93045a5511A90322M2886
16217B33208i194A23227K19528J06201a39565B41413b51754a24447l9592A71932
16206F8261M9074K42259j56883F0872J45909m6321j5372M838O7038r3289C6422
16194a51690A82654j3036a0163A09931J54222p0101A9051a80577A10010g7790
16183b0228j6007k67537B4702e8122A65410i8644B49902a16230A6798N488P3339
16172I5625J19367a68506f0020B23624b10184A78612o6708b73209A62605F1830
16161G7067J69305L9901a58362N9628D0634J78114K21414I4102B8595J59375J5662
$$ plain form
16150 203632 162536 37409 104977 130955 252363 255621 -170005 -48393 195390 -32798 139796
16138 -20791 266454 -145925 54461 185923 70420 -9552 -32065 -83066 249979 82677 -47968
16126 -74732 17751 52992 166186 -141990 225789 -118952 11384 216990 -39796 139937
16115 -136231 303527 -167568 105946 -27652 -109092 -44487 41113 -42798 111560 -63049 383227
16103 197455 -193595 77051 89267 21619 153494 15026 242434 78934 -159132 95949 -7044
16091 41657 -374614 -149586 -147279 -75031 53885 226004 301107 184110 120864 -218157 -88743
16079 -69261 195846 -124139 22106 28033 28695 96504 6798 14429 184412 47137 93686 261282
16067 261282 -35764 -23308 207463 -168080 -194716 111750 191569 41301 -59094 77180 -252833
$$ packed form
16150B03632m1096C7409O7568K5978J21408L258a70005d8393A95390c2798A39796
16138b0791B66454a45925E4461J31462G0420i552k2513n1001B49979H2677d7968
16126g4732A7751L5241J13194a41990B25789a18952A1384K05606c9796A39937
16115a36231C03527a67568A05946b7652q1440d4487D1113d2798A11560f3049C83227
16103A97455a93595G7051J2216B1619J31875A5026K27408G8934a59132I5949g044
16091D1657c74614a49586K307P2248E3885J72119P5103j16997o3246b18157h8743
16079f9261A95846a24139B2106N927O62O7809F798P631J69983D7137M6549J67596
16067B61282c5764J2456B07463a68080k6636A11750P9819D1301e9094G7180b52833
$$ plain form
16055 -116167 333500 95899 -189799 -358334 363518 -154467 -41968 -266604 105492 -94512
16044 -42852 -134181 -61069 -26964 7295 -12874 130205 290738 -48639 -23584 7172 -122491
16032 69086 71383 -109283 -42729 188253 101129 392550 -341456 143628 -109716 -64952 -73230
16021 -73230 -257795 -79087 -66365 90544 -374276 173139 -27500 -242003 223861 152819 353969
16010 353969 241221 -283566 -166263 -16496 -292763 84392 -52461 9763 -72105 54922 112305
15999 112305 140450 213327 131485 -152766 212325 7721 138025 36563 273425 174289 34240
15987 172562 7475 -120660 -14258 -90185 229319 376583 153227 213273 358885 406917 39466
15975 450043 384098 -186958 176170 -79561 321804 -68548 21282 -26631 294250 -19902 -108363
$$ packed form
16055a16167C33500I5899a89799j68535C63518a54467d1968k24636A05492i4512
16044d2852r1329f1069b6964G295a2874A30205J60533d8639b3584G172a22491
16032F9086K297a09283d2729A88253q7124K91421c41456A43628a09716M4764q278
16021g3230j84565g9087J2722I0544c74276A73139b7500k14503B23861p1042K01150
16010C53969j12748b83566J17303a6496k76267H4392e2461I763g2105E4922N7383
15999A12305K8145P2877q1842a52766B12325G721J30304C6563K36862r9136C4240
15987A72562G475a20660a4258p5927B29319J47264A53227O0046J45612M8032C9466
15975D50043o5945a86958A76170g9561C21804f8548B1282b6631B94250a9902q8461
$$ plain form
15964 -108363 21377 -50853 177975 210026 297524 -208826 -195366 -92518 7 -180740 1321 -111088
15951 -109769 -83479 183152 5274 -132704 156602 136442 -3983 -747 -139213 -231713 -223757 -48524
15938 58194 185190 -20409 -13873 216185 -189487 -133431 222071 -28696 78457 -264635 298742
15926 28829 245513 -7513 181761 -134089 -57729 98305 20410 -182832 -112829 -117693 -50863
15914 -116104 -223538 -74592 193086 121259 120916 100052 215447 -88563 -130687 -117737 -169885
15903 -169885 -217617 -79275 -54149 64952 -141946 -11661 42775 -245972 -117273 -118066 145356
15891 -277667 156818 -260523 -201833 6519 -113706 283792 -54330 51717 183651 -73499 -82724
15880 -82724 169534 -131323 -201184 -53039 102999 2495 -215239 -863 -76472 -117959 -164737
$$ packed form
15964a08363B1377e0853A77975L2051Q7498b08826J3460i2518Ga80740A321a11088
15951a09769K6290A83152E274a32704A56602k0160c983g47j38466r2500P956d8524
15938E8194J26996b0409O536B16185a89487N6056B22071b8696G8457b64635B98742
15926B8829K16684g513A81761a34089e7729I8305B0410a82832P0003m864e0863
15914a16104j07434g4592A93086p1827l43k0864J15395h8563m2124J2950n2148
15903a69885m7732g9275K5126F4952a41946a1661D2775b45972a17273p93A45356
15891b77667A56818b60523N8690F519a13706B83792e4330E1717J31934g3499r225
15880h2724A69534a31323o9861e3039A02999B495b15239h63p5609m1487m6778
$$ plain form
15869 -164737 -61476 45179 -336695 -14595 -142919 -168503 153611 195792 112939 -251239 -182904
15858 -182904 80782 -75699 -204119 -198869 156153 31187 68218 -288046 -143444 16611 -207559
15846 -28082 -183592 106661 -21998 119365 59666 -30460 -28602 223692 -362873 207780 -73303
15834 -1175 245184 -48062 265761 -314109 -228858 -12262 343797 75205 10132 -163569 -137762
15823 -137762 67973 -199309 59912 199526 -147358 -292681 -116446 -130782 66894 -156092
15812 41456 246050 21975 -8146 -51530 -320658 72121 -325401 63985 164549 362989 127765
15800 148711 8331 152770 -29473 160853 64236 111237 95977 67553 188056 84121 -382895
15788 25031 -7828 -23691 -137407 -226129 -8041 210957 1871 316212 244173 263224 -390984
$$ packed form
15869a64737f1476D5179c36695a4595j28324k5584A53611M2181q2853b51239O8335
15858a82904H0782g5699j28420N250A56153C1187L7031b88046a43444A6611b07559
15846b8082j55510A06661b1998A19365E9666c0460J858B23692c62873B07780g3303
15834a175B45184d8062B65761c14109Q5251a2262C43797G5205A0132a63569K5807
15823a37762F7973a99309E9912J39614a47358j45323a16446j4336F6894a56092
15812D1456K04594B1975h146m3384k69128G2121c25401F3985J00564J98440A27765
15800A48711H331J44439b9473A60853F4236M7001j5260k8424J20503H4121c82895
15788B5031g828j5863j13716q8722h041B10957A871L14341p2039J9051c90984
$$ plain form
15776 -98476 -13588 -296342 -211480 -418707 -413334 -2868 -183161 -217692 -344990 -147890 -71060
15764 -112228 224513 31356 -106752 241422 136939 496049 24835 28696 122506 -176084
15753 226865 105108 -224493 322622 -204613 -52208 -156251 -449601 -45305 -108914 161857
15742 161522 -4604 -288947 -45528 187267 199878 -20986 159251 68071 -45145 -124868 -23508
15730 141239 -164764 -205754 -178076 -178261 -80329 85944 61067 17756 -345181 -59378 76162
15718 51519 -347152 -168247 44705 -183962 -287194 -113902 -141413 27915 -384957 -73888
15707 -193982 -41979 44227 -66324 133048 89448 124942 188127 96524 52488 -47577 267614
15695 -110943 -36557 -18666 123523 305981 -210530 -105113 16926 -386445 397050 -88309
$$ packed form
15776i8476a3588k82754Q4862k07227N373b868j80293l4531j27298a47890g1060
15764a12228B24513C1356a06752B41422j04483L59110B4835L861R3810a76084
15753B26865A05108b24493C22622b04613e2208j04043k93350d5305o3609A61857
15742A61522d604k84343d5528A87267J2611b0986A59251F8071d5145p9723b3508
15730A41239a64764m0990K7678j85h0329H5944k4877A7756c45181e9378G6162
15718E1519c47152a68247D4705a83962j03232a13902k7511B7915c84957g3888
15707a93982d1979D4227f6324A33048m3600L5494O3185r1603m4036d7577B67614
15695a10943c6557J7891A23523J82458b10530a05113A6926c86445C97050h8309
$$ plain form
15684 -200636 8544 211200 -79004 -313564 -116205 -185063 -150416 -113005 -253476 -49059 -62367
15673 -62367 183733 351524 -133679 10604 321871 178547 -5854 63662 115350 -115489 6777
15661 200869 -44558 59436 -108186 -10396 -149987 23969 -133890 -187087 -325201 -37153 -154428
15650 -154428 102251 110777 -24420 36510 137455 -85623 -151435 223071 -507063 -40850 -12561
15638 -141161 124346 -92257 114910 193158 -78973 -272826 3548 -143939 84186 -302131 -299689
15627 -299689 -58710 97809 -85229 186463 -17027 -69365 123455 18415 -32957 177405 188165
15616 188165 -25183 -210639 212154 49325 330940 206351 84453 175251 -3009 146762 307511
15605 307511 -16243 153222 202277 -18982 51028 62395 39909 172503 186112 -48749 161479
$$ packed form
15684b00636H544K02656g9004k34560a16205o8858L4647L7411j40471d9059j3308
15673f2367A83733J67791a33679A0604L11267j43324e854F3662N1688a15489F777
15661B00869d4558E9436a08186a0396j39591B3969a33890n3197j38114c7153j17275
15650a54428A02251Q526b4420C6510J00945h5623o5812B23071e07063d0850a2561
15638a41161A24346i2257A14910P8248g8973j93853C548a43939H4186c02131K442
15627b99689e8710I7809h5229A86463a7027n2338A23455A8415c2957A77405J0760
15616A88165b5183j85456B12154D9325K81615j24589H4453R0798c009A46762J60749
15605C07511a6243A53222M9055a8982E1028J1367k2486J32594J3609d8749A61479
$$ plain form
15593 158666 -23639 189788 143174 101403 133011 318703 -17646 41833 1133 66918 -219716
15581 266649 -16313 175576 -140148 -207087 -347931 174201 140252 -76768 102378 -54101
15570 -150513 285756 185286 -62279 -39287 97496 100893 124041 -136493 80357 -115388 -92337
15559 -92337 48967 -117584 -163225 143578 53868 178063 -107318 155131 -19253 40191 31062
15548 31062 30454 -180336 109842 -15647 -41725 166310 -164499 14210 282620 54302 -167306
15536 151608 325748 -15310 195483 137161 105169 -211968 -2266 -171976 -130139 84294 -291389
15524 -16270 -464398 268630 -250810 123730 136753 17677 -434260 13517 -33530 -43103 -207508
15513 -207508 -134203 71256 346484 -287636 286808 -199812 -159105 30186 -104759 68064
$$ packed form
15593A58666b3639A89788m6614m1771L1608J85692a7646D1833A133O5785b19716
15581B66649a6313A75576a40148o6939j40844A74201l3949g6768A02378e4101
15570a50513B85756j00470f2279K2992I7496L397K3148a36493H0357a15388K3051
15559i2337D8967a17584m5641A43578E3868J24195a07318A55131a9253D0191r129
15548C1062o08a80336A09842a5647k6078A66310a64499A4210K68410E4302a67306
15536A51608J74140a5310A95483n8322l1992b11968b266j69710M1837H4294b91389
15524a6270m48128B68630b50810A23730J3023A7677d34260A3517c3530r573j64405
15513b07508P3305G1256K75228b87636B86808a99812M0707C0186a04759F8064
$$ plain form
15502 31750 -195707 19159 120731 224671 -24722 150270 -167444 146015 -79936 1198 -178496
15490 231002 177463 139005 -67201 -127058 -51445 366831 -29317 -191355 115322 127240 -85839
15478 105896 1329 -18597 171602 270451 255817 -38653 -111775 -148000 349398 -78695 -137643
15467 -137643 -122626 -288982 -75823 -90020 23557 320989 51368 238254 31398 -40248 117950
15455 125342 22824 68676 410719 300531 18748 -180173 52852 -114695 -12158 301742
15444 -87051 105150 -30618 -321945 -297156 -328263 -164279 -267369 190381 -42649 15477 258880
15433 258880 -68191 -161136 151767 405612 217297 18789 -103494 -212128 139068 45268
15422 -22219 -204301 76427 92867 5045 -146686 -302658 276468 72387 -11935 -17151 78533
$$ packed form
15502C1750a95707A9159J01572J03940b4722A50270a67444A46015g9936A198a78496
15490B31002n3539l8458f7201n9857e1445C66831b9317j62038A15322J1918h5839
15478A05896A329a8597A71602R8849j4634c8653p3122l6225C49398g8695n8948
15467a37643J5017j66356g5823j4197B3557K97432E1368J86886C1398d0248A17950
15455A25342B2824M5852L42043j10188A8748a80173E2852a14695a2158C01742
15444h7051A05150c0618k91327K4789l1107J63984j03090A90381d2649A5477K43403
15433B58880f8191r2945A51767K53845j88315A8789a03494j08634A39068D5268
15422b2219j82082G6427J6440E045a46686j55972B76468G2387a1935n216G8533
$$ plain form
15410 -57464 -13742 96176 -36459 -60170 61771 26099 -155527 84892 -85828 142002 41899
15398 296638 28275 -258544 143023 -38922 -53889 -18453 40844 6038 139505 135472 -52808
15386 169130 47553 -179884 -50573 -53815 -220202 -273931 63529 -5718 -163822 -89789 161218
15374 144011 108999 -131440 112515 217969 54207 134732 11302 -288263 -357717 268447
15363 -64840 129173 -8379 102453 -141712 -12472 -90105 -9746 -132045 -78668 301725 -177281
15351 104927 -80747 -184497 83458 -269429 131255 -36927 -92347 -4560 144755 332288 -174778
15339 9126 108501 -48830 132136 126295 75320 -325697 335043 -79226 110152 156222 -111131
15327 -117124 253099 -35982 -106886 -277659 -91605 68814 125056 -205543 157984 19656 -190413
$$ packed form
15410e7464a3742I6176c6459k3711F1771B6099a55527H4892h5828A42002D1899
15398B96638B8275b58544A43023c8922j4967a8453D0844F038J33467m033e2808
15386A69130D7553a79884e0573l242j66387n3729F3529e718j58104P4033A61218
15374A44011l5012a31440A12515J05454E4207Q0525A1302b88263o9454B68447
15363f4840A29173h379A02453a41712a2472p7633i746j22299N3377C01725a77281
15351A04927h0747j03750H3458b69429A31255c6927n5420d560A44755J87533a74778
15339I126R9375d8830A32136n841n0975c25697C35043g9226A10152M6070a11131
15327a17124B53099c5982p0904j70773i1605F8814N6242b05543A57984A9656a90413
$$ plain form
15315 358709 70158 -41430 -231619 62453 15432 344211 -256422 -24045 222125 -165497
15304 95028 -123840 -18016 376687 18433 -45651 80549 221813 372272 47024 -508809 252793
15292 286019 138388 226790 312963 83058 -214116 -177573 272397 259197 -45269 -51756 121069
15280 -155677 -89554 296557 117224 -43854 -97942 -130833 -206274 311296 164878 176993 345385
15269 345385 188270 96291 178592 47285 134239 252418 -241104 43003 236145 211719 153661
15258 153661 452127 182241 -119580 -197088 -32305 -108607 -187160 331165 556916 591929
15248 591929 792001 1471461 1470959 1517444 1527332 568089 107918 338174 -33611 146400 190555
15237 190555 -219608 282768 -71962 -7514 152402 269135 -194863 205043 195946 128795 135170
$$ packed form
15315C58709G0158d1430j90189F2453A5432L28779b56422b4045B22125a65497
15304I5028a23840a8016C76687A8433d5651H0549J41264J50459D7024e08809B52793
15292B86019A38388Q8402Q6173H3058b14116L6543B72397j3200d5269o487A21069
15280a55677O6123B96557A17224d3854n4088l2891p5441C11296j46418J2115J68392
15269C45385j57115r1979Q2301D7285Q6954J18179b41104D3003J93142k4426n8058
15258A53661K98466A82241a19580p7508c2305p6302p8553C31165K25751L5013
15248E91929K00072O79460n02M6485R888E68089A07918K30256c3611A46400M4155
15237A90555b19608B82768g1962g514A52402J16733a94863B05043r097o7151O375
$$ plain form
15226 135170 121505 257009 41700 323693 217010 -38180 -64605 95855 45460 109269 57368
15215 57368 280350 131381 297435 126085 -131447 125540 -256198 -151018 -33399 -142161
15205 -142161 34977 73752 300649 -43193 207184 55127 85330 115018 -88352 -314657 230281
15193 352940 90057 125310 111985 -155434 127023 324355 128923 -107210 189084 12678
15182 35068 117547 135865 62422 104646 228304 219537 230505 455231 124463 -158275 1718
15170 -377470 174778 -18282 -3684 47965 -312870 95109 30165 316802 124096 -71046 110801
15158 23378 386916 257969 41325 7554 -89 92606 36795 174973 237725 236064 17728 140282
15146 140282 29518 85977 77939 206984 -55498 337719 67012 185940 279188 -133255 206909
$$ packed form
15226A35170j3665J35504D1700K81993j06683c8180k6425I5855D5460O3809n1901
15215E7368K22982A31381J66054A26085a31447A25540b56198J05180c3399j08762
15205a42161C4977L8775K26897d3193B07184E5127L0203K9688h8352k26305B30281
15193C52940I0057L5253j3325a55434A27023J97332A28923a07210A89084A2678
15182C5068Q2479J8318F2422M2224J23658q767J0968K24726A24463a58275A718
15170c77470A74778a8282c684D7965c12870I5109C0165K86637A24096g1046A10801
15158B3378L63538j28947D1325G554h9I2606C6795J38178O2752j661A7728J22554
15146A40282B9518N6459q038J29045e5498C37719F7012J18928R3248a33255B06909
$$ plain form
15134 -159251 68781 -131292 382174 -1767 77093 147178 60720 90484 364202 86144 197487
15123 197487 -61688 256781 507893 293687 -93096 387421 -128056 203565 -83209 21335
15112 -188823 218272 238068 277332 -152520 465596 242449 80032 -103985 236005 19818
15101 115196 482796 391307 187081 89170 147598 452487 18559 -21741 220266 169182 -231184
15089 178851 187484 103774 240779 492696 278215 63396 400168 243918 118731 99403
15079 99403 5056 -71664 197130 113399 111694 90916 472427 230423 -110828 -20891 17584
15067 345598 160504 282026 31812 -66588 84301 314291 76182 145571 159094 220403 128166
15056 128166 227750 14415 101182 55639 515725 83580 58739 207132 33109 36451 249900
$$ packed form
15134a59251F8781a31292C82174a767G7093P0085F0720K9764K73718H6144J11343
15123A97487f1688B56781K51112k14206i3096C87421a28056B03565h3209B1335
15112a88823B18272J9796L9264a52520D65596k23147H0032a03985B36005A9818
15101A15196L67600r1489A87081H9170N8428L04889A8559b1741B20266n1084b31184
15089A78851Q633q3710J37005K51917k14481F3396L36772j56250A18731j9328
15079I9403E056g1664A97130q3731j705k0778L81511B30423a10828b0891A7584
15067C45598A60504J21522C1812f6588H4301K29990G6182O9389J3523O1309r2237
15056A28166R9584A4415Q6767m5543M60086H3580k4841J48393C3109L342K13449
$$ plain form
15045 249900 172276 267230 -207371 113382 342876 293615 169316 21044 169806 93539
15035 93539 250570 231414 85459 486421 360337 398629 63794 280634 222265 59649 430411
15024 430411 106250 168848 334747 86684 378838 -376600 85441 124349 -61134 -162455
15014 -162455 -97308 -341046 -82437 278082 692913 294895 188624 43470 202546 342606
15004 342606 -126380 177177 -9406 351723 319137 -37195 125427 7293 126969 194774 60934
14992 137079 600450 296685 221966 77368 215315 348468 -19034 704592 172378 7307
14981 -39881 278373 -34084 179390 386895 210540 30259 110033 189369 252137 -207171 -14570
14969 484048 371616 406806 129561 201182 505498 50054 605837 -16418 91963 418873
$$ packed form
15045B49900p7624R4954b07371A13382K29494m9261j24299B1044J48762p6267
15035I3539J57031j9156H5459M00962j26084L8292F3794K16840n8369E9649L70762
15024D30411A06250O2598J65899H6684K92154c76600H5441L8908f1134j01321
15014a62455O5147k43738h2437B78082M14831B94895j06271D3470J59076J40060
15004C42606a26380A77177i406C51723l2586c7195A25427G293J19676O7805F0934
14992A37079M63371B96685p4719G7368J37947J33153a9034G04592A72378G307
14981c9881B78373c4084A79390K07505j76355C0259P9774P9336O2768b07171a4570
14969D84048j12432L5190A29561P1621L04316E0054N55783a6418I1963L26910
$$ plain form
14959 418873 178330 483070 119264 183579 325593 230151 478401 56323 88016 360670
14949 360670 435047 88617 459373 303936 418358 382898 -31909 217832 433612 259792
14939 259792 75926 223270 237296 704501 552602 181170 247315 714487 363093 173483
14928 463829 413379 334938 297209 164646 123919 104640 127543 514473 234184 129354 504244
14917 504244 96413 344079 155150 232879 369077 310621 111803 179378 169323 425440
14907 425440 242510 509896 702720 129692 9032 269504 278395 226681 228005 430006 432627
14896 432627 198895 166568 442746 407602 183981 246464 374774 199353 -2931 411018
14885 226494 235890 434156 602758 327055 401322 260715 -54654 81556 306953 162774
$$ packed form
14959D18873A78330L04740A19264O4315J42014r5442K48250E6323L1693K72654
14949C60670P4377H8617L70756j55437J14422l5460c1909B17832K15780j73820
14939B59792G5926J47344J4026M67205j51899A81170O6145M67172l51394A73483
14928D63829n0450p8441l7729j32563m0727j9279K2903L86930B34184j04830L74890
14917E04244I6413K47666A55150P7729J36198n8456A11803O7575j0055K56117
14907D25440j82930K67386J92824A29692I032K60472Q891n1714J324K02001K621
14896D32627A98895l2327K76178l5144A83981O2483J28310j75421b931D11018
14885B26494R396J98266J68602k75703P4267j40607e4654H1556K25397j44179
$$ plain form
14875 162774 164777 319221 38738 303569 472852 492358 412528 453866 102024 444415 268567
14864 268567 245091 240028 623075 214406 404388 448149 384384 455401 287146 273982 219203
14853 219203 398433 458645 378850 260054 511428 330681 275742 78990 674759 309239
14842 451645 263979 147399 626374 271760 670034 199453 306157 794690 342977 159643
14831 491808 345577 200835 617337 592239 121879 296241 246200 323361 280486 358765
14821 358765 370528 445252 240793 281425 288510 318317 266186 548265 495406 433709 509624
14810 509624 575063 385391 663315 438032 674942 411882 374962 508561 564903 495599
14800 495599 273912 426749 518970 466944 298508 524544 415075 865764 664124 590984
$$ packed form
14875A62774K003J54444C8738K64831J69283J9506p9830M1338A02024L42391j75848
14864B68567k3476n063L83047B14406J89982M3761o3765P1017j68255j3164n4779
14853B19203J79230O0212p9795j18796K51374j80747n4939G8990N95769C09239
14842D51645j87666j16580M78975B71760L98274A99453J06704M88533C42977A59643
14831D91808j46231j44742M16502k5098A21879J74362n0041P7161m2875P8279
14821C58765J1763P4724k04459M0632P085K9807n2131K82079n2859o1697P5915
14810E09624O5439j89672K77924k25283K36910k63060l6920J33599N6342o9304
14800D95599k21687J52837R2221n2026j68436K26036j09469M50689k01640p3140
$$ plain form
14790 590984 735233 83088 645963 395343 506036 723784 477350 705410 667291 532979
14780 532979 664603 379447 678711 644097 630720 361607 327194 776933 607024 418038
14770 418038 703924 699361 401193 773876 523476 733155 521459 632574 581550 643204
14760 643204 577347 595185 531488 634929 241590 665341 728768 936276 312091 589028
14750 589028 917227 390532 571785 539583 551767 571477 569141 663980 718146 411345 543745
14739 543745 767152 539537 641624 751994 715085 586033 667896 561677 566132 737785
14729 737785 782531 487601 526301 732948 806303 798223 663424 674403 837692 938581 776707
14718 776707 780471 854106 778613 416845 773349 675240 737373 1208575 762566 671254 703410
$$ packed form
14790E90984J44249H3088N62875k50620J10693K17748k46434K28060l8119j34312
14780E32979J31624k85156K99264l4614j3377k69113l4413M49739j69909j88986
14770D18038K85886m563k98168L72683k50400K09679k11696J11115n1024O1654
14760F43204o5857J7838o3697J03441B41590M23751O3427K07508C12091K76937
14750E89028L28199C90532J81253l2202J2184J9710k336R4839N4166l06801J32400
14739E43745K23407k27615J02087J10370l6909j29052Q1863j06219M455J71653
14729G37785M4746k94930L8700K06647P3355q080j34799J0979J63289J00889j61874
14718G76707L764P3635p5493l61768L56504r8109O2133M71202m46009r1312L2156
$$ plain form
14707 703410 564506 802925 768543 754788 604546 918806 628310 876564 649717 708559
14697 708559 922719 817286 635116 791752 686201 841345 991640 1006892 732694 800924
14687 800924 877890 1114138 838196 759089 1048371 639230 1017458 779102 880987 715748
14677 715748 1066517 964446 884616 934541 881151 703023 931346 892629 1245143 989707
14667 989707 840492 743308 998000 935152 1103365 1041745 761935 914611 1215174 904909
14657 904909 806947 932314 979062 909478 961097 1203845 1049053 1403412 870185 941899
14647 941899 1342348 913019 1120252 1172707 952358 1201219 973942 1019630 1173560 1468468
14637 1468468 1377303 1133894 1106404 1034081 1431254 909994 1318708 1036396 1276675 1044752
$$ packed form
14707G03410j38904K38419l4382j3755j50242L14260k90496K48254k26847N8842
14697G08559K14160j05433j82170J56636j05551J55144J50295J5252k74198O8230
14687H00924P6966K36248k75942p9107K89282m09141L78228k38356J01885j65239
14677G15748L50769j02071p9830M9925n3390j78128K28323l8717L52514k55436
14667I89707j49215r7184K54692o2848J68213o1620k79810J52676L00563l10265
14657I04909r7962J25367M6748o9584N1619K42748j54792L54359n33227P1714
14647I41899M00449m29329K07233N2455k20349K48861k27277M5688J53930K94908
14637A468468r1165k43409k7490p2323L97173n21260M08714k82312K40279k31923
$$ plain form
14627 1044752 1744805 1351331 1239049 1282342 1204994 1147317 1316870 1203883 1030034 1750809
14617 1750809 1281867 1517335 1318547 1664576 1398804 1160769 1093927 1510016 1513972 1469458
14607 1469458 1667796 1246369 1366311 1496928 1604881 1202925 1148783 1452312 1717492 1180500
14597 1180500 1478796 1623941 1211568 1454619 1651916 1631093 1598346 1848972 1659031 1619097
14587 1619097 1672510 1631441 1904645 1769329 1712281 1957374 1992205 1986976 1640477 1776909
14577 1776909 1709997 1647532 2091877 1843372 2004471 1913528 1713964 1884724 2073512 2060902
14567 2060902 2112540 2288795 2367912 2249801 2119505 2490061 2526650 2490363 2654930 2369321
14557 2369321 2897015 2956548 2921158 3308294 3321350 3367742 4037091 4178524 6143862 9711549
$$ packed form
14627A044752P00053l93474j12282M3293p7348n7677J69553j12987j73849P20775
14617A750809m68942K35468j98788L46029k65772k38035o6842M16089L956m4514
14607A469458J98338m21427J19942J30617J07953m01956n4142L03529K65180n36992
14597A180500K98296J45145m12373K43051J97297k0823l2747K50626j89941l9934
14587A619097N3413m1069K73204j35316n7048K45093L4831n229l46499J36432
14577A776909o6912o2465M44345k48505J61099r0943j99564J70760J88788j2610
14567B060902N1638J76255P9117j18111j30296L70556L6589l6287J64567k85609
14557B369321N27694N9533l5390L87136J3056M6392O69349J41433J965338L567687
$$ plain form
14547 9711549 20022782 35942341 46438892 24185706 10456832 4998469 2956182
14540 2956182 2064008 1772171 1781303 1907895 1565297 1558258 1588494 1677022 1837896 2156309
14530 2156309 2022017 2047929 2001318 2092544 1848014 2106287 2106931 2144051 1991234 2263712 2224595
14519 2224595 2247051 2248549 2153802 2378656 2195719 2444574 2325201 2275096 2573658 2551987
14509 2551987 2801059 2739326 2712267 2764990 2708396 2527471 2756644 2879629 3033827 3025683
14499 3025683 2888101 2633527 2914409 3220658 2903658 2896383 2991402 3045728 2983523 3206588
14489 3206588 3296613 3614624 3203503 3216042 2985364 3321406 3487785 3435387 3643784 3555678
14479 3555678 3127644 3778990 3380618 3654867 3849038 4059276 3709673 3714745 3872805 4099509
$$ packed form
14547I711549J0311233J5919559J0496551k2253186A0456832D998469k042287
14540B956182q92174k91837R132J26592l42598p039L0236Q8528J60874L18413
14530B156309j34292K5912m6611R1226k44530K58273O44L7120j52817K72478l9117
14519B224595K2456J498r4747K24854j82937K48855j19373n0105K98562k1671
14509B551987K49072o1733k7059N2723n6594j80925K29173J22985J54198q144
14499C025683j37582k54574K80882L06249l17000p275R5019N4326o2205K23065
14489C206588R0025L18011m11121J2539k30678L36042J66379n2398K08397q8106
14479C555678m28034O51346l98372K74249J94171K10238l49603N072J58060K26704
$$ plain form
14469 4099509 4024673 4071044 4110453 4011064 4319652 4209460 4269256 4354491 3933533 4072001
14459 4072001 4799151 4749923 4701585 4465777 4687337 4497422 4929963 4904435 4716187 4858054
14449 4858054 4856632 5055846 4884105 5657866 5330400 5184424 5376840 5408671 5596656 5754209
14439 5754209 5850107 5777846 5673770 5797917 5931616 5891749 6204194 6137157 6111760 6431228
14429 6431228 6354336 6295508 6777143 6363749 6793277 6879108 6840275 6933610 7153466 7337294
14419 7337294 7432988 7367207 7517895 7576086 7561891 7880053 7620628 8044311 7909626 8272272
14409 8272272 8059300 8470298 8655909 8609650 8806641 8679887 9207071 9560057 9344874 9315438
14399 9315438 9809562 9956521 10342455 10306823 10411349 10336045 10906780 10729757 11364221 11317146
$$ packed form
14469D099509p4836M6371L9409r9389L08588j10192N9796Q5235m20958J38468
14459D072001P27150m9228m8338k35808K21560j89915M32541k5528j88248J41867
14449D858054j422J99214j71741P73761l27466j45976J92416L1831J87985J57553
14439E754209R5898p2261j04076J24147J33699l9867L12445o7037k5397L19468
14429F431228p6892n8828M81635m13394M29528Q5831l8833R3335K19856J83828
14419G337294R5694o5781J50688N8191j4195L18162k59425M23683j34685L62646
14409H272272k12972M10998J85611m6259J96991j26754N27184L52986k15183k9436
14399I315438M94124J46959L85934l5632J04526p5304N70735j77023O34464m7075
$$ plain form
14389 11317146 11745252 11406062 11564237 12056660 12254150 12212993 12796869 12825885 13387076 13372707
14379 13372707 13827770 13753067 14413132 14319362 14670332 15319547 15479080 15555044 15966773 16546562
14369 16546562 16424654 16711290 17122902 17937609 17702593 18318062 18493130 18888897 19532654
14360 19532654 19615727 20407666 20664199 21225750 21581496 22103071 22557007 23553525 23843199
14351 23843199 24295541 24933154 25408215 26328062 26826623 27779310 28087192 28971230 29608850
14342 29608850 30287104 31243405 32204837 32918460 34125347 35252644 35918872 36759134 38089564
14333 38089564 38857772 40597956 41684486 42951902 44247826 45517547 47571224 48689023
14325 48689023 50238674 51782320 53559577 55610550 57871673 59917255 62111447 64247156
$$ packed form
14389A1317146M28106l39190J58175M92423J97490m1157N83876K9016N61191j4369
14379A3372707M55063p4703O60065r3770L50970O49215J59533P5964M11729N79789
14369A6546562j21908K86636M11612Q14707k35016O15469J75068L95767O43757
14360A9532654Q3073P91939K56533N61551L55746N21575M53936R96518K89674
14351B3843199M52342O37613M75061R19847M98561R52687L07882Q84038O37620
14342B9608850O78254R56301R61432P13623J206887J127297O66228Q40262J330430
14333C8089564P68208J740184J086530J267416J295924J269721K053677J117799
14325D8689023J549651J543646J777257K050973K261123K045582K194192K135709
$$ plain form
14317 64247156 66616633 69283885 71703586 74447389 78006207 80756106 84142270 87795017
14309 87795017 91626609 95720168 99473551 104525203 108975818 113967826 119316147 124642830
14301 124642830 131201002 137353143 144344927 151814166 159634999 167639058 176336115 185569929
14293 185569929 195991989 206443050 217810812 229574160 241947628 255500766 268802822
14286 268802822 283025820 298162665 313483353 329243273 345416311 361181163 377240495
14279 377240495 392783293 407579080 421607027 433967545 445158995 454289207 460284669
14272 460284669 462423259 458704737 454119238 453238507 452362336 447743619 439624769 429521567
14264 429521567 417150414 402478421 386881116 371115952 354635210 338483910 321840038
$$ packed form
14317F4247156K369477K667252K419701K743803L558818K749899L386164L652747
14309H7795017L831592M093559L753383N051652M450615M992008N348321N326683
14301A24642830O558172O152141O991784P469239P820833Q004059Q697057R233814
14293A85569929J0422060J0451061J1367762J1763348J2373468J3553138J3302056
14286B68802822J4222998J5136845J5320688J5759920J6173038J5764852J6059332
14279C77240495J5542798J4795787J4027947J2360518J1191450R130212N995462
14272D60284669K138590l718522m585499q80731q76171m618717q118850j0103202
14264D29521567j2371153j4671993j5597305j5765164j6480742j6151300j6643872
$$ plain form
14257 321840038 306271104 290459019 275635649 261762427 248674877 235784219 223152342
14250 223152342 211660818 200922646 190423198 180512394 171328625 162905293 155298189
14243 155298189 147475480 140359517 133570453 127574745 121356737 116159980 111249944 106237006
14235 106237006 101275353 96564849 92980374 89065046 85649794 82417122 78560371 75805663
14227 75805663 72452087 69830684 66878071 64577176 62421065 59998747 57766523 56077965
14219 56077965 54426326 52145519 50493012 48843754 47186395 46152327 45008046 43441566
14211 43441566 41972792 40747284 39375294 38193733 38066155 36861534 35424430 34426104
14203 34426104 33089926 32282400 31549613 31017966 30227621 29220473 28536764 27565666 27211443
$$ packed form
14257C21840038j5568934j5812085j4823370j3873222j3087550j2890658j2631877
14250B23152342j1491524j0738172j0499448r910804r183769q423332p607104
14243A55298189p822709p115963o789064n995708o218008n196757m910036n012938
14235A06237006m961653m710504l584475l915328l415252l232672l856751k754708
14227G5805663l353576k621403k952613k300895k156111k422318k232224j688558
14219E6077965j651639k280807j652507j649258j657359j034068j144281j566480
14211D3441566j468774j225508j371990j181561j27578j204621j437104r98326
14203C4426104j336178q07526p32787n31647p90345j007148o83709r71098l54223
$$ plain form
14194 27211443 26650028 25771673 25150482 24385146 23794779 23449153 22707349 21897424 21759843
14185 21759843 21381491 20926271 20424281 19645827 19394696 19009746 18907513 18446611 17840166
14176 17840166 17449205 16973745 16711366 16244093 16065346 15668209 15536773 15053441 14317058
14167 14317058 14608204 14522204 14142359 13851166 13121908 13343158 12928915 12903509 12404777 12283325
14157 12283325 12221899 11845237 11534766 11389742 11503921 11209286 10529681 10691676 10165152
14148 10165152 10175071 9960145 10123156 9731462 10018042 9817059 9179326 9482705 9157746 9098785
14138 9098785 8820894 8645534 8539366 8735486 8551025 8203408 7913408 8112754 7840076
14129 7840076 7698721 7762305 7685308 7260088 7361050 7235994 7117660 7170044 7186087 7271802
$$ packed form
14194B7211443n61415q78355o21191p65336n90367l45626p41804q09925j37581
14185B1759843l78352m55220n01990p78454k51131l84950j02233m60902o06445
14176A7840166l90961m75460k62379m67273j78747l97137j31436m83332p36383
14167A4317058K91146q6000l79845k91193p29258K21250m14243k5406m98732j21452
14157A2283325o1426l76662l10471j45024J14179k94635o79605J61995n26524
14148A0165152R919k14926J63011l91694K86580k00983o37733L03379l24959n8961
14138I098785k77891j75360j06168J96120j84461l47617k90000J99346k72678
14129G840076j41355O3584p6997m25220J00962j25056j18334N2384J6043Q5715
$$ plain form
14119 7271802 6705153 6546097 6626882 6568344 6205763 6208912 6001677 6390870 6115384 6341170
14109 6341170 5967351 6184761 5960799 5756407 5872265 5516857 5439107 5128172 5677278 5247261
14099 5247261 5264751 5333015 5161984 5095023 4963778 4916049 4929946 5140011 4855153 4643188
14089 4643188 4571835 4745162 4771401 4623125 4452350 4566056 4422008 4562579 4426242 4262252
14079 4262252 4346592 4111550 4278749 4342534 4180562 4041984 4060508 3713481 3879007 3778352
14069 3778352 3969416 3959607 3613893 4099031 3751277 3768329 3442289 3578663 3528657 3399733
14059 3399733 3368295 3909413 3592186 3515628 3579793 3497968 3164543 2975900 3267983 3406351
14049 3406351 3024589 3020350 3409089 2883555 3156115 3134001 2919859 2986919 3130371 2711101
$$ packed form
14119G271802n66649j59056Q0785n8538l62581L149k07235L89193k75486K25786
14109F341170l73819K17410k23962k04392J15858l55408p7750l10935N49106m30017
14099E247261J7490O8264j71031o6961j31245m7729J3897K10065k84858k11965
14089D643188p1353J73327K6239j48276j70775J13706j44048J40571j36337j63990
14079D262252Q4340k35042J67199O3785j61972j38578J8524l47027J65526j00655
14069C778352J91064r809l45714M85138l47754J7052l26040J36374n0006j28924
14059C399733l1438N41118l17227p6558O4165q1825l33425j88643K92083J38368
14049C406351l81762m239L88739n25534K72560k2114k14142O7060J43452m19270
$$ plain form
14039 2711101 2691592 3048171 3072380 2661066 2830563 3033823 2505730 2946447 2640983 2915761
14029 2915761 2476130 2658814 2913650 2775489 2668717 2607974 2442396 2137022 2313081 2352671
14019 2352671 2291240 2299912 2673309 2168694 2222571 2439009 2134871 2066412 2084349 2273019
14009 2273019 2140355 2064409 1643537 1959301 2156736 1884139 2019178 2182677 1917726 2234351
13999 2234351 2079669 1833073 2017443 1885572 1468715 1603266 1683497 1849870 1743256 1974832
13989 1974832 2393509 4716898 12520375 29313399 45865975 29720639 12830817 7213684
13981 7213684 5304500 3862124 3471677 3398574 2910373 2830121 2941970 2339502 2306584 2148971
13971 2148971 2397362 2072346 2117708 1997058 2125293 2098551 2073407 2084891 2038249 2172735
$$ packed form
14039B711101j9509L56579K4209m11314J69497K03260n28093M40717l05464K74778
14029B915761m39631J82684K54836j38161j06772o0743j65578l05374J76059L9590
14019B352671o1431Q672L73397n04615N3877K16438l04138o8459J7937J88670
14009B273019j32664p5946m20872L15764J97435k72597J35039J63499k64951L16625
13999B234351j54682k46596J84370j31871m16857J34551Q0231J66373j06614K31576
13989A974832M18677K323389P803477J6793024J6552576j6145336A2830817n617133
13981G213684j909184j442376l90447p3103m88201q0252J11849o02468l2918j57613
13971B148971K48391l25016M5362j20650J28235k6742k5144J1484m6642J34486
$$ plain form
13961 2172735 1734580 2007997 1996454 2105002 1638553 1639516 1580516 1851656 1852834 1744309 1693355
13950 1693355 1854537 1581099 1491374 1806367 1667510 1523801 1495863 1708606 1525607 1841346
13940 1841346 1560807 1682589 1592492 1234941 1724146 1484525 1532636 1410685 1276556 1289772
13930 1289772 1569524 1570161 1666092 1528658 1475080 1376446 1478572 1379124 1254238 1590030 1485057
13919 1485057 1540201 1264898 1443594 1436922 977857 1120890 1369787 1611413 1508327 1145141
13909 1145141 1018916 701990 1189727 1049940 1206962 1209097 1459059 1116078 1279802 885696
13899 885696 1276960 1221757 1205246 1303395 1041652 1406962 1025241 777998 1311413 1099613
13889 1099613 1032094 1303941 1284312 1039658 981995 1025332 852895 823694 1236172 1228466 787283
$$ packed form
13961B172735m38155K73417j1543J08548m66449R63n9000K71140J178j08525n0954
13950A693355J61182k73438q9725L14993j38857j43709k7938K12743j82999L15739
13940A841346k80539J21782r0097l57551M89205k39621M8111j21951j34129J3216
13930A289772K79752O37R5931j37434n3578r8634J02126r9448j24886L35792j04973
13919A485057N5144k75303J78696o672m59065J43033K48897K41626j03086l63186
13909A145141j26225l16926M87737j39787J57022K135K49962l42981J63724l94106
13899H85696L91264n5203j6511R8149k61743L65310l81721k47243N33415k11800
13889A099613o7519K71847j9629k44654n7663M3337j72437k9201M12478p706m41183
$$ plain form
13878 787283 807779 1042409 1033437 1001371 1055250 1133502 926840 893520 910242 666751 1021344
13867 1021344 804076 931591 1105488 1134830 622935 909750 993213 584456 538605 978198
13857 978198 965598 760176 958195 778177 808037 716822 936574 671484 810734 865326
13847 865326 773991 777533 970047 913587 954820 759208 1008211 701113 886733 1186069
13837 1186069 834647 740689 1084720 701922 716888 719464 839111 1036325 1012268 541282
13827 541282 639032 784109 748055 756138 522202 650292 795912 850169 606470 673599 999265
13816 999265 846047 873885 513443 720445 504558 986318 605993 804027 592067 924837
13806 924837 829665 1229303 500321 536929 633991 710984 310962 635758 427299 673508
$$ packed form
13878G87283K0496K34630q972l2066N3879P8252k06662l3320J6722k43491L54593
13867A021344k17268J27515J73897K9342n11895K86815Q3463m08757m5851M39593
13857I78198j2600k05422J98019j80018K9860r1215K19752k65090J39250N4592
13847H65326r1335L542J92514n6460M1233j95612K49003l07098J85620K99336
13837A186069l51422r3958L44031l82798J4966K576J19647J97214k4057m70986
13827E41282R7750J45077l6054Q083k33936J28090J45620N4257k43699O7129L25666
13816I99265j53218K7838l60442K07002k15887M81760l80325J98034k11960L32770
13806I24837r5172L99638E00321L6608R7062P6993C10962L24796k08459K46209
$$ plain form
13796 673508 587559 839539 451713 466477 655061 676028 1094950 745476 816254 625002
13786 625002 744686 750420 442738 405311 709810 973260 323048 296922 666558 627259
13776 627259 707649 561073 682706 770367 725204 340546 531976 602854 717814 321049
13765 888154 569124 437595 632871 607983 401861 529427 706621 865720 563683 397750
13755 397750 668400 686196 623894 468308 393246 551558 630086 911362 629949 670077
13745 670077 412280 355903 621487 369727 367558 164193 450161 547617 496871 594808 262669
13733 449682 560429 326680 394814 378864 782046 488720 555331 712487 389506 463102
13723 463102 572505 721430 569979 434941 306996 475100 626486 473671 293969 234275
$$ packed form
13796F73508q5949K51980l87826J4764J88584K0967M18922l49474P0778j91252
13786F25002J19684N734l07682l7427L04499K63450C23048k6126L69636l9299
13776F27259Q0390j46576J21633Q7661m5163C40546J91430P0878J14960C21049
13765H88154l19030j31529J95276k4888k06122J27566J77194J59099l02037j65933
13755C97750K70650J7796o2302j55586p5062J58312P8528K81276k81413M0128
13745F70077k57797n6377K65584k51760k169A64193K85968R7456n0746R7937B62669
13733D49682J10747k33749O8134j5950M03182k93326O6611J57156l22981P3596
13723D63102J09403J48925j51451j35038j27945J68104J51386j52815j79702n9694
$$ plain form
13713 234275 426443 612524 236546 496026 883530 288124 278516 556393 482036 403514
13703 403514 339514 153257 518791 644480 406090 268458 207125 515353 645860 268533
13692 459764 584324 595805 758264 520241 544339 424814 440066 61300 671508 165750
13681 418527 293151 51082 333127 463689 427258 505555 527771 270743 509248 188353
13670 460607 391664 436873 428628 566076 253198 627108 489134 390842 392492 174629 218831
13659 218831 245744 384191 51811 858098 459677 433996 533126 -75492 388424 285910
13649 285910 325698 329911 488731 627191 205493 419576 521728 464433 380511 593619
13639 593619 9377 476552 121871 85215 435366 108389 699927 188397 401990 99465
$$ packed form
13713B34275J92168J86081B36546K59480L87504B88124r608K77877p4357p8522
13703D03514o4000A53257L65534J25689k38390j37632o1333L08228J30507B68533
13692D59764J24560J1481J62459k38023K4098j19525J5252F1300O10208A65750
13681D18527j25376E1082K82045J30562l6431P8297K2216k57028K38505A88353
13670D60607o8943M5209q245J37448B53198L73910j37974r8292J650A74629M4202
13659B18831K6913J38447E1811Q06287l98421k5681R9130g5492C88424j02514
13649B85910L9788M213J58820J38460B05493K14083J02152n7295q3922K13108
13639E93619I377M67175A21871l6656L50151A08389N91538A88397K13593I9465
$$ plain form
13628 73502 494036 471641 257854 281087 -24610 40084 279763 92818 338326 130563 243941
13617 243941 224644 173869 155987 697271 263310 313022 315236 355480 211456 425443 295399
13606 295399 447793 394835 299233 225825 339416 345565 133933 481072 478881 345232 471507
13595 471507 301195 53086 61784 105825 242203 412173 266954 531533 402427 6543 134003
13584 134003 76445 231849 196343 146721 244920 265648 166356 241253 222341 223963 -154467
13572 601807 -26545 588112 216384 511732 285111 -46512 155096 452834 185004 237112
13562 237112 528575 214380 174031 461000 87304 344197 575257 484471 187529 304545
13552 304545 350038 239728 313876 97055 245916 633834 177225 254062 330888 583730
$$ packed form
13628G3502M20534k2395k13787K3233b4610D0084K39679I2818K45508A30563J13378
13617B43941j9297n0775j7882N41284B63310M9712K214M0244j44024K13987j30044
13606B95399J52394n2958r5602p3408J13591O149A33933L47139k191j33649J26275
13595D71507j70312E3086Q698M4041J36378J69970j45219K64579j29106F543J27460
13584A34003n7558J55404l5506m9622R8199K0728r9292P4897j8912J622a54467
13572F01807b6545E88112B16384K95348k26621d6512A55096K97738A85004N2108
13562B37112K91463B14380m0349K86969H7304K56893K31060r0786A87529J17016
13552C04545M5493j10310P4148I7055J48861L87918A77225P6837P6826K52842
$$ plain form
13542 583730 199619 153676 423658 -17801 490973 230096 340452 314846 325674 362065
13532 362065 272286 92509 343918 10222 -65265 283268 225072 189889 353552 -29669 101086
13520 29843 356601 386868 138258 279268 326720 37981 335361 261522 343791 294844 79002
13508 322265 228945 301481 439892 249230 401647 233529 141722 -36588 152785 301283
13498 301283 193052 176604 184014 -128156 136169 122869 358893 232381 -129969 416193
13487 134820 382813 481899 63754 50434 22079 96999 -55345 57199 197763 -66702 118404
13475 189543 -98506 110912 243452 123407 275876 303266 201150 -278744 223336 122287
13465 122287 -154699 -116037 645002 23292 322369 213901 177663 283724 141343 157597
$$ packed form
13542E83730A99619m5943K69982a7801D90973B30096J10356k5606J0828L6391
13532C62065q9779I2509K51409A0222f5265B83268n8196l5183J63663b9669A01086
13520B9843L26758L0267A38258J41010M7452C7981K97380p3839Q2269m8947G9002
13508C22265r3320P2536J38411j90662J52417j68118r1807c6588A52785J48498
13498C01283j08231j6448P410a28156A36169j3300K36024j26512a29969D16193
13487A34820K47993R9086F3754j3320B2079P4920e5345E7199J40564f6702A18404
13475A89543i8506A10912J32540j20045J52469K7390j02116b78744B23336j01049
13465A22287a54699L8662F45002B3292K99077j08468l6238J06061A41343J6254
$$ plain form
13455 157597 -18687 108456 268571 613698 184069 -34582 480164 68139 280367 74379
13444 376376 417286 281779 118524 200504 208848 -22581 338034 65082 363590 352630 129107
13432 55235 254176 -34903 328469 49770 6046 55397 264558 36020 76001 245778 420024
13421 420024 -170433 69296 221612 470651 166547 345601 177861 404756 -2758 -112460
13411 -112460 459302 453777 480803 19557 -4116 301646 31907 114308 95082 331194 407673
13400 407673 3889 -30763 -119537 16668 127004 -95200 289847 33125 6548 207019 213445
13389 213445 -18800 10963 277493 334051 -81135 252689 185714 485101 166200 -221192
13378 22362 172591 349991 105659 73862 204138 110847 154339 -30086 117530 301128
$$ packed form
13455A57597a8687A08456J60115L45127A84069c4582D80164F8139K12228G4379
13444C76376M0910j35507A18524Q1980Q344b2581C38034F5082K98508j0960A29107
13432E5235J98941c4903C28469D9770F046M9351K09161C6020L9981J69777J74246
13421D20024a70433F9296J52316K49039A66547J79054j67740K26895b758j09702
13411a12460D59302n525K7026A9557d116C01646C1907Q2401j9226K36112P6479
13400D07673C889c0763q8774A6668J10336i5200B89847C3125F548K00471O426
13389B13445a8800A0963K66530N6558h1135B52689o6975K99387A66200b21192
13378B2362J50229J77400A05659l1797J30276r3291M3492c0086A17530J83598
$$ plain form
13368 301128 239271 98925 30583 356116 505469 62987 -48022 119203 397979 -145360
13357 402605 181439 130109 291969 49487 111179 -3969 113920 210985 298770 112604 -196009
13345 87012 158468 252375 119230 362905 362286 504827 -26378 361185 79519 222834 281062
13334 281062 220753 129706 228576 164058 179810 196401 194503 388425 225564 427106 254253
13323 254253 137315 409541 402728 338905 387825 316748 174810 214194 431065 307430 9513
13311 72825 375520 201839 93454 370710 -256957 108915 201755 106 303826 315533 -18723
13299 164189 -45581 206162 -149912 291193 65833 -161174 52757 11857 42692 7389 -36824
13287 168170 93082 339680 -107222 184671 37790 221417 129614 400806 97405 157947
$$ packed form
13368C01128o1857I8925C0583L25533J49353F2987d8022A19203K78776a45360
13357D02605A81439n1330J61860D9487O1692c969A13920R7065Q7785A12604a96009
13345H7012P1456R3907A19230K43675o19J42541b6378C61185G9519J43315N8228
13334B81062o0309r1047R8870o4518J5752J6591j898J93922j62861K01542j72853
13323B54253j16938K72226o813o3823M8920p1077j41938L9384K16871j23635I513
13311G2825L02695j73681I3454K77256b56957A08915R2840A06L03720J1707a8723
13299A64189d5581B06162a49912B91193F5833a61174E2757A1857L0835G389c6824
13287A68170p5088K46598a07222A84671C7790J83627r1803K71192I7405O0542
$$ plain form
13277 157947 86593 250276 430771 32077 97470 112555 -92706 19111 -89783 283916 199171
13266 199171 -115488 705 245794 96078 91147 -69585 -160891 -623 97080 -96248 -88112 131399
13253 263819 100800 136239 281984 123988 21564 176480 114205 18331 117481 69654 -32475
13241 175045 61538 283945 140545 157393 202512 18207 9514 235619 13160 77674 -134265
13229 237615 32250 -111149 87067 203727 -77790 307879 169444 19035 -1188 364826 372645
13218 372645 264310 -30734 230128 -43229 -24921 -99139 247047 57024 -38757 -157114 445044
13206 104547 -144789 -296357 -82451 33301 36234 -39904 -115265 -71501 238534 399276 332829
13195 332829 50601 -148860 92532 155286 171573 183802 143510 -133130 252216 -50254 133390
$$ packed form
13277A57947p1354J63683J80495C2077O5393J5085i2706A9111h9783B83916q4745
13266A99171a15488G05K45089I6078m931f9585r1306f23I7080i6248Q136A31399
13253B63819A00800L5439J45745A23988B1564J54916o2275A8331R9150m7827c2475
13241A75045F1538K22407A40545J6848M5119A8207q693K26105A3160O4514a34265
13229B37615C2250a11149H7067J16660g7790C07879j38435A9035a188C64826P819
13218C72645j08335c0734B30128d3229J8308p4218B47047E7024c8757j18357D45044
13206A04547a44789j51568h2451C3301K933c9904p5361M3764B38534J60742o6447
13195C32829E0601a48860I2532O2754J6287J2229m0292a33130B52216e0254A33390
$$ plain form
13183 -203291 -91796 113463 5625 161458 24883 -33226 -134169 167563 247247 28818 -122000
13171 -62486 -57820 11323 86028 66141 -302352 178539 -119470 -20354 -142271 292708 197010
13160 197010 -208009 8512 114019 233361 -320180 152821 -495265 49911 -59860 369921
13149 -157561 -140407 88127 -39150 -66950 -31579 110533 63646 -84611 118042 266341 -60827
13137 -78355 -48527 -98077 335869 157904 111889 -161088 6259 -60797 139334 -180206 87078
13125 53818 31926 -86099 8669 35774 98108 159540 407671 55329 -3338 -33563 -269 83868
13112 108605 -107397 120925 -73927 -229625 196558 -85465 -131992 279824 101528 142089
13102 142089 19220 -198798 145164 -72325 103159 195378 47502 -244690 87595 6269 -223201
$$ packed form
13183b03291i1796A13463E625J55833B4883c3226j00943A67563P9684B8818a22000
13171f2486M666A1323P4705j9887c02352A78539a19470b0354j21917B92708r5698
13160A97010b08009H512J05507J19342c20180A52821d95265D9911e9860C69921
13149a57561J7154H8127c9150k7800c1579A10533m6887h4611A18042J48299f0827
13137g8355K9828m9550C35869A57904m6015a61088F259f0797A39334a80206H7078
13125E3818k1892h6099H669K7105O2334O1432K48131E5329c338l0225b69H3868
13112A08605a07397A20925g3927j55698A96558h5465m6527B79824A01528M0561
13102A42089A9220a98798A45164g2325A03159R2219D7502b44690H7595F269b23201
$$ plain form
13090 -110806 268333 208127 -60340 -72950 -157468 -77049 -36461 389436 249041 -75720 201443
13078 -163055 85995 169266 -95290 -60515 -117173 -54467 -91825 13115 52756 -56572 296967
13066 100974 -74722 433272 498848 -17102 -98140 140690 122731 18348 -107262 104795 68383
13055 68383 101071 133796 89723 338931 129672 39098 194976 -36956 -66411 -303761 551466
13043 -44075 -140117 122237 197126 -293412 31480 127329 -53506 9253 112815 395730 -35578
13031 202728 161752 6648 173637 9424 315584 15830 57489 1459 188248 -107134 -150086
13020 -150086 211115 190905 37278 122629 -167512 251482 47654 279781 -43247 11876 189656
13009 189656 101954 284739 48171 126502 -40419 -37708 336698 312586 90374 218606 -25864
$$ packed form
13090a10806B68333o0206f0340j2610q4518g7049c6461C89436j40395g5720B01443
13078a63055H5995Q3271i5290L4775n6658e4467l7358A3115L9641e6572B96967
13066A00974g4722D33272O5576a7102q1038A40690j7959A8348a07262A04795l6412
13055F8383L2688L2725m4073K49208A29672C9098J55878c6956k9455k37350E51466
13043d4075r6042A22237P4889b93412C1480R5849e3506I253J03562K82915c5578
13031B02728m0976F648J66989I424L06160A5830M1659A459J86789a07134m2952
13020a50086B11115k0210C7278Q5351a67512B51482D7654K32127d3247A1876J77780
13009A89656q7702J82785D8171P8331d0419K711C36698k4112I0374J28232b5864
$$ plain form
12997 2600 -75968 3961 -4514 -69150 -31729 5181 264074 -158747 12014 -3071 -267 -125914
12985 -125914 192160 105045 -56248 256061 198803 56747 188183 189429 -21476 58479 7019
12973 7925 -20764 -215441 241631 -17582 -162721 318512 310862 -135132 135811 -42261 137480
12961 -37837 214172 65857 -6912 124611 -37113 -28261 -174896 126293 34676 24168 149377
12950 149377 -94033 263434 109555 -50226 127276 105414 -358059 -5742 -41464 114569 114109
12939 114109 137692 114663 53677 -71015 -193774 317739 330146 -61200 153709 440470 234408
12928 234408 -139080 -119296 127717 1402 -409116 124137 46055 224789 85854 -51852 10462
12916 167964 110024 21123 2501 -280413 113939 259240 228586 34834 41841 52157 23281
$$ packed form
12997B600g5968C961d514o4636c1729E181K58893a58747A2014c071b67j25647
12985a25914A92160q7115e6248B56061n7258E6747J31436J246b1476E8479G019
12973G925b0764j94677B41631a7582j45139C18512p650a35132A35811d2261A37480
12961c7837B14172F5857f912A24611c7113Q852j46635A26293C4676j0508J25209
12950A49377i4033B63434A09555e0226A27276k1862c58059e742l5722A14569m60
12939A14109K3583k3029E3677g1015j22759C17739J2407f1200A53709K86761k06062
12928B34408a39080J9784A27717A402d09116A24137D6055J78734H5854e1852A0462
12916A67964n7940B1123B501b80413A13939J45301l0654C4834P007J0316B3281
$$ plain form
12904 -8794 -132149 -149494 33766 232264 -16316 204610 370796 295618 336851 141787 53210
12892 -15122 -204004 269539 -274816 174166 174033 286473 -32722 -9197 -198845 -14985 -168391
12881 -168391 36894 98457 65282 99829 -85773 -176702 34141 -41713 45495 -150785 -24549
12869 -12083 -128214 -88717 374191 -250129 -61251 -199370 -43964 -35390 46733 160704 -64169
12857 336917 -23637 -86310 45114 34398 12887 -126910 -26948 22186 99040 -295643 -99377
12845 -64726 217598 81659 318844 47329 -177060 -322119 -83410 93255 -211517 333524
12834 -142273 -158524 -31291 -28038 103463 -248171 -127512 -147808 138829 119339 160227 363718
12823 363718 -228915 -90930 74458 -120744 66772 66988 -51370 -45760 -413642 134578 262495
$$ packed form
12904h794j23355j7345C3766J98498a6316B04610J66186p5178M1233A41787E3210
12892a5122j88882B69539b74816A74166j33J12440c2722i197j89648a4985j53406
12881a68391C6894O1563l3175L4547h5773r0929C4141d1713D5495a50785b4549
12869a2083j16131L9497C74191b50129f1251j38119d3964Q574D6733J13971f4169
12857C36917b3637o2673D5114j0716A2887a26910b6948B2186P6854b95643i9377
12845f4726B17598H1659K37185D7329a77060j45059h3410I3255b11517C33524
12834a42273j6251c1291L253A03463b48171J20659k0296A38829j9490M0888K03491
12823C63718b28915i0930G4458a20744F6772K16e1370N610l67882A34578J27917
$$ plain form
12812 262495 150865 -330482 -14160 -93680 -93293 107705 -143934 130598 -132963 6560 -29356
12800 -223643 -62496 -28915 34127 46538 -32085 -45728 -124623 -90747 52052 -111683 30770
12788 -261134 4460 -128307 -160207 -213387 143284 3039 117441 -135879 68591 -187510 -221922
12777 -221922 54770 -221594 49741 19804 223595 -153508 82733 -249802 246941 314643
12767 314643 134640 -92682 102776 97704 -172538 -211666 215853 -47321 337758 37872 -51995
12755 70419 19182 174159 34548 225389 -295300 -328840 155181 32974 -9295 308327 86228
12743 52755 -69164 -27632 -3276 195616 316803 -87033 84922 52072 -96003 68770 406736
12732 406736 227924 -40076 -60376 -321186 -74837 103162 -221770 102934 -211925 -181470
$$ packed form
12812B62495j11630c30482a4160p9520L87A07705a43934A30598a32963F560b9356
12800b23643f2496b8915C4127J2411c2085j3643p8895L3876E2052a11683C0770
12788b61134D460a28307l1900n3180A43284C039J14402a35879F8591a87510l4412
12777b21922E4770b21594D9741A9804K03791a53508H2733b49802B46941O7702
12767C14643A34640i2682A02776n072a72538l9128B15853d7321C37758C7872e1995
12755G0419A9182J54977C4548J90841b95300l3540A55181C2974i295C08327H6228
12743E2755f9164b7632c276A95616J21187h7033H4922l2850i6003F8770L37966
12732D06736j78812d0076k0300k60810g4837A03162b21770A02934b11925L0455
$$ plain form
12722 -181470 162208 -249545 43074 -94891 -113009 -117558 44108 -38116 180530 -117077 19317
12710 -182376 -7336 59732 375424 158967 -12533 91826 258907 -9677 -70892 124235 13734
12698 103365 -62449 49745 -55181 117413 -102188 -113655 -106689 243662 195008 150771 -227641
12686 69610 122101 98532 30793 32828 118945 73916 -68461 186824 -129677 240251 319020
12675 319020 228664 -133062 411527 -9249 120989 132348 174433 230639 39336 -77541 249518
12663 84376 157594 -100402 -25627 290923 -21311 91841 -10093 66481 -8076 184917 -248073
12651 99348 443872 -3549 63813 -171820 -240817 299928 123897 -20041 -118315 322874 -28076
12639 109521 60965 -96977 175604 139274 185552 -160783 -19016 178438 -98198 51462 304064
$$ packed form
12722a81470A62208b49545D3074i4891j8118m549D4108c8116A80530a17077A9317
12710a82376g336E9732L15692A58967a2533I1826J67081i677o1215A24235A3734
12698A03365f2449D9745e5181A17413a02188j1467O966B43662m8654m4237b27641
12686F9610N2491k3569C0793K035Q6117m5029f8461A86824a29677B40251P8769
12675C19020r0356a33062D11527i249A20989J1359M2085N6206C9336g7541B49518
12663H4376P3218a00402b5627B90923b1311I1841a0093F6481h076A84917b48073
12651I9348L44524c549F3813a71820o8997B99928A23897b0041r8274C22874b8076
12639A09521m8556i6977A75604l6330M6278a60783a9016A78438i8198E1462K52602
$$ plain form
12628 304064 72713 362552 -36093 -134693 -117271 -188976 293991 201194 200996 -72862 -83533
12617 -83533 -301388 100990 172570 -215554 -121629 -159864 16529 43057 87158 74789 349855
12606 349855 61039 41959 131579 -275638 19581 158197 116170 31485 171574 156992 254545
12595 254545 -174771 -116222 15139 237525 249577 -37160 17958 -98003 5902 -87264 365274
12583 -110711 133478 -82379 -282147 -147545 79008 -185283 -137912 -174610 -201430 -1248 328579
12571 306159 64558 287679 -70040 16367 317660 8986 321653 -80671 -221652 -69944 120897
12559 182847 -214895 323027 311279 -19254 227366 -36196 -121464 9515 -183113 -62911 50937
12547 -128485 90040 -7501 382386 -172827 67195 -99277 8061 -65680 216036 -213978 70996
$$ packed form
12628C04064G2713K89839c6093r8600J7422p1705B93991r2797j98g2862j0671
12617h3533k17855A00990P1580b15554R3925l8235A6529K6528M4101j2369K75066
12606C49855F1039j9080Q9620b75638A9581J38616m2027C1485J40089j4582R7553
12595B54545a74771N8549A5139K22386J2052c7160A7958i8003E902h7264C65274
12583a10711A33478h2379j99768J34602G9008a85283M7371l6698k6820a248C28579
12571C06159F4558K23121g0040A6367L01293H986L12667h0671j40981f9944A20897
12559A82847b14895C23027j1748a9254B27366c6196q5268I515a83113f2911E0937
12547a28485I0040g501C82386a72827F7195i9277H061f5680B16036b13978G0996
$$ plain form
12535 106890 -36162 -32326 31758 277312 268277 113663 80784 -53177 -84613 396671 -339465
12523 -119603 -232274 27914 -29903 -101924 -237899 -97746 136948 23201 156880 78915 -313477
12511 133512 -35935 -18883 -242464 36573 160661 -156227 -419138 75946 -137763 92142
12500 426496 120063 63249 64108 56528 -43647 115561 209008 208780 94621 -214561 -23024 12613
12487 128408 102329 45313 87678 138416 -53877 -182326 135822 394963 161496 -76371 -14434
12475 -60362 -33255 147606 -193909 166685 -179584 8323 118025 116613 -112895 -43564 55408
12463 155429 -39521 -170906 -202701 107415 -323190 122 -91972 -281000 47843 -41342 93100
12451 130983 -90258 -60580 222967 -47415 -61297 -14449 -17692 62049 135107 7558 -47264 -32925
$$ packed form
12535A06890c6162L836C1758K45554r035A13663l2879e3177l1436C96671c39465
12523a19603j12671B7914b9903p2021j35975i7746A36948B3201J33679p7965c13477
12511A33512c5935J7052k23581C6573J24088a56227k62911G5946a37763I2142
12500D26496A20063n6814Q59p580d3647A15561R3447k28I4621b14561b3024A2613
12487A28408k6079D5313M2365N0738e3877j28449A35822K59141A61496g6371a4434
12475f0362K7107A47606a93909A66685a79584H323J09702j412a12895d3564E5408
12463A55429c9521j31385l1795A07415c23190A22i1972j89028D7843d1342I3100
12451A30983i0258K9678B22967d7415j3882a4449l243F2049P3058G558d7264J4339
$$ plain form
12439 -32925 203776 -87815 -45866 -13906 -41710 133751 166635 21942 -119608 73243 21034
12427 1303 -27345 -9600 -262116 -138848 -45645 135220 24944 651 82017 -105462 -37702 -15855
12414 -53013 59469 -36589 257794 -105628 -296289 -324117 -52989 -241053 -198282 -55995 222572
12402 -31348 186850 188453 -47844 75455 -240146 5000 -119874 -28591 -20774 -113033 152720
12390 7218 -118956 -112496 52785 71737 322844 9697 54100 152981 -57622 -178762 -150459 203448
12377 -190092 37958 -100213 -348290 -70868 179703 308299 -372397 81213 138956 -190022
12366 -235005 149706 39149 -353301 -89971 33787 -410553 -41529 -138839 -19671 -164041 -82456
12355 -82456 -16364 -237562 -131876 -28230 -38464 -177033 -349852 -126084 239393 -37548
$$ packed form
12439c2925B03776h7815M1949a3906k7804A33751L2884B1942a19608G3243B1034
12427A303b7345i600k52516J23268d5645A35220B4944F51Q1366a05462c7702a5855
12414e3013E9469c6589B57794a05628j90661k7828e2989j88064M2771e5995B22572
12402c1348A86850J603d7844G5455b40146E000a19874b8591P817r2259A52720
12390G218a18956O460E2785J8952K51107I697M4403R8881e7622j21140K8303B03448
12377a90092C7958a00213k48077g0868A79703J28596c72397H1213N7743a90022
12366b35005A49706C9149c53301h9971C3787d10553d1529r7310a9671j44370Q1585
12355h2456a6364k21198J05686b8230j0234j38569j72819a26084B39393c7548
$$ plain form
12344 144811 -21051 -147318 -328258 128829 103175 -79082 -12353 101210 19311 138034
12334 138034 -100818 189623 -162959 -254089 -189554 210762 210109 978 -313745 466669 -45908
12322 197216 76062 -20258 -412119 338335 216158 75827 210513 -95658 143993 187786
12312 187786 58525 121040 -49422 127508 -68213 152991 151021 9997 197879 -223729 -125412
12301 -125412 -291788 109280 190424 -206167 -169923 96495 -155026 -91739 -18472 80961 -1607
12289 23066 -121011 1861 -224138 -20960 139087 126883 -171756 361722 -78863 -92673 206221
12277 -126454 -221673 67979 324841 41817 241243 -72610 165079 20018 -919 87257 -94697
12265 12608 145677 156974 167995 -298084 -2880 143493 -67253 -31264 129342 5088 277912
$$ packed form
12344A44811b1051j26267j80940A28829k5654g9082a2353A01210A9311J18723
12334A38034a00818A89623a62959r1130O4535B10762o53I78c13745D66669d5908
12322A97216G6062b0258l91861C38335j22177G5827J34686i5658A43993M3793
12312A87786E8525O2515d9422A27508f8213A52991j970I997J87882b23729R8317
12301a25412j66376A09280Q1144b06167L6244I6495a55026O3287a8472H0961a607
12289B3066a21011A861b24138b0960A39087j2204a71756C61722g8863j3810B06221
12277a26454r5219F7979K56862D1817J99426g2610A65079B0018i19H7257i4697
12265A2608J33069J1297J1021b98084b880A43493f7253c1264A29342E088K72824
$$ plain form
12254 277912 270864 -172579 350136 257373 77670 176378 40254 -249442 60093 30416 406501
12243 406501 -39293 289203 -156895 302835 189540 167846 -79076 244248 247749 -242402
12232 -216258 64651 4370 87235 -261985 167644 -1210 41405 261108 279057 239640 335833
12221 335833 420786 331277 440660 -9351 161807 275333 249627 113386 309455 114388
12210 76367 66536 -96586 -47437 87031 53759 155148 186384 92002 -56348 252634 -52542
12198 27557 216547 67169 -34732 -14130 241819 -143216 298104 82434 -69462 32227 291376
12187 291376 236076 -17909 -60821 -202059 22802 187810 -9673 479222 156629 -7891 192726
12175 199718 72517 -66843 129401 134674 377409 -19218 91644 -120784 197969 -72706 24501
$$ packed form
12254B77912p048a72579C50136r2763G7670R8708D0254b49442F0093k9677L76085
12243D06501c9293B89203a56895C02835j13295k1694g9076B44248L501b42402
12232b16258F4651D370Q2865b61985A67644a210D1405K19703J7949l9417R6193
12221C35833Q4953q9509J09383i351A61807J13526k5706A13386J96069A14388
12210G6367r831i6586d7437H7031l3272J01389L1236I2002e6348B52634e2542
12198B7557J88990F7169c4732a4130B41819a43216B98104H2434f9462C2227K59149
12187B91376n5300a7909m2912j41238B2802J65008i673D79222A56629g891A92726
12175A99718G2517f6843A29401N273K42735a9218I1644a20784A97969g2706B4501
$$ plain form
12163 -100846 102210 264142 359904 -68078 35053 139748 -238120 -106085 -139673 -253639
12153 -253639 -4422 -25733 130007 16562 -225874 491404 282645 -26429 57116 -89316 86248
12141 -54999 206402 -330376 -146353 -156302 47554 80360 267885 -75968 -105206 244983 -114000
12129 -106295 311351 112693 1350 25110 6077 158970 218183 -341739 -14037 -151670 -26561
12117 19654 -68707 -81143 65517 24023 15921 -137785 -154463 -309628 11897 -144254 194467
12105 21312 47615 141358 47995 131148 277119 -10423 -135527 -75234 193104 64571 -157134
12093 154218 19336 5676 -25839 287249 -373488 95778 -105524 -268258 -124185 41907 -197313
12081 222820 251039 58400 -104485 24922 570934 778361 1981474 883774 206201 151502
$$ packed form
12163a00846A02210J61932R5762f8078C5053J04695b38120a06085l3588j13966
12153b53639d422k1311A30007A6562b25874D91404k08759b6429E7116h9316H6248
12141e4999B06402c30376a46353r949D7554L2806J87525g5968k9238B44983a14000
12129a06295C11351A12693A350K3760F077J52893N9213c41739a4037j37633b6561
12117A9654f8707j2436F5517B4023q102a37785j6678j55165A1897a44254A94467
12105B1312K6303R3743D7995Q3153J45971a0423j25104O0293A93104F4571a57134
12093A54218A9336E676b5839B87249c73488I5778a05524j62734a24185D1907a97313
12081B22820K8219E8400a04485B4922N46012K07427J203113H83774B06201n4699
$$ plain form
12071 151502 236970 -39852 -305739 -112074 -130188 -97366 68032 161714 -132710 382729 175574
12059 189614 -177165 378952 82090 -105740 289235 82119 -207506 66487 129314 -12302
12048 -232675 -64272 16972 54855 -74126 127615 -289826 119656 -136602 187854 83587
12037 73732 -269268 -177234 149425 146657 212102 -65149 279700 178495 -99405 -478108 16700
12025 94637 173809 -223603 62732 81778 -14720 316518 88364 211535 48823 -3737 225344
12013 -289274 18620 188047 143437 285598 15707 -40475 -72716 -66566 213063 46080 -205583
12001 37657 -109399 207117 -53060 -79216 -312481 -136612 -150507 52175 -377432 -117868
11990 -7699 -103459 -240660 4051 82481 -270470 32020 -183519 175449 -23697 149897 41296
$$ packed form
12071A51502Q5468c9852k65887a12074j8114L2822F8032R3682a32710C82729A75574
12059A89614a77165C78952H2090a05740B89235H2119b07506F6487O2827a2302
12048b32675f4272A6972L7883g4126A27615b89826A19656a36602A87854H3587
12037G3732b69268R2034A49425k768O5445f5149B79700j01205i9405l78703A6700
12025I4637P9172b23603F2732J9046a4720C16518H8364J23171D8823c737B25344
12013b89274A8620J69427m4610J42161A5707d0475l2241O150B13063D6080b05583
12001C7657a09399B07117e3060k6156k33265a36612j3895E2175c77432a17868
11990g699r5760j37201D051P8430b70470C2020a83519A75449b3697A49897D1296
$$ plain form
11978 -322802 29459 27501 -98011 16476 14593 316837 -17535 -181617 -147255 -142800 32758 -129141
11965 -30054 -84213 88628 17333 -122112 -163543 -210824 -270974 -66385 -7507 -154615 10715
11953 -227758 -290576 6548 -89480 -110114 -229961 182686 -23646 -32254 30680 -324472 173121
11941 73838 -346354 -87128 222718 -73810 -56720 -124829 -200831 -66215 -203238 -118615 20750
11929 108618 -175098 47080 -138616 34140 115392 -40547 -28152 -35513 -310520 -261970 -118487
11917 -243902 52271 10713 257391 56420 101047 6274 -151347 -407544 -150722 -21013 156796
11905 342476 -30303 -44276 77466 221500 -91989 160692 88895 32036 -244338 -90028 68136
11893 -274443 55386 -118623 -19762 175785 173613 -206876 264307 -127179 -171960 88810 -88424
$$ packed form
11978c22802B9459j958i8011A6476j883L02244a7535j64082L4362M455C2758a29141
11965c0054n4159H8628A7333a22112m1431m7281o0150f6385g507j47108A0715
11953b27758o2818F548h9480k0634j19847A82686b3646q608C0680c24472A73121
11941G3838c46354h7128B22718g3810J7090o8109p6002f6215j37023Q4623B0750
11929A08618a75098D7080a38616C4140Q1252d0547J2395p361k75007M8550a18487
11917b43902E2271A0713K46678E6420M4627F274a51347k56197a50722b1013A56796
11905C42476c0303j3973G7466J44034i1989A60692p1797C2036b44338i0028F8136
11893b74443E5386a18623a9762A75785k172b06876B64307a27179m4781H8810h8424
$$ plain form
11881 -122372 -179154 46076 21962 -88864 -266520 263905 92320 53168 33257 -53537 206595
11869 43710 -70081 -300290 -297894 -218792 -54422 -119794 165597 17588 -79167 96757 18803
11857 -81551 -376443 39159 -191947 52217 -208866 -886 -320902 -126654 -14193 58588 -85498
11845 -38564 24274 -164772 142885 -126010 35782 -30619 -198426 -180761 111433 101401 -36502
11833 -37011 49565 -166353 127915 44499 -193529 -532772 122505 -6236 -312633 -241987 -180103
11822 -180103 -126016 88652 377873 -144670 -174543 137117 -248702 -108762 -170315 116162
11811 -88081 113059 -80245 -279906 96487 102296 -216677 3154 59648 42202 -150477 85757
11799 -283739 -17128 -252648 23022 73135 112008 -19276 -103895 -74090 -21255 -77393 -144100
$$ packed form
11881a22372n6782D6076B1962h8864j77656B63905I2320l9152j9911e3537B06595
11869D3710g0081k30209K396P9102e4422o5372A65597A7588g9167I6757A8803
11857h1551k94892C9159a91947E2217b08866h86l20016a26654a4193E8588h5498
11845c8564B4274a64772A42885a26010C5782c0619j67807J7665A11433j0032c6502
11833c7011D9565a66353A27915D4499a93529l39243A22505f236l06397P0646O1884
11822a80103N4087H8652K89221a44670k9873A37117b48702a08762o1553A16162
11811h8081A13059h0245j99661I6487N809b16677C154N6494j7446a50477H5757
11799b83739a7128k35520B3022N0113L8873a9276q4619K9805b1255n6138o6707
$$ plain form
11788 -144100 26837 -97405 259419 -204055 38984 -8098 -202198 212777 -252113 -137700
11778 -137700 -97961 -63727 170494 -13984 95246 -61033 -79072 136719 92014 221496 -245975
11766 445425 162909 116594 -102529 -83653 341229 -58542 21250 -48269 59208 106910 37514
11754 41727 -66976 5332 109382 173779 -5377 -41861 329234 -63108 373455 205752 14787
11742 210899 -173699 -55945 -14717 54302 -179493 83591 171390 -16442 -106522 121707 -267997
11730 -134510 -54329 -159971 61541 335054 201269 -142587 -34901 109765 -43797 -363976
11720 -363976 57390 185580 -41107 86530 -108119 24386 208991 -11756 119595 46542 144709
11709 144709 115486 -153226 67024 218141 -34461 -25296 230173 -143286 -298530 166245
$$ packed form
11788a44100B6837i7405B59419b04055C8984h098j94100B12777b52113J14413
11778a37700L9739L4234A70494a3984I5246f1033j8039A36719m4705J29482b45975
11766D45425A62909m6315a02529J8876C41229e8542B1250d8269E9208M7702C7514
11754D1727f6976E332J04050O4397e377l6484C29234f3108C73455j67703A4787
11742B10899a73699e5945a4717E4302a79493H3591Q7799a6442r0080A21707b67997
11730a34510e4329j05642F1541K73513j33785a42587c4901A09765d3797l20179
11720c63976E7390J28190d1107H6530a08119B4386J84605a1756A19595D6542R8167
11709A44709k9223a53226F7024J51117c4461R165B30173a43286j55244A66245
$$ plain form
11698 -56577 109659 197116 29651 30269 -15596 -40658 109302 -19607 65022 -211369 -50037
11686 -77080 157839 96171 64593 24533 -248513 -264144 277724 -108681 -177859 106563 -72960
11674 148538 -27903 104997 61022 -281632 -150721 -30334 -92589 47980 -12766 33526 -176861
11662 86148 -73120 -335538 -241659 -188899 128838 95493 -73256 -50533 38628 -10675 -93526
11651 -93526 167966 85019 147990 -104967 86050 -27819 26950 -182908 346313 -75990 -142350
11640 -142350 -174401 -103627 16708 161548 202600 -202457 94163 211548 67503 -99067 46621
11628 416870 196221 -226914 145278 139061 -28185 -339734 -197219 246042 31975 191627
11618 191627 -293044 -45630 -50142 -183512 -46572 -38063 186402 -18233 311146 -19943 -25196
$$ packed form
11698e6577A09659Q7457B9651O18a5596k5062A09302a9607F5022b11369e0037
11686g7080A57839o1668l1578B4533b48513j5631B77724a08681o9178A06563g2960
11674A48538b7903A04997m3975b81632J30911c0334o2255D7980a2766C3526a76861
11662H6148g3120k62418R3879N2760A28838l3345g3256K2723C8628a0675q2851
11651i3526A67966q2947O2971a04967H6050b7819B6950a82908C46313g5990o6360
11640a42350l2051P0774A6708J44840M1052b02457I4163J17385F7503i9067D6621
11628D16870A96221b26914A45278o217b8185l11549J42515B46042C1975J59652
11618A91627b93044d5630m512j33370d6572Q509A86402a8233C11146a9943n253
$$ plain form
11607 -25196 -193241 155138 -212989 -177273 -29352 -252931 86373 -156361 -128832 -12419 161467
11595 128625 -14850 -164922 281052 108223 264092 124627 -101673 -196491 -62186 435371
11584 -48511 360520 -104636 92721 270017 100678 34003 164302 5257 -67420 -152932 198283
11572 527446 -56534 -215471 122827 -233872 134983 -320090 29635 -178765 -194294 -25905
11561 52890 -57815 12555 50502 -130733 165628 358676 -53250 -109811 143015 -60673 -99733
11550 -99733 163914 -228601 252733 42592 218767 -188763 -172795 -175574 -33192 -12948 -44934
11539 -44934 -259925 18830 47684 111062 3786 345020 -283382 -173383 117793 287666 21502
11527 3394 -268293 193490 192224 90284 -90714 -181895 -152612 22928 39534 -102888 145499
$$ packed form
11607b5196j68045A55138b12989L5716b9352k23579H6373a56361K7529a2419A61467
11595A28625a4850j50072B81052A08223J55869A24627a01673r4818f2186D35371
11584d8511C60520a04636I2721J77296A00678C4003J30299E257f7420q5512A98283
11572E27446e6534j58937A22827b33872A34983c20090B9635a78765j5529b5905
11561E2890e7815A2555L7947a30733A65628J93048e3250n6561A43015f0673l9060
11550i9733A63914b28601B52733D2592J76175a88763J5968k779c3192a2948l1986
11539d4934k14991A8830K8854O3378C786L41234b83382J09999A17793J69873B1502
11527C394b68293A93490j266I0284i0714r1181K9283B2928J6606a02888A45499
$$ plain form
11515 -66733 -71322 95765 77924 214859 -228472 -109797 254559 232607 -111836 -99164 -371354
11504 -371354 195701 -8058 44752 219432 39191 384323 224384 96104 207314 -59222 101898
11492 210233 59671 264728 -420209 44121 84172 -14886 144075 239327 196569 246278 329188
11481 329188 266434 -19581 201024 171366 122593 52417 249236 343521 292118 282980 -61035
11469 -109875 355893 286346 -88049 401015 415684 15181 -18472 210277 158280 49865 24225
11457 144045 73037 148849 393049 -43136 120768 225176 -44012 107039 148593 -62448 95121
11445 -64722 174855 156883 4994 319988 74140 -21271 151709 84270 107243 107759 -41388 -14829
11432 34069 -340717 -93314 94561 39013 -66001 -211202 -58788 385491 -53771 4510 62484
$$ packed form
11515f6733m589I5765j7841J36935b28472a09797B54559k1952a11836J2672k72190
11504c71354A95701h058D4752J74680C9191L45132j59939I6104J11210e9222A01898
11492B10233E9671K05057d20209D4121M0051a4886A44075R5252m2758M9709Q2910
11481C29188o2754a9581B01024k9658m8773E2417J96819R4285n1403r138f1035
11469a09875C55893o9547h8049D01015J4669A5181a8472B10277n1997D9865B4225
11457A44045p1008P5812K44200d3136A20768J04408d4012A07039M1554f2448I5121
11445f4722A74855j7972D994L14994G4140b1271A51709o7439K2973N16d1388a4829
11432C4069c40717i3314I4561C9013f6001j45201e8788C85491e3771D510N7974
$$ plain form
11421 62484 -195758 -31285 -85048 162334 6061 321359 -240061 -46013 -184203 -297467 -105309
11409 86703 181347 26770 -93293 -60611 -227287 131570 299978 26421 18372 81311 114819
11398 114819 71963 -25840 -127520 49942 331167 212053 1923 -187804 74248 55086 -287500
11386 -99251 -316908 -16078 -87842 -58092 -241974 -5558 -154665 -33458 -406393 201726 87063
11374 -158889 188660 -96982 151846 -7683 244101 -16417 -242445 182435 -33902 177271
11363 462365 149724 -75921 -189583 -274506 146176 -100669 -187244 -85434 177886 137087
11353 137087 189385 213712 48057 -182887 236576 -109673 156906 -328056 -59094 -150238
11343 -150238 364457 134731 210894 161791 274557 17255 72851 -368381 -214139 -10425
$$ packed form
11421F2484a95758c1285n3763A62334F061L15298b40061d6013j38190j13264a05309
11409H6703R4644B6770i3293L2682j66676A31570J68408B6421q049O2939L3508
11398A14819m2856b5840j01680D9942K81225j19114A923a87804G4248j9162b87500
11386i9251k17657a6078p1764K9750j83882e558j49107c3458l72935B01726H7063
11374a58889A88660i6982A51846g683B44101a6417k26028A82435c3902A77271
11363D62365A49724g5921j13662q4923A46176a00669q6575h5434A77886m0799
11353A37087N2298K4327D8057a82887B36576a09673A56906c28056e9094r1144
11343a50238C64457A34731P6163m9103J12766A7255N5596c68381J54242a0425
$$ plain form
11332 -82202 -269330 -47125 -8180 -287807 37625 189612 -21313 3167 160226 -111716 282684
11320 -83659 -1798 110181 113049 -112314 90992 -118408 -60907 195073 153836 -275528 108963
11308 376603 -142311 -198593 -75380 -161941 -339336 149142 -334894 -92912 21013 -130076
11297 -250984 -4351 89595 -182222 32581 12242 186323 -60315 -63209 56018 -53314 78107
11285 283382 -57862 15272 -285841 230309 155286 -8789 -101717 -122211 -188759 113207 3400
11273 -124605 42392 5902 -197918 -202635 253860 -48306 -498052 -393796 6329 22705 191533
11262 191533 -68525 -55072 40545 -455405 -147325 -85177 -190339 -404544 19519 -160864
11251 101346 60725 260854 -240626 -32564 -241822 169305 -187573 63657 483161 -104729
$$ packed form
11332h2202j87128d7125h180k79627C7625J51987b1313C167J57059a11716B82684
11320h3659a798A10181K868a12314I0992a18408N7501A95073m1237b75528A08963
11308C76603a42311n6282g5380q6561j77395A49142c34894i2912B1013a30076
11297b50984d351H9595a82222C2581A2242J74081f0315k894E6018e3314G8107
11285B83382e7862A5272b85841B30309p5023h789r2928k0494o6548A13207C400
11273a24605D2392E902a97918m717B53860d8306m49746J04256F329J6376J68828
11262A91533f8525J3453D0545d55405a47325O2148j05162k14205A9519a60864
11251A01346m0621K00129b40626c2564k09258A69305a87573F3657M19504a04729
$$ plain form
11240 -45230 -168967 -98117 111344 79521 -83711 -62081 -89878 -221668 -94115 83854 407338
11229 407338 -90742 -244362 -116153 -86712 -22886 222721 -179784 18387 45951 282903
11219 282903 -428740 -57874 -26446 17852 -42572 -211072 -143330 187044 -214216 100007
11208 -201631 -7484 324609 119070 72091 92411 189121 -290571 14544 -202019 -39092 249205
11196 -64108 -166802 -168832 -154028 -59670 113966 -163368 -33272 -29246 222086 177129 -75772
11184 -61859 -173246 -172427 357115 204058 93093 12640 117997 -93367 150750 254458 -151481
11172 19583 198480 -101559 -186668 -33371 -34934 -44086 -149861 -184274 -56831 -137139 15521
11160 -119732 -22077 -295017 -463675 6580 -277740 -22366 -143151 -211437 -173369 -136608 -327017
$$ packed form
11240d5230j23737P0850A11344l1823h3711K1630k7797j31790i4115H3854L23484
11229D07338i0742j53620a16153K9441b2886B22721a79784A8387K7564K36952
11219B82903d28740e7874b6446A7852d2572j68500O7742A87044b14216A00007
11208b01631g484C24609A19070m6979K0320R6710b90571A4544b02019c9092B49205
11196f4108j02694k030J4804e9670A13966a63368c3272M026B22086m4957g5772
11184f1859j11387Q19C57115j53057I3093A2640J05357i3367A50750J03708a51481
11172A9583J78897a01559q5109c3371j563r152j05775l4413e6831q0308A5521
11160a19732b2077k72940j68658F580b77740b2366j20785o8286L8068L6761j90409
$$ plain form
11149 -327017 254791 -301377 218762 149682 189763 -200654 -8037 257568 65592 209719
11139 209719 222708 -262875 114551 535015 90563 178173 67156 -47352 64394 -110939 217134
11127 -340643 190542 300390 141331 96082 -422333 -61616 -82744 -116101 45436 -94258 -335913
11116 -335913 -180189 -211853 132139 -147512 -186837 91646 269135 131882 -80633 581 -83681
11104 207838 157001 439257 38677 -77069 251438 137309 110733 -109518 707777 168333
11093 254850 -82703 241385 256373 204666 246580 18644 149054 259198 417420 195243
11082 185142 26277 108293 133850 213210 325461 -133881 531322 55948 91747 68747 570055
11071 570055 7640 -34248 338414 85787 83962 257704 273113 167676 110201 -1247 440240
$$ packed form
11149c27017B54791c01377B18762o9080M0081b00654h037B57568F5592J44127
11139B09719J2989b62875A14551M20464I0563Q7610F7156d7352F4394a10939B17134
11127c40643A90542J09848A41331m5249d22333f1616k1128l3357D5436i4258k41655
11116c35913J55724l1664A32139a47512l9325I1646J77489A31882h0633E81h3681
11104B07838n0837K82256C8677g7069B51438j14129k6576a09518G07777A68333
11093B54850h2703B41385J4988n1707M1914A8644J30410J10144J58222A95243
11082A85142B6277Q2016K5557P9360J12251a33881E31322E5948L5799k3000N01308
11071E70055G640c4248C38414H5787j825J73742J5409j05437n7475a247D40240
$$ plain form
11059 575790 710772 667111 390393 763838 729315 554743 448300 609308 451874 955315
11049 955315 615420 659805 632456 512029 541686 546073 396569 597843 638532 663727 643351
11038 643351 316316 721803 311278 209138 755698 500475 333005 376633 688945 617302
11028 617302 277743 689578 610020 490212 684515 588395 427196 496154 396628 690160
11018 690160 497348 509063 626793 542119 616251 526946 590115 732176 313745 507722
11008 507722 301945 925062 643831 436331 457946 56716 566254 738201 511084 246884
10997 469701 327423 373601 362574 876380 477333 756725 477145 746036 617173 767756
10987 767756 508203 953548 1145342 610401 581436 855930 843730 690308 1075659 1504851
$$ packed form
11059E75790J34982m3661k76718L73445l4523j74572j06443J61008j57434N03441
11049I55315l39895M4385k7349j20427K9657M387j49504K01274M0689K5195k0376
11038F43351C16316M05487C11278j02140N46560k55223j67470M3628L12312p1643
11028F17302B77743M11835p9558j19808J94303r6120j61199O8958r9526K93532
11018F90160j92812J1715J17730q4674P4132q9305O3169J42061C13745J93977
11008E07722k05777O23117k81231k07500K1615E6716N09538J71947k27117B46884
10997D69701j42278M6178j1027N13806l99047K79392k79580K68891j28863J50583
10987G67756k59553M45345J91794n34941k8965K74494j2200j53422L85351M29192
$$ plain form
10977 1504851 1511184 1145410 1705609 1704623 2336781 2259338 2464412 2636929 2319652 1920106
10967 1920106 1989411 1957401 1351633 1549222 1085187 1520603 1469239 1333411 1467074 1316875
10957 1316875 1555304 1578546 1388748 1265709 1300714 796762 1210728 790266 521435 867963
10947 867963 596049 601912 91765 395055 72507 152893 24438 128467 368207 92583 -12838
10935 -43244 264196 -46432 80794 -175428 -137336 481679 -258502 121522 27888 133474
10925 133474 -123746 63948 -112069 -202122 146008 477409 34117 11685 180942 -36953
10914 391208 188024 157723 127773 232471 -128250 25911 -28729 -93554 126556 301256
10904 301256 -136590 -280971 -31347 -261123 -461675 328851 174764 19415 -65872 -160056
$$ packed form
10977A504851O333l65774N60199r86O32158p7443K05074J72517l17277l99546
10967A920106O9305l2010o05768J97589m64035M35416n1364j35828J33663j50199
10957A316875K38429K3242j89798j23039L5005n03952M13966m20462k68831L46528
10947H67963k71914N863I1765L03290G2507Q0386B4438J04029K39740I2583a2838
10935d3244B64196d6432H0794a75428L8092D81679b58502A21522B7888J05586
10925A33474a23746F3948a12069r0053A46008L31401C4117A1685J69257c6953
10914C91208A88024l0301k9950J04698a28250B5911b8729o4825A26556J74700
10904C01256a36590j44381c1347k29776k00552C28851j54087A9415f5872r4184
$$ plain form
10894 -160056 -80064 35538 -233190 32852 -92063 -66848 168682 -61505 -128486 -470718 -1719
10882 -23100 -99018 96064 298409 34456 55965 -18406 243052 -108749 -51322 -149573 -123027
10871 -123027 -107036 -8932 -122020 -420332 29106 29965 -344723 9441 94136 107066 -114835
10859 -108726 110381 -196567 25028 124327 -131972 -78869 -95144 -82555 24591 -9163 117654
10847 -188507 77692 -153349 -152655 -39901 -156197 -202717 -212981 160819 21181 341082 -162709
10835 284494 -43080 121966 152975 -351474 33088 412224 378515 -240747 111614 245823
10825 245823 244621 -36241 158484 35171 -137246 -83802 -186438 -16678 36583 -163646 -415978
10814 -415978 -226323 -132956 -45130 185155 -150694 -44407 69604 43544 -139524 -273923
$$ packed form
10894a60056P9992C5538b33190C2852i2063K5215A68682f1505o6981l42232a719
10882b3100p5918I6064K02345C4456K1509a8406B43052a08749e1322r8251K6546
10871a23027J5991h932j13088k98312B9106Q59c44723I441Q4695J2930a14835
10859a08726A10381a96567B5028R9299a31972N3103j6275J2589B4591i163A17654
10847a88507G7692a53349O94c9901j16296m6520j0264A60819B1181L19901a62709
10835B84494d3080A21966L1009c51474C3088L79136l3709b40747A11614J34209
10825B45823j202c6241A58484C5171a37246N3444j02636a6678C6583a63646k52332
10814d15978J89655R3367d5130A85155a50694d4407F9604k6060a39524j34399
$$ plain form
10804 -273923 256665 26462 80811 -63529 7235 -51337 -211566 -91664 -124927 -50723 186602
10792 49352 -239956 11715 -53039 60841 -172992 -243979 -117054 -135998 -87278 152917 103722
10781 103722 10015 -94265 359610 -150011 -113790 -382598 -188762 -17010 108238 149635
10771 149635 265410 400007 355398 -156960 -8844 -272555 109115 77077 -205785 -17904
10760 -140747 7946 27359 55865 294225 -160506 42255 -65488 -35949 178061 -293365 -46561
10748 -123789 -108538 -91302 -163977 189271 -255830 -79857 58666 27680 -65643 -109244 -182887
10737 -182887 -209278 45823 133842 -112924 33631 -212895 -65869 -68526 61379 -199495 -292469
10726 -292469 93015 -10203 -132027 5627 -12038 201693 -144319 1058 -518466 68432 122905
$$ packed form
10804b73923B56665B6462N4349f3529G235e1337j60229i1664l3263e0723A86602
10792D9352b39956A1715e3039F0841a72992p0987a17054j8944M8720A52917m9195
10781A03722A0015i4265C59610a50011L6221k68808a88762a7010A08238M1397
10771A49635J15775J34597m4609a56960h844k63711A09115l2038b05785a7904
10760a40747G946J9413K8506K38360a60506D2255f5488K9539A78061b93365d6561
10748a23789J5251J7236p2675A89271b55830g9857E8666B7680f5643m3601p3643
10737a82887k6391D5823Q8019a12924C3631b12895f5869k657F1379a99495r2974
10726b92469I3015a0203j21824E627a2038B01693a44319A058e18466F8432N4473
$$ plain form
10715 122905 70691 -161382 77735 -305197 362591 71652 -113311 -448551 -195009 150718
10704 -76742 17472 -250186 -112772 -255085 277813 14982 -231479 -171968 95852 -52286 -89793
10693 -89793 -121404 -245398 -46601 -237883 -54301 -130109 -194876 92158 115190 46892 295301
10682 295301 -95673 213241 200207 20051 -163940 152272 121403 -229454 -38061 230699
10671 -206697 22473 193117 -215723 -133174 -105902 -97573 3628 -197921 117410 172149 130787
10660 130787 -194790 -194057 -44847 29329 -45020 141555 -370957 -103791 -288286 -148268 -32144
10648 -26652 215569 -49740 213864 -100966 -296696 -144414 -60294 325583 -311897 -84779
10637 -114662 89006 -133573 -21736 46529 -25850 -282741 -7060 -24268 -188225 171864 -24739
$$ packed form
10715A22905n2214a61382G7735c05197C62591G1652a13311l35240a95009A50718
10704g6742A7472b50186a12772j42313B77813A4982b31479N9511I5852e2286l7507
10693h9793l1611j23994d6601j91282e4301p5808o4767I2158K3032D6892K48409
10682B95301i5673B13241j3034B0051a63940A52272l0869b29454c8061B30699
10671b06697B2473J70644b15723Q2549K7272Q329C628a97921A17410N4739m1362
10660A30787a94790P33d4847B9329d5020A41555c70957a03791j84495J40018c2144
10648b6652B15569d9740B13864a00966j95730a44414f0294C25583c11897h4779
10637a14662H9006a33573b1736D6529b5850k56891g060j7208j63957A71864b4739
$$ plain form
10625 -37010 102241 -243545 -41512 -88445 259117 6062 -80229 -177119 -119895 -216731 -73638
10613 2953 -125865 14471 -50902 -104951 -30599 -131510 22194 41600 -74204 147156 97384
10602 97384 222147 -101951 -5725 47999 190142 -275484 -81218 -142001 -215699 -108163 166918
10590 -21864 -70113 -53595 -155792 213945 103846 -7431 -133842 28090 -113394 -215725 -278592
10579 -278592 135700 22236 49124 -65983 -280896 -53940 -264042 -1782 112173 29146 -307608
10567 -177067 -167955 18144 -39233 -190663 -64146 -123273 -54372 -563979 -21579 487817 -35578
10555 -49145 -141575 -84469 -177035 -2138 -77180 -5606 109498 420560 53045 235094 -115313
10543 -149767 -181756 -43714 -160109 -152289 -79159 104450 -242816 -116760 119829 -10762 -153858
$$ packed form
10625c7010A02241b43545d1512m6933B59117F062h0229r6890N7224r6836g3638
10613B953a25865A4471e0902n4049c0599j00911B2194J9406g4204A47156m9772
10602I7384J24763a01951e725D7999J42143b75484h1218o0783p3698J07536A66918
10590b1864m8249J6518j02197B13945A03846g431j26411B8090a13394j02331o2867
10579b78592A35700B2236K6888f5983k14913e3940k10102a782A12173B9146c07608
10567a77067R112A8144c9233j51430f4146n9127e4372n09607b1579D87817c5578
10555d9145r2430N7106r2566b138p5042e606A09498L11062E3045J82049a15313
10543a49767l1989d3714j16395P820P3130A04450b42816a16760A19829a0762j43096
$$ plain form
10532 -153858 -90506 -453234 77153 -397377 -287072 -66436 -273316 -123452 103691 -88605
10521 -142210 361636 72803 199848 -329348 97706 251336 -2021 33296 -181685 61085 299252
10510 299252 102814 423192 33483 -140980 195273 4448 -1949 141609 -89703 67224 -89638
10498 194221 -83452 317301 38161 110811 -13794 -246634 204339 -330824 -107953 -496038
10488 -496038 -46440 -233125 159785 43160 160099 33528 -137737 126435 365914 409959
10478 409959 452778 267962 271403 -237367 134814 -130657 244754 19116 178796 -230762
10467 -10960 -33759 -512371 213923 -224026 -21858 277045 122788 -152576 30031 345991
10457 345991 -95974 8726 52451 -5261 -357716 -44427 117291 -84443 -123520 -91541 -259720
$$ packed form
10532a53858O3352l62728G7153c97377J10305f6436k06880a23452A03691h8605
10521a42210C61636G2803J27045c29348I7706J53630b021C3296a81685F1085K38167
10510B99252A02814L20378C3483a40980A95273D448a949A41609h9703F7224h9638
10498A94221h3452C17301C8161P2650a3794k32840B04339c30824a07953l88085
10488d96038d6440j86685A59785D3160J16939C3528a37737A26435K39479M4045
10478D09959M2819j84816L441b37367A34814a30657B44754A9116J59680b30762
10467a0960k2799m78612B13923b24026b1858B77045A22788a52576C0031L15960
10457C45991i5974H726M3725e261l52455d4427A17291h4443l9077L1979j68179
$$ plain form
10446 -259720 -16473 180712 110730 130608 -148077 -123099 -251176 -186761 -88642 22231 -63561
10434 -190522 -13384 -202010 76665 -28172 21363 -9977 32150 32329 -17174 26525 -9787 -50027
10422 -50027 -18850 -50137 -328182 -64137 -60196 -434836 -40197 76317 -2258 140388 -24509
10410 -129630 208395 -20542 -15291 -201030 -94064 105217 7026 -103873 -36836 92786 82661
10399 82661 205373 147741 165869 194151 -38792 306370 48112 -51062 -84892 -44161 176848
10387 -63820 10506 176325 -108035 -28589 237900 66989 175753 144890 101133 469896 230148
10375 523540 172221 239703 14617 -180924 19844 9026 225270 160960 413654 709386 -23921
10363 129863 166101 233705 -44078 45328 8020 97472 -308928 94271 4974 -100091 119218
$$ packed form
10446b59720a6473A80712o9982J9878a48077K4978j28077O4415h8642B2231f3561
10434a90522a3384j88626G6665b8172B1363i977C2150J79a7174B6525i787m0240
10422e0027a8850l1287k78045f4137L941l74640d0197G6317b258A40388b4509
10410a29630B08395b0542N251j85739i4064A05217G026a03873c6836I2786j0125
10399H2661J22712n7632J8128K8282c8792C06370D8112e1062l3830M0731A76848
10387f3820A0506J65819a08035b8589B37900F6989J08764l0863m3757L68763B30148
10375E23540A72221O7482A4617a80924A9844I026K16244o4310K52694K95732b3921
10363A29863L6238O7604d4078D5328H020Q9452c08928I4271D974a00091A19218
$$ plain form
10351 583892 205576 407007 307064 361644 192955 313234 286264 140103 288386 328437
10341 328437 394738 138310 234123 345339 250273 8372 438189 268923 309001 -62111 229713
10329 189433 31396 -79879 -12323 93380 -143142 131724 589402 9257 231001 109559 -355892
10317 317144 -256739 -32185 -46517 -244442 -95604 105120 -51599 -101781 -157716 189393 -106023
10305 91448 -6196 62783 167780 4431 -65732 -44267 82225 143057 35512 -52506 247096 75847
10292 113438 -422956 -208002 -246296 67420 97667 38724 -181998 -206434 -258179 -293204 -256714
10281 -256714 -45068 -43940 179575 -336617 -83478 -151728 -94916 -295117 69858 -49388 7763
10269 -110274 -172617 142012 -156341 76649 -156262 117830 -60261 -167241 -1704 -47556 87593
$$ packed form
10351E83892B05576K01431r9943N4580j68689J20279k6970A40103J48283M0051
10341C28437O6301A38310R5813J11216r5066H372M29817j69266M0078f2111B29713
10329A89433C1396g9879a2323I3380a43142A31724M57678I257K21744A09559c55892
10317C17144b56739c2185j4332j97925i5604A05120e1599n0182n5935A89393a06023
10305I1448f196F2783J04997D431f5732K1465H2225O0832C5512e2506B47096G5847
10292A13438d22956b08002l8294F7420L0247C8724a81998k4436n1745l5025L6490
10281b56714d5068J128A79575c36617h3478o8250N6812k00201F9858d9388G763
10269a10274o2343A42012a56341G6649a56262A17830f0261j06980a704m5852H7593
$$ plain form
10257 148848 378296 152837 593018 304167 251065 -74501 346474 152220 38127 339480
10247 339480 99962 -132424 -223005 178143 61960 -89988 -229402 49732 132742 -414219 -333790
10236 -333790 -168638 -41679 326181 -37753 52212 -75507 -86349 111807 -167067 -147158 170349
10224 -242163 -132409 -100874 -462656 -128106 -203090 10040 -130675 -184803 96103 -35306 -68647
10213 -68647 -57225 -273256 -8169 -53797 -54637 76074 8428 -463695 95029 132369 146389 -89181
10200 -181784 380228 12697 -336025 -88492 -18942 314273 -306035 -203198 -17289 13667
10189 -174416 47811 -259876 -243977 -84337 240545 185818 112212 104332 -340874 -333374 4405
10177 -27366 -110131 106322 -258456 -203703 364026 2569 -52980 54301 57607 -402049 -28914
$$ packed form
10257A48848K29448A52837M40181k88851n3102g4501C46474A52220C8127L01353
10247C39480I9962a32424r0581A78143F1960h9988j39414D9732Q3010d14219Q0429
10236c33790J65152d1679C26181c7753E2212g5507j0842A11807a67067J9909A70349
10224b42163J09754L1535l61782a28106p4984A0040a30675n4128I6103c5306l3341
10213f8647J1422k16031h169m5628q40G6074H428d63695I5029L7340J4020h9181
10200a81784C80228A2697c36025h8492a8942C14273c06035J02837a7289A3667
10189a74416D7811b59876J5899h4337B40545n4727p3606p880c40874P500D405
10177b7366q2765A06322b58456N4753C64026B569e2980E4301L306d02049b8914
$$ plain form
10165 93876 -75309 -98811 -102506 -126517 -64023 -260851 113647 15830 148390 15912 -235160
10153 91243 -26600 -30239 -138223 -105781 331561 72947 -311168 -304993 128524 -75211 -93061
10142 -93061 -98860 44927 -248621 39620 -194844 67731 91886 90042 -144326 718890 -221768
10130 69116 -42168 -39042 -119891 275974 -152704 372992 -121711 57413 -121480 -46988 140468
10118 141802 -245241 -121308 23539 -210643 15131 -187585 -136100 -44619 -284260 111677
10107 -59925 230069 -276952 -96200 66332 -148678 -296886 -65469 -122721 83327 -85625 -47285
10096 -47285 -271399 85574 -65414 -315528 44168 181675 25364 128400 266491 272260 -190707
10084 301232 93237 -260695 171370 -402773 -235783 -19263 -372301 -241480 -113504 240019
$$ packed form
10165I3876g5309k3502l695k4011O2494j96828A13647A5830J32560A5912b35160
10153I1243b6600l639j07984L2442C31561G2947c11168O175A28524g5211j7850
10142i3061n799D4927b48621C9620a94844F7731K4155j844a44326G18890b21768
10130F9116d2168L126q0849B75974a52704C72992a21711E7413a21480d6988A40468
10118A41802b45241a21308B3539b10643A5131a87585N1485d4619k39641A11677
10107e9925B30069b76952i6200F6332a48678j48208f5469n7252H3327h5625L8340
10096d7285k24114H5574f5414k50114D4168J37507B5364J03036J38091N769a90707
10084C01232I3237b60695A71370d02773J66990a9263l53038J30821a13504B40019
$$ plain form
10073 -312520 -42866 -260288 -254369 55508 -75476 -130522 -78292 -209274 -351848 -222758 183286
10061 273206 88528 -132110 -46558 20191 -84612 -18677 102188 4960 -16524 -119408 15844
10049 -90447 182108 153116 -245021 -114665 -36828 111120 84713 -298992 -154566 -19063
10038 131987 -61195 54913 34304 175682 -321538 -275139 93759 -190556 -272939 81588 23716
10026 -268408 -75025 -80069 111047 183288 -160159 26949 -78990 305735 3666 -58460 -359627
10015 -359627 228538 -111565 -111926 -203142 46201 -17976 -247796 211670 -151072 -125501 -4217
10003 -158357 22899 16494 -41569 43891 73775 23907 23932 -5049 -274229 71779 35136 -14157
9990 102260 -300088 -145435 58760 -388172 -142654 -244838 205848 -142241 -83263 1389
$$ packed form
10073c12520d2866k17422N919E5508g5476n5046N2230j30982j42574J29090A83286
10061B73206H8528a32110d6558B0191h4612a8677A02188D960a6524j02884A5844
10049i0447A82108k8992b45021a14665c6828A11120k6407b98992J44426a9063
10038A31987f1195E4913k0609J41378c21538M6399I3759a90556q2383H1588B3716
10026b68408g5025n044A11047P2241a60159B6949g8990C05735C666e8460l01167
10015c59627B28538a11565l61r1216D6201a7976k29820B11670a51072K5571d217
10003a58357B2899o405d1569D3891K9884B3907K5e049k69180G1779C5136a4157
9990A02260c00088a45435E8760c88172a42654j02184B05848a42241N8978A389
$$ plain form
9979 -191695 42510 -33689 -188297 -279609 -102338 -97874 -153934 17391 -128193 -329352 -61004
9967 195367 -18293 -396534 -356 -126888 812 24180 -53577 -37090 -514242 -269299 -37607 -165395
9955 -165395 -147550 23126 317867 -102338 1278 66327 -129466 97972 -164323 132538 -31655
9943 86600 18535 -209533 -241551 -3811 -235711 212073 -185688 -148758 -79922 -319122 -118348
9931 -177649 -128775 -67287 -106072 -406404 -154242 -43570 -210483 -84102 -220936 -13660 -247418
9920 -247418 173002 -75284 -70995 -28841 38177 -188688 -98321 -170480 176260 41545 -12234
9908 219524 -85667 -210553 -282525 -68339 -72783 164646 -166005 -262687 -19697 -30924 -138550
9897 -138550 27250 -221037 11748 -155234 -196408 -513541 -10668 784 228656 -150662 -103510
$$ packed form
9979a91695D2510c3689j54608r1312a02338M464n6060A7391a28193k01159f1004
9967A95367a8293l78241c56j26532H12K3368e3577J6487m77152K44943c7607j27788
9955a65395J7845B3126K94741a02338A278O5049a29466I7972a64323A32538c1655
9943H6600A8535b09533l2018c811k31900B12073a85688L6930O8836k39200a18348
9931a77649M8874O1488l8785l00332a54242d3570j66913h4102j36834a3660k33758
9920b47418A73002g5284M289b8841C8177a88688R0367p2159A76260D1545a2234
9908B19524h5667j24886p1972f8339m444A64646a66005r6682a9697j1227j07626
9897a38550B7250b21037A1748a55234m1174l17133a0668G84K27872a50662M7152
$$ plain form
9886 -103510 -19362 -39624 87496 191612 -176990 -164873 -23739 -50625 278516 -149522 -113326
9875 -113326 -45744 -49003 -62955 193632 -10424 -64032 116919 -6227 -65454 -83511 -74970 -170783
9863 -170783 -119368 -309199 16403 41745 -255732 55261 -278092 -108887 150728 -96570 -30395
9851 -32630 31707 -45161 -140103 -235144 -202772 -13755 -238456 -342477 -137362 -110400 -106105
9840 -106105 -206462 127110 -258582 -79391 98407 77239 -339914 -56027 111020 -8210 2099
9828 -317021 69546 -127905 17847 -171451 -178700 -461483 -176003 -137982 -42747 -17563 435261
9816 -34958 -153292 467489 195533 23017 224748 24404 135036 -143671 -20097 12108 80263
9805 80263 -162103 -199225 42394 -33399 -46525 -23600 44681 332514 -277994 -253312 -345196
$$ packed form
9886a03510a9362k0262H7496J04116a76990J2117b3739k6886B78516a49522L6196
9875a13326d5744l259j3952A93632a0424n3608A16919f227n9227j8057Q541r5813
9863a70783N1415j89831A6403K5342b55732E5261b78092a08887A50728i6570c0395
9851c2630C1707d5161r4942r5041L2372a3755k24701j04021a37362K6962M295
9840a06105j00357A27110b58582g9391I8407k1168c39914e6027A11020h210B099
9828c17021F9546a27905A7847a71451p249k82783a76003L8021d2747a7563D35261
9816c4958j18334D67489A95533B3017K01731B4404J10632a43671b0097A2108O8155
9805H0263a62103l7122D2394c3399j3126K2925D4681K87833b77994K4682r1884
$$ plain form
9794 -345196 -310059 176133 -184190 -29581 -189308 -38297 -193616 -290051 140581 35801 -347443
9782 104376 -82766 173075 -89699 4992 -40670 296535 -154342 192474 -132984 -180550 151264
9770 -108091 -350027 -131302 180168 125431 -225348 77124 -176851 -174488 -117606 22152 -226770
9758 -171124 17839 -135269 -334530 494997 -290919 -146041 -216874 -137913 -452582 -22647
9747 -84137 -254870 -102557 76311 108393 11087 159500 183622 5720 -48712 -117220 13035
9735 415477 434722 15585 229994 -46168 108076 280301 -137843 65460 -306592 -100235
9724 8251 -5128 42306 -152748 73579 -52050 81591 121822 -398729 -379008 189836 -304933
9712 159253 86957 9295 159219 -209229 -131920 119994 -187517 -227113 -68838 7323 -119997
$$ packed form
9794c45196L5137A76133a84190b9581j59727c8297j55319r6435A40581C5801c47443
9782A04376h2766A73075h9699D992d0670B96535a54342A92474a32984m7566A51264
9770a08091k41936a31302A80168n4737b25348G7124a76851K363N6882B2152b26770
9758a71124A7839a35269j99261D94997b90919J44878p0833P8961l14669b2647
9747h4137j70733a02557G6311L2082A1087J48413K4122E720d8712o8508A3035
9735D15477J9245A5585K14409d6168A08076J72225a37843F5460c06592a00235
9724H251e128D2306a52748G3579e2050H1591M0231c98729J9721A89836c04933
9712A59253p2296I295J49924b09229P7309A19994a87517l9596f8838G323a19997
$$ plain form
9700 -66156 -112303 58401 36512 69031 -170221 -189321 174383 -238511 -70550 -212147 -342058
9689 -342058 -248582 -8644 -32951 527238 -384260 -211367 -282370 261057 76296 -90919 -84409
9678 -84409 -238791 179505 66796 -128751 -92332 -24909 -225497 -98800 -273447 317865 -92154
9666 52062 -210336 -368321 -488424 -47861 -235332 90755 93741 -98975 31759 -227530 -308762
9655 -308762 -21296 160309 -182289 204446 67852 -154638 -64855 -96079 -30827 -139568 152635
9643 -66246 -33695 13535 122329 239685 -232895 -278964 -298820 -260427 39024 -72350 785 -125275
9630 91074 -39025 -199922 -234054 -49839 -19594 -189334 -338050 5042 -290573 201578 -53852
9618 327727 38317 200710 -123935 169440 -163544 -247709 -354441 161935 -87711 -384088
$$ packed form
9700f6156m6147E8401k1889L2519a70221j9100A74383b38511g0550j41597j29911
9689c42058R3476h644k4307E27238c84260J72893p1003B61057G6296i0919O510
9678h4409j54382A79505F6796a28751L6419b4909k00588i8800j74647C17865i2154
9666E2062b10336j57985j20103d7861j87471I0755K986i8975C1759b27530q1232
9655c08762b1296A60309a82289B04446F7852a54638f4855l1224c0827j08741A52635
9643f6246L2551A3535J08794J17356b32895m6069j9856L8393C9024g2350G85a25275
9630I1074c9025j60897l4132d9839a9594j69740j48716E042b90573B01578e3852
9618C27727C8317J62393a23935A69440a63544q4165j06732A61935h7711k96377
$$ plain form
9608 -384088 58587 81742 170417 26466 -319940 -88287 -117636 -181278 -97879 -110631 7854 92127
9596 92127 -110016 -75169 224091 102244 -262733 146251 -145749 93987 94053 -12661 -216193
9585 -216193 74140 -347291 103653 -209470 -98106 -52311 -195941 -77718 -26568 218600 330966
9574 330966 -248171 -8564 -216233 -114014 -120397 -253290 -239083 -34007 79645 158256 89712
9563 89712 -239092 369904 92669 -124080 14831 -24054 -222662 -371606 264810 -217308
9552 -388058 -19527 -534717 68727 -208321 219831 -407616 28057 75160 48404 48863 88027
9541 88027 99262 29846 133615 -279257 -121836 -246554 21013 -258329 -129919 -209740 -269381
9530 -269381 68799 -119068 -125953 -230092 38179 -284129 123148 43556 -92345 8272 -202555
$$ packed form
9608c84088E8587K3155Q8675B6466c19940h8287k9349o3642Q3399j2752G854Q4273
9596I2127a10016L4847B24091A02244b62733A46251a45749I3987O6a2661k03532
9585b16193G4140c47291A03653b09470i8106M5795j43630g7718b6568B18600J12366
9574C30966b48171h564k07669J02219o383j32893J4207c4007G9645P8611o8544
9563H9712b39092C69904I2669a24080A4831b4054j98608j48944B64810b17308
9552c88058a9527n15190F8727b08321B19831d07616B8057M7103k6756M59L9164
9541H8027J1235B9846J03769b79257a21836j24718B1013b58329J28410p9821n9641
9530b69381F8799a19068o885j04139C8179b84129A23148D3556i2345H272b02555
$$ plain form
9518 83568 -411108 177859 -32048 -114296 248037 -39759 -112218 -174894 -197230 23176 56991
9507 56991 71661 121315 -330747 53695 -97511 -80996 132005 12226 -151072 166773 -184339
9495 -211765 -19558 425734 33441 -83869 44604 167784 12874 70156 -101674 -197765 -49997
9483 -198382 -229519 109652 -129201 -97263 -59435 115622 175758 190779 126121 76416 71910
9472 71910 -212406 -383198 -185726 -1424 41036 -289817 -46894 96505 -198750 133089 -64353
9460 23490 47766 18913 -81508 67441 -180972 16594 -365964 -192515 -70652 -281235 22375
9448 150748 -16022 -21688 -77592 -177154 -107571 -216186 -165646 126367 -172450 259260 -110450
9436 -64805 -361163 -412325 -170640 -177846 -262455 -58197 70943 3843 44656 1353 -90852 -41058
$$ packed form
9518H3568d11108A77859c2048q2248B48037c9759p2459o2676k2336B3176L3815
9507E6991J4670M9654c30747E3695i7511J6515A32005A2226a51072A66773a84339
9495b11765a9558D25734C3441h3869D4604J23180A2874N7282a01674r6091d9997
9483a98382l1137A09652a29201L1938L7828A15622O0136J5021o4658m9705m506
9472G1910b12406j70792a85726a424D1036b89817d6894I6505a98750A33089f4353
9460B3490K4276A8913h1508F7441a80972A6594c65964J73449g0652k10583B2375
9448A50748a6022n666n5904r9562O9583j08615N0540A26367a72450B59260a10450
9436f4805k96358n1162a70640p206q4609e8197G0943C843M0813A353i0852d1058
$$ plain form
9423 -115377 14095 -272913 -39643 -120237 -30386 158450 -49952 13416 -150026 -43055 -269689
9412 -269689 -121974 25107 74244 -109357 -33996 81209 44994 91989 -124273 -424712 75874
9400 49034 -353569 130403 -224453 19287 -91276 206332 -127683 -200948 49800 -88668 -9887
9388 -110498 -59058 -52694 -163883 -250390 43095 -325355 -187880 -123486 -97038 -209096 158769
9376 204958 253669 363172 -85829 154608 -208140 12094 -171380 -282804 -236278 399922
9365 116902 -143552 -197269 60231 -40661 -175493 -121520 340833 129160 -217185 145638
9354 41332 240066 -73656 81608 106828 268906 -186879 192822 27856 -168369 -391566 -138466
9342 179776 501003 -162967 -23556 278904 -241765 178482 -375953 -245118 126008 87949
$$ packed form
9423a15377A4095b72913c9643q0594c0386A58450d9952A3416a50026d3055k26634
9412b69689a21974B5107M9137a09357c3996H1209l6215M6995a24273l00439G5874
9400D9034c53569A30403b24453A9287i1276B06332a27683p3265D9800h8668i887
9388a10498N1440O364j11189q6507D3095c25355J37475O4394K6448j12058A58769
9376B04958M8711J09503h5829A54608b08140A2094a71380j11424M6526C99922
9365A16902a43552n3717F0231d0661j34832N3973C40833A29160b17185A45638
9354D1332J98734g3656H1608K5220J62078a86879A92822B7856a68369k23197a38466
9342A79776L21227a62967b3556B78904b41765A78482c75953J30835A26008l8059
$$ plain form
9332 87949 72274 -72352 -110067 184624 125966 106872 25892 19063 -409442 4566 -135000 -125949
9320 -125949 96809 185492 250007 6894 111581 -128068 31722 8507 -9775 -71888 53893 -198682
9307 107053 -207707 164653 184954 -388153 -192976 -200848 -237933 -34529 -31081 -257979 -261697
9296 -261697 -28718 248953 -79044 -54174 -11278 -97258 -135637 -186101 381462 -46648 67718
9284 -30636 11779 -66021 101763 15068 62458 47074 7034 -204661 6185 -39715 -96661 -18799
9271 -208492 -272331 104048 -180518 -165450 -312675 188849 118258 44768 72867 -118463 -582629
9260 -582629 1867 -104256 -170110 33627 -215234 -348080 -92223 -130504 -68228 -144041 -95157
9249 -95157 -155664 -123061 -249411 -29186 -87034 106477 -80864 -264378 147649 11653 -6358
$$ packed form
9332H7949j5675g2352l7715A84624n8658j9094B5892o829d09442D566a35000R051
9320a25949I6809Q8683O4515F894J04687a28068C1722H507i775o2113E3893a98682
9307A07053b07707A64653K0301c88153a92976p872l7085c4529L448k26898l718
9296b61697b8718B48953g9044K4870a1278q5980l8379n0464C81462d6648F7718
9284c0636A1779f6021A01763A5068M7390j5384G034b04661F185c9715n6946a8799
9271b08492o3839A04048a80518J5068j47225A88849p0591D4768K8099a18463m64166
9260e82629A867a04256o5854C3627b15234j32846i2223l8281O2276p5813M8884
9249i5157o0507L2603j26350b9186n7848A06477h0864j83514A47649A1653f358
$$ plain form
9237 157307 16204 -126407 -258363 112063 164126 -79122 223141 -257675 158925 -347393
9226 -380238 88354 -140983 325168 28476 -208774 -103313 30371 -162840 -183366 -145029 74953
9214 86355 -69175 -140502 -169237 -75036 -127880 -124880 152446 -232242 -24425 182927 119396
9203 119396 -71327 -103331 -318647 -195912 91496 -10199 380947 25079 -18145 -89211 145969
9191 192403 -8453 -202628 30055 133415 -36677 -293834 -236641 -151799 178206 -118058 -244096
9180 -244096 35247 -726678 -35647 -125852 8752 -246149 -392275 -192506 41758 117177 92591
9169 92591 -76629 128456 -99579 60430 -125460 -341489 52675 -175835 -77216 -149081 -74239
9157 263512 -154822 -151758 -94710 155045 83163 -305799 -31722 -127361 -6468 -137842 -109157
$$ packed form
9237A57307A6204a26407j31956A12063N2063g9122B23141b57675A58925c47393
9226c80238H8354a40983C25168B8476b08774a03313C0371a62840k0526L8337G4953
9214H6355f9175p1327k8735g5036n2844L000A52446b32242b4425A82927o3531
9203A19396g1327l2004k15316J22735I1496a0199C80947B5079a8145p1066A45969
9191A92403h453j94175C0055J03360c6677k57157N7193Q4842A78206a18058j26038
9180b44096C5247g26678c5647r0205H752b46149j46126a92506D1758P5419k4586
9169I2591g6629A28456i9579F0430a25460k16029E2675a75835g7216p1865g4239
9157B63512a54822L064N7048A55045p1882c05799c1722r5639f468j31374K8685
$$ plain form
9146 -109157 151389 -186202 -350168 -236727 -96258 -276594 -26206 147663 -125250 -135873
9136 -135873 197009 -173879 329162 -186750 -107770 -33419 3616 73350 390111 -337599 85579
9124 -241111 -152905 -28585 -152671 -53645 -195431 213780 -146904 -42294 -33638 251235 -278895
9112 98638 41243 76009 -103564 -237171 -127240 -183140 -108234 50766 217792 -107219 58692
9100 94757 128268 -111011 -288262 67710 -335391 -203243 -375032 -121630 -56817 -82301 -21514
9088 -21081 -28652 -218315 143861 -46153 -117276 -17319 135586 -159329 48794 26225 -259059
9076 4625 -195981 -126136 84065 119102 138901 -132920 -162098 -464976 -15604 -90513 -358037
9065 -358037 -151179 25832 -17324 -1127 -343717 -34128 -170531 -99797 17230 -59615 -341828
$$ packed form
9146a09157A51389a86202j63966J13441i6258j80336b6206A47663a25250j0623
9136a35873A97009a73879C29162a86750P8980c3419C616O9734L16761c37599H5579
9124b41111Q8206b8585j24086e3645j41786B13780a46904d2294Q656B51235b78895
9112I8638D1243L4766a03564j33607J09931n5900P4906E0766J67026a07219E8692
9100I4757L3511a11011j77251F7710c35391J32148j71789a21630e6817k5484b1514
9088b1081p571j89663A43861d6153p1123a7319A35586a59329D8794k2569b59059
9076D625a95981O9845H4065L5037J9799a32920k9178l02878a5604p4909k67524
9065c58037a51179B5832a7324a127l42590c4128j36403P0734A7230e9615k82213
$$ plain form
9054 -341828 46040 -111695 35146 22337 -185011 -99424 110448 -266245 -66928 -121257 -15451
9042 127343 18435 113341 -150531 -88910 58428 -186600 42070 157417 -219465 -78978 -310115
9031 -310115 -245225 112385 -260194 112330 -73894 -205102 -116858 -357321 101945 -98721
9020 115469 -65249 163356 19491 235737 -216423 10750 1076 105848 -16846 -85032 128622
9008 16951 68440 -155569 -48967 -100307 -320197 126864 86887 -190995 -338680 -110002 488493
8996 167625 75427 93624 254781 -38756 174710 14300 126864 92931 -293209 222681 -287949
8984 175630 -14417 43380 110389 -110134 -45874 204637 13033 -133335 -50624 -222168 9660
8972 -322795 34630 -53431 -136129 429511 -431901 -121200 22232 141729 -65729 -317995 -150952
$$ packed form
9054c41828D6040a11695C5146j2809a85011Q5587A10448b66245f6928n4329a5451
9042A27343A8435R4906a50531O1621E8428a86600D2070J15347b19465g8978k31137
9031c10115O4890A12385b60194A12330g3894j31208Q8244k40463A01945i8721
9020A15469f5249A63356A9491K16246b16423A0750A076J04772a6846o8186A28622
9008A6951N1489a55569d8967n1340k19890A26864l9977a90995j47685a10002D88493
8996A67625G5427J8197J61157c8756A74710A4300J12564l3933b93209B22681b87949
8984A75630a4417D3380O7009a10134d5874B04637A3033a33335e0624j71544I660
8972c22795C4630e3431q2698D29511d31901a21200B2232J19497f5729k52266a50952
$$ plain form
8960 -477680 -90100 1059 123413 -176779 118191 -267167 237143 -107075 -23022 154073
8949 -387705 168492 270460 166197 -313011 -173643 -301546 -24787 90287 304707 -368126
8938 -268744 -170005 122607 63944 367215 199464 235004 287730 321108 -112556 138787 169135
8927 169135 -12273 208812 352811 763606 2814595 9213293 18197472 11193033 2356735
8917 835735 371353 127875 256123 133655 -147649 218380 -38748 115588 -97738 225212
8906 373729 96883 -191298 35947 41396 -428521 156466 36095 -119179 -159928 -97787 -64064
8895 -64064 -327733 128367 74409 -325965 94706 -45024 56535 -119424 188703 -198052 -271641
8884 -271641 -45414 203225 -82101 135822 94108 -179921 -77723 72172 224499 86905 223641
$$ packed form
8960d77680i0100A059J22354a76779A18191b67167B37143a07075b3022A54073
8949c87705A68492J01968j04263c13011J39368j27903b4787I0287K14420c68126
8938b68744R8739A22607n8663L03271j67751L5540N2726L3378a12556A38787L0348
8927A69135a2273B08812J43999M10795K050989O398698Q984179p004439B356735
8917H35735C71353A27875J28248j22468a47649B18380c8748A15588i7738B25212
8906C73729I6883a91298C5947N449d28521A56466C6095a19179m0749O2141L3723
8895f4064k63669A28367n3958c25965I4706d5024E6535a19424A88703a98052p3589
8884b71641d5414B03225h2101A35822m1714a79921g7723G2172J52327H6905J36736
$$ plain form
8873 223641 2043 122663 53379 -300424 -262345 -40629 176318 -169795 -30835 -325852 -9732
8861 -494727 52790 191302 -159179 -48403 -244059 -20955 3777 -18867 55125 -65212 -34196
8850 -34196 -94303 -135257 4441 -88520 -433249 -2174 -77613 177027 45677 -188616 -420501
8839 -420501 -61397 -144206 59675 128065 -222765 -168417 -188750 226314 -210681 -95255 272445
8827 -212701 -239191 -170442 26461 59169 -74551 -116144 -216464 -71404 -125062 -110375 -54798
$$ packed form
8873B23641B043J20620E3379c00424L8079d0629A76318a69795c0835k95017i732
8861d94727E2790J38512a59179d8403j95656b0955C777a8867E5125f5212L1016
8850c4196o0107m0954D441h8520l44729b174p5439A77027D5677a88616k31885
8839d20501f1397q2809E9675O8390b22765N4348k0333B26314b10681i5255B72445
8827b12701k6490O8749B6461L2708g4551m1593j00320g1404n3658J4687e4798
$$ [...]
##END NTUPLES=NMR SPECTRUM
##END=
