
##TITLE=UV1231_M7_1357-1247_30_7230727_dpX2DbCiSP
##JCAMPDX= 6.0         $$ Bruker NMR JCAMP-DX V2.0
##DATA TYPE= NMR SPECTRUM
##DATA CLASS= NTUPLES
##ORIGIN= BRUKER
##OWNER= Administrator
$$ 1.72 TOPSPIN		Version 2.1
$$ 2013-01-18 20:37:23.992 -0500  Administrator@X
$$ Compression mode = diff/dup
##.OBSERVE FREQUENCY= 400.02188249412
##.OBSERVE NUCLEUS= ^1H
##.ACQUISITION MODE= SIMULTANEOUS (DQD)
##.ACQUISITION SCHEME= undefined
##.AVERAGES= 64
##.DIGITISER RES= 22
##SPECTROMETER/DATA SYSTEM= spect
##.PULSE SEQUENCE= noesygpps1d.comp
##.SOLVENT NAME= COFFEE_meoh
##.SHIFT REFERENCE= INTERNAL, COFFEE_meoh, 1, 14.96131
##AUDIT TRAIL= $$ (NUMBER, WHEN, WHO, WHERE, PROCESS, VERSION, WHAT)
$$ ##TITLE= Audit trail, TOPSPIN		Version 2.1
$$ ##JCAMPDX= 5.01
$$ ##ORIGIN= Bruker BioSpin GmbH
$$ ##OWNER= Administrator
$$ $$ E:\/data/COFFEE/nmr/UV1231_M7_1357-1247_30_7230727_dpX2DbCiSP/22/pdata/1/auditp.txt
$$ ##AUDIT TRAIL=  $$ (NUMBER, WHEN, WHO, WHERE, PROCESS, VERSION, WHAT)
(   1,<2013-01-18 20:37:18.195 -0500>,<Administrator>,<X>,<go>,<TOPSPIN 2.1>,
      <created by zg
	started at 2013-01-18 20:25:47.929 -0500,
	POWCHK enabled, PULCHK disabled,
       configuration hash MD5:
       86 BA 57 50 F2 9D 5C 9B 26 00 A9 28 5F 66 2E 89
       data hash MD5: 64K
       95 CD 20 27 2F 6D 8F B9 DC 9E CE C7 01 C3 5A 19>)
(   2,<2013-01-18 20:37:21.273 -0500>,<Administrator>,<X>,<proc1d>,<TOPSPIN 2.1>,
      <Start of raw data processing
       efp LB = 0.3 FT_mod = 6 PKNL = 1 PHC0 = 0 PHC1 = 0 SI = 128K 
       data hash MD5: 128K
       24 30 46 B3 B5 08 C4 4A B2 5A 69 C5 3A F9 48 7C>)
(   3,<2013-01-18 20:37:22.335 -0500>,<Administrator>,<X>,<proc1d>,<TOPSPIN 2.1>,
      <pk PHC0 = -82.00745 PHC1 = 0 
       data hash MD5: 128K
       4B 2F 99 74 EA ED 78 86 E3 0C 39 E9 58 09 CA DE>)
(   4,<2013-01-18 20:37:22.992 -0500>,<Administrator>,<X>,<proc1d>,<TOPSPIN 2.1>,
      <abs ABSG = 1 
       data hash MD5: 128K
       53 E2 04 7E F6 55 2A 1A DE 1F 94 F0 58 D9 F5 A6>)
(   5,<2013-01-18 20:37:23.163 -0500>,<Administrator>,<X>,<proc1d>,<TOPSPIN 2.1>,
      <abs ABSG = 2 
       data hash MD5: 128K
       C2 FD 4F 25 34 27 0C 03 82 BD BD 07 05 17 E4 5B>)
(   6,<2013-01-18 20:37:23.351 -0500>,<Administrator>,<X>,<proc1d>,<TOPSPIN 2.1>,
      <abs ABSG = 3 
       data hash MD5: 128K
       F3 8C 89 13 9E CE 4A 82 DF C2 C6 07 CE 76 27 D4>)
(   7,<2013-01-18 20:37:23.538 -0500>,<Administrator>,<X>,<proc1d>,<TOPSPIN 2.1>,
      <abs ABSG = 4 
       data hash MD5: 128K
       38 CA E7 A7 EC 7B EA 5F 0A C8 5B 36 08 26 2A 4B>)
(   8,<2013-01-18 20:37:23.726 -0500>,<Administrator>,<X>,<proc1d>,<TOPSPIN 2.1>,
      <abs ABSG = 5 
       data hash MD5: 128K
       99 F6 46 0E 49 F6 F9 B1 9E 2F 16 A3 BB DE 8B 71>)
$$ ##END=
$$ 
$$ $$ hash MD5
$$ $$ 46 61 9D 22 3E DA 1E 04 F3 07 C5 18 12 70 21 3E
##$RELAX= 
##$RELAX= 
##$RELAX= 
##$RELAX= 
##$RELAX= 
##$RELAX= 
##$RELAX= 
##$RELAX= 
$$ Bruker specific parameters
$$ --------------------------
##$DU= <E:\>
##$EXPNO= 22
$$ [...]
##$TP07= 0
##$TPNAME0= <>
##$TPNAME1= <>
##$TPNAME2= <>
##$TPNAME3= <>
##$TPNAME4= <>
##$TPNAME5= <>
##$TPNAME6= <>
##$TPNAME7= <>
##$TPOAL= (0..7)
0.5 0.5 0.5 0.5 0.5 0.5 0.5 0.5
##$TPOFFS= (0..7)
0 0 0 0 0 0 0 0
##$TUNHIN= 0
##$TUNHOUT= 0
##$TUNXOUT= 0
##$USERA1= <user>
##$USERA2= <user>
##$USERA3= <user>
##$USERA4= <user>
##$USERA5= <user>
##$V9= 5
##$VALIST= <valist>
##$VCLIST= <CCCCCCCCCCCCCCC>
##$VD= 0
##$VDLIST= <DDDDDDDDDDDDDDD>
##$VPLIST= <PPPPPPPPPPPPPPP>
##$VTLIST= <TTTTTTTTTTTTTTT>
##$WBST= 1024
##$WBSW= 4
##$XGAIN= (0..3)
0 0 0 0
##$XL= 0
##$YL= 0
##$YMAX_a= 5632965
##$YMIN_a= -11812549
##$ZGOPTNS= <>
##$ZL1= 120
##$ZL2= 120
##$ZL3= 120
##$ZL4= 120
##$ABSF1= 14.96131
##$ABSF2= -5.596871
##$ABSG= 5
##$ABSL= 3
##$ALPHA= 0
##$AQORDER= 0
##$ASSFAC= 0
##$ASSFACI= 0
##$ASSFACX= 0
##$ASSWID= 0
##$AUNMP= <proc_prof1d_extract.lims>
##$AXLEFT= 0
##$AXNAME= <>
##$AXNUC= <1H>
##$AXRIGHT= 0
##$AXTYPE= 0
##$AXUNIT= <>
##$AZFE= 0.1
##$AZFW= 0.1
##$BCFW= 0
##$BC_mod= 0
##$BYTORDP= 0
##$COROFFS= 0
##$CY= 15
##$DATMOD= 1
##$DC= 0
##$DFILT= <>
##$DTYPP= 0
##$F1P= 0
##$F2P= 0
##$FCOR= 0.5
##$FTSIZE= 131072
##$FT_mod= 6
##$GAMMA= 0
##$GB= 0
##$INTBC= 1
##$INTSCL= 1
##$ISEN= 128
##$LB= 0.3
##$LEV0= 0
##$LPBIN= 0
##$MAXI= 10000
##$MC2= 0
##$MEAN= 0
##$ME_mod= 0
##$MI= 0
##$NCOEF= 0
##$NC_proc= -2
##$NLEV= 6
##$NOISF1= 0
##$NOISF2= 0
##$NSP= 0
##$NTH_PI= 0
##$NZP= 0
##$OFFSET= 14.96131
##$PC= 1
##$PHC0= -82.00745
##$PHC1= 0
##$PH_mod= 1
##$PKNL= yes
##$PPARMOD= 0
##$PPDIAG= 0
##$PPIPTYP= 0
##$PPMPNUM= 2147483647
##$PPRESOL= 1
##$PSCAL= 4
##$PSIGN= 0
##$PYNMP= <proc.py>
##$REVERSE= no
##$SF= 400.020009513211
##$SI= 131072
##$SIGF1= 0
##$SIGF2= 0
##$SINO= 400
##$SIOLD= 131072
##$SPECTYP= <>
##$SREGLST= <1H.CDCl3>
##$SSB= 0
##$STSI= 131072
##$STSR= 0
##$SW_p= 8223.68421052631
##$SYMM= 0
##$S_DEV= 0
##$TDeff= 65536
##$TDoff= 0
##$TI= <>
##$TILT= no
##$TM1= 0
##$TM2= 0
##$TOPLEV= 0
##$USERP1= <user>
##$USERP2= <user>
##$USERP3= <user>
##$USERP4= <user>
##$USERP5= <user>
##$WDW= 1
##$XDIM= 131072
##$YMAX_p= 414962723
##$YMIN_p= -45122
##$CURPLOT= <Network HP LaserJet P1505>
##$CURPRIN= <$Network HP LaserJet P1505>
##$DFORMAT= <normdp>
##$LAYOUT= <+/1D_H.xwp>
##$LFORMAT= <normlp>
##$PFORMAT= <normpl>
##$SURQMSG= 1
$$ End of Bruker specific parameters
$$ ---------------------------------
##NTUPLES= NMR SPECTRUM
##VAR_NAME=  FREQUENCY,     SPECTRUM/REAL,   SPECTRUM/IMAG
##SYMBOL=    X,             R,               I
##VAR_TYPE=  INDEPENDENT,   DEPENDENT,       DEPENDENT
##VAR_FORM=  AFFN,          ASDF,            ASDF
##VAR_DIM=   131072,        131072,          131072
##UNITS=     HZ,            ARBITRARY UNITS, ARBITRARY UNITS
##FACTOR=    0.0627417313425164, 1,          1
##FIRST=     8223.62146879497, 1253,         -56269
##LAST=      0,             1996,            -56381
##MIN=       0,             -45122,          0
##MAX=       8223.62146879497, 414962723,    0
$$ Real data points
##PAGE= N=1
##DATA TABLE= (X++(R..R)), XYDATA
$$ [...]
63915D057564k73029k72375k66733k57514k45808k32512k17955k01761j83739
63906A906138j64691j45950j28451j12565r8408q5797p4165o3125n3058m4725
63896I35203l8379l3626k9994k7169k4902k3100k1990k1697k1658k0912j9094
63885F52682j6837j5021j3910j3063j1871j0079p956n963m206k269J63K731M791
63872E59192O317P990J0291J2922J5315J7390J9556K2115K4862K7224K8688K9225
63860G81087K9336K9579L0018L0219K9799K8723K7106K4955K2266J9169J5790
63849A068047J2106Q012L464j506o710j1676j5882j9275k2371k5630k8920l1799
63837I27860l4114l5970l7234l7566l6992l6089l5334l4513l3058l0850k8382
$$ plain form
63915 4057564 3784535 3512160 3245427 2987913 2742105 2509593 2291638 2089877 1906138
63906 1906138 1741447 1595497 1467046 1354481 1256073 1170276 1096111 1032986 979928 935203
63896 935203 896824 863198 833204 806035 781133 758033 736043 714346 692688 671776 652682
63885 652682 635845 620824 606914 593851 581980 571901 563945 557982 553776 551507 551670 554401 559192
63872 559192 565509 573499 583790 596712 612027 629417 648973 671088 695950 723174 751862 781087
63860 781087 810423 840002 870020 900239 930038 958761 985867 1010822 1033088 1052257 1068047
63849 1068047 1080153 1088165 1091629 1090123 1083413 1071737 1055855 1036580 1014209 988579 959659 927860
63837 927860 893746 857776 820542 782976 745984 709895 674561 640048 606990 576140 547758
63826E47758k6105k3963k1700j9465j7695j6527j5604j4593j3540j2495j1148
63815C54923r278p413o464o545o674n952m650l702l382l103k478j944k064k660
63801B88614l047k967k848l129l666l987l921l740l738l812l580k882k029j517
63787B43751j541j846k002j740j132n93o31j292j870j541m19L83Q7p18q38p1O16
63770B28603N22Q5K1K20N4n83j156j242r09m01N7J91j93q56j295j332j174r39
63752B19673n12K3K32p2m67l16O00J976L228L737L232K176J459J503J877J973
63736B40322J722J434J257J119R50O65K00k21o9Q80K199L352M246M896N036M572
63720B72560M033L961M094L878L481L400L224J880o83l006l831l536l290l449
$$ plain form
63826 547758 521653 497690 475990 456525 438830 422303 406699 392106 378566 366071 354923
63815 354923 345645 338232 331768 325223 318549 312597 307947 304245 300863 297760 295282 293338 291274 288614
63801 288614 285567 282600 279752 276623 272957 268970 265049 261309 257571 253759 250179 247297 245268 243751
63787 243751 242210 240364 238362 236622 235490 234897 234266 232974 231104 229563 229144 229527 229614 228896 228058 227987 228603
63770 228603 229125 229210 229231 229451 229505 228922 227766 226524 225615 225214 225271 225462 225269 224413 223118 221786 220612 219673
63752 219673 219161 219184 219416 219344 218877 218561 219161 221137 224365 228102 231334 233510 234969 236472 238349 240322
63736 240322 242044 243478 244735 245854 246804 247469 247669 247448 247379 248259 250458 253810 258056 262952 267988 272560
63720 272560 276593 280554 284648 288526 292007 295407 298631 300511 299828 296822 292991 289455 286165 282716
63706B82716l433k862j991j167m86J4K70M70J017K013K979L285K868K385K553
63691B90631L332L965L873L276K684K117J241J79m76m84k80k70l57l72m85q06
63675C07768j049r14n66l68l98m78m15j8Q30J830K323J969J075O8j006k090k770
63658C05791k748k367k208k447k966l690m348m338l450k441k204k589k716k208
63644B65071j404n13N86J673K164K014J950K498L334L807L746L455L344L736M629
63629C00090N522N852N725N779O255O729O957P399Q495R987J1316J2360J3337
63616D05803J4397J5683J7493J9862K2216K3886K4878K5701K6516K6929K6562
63605F49926K5376K3271J9793J4663Q505K707j626m496o625q387r484r672r389
$$ plain form
63706 282716 279283 276421 274430 273263 272777 272791 273061 273531 274548 276561 279540 282825 285693 288078 290631
63691 290631 293963 297928 301801 305077 307761 309878 311119 311298 310822 310338 310058 309788 309431 309059 308574 307768
63675 307768 306719 305805 305239 304871 304473 303995 303580 303562 304392 306222 308545 310514 311589 311657 310651 308561 305791
63658 305791 303043 300676 298468 296021 293055 289365 285017 280679 277229 274788 272584 269995 267279 265071
63644 265071 263667 263154 263740 265413 267577 269591 271541 274039 277373 281180 284926 288381 291725 295461 300090
63629 300090 305612 311464 317189 322968 329223 335952 342909 350308 358803 368790 380106 392466 405803
63616 405803 420200 435883 453376 473238 495454 519340 544218 569919 596435 623364 649926
63605 649926 675302 698573 718366 733029 741534 744241 742615 738119 731494 723107 713623 703951 694562
63592F94562r267r434r785j0597j2278j4539j6549j7947j9042j9855j9802j8650
63580E16817j7155j6086j5130j3398j0766q079o113m815l598k005l6J938L547
63567D25121M743N718O449O689O446O155O166O349O486O736P448Q774J0695J3136
63553E27111J5804J8309K0711K3611K7252L0955L3823L5566L6136L4913L0982
63542H35173K4109J4967M715n140j2858j7342j8876j8448j6574j3479j0145p991
63530G58111p441p754q527j0336j3488j7137k0279k2859k5184k6895k7362k6634
63518E44215k5216k3192k0479j7633j5547j4325j3279j2098j1184j0607r644p868
63506C63143o053n275n496n749n522n153m843m145k852j684j368j457r34J59O01
$$ plain form
63592 694562 685295 675861 666076 655479 643201 628662 612113 594166 575124 555269 535467 516817
63580 516817 499662 483576 468446 455048 444282 436203 430090 425275 421677 419672 419636 421574 425121
63567 425121 429864 435582 442031 448720 455166 461321 467487 473836 480322 487058 494506 503280 513975 527111
63553 527111 542915 561224 581935 605546 632798 663753 697576 733142 769278 804191 835173
63542 835173 859282 874249 878964 873824 860966 843624 824748 806300 789726 776247 766102 758111
63530 758111 750670 742916 734389 724053 710565 693428 673149 650290 625106 598211 570849 544215
63518 544215 518999 495807 475328 457695 442148 427823 414544 402446 391262 380655 371011 363143
63506 363143 357090 351815 346319 340570 335048 329895 325052 320907 318055 316371 315003 313546 312612 312771 313372
63491C13372j47r81o64L66O56j66r33o18N22J716K730L687M481M886M869M364
63475C38140L216J767R38J120J424P83n99j666k176k864l990m723m428l648l209
63460C20085l007k370j197o0O11Q87J012J252J888K847L524L486L240L694M935
63445C40827O207P104P942Q866R564J0245J1973J5230J8889K1589K3555K5924
63433E07915K8458K9272K7028K2368J6810J1280O358K964J815K587M451P186J1017
63420F79509J5600J9990K3659K6862K9702L1476L1214K8611K4135J8468J2093
63409I41319N388j036o277r631j1220j1869j2254j2388j2186j2152j3027j4973
63397H29694j7537k0336k3266k6076k8246k9417k9563k8726k6910k4370k1593
$$ plain form
63491 313372 313225 312244 311580 311946 312602 312436 311503 310885 311407 313123 315853 319540 324021 328907 333776 338140
63475 338140 341356 343123 344061 345181 346605 347388 346789 345123 342947 340083 336093 331370 326942 323294 320085
63460 320085 317078 314708 313511 313451 314062 314949 315961 317213 319101 321948 325472 328958 332198 335892 340827
63445 340827 347034 354138 362080 370946 380510 390755 402728 417958 436847 458436 481991 507915
63433 507915 536373 565645 592673 615041 631851 643131 649489 652453 654268 656855 661306 668492 679509
63420 679509 695109 715099 738758 765620 795322 826798 858012 886623 910758 929226 941319
63409 941319 946707 945671 939394 929763 918543 906674 894420 882032 869846 857694 844667 829694
63397 829694 812157 791821 768555 742479 714233 684816 655253 626527 599617 575247 553654
63386E53654j8976j6692j4847j3387j1970j0337q712p389o015l880j012J705L596
63373D45738M820N762O480P067P934R333J1022J2795J4785J6932J8737K0064K1611
63360F03080K3973K6673K8823L0244L1231L1563L0656K8527K5709K2224J7478
63349I00181J1412M933r91o029j0031j2539j3318j2962j2504j2558j3161j4169
63337H08264j5494j7079j8930k1091k3383k5298k6344k6415k5669k4144k1693
63326E62724j8330j4487j0880q043n965m167k234l56O21l14l647q757j3962j7439
63312D54764j8461j7702j6231j4470j2343j0012p920o243m890l948l608l647l547
63299C31742l220l035k971k461j395o58j032k025k457j936j155q43j022j332j511
$$ plain form
63386 553654 534678 517986 503139 489752 477782 467445 458733 451344 445329 441449 440437 442142 445738
63373 445738 450558 456320 462800 469867 477801 487134 498156 510951 525736 542668 561405 581469 603080
63360 603080 627053 653726 682549 712793 744024 775587 806243 834770 860479 882703 900181
63349 900181 911593 916526 915535 909506 899475 886936 873618 860656 848152 835594 822433 808264
63337 808264 792770 775691 756761 735670 712287 686989 660645 634230 608561 584417 562724
63326 562724 544394 529907 519027 510984 505019 500852 498618 498262 498883 498569 494922 486165 472203 454764
63312 454764 436303 418601 402370 387900 375557 365545 357625 351382 346492 342544 338936 335289 331742
63299 331742 328522 325487 322516 320055 318660 318002 316970 314945 312488 310552 309397 308554 307532 306200 304689
63284C04689j428j098q39j026j490j587j010k71j4j46k0O38J334J410P99M4k22
63267B99763J81Q79J279J131P69P33J127J555J672J614J668J773J638J311J226
63252C18319J622K220K657K992L500M125M477M339L947L726L965M722N845O996
63238C73452P889Q619R589J1031J2662J3945J4645J4985J5282J5558J5603J5364
63226E28624J5153J5370J5984J6495J6454J5969J5571J5622J5949J6092J5834
63215G03117J5444J5401J5796J6034J5284J3283J0561P791N133K313q62m338p979
63202H06978j1574j4775j7280j9088k0329k0925k0638j9388j7351j4777j1993
63191F18860r383p074m697j811J454M523P060R097J0677J1895J3256J5315J7787
$$ plain form
63284 304689 303261 302163 301324 300298 298808 297221 296211 295940 295926 295780 295760 296398 297732 299142 299941 299985 299763
63267 299763 299944 300823 302102 303233 304002 304735 305862 307417 309089 310703 312371 314144 315782 317093 318319
63252 318319 319941 322161 324818 327810 331310 335435 339912 344251 348198 351924 355889 360611 366456 373452
63238 373452 381341 389960 399549 410580 423242 437187 451832 466817 482099 497657 513260 528624
63226 528624 543777 559147 575131 591626 608080 624049 639620 655242 671191 687283 703117
63215 703117 718561 733962 749758 765792 781076 794359 804920 812711 817844 820157 819295 814957 806978
63202 806978 795404 780629 763349 744261 723932 703007 682369 662981 645630 630853 618860
63191 618860 609477 602403 597706 595895 597349 601872 608932 618029 628706 640601 653857 669172 686959
63178F86959J9610K0220K0209K0368K0655K0571K0086J9627J9397J9288J9175
63167I06165J8829J7758J5686J3005J0216P045K800k413p505j1651j5140j8741
63155I36054k2579k6028k8430k9673l0135l0252l0073k9285k7728k5751k3803
63144F32317k1805j9386j6706j4501j3120j1968j0304q216o434n313m428l271
63132D96865j986j237j376j874j755o11R55K056K475K701L100L509L706L804M015
63117E14347M288M483M657M876M920M477L617K809K487K656K950L003K772K534
63103E64876K501K499K166J398L58q61k147k912k323m00J530K018J006k97q96
63088E68516q39o08k83L22J093J584J505J024N64M00M83N38L48o0l98l19L58J498
$$ plain form
63178 686959 706569 726789 746998 767366 788021 808592 828678 848305 867702 886990 906165
63167 906165 924994 942752 958438 971443 981659 988704 991504 989091 981586 969935 954795 936054
63155 936054 913475 887447 859017 829344 799209 768957 738884 709599 681871 656120 632317
63144 632317 610512 591126 574420 559919 546799 534831 524527 516311 509877 504564 500136 496865
63132 496865 494879 493642 492266 490392 488637 488026 488981 491037 493512 496213 499313 502822 506528 510332 514347
63117 514347 518635 523118 527775 532651 537571 542048 545665 548474 550961 553617 556567 559570 562342 564876
63103 564876 567377 569876 572042 573440 573798 572937 570790 567878 565555 565155 566685 568703 569709 569412 568516
63088 568516 567677 567069 566786 567108 568201 569785 571290 572314 572878 573278 573761 574299 574647 574587 574189 573870 574228 575726
63070E75726K709L672M399N108N864O575P321Q307R439J0335J0978J1938J3570
63057F75941J5361J6668J7793J9686K2616K5823K8546L0770L2738L4401L5711
63046I56054L6938L8267L9373L9875L9902L9860L9818L9495L8732L7631L6352
63035A382297L5080L4036L3289L2610L1751L0658K9203K6943K3501J8939J3452
63024A691759O923p14q919j6920k4480l1767l8443m3610m6738m8125m8281m7401
63012A343284m5620m3130l9727l4860k8604k2074j6310j1108n551N16O294J1153
63000A114263J5374J9518K3603K7180K9915L1947L3675L5264L6333L6365L5606
62989A439043L5155L5743L6632L6371L4553L2118K9824K7192K3356J8215J2168
$$ plain form
63070 575726 578435 582107 586506 591614 597478 604053 611374 619681 629120 639455 650433 662371 675941
63057 675941 691302 707970 725763 745449 768065 793888 822434 853204 885942 920343 956054
63046 956054 992992 1031259 1070632 1110507 1150409 1190269 1230087 1269582 1308314 1345945 1382297
63035 1382297 1417377 1451413 1484702 1517312 1549063 1579721 1608924 1635867 1659368 1678307 1691759
63024 1691759 1698682 1697968 1689049 1672129 1647649 1615882 1577439 1533829 1487091 1438966 1390685 1343284
63012 1343284 1297664 1254534 1214807 1179947 1151343 1129269 1112959 1101851 1096300 1096816 1103110 1114263
63000 1114263 1129637 1149155 1172758 1199938 1229853 1261800 1295475 1330739 1367072 1403437 1439043
62989 1439043 1474198 1509941 1546573 1582944 1617497 1649615 1679439 1706631 1729987 1748202 1760370
62978A760370N216k848j1547j9890k7506l4929m2509m9543n4854n7963n9307n9556
62966A345134n9034n7738n5538n2385m8530m4595m1140l8151l5142l1924k8993
62955H51964k7013k5929k4966k3481k1619j9997j8916j8109j7195j6119j5070
62944F23550j4139j3193j2104j0965j0005r347q852q270p590p077o911o810o244
62931E02043n051l687k746k330k065j659j287j360j992k759k984k383j400q33
62917D69507j024j528j697j465j329j637k176k538k554k286j834j375j207j444
62903D45413j763j730j351r77o75j0J283K710L372K865J629M65q2J73J074K088
62887D54484K461J831P47K16O46J388J534R43J60m69j125j934k548k644k468k442
$$ plain form
62978 1760370 1765586 1762738 1751191 1731301 1703795 1668866 1626357 1576814 1521960 1463997 1404690 1345134
62966 1345134 1286100 1228362 1172824 1120439 1071909 1027314 986174 948023 912881 880957 851964
62955 851964 824951 799022 774056 750575 728956 708959 690043 671934 654739 638620 623550
62944 623550 609411 596218 584114 573149 563144 553797 544945 536675 529085 522008 515097 508287 502043
62931 502043 496992 493305 490559 488229 486164 484505 483218 481858 479866 477107 474123 471740 470340 469507
62917 469507 468483 466955 465258 463793 462464 460827 458651 456113 453559 451273 449439 448064 446857 445413
62903 445413 443650 441920 440569 439592 438917 438907 440190 442900 446272 449137 450766 451231 451149 451322 452396 454484
62887 454484 456945 458776 459523 459739 460385 461773 463307 464250 464410 463941 462816 460882 458334 455690 453222 450780
62871D50780k484k230j821j858k452k930k790k409k348k371j806o90J58L21L58
62856D25428Q81J504J319J95q93r87j62P28J108J148J192J144P05lm71n50p27
62839D31559j416k265k556k097j386r26p58o90n60k63J92N39M52k6n07o58m01
62822D18233K90J316K234K542K383K434K961L451L386K879K288J772J521J855
62808D49545K603L008K816K830L680M651M645L889L506L779M070M330N278O747
62794E05377P386O698O127P253R785J2355J4533J6899J9638K2224K4443K6739
62782F79457K9546L2933L6820M0900M4494M7205M9640N2700N6224N9099O0712
62771A189730O1439O1553O0431N7218N1676M4108L5055K5265J5402N479m871j5430
$$ plain form
62871 450780 448296 446066 444245 442387 439935 437005 434215 431806 429458 427087 425281 424591 424749 425070 425428
62856 425428 426309 427813 429132 429327 428434 427447 427285 428013 429121 430269 431461 432605 433310 433307 432836 432286 431559
62839 431559 430143 427878 425322 423225 421839 420913 420155 419465 418905 418642 418834 419373 419825 419799 419292 418634 418233
62822 418233 418523 419839 422073 424615 426998 429432 432393 435844 439230 442109 444397 446169 447690 449545
62808 449545 452148 455156 457972 460802 464482 469133 473778 477667 481173 484952 489022 493352 498630 505377
62794 505377 512763 519461 525588 532841 542626 554981 569514 586413 606051 628275 652718 679457
62782 679457 709003 741936 778756 819656 864150 911355 960995 1013695 1069919 1129018 1189730
62771 1189730 1251169 1312722 1373153 1430371 1482047 1526155 1561210 1586475 1601877 1607356 1602485 1587055
62759A587055k5322l4126m2184m9388n4653n7386n8675n9927o0831n9946n7038
62748A027579n3593n0802m8256m5058m1233l7348l3462k9398k5606k2869k1132
62737F18822j9399j6988j4382j2459j1283j0060q273o436n429n324n212m282k688
62724D96607j206k92J43L37N28J081K265L768M918N554O280P650R490J1228J2577
62709E60928J3653J4774J6364J8719K1523K4026K6068K8487L2026L6217M0038
62698H32823M3384M7053N1381N5787N9845O3890O8172P1996P4225P4228P1903
62687A514687O7229O0274N1397M1015K9276J6388L036r909k1988l3270m3950n4015
62675A620170o2968o9740p3323p3932p3024p1690o9476o5490o0272n5473n1837
$$ plain form
62759 1587055 1561733 1527607 1485423 1436035 1381382 1323996 1265321 1205394 1144563 1084617 1027579
62748 1027579 973986 923184 874928 829870 788637 751289 717827 688429 662823 639954 618822
62737 618822 599423 582435 568053 555594 544311 534251 525978 519542 514113 508789 503577 499295 496607
62724 496607 495401 495109 495252 495589 496117 497198 499463 503231 508149 513703 519983 527633 537123 548351 560928
62709 560928 574581 589355 605719 624438 645961 669987 696055 724542 756568 792785 832823
62698 832823 876207 923260 974641 1030428 1090273 1154163 1222335 1294331 1368556 1442784 1514687
62687 1514687 1581916 1642190 1693587 1734602 1763878 1780266 1783302 1773393 1751405 1718135 1674185 1620170
62675 1620170 1557202 1487462 1414139 1340207 1267183 1195493 1126017 1060527 1000255 944782 892945
62664H92945m8511m4608m0410l6550l2891k8983k5081k1905j9629j7759j5889
62653E60729j4032j2333j0952j0132r896r729r039p916o991o456n810m724l690
62640D49029l349l545l471k721j733j150j060j125j231j622k378l083l315l217
62626D16029l284l536l379k429j135k94r4l3L87J146J928K481K658K393J884J589
62610D16311J797K238K342J933J503J698K631L830M847N723O900Q715J1117J3699
62596D85284J5973J7724J9181K0784K2725K4836K6926K8981L0816L1895L1763
62585G56888L0489K8314K5104K0659J5361R884M386j336o948j1693j5635j9710
62573H35763k4078k7347k8365k8005k8050k8682k8399k6396k3756k1911k0900
$$ plain form
62664 892945 844434 799826 759416 722866 689975 660992 635911 614006 594377 576618 560729
62653 560729 546697 534364 523412 513280 503384 493655 484616 476700 469709 463253 457443 452719 449029
62640 449029 445680 442135 438664 435943 434210 433060 432000 430875 429644 428022 425644 422561 419246 416029
62626 416029 412745 409209 405830 403401 402266 401972 401878 401845 402232 403378 405306 407787 410445 412838 414722 416311
62610 416311 418108 420346 422688 424621 426124 427822 430453 434283 439130 444853 451753 460468 471585 485284
62596 485284 501257 518981 538162 558946 581671 606507 633433 662414 693230 725125 756888
62585 756888 787377 815691 840795 861454 876815 886699 891085 889749 882801 871108 855473 835763
62573 835763 811685 784338 755973 727968 699918 671236 642837 616441 592685 570774 549874
62562E49874j9744j7863j5492j3101j0989r278p914o768n860n305m920m315l521
62549D24804l062l112l067k304j037RM47L08l20j140j345l13J429K507K210J174
62533D17188M04J51J05J23L37P40J273K218L974O380Q676J0331J1573J2910J4414
62518D90797J5854J7329J9339K2127K5287K8197L0656L2985L5569L8392M0910
62507G97442M2400M2602M1958M0946L9251L6023L1098K5368J9589J3395O213j261
62495A135024p431j1550j4200j5852j5927j3921j0617p328m328q73L341P611J1232
62482A055181J4292J7065J9156J9686J8113J4531R375L259k959q489j3247j8029
62470A127934k3801l0682l7628m3109m6121m6719m5777m4236m2452m0192l7241
$$ plain form
62562 549874 530130 512267 496775 483674 472685 463407 455493 448725 442865 437560 432640 428325 424804
62549 424804 421742 418630 415563 413259 412222 412231 412678 412986 412666 411526 410181 409868 411297 413804 416014 417188
62533 417188 417592 417743 417848 417971 418308 419048 420321 422539 426513 432893 441569 451900 463473 476383 490797
62518 490797 506651 523980 543319 565446 590733 618930 649586 682571 718140 756532 797442
62507 797442 839842 882444 924402 965348 1004599 1040622 1071720 1097088 1116677 1130072 1136285 1135024
62495 1135024 1127593 1116043 1101843 1085991 1070064 1056143 1045526 1038198 1033870 1032997 1036338 1043949 1055181
62482 1055181 1069473 1086538 1105694 1125380 1143493 1158024 1167399 1170658 1167699 1159210 1145963 1127934
62470 1127934 1104133 1073451 1035823 992714 946593 899874 854097 809861 767409 727217 689976
62459F89976l3880l0637k7634k4500k1008j7481j4325j1484q712o223m542l729
62447D85821l147k177q29M77J448K085K626L438M667N853O200N453M201L139K306
62432E21561J365K52q84k098l590n276o831q053q812q836q042p020o623p027p613
62417D42473p840p662p013n625l732k348k161k542k363j575j145j483j772j247
62403C93965l45L2j31r8M02R30J297J933L024L947M085L672L348L238L053K884
62387D25236L150L817M286M243M095M412N284O404P425Q049Q112P747P290O945
62373E06495O805P100P969Q939R314R209R541J0749J2216J3474J5208J8267K2259
62360F57545K6079K9533L3346L7672M1632M4549M6696M8370M9089M8221M5839
$$ plain form
62459 689976 656096 625459 597825 573325 552317 534836 520511 509027 500315 494092 489550 485821
62447 485821 482674 480497 479668 480145 481593 483678 486304 489742 494409 500262 506462 511915 516116 519255 521561
62432 521561 522926 523178 522294 520196 516606 511330 504499 496446 487634 478798 470756 463736 457113 450086 442473
62417 442473 434633 426971 419958 414333 410601 408253 406092 403550 401187 399612 398467 396984 395212 393965
62403 393965 393620 393652 393521 393423 393825 394755 396052 397985 401009 404956 409041 412713 416061 419299 422352 425236
62387 425236 428386 432203 436489 440732 444827 449239 454523 460927 468352 476401 484513 492260 499550 506495
62373 506495 513300 520400 528369 537308 546622 555831 565372 576121 588337 601811 617019 635286 657545
62360 657545 683624 713157 746503 784175 825807 870356 917052 965422 1014511 1062732 1108571
62349A108571M2311L7456L0806K2621J4011O003j103p396j2745j6847j9797k2304
62337A181587k5123k8265l0952l2462l2782l2276l1079k9227k7147k5430k4090
62326H62754k2629k0932j9536j8871j8723j8703j8809j9132j9442j9416j8998
62315F47563j8249j7160j5927j4991j4471j3848j2671j1212r912q579o839n117
62303D98587m290m318m071k750q57O29J524K336L272L917L883L414L201L710M722
62288E12909N539N732N628N966P051Q438R415R603R208Q903R364J0589J1652J1628
62274F31625J0726J0037J0052J0107R532Q690Q341Q507Q689Q808R266J0251J1724
62261G56355J3956J7296K1420K5549K9493L3755L8397M2581M5522M7187M7654
$$ plain form
62349 1108571 1150882 1188338 1219144 1241765 1255776 1261779 1260676 1253280 1240535 1223688 1203891 1181587
62337 1181587 1156464 1128199 1097247 1064785 1032003 999727 968648 939421 912274 886844 862754
62326 862754 840125 819193 799657 780786 762063 743360 724551 705419 685977 666561 647563
62315 647563 629314 612154 596227 581236 566765 552917 540246 529034 519122 510543 503704 498587
62303 498587 494297 489979 485908 483158 482301 482930 484454 486790 490062 493979 497862 501276 504477 508187 512909
62288 512909 518448 524180 529808 535774 542825 551263 560678 570281 579489 588392 597756 608345 619997 631625
62274 631625 642351 652388 662440 672547 682079 690769 699110 707617 716306 725114 734380 744631 756355
62261 756355 770311 787607 809027 834576 864069 897824 936221 978802 1024324 1071511 1119165
62250A119165M6500M3379L8623L2671K5433J6972Q258M06o618j3522k0195k5699
62238A265373k9879l3820l8302m2638m5632m7004m7207m6462m4702m2140l9146
62227H08441l5671l1463k6848k2635j9233j6338j3729j1743j0735j0330r736q618
62215E91362p341o318n479m565l688l223l128k797j829o12K30P30J381K123K285
62200E59131J719J299J812K871L569L781M144M954N874O719P748Q970R764R637
62186F31992Q912Q381Q465Q985R477R481Q749P481O243N447M984M558M153M046
62172G31354M483N658P811J0990J4747J8350K1544K4791K8566L2484L5402L6502
62160I72682L6054L4848L3050K9956K4983J8521J1575M853j418o953j1314j4475
$$ plain form
62250 1119165 1165665 1209044 1247667 1280338 1305771 1322743 1331001 1331407 1324789 1311267 1291072 1265373
62238 1265373 1235494 1201674 1163372 1120734 1075102 1028098 980891 934429 889727 847587 808441
62227 808441 772770 741307 714459 691824 672591 656253 642524 630781 620046 609716 599980 591362
62215 591362 584021 577703 572224 567659 563971 560748 557620 554823 552994 552382 552612 553342 554723 556846 559131
62200 559131 560850 562149 563961 566832 570401 574182 578326 583280 589154 595873 603621 612591 622355 631992
62186 631992 640904 649285 657750 666735 676212 685693 694442 701923 708166 713613 718597 723155 727308 731354
62172 731354 735837 741495 749306 760296 775043 793393 814937 839728 868294 900778 936180 972682
62160 972682 1008736 1043584 1076634 1106590 1131573 1150094 1161669 1166522 1165104 1158151 1146837 1132362
62148A132362j7061j9723k2517k5107k7315k9083l0057k9642k7682k4794k1758
62137H57623j8754j5478j2023r196p695p257p019o585o252o229o259o180o234
62124G42462o438o187n076l656k664j843l84J647L268M123N028O618Q254Q816
62110G53968P964N959K940q20m249o048o042n293m769m426l862l343l715n425
62096G22839p911r958j0590r659p728n476l286j264N61K096L204L792M017M336
62082F84973N146O369P681R028J0681J2622J4351J5489J6240J7106J8372K0059
62070H38117K1958K3473K3960K3603K3478K4249K5237K5384K4732K4189K4019
62059A102399K3445K1715J8715J4463Q962K857k513o395r351j2331j5561j8795
$$ plain form
62148 1132362 1115301 1095578 1073061 1047954 1020639 991556 961499 931857 904175 879381 857623
62137 857623 838869 823391 811368 802172 794477 787220 780201 773616 767364 761135 754876 748696 742462
62124 742462 736024 729837 724761 721105 718441 716598 716214 717861 721129 725252 730280 736898 745152 753968
62110 753968 761932 767891 770831 770011 765762 759714 753672 748379 743610 739184 735322 731979 728264 722839
62096 722839 714928 704970 694380 684721 676993 671517 668231 666967 667528 669624 672828 676620 680637 684973
62082 684973 690119 696488 704169 713197 723878 736500 750851 766340 782580 799686 818058 838117
62070 838117 860075 883548 907508 931111 954589 978838 1004075 1029459 1054191 1078380 1102399
62059 1102399 1125844 1147559 1166274 1180737 1189699 1192556 1190043 1183648 1174297 1161966 1146405 1127610
62047A127610k2071k5386k8113k9621l0356l1422l3027l4139l3908l2710l1394
62036G95463l0152k8636k6837k5119k3602k1969j9990j7779j5533j3406j1639
62025E60801j0489r873r407q875q355p762o752n378m476m835o124p090o895n789
62011D58701m487l296k103q38M20J626K789L844M669N220N518N604N548N400N008
61996D93623M037K393O14l79j12Q45J213O5k273m550n790o144o377o857p325p523
61980D55460p475p163o401n274m242l565l008k338j723j378j166r21p88q55p78
61965D08385l08K03K74O4N3J69q6o92r98o81j34K66P01J479K500L467M218M689
61947D23569M933N362O472Q047R129R230R162J0090J2073J4109J5430J6078J6305
$$ plain form
62047 1127610 1105539 1080153 1052040 1022419 992063 960641 927614 893475 859567 826857 795463
62036 795463 765311 736675 709838 684719 661117 639148 619158 601379 585846 572440 560801
62025 560801 550312 540439 531032 522157 513802 506040 499288 493910 489434 484599 478475 471385 464490 458701
62011 458701 454214 450918 448815 447977 448397 450023 452812 456656 461325 466545 472063 477667 483215 488615 493623
61996 493623 497660 500053 500667 500288 500176 501021 502234 502299 500026 495476 489686 483542 477165 470308 462983 455460
61980 455460 447985 440822 434421 429147 424905 421340 418332 415994 414271 412893 411727 410806 410018 409163 408385
61965 408385 408077 408280 408554 408618 408671 408840 408754 408062 407064 406383 406249 406515 407216 408695 411195 414662 418880 423569
61947 423569 428502 433864 440336 448383 457512 466742 475904 485994 498067 512176 527606 543684 559989
61934E59989J6070J5446J4910J4830J4802J3964J1990R558P698O784O216N074
61922F97331K993M14j909l501m383m842n088n043m349k725l45K237M612O833R107
61907F91342J1315J3014J3897J4004J3449J2112R845O835L527J68l385p170j0651
61894G68302j3019j3967j3928j3541j3143j2917j3047j3439j3519j2764j1401
61883F23617j0214r656r480r256q998r009r338r578r172p996o597n738n560n329
61869E07696m308k677j196j25J041K606M074M823N008N429O718Q905J1580J4123
61855E63697J5941J6940J7765J9279K1721K4478K6688K7939K8404K8512K8483
61844H19847K8052K6609K3759J9772J5410J1284P429L525n97m698q294j0942j2315
$$ plain form
61934 559989 576059 591505 606415 621245 636047 650011 662001 671559 679257 686041 692257 697331
61922 697331 700324 700738 698829 695328 690945 686103 681015 675972 671623 668898 668553 670790 675402 682235 691342
61907 691342 702657 715671 729568 743572 757021 769133 778978 785813 789340 789508 786123 778953 768302
61894 768302 755283 741316 727388 713847 700704 687787 674740 661301 647782 635018 623617
61883 623617 613403 603747 594267 585011 576013 567004 557666 548088 538916 530920 524323 518585 513025 507696
61869 507696 503388 500711 499515 499390 500431 503037 507111 511934 516942 522371 529089 537994 549574 563697
61855 563697 579638 596578 614343 633622 655343 679821 706509 734448 762852 791364 819847
61844 819847 847899 874508 898267 918039 933449 944733 952162 955687 955090 950392 942098 931156 918841
61831I18841j2142j0337p365m187j521Q46L688P255J0750J3008J3412J2088R493
61818I53829O034J935k729p807j2849j7272k0805k3529k5433k6334k6348k6085
61806G72607k5871k5144k3183k0263j7555j5771j4480j2945j1114r494q377p649
61794E80761p112o596n861m797l757l273l313l195k460j495j024j173j494j795
61780E33416k357l198l628l053j896j231j466j910j766j132p58j018j429j262
61766E07312l43Q02J526J699J687J839K140K442K803L390M097M512M283L414K162
61751E43765Q01n19j774k935l836m276m303m211m117l809l204k718k744k992k828
61736E00300k130j294m53O31J811K342J810P54K3j08J41O39J333J940K091J800
$$ plain form
61831 918841 906699 896362 888997 884810 883289 884135 887823 895078 905828 918836 932248 944336 953829
61818 953829 959863 961798 959069 951262 938413 921141 900336 876807 851374 825040 798692 772607
61806 772607 746736 721592 698409 678146 660591 644820 630340 617395 606281 596787 588410 580761
61794 580761 573649 567053 561192 556395 552638 549365 546052 542857 540397 538902 537878 536705 535211 533416
61780 533416 531059 527861 524233 521180 519284 518053 516587 514677 512911 511779 511021 510003 508574 507312
61766 507312 506969 507771 509297 510996 512683 514522 516662 519104 521907 525297 529394 533906 538189 541603 543765
61751 543765 544566 544047 542273 539338 535502 531226 526923 522712 518595 514786 511582 508864 506120 503128 500300
61736 500300 498170 496876 496423 497054 498865 501207 503017 503771 503794 503686 503827 504466 505799 507739 509830 511630
61720E11630J432J327J526J824J941J810J737J979K185J642K69j131j920k389
61706E23862l072l761l907l652l811m772n983o560o105m907l701l152l318l650
61692D63511l705l623l613l379k616j779j672k294k787k639k296k359k741k936
61678D25072k774k475k249k081j843j444r61o30n89o38n25l96n95j017j058m86
61662D05311J05L6n12p09j57O45J008R25R06J149J284J091R67J265J475Q22k95
61645D15316l91J141K953L339K390J642J885K292J833N62p62j651k084k225k312
61630D23928k499k605k354j968k081k820l427l115j988q58l62n31j005j362j460
61615C95493j474j588j613j242o54m61r98j992l025l915m537m733m553m236l872
$$ plain form
61720 511630 513062 514389 515915 517739 519680 521490 523227 525206 527391 529033 529302 528171 526251 523862
61706 523862 520790 517029 513122 509470 505659 500887 494904 488344 482239 477332 473631 470479 467161 463511
61692 463511 459806 456183 452570 449191 446575 444796 443124 440830 438043 435404 433108 430749 428008 425072
61678 425072 422298 419823 417574 415493 413650 412206 411245 410615 410026 409388 408863 408467 407872 406855 405797 405311
61662 405311 405416 405452 404940 404231 404074 404719 405727 406652 407558 408707 409991 411082 412049 413314 414789 415611 415316
61645 415316 414925 416066 419019 422358 424748 426390 428275 430567 432400 432962 432200 430549 428465 426240 423928
61630 423928 421429 418824 416470 414502 412421 409601 406174 403059 401071 400213 399851 399320 398315 396953 395493
61615 395493 394019 392431 390818 389576 388922 388461 387463 385471 382446 378531 373994 369261 364708 360472 356600
61600C56600l419l124l335l743l456k173p60k34o84j550k399k950k813j939r93
61585C23028o45o86l99L35Q81P62J36n70j067j204r55n20k02k08n98j189j407
61568C15492o85O82J581J435R85J153J607J367N09J64P37J300J044M22K77N89
61552C28659P68O85P02R58J225J358J389J272R76P87J037J538J672J218P16Q29
61536C45789J512K114K217K077K164K488K606K206J465P46J63m04j053j708k163
61521C60219k173j639q46l45l63n29l91j02j96p34j054n41N69J415J395P20L4
61504C55439l45o89j307j919j889j152m61m59p61m50O68J756K027J590J053O36
61488C53737P4p13j272j103k97N03Q27Q16Q77J092J211J151J083R83O14O6j38
$$ plain form
61600 356600 353181 350057 346722 342979 339523 337350 336590 336356 335672 334122 331723 328773 325960 324021 323028
61585 323028 322383 321697 321298 321633 322514 323276 323412 322842 321775 320571 319616 319096 318894 318686 318088 316899 315492
61568 315492 314807 315489 317070 318505 319490 320643 322250 323617 324126 324290 325027 326327 327371 327793 328070 328659
61552 328659 329427 330112 330814 331772 332997 334355 335744 337016 337992 338779 339816 341354 343026 344244 344960 345789
61536 345789 347301 349415 351632 353709 355873 358361 360967 363173 364638 365384 365547 365143 364090 362382 360219
61521 360219 358046 356407 355561 355216 354853 354324 353933 353831 353635 352901 351847 351306 351875 353290 354685 355405 355439
61504 355439 355094 354405 353098 351179 349290 348138 347677 347218 346457 346007 346675 348431 350458 352048 353101 353737
61488 353737 353811 353098 351826 350723 350426 350929 351756 352572 353449 354541 355752 356903 357986 358969 359583 359649 359511
61471C59511J62L75N2k81J73J177J693J325P86P60R93R08N29L41N73R79J146Q38
61453C72040J92k21J63J206K079K181J774J442J235P40j67j069j484j255m64Q15
61437C79207K427L928M672M259K981J685R93P41L33l41o99k68O56J394J744K054
61421D05766K517K758K397J722J409J606J659J025Q3m00m04o26j307j785j600
61406D14820j250j379j700j529r56o64p81p86m88k53k72k96k39k61j90L10Q94
61389D04980Q02J67J02J015J865J694R43N04L46N9jO43J413J356Q22J128K551
61372D20389L805L834L051K404K040J522P78K43L13J030K115L060L443L316L179
61357D54522L460M225N267O234O745O773O846P459Q335Q774Q682Q598Q646Q118
$$ plain form
61471 359511 359673 360048 360100 359819 359992 361169 362862 364187 364973 365733 366726 367634 368163 368504 369077 370056 371202 372040
61453 372040 372232 372011 372174 373380 375459 377640 379414 380856 382091 382831 382664 381595 380111 378856 378392 379207
61437 379207 381634 385562 390234 394493 397474 399159 400152 400893 401226 400885 400186 399918 400574 401968 403712 405766
61421 405766 408283 411041 413438 415160 416569 418175 419834 420859 420942 420542 420138 419512 418205 416420 414820
61406 414820 413570 412191 410491 408962 408006 407342 406561 405775 405287 405034 404762 404466 404227 403966 403776 404086 404980
61389 404980 405782 405949 406051 407066 408931 410625 411568 412072 412418 412477 412476 413119 414532 415888 416710 417838 420389
61372 420389 424194 428028 431079 433483 435523 437045 437823 438066 438379 439409 441524 444584 448027 451343 454522
61357 454522 457982 462207 467474 473708 480453 487226 494072 501531 509866 518640 527322 535920 544566 552684
61343E52684O511M381K737J918J472R18K11l90o74p43j004j773k806l524l715
61328E56203l707l743l588l025k318j888j810j898k048k183k079j586q55j36M85
61313E25824R75J252J477K093L316M842O387Q215J0613J3086J4698J5121J4790
61300F22689J3990J2422R879O830L981J521q07l125n183o648p391p509p229o786
61286F26634o330n958n805n937o088n753m725l394k316j592r28k37K20L89O87
61271E78867J435K326K824K988L314L865M072L629L133L401M500N911P409R157
61257F36831J0986J2149J2040J0792Q994P013M782K101r65l869n808o400o160
61244F82486o047o499p193p662p776p549o894n851m707l745l024k546k289j956
$$ plain form
61343 552684 559195 563576 566313 568231 569703 570621 570832 570442 569768 569025 568021 566248 563442 559918 556203
61328 556203 552496 548753 545165 542140 539822 537934 536124 534226 532178 529995 527916 526330 525475 525339 525824
61313 525824 526799 528051 529528 531621 534937 539779 546166 554381 564994 578080 592778 607899 622689
61300 622689 636679 649101 658980 665810 669791 671312 670505 667380 662197 655549 648158 640649 633420 626634
61286 626634 620304 614346 608541 602604 596516 590763 586038 582644 580328 578736 577808 577571 577791 578180 578867
61271 578867 580302 582628 585452 588440 591754 595619 599691 603320 606453 609854 614354 620265 627674 636831
61257 636831 647817 659966 672006 682798 691792 698805 703587 705688 704723 700854 695046 688646 682486
61244 682486 676439 669940 662747 655085 647309 639760 632866 627015 622308 618563 615539 612993 610704 608748
61230F08748j105K32J416J945K102K517L392M440N284N672N539N179N095N389
61216F55845N616N508N358N379N100M067K749K074K290K868L297L348K812J846
61202G08157J349K161L871N355O465Q127J0694J3272J5184J6935J8999K0572K0490
61189H51631J8803J6463J3894J0848P464M453K211M84r56k045k914m017n551p187
61175I03581q554r660j0698j1787j3007j4362j5575j6196j6053j5460j4969j5062
61163G42198j5818j6635j6537j5208j3553j2635j2218j1086q794o229m232k553
61151F06700o77J059J959K173K546L388M110M045L104J498o64l247n812p714q403
61136F04065p707n956l791j684K45J950L287M350N646P464R344J0610J1340J2225
$$ plain form
61230 608748 607643 607875 609291 611236 613338 615855 619247 623687 628971 634643 640182 645361 650456 655845
61216 655845 661461 666969 672327 677706 682806 686873 689622 691696 693986 696854 700151 703499 706311 708157
61202 708157 709506 711667 715538 720893 727358 735485 746179 759451 774635 791570 810569 831141 851631
61189 851631 870434 886897 900791 911639 919103 923556 925767 926251 925295 923250 920336 916319 910768 903581
61175 903581 895027 885367 874669 862882 849875 835513 819938 803742 787689 772229 757260 742198
61163 742198 726380 709745 693208 678000 664447 651812 639594 628508 619714 613485 609253 606700
61151 606700 606023 607082 609041 611214 613760 617148 621258 625303 628407 629905 629241 625994 620182 612468 604065
61136 604065 596358 590402 586611 584927 585172 587122 590409 594759 600405 607869 617213 627823 639163 651388
61122F51388J3588J5152J6765J8609K0493K1739K2098K2201K2633K3095K3017
61111H70778K2461K1763K0727J9009J6999J5471J4380J2874J0557P995N743L616
61099A042373J197j597m822q698j3015j6928j9861k2134k4094k5244k4962k3710
61087H58505k2546k1639k0254j8235j6492j5645j5097j3965j2234j0406q522o407
61075F77063m494l517l291k650q81J246K461K606K768L786N195O002O101O392
61061F98787P505R004J0111J0740J1374J2220J3122J4124J5522J7315J9128K0752
61049H59704K2263K3547K4370K5041K6328K8359L0207L1033L1131L1314L1782
61038A165079L2230L2630L3166L3656L3759L3705L4151L5392L7156L9093M0943
$$ plain form
61122 651388 664976 680128 696893 715502 735995 757734 779832 802033 824666 847761 870778
61111 870778 893239 915002 935729 954738 971737 987208 1001588 1014462 1025019 1033014 1038757 1042373
61099 1042373 1043570 1041973 1037151 1028453 1015438 998510 978649 956515 932421 907177 882215 858505
61087 858505 835959 814320 794066 775831 759339 743694 728597 714632 702398 691992 683470 677063
61075 677063 672569 669052 665761 663111 662230 663476 665937 668543 671311 675097 680292 686294 692395 698787
61061 698787 706292 715296 725407 736147 747521 759741 772863 786987 802509 819824 838952 859704
61049 859704 881967 905514 929884 954925 981253 1009612 1039819 1070852 1101983 1133297 1165079
61038 1165079 1197309 1229939 1263105 1296761 1330520 1364225 1398376 1433768 1470924 1510017 1550960
61027A550960M2485M3955M6246M9896N4063N7252N9017O0069O0931O1603O2637
61016B149114O5213O9705P5239Q1221Q8222R6741J06157J15822J26281J38755
61006C112470J54496J75797K06713K51428L12722L93166M96634O26803P84839
60997F515068R69889J179437J405199J630242J836174K012882K149880K209160
60989A9907931K116444J804395J283560O69842J29247k15574l35454k74384j07391
60980B4978616P1695J45290k52m07928j003229j622807k102257k352222k373441
60971A5333465k222723j971839j683427j401755j150821r38240p62878o20779
60963D581003n06881m15490l41783k82794k36495k00656j73003j51571j34467
$$ plain form
61027 1550960 1593445 1637400 1683646 1733542 1787605 1844857 1903874 1963943 2024874 2086477 2149114
61016 2149114 2214327 2284032 2359271 2440492 2528714 2625455 2731612 2847434 2973715 3112470
61006 3112470 3266966 3442763 3649476 3900904 4213626 4606792 5103426 5730229 6515068
60997 6515068 7484957 8664394 10069593 11699835 13536009 15548891 17698771 19907931
60989 19907931 22024375 23828770 25112330 25782172 25911419 25695845 25360391 25086007 24978616
60980 24978616 25050311 25195601 25195349 24787421 23784192 22161385 20059128 17706906 15333465
60971 15333465 13110742 11138903 9455476 8053721 6902900 5964660 5201782 4581003
60963 4581003 4074122 3658632 3316849 3034055 2797560 2596904 2423901 2272330 2137863
60954B137863j19936j07168r6264q7019p8440o9925o2080n5654n0386m5751m2217
60943A323023m0753m1295m2627m3670m4061m3581m1908l9204l6194l3403l0745
60932H85582k8084k5584k3337k1128j8867j6770j4903j3025j1197r940r419q948
60920F84380p900o650n875n324m143k366j103r73j164n92N89J346J238R19J110
60905F53492J710K037J683Q13j60r87j704k511l567m835o050o887p241p381p667
60890F10745q069q174p855p673q167q898q838p794o773o654p025o981o525o415
60876E04904o828p029o467n506m809m526m416m253l884l202k354j706j314p36
60862D47874L75J729K723L083K994K812K877L340L943M243M218M270M504M461
$$ plain form
60954 2137863 2017927 1910759 1814495 1727476 1649036 1579111 1517031 1461377 1410991 1365240 1323023
60943 1323023 1282270 1240975 1198348 1154678 1110617 1067036 1025128 985924 949730 916327 885582
60932 885582 857498 831914 808577 787449 768582 751812 736909 723884 712687 702747 693328 684380
60920 684380 676480 669830 663955 658631 654488 652122 651019 650046 648882 648290 648879 650225 651463 652382 653492
60905 653492 655202 657239 658922 659735 659575 658588 656884 654373 650806 645971 639921 633034 625793 618412 610745
60890 610745 602676 594502 586647 578974 570807 561909 553071 545277 538504 531850 524825 517844 511319 504904
60876 504904 498076 491047 484580 479074 474265 469739 465323 461070 457186 453984 451630 449924 448610 447874
60862 447874 448249 449978 452701 455784 458778 461590 464467 467807 471750 475993 480211 484481 488985 493446
60848D93446L916L412L499L907M081M056M038L567K077Q9j215j667k306l677n004
60833E12219n462n260m876m133k872j796j677k220k583k655k925l345l375l018
60819D66022k906l238l513l451l396l638m039m560n411o378o681n950m772l908
60805D04181l461l231l285l666l996l975l818l697l164j862m39Mo40j314j171
60790C66466m41J75M59P52J381K248K815K553J619Q99J079J774K060J709J342
60775C86890J469J981K608L165L222K392J212R98K178L488L456K214J079P36P04
60760D17792M46P5j84m84r78j400j397j028p02p80j312j968k214j764r12j68L22
60743D03344P10Q56L24r78k564l956n079n882o008n310m406m162m663n056m514
$$ plain form
60848 493446 497362 500774 504273 508180 512261 516317 520355 523922 525999 526088 524873 523206 520900 517223 512219
60833 512219 506757 501497 496621 492488 489616 487820 486143 483923 481340 478685 475760 472415 469040 466022
60819 466022 463116 459878 456365 452914 449518 445880 441841 437281 431870 425492 418811 412861 408089 404181
60805 404181 400720 397489 394204 390538 386542 382567 378749 375052 371888 370026 369587 369591 368951 367637 366466
60790 366466 366025 366200 366659 367411 368792 371040 373855 376408 378027 378926 380005 381779 383839 385548 386890
60775 386890 388359 390340 392948 396113 399335 401727 402939 403937 406115 409603 413059 415273 416352 417088 417792
60760 417792 418238 418313 418129 417645 416667 415267 413870 412842 412140 411360 410048 408080 405866 404102 403190 403022 403344
60743 403344 404054 404910 405234 404256 401692 397736 392657 386775 380767 375457 371051 366889 362226 357170 352656
60728C52656l132j729r75q94j116j315j290q15J60J235J782J690J510J668J879
60713C51314J708J364J298J325R17L71P32K288L833M062L142K313K309K763K995
60698C82734K787K380K096K048K020J753J396J445J950K189J549L81m57o78o09
60683D02984l94J17O89O84L2l95K17J532K424K276J565J160J283J377R17P3o41
60666D15900j214k158l561m707m938m472l884l221k235j251r05j179j367j068
60652C79740m79L20J572K996L577K733J196K54L70R71J231P22m43j696k441k569
60636C88054k418k140j566q22m78p17r08m75K32M95K65Q5K28N02P31Q69P87M21
60618C83145L3j63m02q89j174o60L15P46L41q0J93P85R13M99J31J33K15L4l17
$$ plain form
60728 352656 349524 347795 346820 345926 344810 343495 342205 341390 341550 342785 344567 346257 347767 349435 351314
60713 351314 353022 354386 355684 357009 357926 358297 359029 361317 365150 369212 372354 374667 376976 379739 382734
60698 382734 385521 387901 389997 392045 394065 395818 397214 398659 400609 402798 404347 404728 404271 403593 402984
60683 402984 402590 402707 403396 404080 404112 403717 403934 405466 407890 410166 411731 412891 414174 415551 416468 416541 415900
60666 415900 414686 412528 408967 404260 399322 394850 390966 387745 385510 384259 383354 382175 380808 379740
60652 379740 379261 379581 381153 384149 387726 390459 391655 391909 392279 393250 394481 395203 394760 393064 390623 388054
60636 388054 385636 383496 381930 381108 380630 379913 379005 378530 378762 379257 379522 379607 379835 380337 381068 381937 382724 383145
60618 383145 383178 383015 382613 381724 380550 379890 380205 380951 381292 381212 381405 382190 383103 383602 383733 383866 384081 384115 383798
60599C83798m63k72l0l2n2M63J608K703L042K693K253J977J689J383J399J849
60583D04008K351K471K125J428N61j57l98k14OR2L62J146K346L634M904O292P876
60566D38833R524J0972J2033J2790J3522J4356J4993J4993J4113J2248R307N581
60554E83265J938q83l098n380p628q891q562p018m918k592l86J193K166L302N151
60539E47659P337R363J1548J4523J8091K1370K3889K5899K7633K8822K8984K7776
60527G92894K4963K0429J4413P555P05n398j0394j4398j7510j9271j9039j7128
60515G57821j4952j3574j2637j1253r432p867o643n113k988o86J507L826O413
60502F84422Q990J1423J4137J7689K2250K7694L3693L9654M5000M9705N4179N8457
$$ plain form
60599 383798 383335 383063 383033 383001 382949 383412 385020 387723 390765 393458 395711 397688 399377 400760 402159 404008
60583 404008 406359 408830 410955 412383 412944 412787 412389 412175 412181 412273 412635 413781 416127 419761 424665 430957 438833
60566 438833 448357 459329 471362 484152 497674 512030 527023 542016 556129 568377 577684 583265
60554 583265 585203 584320 581222 575842 568214 559323 550761 543743 538825 536233 535847 537040 539206 542508 547659
60539 547659 554996 564359 575907 590430 608521 629891 653780 679679 707312 736134 765118 792894
60527 792894 817857 838286 852699 860254 860959 855561 845167 830769 813259 793988 774949 757821
60515 757821 742869 729295 716658 705405 695973 688106 681463 676350 673362 672676 674183 678009 684422
60502 684422 693412 704835 718972 736661 758911 786605 820298 859952 904952 954657 1008836 1067293
60490A067293O1844O3493O2894N9764N4092M6511L8155K9773K1309J2574L773
60479A521475m994j4173k4227l4862m5283n4933o3438p0003p3512p3395p0143
60468I92512o4886n8691n2220m5827l9771l4349k9768k5967k2767k0121j8002
60457E80143j6018j3582j0703q280p219p409p845p611o567n243m322m117m309
60444D76918m259l697k959k406j923j267n73k20l02o51j162j710j929j533q32
60429D51495m80o64r15q84q12j011j301j285j013r33j195j385j138p09n49m46
60413D36775M29K300M082M420L235J750R83R42J247J764K209J903O56o27r46n24
60397D60598l05m42j75Q36J946K543K781K988L030K750K507K740L307L668L564
$$ plain form
60490 1067293 1129137 1192630 1255524 1315288 1369380 1415891 1454046 1483819 1505128 1517702 1521475
60479 1521475 1516481 1502308 1478081 1443219 1397936 1343003 1279565 1209562 1136050 1062655 992512
60468 992512 927626 868935 816715 770888 731117 696768 667000 641033 618266 598145 580143
60457 580143 564125 550543 539840 531560 524341 516932 509087 501476 494909 489666 485344 481227 476918
60444 476918 472659 468962 466003 463597 461674 460407 459834 459614 459312 458661 457499 455789 453860 452327 451495
60429 451495 451015 450351 449436 448552 447740 446729 445428 444143 443130 442197 441002 439617 438479 437770 437221 436775
60413 436775 437204 439504 443586 448006 451241 452991 453974 454916 456163 457927 460136 462039 462695 462068 461122 460598
60397 460598 460293 459851 459676 460512 462458 465001 467782 470770 473800 476550 479057 481797 485104 488772 492336
60382D92336L155K735K595K950L596L823L116J876J082J230J841K067J578P83
60368E24763L32N08J036J409J386J140J024J270J797K219K150J721J607K218L058
60353E47638L378L388M153O063Q116R102Q939Q345P635O508M755K552J18k342
60339F18348m465n962o945p547p391o125m350l248l133l122k517j807j791k363
60325E57582k846l110l658m636n444n395m393k917j592q08m45N1J085K522M005
60310E30001N540P389R519J1555J3262J4648J5607J5944J5815J5700J5738J5471
60298F86189J4438J2647J0228P065L138j164n493r959j4516j8183j9620j8615
60286F46155j6404j4376j2923j1710j0536r455q367p111n917n330n501n754n166
$$ plain form
60382 492336 495491 498226 500821 503771 507367 511190 514306 516182 517264 518494 520335 522402 523980 524763
60368 524763 525095 525603 526639 528048 529434 530574 531598 532868 534665 536884 539034 540755 542362 544580 547638
60353 547638 551016 554404 558557 564620 572736 581838 590777 599122 606757 613265 618020 620572 620690 618348
60339 618348 613883 607921 600976 593429 586038 579913 575563 572315 569182 566060 563543 561736 559945 557582
60325 557582 554736 551626 547968 543332 537888 532493 528100 525183 523591 522783 522338 522389 523474 525996 530001
60310 530001 535541 542930 552449 564004 577266 591914 607521 623465 639280 654980 670718 686189
60298 686189 700627 713274 723502 730567 733705 732541 727048 717089 702573 684390 664770 646155
60286 646155 629751 615375 602452 590742 580206 570751 562384 555273 549356 544026 538525 532771 527605
60273E27605l540j686o09n68j036j503j942k437k764k688k343j883j060K75J469
60258E05290J632R38N65J098J771J727J269J189J416J191L09n93r87j014j023
60243E14778j096j119j038r32j034j534k165k307j785j187r32n21N61J734K036
60228E03459J684J826K771L627L823L874M233M485M236L790L403K844K382L116
60214E49553N346P500P941P122O743P253P627P293O846O723O545O070N664N442
60200F43668M938M060L389L113K517J118n10j618k264k842l349l712m234n014
60186F39260n472n249n000n435o031n720m569l687l489l176k166j101q57j308
60172E86000j613j304n95J05N01M66J62l4oj63r05j928k467k158j413q77p71q26
$$ plain form
60273 527605 524065 522379 521770 521202 520166 518663 516721 514284 511520 508832 506489 504606 503546 503821 505290
60258 505290 506922 507860 508425 509523 511294 513021 514290 515479 516895 518086 518395 517802 516815 515801 514778
60243 514778 513682 512563 511525 510593 509559 508025 505860 503553 501768 500581 499649 499128 499689 501423 503459
60228 503459 505143 506969 509740 513367 517190 521064 525297 529782 534018 537808 541211 544055 546437 549553
60214 549553 554899 562399 570340 577462 584205 591458 599085 606378 613224 619947 626492 632562 638226 643668
60200 643668 648606 652666 656055 659168 661685 662803 662293 660675 658411 655569 652220 648508 644274 639260
60186 639260 633788 628539 623539 618104 612073 606353 601784 598097 594608 591432 589266 588165 587308 586000
60172 586000 584387 583083 582488 582593 583094 583560 583722 583688 583682 583519 582614 580686 578219 576061 574648 573771 573000 572174
60154E72174o94k08O12J647K662L324L396K982K480K232K257K315K208J919J594
60139F00900J501J895K751L649M126M114L903L757L820M250N059N711N350L757
60125F54543J864Q88J082J669J948K043K433L146L751M016M227M731N322N333
60111F96996M377K873J648J029N58k74j359k340l369m905o758p949p895p141o469
60096F59022n720m237k235q26n47o31j28Q74J605J714J432J021O77O84J058J149
60080F54912K85j248k508l145l670m445n158n622o242p204p889p784p425p636
60066E85221q172q005o806n295m097l118k246j853k162k711k915k744k379j681
60052E31037n34O04J142J257J698K678L497L510L033K944L621M555M919M316L016
$$ plain form
60154 572174 571480 571272 571884 573531 576193 579517 582913 585895 588375 590607 592864 595179 597387 599306 600900
60139 600900 602401 604296 607047 610696 614822 618936 622839 626596 630416 634666 639725 645436 650786 654543
60125 654543 656407 657295 658377 660046 661994 664037 666470 669616 673367 677383 681610 686341 691663 696996
60111 696996 701373 704246 705894 706923 707481 707207 705848 703508 700139 695234 688476 680527 672632 665491 659022
60096 659022 653302 649065 646830 646004 645457 644826 644698 645572 647177 648891 650323 651344 652021 652705 653763 654912
60080 654912 655197 653949 651441 648296 644626 640181 635023 629401 623159 615955 608066 600282 592857 585221
60066 585221 577049 569044 562238 556943 552846 549728 547482 545629 543467 540756 537841 535097 532718 531037
60052 531037 530503 531107 532249 533506 535204 537882 541379 544889 547922 550866 554487 559042 563961 568277 571293
60037E71293J634O54J65q8m21j021j856k708l288l491l521l695m077m458m665
60022E40457m776n000n476o223p116p805p849p119o017n141m739m594m422m101
60008D60079l552k673j632r74j101j637j704q93K57R46J001Q43P74P17O12O83
59992D51746J145J888K664L340L791L790L278K585K089J770J362Q96O23M28k55
59977D81140j686l264m044l677k635j676j264j382j631j560j093o23n12n41q8
59962D55464J123K664L801M124L758L131K646K371K003J186j3j058j431j106n01
59947D78162m9Q1J0l0L0o2o43j647k519k754k434k021j723j268l54Q51J795K017
59929D67442J596J132J311K355L894N364O493P271P592P201O064M532L017J662
$$ plain form
60037 571293 572927 573581 573746 573658 573237 572216 570360 567652 564364 560873 557352 553657 549580 545122 540457
60022 540457 535681 530681 525205 518982 511866 504061 496212 489093 483076 477935 473196 468602 464180 460079
60008 460079 456527 453854 452222 451248 450147 448510 446806 445913 446170 447116 448117 448960 449734 450451 451063 451746
59992 451746 452891 454779 457443 460783 464574 468364 471642 474227 476316 478086 479448 480344 480967 481395 481140
59977 481140 479454 476190 472146 468469 465834 464158 462894 461512 459881 458321 457228 456605 456093 455552 455464
59962 455464 456587 459251 463052 467176 470934 474065 476711 479082 481085 482271 482258 481200 479769 478663 478162
59947 478162 478113 478194 478204 478174 478204 478142 477499 475852 473333 470579 468145 466124 464401 463133 462779 463630 465425 467442
59929 467442 469038 470170 471481 473836 477730 483094 489587 496858 504450 511651 517715 522247 525264 526926
59915E26926M92l16n40k57K41Q38J650K625L381L568L222K585J785R07J82j52
59899E47137j34Q6N69J419K312K683K511K546L493N168O750P559P434O586N515
59884F01634M883M969N371N513N358N205M983M372L588L303L601L605K573Q37
59870F59795p81k070l340m613n494n803n703n299m584l843l545l681l712l352
59856F03975k953k875k831k261j140M8J033K095L571N332O873P895Q668R803J1578
59841F48811J3498J4457J3506J0579O617K983O53k51j92L68J283K366K991K288
59827G19957j05l581o903r076r968j0185j0344j0486j0193r284q149p371p075
59814F17237o826o160n158m458m636n526o197n857m703l595k930k260j191j00
$$ plain form
59915 526926 527418 527102 526562 526305 526546 527384 529034 531659 535040 538608 541830 544415 546200 547107 547289 547137
59899 547137 547003 547089 547658 549077 551389 554072 556583 559129 562622 567790 574540 582099 589533 596119 601634
59884 601634 606517 611486 616857 622370 627728 632933 637916 642288 645876 649179 652780 656385 658958 659795
59870 659795 659014 656944 653604 648991 643497 637694 631991 626692 622108 618265 614720 611039 607327 603975
59856 603975 601022 598147 595316 593055 591915 591963 592996 595091 598662 603994 610867 618762 627430 637233 648811
59841 648811 662309 676766 690272 700851 707468 710451 711104 710853 710661 711029 712312 714678 717669 719957
59827 719957 719852 716271 709368 700292 690324 680139 669795 659309 649116 639832 631683 624312 617237
59814 617237 610411 604251 599093 594635 589999 584473 578276 572419 567716 564121 561191 558931 557740 557640
59800E57640L87L13K17K89K10j78n57n47j64K48K93j65p73q89l09L62M42Q9PL62
59780E57277O08M07M0k40p23j711k857l390k846j508k49J13l72p01J8J420K323
59763E47609K156J472J011J056J735L131M740N605N464N127N335N824O082O294
59749F02641O880P552P565O693N379M246L869M548N777O348N607M192L029K159
59735F76485J260O66Q54J328J154L83j00m6q0m64p83r33j424k372l154l417l547
59718F65810l786l779l369l034l086l107k746k287j989j520o53J14L01K60N87
59703F37716J170J476J447J403J338R60L45n5O3O42J470K180K306J672O44l31
59687F54446j149j792k018j750j427j502j833k021k106k442l072l737m310m813
$$ plain form
59800 557640 558027 558340 558557 558846 559056 558878 558321 557774 557610 557858 558151 557986 557213 556324 556015 556377 556819 556908 556915 557277
59780 557277 557885 558292 558332 558092 557369 555658 552801 549411 546565 545057 544808 544921 544549 543848 543866 545286 547609
59763 547609 549765 551237 552248 553304 555039 558170 562910 568515 573979 579106 584441 590265 596347 602641
59749 602641 609521 617073 624638 631331 636710 640956 644825 649373 655150 661498 667105 671297 674326 676485
59735 676485 677745 678411 679265 680593 681747 682130 682030 681984 681904 681440 680657 679724 678300 675928 672774 669357 665810
59718 665810 662024 658245 654876 651842 648756 645649 642903 640616 638627 637107 636454 636568 636869 637129 637716
59703 637716 638886 640362 641809 643212 644550 645510 645855 645800 645863 646505 647975 650155 652461 654133 654777 654446
59687 654446 653297 651505 649487 647737 646310 644808 642975 640954 638848 636406 633334 629597 625287 620474
59673F20474n121n051m666m160l659l367l566m110m332l885l234k795k154r04
59659E69470L24O80O45J494L278M565M468L787L657M066M309M061L259J666o68
59644F09061k892m155m598m988n585o024o075n866n441m727l910l373l150k900
59630E45377k479k141k102k228k314k369k546k854l080k960k495k073k124k558
59616E11054k824k703k615k852k890k084q02q3j42J2J114K523L103K751K370K521
59600E08453K769K469J648R04O75R06J206J203Q37M36M29Q69J306J187M13o13
59584E25097j350j504j154o10k03j56n13j113j589j503p96j5J11m46q48l52O92
59567E13748J152M78o16j024m98K55N55M53L31K31j30p58j254j373j394j637j806
$$ plain form
59673 620474 615353 610302 605636 601476 597817 594450 590884 586774 582442 578557 575323 572528 570374 569470
59659 569470 569794 570474 571119 572613 575891 580456 584924 588711 592368 596434 600743 604804 608063 609729 609061
59644 609061 606169 602014 597416 592428 586843 580819 574744 568878 563437 558710 554800 551427 548277 545377
59630 545377 542898 540757 538655 536427 534113 531744 529198 526344 523264 520304 517809 515736 513612 511054
59616 511054 508230 505527 502912 500060 497170 495086 494284 494201 494059 494071 495185 497708 500811 503562 505932 508453
59600 508453 511222 513691 515339 516243 516918 517824 519030 520233 521070 521506 521935 522804 524110 525297 525710 525097
59584 525097 523747 522243 521089 520479 520276 520120 519607 518494 516905 515402 514606 514591 514702 514256 513408 513056 513748
59567 513748 514900 515378 514762 513738 513240 513495 514050 514503 514834 515065 514935 514177 512923 511550 510156 508519 506713
59550E06713j284l8J193J828K152K814L886M930N840P144R294J2020J4555J6358
59536E87405J7491J8318J8749J7773J4072P484k15o457r800j0477r303o841l730
59523F34469r83O77J368J532J164P2j463k853l908m897o016p183q243r004r158
59508E85574q582p640o797o096n371m758m480m287l751l037k725k762k411j446
59494E21431o93q94j586j699r09J30O52M41j82n46j6J323K460K449J597J151J810
59477E26919L051M070M787N526O134O079N307M437L958L691L226K548J932J505
59463E83170J260J355J914K639L047L180L606M577N631O278O630P052P516P742
59449F45597P668P332O516N005L038J082p67k685m587o172p390q347q851q617
$$ plain form
59550 506713 505429 505391 506584 508412 510564 513378 517264 522194 528034 535178 544472 556492 571047 587405
59536 587405 604896 623214 641963 659736 673808 681292 681077 674620 664820 654343 645040 638199 634469
59523 634469 633486 634163 635531 637063 638227 638299 636836 633983 630075 625178 619162 611979 603736 594732 585574
59508 585574 576992 569352 562555 556459 551088 546330 541850 537563 533812 530775 528050 525288 522877 521431
59494 521431 520738 519844 518258 516559 515650 515780 516432 516873 516691 516145 516129 517452 519912 522361 523958 525109 526919
59477 526919 529970 534040 538827 544353 550487 556566 561873 566310 570268 573959 577185 579733 581665 583170
59463 583170 584430 585785 587699 590338 593385 596565 600171 604748 610379 616657 623287 630339 637855 645597
59449 645597 653265 660597 667113 672118 675156 676238 675471 672786 668199 662027 654637 646290 637439 628822
59435F28822p809o805n520l709j873r00o77jJ753L777N183O270P807R825J1908
59420F48051J3999J6047J7506J8235J9311K1686K4412K5624K5174K4690K4676
59409H79411K3037J7413Q016k625j1841j7913j9910j7916j3341p957k494L087
59397H36967Q021J0414Q802L473l954j1625j7874k1323k1528j9460j6755j4348
59385G40810j2065r511o933n001m046l776l744l712l595l255k647k054j869k016
59371F76586j860r63K10P24L93J63R80K529L612L693L573M300N870P404Q346Q980
59355G24540R809J0896J1978J2932J3877J4952J6106J7084J7596J7642J7540J7444
59343I02396J6908J5303J2706R908P487N224K689o7k745n338q069j0957j3829
$$ plain form
59435 628822 621013 614208 608688 604979 603106 602206 601529 601528 603281 607058 612241 618511 626318 636143 648051
59420 648051 662050 678097 695603 713838 733149 754835 779247 804871 830045 854735 879411
59409 879411 902448 919861 927877 925252 913411 895498 875588 857672 844331 836374 833880 836967
59397 836967 844988 855402 864204 867677 863723 852098 834224 812901 791373 771913 755158 740810
59385 740810 728745 719234 712301 707300 703254 699478 695734 692022 688427 685172 682525 680471 678602 676586
59371 676586 674726 673763 673973 674697 675090 675253 676233 678762 682374 686067 689640 693940 699810 707214 715560 724540
59355 724540 734349 745245 757223 770155 784032 798984 815090 832174 849770 867412 884952 902396
59343 902396 919304 934607 947313 957221 964708 969932 972621 972554 969809 964471 956402 945445 931616
59330I31616j6483j8525j9427j9228j8872j9159j9540j8753j6669j4625j3689
59319G36646j3387j2633j1319j0240r822r610r079q309p743p559p523p249o516
59306F15657n372m063k831j763p21O18K569N131P862J0211J1936J3139J3994J4665
59292F81032J5179J4967J2733P517J02p137j2121j4416j4682j3484j1205q514
59280F49971o070l859j424J249L624N392O878Q591J0695J2895J4579J5077J4282
59267G31880J3001J2331J2532J2758J1993R957P132M200J520j068l958p038r375
59254G95865j0055r288q206p578p201o608n778m845l631j912J09J993L518M673
59240G41056N418N773N959O191O391O296N736M663L135J412j20j398k835m831
$$ plain form
59330 931616 915133 896608 877181 857953 839081 819922 800382 781629 764960 750335 736646
59319 736646 723259 710626 699307 689067 679245 669635 660556 652247 644504 636945 629422 622173 615657
59306 615657 610285 606222 603391 601628 600907 601525 604094 609225 617087 627298 639234 652373 666367 681032
59292 681032 696211 711178 723911 731428 731530 724393 712272 697856 683174 669690 658485 649971
59280 649971 643901 640042 638618 639867 643491 648883 655761 664352 675047 687942 702521 717598 731880
59267 731880 744881 757212 769744 782502 794495 804452 811584 815784 817304 816236 812278 805240 795865
59254 795865 785810 776522 768316 760738 753537 746929 741151 736306 732675 730763 730872 732865 736383 741056
59240 741056 746474 752247 758206 764397 770788 777084 782820 787483 790618 792030 791910 790512 787677 782846
59226G82846p259r604j1451j2686j3430j3930j4285j4140j2961j0864q774p498
59214F45964o870o164n001l597k350j615j590j933j805p51N75J194J028Q32R96
59199F18913J180J173J377K163L253M111M544M667M564M279L911L555L272L148
59185F64110L189L180K851K248J616J043M73M0n1R4J87K52N08Q33Q67O62O75J051
59167F83828J471J796K242K749K869K466J853J044l50k184l578m231n021o675
59153F78279q551r582r794r913j0008r529q488p501o802o091n335m939m957m947
59139E71842m677m360m123l863l609l469l192k438j411n75J69J220K232K316J508
59124E47570J055J933L743N549O970P966Q367Q331Q727J0247J2408J4022J4495
$$ plain form
59226 782846 775587 765983 754532 741846 728416 714486 700201 686061 673100 662236 653462 645964
59214 645964 639094 632930 627929 624332 621982 620367 618777 616844 615039 614288 614863 616057 617085 617917 618913
59199 618913 620093 621266 622643 624806 628059 632170 636714 641381 645945 650224 654135 657690 660962 664110
59185 664110 667299 670479 673330 675578 677194 678237 678710 678750 678699 678793 678980 679232 679740 680573 681440 682102 682777 683828
59167 683828 685299 687095 689337 692086 694955 697421 699274 700318 699968 697784 694206 689975 684954 678279
59153 678279 669728 660146 650352 640439 630431 620902 612414 604913 598111 592020 586685 581746 576789 571842
59139 571842 567165 562805 558682 554819 551210 547741 544549 542111 540700 540125 540294 541514 543746 546062 547570
59124 547570 548625 550558 554301 559850 566820 574786 583153 591484 600211 610458 622866 636888 651383
59111F51383J4129J3446J2717J2037J1336J0324Q770O800M728K766J090j29r95
59098G48402j989l380m782n588n689n395m848l924k697j661j334j765k394k500
59084G00456j961j536k063l399m563n018n252n807o360o290n718n320n313n212
59070F36644m570l545k691k489l027l844m249l969l359k842k426k035j864k028
59056E93706k226k206k161k210j870p48O02J260J168R65Q16K95n43j006q67p79
59040E84196j220j781j941j871j978k250k416k278j526J40K199L368L159K752
59026E78553L550N378P060Q256R513J0748J1061J0333R675R713R464P777N022
59013F86103K408K40j962l981m842m341l481l007k421j059O69J894K592L467M746
$$ plain form
59111 651383 665512 678958 691675 703712 715048 725372 734142 740942 745670 748436 749526 749397 748402
59098 748402 746413 743033 738251 732663 726974 721579 716731 712807 710110 708449 707115 705350 702956 700456
59084 700456 698495 696959 694896 691497 686934 681916 676664 670857 664497 658207 652489 647169 641856 636644
59070 636644 632074 628529 625838 623349 620322 616478 612229 608260 604901 602059 599633 597598 595734 593706
59056 593706 591480 589274 587113 584903 583033 582285 582887 584147 585315 586280 587096 587391 586848 585842 584975 584196
59040 584196 582976 581195 579254 577383 575405 573155 570739 568461 566935 567075 569274 572642 575801 578553
59026 578553 582103 587481 594541 602797 612310 623058 634119 644452 654127 663840 673304 681081 686103
59013 686103 688511 688751 686789 682808 677966 673625 670144 667137 664716 663657 664326 666220 668812 672279 677025
58998F77025N888O440O514O325N864N166M415L629K592J318J89n33j034j602k279
58983G19917k998l728m297m318l530k082k98J561L322M939O669Q766J0896J2260
58969G47079J2593J2528J2680J2847J2625J2263J2272J2445J2145J1372J0720
58958H81569J0075Q317M801N11k935n187p393j0573j4328j7400j9101j9754j9861
58945G88741j9404j8147j6266j4221j2185j0101q264p236o928o327m621k249l68
58932F62424M13L51j30p87j281j198n86k2j2n50j388k369l291l754l416k392j267
58915F40745o71p77j066p34N13K060L021L200L209L706M811O315Q140J0330J2660
58900F95462J4492J5221J4922J4448J4605J5273J5646J5391J5101J5457J6382
$$ plain form
58998 677025 682913 689353 695867 702192 708056 713222 717637 721266 723858 725176 725365 724832 723798 722196 719917
58983 719917 716919 713191 708894 704576 701046 698964 698666 700227 703549 708488 715157 723923 734819 747079
58969 747079 759672 772200 784880 797727 810352 822615 834887 847332 859477 870849 881569
58958 881569 891644 899961 904762 905273 902338 897151 889758 879185 864857 847457 828356 808602 788741
58945 788741 769337 751190 734924 720703 708518 698417 690153 682917 675989 669662 665041 662792 662424
58932 662424 662837 663188 663058 662271 660990 659792 659206 659184 659172 658622 657234 654865 651574 647820 644404 642012 640745
58915 640745 640074 639297 638231 637497 638010 640070 643091 646291 649500 653206 658017 664332 672472 682802 695462
58900 695462 709954 725175 740097 754545 769150 784423 800069 815460 830561 846018 862400
58889H62400J7501J8945K1037K3280K4367K3370K0557J6954J3359R886O174K010
58877A059840k203n719q343j0719j3441j6145j7941j8421j7806j6315j4111j1712
58865I06964r782q479p567p106p303p874q244q541r474j1052j2278j2484j2147
58852G84633j1917j1601j0742r567q642q017p388o846o744p092p606q233q961
58839F71277r330q752p397o180n744n827n788n382m855m496m275l868l027j864
58825E94492p58O8P21J374K054K815L755M690N111M829M371M357M632M434L390
58810F40335J998J009O72O25L51l52j180j559j266q29j102k371m031n231n644
58795F21425n532n212m792m409m302m495m570m102l183k116p86J113L116M044
$$ plain form
58889 862400 879901 898846 919883 943163 967530 990900 1011457 1028411 1041770 1051656 1057830 1059840
58877 1059840 1057637 1051918 1043575 1032856 1019415 1003270 985329 966908 949102 932787 918676 906964
58865 906964 897182 888703 881136 874030 866727 858853 850609 842068 832594 821542 809264 796780 784633
58852 784633 772716 761115 750373 740806 732164 724147 716759 709913 703169 696077 688471 680238 671277
58839 671277 661947 653195 645798 639618 633874 628047 622259 616877 612022 607526 603251 599383 596356 594492
58825 594492 593734 593802 594523 595897 597951 600766 604521 609211 614322 619151 623522 627879 632511 636945 640335
58810 640335 642333 643342 644014 644639 644990 644638 643458 641899 640633 639804 638702 636331 632300 627069 621425
58795 621425 615893 610681 605889 601480 597178 592683 588113 584011 580828 578712 577926 579039 582155 586199
58781E86199L530K819L272M549N170M663L987L780L351J980J53j247k376m030
58767F15800o146p673p915p293o574n948n169m158l100k130j239m32K08P00J160
58752E60091J555J561J048N64J000K496M058M581M055L420L435M178N400O765
58738F04207P726P834P407P289P787Q263Q047P299O647O341O173N981N856N883
58724G02740N853N388M421L554L602M633N797O468P046Q006Q712Q189O755N658
58710G86822N105L930J513j277l608n905q740j1534j3427j4680j6115j7673j8589
58697F85822j8680j8510j8421j8205j7628j6576j4853j2460r980q134p014o245
58685E19116n634n223m888m390l731l070k454j932j589j245n31M11R75J214K133
$$ plain form
58781 586199 589729 592548 595820 600369 605539 610202 614189 617969 621320 623300 623453 622206 619830 615800
58767 615800 609654 601981 594066 586773 580199 574251 569082 564924 561824 559694 558455 558023 558231 558931 560091
58752 560091 561646 563207 564255 564819 565819 568315 572373 576954 581009 584429 587864 592042 597442 604207
58738 604207 611933 619767 627174 634463 642250 650513 658560 665859 672506 678847 685020 691001 696857 702740
58724 702740 708593 713981 718402 721956 725558 730191 735988 742456 749502 757508 766220 774409 781164 786822
58710 786822 791927 795857 797370 796093 792485 786580 777840 766306 752879 738199 722084 704411 685822
58697 685822 667142 648632 630211 612006 594378 577802 562949 550489 540509 532375 525361 519116
58685 519116 513482 508259 503371 498981 495250 492180 489726 487794 486205 484960 484429 484840 485815 487029 489162
58670D89162M286O788Q537R691J1036J2562J3789J4818J5872J6112J4311J0650
58658F27614O543K695j430o014j0034j2396j3045j2579j1603j0725j0342j0091
58646E38593r156p394n509l983k634j410p72q97j249j281r67l78N77J585J911
58631E07036J380P80P72R72O76l2m73k67N21J872L828O135Q229R570R797Q820
58615E59616P016N226M175L895L819L381K544J719J236Q31j12j713l238l826l347
58600E81222k323j337q53j179k060k614k304j665j413j191j9K198M553O442Q045
58585E85502R474J0398J0770J1035J1349J1302J0638R607Q386O965N714N280N571
58572G01991N745N517N700P030R288J2053J5432J9364K2996K5538K7189K8423
$$ plain form
58670 489162 493448 500236 508773 518464 529500 542062 555851 570669 586541 602653 616964 627614
58658 627614 634157 636852 635422 629408 619374 606978 593933 581354 569751 559026 548684 538593
58646 538593 529437 522043 516534 512551 509917 508507 507735 506838 505589 504308 503341 502963 503540 505125 507036
58631 507036 508416 509196 509968 510940 511616 511584 511111 510844 511365 513237 517065 523200 531429 540999 550796 559616
58615 559616 566632 571858 576033 579928 583747 587128 589672 591391 592627 593458 593346 591633 588395 584569 581222
58600 581222 578899 577562 576709 575530 573470 570856 568552 566887 565474 564283 564264 566462 571015 577457 585502
58585 585502 594976 605374 616144 627179 638528 649830 660468 670075 678461 685426 691140 696420 701991
58572 701991 707736 713253 718953 725983 735271 747324 762756 782120 805116 830654 857843 886266
58560H86266K8894K7927K5692K2956J9805J5532R942L993j104m968p876r886j0608
58547A006565r949q726q109q485r298j0134j1421j3567j5955j7567j8329j9031
58535H55994k0014k0729k0618j9590j7579j4521j0980q056o255n085l922k685
58523G05960j521o35n69j732l375l929k817j183m07o74j430k278k893k900k520
58508F77097k596l333l756l155k316k323k814k490j056L87P63P3r96j805k027
58493F49653j697j030o1J333K861L791L926M124N327P361R234J0374J1055J1831
58479G18082J2972J4318J5294J5248J4068J2244J0155P630M384N03l727p915j1292
58466H01964j2988j2944j1994j0681q632n577k270L01K076L699N537P545R661
$$ plain form
58560 886266 915160 943087 968779 991735 1011540 1027072 1037014 1041007 1039903 1034935 1027059 1017173 1006565
58547 1006565 996616 987890 979781 971296 961998 951864 940443 926876 910921 893354 875025 855994
58535 855994 835980 815251 794633 775043 757464 742943 731963 723907 717652 712567 708645 705960
58523 705960 704439 703804 703235 701503 698128 694199 691382 690199 689792 689118 687688 685410 682517 679617 677097
58508 677097 674501 671168 667412 664257 661941 659618 656804 654314 653258 653645 654408 654481 653485 651680 649653
58493 649653 647956 646926 646865 648198 651059 654850 658776 662900 668227 675588 684822 695196 706251 718082
58479 718082 731054 745372 760666 775914 789982 802226 812381 820011 824395 824898 821171 813256 801964
58466 801964 788976 776032 764038 753357 744725 739148 736878 737179 739255 742954 748491 756036 765697
58453G65697J1692J3067J3277J2272J0100O667K306j943n217p566r346j0372j0303
58440G90331r389q160o729n017l255j698k46J135K019K121J894J936K297K878
58426G70117L951N587P076P706P648P387O730N228L107R58j207l654n986p447
58412H07201q045q481r013r152q553p505o480n682n098m595l969l175k363j496
58398G23594k96J139K186K583K957L934N146N703N261M097K645J473J258K107
58384G63787L258M004M428M806M908M565M341M846N789O431O573O468O252O086
58370H36542O326O927P253P086P165Q021R043R547R935J0854J1855J2000J1246
58357I53800J0159Q849P229N721M625L371J523K4R0J299K133K118K144K836L900
$$ plain form
58453 765697 777389 790456 803733 816005 826105 832772 835078 833135 827918 820352 811006 800634 790331
58440 790331 780942 772782 766053 761036 757781 756083 755837 756972 758991 761112 763006 764942 767239 770117
58426 770117 774068 779655 786731 794437 802085 809472 816202 821430 824537 825495 824288 820634 814648 807201
58412 807201 799156 790675 781662 772510 763957 756452 749972 744290 739192 734597 730628 727453 725090 723594
58398 723594 723298 724437 726623 729206 732163 736097 741243 746946 752207 756304 758949 760422 761680 763787
58384 763787 767045 771049 775477 780283 785191 789756 794097 798943 804732 811163 817736 824204 830456 836542
58370 836542 842868 849795 857048 864134 871299 879320 888363 897910 907845 918699 930554 942554 953800
58357 953800 963959 972808 980037 985758 990383 993754 995277 995301 995391 996690 998823 1000941 1003085 1005921 1009821
58342A009821N037O358P861R356J0930J2657J4154J5158J6130J7425J8346J8017
58330A161250J6738J5397J4028J2132R854P743N660L280J203L71N80Q59J029J663
58316A251787K730L599M203N035O043O737P193Q006R301J0714J2124J3532J4622
58303A355626J5221J5708J6193J6057J5118J4384J4587J5025J4966J5079J6028
58292A523992J6960J6992J7025J8207J9710K0120J9966K0678K1945K2452K2520
58281A740567K3473K4926K5228K4374K4091K5217K7133K9461L2164L4295L4919
58270B045848L4975L6094L8054L9601M1101M3793M6992M8857M9527N0727N2578
58259B528147N3652N3890N4536N5475N5666N5997N8415O2296O5030O6385O8862
$$ plain form
58342 1009821 1014858 1021216 1029077 1038433 1049363 1062020 1076174 1091332 1107462 1124887 1143233 1161250
58330 1161250 1177988 1193385 1207413 1219545 1229399 1237142 1242802 1246082 1247285 1247656 1248236 1249095 1250124 1251787
58316 1251787 1254517 1258116 1262319 1267354 1273397 1280134 1287327 1295333 1304634 1315348 1327472 1341004 1355626
58303 1355626 1370847 1386555 1402748 1418805 1433923 1448307 1462894 1477919 1492885 1507964 1523992
58292 1523992 1540952 1557944 1574969 1593176 1612886 1633006 1652972 1673650 1695595 1718047 1740567
58281 1740567 1764040 1788966 1814194 1838568 1862659 1887876 1915009 1944470 1976634 2010929 2045848
58270 2045848 2080823 2116917 2154971 2194572 2235673 2279466 2326458 2375315 2424842 2475569 2528147
58259 2528147 2581799 2635689 2690225 2745700 2801366 2857363 2915778 2978074 3043104 3109489 3178351
58248C178351P3347P7781Q0820Q3655Q7422R1641R5941J00777J06019J11227J17281
58237D204262J25207J33784J41132J48057J56694J66633J75983J85397J97052
58228E634201K10406K23253K36277K52027K70169K88577L08380L32613L60622
58219H116525L89400M19841M55738M97267N41872N90884O48488P14784P87305
58210A3162104Q68757R65406J078655J206934J355179J533197J745886J995905
58202B3912023K295681K666246L127001L701305M432641N382829O617887Q210171
58194F0345784J0243422J2784853J5846951J9388129K3318975K7448448L1435434
58187B00811996L4871464L7395334L8554795L7450472L2729201K3367807R781654
$$ plain form
58248 3178351 3251698 3329479 3410299 3493954 3581376 3673017 3768958 3869735 3975754 4086981 4204262
58237 4204262 4329469 4463253 4604385 4752442 4909136 5075769 5251752 5437149 5634201
58228 5634201 5844607 6067860 6304137 6556164 6826333 7114910 7423290 7755903 8116525
58219 8116525 8505925 8925766 9381504 9878771 10420643 11011527 11660015 12374799 13162104
58210 13162104 14030861 14996267 16074922 17281856 18637035 20170232 21916118 23912023
58202 23912023 26207704 28873950 32000951 35702256 40134897 45517726 52135613 60345784
58194 60345784 70589206 83374059 99221010 118609139 141928114 169376562 200811996
58187 200811996 235683460 273078794 311633589 349084061 381813262 405181069 414962723
58180D14962723n815353k0288464l1022409l6852174l8084173l5976905l2137641
58173B14785604k7992838k4399330k1547663j9201619j7058960j4963609j2910274
58166G6711311j0963966r197424p658792o359377n282459m401208l686537l107073
58158B6054475k634079k247300j931716j671685j453303j269335j116589r90440
58150A2740028q85364p97856p25169o63403o09629n63263n22961m84981m46786
58141G040616m09470l74595l41536l09795k80880k55822k33534k13394j96841
58132D424749j84844j76317j70236j66523j63665j58549j50138j40583j31550
58123B982344j22291j12466j03664r6654r0014q2997p6902p2216o7297o1430n6463
$$ plain form
58180 414962723 409147370 388858906 357836497 320984323 282900150 246923245 214785604
58173 214785604 186792766 162393436 140845773 121644154 104585194 89621585 76711311
58166 76711311 65747345 56549921 48891129 42531752 37249293 32848085 29161548 26054475
58158 26054475 23420396 21173096 19241380 17569695 16116392 14847057 13730468 12740028
58150 12740028 11854664 11056808 10331639 9668236 9058607 8495344 7972383 7487402 7040616
58141 7040616 6631146 6256551 5915015 5605220 5324340 5068518 4834984 4621590 4424749
58132 4424749 4239905 4063588 3893352 3726829 3563164 3404615 3254477 3113894 2982344
58123 2982344 2860053 2747587 2643923 2547269 2457255 2374258 2297356 2225140 2157843 2096413 2039950
58112B039950n3705n1840m9534m7553m6681m6010m4974m4689m5565m5844m4260
58101A519295m2061m0707l9624l7779l5684l4188l2986l1710l0749k9809k7484
58090A136514k3576k0086j8626j8501j8370j7991j7285j5735j3876j3497j5055
58079I43916j6750j7232j7319j7885j8242j7999j8333j9729k0428j8904j6250
58068G44845j4388j3471j2653j1927j1438j0438q568o919o357o117n450n203o192
58055F25724p428p720p727q675j0170j0942j0845j0434r526p787o027n295n374
58042E17774n443n518n944o243n821n168n159n661n881n490m612l373k328k416
58028D48717l725n207o302p691r641j0894j0317q456o389m293k268j277j764k534
$$ plain form
58112 2039950 1986245 1934405 1884871 1837318 1790637 1744627 1699653 1654964 1609399 1563555 1519295
58101 1519295 1477234 1436527 1396903 1359124 1323440 1289252 1256266 1224556 1193807 1163998 1136514
58090 1136514 1112938 1092852 1074226 1055725 1037355 1019364 1002079 986344 972468 958971 943916
58079 943916 927166 909934 892615 874730 856488 838489 820156 800427 779999 761095 744845
58068 744845 730457 716986 704333 692406 680968 670530 661962 655043 648686 642569 637119 631916 625724
58055 625724 618296 610576 602849 594174 584004 573062 562217 551783 542257 534470 528443 523148 517774
58042 517774 512331 506813 500869 494626 488805 483637 478478 472817 466936 461446 456834 453461 451133 448717
58028 448717 444992 439785 433483 425792 416151 405257 394940 386484 380095 375802 373534 372257 370493 367959
58014C67959k353j691j586j826j745j720k319k887k515j697j520j838j763j225
58000C41274p29j75O75J269J092Q06J205J725J431P64P11Q67Lj721k750k321j310
57983C42816r47j646k988l995l721k452j737k417l383l244k393k069k225j858
57969C07741r12k87k44k57k15m61p86o38j11L08P07J338J693J157J78m15q37j829
57951C06130l135l793l680l410l087k386j560j068n04P72K294L132L525M414N710
57936C03354O564P093Q159R589J0313J0297J0546J1014J0280P737M512J683j002
57923D00139m024o944r064j0232j0509r926r016q616q761q645p897o982o133m919
57909B88471l231j710p55J2R74J924K551K797K592J960J456J633K075J907J296
$$ plain form
58014 367959 365606 363915 362329 360503 358758 357038 354719 351832 349317 347620 346100 344262 342499 341274
58000 341274 340545 340370 341045 342314 343406 344212 345417 347142 348573 349337 350048 350915 350918 349197 346447 344126 342816
57983 342816 341869 340223 337235 333240 329519 327067 325330 322913 319530 316286 313893 311824 309599 307741
57969 307741 306829 306542 306298 306041 305826 305365 304579 303941 303830 304138 304845 306183 307876 309033 309211 308796 307959 306130
57951 306130 302995 299202 295522 292112 289025 286639 285079 284011 283507 284279 286573 289705 293230 297644 303354
57936 303354 309918 317011 325170 334759 345072 355369 365915 376929 387209 394946 399458 401141 400139
57923 400139 396115 389171 380107 369875 359366 349440 340424 331808 323047 314402 306505 299523 293390 288471
57909 288471 285240 283530 282775 282787 283761 285685 288236 291033 293625 295585 297041 298674 300749 302656 303952
57894C03952J322K278L227L479L377L334L192K951L031L396L387K867K485K371
57880C44649J672m6j905k967l535m453n777o800o994o387n455m900n031n236m614
57865B82221l305k339k032j498j38J426K372K822L349M041M686N342O165P107
57851C10219Q063Q859Q964P915O246N144M878M439L076J362K38j75l02m99j145
57836C67282k506m017m571m075l807m568n474n391m575l927l429k547j590j397
57822C15408j947k426k509k580k758k661k244k057k448l052l273k952k512k654
57808B79335l739n317o492o950p198p553p476o455n011m110l831l391k370j302
57794B08140r83j612k603k998k212o29P03J115Q38L98Q4K81J537L708N569O134
$$ plain form
57894 303952 305274 307552 310779 314258 317635 320969 324161 327112 330143 333539 336926 339793 342278 344649
57880 344649 346321 346275 344370 341403 337868 333415 327638 320838 313844 307457 302002 297102 292071 286835 282221
57865 282221 278916 276577 274545 273047 272909 274335 276707 279529 282878 286919 291605 296947 303112 310219
57851 310219 318282 327141 336105 344020 350266 355410 360288 364727 367803 369165 369403 369228 368926 368427 367282
57836 367282 364776 360759 356188 352113 348306 343738 338264 332873 328298 324371 320942 318395 316805 315408
57822 315408 313461 311035 308526 305946 303188 300527 298283 296226 293778 290726 287453 284501 281989 279335
57808 279335 275596 270279 263787 256837 249639 242086 234610 228155 223144 219034 215203 211812 209442 208140
57794 208140 207157 205545 202942 199944 197732 197103 197806 198921 199759 200157 200241 200522 202059 205767 211336 217470
57778B17470N940O319P555Q656Q826Q383Q041P931P607O674N268L995L363L049
57764C09077K101O6k379m319n692o944p999q380q159q019q231q362q099p774p695
57749B19192p481o383m023o29L165O547Q808R701R526Q721P525O035M463L153
57735B68320K351J979J714J401J257J450J568R82j59q18l33P17J376J578J925
57720B85308K485K689K341J989K015K107J903J579J351Q92k00j601k540k792k885
57705B94641l289l848m209m387m582m692m403l774l251l092l057k854k581k482
57691B44140k556k715l126l938m758m857m013k759j726j019m18K18J019K327M482
57676B20301P445J0853J4477J8493K3281K9024L5608M2808N0507N8448O5815P1257
$$ plain form
57778 217470 223410 229729 237284 245940 254766 263149 271190 279121 286728 293402 298670 302665 306028 309077
57764 309077 311178 311244 308865 304546 298854 291910 283911 275531 267372 259353 251122 242760 234661 226887 219192
57749 219192 211711 205328 201305 200676 203841 210388 219196 228897 238423 247144 254669 260704 265167 268320
57735 268320 270671 272650 274364 275765 277022 278472 280040 281022 280863 280045 279712 280429 281805 283383 285308
57720 285308 287793 290482 292823 294812 296827 298934 300837 302416 303767 304659 304459 302858 300318 297526 294641
57705 294641 291352 287504 283295 278908 274326 269634 265231 261457 258206 255114 252057 249203 246622 244140
57691 244140 241584 238869 235743 231805 227047 222190 218177 215418 213692 212673 212255 212473 213492 215819 220301
57676 220301 227746 238599 253076 271569 294850 323874 359482 402290 452797 511245 577060 648317
57664F48317P3296P0358O0398M1636J4742j5799m3523o3597p4616p7458p3695
57653E60059o5386n5185m5379l6872k9552k3345j8493j4953j2192r674p324n504
57641B36200m533m272m112l590k875k408k182j813j255q97q98r52q87r01j071
57626B03554j145j102j260j593j586j160j041j682k448k504j969j580j568j669
57612A81247j878k368k839k720k002j264q57n40k4N94R60Q00J99l16k16K48J43
57595A69167r42k199k619k238j766j480j236j236j746k304k176j620j677k504
57581A43424k981k326j252q84j273j652j651j589j736j950k024j947j798j578
57567A18783j227o62J7L87m1j174k160k162j252k89N8l9J0L54N06P2n96p31j03
$$ plain form
57664 648317 721613 791971 852369 894005 908747 892948 849425 785828 711212 633754 560059
57653 560059 494673 439488 394109 357237 327685 304340 285847 270894 258702 249028 241704 236200
57641 236200 231667 227395 223283 219693 216818 214410 212228 210415 209160 208263 207365 206413 205526 204625 203554
57626 203554 202409 201307 200047 198454 196868 195708 194667 192985 190537 188033 186064 184484 182916 181247
57612 181247 179369 177001 174162 171442 169440 168176 167319 166779 166755 167349 168309 169109 169308 168992 168776 169024 169167
57595 169167 168225 166026 163407 161169 159403 157923 156687 155451 153705 151401 149225 147605 145928 143424
57581 143424 140443 138117 136865 135981 134708 133056 131405 129816 128080 126130 124106 122159 120361 118783
57567 118783 117556 116894 116911 117298 117257 116083 113923 111761 110509 110220 110278 110239 110249 110603 111109 111181 110585 109854 109751
57548A09751P49J309J641J985K195K006J578J269J134J071J253J898K708L091
57534A33638K845K091P30j285l170l715k746j407o52k22M18R60Q54M30M66R20
57518A30155J023O20M72J090J982K399K224J744J048J26p31j124j044q59q85j236
57502A37004j902k724l355l522l289k947k663k524k680l103l344k913j977j232
57488I8829j051j122j060r26r30r49p54m08j56o2j0O6K18M86O69M10k40o75n33
57469I1802k64m29p19l82N74J243R49q3j168j759j591p89Q7N64Q68J464K103J986
57451I4456J004K0l05k45l32n96q82j225j427r47K14J059P15l97j150j162r10
57434H7890o84k03N98J144Q78M5m53K5J151J845J350Q3q35r05p29j017j616j861
$$ plain form
57548 109751 110500 111809 113450 115435 117630 119636 121214 122483 123617 124688 125941 127839 130547 133638
57534 133638 136483 138574 139304 138019 134849 131134 128388 126981 126329 126107 126525 127485 128339 128769 129235 130155
57518 130155 131178 131798 132270 133360 135342 137741 139965 141709 142757 142883 142152 141028 139984 139125 138240 137004
57502 137004 135102 132378 129023 125501 122212 119265 116602 114078 111398 108295 104951 102038 100061 98829
57488 98829 97778 96656 95596 94670 93740 92791 92037 91629 91473 91411 91401 91467 91685 92171 92840 93250 93010 92335 91802
57469 91802 91538 91109 90390 90008 90582 91825 92774 92691 91523 89764 88173 87384 87471 88035 88903 90367 92470 94456
57451 94456 95460 95480 95175 94930 94598 94002 93120 91895 90468 89521 89735 90794 91509 91112 89962 88800 87890
57434 87890 87206 87003 87601 88745 89623 89668 89215 89240 90391 92236 93586 93669 92834 91929 91200 90183 88567 86706
57416H6706j510r22m88k90j44K17Q86J527J622J124N84M59O24P34O81M40j24r47
57398I1179j604j719j311n36M77J358J513P86l39j343k040k175j405r3P22O45
57382H4115N35J133J792J494N16M0M76J153J498J519J222M80m16q79p97o08n41
57365I2732l89l0L58O28P63O56K82o5j67k70n69n95J56J196J466P97J61L75J217
57346I8702J969K224J971J385P95N14M86L52r3o78j037q83l00J35o8n42m54J33
57328A04611J12r23j734j183o0N4q86j574j462j197j055m50P34J649J724J339
57312I9699R66N85K71L08M27n2r39j088n7J096J278P50M19N14P36J038J498J796
57294A09245J578J117J067J639K369K634K274J780J835K374K431J415K20K49J412
$$ plain form
57416 86706 85196 84274 83786 83496 83352 83569 84455 85982 87604 88728 89312 89771 90395 91129 91810 92250 92126 91179
57398 91179 89575 87856 86545 86009 86486 87844 89357 90143 89804 88461 86421 84246 82841 82748 83470 84115
57382 84115 84650 85783 87575 89069 89585 89625 90101 91254 92752 94271 95493 95973 95557 94678 93881 93273 92732
57365 92732 92343 92313 92671 93299 94062 94718 95000 94935 94768 94498 93929 93334 93490 94686 96152 96949 97110 97485 98702
57346 98702 100671 102895 104866 106251 107046 107560 108046 108398 108305 107627 106590 105707 105407 105542 105474 104932 104478 104611
57328 104611 104723 103800 102066 100883 100823 100877 99991 98417 96955 95758 94703 94253 94987 96636 98360 99699
57312 99699 100665 101250 101521 101829 102256 102204 101265 100177 100120 101216 102494 103244 103663 104177 104913 105951 107449 109245
57294 109245 110823 111940 113007 114646 117015 119649 121923 123703 125538 127912 130343 131758 131978 132227 133639
57279A33639K171J693Q34O16P83M82m03j395k223k828l044k956l162m059n141
57264A15007n563n165m440l754l082k394j804j325q27l44j86o04j287j387l38
57249H2507J261K068J529N51K66O25Q11M94m6o43j162j095k00P10O70M1qO79J132
57230I0190R60Q92J383J957K215K379K484K123J415J139J552J969J865J462R31
57215A14916K01k47M30J919K711K117J196J017J223J078P56P16O89K80j90k48
57199A28564K0M32J100J796J833J202R01J429J955J730J297J404J707J543J194
57184A48107J298J701J891J935K083K040J598J372K033L299M484N476O474P370
57170A91161Q142R200J0604J1595J1685J1555J2088J3186J4268J5252J6203J6761
$$ plain form
57279 133639 135810 137503 138337 138953 139736 140218 139815 138420 136197 133369 130325 127369 124207 120148 115007
57264 115007 109444 104279 99839 96085 93003 90609 88805 87480 86653 86309 86123 85519 84232 82845 82507
57249 82507 83768 85836 87365 87916 88182 88807 89618 90112 90066 89423 88261 87166 86966 87676 88346 88387 88379 89058 90190
57230 90190 91150 92042 93425 95382 97597 99976 102460 104583 105998 107137 108689 110658 112523 113985 114916
57215 114916 115117 114870 115300 117219 119930 122047 123243 124260 125483 126561 127317 128033 128722 129002 128812 128564
57199 128564 128584 129016 130116 131912 133745 134947 135848 137277 139232 140962 142259 143663 145370 146913 148107
57184 148107 149405 151106 152997 154932 157015 159055 160653 162025 164058 167357 171841 177317 183791 191161
57170 191161 199303 208503 219107 230702 242387 253942 266030 279216 293484 308736 324939 341700
57158C41700J6751J6779J7355J8066J8282J8144J8070J8027J7942J8192J8954
57147E38262J9815K0551K1536K2766K3500K3463K3420K3875K4343K4595K5376
57136G91502K6971K8400K9051K9902L1988L4794L7370L9885M2862M5958M8765
57125A187448N1867N5982O0949O6476P2786P9701Q6415R3057J00958J10416J19974
57114B086029J28958J38782J50424J62695J74745J88346K06108K29383K59620
57105C725090K99617L51588M16008M93653N85485O88366P94805R01597J017851
57096I274060J162461J355401J611624J936980K324162K754548L207086L662723
57088B7289045M099743M493683M828292N099972N306229N440554N506453N514925
$$ plain form
57158 341700 358451 375230 392585 410651 428933 447077 465147 483174 501116 519308 538262
57147 538262 558077 578628 600164 622930 646430 669893 693313 717188 741531 766126 791502
57136 791502 818473 846873 875924 905826 937814 972608 1009978 1049863 1092725 1138683 1187448
57125 1187448 1239315 1295297 1356246 1422722 1495508 1575209 1661624 1754681 1855639 1966055 2086029
57114 2086029 2214987 2353769 2504193 2666888 2841633 3029979 3236087 3465470 3725090
57105 3725090 4024707 4376295 4792303 5285956 5871441 6559807 7354612 8256209 9274060
57096 9274060 10436521 11791922 13403546 15340526 17664688 20419236 23626322 27289045
57088 27289045 31388788 35882471 40710763 45810735 51116964 56557518 62063971 67578896
57080F7578896N436661N162207M553421L565615K309588R75806k96883j471582
57072H7813729k559728l553875m415324n098374n569284n813890n843431n692920
57064D9266903n407100n027150m589325m127326l668224l227722k813226k430088
57056A7976742k083093j775170j508063j282656j096480r42737q14091p06278
57048G768174o16829n42395m79296m25400l79718l41128l08425k80539k55831
57039D138613k32495k10351j90795j74302j59455j45047j31473j19181j07414
57030B668100r5444q3684p2487o1105m8673l5187k0832n603R752K3553L4422M1127
57018B353939M0569K7991J182l5809p3997j04264j21241j24625j18360j07823
$$ plain form
57080 67578896 73015557 78177764 82731185 86296800 88606388 89582194 89285311 87813729
57072 87813729 85254001 81700126 77284802 72186428 66617144 60803254 54959823 49266903
57064 49266903 43859803 38832653 34243328 30116002 26447778 23220056 20406830 17976742
57056 17976742 15893649 14118479 12610416 11327760 10231280 9288543 8474452 7768174
57048 7768174 7151345 6608950 6129654 5704254 5324536 4983408 4674983 4394444 4138613
57039 4138613 3906118 3695767 3504972 3330670 3171215 3026168 2894695 2775514 2668100
57030 2668100 2572656 2488972 2416485 2355380 2306707 2271520 2250688 2245085 2254837 2278390 2312812 2353939
57018 2353939 2394508 2422499 2423681 2387872 2313875 2209611 2088370 1963745 1845385 1737562
57008A737562r6514q5229p4110o4139n6174m9814m4267l9507l5757l2601k9442
56997A130008k6315k3572k1219j9144j7451j6100j4646j2747j0459p858m840j477
56985I54180K012N714R674J3039J4369J3046R557M379k379r993j6897k1921k4929
56972I49851k5983k4971k2487k0010j8372j6869j4525j1550q847o644m239q79
56960G74475L507Q146J1906J4381J6333J8334J9060J6021Q242k586j3704k3002
56948H51113k9147l1538l0884k8827k6305k2975j8642j4154j0261o638k854O81
56936F29569L615O729J1025J6313K1535K6057K9786L2273L2411K8900K0755Q009
56924H66977p472k2325l3624m0420m3269m2909l9945l5239k9862k4673k0194j6571
$$ plain form
57008 1737562 1641048 1555819 1481709 1417570 1361396 1311582 1267315 1227808 1192051 1159450 1130008
56997 1130008 1103693 1080121 1058902 1039758 1022307 1006207 991561 978814 968355 960497 955657 954180
56985 954180 956192 961906 971580 984619 998988 1012034 1021591 1025970 1023591 1013598 996701 974780 949851
56972 949851 923868 898897 876410 856400 838028 821159 806634 795084 786237 779593 775354 774475
56960 774475 777982 786128 798034 812415 828748 847082 866142 882163 890405 887819 874115 851113
56948 851113 821966 790428 759544 730717 704412 681437 662795 648641 638380 631742 628888 629569
56936 629569 633184 639913 650938 667251 688786 714843 744629 776902 809313 838213 858968 866977
56924 866977 859505 837180 803556 763136 719867 676958 637013 601774 571912 547239 527045 510474
56912E10474j3522j0784q755q079q381q273p023n480m781m854m835m360l713l145
56898D14489k713k447k177j459n9J781L873O344R169J1990J4710J7645K0824K3729
56884E15699K6002K7499K7275K3605J5899N885l799j1546j6743j8918j8103j5482
56872E57273j2433r132n015k45M333Q516J3051J8582K5043L2133L9665M7363N4719
56859G73853O1078O5429O6224O1767N0812L2901R090j7110m0254n5788o2557o2342
56847H83103n7398m9159l8780k7613j6739o529L231J3146K4037L6402M9949O3832
56835H77482P7189Q9228R9155J06204J09099J04967Q9671O0684K0143k5136o6673
56824A542013r7569j14328j17399j10390r7872q3189o7940n2859l8384k4688j1845
$$ plain form
56912 510474 496952 486168 477413 469334 460953 452680 445657 440177 435396 430542 425707 421347 417634 414489
56898 414489 411776 409329 407152 405693 405634 407415 411288 417632 426801 438791 453501 471146 491970 515699
56884 515699 541701 569200 596475 620080 635979 641864 638065 626519 609776 590858 572755 557273
56872 557273 544840 535708 530693 530448 534781 543297 556348 574930 599973 632106 671771 719134 773853
56859 773853 834931 900360 966584 1028351 1079163 1112064 1121154 1104044 1063790 1008002 945445 883103
56847 883103 825705 776546 737766 710153 693414 686885 690116 703262 727299 763701 813650 877482
56835 877482 954671 1043899 1143054 1249258 1358357 1463324 1552995 1613679 1633822 1608686 1542013
56824 1542013 1444444 1330116 1212717 1102327 1004455 921266 853326 800467 762083 737395 725550
56813G25550o7J0759K1478L3014M5297N7252O7642P5334P8899P6452O6010M6068
56801A303688J6867j7941n1475p6867r0866r4307q9852q0319o8508n6718m5754
56790F47948l5195k4969j5829q158j243N823J3194K0537K7505L3524L7800L9794
56778G40731L9130L4790K5280J0299q093k6378m1337n0967n4718n3639m9793m4867
56766E20438l9353l3293k7207k1860j7561j4308j2162j0915r797q230o653n846
56754C13253n660n171m137l385l527l968l674k499j253o68p45j016j101r50p58
56739B74741p37q70r21p71o66q88j267j237n37L72Q04O63M79O28Q22N52q7l44
56721B70736L08J407J892J321M47L19R98J632J693J564J662J627J001K23J36O32
$$ plain form
56813 725550 725483 736242 757720 790734 836031 893283 960925 1036259 1115158 1191610 1257620 1303688
56801 1303688 1320555 1302614 1251139 1174272 1083406 989099 899247 818928 750420 693702 647948
56790 647948 612753 587784 571955 563797 562554 568377 581571 602108 629613 663137 700937 740731
56778 740731 779861 814651 839931 850230 842137 815759 774422 723455 668737 615098 565305 520438
56766 520438 481085 447792 420585 398725 381164 366856 354694 343779 333982 325752 319099 313253
56754 313253 307593 302422 298285 294900 291373 287405 283731 281232 279979 279311 278566 277550 276449 275499 274741
56739 274741 274004 273134 272213 271442 270776 269888 268621 267384 266847 267219 268023 268686 269165 269793 270615 271167 271080 270736
56721 270736 271044 272451 274343 275664 276111 276430 277428 279060 280753 282317 283979 285606 286607 286830 286966 287598
56705B87598O86j39r99r77l10P5k23q30j220j122n13K51N00j49j230j857j695
56688B77846j251j167j505j781j552q94l44k88n47n99k14L86R21J326J599J668
56672B73604J469R17j91j886l634m684m889m691m343l679k870k608l160l803l672
56657B31880k813j950j590j725k013j902r97L44J145R91N55O12J071J525K121
56642B27254L114L997L966L054K084J695J978K793L759M200L807L183L021L009
56628B70914K315R50k95j136k000k896l094k288j241q48j171j720k118k114j550
56613B51708p09k72n72j180j482j330r05l79N4J40r9k64o9L49P09R45J068J033
56595B48745R29J010J273J268O42k62o77k73N11J026J120J154J295J194N79j02
$$ plain form
56705 287598 288284 288145 287146 286169 285859 285934 285711 284881 283661 282539 282026 282277 282777 282628 281398 279541 277846
56688 277846 276595 275428 273923 272142 270590 269696 269352 269064 268517 267918 267704 268090 269011 270337 271936 273604
56672 273604 275073 275990 275799 273913 270279 265595 260706 256015 251672 247993 245123 242515 239355 235552 231880
56657 231880 229067 227117 225527 223802 221789 219887 218890 219234 220379 221370 221925 222537 223608 225133 227254
56642 227254 230368 234365 238331 241385 243469 245164 247142 249935 253694 257894 261701 264884 267905 270914
56628 270914 273229 274179 273884 272748 270748 267852 264758 262470 261229 260381 259210 257490 255372 253258 251708
56613 251708 250999 250727 250155 248975 247493 246163 245258 244879 244933 245073 244974 244710 244641 244990 245699 246644 247712 248745
56595 248745 249674 250684 251957 253225 253867 253605 252928 252655 253166 254192 255312 256466 257761 258955 259534 259432
56579B59432j77J45q2j060j702j132J5N79N94R68J862K518K637K784L192L346
56563B73919L135L406M733O427P417P543P326P025O531N849N003L847K503J630
56549C46294J643J948J649Q18K69K42J44l15o05l92l10j059k173k504j802j071
56533C42776j245k127k960l458l792l932l684l249l096l149k800j844r25p48j274
56518C04493k009k627k930k665j880j196j183j686k127k274k257k110j829j660
56504B76060j770j765j161k34J99j25o67r62j080j154r90n53k58m24p01m87K59
56487B64187R05R16M82L21Q21J518J566P19l77r15o68R9J018J706J800J252M42
56470B75792k39o90q77p56n93p76j093q37j2L36l14r55n29L76M59j47j34Q24J584
$$ plain form
56579 259432 259255 259400 259318 258258 256556 255424 255439 256018 256612 257580 259442 261960 264597 267381 270573 273919
56563 273919 277054 280460 285193 291620 299037 306580 313906 320931 327462 333311 338314 342161 344664 346294
56549 346294 347937 349885 351534 352352 352621 352863 353007 352692 352087 351695 351385 350326 348153 345649 343847 342776
56533 342776 341531 339404 336444 332986 329194 325262 321578 318329 315233 312084 309284 307440 306515 305767 304493
56518 304493 302484 299857 296927 294262 292382 291186 290003 288317 286190 283916 281659 279549 277720 276060
56504 276060 274290 272525 271364 271130 271329 271204 270537 269575 268495 267341 266351 265798 265540 265116 264415 263928 264187
56487 264187 265092 266008 266490 266811 267632 269150 270716 271435 271058 270143 269475 269574 270592 272298 274098 275350 275792
56470 275792 275553 274863 273986 273230 272637 271861 270768 269931 269919 270255 269941 268986 268457 268833 269292 269145 269011 269835 271419
56451B71419J334N48n5l70l83R1P25P62J94m7M54R36P88N40Q44J295J168O03K44
56432B81090J42j00m45n02l22l42n88n86j29L51L79K7j95NK92L7q53j583j289
56413B75389j10J009J492J602J638J421Q41M08O67J324J436M23j289k601k687
56398B80963j739p41l99m39k62J12K49K21M89R23P97ln32R6J677L432N036O727
56380B96607Q683J0578J1639J1137R076O323L721J324r79k487k324j006j99o67
56366C51426j410j310n96j34j18j98k77m38n15l39r7K3J57L59L19j34o81j004
56348C45033j172j153n95M91J333J268N84j1l07m98n90n25n42q32j066p03L27
56331C41042J572K481K695K249J726J801K442K953K994L000L332L628L422K853
$$ plain form
56451 271419 272753 273301 273246 272876 272493 272584 273309 274071 274265 274218 274672 275608 276396 276936 277780 279075 280243 280846 281090
56432 281090 281232 281132 280687 280185 279863 279521 278933 278347 278218 278569 278948 278975 278780 278785 279077 279114 278261 276678 275389
56413 275389 275279 276288 277780 279382 281020 282441 283282 283690 284357 285681 287117 287540 286251 283650 280963
56398 280963 279224 278483 278084 277645 277383 277495 277744 277965 278454 279377 280174 280171 279639 279735 281412 284844 289880 296607
56380 296607 305290 315868 327507 338644 347720 354043 357764 359088 358109 355622 353298 352292 352093 351426
56366 351426 350016 348706 348110 347976 347858 347660 347383 346945 346430 346091 345994 346017 346174 346533 346852 346718 346037 345033
56348 345033 343861 342708 342113 342604 343937 345205 345789 345778 345471 344973 344383 343858 343316 342484 341418 340715 341042
56331 341042 342614 345095 347790 350039 351765 353566 356008 358961 361955 364955 368287 371915 375337 378190
56317C78190K282J669Q27j18q54j161p94L64J770K420K012J391J458K146K841
56302C94443L252L456L615M010M839N634N540M527L632L551L718L381K799K721
56288D49118L227L879M460N026N585O205O979P524P224O435O470P770R029R022
56274E37953Q380Q453R197R552R353R511J0431J1513J2292J3025J4046J5342J6897
56261F85945J8779K0879K3122K5899K9636L4144L8881M3769M9183N5285O1998
56250A087520O9459P7879Q7020R6210J04853J12579J19173J24613J28840J31279
56240B139425J31052J27978J22653J15110J04237Q9158P0513M9662K7435M569
56230B981792j7487l7393n5120p1170q5038r5637j02938j07967j11227j12304
$$ plain form
56317 378190 380472 382141 382968 382850 381996 380835 380041 380405 382175 384595 386607 387998 389456 391602 394443
56302 394443 397695 401151 404766 408776 413615 419249 424789 429316 432948 436499 440217 443598 446397 449118
56288 449118 452345 456224 460684 465710 471295 477500 484479 492003 499227 505662 512132 519902 528931 537953
56274 537953 546333 554786 563983 573535 582888 592399 602830 614343 626635 639660 653706 669048 685945
56261 685945 704724 725603 748725 774624 804260 838404 877285 921054 970237 1025522 1087520
56250 1087520 1156979 1234858 1321878 1418088 1522941 1635520 1754693 1879306 2008146 2139425
56240 2139425 2270477 2398455 2521108 2636218 2740455 2829613 2900126 2949788 2977223 2981792
56230 2981792 2964305 2926912 2871792 2800622 2715584 2619947 2517009 2409042 2297815 2185511
56220B185511j11111j08484j05259j01535r7076r1861q6087q0116p4399o9091
56210A260492o3870n8536n3426m8881m4636m0337l6170l2540k9447k6766k4584
56199H01299k2663k0311j7456j5130j3968j3002j1055q667p313p094o697n456
56187F52487m132l521l446l410l258l032k800k720k720k328j352m15p3J48J000
56172F20428K193K823K735K475K175J594J081J351K326L145L387L468L880M786
56158F57847O148P522Q103P803P838R264J1327J2457J2535J2928J4446J6554J8650
56145H03422K1015K4301K9001L5347M2978N0911N8665O7140P7405Q8938J00047
56134A399170J09534J16714J20238J18456J11111R9589Q5632P0945N7693M7751
$$ plain form
56220 2185511 2074400 1965916 1860657 1759122 1662046 1570185 1484098 1403982 1329583 1260492
56210 1260492 1196622 1138086 1084660 1035779 991143 950806 914636 882096 852649 825883 801299
56199 801299 778636 758325 740869 725739 711771 698769 687714 679047 671734 664640 657943 652487
56187 652487 648355 644834 641388 637978 634720 631688 628888 626168 623448 621120 619768 619353 619280 619428 620428
56172 620428 622621 625444 628179 630654 632829 634423 635504 636855 639181 642326 645713 649181 653061 657847
56158 657847 663995 671517 679620 687423 695261 704525 715852 728309 740844 753772 768218 784772 803422
56145 803422 824437 848738 877739 913086 956064 1006975 1065640 1132780 1210185 1299123 1399170
56134 1399170 1508704 1625418 1745656 1864112 1975223 2074812 2160444 2231389 2289082 2336833
56124B336833M1101L6078L1195K5757J8855R389k422j4610k5010l2638l7765m1618
56112B345145m6128n3106o3228p5937q9711j01941j09473j10621j06351r8696
56102A489953q8716p6948o4744n3606m3784l4985k7736k2522j8302j3654q850
56091A036106n145k644n97Q45J184J280K386L940M478M341N146O811P624P251
56077A073006P217Q158Q935Q942R079R877J0658J1116J1891J3175J4297J5023
56065A201374J5678J5986J5422J4603J4545J4746J3938J2431J1611J1412J0661
56054A352407R505R146R451R432R754J1855J4805J6228J6301J7475K0067K1620
56042A518046K1237K0975K1997K2738K2140K1524K2055K3196K4783K7622L1020
$$ plain form
56124 2336833 2377934 2414012 2445207 2470964 2489819 2499208 2496786 2482176 2457166 2424528 2386763 2345145
56112 2345145 2299017 2245911 2182683 2106746 2017035 1915094 1805621 1695000 1588649 1489953
56102 1489953 1401237 1324289 1259545 1205939 1162155 1127170 1099434 1076912 1058610 1044956 1036106
56091 1036106 1030961 1028317 1027720 1028565 1029749 1031029 1033415 1037355 1041833 1046174 1051320 1058131 1065755 1073006
56077 1073006 1080223 1088381 1097316 1106258 1115337 1125214 1135872 1146988 1158879 1172054 1186351 1201374
56065 1201374 1217052 1233038 1248460 1263063 1277608 1292354 1306292 1318723 1330334 1341746 1352407
56054 1352407 1361912 1371058 1380509 1389941 1399695 1411550 1426355 1442583 1458884 1476359 1496426 1518046
56042 1518046 1539283 1560258 1582255 1604993 1627133 1648657 1670712 1693908 1718691 1746313 1777333
56031A777333L2708L2380L2343L3645L4691L4784L5583L7665L9011L8582L8282
56020B167007L9678M1790M3711M6369N0045N3175N5360N8568O3645O8618P2037
56009B760003P5099P8838Q2287Q4951Q8051R1878R4985R7358J01051J06506J11727
55998C772734J16302J22300J30029J37134J43234J50911J60659J69623J77108
55989E080034J86225J98187K10164K21037K33913K50551K68716K87504L09588
55980G245919L35689L62825L90631M23203M62051N03994N48703O01020O62874
55971A1536909P30919Q05469Q93265R97937J116999J252114J412475J604505J829991
55962B2180583K099250K434077K854155L376831M037922M898584O027215P492800
$$ plain form
56031 1777333 1810041 1842421 1874764 1908409 1943100 1977884 2013467 2051132 2090143 2128725 2167007
56020 2167007 2206685 2248475 2292186 2338555 2388600 2441775 2497135 2555703 2619348 2687966 2760003
56009 2760003 2835102 2913940 2996227 3081178 3169229 3261107 3356092 3453450 3554501 3661007 3772734
55998 3772734 3889036 4011336 4141365 4278499 4421733 4572644 4733303 4902926 5080034
55989 5080034 5266259 5464446 5674610 5895647 6129560 6380111 6648827 6936331 7245919
55980 7245919 7581608 7944433 8335064 8758267 9220318 9724312 10273015 10874035 11536909
55971 11536909 12267828 13073297 13966562 14964499 16081498 17333612 18746087 20350592 22180583
55962 22180583 24279833 26713910 29568065 32944896 36982818 41881402 47908617 55401417
55954E5401417R376600J1756774J4663153J8064860K1891491K5999487L0092752
55947A87246534L3755069L6605664L8281994L8079985L4694248K6729359J3897597
55940D09290450k144258j8249563l1261725l9348249m2347578m1264687l7550026
55933A97124364l2576746k7371905k2545758j8367302j4898093j2093438r856282
55926E9414840q076928o662211n537908m638387l908862l312952k826332k425536
55918B2025724k090030j808931j576037j381590j215611j074522r57079q57709
55910A1064215p70224o94038o30298n75537n25112m79347m40448m06456l73798
55901F168957l42994l16540k93527k71189k49555k30309k13074j96743j82290
$$ plain form
55954 55401417 64778017 76534791 91197944 109262804 131154295 157153782 187246534
55947 187246534 221001603 257607267 295889261 333969246 368663494 395392853 409290450
55940 409290450 407146192 388896629 357634904 318286655 275939077 234674390 197124364
55933 197124364 164547618 137175713 114629955 96262653 81364560 69271122 59414840
55926 59414840 51337912 44675701 39137793 34499406 30590544 27277592 24451260 22025724
55918 22025724 19935694 18126763 16550726 15169136 13953525 12879003 11921924 11064215
55910 11064215 10293991 9599953 8969655 8394118 7869006 7389659 6949211 6542755 6168957
55901 6168957 5825963 5509423 5215896 4944707 4695152 4464843 4251769 4055026 3872736
55892C872736j70668j60055j48565j37378j28059j19234j09130r8913r0150q1397
55882B629187p0648n9033m8788l9634l0305k1787j6013j3183j3241j7949k8442
55871B270164m2275n5682o7131p6375q2103q3507q2408q0923p8471p3667o7564
55860A480058o2228n7610n2510m7393m3496m0349l6727l3050l0439k8408k5790
55849A022058k2983k1177k0349j9958k0522k2403k4157k4168k2870k1565k0202
55838G81704j8230j6372j5482j4838j3584j2580j2863j3447j2861j1636j1094
55827F28717j0739r216o905n320m677m263m353n628p348q229q517r167r751r177
55813E25427p869p055o487m995k826j300m97O97K508M128N447P075Q815R727R532
$$ plain form
55892 3872736 3702068 3542013 3393448 3256070 3128011 3008777 2899647 2800734 2710584 2629187
55882 2629187 2558539 2499506 2450718 2411084 2380779 2358992 2342979 2329796 2316555 2298606 2270164
55871 2270164 2227889 2172207 2105076 2028701 1946598 1863091 1780683 1699760 1621289 1547622 1480058
55860 1480058 1417830 1360220 1307710 1260317 1216821 1176472 1139745 1106695 1076256 1047848 1022058
55849 1022058 999075 977898 957549 937591 917069 894666 870509 846341 823471 801906 781704
55838 781704 763474 747102 731620 716782 703198 690618 677755 664308 651447 639811 628717
55827 628717 617978 608762 601857 596537 591860 587597 583244 577616 570268 562039 553522 544355 534604 525427
55813 525427 517558 510503 504016 499021 496195 494895 494398 495095 497603 501731 507178 514253 523068 532795 542327
55798E42327Q509O426L153k19k585m589p471j0693j2572j2893j2847j2767j1849
55785D71930j0031q241o806n441m708n617p652r075r258q991q366o303k627J162
55771C79976L805N578P154Q370Q599P281L845j656p629j1792j3391j3530j3280
55758C63330j2574j1213r662q353p197o181n625n527n477n367n474n712n621n192
55744B64155m855m685m346l857l562l359k850k109j531j030l69m2p00j793k017
55729B27050j146k95k84q36j527k340k999k945k347k155k738l301l096k285j299
55714A97457j77R92J777K032K294L107M347N431N764M968L137J009o54j779k741
55699B26964l538l938m249n055o200o837o564n713m536k973j350l70j27M0N17
$$ plain form
55798 542327 550836 557262 560415 560196 557611 553022 545551 534858 522286 509393 496546 483779 471930
55785 471930 461899 453658 446852 441411 436703 431086 423434 414359 405101 396110 387744 381441 378814 379976
55771 379976 383781 389359 396513 404883 413482 420763 424608 422952 415323 403531 390140 376610 363330
55758 363330 350756 339543 329881 321528 314331 308150 302525 296998 291521 286154 280680 274968 269347 264155
55744 264155 259300 254615 250269 246412 242850 239491 236641 234532 233001 231971 231602 231560 230860 229067 227050
55729 227050 225904 225609 225325 224489 222962 220622 217623 214678 212331 210176 207438 204137 201041 198756 197457
55714 197457 197280 198272 200049 202081 204375 207482 211829 217260 223024 227992 231129 232138 231484 229705 226964
55699 226964 223426 219488 215239 210184 203984 197147 190583 184870 180334 177361 176011 175641 175514 175554 176071
55684A76071R62J190J705K916M452N627O173O139N515M294K675J012l30j140j560
55669B15701j968k387k382j852j405j401j267n20K07K53L95J795L821M575L668
55654B17233K848L362M269M063K701J072m83k064l384m129m724n780p073p757
55640B00154p500o804o289o103n941n365m239l032k414k386k163j193J7M81q3
55625A47140r63j330j083q12r89j343j239o51l15p64j597k086k130k031j793j318
55609A26696r47j006j047m37L99L22q69k072k403k129j849j564j132p85p03o16
55593A09858l60k90o30r22o85k66l58r28j184o10M00R92P41j3n23l16M80J391
55575A06777K023K249K195K235K695L345L518L007K502K642L053K911K182J522
$$ plain form
55684 176071 177033 178223 179928 182844 187296 192923 199096 205235 210750 215044 217719 218731 218401 217261 215701
55669 215701 213733 211346 208964 207112 205707 204306 203039 202519 202726 202979 203374 205169 208990 213565 217233
55654 217233 220081 223443 227712 231775 234476 235548 235065 233001 229617 225488 220764 214984 207911 200154
55640 200154 192654 185850 179561 173458 167517 162152 157913 154881 152467 150081 147918 146725 146742 147223 147140
55625 147140 146177 144847 143764 142952 141963 140620 139381 138730 138415 137651 136054 133968 131838 129807 128014 126696
55609 126696 125749 124743 123696 123259 123658 123980 123111 121039 118636 116507 114658 113094 111962 111177 110474 109858
55593 109858 109498 109208 108578 107656 106971 106705 106347 105419 104235 103625 104025 105017 105758 105745 105222 104906 105386 106777
55575 106777 108800 111049 113244 115479 118174 121519 125037 128044 130546 133188 136241 139152 141334 142856
55561A42856J156O52j94r96j418j564j571j462j441j817k530l163l468l384k744
55546A18912j513k58L56M20M98N81J97n17p97m67k29m39n26OP59J073Q17J61q21
55527A18213j913k619k746k673k823l241l824m419m595m002l125k959l722m592
55513G0960m969n126n344n215m397l187j782K85L271O401Q678J0023J0859J1017
55499I1474R910P614N043L020J694Q19K16o6J35P20J065M83q66j965k072j437
55483A15787o56P3P20R40M53m00r95j139j073r80q76q40r50j108j129r98q52q18
55465A05159q72p95l70J74K02m63j055q17j49O4k8M60J378J427K15r51r82n40
55447A02057o85j122r32k97j07l57k23M26P79N00K69O47J213J288R06O34P47R16
$$ plain form
55561 142856 144012 144664 144470 143474 142056 140492 138921 137459 136018 134201 131671 128508 125040 121656 118912
55546 118912 117399 117141 117497 117917 118415 118996 119193 118676 117879 117412 117183 116744 116218 116224 116983 118056 118873 119034 118213
55527 118213 116300 113681 110935 108262 105439 102198 98374 93955 89360 85358 82233 79274 75552 70960
55513 70960 65991 60865 55521 50306 45909 42722 40940 41225 44496 50897 59575 69598 80457 91474
55499 91474 101384 108998 114041 117061 118755 119574 119790 119724 119859 120579 121644 122127 121261 119296 117224 115787
55483 115787 115131 115204 115924 116864 117317 116917 115922 114783 113710 112730 111854 111014 110064 108956 107827 106829 105977 105159
55465 105159 104287 103492 103122 103296 103498 103035 101980 101163 101014 101078 101050 101510 102888 104315 104530 103579 102597 102057
55447 102057 101372 100250 99318 99021 98914 98557 98334 98760 99539 100039 100308 100955 102168 103456 104362 104996 105743 106659
55429A06659O95Q8m69o60o62p87r20o78n5N38Q64J053J184J275J614K413L098
55412A15250K801J711R84J050R79Nj325k165k562k816k623j772r58q65j051p71
55396A05872k85k86n36k72L41M16k05p58p78n33k83L3L51N37P46J050R36J5j060
55377A05301j405j291j582k035j503N2J196J044L55J20J48j76o26n49O6O96J054
55360A00865J213J246J178J030O72m1q29j133r08p46r50j051o16M0L95M89O00
55343A01454N98K00l58n61l97l51n76n84P6J126J820J724J106N01Q6l21p69r59
55325A03815o93k53n5j00m8K23M52L66j9m62o77n61l53l77n24k78M65J021Q07
55306A02749J80j07%N4L4K60N15K23l81l33N42J078L53r38j448r79m97n96p43
$$ plain form
55429 106659 107354 107442 106973 106313 105651 104864 103944 103266 103211 103749 104613 105666 106850 108125 109739 112152 115250
55412 115250 118051 119762 120746 121796 122775 122780 121455 119290 116728 113912 111289 109517 108559 107694 106643 105872
55396 105872 105587 105301 104765 104493 104834 105250 105045 104287 103509 102976 102693 102726 103077 103614 104360 105410 106346 106361 105301
55377 105301 103896 102605 101023 98988 97485 97537 98733 99777 100132 100252 100400 100224 99598 99049 99115 99811 100865
55360 100865 102078 103324 104502 105532 106204 106163 105334 104201 103293 102547 101597 100546 99930 99970 100365 100854 101454
55343 101454 102052 102252 101894 101333 100936 100585 100009 99425 99501 100627 102447 104171 105277 105778 105864 105543 104774 103815
55325 103815 103122 102869 102814 102714 102666 102889 103341 103707 103688 103226 102549 101988 101635 101258 100734 100456 100921 101942 102749
55306 102749 102929 102822 102822 102876 102910 103170 103685 103908 103527 103194 103736 104814 105167 104229 102781 101802 101305 100709 99966
55287I9966k15Q60J634J513P15q5m54m47k40J70P17J044Q33K46k84o60j026j192
55269A03095o80M85J497J600Q99Q8l69n55p17q67p95l83J77N24N06L20K04J62
55251A05191J20J33K34K48L7k66m28l90j94J21L47J44l95o61l68o3k87p02p17
55232A02104n54q06j252j104l05L67N04M44L88J34j67pM89N46P0m3O05J149Q34
55213A03396K44K79P29P53K28l47q17j255j219k32J105J484N70n23o93j05L42
55196A03939K67K0r0k04n42r18q83k94M17O97M29q4n35p12m09L80J124J185O60
55177A04447L31O41J158J295J037O36O7p37j395j284k58J066J739J256J02n43
55161A09558m3Q38Q27j52r36q21m24m65o15k42M17O18J78n50j355k018j950q11
$$ plain form
55287 99966 99751 100611 102245 103758 104473 104388 103934 103487 103247 103417 104134 105178 106011 106257 105973 105313 104287 103095
55269 103095 102415 102900 104397 105997 106896 106984 106615 106060 105343 104476 103681 103298 103475 103999 104505 104825 105029 105191
55251 105191 105311 105444 105678 105926 105963 105697 105269 104879 104685 104806 105153 105297 104902 104241 103873 103810 103523 102821 102104
55232 102104 101550 100744 99492 98388 98083 98450 98954 99398 99786 99920 99753 99746 100235 100781 100851 100808 101413 102562 103396
55213 103396 103640 103919 104648 105401 105629 105282 104465 103210 101991 101759 102864 104348 104918 104395 103702 103597 103939
55196 103939 104206 104226 104136 103932 103390 102472 101589 101295 101712 102409 102838 102754 102219 101507 101098 101478 102602 103787 104447
55177 104447 104778 105419 106577 107872 108909 109545 109612 108875 107480 106196 105938 107004 108743 109999 110101 109558
55161 109558 109515 110353 111180 111028 110092 109271 108847 108382 107767 107525 107942 108560 108738 108188 106833 104815 102865 102054
55143A02054O75J409J259J012J108J173Q42K66l23q79j244j140o22j09J92M40
55127A06113O65N57l4p55j087q48l04O7n2m78o90m63j36J3K26P63J290J389J289
55108A07525J401J422P69k23m63L70J352J593J225Q12N48M15N47R30J190J083
55092A20496P97M91K5n77r26q88q92j130j066k60P12R38M04r3j16K9J8n8p0j50
55072A17684l85o30p56p87p17m39k4K14P5k46l99k84j32k22n07o23k98K40M80
55053A12244L06J45K65K41m20j338j506n20Q17J359Q23q7m83j21N09P05K71l36
55035A12874n74m11j29K39Q54J451J357M00o28q69m14l0n5j35k6j7l89q64r21
55016A11713m26K82P60P41K23m66q41o92k17K93P86J262J539J468J199Q97M10
$$ plain form
55143 102054 102729 104138 105397 106409 107517 108690 109532 109798 109475 108596 107352 106212 105590 105481 105673 106113
55127 106113 106778 107335 107301 106546 105459 104611 104307 104374 104322 103844 103154 102691 102555 102568 102794 103557 104847 106236 107525
55108 107525 108926 110348 111117 110894 110431 110801 112153 113746 114971 115783 116331 116746 117293 118223 119413 120496
55092 120496 121293 121784 121809 121232 120306 119418 118526 117396 116330 116070 116782 117720 118124 118031 117915 117944 117962 117904 117834 117684
55072 117684 117299 116669 115913 115126 114409 113970 113946 114160 114235 113989 113590 113306 113174 112952 112445 111822 111524 111764 112244
55053 112244 112550 112695 112960 113201 112781 111443 109937 109417 110234 111593 112416 112329 111846 111725 112234 112939 113210 112874
55035 112874 112300 111889 111760 111999 112853 114304 115661 116061 115433 114564 114150 114120 114065 113930 113904 113887 113498 112634 111713
55016 111713 111287 111569 112329 113070 113293 112827 111986 111294 111077 111370 112156 113418 114957 116425 117624 118521 118931
54999A18931m03j116j047j64P10Q68M55Q6J5K5m0n6J15M00O13O94P43Q42Q80O31
54979A23182J62p1K43P51Q04L85J30L22M60J44j68J59Q38J021N62K54O32J216
54961A31026J208N36j72l55kN00P26N26J38o7PJ27M2k72p20j166j382j123m31
54942A29146K82N85L77j18n21m85R6R04J444J564J565J785K232K750L293L886
54926A48785M483N051N639O241O689O826O627O096N251M293L472K602J010j634
54912B11431m615o713p378p076o559o177n867n457m775l805k839k282k174k136
54898A43578j845j375r55o60m45k96j43K13Q78J668K257K492K479K469K706L287
54882A56308M061M827N625O621P622Q036P511O361N109L767J961l58k728m639
$$ plain form
54999 118931 118528 117412 116365 116201 116911 117779 118234 118320 118335 118360 118320 118264 118379 118779 119392 120086 120829 121671 122551 123182
54979 123182 123344 123273 123516 124267 125071 125456 125586 125908 126368 126512 126344 126503 127341 128362 128924 129178 129810 131026
54961 131026 132234 132770 132598 132243 132241 132741 133467 133993 134131 134064 134071 134198 134240 133968 133248 132082 130700 129577 129146
54942 129146 129428 130013 130390 130272 129751 129266 129362 130266 131710 133274 134839 136624 138856 141606 144899 148785
54926 148785 153268 158319 163958 170199 176888 183714 190341 196437 201688 205981 209453 212055 213065 211431
54912 211431 206816 200103 192725 185649 179090 172913 167046 161589 156814 153009 150170 147888 145714 143578
54898 143578 141733 140358 139403 138743 138298 138002 137859 138072 138950 140618 142875 145367 147846 150315 153021 156308
54882 156308 160369 165196 170821 177442 185064 193100 200611 206972 212081 215848 217809 217451 214723 210084
54868B10084n938o768p382p946q264p752o096l966k568k357k569k275j473q45
54854A43885p61j028j463k132k963l499l321k504j538q11m08k75m12p47r86p97
54838A20240k45J82J49p7jM02P03O86O48Q95J265J337R11J37o03r09o77k92k26
54819A24525l85k33L18O46L39j35r1M32Q27P84M71J31LL87J239J877J652Q06J05
54800A33698k02l95m16J16R50J188N73KK87R58R82J97n91p78n43l37k57r8K66
54781A35600P18J037J153J215J381J635J907K240K699L227L887N003O597P959
54767A76258Q334Q009P993Q522Q575P163M419J144j991m457n729n901n881o354
54753B00104o864o572n574m779m667m786m478l551k328j392j207j609j822j330
$$ plain form
54868 210084 204146 197378 189996 182050 173786 166034 159938 155972 153404 151047 148478 146203 144730 143885
54854 143885 143124 142096 140633 138501 135538 132039 128718 126214 124676 123865 123457 123182 122770 122023 121037 120240
54838 120240 119995 120177 120326 120249 120248 120650 121353 122039 122687 123582 124847 126184 127095 127232 126629 125720 125043 124751 124525
54819 124525 124140 123907 124225 124871 125210 125075 124984 125416 126243 127027 127498 127629 127632 128019 129258 131135 132787 133593 133698
54800 133698 133496 133101 132685 132801 133751 134939 135512 135514 135801 136759 137741 137938 137347 136569 136026 135689 135432 135334 135600
54781 135600 136318 137355 138508 139723 141104 142739 144646 146886 149585 152812 156699 161702 168299 176258
54767 176258 184592 192601 200594 209116 217691 224854 229273 230417 228426 223969 218240 212339 206458 200104
54753 200104 193240 186668 181094 176315 171648 166862 162384 158833 156505 155113 153906 152297 150475 149145
54739A49145n05j3J33L61P08Q56Q76J209J899K478K742L097L929N082O126O813
54723A84936P136P182O996O368M928K658J78j927l821n887p713q346p626o463
54709A78599n659n084m376l694l303k944k241j423j062j258j551j583j444j324
54695A41653j144o79P4P57R36N29r6n49p85r43r82q07o18p47j106j206q23k53
54677A33211J47L13K88O0k19k80j18l5r2N7N63J011R96O52K82j93q97j427j191
54658A33128k96M19L54k39o55n21pM51N21J69l58p31p54m88k14k05l94l73J01
54639A29908O45O39O9l91k74J49M36N84P19N68j44r77j119l97M82Q37O26J41m62
54620A32039j028j208p52P4O58N90K9m54l41L32R64R85N37K90O01J114J303J049
$$ plain form
54739 149145 148640 148627 148760 149121 149829 150685 151561 152770 154669 157147 159889 162986 166915 171997 178123 184936
54723 184936 192072 199254 206250 212618 217546 220204 220382 218455 214634 208747 201034 192688 185062 178599
54709 178599 172940 167856 163480 159786 156483 153539 151298 149875 148813 147555 146004 144421 142977 141653
54695 141653 140509 139830 139904 140661 141597 142126 142030 141481 140696 139753 138771 137964 137346 136599 135493 134287 133464 133211
54677 133211 133358 133671 133959 134019 133800 133520 133402 133367 133275 133332 133895 134906 135902 136554 136836 136643 135746 134319 133128
54658 133128 132832 133251 133605 133366 132711 132190 132183 132634 133155 133324 132966 132235 131481 130993 130779 130574 130180 129807 129908
54639 129908 130553 131192 131261 130870 130596 130745 131181 131765 132484 133052 132908 131931 130812 130415 130897 131734 132360 132501 132039
54620 132039 131011 129803 129051 129125 129783 130373 130402 129948 129607 129939 130903 131888 132425 132715 133316 134430 135733 136782
54602A36782M97k77j097j528j318q64p52r08o90Q0Q28J010Q21P70J007J338J567
54585A37266J514J013K16l78n70p61j214j439r57k72k83q64r77k62L97K34k93
54568A32370k69M30J189J553J522J242Q86N84K66k27p04p53m51l31l99L1J133
54551A38072J947J725J099J008J120M72p00j086k27R09J372J276J031O52J83j8
54535A48835N8j86j018j742j545n51L83O45L00j67k75J17O76R50Q95P73O34K67
54517A49049l34r21j356j567j302n48q8p17j887k071q08N88Q17J97r5L63J055
54500A40375J435J243M85l19l14N88J220N84o39q85J90J285J229L29l20k46J10
54483A46350K35J84L07O03O19J11n26p75p13p14o74j26Q14J426J403J236J340
$$ plain form
54602 136782 137279 137002 135905 134377 133059 132195 131443 130535 129845 129925 130753 131763 132584 133354 134361 135699 137266
54585 137266 138780 139793 140009 139631 139061 138300 137086 135647 134690 134418 134135 133271 132294 132032 132429 132663 132370
54568 132370 132101 132531 133720 135273 136795 138037 138923 139507 139773 139546 138842 138089 137638 137307 136908 136939 138072
54551 138072 140019 141744 142843 143851 144971 145443 144743 143657 143430 144339 145711 146987 148018 148670 148853 148835
54535 148835 148893 148707 147689 145947 144402 143851 144234 144879 145179 145012 144737 144854 145530 146480 147375 148148 148782 149049
54517 149049 148715 147794 146438 144871 143569 143021 142933 142216 140329 138258 137450 138038 138855 139052 138957 139320 140375
54500 140375 141810 143053 143538 143219 142905 143493 144713 145297 144658 143773 143963 145248 146477 146806 146486 146240 146350
54483 146350 146585 146769 147076 147679 148298 148409 147883 147108 146395 145681 145007 144881 145695 147121 148524 149760 151100
54466A51100J499J520J660J971J904J076q4r23j281j235p65j40qn39j032r31n99
54449A53193n77p44q12q87r20m11N95J071M75k52j37K57Ol81J46J090J039J7n88
54430A52180k89J8l7K67J093J494J064O15O07L57m89j020n26K77M36J61J07J64
54412A56479n9k87j18Q1k14o07k80Q05J883K350K110J311L36k06p0K73K58m0k02
54393A63803o6K46N01L19n22j441j450n80n8n57j068l93J013J695J185K69l69
54376A62527p25q56o51k57PK59R07J912K719K965K777K434K241K522L274L893
54360A85948L801L217K787K675K464J866R50k20j619l010m074m752n045m719l645
54345A76624k294j299p53l72j74l90r34j494k005k425k359j553n39j16l01n14
$$ plain form
54466 151100 152599 154119 155779 157750 159654 160730 160646 159723 158442 157207 156442 156302 156294 155755 154723 153792 153193
54449 153193 152616 151872 151060 150173 149253 148842 149437 150508 150983 150731 150594 150851 150857 150476 150622 151712 152751 152768 152180
54430 152180 151891 151909 151872 152139 153232 154726 155790 156405 157012 157369 156880 155860 155334 155611 156047 156208 156315 156479
54412 156479 156420 156133 156015 156096 155882 155275 154995 155800 157683 160033 162143 163454 163790 163584 163514 163787 164045 164005 163803
54393 163803 163737 163983 164484 164803 164281 162840 161390 160810 160752 160195 159127 158734 159747 161442 162627 162896 162527
54376 162527 161802 160946 160295 160038 160045 160304 161211 163123 165842 168807 171584 174018 176259 178781 182055 185948
54360 185948 189749 192966 195753 198428 200892 202758 203708 203488 201869 198859 194785 190033 184988 180269 176624
54345 176624 174330 173031 172278 171906 171732 171342 170408 168914 166909 164484 162125 160572 160033 159917 159616 159102
54329A59102n55o01m71J21O71L05p95j417r96k72N1K81Q72J389J100O4r99j519
54311A56331j367p03M7L60J03l51o29n95j55O37J170P40l87j049o44J93O53O85
54293A55039M81p5p81p76L26J603J937J465J027P54K46k43l4O99R94N31qj52k65
54274A62768o14p82m52o9q2j80J12M66J37q41j502j094Q5J135J577J702J971K324
54256A66661K227J372J63o20n98j42Q3j94n91n60r6J99q2m92l14L37N71M9m82
54237A67491l30M2k08r70j376j071m58J76Q95J489J439P67J81R7J87J45K41P09
54219A69446J128R73L89q4k72l87n23n68m64k76p3J7j49m49m79j15K08O0l78n61
54199A67443k52L97J100J528J319M55n75j255j555j671j506q52N9O84P65M87J11
$$ plain form
54329 159102 158547 157946 157475 157596 158267 158572 157777 156360 155364 155092 155143 155424 156296 157685 158785 158849 157850 156331
54311 156331 154964 154261 154308 154668 154771 154420 153791 153196 153041 153678 154848 155588 155201 154152 153508 153701 154354 155039
54293 155039 155520 155445 154664 153888 154214 155817 157754 159219 160246 161000 161246 161003 160969 161668 162662 163193 163185 163033 162768
54274 162768 162154 161372 160920 160851 160769 160589 160701 161167 161304 160463 158961 157867 157952 159087 160664 162366 164337 166661
54256 166661 168888 170260 170423 169803 169205 169063 169146 168952 168361 167801 167705 167904 167822 167330 167016 167353 167924 167973 167491
54237 167491 167161 167203 166995 166025 164649 163578 163120 163296 164191 165680 167119 167886 168067 168164 168351 168496 168737 169446
54219 169446 170574 171547 171936 171852 171580 171193 170670 170102 169638 169362 169289 169306 169157 168708 168229 168114 168322 168382 168004 167443
54199 167443 167191 167588 168688 170216 171535 171990 171415 170160 168605 166934 165428 164576 164635 165319 166084 166571 166682
54182A66682j59j14L16Q35J051R34P43N98M28J83k05q31j405j255k42O06K17r31
54164A67451j334n50K35L7n27l82K88L91m06j210j081r1Q74R68J29q26q96M4J096
54145A64210J413J042M75j47q68j312j036l46m4l19n34k11L33N85N14L43R2k70
54127A63920m72j50P01J670K285K283J671Q03K05J92O00J053J353J499J439J066
54111A80118M81M5M2M15R14J405J877K167J992J409J097J773L303M648M912M250
54095B10848L617L699M309M682M229K950J343r2j285k514l877n026n449m963l843
54080B08628k634j913j909k200j955p76Q39K085K716L002L073K760K084J462J188
54065B16450J022N25m18j469k144k202j788j389j446j951k423k317j509m30K69
$$ plain form
54182 166682 166523 166409 166725 167560 168611 169545 170288 170886 171314 171497 171292 170461 169056 167801 167559 168165 168382 167451
54164 167451 166117 165567 165802 165839 165312 164930 165218 165609 165203 163993 162912 162821 163695 164663 164792 163966 163070 163114 164210
54145 164210 165623 166665 167140 166993 166125 164813 163777 163431 163387 163068 162534 162323 162656 163241 163755 164098 164190 163920
54127 163920 163448 163298 163999 165669 167954 170237 171908 172711 172916 173108 173708 174761 176114 177613 179052 180118
54111 180118 180599 180644 180686 181101 182015 183420 185297 187464 189456 190865 191962 193735 197038 201686 206598 210848
54095 210848 214465 218164 222473 227155 231384 234334 235677 235585 234300 231786 227909 222883 217434 212471 208628
54080 208628 205994 204081 202172 199972 198017 197241 198080 200165 202881 205883 208956 211716 213800 215262 216450
54065 216450 217472 217997 217579 216110 213966 211764 209976 208587 207141 205190 202767 200450 198941 198511 198780
54050A98780L27J72L86R33J243J210J552K712L881L915L002K572L406M681N308
54035B34080N401N743O321O297N413M532M523N102N302M736L927L401L021K459
54021C00258J866J604J483R01k03j059j099p35p83j404k161k794l405m027m534
54006B83908m966n371n452m898m070l709l920m064l777l435l332l067k260j357
53992B30230j205j965k900l138k422j270n12n64j013j170q99n79k91K52Q50P17
53976B14121l86j540j775j271q36o74l74J59N86Q22J183J765K254K414K357K234
53960B21039K107K172K717L806N247O910Q762J0608J2119J3195J4017J4655J4767
53947C32121J3716J0946O405Q55m359q093r950j0104q966p183n524m251k879j006
$$ plain form
54050 198780 199107 199279 199665 200598 201841 203051 204603 207315 211196 215111 218113 220685 224091 228772 234080
54035 234080 239481 245224 251545 257842 263255 267787 272310 277412 282714 287450 291377 294778 297799 300258
54021 300258 302124 303728 305211 306112 305909 304850 303751 303016 302233 300829 298668 295874 292469 288442 283908
54006 283908 278942 273571 268119 263221 259151 255442 251522 247458 243681 240246 236914 233847 231587 230230
53992 230230 229025 227060 224160 221022 218600 217330 216818 216254 215241 214071 213172 212593 212302 212554 213404 214121
53976 214121 213735 212195 210420 209149 208313 207639 207265 207424 208010 208832 210015 211780 214034 216448 218805 221039
53960 221039 223146 225318 228035 231841 237088 243998 252760 263368 275487 288682 302699 317354 332121
53947 332121 345837 356783 363188 364043 359684 351591 341641 331537 322571 315388 309864 305613 302734 301728
53933C01728Q36J714J514J025Q40P90N25J11j71j55K72J263K726M191N064M978
53917C27251M026K898K662L883N872P212P197O398N745N458N160M653M194M013
53903C96622L929L454K297O69q63j902k487k808k850k607k467k907l826m527m566
53888C75161m337m620n670o939p656p598p285p309p545p245o014m432l467l430
53874B91614l815m027l923l742l794m128m382m062l194k444k266k284j974j660
53860B45919k121l275l969l376k042j244j659k857l851l881k853j268K14J105
53846B14842J153L91o35j144r24o16p37q27j58J000J581J099J23o19r27q69n43
53829B12190k71m00p62p66k15M99R93J166R37L78Q5O53J722K311K166J974K113
$$ plain form
53933 301728 302564 304278 305792 306817 307657 308447 308972 309083 308912 308757 309029 310292 313018 317209 322273 327251
53917 327251 331277 334175 336837 340720 346592 353804 361001 367399 373144 378602 383762 388415 392609 396622
53903 396622 400551 404005 406302 406971 406108 404206 401719 398911 396061 393454 390987 388080 384254 379727 375161
53888 375161 370824 366204 360534 353595 345939 338341 331056 323747 316202 308957 302943 298511 295044 291614
53874 291614 287799 283772 279849 276107 272313 268185 263803 259741 256547 254103 251837 249553 247579 245919
53860 245919 243798 240523 236554 233178 231136 229892 228233 225376 221525 217644 214791 213523 213737 214842
53846 214842 215995 216386 215751 214607 213683 213067 212330 211503 211345 212345 213926 215025 215148 214529 213602 212733 212190
53829 212190 211919 211519 210757 209991 209776 210275 211268 212434 213371 213749 213834 214487 216209 218520 220686 222660 224773
53812B24773K191K010J974K157J955J243R33J752L194M365N010N165M632L618
53798B64972L076L521M166M142L838M075M627M702M367M245M156L331J836O20
53784C15674J39j8j77k81o09j640l058l836l661l369l668m254m546m558m603m708
53768B72827m762m798m818m698m415m056l514k728k089k089k426k177j089k1J35
53753B29282n57j449k038k058j405m24J18k02j012j629j785j630j341r05k09P68
53737B13524J633J679P23l55m92K29P84P36O99J135J588J483R86O01M73N85J003
53720B27014J498J488Q50K86L28N56L45o8j3M58O62L99K75Q30J835K578K600K092
53702B44013J732J997K594K853K698K734L211L541L282K927L079L365K957J872
$$ plain form
53812 224773 226964 228974 230948 233105 235060 236303 237236 238988 242182 246547 251557 256722 261354 264972
53798 264972 268048 271569 275735 279877 283715 287790 292417 297119 301486 305731 309887 313218 315054 315674
53784 315674 315813 315795 315618 315337 314728 313088 310030 306194 302533 299164 295496 291242 286696 282138 277535 272827
53768 272827 268065 263267 258449 253751 249336 245280 241766 239038 236949 234860 232434 230257 229168 229147 229282
53753 229282 228725 227276 225238 223180 221775 221351 221469 221267 220255 218626 216841 215211 213870 212965 212756 213524
53737 213524 215157 216836 217559 217204 216712 216941 217725 218461 219160 220295 221883 223366 224352 224953 225426 226011 227014
53720 227014 228512 230000 230850 231136 231464 232020 232365 232297 232284 232742 233404 233803 234078 234908 236743 239321 241921 244013
53702 244013 245745 247742 250336 253189 255887 258621 261832 265373 268655 271582 274661 278026 280983 282855
53688B82855Q97L72j28q39j366j365j057p98n91k68J67N46O92N10J04j63p6Q5
53670B79577q1n48r94j348j689j703r02M58J328J063K23k02M4M45N80N25M85M87
53652B77748M81M31K22k62q25r55l72N02R14O23J46Q1M32Q50J165J387J360J008
53634B84936P80J203J968K081J294O56J152K342K973K619J999J874K253K707K868
53619C13705K587K058J845K413L613M859N743O148N986N346M731M596M654M231
53605C72515L266K410K019J743J260Q49Q13R12P67N42P31J396J958J803R20o7
53589C93837n16m31m31r13j505j619j280r51p42m70l81j035k279l114k936k227
53573C73007j722j500j339j356j652j823j502j045j019j284j262r05p25q62q41
$$ plain form
53688 282855 283752 284124 283996 283157 281791 280426 279369 278571 277980 277712 277879 278425 279117 279627 279731 279568 279492 279577
53670 279577 279496 278948 277954 276606 274917 273214 272312 272770 274098 275161 275384 275182 275226 275671 276251 276776 277261 277748
53652 277748 278229 278660 278882 278620 277795 276840 276468 276970 277884 278507 278653 278734 279166 280016 281181 282568 283928 284936
53634 284936 285716 286919 288887 290968 292262 292918 294070 296412 299385 302004 304003 305877 308130 310837 313705
53619 313705 316292 318350 320195 322608 326221 331080 336823 342971 348957 354303 359034 363630 368284 372515
53605 372515 375781 378191 380210 381953 383213 384062 384875 385787 386554 387096 387827 389223 391181 392984 393904 393837
53589 393837 393321 392890 392459 391546 390041 388422 387142 386191 385449 384979 384598 383563 381284 378170 375234 373007
53573 373007 371285 369785 368446 367090 365438 363615 362113 361068 360049 358765 357503 356598 355873 355011 354170
53558C54170l29L93Q55Q83N36qm41m92k90k05l07k56J52O67R83J122J254J360
53540C60047J309J166J185J519K027K454K733L045L501L898M026M154M850O101
53526D02015P084P159O757O828P574Q407R018R817J1046J2195J2689J2740J2998
53513E26327J3601J4178J4687J5586J7033J8383J8979J9095J9593K0607K1167
53502G19236K0416J8781J7521J7248J7457J7450J7113J6654J6091J5488J5238
53491I08693J5604J6119J5963J5037J4188J4281J5221J6100J6177J5651J5376
53480A078410J5779J6220J5760J4452J3402J3284J3396J2635J0926R087P538N913
53468A226802L913J834Q7j329k739m453o572q760j0394j1268j1969j2998j3860
$$ plain form
53558 354170 353841 354234 355089 355972 356508 356500 356059 355567 355277 355072 354765 354509 354661 355328 356311 357433 358687 360047
53540 360047 361356 362522 363707 365226 367253 369707 372440 375485 378986 382884 386910 391064 395914 402015
53526 402015 409099 416258 423015 429843 437417 445824 454842 464659 475705 487900 500589 513329 526327
53513 526327 539928 554106 568793 584379 601412 619795 638774 657869 677462 698069 719236
53502 719236 739652 758433 775954 793202 810659 828109 845222 861876 877967 893455 908693
53491 908693 924297 940416 956379 971416 985604 999885 1015106 1031206 1047383 1063034 1078410
53480 1078410 1094189 1110409 1126169 1140621 1154023 1167307 1180703 1193338 1204264 1213351 1220889 1226802
53468 1226802 1230715 1232549 1232636 1231307 1228568 1224115 1217543 1208783 1198389 1187121 1175152 1162154 1148294
53455A148294j3793j3239j3480j4715j5659j5464j4991j5411j6436j6892j6520
53444I81694j6099j6054j5894j5091j3782j2519j1721j1436j1209j0248q179n588
53432H33874l460k188j457r35n26j29L74R11J427K188L398M729N754O725Q245
53417H58930J0273J2104J3424J4598J5827J6775J7331J8013J9194K0508K1484
53406A038461K2273K3217K4159K4796K5425K6758K9009L1667L4109L6022L7374
53395A353270L8305L9170M0349M1889M3480M4788M5760M6588M7408M7961M7658
53384A836626M6232M4286M2768M1870M0863L9209L7243L5430L3490L0859K7648
53373B256524K4418K1234J7623J3470R224N178J169k867o758j0752j5576k1371
$$ plain form
53455 1148294 1134501 1121262 1107782 1093067 1077408 1061944 1046953 1031542 1015106 998214 981694
53444 981694 965595 949541 933647 918556 904774 892255 880534 869098 857889 847641 839462 833874
53432 833874 830414 828226 826769 825834 825308 825179 825553 826464 827891 830079 833477 838206 843960 850685 858930
53417 858930 869203 881307 894731 909329 925156 941931 959262 977275 996469 1016977 1038461
53406 1038461 1060734 1083951 1108110 1132906 1158331 1185089 1214098 1245765 1279874 1315896 1353270
53395 1353270 1391575 1430745 1471094 1512983 1556463 1601251 1647011 1693599 1741007 1788968 1836626
53384 1836626 1882858 1927144 1969912 2011782 2052645 2091854 2129097 2164527 2198017 2228876 2256524
53373 2256524 2280942 2302176 2319799 2333269 2342493 2347671 2348840 2345973 2339215 2328463 2312887 2291516
53361B291516k7103l1671l5227l8690m2102m4376m4831m4235m3827m3732m3051
53350A852671m1357l9400l8095l7364l6457l5159l4073l3668l3618l3378l3010
53339A457092l2930l3026l2588l1207k9317k7612k6167k4475k2223j9760j7738
53328A160049j6410j5445j4334j2912j1445j0243r380q894r021r971j1381j2322
53316A018291j2093j0902r586q648p807o540m924l679l332l441k921j163J250
53303I44505L157M035M420N102O270P627R081J0848J2909J4788J6102J6997J7829
53290A073670J8642J9305J9985K0989K2123K2683K2274K1301K0326J9288J7725
53279A298311J5636J3584J1900J0232Q068N499L093J199m38k318m625p067r185
$$ plain form
53361 2291516 2264413 2232742 2197515 2158825 2116723 2072347 2027516 1983281 1939454 1895722 1852671
53350 1852671 1811314 1771914 1733819 1696455 1659998 1624839 1590766 1557098 1523480 1490102 1457092
53339 1457092 1424162 1391136 1358548 1327341 1298024 1270412 1244245 1219770 1197547 1177787 1160049
53328 1160049 1143639 1128194 1113860 1100948 1089503 1079260 1069880 1060986 1051965 1041994 1030613 1018291
53316 1018291 1006198 995296 985710 977062 969255 962715 957791 954112 950780 947339 944418 943255 944505
53303 944505 947662 951697 956117 961219 967489 975116 984197 995045 1007954 1022742 1038844 1055841 1073670
53290 1073670 1092312 1111617 1131602 1152591 1174714 1197397 1219671 1240972 1261298 1280586 1298311
53279 1298311 1313947 1327531 1339431 1349663 1357731 1363230 1366323 1367522 1367084 1364766 1360141 1353074 1343889
53266A343889j0810j2221j3868j5948j8215k0209k1602k2385k2783k3023k3198
53255A139627k3340k3478k3557k3393k2976k2735k3128k3859k3926k2777k1030
53244H85428j9739j9234j9126j9124j9211j9197j8829j8349j8226j8261j7693
53233F78439j6394j5198j4680j4287j3235j1682j0350r396q372p087n891n189
53221E46678n141n749o810p889q712r424j0126j0461j0166r743r898j0520j0831
53208D31208j0503r934r402q653p496o232n214m476l975l796l867l907l868m048
53194C45837m597n233n611n690n579n383n286n401n434m921l968l275l192l223
53180B79044k784j986j296q25m35k36m94j107j678k011k246k436k342j766r21
$$ plain form
53266 1343889 1333079 1320858 1306990 1291042 1272827 1252618 1231016 1208631 1185848 1162825 1139627
53255 1139627 1116287 1092809 1069252 1045859 1022883 1000148 977020 953161 929235 906458 885428
53244 885428 865689 846455 827329 808205 788994 769797 750968 732619 714393 696132 678439
53233 678439 662045 646847 632167 617880 604645 592963 582613 573217 564845 557758 551867 546678
53221 546678 541537 535788 528978 521089 512377 502953 492827 482366 472200 462457 452559 442039 431208
53208 431208 420705 410771 401369 392716 385220 378988 373774 369298 365323 361527 357660 353753 349885 345837
53194 345837 341240 336007 330396 324706 319127 313744 308458 303057 297623 292702 288734 285459 282267 279044
53180 279044 276260 274274 272978 272153 271718 271482 270988 269881 268203 266192 263946 261510 259168 257402 256481
53165B56481l60m55r39j147q36n07o57r27o38M4J64o26j515j676j207n81Q9O98
53147B45405O95q6p96n40K72M88p0m33n8M06J51p10j491j815j713j217l34P54
53129B38908J685K201K326K319K293J914Q12n77j055q2J335J809J357J122J565
53114B57932J930J628J085Q02N20j30q83j399j941k767l303k788j463m27l11p45
53098B47740j109j200j108r22p52o84o55n37l56j61J41N06N13j18r02j030m78
53081B38888l1j24k90p8J32j77o76n80J57P74Q44P14O43K34p73j699j673r42n98
53062B34745j012j358r88m79o77j245j080j3Q01M11o64j162n80M56J053R05M41
53045B29554L76J025J867J945R50l23q32m12K57N76N12K80K1j23j7K33L02Q2j77
$$ plain form
53165 256481 256121 255666 254727 253580 252744 252237 251580 250653 250015 250059 250223 249597 248082 246406 245199 244618 244707 245405
53147 245405 246100 246014 245218 244678 244950 245438 245368 244935 244877 245283 245434 244724 243233 241418 239705 238488 238154 238908
53129 238908 240593 242794 245120 247439 249732 251646 252458 251881 250826 250744 252079 253888 255245 256367 257932
53114 257932 259862 261490 262575 263377 263897 263767 262884 261485 259544 256777 253474 250686 249223 248796 248485 247740
53098 247740 246631 245431 244323 243401 242649 241965 241310 240773 240417 240256 240397 240903 241416 241298 240396 239366 238888
53081 238888 238857 238733 238443 238365 238497 238320 237644 237064 237221 237995 238839 239553 240196 240430 239657 237958 236285 235343 234745
53062 234745 233733 232375 231387 230908 230231 228986 227906 227893 228694 229105 228441 227279 226699 227155 228208 229113 229554
53045 229554 229930 230955 232822 234767 235717 235394 234562 234150 234407 234983 235495 235775 235796 235673 235656 235889 236191 236273 236096
53026B36096k25j10J9J10R4j50n01m91J63J073J529J297Q19N78N97O20N72N69
53008B42659O42O34L93m3m22l97J71R11J134N51k69n17k27k89j234k367k480j243
52990B37607N13J751K014J401L29n23n29K16Q91R16O71Q85J540J913J598J008
52974B52201O79N91M61L97P97J623K163J753O07k81j76O21J184J124R58J182J341
52957B67225N13j327k995l372k624j796j490j453j289j038q56o58m20n05j202
52942B46713k066k207j381l45N7j61l75k59r4k57p95j455j809j433l81N87O45
52925B34984m1l98J64R64J036M48M1J42K64J28K01Q92J752J943J205N7q33j162
52907B41787j047q59r25j125r30q2Q41R59J53p52r64n83k31j48PN24J126J350
$$ plain form
53026 236096 235871 235761 235780 235890 235984 235834 235333 234842 235005 236078 237607 238904 239723 240301 240898 241518 242090 242659
53008 242659 243301 243935 244328 244285 243863 243466 243637 244548 245682 246233 245964 245447 245220 244931 243697 241330 238850 237607
52990 237607 238120 239871 241885 243286 243615 243092 242563 242779 243670 244586 245257 246142 247682 249595 251193 252201
52974 252201 252880 253471 253932 254329 255126 256749 258912 260665 261272 260991 260815 261436 262620 263744 264702 265884 267225
52957 267225 267738 266411 263416 260044 257420 255624 254134 252681 251392 250354 249498 248840 248420 247915 246713
52942 246713 244647 242440 241059 240714 240771 240610 240235 239976 239882 239625 238830 237375 235566 234133 233752 234339 234984
52925 234984 234943 234545 234709 235673 236709 237157 237198 237340 237604 237732 237933 238825 240577 242520 243725 243782 242949 241787
52907 241787 240740 239881 238956 237831 236901 236819 237660 238619 238772 238020 237056 236473 236242 236094 236101 236625 237751 239101
52889B39101J123Q05O62N49K54r4j60N5J17k35o45n52L1M76L43j01l22j83J10
52870B41334N42J288K171K629K501K484L286M541N022M032K094J50j363k393k738
52855B65580k325j821k128l204l925l449k233j364j282j638k046k420k637k464
52841B32644j944j465j271j167r30p07q28j297j662j388l52R08J565J352R47J225
52825B25630K073K426J623L08l97k47O9k1l48l93J58J291K632L511L454K764K215
52808B46748K032J540J34j764l103l342k852k296k005j933j907j790j515j135
52794B26812q02p06r64j418j613j200m57n9k44m77k58K14N84J118K222L363L418
52777B29533K212R02M23L89N7l51j28N13N95j92j079j410j417j503j484j085n99
$$ plain form
52889 239101 240224 241029 241691 242240 242494 242400 242240 242295 242412 242177 241532 240980 241011 241487 241830 241729 241407 241224 241334
52870 241334 241876 243164 245335 247964 250465 252949 256235 260776 265798 269830 271924 272074 270711 268318 265580
52855 265580 263255 261434 259306 256102 252177 248728 246495 245131 243849 242211 240165 237745 235108 232644
52841 232644 230700 229235 227964 226797 225867 225160 224332 223035 221373 219985 219633 220541 222106 223458 224405 225630
52825 225630 227703 230129 231752 232060 231663 231416 231485 231464 231116 230723 230881 232172 234804 238315 241769 244533 246748
52808 246748 248780 250320 250454 248690 245587 242245 239393 237097 235092 233159 231252 229462 227947 226812
52794 226812 226010 225304 224340 222922 221309 220109 219652 219593 219349 218872 218614 218828 219412 220530 222752 226115 229533
52777 229533 231745 232647 233070 233459 233516 233165 233037 233550 234145 233953 232874 231464 230047 228544 227060 225975 225376
52760B25376m07k31M12J226J339N47k72k66L58P42M73j09m70l19L90J418K170
52743B32377K095J363Q23J053J671J857J435R88R95J286J438J377J267J157J015
52728B52197R58J056J072P09J09k97m62p62j352j870k087k299k760k991k297q22
52712B38102M59Q99P73O05L57k45r33r87j52R14J327R44M41M42P65P21L6p59j005
52693B42704p05m22m28l78J32R67J621J766J417P43m9p02j107j385j664j777j440
52676B39293p12k9L22M82O68P29L28m58j014p99J2P62J103J342J808K202J948
52659B47987J063K32q2q5J2N53J823L250L827L272K158R61l06j417j647p65K05
52642B61041o6j581k951l014k034j058n19O7J064J958J979J261Q19J250J941J969
$$ plain form
52760 225376 224969 224738 225150 226376 227715 228262 227990 227724 228082 228824 229297 229188 228718 228399 228789 230207 232377
52743 232377 234472 235835 236658 237711 239382 241239 242674 243662 244657 245943 247381 248758 250025 251182 252197
52728 252197 253155 254211 255283 255992 256101 255804 255342 254580 253228 251358 249271 246972 244212 241221 238924 238102
52712 238102 238561 239460 240233 240838 241195 240950 240017 239030 238878 239792 241119 242063 242504 242946 243711 244432 244468 243709 242704
52693 242704 241999 241577 241149 240771 240903 241870 243491 245257 246674 247417 247368 246666 245559 244174 242510 240733 239293
52676 239293 238581 238552 238874 239356 240024 240753 241081 240623 239609 238810 238822 239584 240687 242029 243837 246039 247987
52659 247987 249050 249282 249200 249115 249127 249680 251503 254753 258580 261852 264010 264971 264665 263248 261601 260836 261041
52642 261041 260975 259394 256443 253429 251395 250337 249818 249885 250949 252907 254886 256147 256966 258216 260157 262126
52626B62126J383R70R39N75o44k235l324l583l136k102p39L26O07M05L59M94K65
52609B52686m81j145j132n50M1L01L52N00Q54J169J082N61ql36n01n59k64M20
52591B52990Q53M49l10l83L54R26P25K76K26L99M31O06J261J830J417J48q84j051
52573B60263p82n75k43N05J256J278M64n68j242j507j524j249o09J06L52Jl85
52556B55541k39K08K14l68p72l76M12P78O51N66O10K94m21p19%J186J767J371
52538B60703M39o05j599k178j786m34J009J661J489J076Q01O11M32L80N45Q99
52522B63443J391J909K077J535N01k97m34k11k1L14J075J873J998J515J350K003
52506B80021K703K352R06n71j207j192j294j800k232k057j471j267j834k559k474
$$ plain form
52626 262126 263509 264479 265418 265993 265349 263114 259790 256207 253071 250969 250230 250556 251163 251568 251927 252421 252686
52609 252686 252205 251060 249928 249378 249419 249720 250072 250572 251426 252595 253677 254238 254230 253894 253393 252834 252570 252990
52591 252990 253843 254292 253982 253599 253953 254879 255604 255880 256106 256505 256936 257542 258803 260633 262050 262198 261314 260263
52573 260263 259481 258906 258663 259168 260424 261702 262166 261598 260356 258849 257325 256076 255467 255573 255925 255926 255541
52556 255541 255302 255510 255724 255356 254584 254208 254620 255398 256049 256615 257225 257519 257098 256379 256379 257565 259332 260703
52538 260703 261142 260537 258938 256760 254974 254540 255549 257210 258699 259775 260576 261187 261619 261999 262544 263443
52522 263443 264834 266743 268820 270355 270856 270559 270125 269914 269893 270207 271282 273155 275153 276668 278018 280021
52506 280021 282724 285076 285982 285411 284204 283012 281718 279918 277686 275629 274158 272891 271057 268498 266024
52491B66024j458m23k25o87r58n58J19L55j18q12r40k45O19P90K83K8P04J875
52473B64373K580K431J818J250R30Q89J098J411J667J863K061K208K233K174K013
52458B90999J549P05k22r36j574k344k978l045k689k483k572k537k223k031k126
52443B65493k000j265m00j89o35j007q36m42m45r68j502j404n92K38K84m82j230
52426B52618j187l97N38J175J457J488J395J326J340J342J293J344J564J772J819
52411B68887J909K330L075L969N057O467P962R037R443R330Q779P519N224J982
52397C50970j612m732o751p568p530o967n991m815l970l742l673l052j916r71
52383B87680n87m15j50L3P6M50J391K219K136J446J264K003K891L176L124L413
$$ plain form
52491 266024 264566 264143 263918 263231 262273 261715 261834 262189 262071 261259 260319 260074 260693 261483 261766 261794 262498 264373
52473 264373 266953 269384 271202 272452 273382 274271 275369 276780 278447 280310 282371 284579 286812 288986 290999
52458 290999 292548 293253 293031 292095 290521 288177 285199 282154 279465 276982 274410 271873 269650 267619 265493
52443 265493 263493 262228 261828 261639 261004 259997 259161 258719 258274 257306 255804 254400 253808 254046 254330 253848 252618
52426 252618 251431 251034 251572 252747 254204 255692 257087 258413 259753 261095 262388 263732 265296 267068 268887
52411 268887 270796 273126 276201 280170 285227 291694 299656 308693 318136 327466 336245 343764 348988 350970
52397 350970 349358 344626 337875 330307 322777 315810 309819 305004 301034 297292 293619 290567 288651 287680
52383 287680 287093 286678 286528 286561 286637 287087 288478 290697 292833 294279 295543 297546 300437 303613 306737 310150
52367C10150L950L970L115J918J071O56K51m17j250j995k383k120j079L39J309
52352C17485J307O76K02K26M15L82K29K74N57Q50J053J235J401J450J488J877
52336C31107K755L682M040L801L675M332N663P014P979Q671R191R328R019Q730
52322D18987Q917R266R076Q372Q055Q717R785J0202R670Q854Q557R060J0082J1092
52308E48692J1743J2217J3008J4196J5187J5451J5182J4864J4561J4142J3882
52297G03125J4074J4220J3445J1760J0096Q844P295M946K574J261Q95M48n70j660
52283G90753k235k303k182k017j721j130k41N37N87j69r64j011m33R5L89Q79J738
52266G80572K551K963L160L493L996M472M833N193N870P213R183J1124J2282J2568
$$ plain form
52367 310150 314100 318070 321185 323103 324174 324830 325081 324664 323414 321419 319036 316916 315837 316176 317485
52352 317485 318792 319468 319670 319896 320311 320693 320922 321196 321753 322603 323656 324891 326292 327742 329230 331107
52336 331107 333862 337544 341584 345385 349060 353392 359055 366069 374048 382719 391910 401238 410257 418987
52322 418987 427904 437170 446246 454618 462673 471390 481175 491377 501047 509901 518458 527518 537600 548692
52308 548692 560435 572652 585660 599856 615043 630494 645676 660540 675101 689243 703125
52297 703125 717199 731419 744864 756624 766720 775564 782859 787805 790379 791640 792535 792983 792413 790753
52283 790753 788518 786215 784033 782016 780295 779165 778924 779461 780048 779879 778915 777904 777471 777566 777955 778834 780572
52266 780572 783123 786086 789246 792739 796735 801207 806040 811233 817103 824316 833499 844623 856905 869473
52252H69473J2494J2466J2456J2276J1735J0609Q933P287O247N575M568L159K005
52239I79283J428J033N63K67J02n87k043l477m092m101m098m034l612l173l298
52224I50161l817m039l805l480l124k498j852j797k231k279j545o84l70l00L13
52209I18653J649L164M266M721M574M025L352K807K564K748L443M546N761O755
52195I73028P314P428P286P029O496N427M010K882K323J827P48q80k595m142n421
52180A012760o135o193o155o651p439p735p363o830o386n781m973m276l717l028
52166I30098k372k188k127j152Q96K752L263K765K240J966J670J444J540J654
52152I42449J252M44j08n0M32R94J320J182P58N72P37O13k05j098j325j231j653
$$ plain form
52252 869473 881967 894433 906889 919165 930900 941509 950442 957729 963976 969551 974119 977278 979283
52239 979283 980711 981744 982307 982574 982676 982089 980046 976569 972477 968376 964278 960244 956632 953459 950161
52224 950161 946344 942305 938500 935020 931896 929398 927546 925749 923518 921239 919694 919010 918640 918340 918653
52209 918653 920302 923466 927732 932453 937027 941052 944404 947211 949775 952523 955966 960512 966273 973028
52195 973028 980342 987770 995056 1002085 1008581 1014008 1018018 1020900 1023223 1025050 1025798 1024918 1022323 1018181 1012760
52180 1012760 1006625 1000432 994277 987626 980187 972452 965089 958259 951873 946092 941119 936843 933126 930098
52166 930098 927726 925538 923411 922259 923155 925907 929170 931935 934175 936141 937811 939255 940795 942449
52152 942449 943701 944145 944037 943987 944419 945413 946733 947915 948673 949245 949982 950595 950390 949292 947967 946736 945083
52135I45083k421k537j729q19l18K80J458K855L979N173P098R684J2071J3521
52121I93378J3995J3977J3997J4248J4537J4633J4598J4525J4107J2993J1608
52110A146596J1009J1623J2589J2786J2157J1637J1971J3036J4186J4804J4583
52099A286977J3587J2178J0682R076P102M609J682j443m408o710p969q289q298
52086A308776q652r484j0276j0282r203p522o157n718o069o603o829o633o091
52073A209257n227m041k727j721j339j327r27M29K536M629O188P269Q117Q718
52059A229834R006R229R834J0892J1920J2287J1725J0353Q393O111L873K001M41
52046A335899j209l134m979o262o984p481p824p764p306o897o816o793o570o461
$$ plain form
52135 945083 942662 940125 938396 937577 937259 937539 938997 941852 945831 951004 958102 967786 979857 993378
52121 993378 1007373 1021350 1035347 1049595 1064132 1078765 1093363 1107888 1121995 1134988 1146596
52110 1146596 1157605 1169228 1181817 1194603 1206760 1218397 1230368 1243404 1257590 1272394 1286977
52099 1286977 1300564 1312742 1323424 1332500 1339602 1344211 1345893 1344450 1340042 1333332 1325363 1317074 1308776
52086 1308776 1300124 1290640 1280364 1270082 1260879 1253357 1247200 1241482 1235413 1228810 1221981 1215348 1209257
52073 1209257 1204030 1199989 1197262 1195541 1194202 1192875 1191948 1192377 1194913 1199542 1205730 1212999 1221116 1229834
52059 1229834 1238840 1248069 1257903 1268795 1280715 1293002 1304727 1315080 1323473 1329584 1333457 1335458 1335899
52046 1335899 1334690 1331556 1326577 1320315 1313331 1305850 1298026 1290262 1282956 1276059 1269243 1262450 1255880 1249419
52032A249419o950p889q636q947r320j0258j1539j2428j2440j1764j1023j0703
52020A127522j0813j0961j0746j0096r228q445p939p717p646p659p847q234q577
$$ plain form
52032 1249419 1242469 1234580 1225944 1216997 1207677 1197419 1185880 1173452 1161012 1149248 1138225 1127522
52020 1127522 1116709 1105748 1095002 1084906 1075678 1067233 1059294 1051577 1043931 1036272 1028425 1020191 1011614
$$ [...]
##END NTUPLES=NMR SPECTRUM
##END=
