
##TITLE=UV1232_M7_1357-1247_50_7230683_0sIhplZAvN
##JCAMPDX= 6.0         $$ Bruker NMR JCAMP-DX V2.0
##DATA TYPE= NMR SPECTRUM
##DATA CLASS= NTUPLES
##ORIGIN= BRUKER
##OWNER= Administrator
$$ 1.72 TOPSPIN		Version 2.1
$$ 2013-01-18 18:35:21.120 -0500  Administrator@X
$$ Compression mode = diff/dup
##.OBSERVE FREQUENCY= 400.02188249412
##.OBSERVE NUCLEUS= ^1H
##.ACQUISITION MODE= SIMULTANEOUS (DQD)
##.ACQUISITION SCHEME= undefined
##.AVERAGES= 8
##.DIGITISER RES= 22
##SPECTROMETER/DATA SYSTEM= spect
##.PULSE SEQUENCE= zg30
##.SOLVENT NAME= COFFEE_meoh
##.SHIFT REFERENCE= INTERNAL, COFFEE_meoh, 1, 14.98509
##AUDIT TRAIL= $$ (NUMBER, WHEN, WHO, WHERE, PROCESS, VERSION, WHAT)
$$ ##TITLE= Audit trail, TOPSPIN		Version 2.1
$$ ##JCAMPDX= 5.01
$$ ##ORIGIN= Bruker BioSpin GmbH
$$ ##OWNER= Administrator
$$ $$ E:\/data/COFFEE/nmr/UV1232_M7_1357-1247_50_7230683_0sIhplZAvN/20/pdata/1/auditp.txt
$$ ##AUDIT TRAIL=  $$ (NUMBER, WHEN, WHO, WHERE, PROCESS, VERSION, WHAT)
(   1,<2013-01-18 18:35:13.073 -0500>,<Administrator>,<X>,<go>,<TOPSPIN 2.1>,
      <created by zg
	started at 2013-01-18 18:34:06.683 -0500,
	POWCHK enabled, PULCHK disabled,
       configuration hash MD5:
       86 BA 57 50 F2 9D 5C 9B 26 00 A9 28 5F 66 2E 89
       data hash MD5: 64K
       8D 4C EE B6 6D A6 45 DE BD BD EF 48 A7 71 9E 4E>)
(   2,<2013-01-18 18:35:16.151 -0500>,<Administrator>,<X>,<proc1d>,<TOPSPIN 2.1>,
      <Start of raw data processing
       efp LB = 0 FT_mod = 6 PKNL = 1 PHC0 = 0 PHC1 = 0 SI = 32K 
       data hash MD5: 32K
       17 AA A1 A9 3D 70 41 B3 91 A2 09 C6 0A 7E 56 D0>)
(   3,<2013-01-18 18:35:16.620 -0500>,<Administrator>,<X>,<proc1d>,<TOPSPIN 2.1>,
      <pk PHC0 = 94.89441 PHC1 = 0 
       data hash MD5: 32K
       FB 96 DF F6 DF 79 8E E9 23 89 D5 78 68 0E 8D A7>)
(   4,<2013-01-18 18:35:16.870 -0500>,<Administrator>,<X>,<proc1d>,<TOPSPIN 2.1>,
      <abs ABSG = 1 
       data hash MD5: 32K
       21 37 C6 48 97 9E F7 A4 6F 5F 70 77 4E BD BC C0>)
(   5,<2013-01-18 18:35:17.011 -0500>,<Administrator>,<X>,<proc1d>,<TOPSPIN 2.1>,
      <abs ABSG = 2 
       data hash MD5: 32K
       B8 3E 31 02 1C C5 52 9D 41 F4 79 E2 3C DB 41 FE>)
(   6,<2013-01-18 18:35:17.183 -0500>,<Administrator>,<X>,<proc1d>,<TOPSPIN 2.1>,
      <abs ABSG = 3 
       data hash MD5: 32K
       06 23 54 46 44 A8 91 D0 89 DA C7 31 F8 8C D3 08>)
(   7,<2013-01-18 18:35:17.308 -0500>,<Administrator>,<X>,<proc1d>,<TOPSPIN 2.1>,
      <abs ABSG = 4 
       data hash MD5: 32K
       82 86 0F F6 20 B1 AC EE 60 16 C7 2D 7F 10 A4 C6>)
(   8,<2013-01-18 18:35:17.448 -0500>,<Administrator>,<X>,<proc1d>,<TOPSPIN 2.1>,
      <abs ABSG = 5 
       data hash MD5: 32K
       B7 8C 91 F7 4B 94 58 E7 A5 10 F9 82 30 C8 5B D9>)
$$ ##END=
$$ 
$$ $$ hash MD5
$$ $$ 43 EC 46 84 65 FF 42 5C AE 2A 47 52 72 FC C4 4C
##$RELAX= 
##$RELAX= 
##$RELAX= 
##$RELAX= 
##$RELAX= 
##$RELAX= 
##$RELAX= 
$$ Bruker specific parameters
$$ --------------------------
##$DU= <E:\>
##$EXPNO= 20
$$ [...]
150 150 150 150 150 150 150 150
##$TP07= 0
##$TPNAME0= <>
##$TPNAME1= <>
##$TPNAME2= <>
##$TPNAME3= <>
##$TPNAME4= <>
##$TPNAME5= <>
##$TPNAME6= <>
##$TPNAME7= <>
##$TPOAL= (0..7)
0.5 0.5 0.5 0.5 0.5 0.5 0.5 0.5
##$TPOFFS= (0..7)
0 0 0 0 0 0 0 0
##$TUNHIN= 0
##$TUNHOUT= 0
##$TUNXOUT= 0
##$USERA1= <user>
##$USERA2= <user>
##$USERA3= <user>
##$USERA4= <user>
##$USERA5= <user>
##$V9= 5
##$VALIST= <valist>
##$VCLIST= <CCCCCCCCCCCCCCC>
##$VD= 0
##$VDLIST= <DDDDDDDDDDDDDDD>
##$VPLIST= <PPPPPPPPPPPPPPP>
##$VTLIST= <TTTTTTTTTTTTTTT>
##$WBST= 1024
##$WBSW= 4
##$XGAIN= (0..3)
0 0 0 0
##$XL= 0
##$YL= 0
##$YMAX_a= 618479
##$YMIN_a= -524989
##$ZGOPTNS= <>
##$ZL1= 120
##$ZL2= 120
##$ZL3= 120
##$ZL4= 120
##$ABSF1= 14.98509
##$ABSF2= -5.573092
##$ABSG= 5
##$ABSL= 3
##$ALPHA= 0
##$AQORDER= 0
##$ASSFAC= 0
##$ASSFACI= 0
##$ASSFACX= 0
##$ASSWID= 0
##$AUNMP= <proc_prof1d_extract_pilot.lims>
##$AXLEFT= 0
##$AXNAME= <>
##$AXNUC= <1H>
##$AXRIGHT= 0
##$AXTYPE= 0
##$AXUNIT= <>
##$AZFE= 0.1
##$AZFW= 0.1
##$BCFW= 0
##$BC_mod= 0
##$BYTORDP= 0
##$COROFFS= 0
##$CY= 15
##$DATMOD= 1
##$DC= 0
##$DFILT= <>
##$DTYPP= 0
##$F1P= 0
##$F2P= 0
##$FCOR= 0.5
##$FTSIZE= 32768
##$FT_mod= 6
##$GAMMA= 0
##$GB= 0
##$INTBC= 1
##$INTSCL= 1
##$ISEN= 128
##$LB= 0
##$LEV0= 0
##$LPBIN= 0
##$MAXI= 10000
##$MC2= 0
##$MEAN= 0
##$ME_mod= 0
##$MI= 0
##$NCOEF= 0
##$NC_proc= -8
##$NLEV= 6
##$NOISF1= 0
##$NOISF2= 0
##$NSP= 0
##$NTH_PI= 0
##$NZP= 0
##$OFFSET= 14.98509
##$PC= 1
##$PHC0= 94.89441
##$PHC1= 0
##$PH_mod= 1
##$PKNL= yes
##$PPARMOD= 0
##$PPDIAG= 0
##$PPIPTYP= 0
##$PPMPNUM= 2147483647
##$PPRESOL= 1
##$PSCAL= 4
##$PSIGN= 0
##$PYNMP= <proc.py>
##$REVERSE= no
##$SF= 400.02
##$SI= 32768
##$SIGF1= 0
##$SIGF2= 0
##$SINO= 400
##$SIOLD= 32768
##$SPECTYP= <>
##$SREGLST= <1H.CDCl3>
##$SSB= 0
##$STSI= 32768
##$STSR= 0
##$SW_p= 8223.68421052631
##$SYMM= 0
##$S_DEV= 0
##$TDeff= 65536
##$TDoff= 0
##$TI= <>
##$TILT= no
##$TM1= 0
##$TM2= 0
##$TOPLEV= 0
##$USERP1= <user>
##$USERP2= <user>
##$USERP3= <user>
##$USERP4= <user>
##$USERP5= <user>
##$WDW= 1
##$XDIM= 32768
##$YMAX_p= 466344820
##$YMIN_p= -711101
##$CURPLOT= <Network HP LaserJet P1505>
##$CURPRIN= <$Network HP LaserJet P1505>
##$DFORMAT= <normdp>
##$LAYOUT= <+/1D_H.xwp>
##$LFORMAT= <normlp>
##$PFORMAT= <normpl>
##$SURQMSG= 1
$$ End of Bruker specific parameters
$$ ---------------------------------
##NTUPLES= NMR SPECTRUM
##VAR_NAME=  FREQUENCY,     SPECTRUM/REAL,   SPECTRUM/IMAG
##SYMBOL=    X,             R,               I
##VAR_TYPE=  INDEPENDENT,   DEPENDENT,       DEPENDENT
##VAR_FORM=  AFFN,          ASDF,            ASDF
##VAR_DIM=   32768,         32768,           32768
##UNITS=     HZ,            ARBITRARY UNITS, ARBITRARY UNITS
##FACTOR=    0.250966925370066, 1,           1
##FIRST=     8223.43324360094, 167788,       -89878
##LAST=      0,             -52870,          -178284
##MIN=       0,             -711101,         0
##MAX=       8223.43324360094, 466344820,    0
$$ Real data points
##PAGE= N=1
##DATA TABLE= (X++(R..R)), XYDATA
$$ [...]
$$ plain form
19537 -220020 -42800 -231907 -150760 60888 66678 73874 -375481 399071 -29372 -358523 35984
19525 -190295 23681 98917 -414033 -16647 68493 107635 -13551 -304025 13266 -910 -190012
19514 -190012 -158697 21122 -201359 103925 -40458 -341505 -178496 -173638 -28410 352031 -266436
19502 257494 -315566 148603 -233387 17780 255755 288575 81674 57710 -218933 29302
19491 152321 16435 -44675 27438 -155236 -223966 -58921 -95730 -93759 -199088 -120140 63891
19479 51405 -137397 -5317 -202958 -40806 -66260 -133492 -5947 95333 -222878 -203381 72869
19467 -186256 -73322 -326297 -104464 -435687 156491 -302385 50198 -49976 -32330 -102296
19457 -102296 -174967 -23655 144978 35784 -39084 106164 51191 -249377 -170703 -237688 -252453
$$ packed form
19537b20020d2800j89107Q1147F0888N790P196c75481C99071b9372l29151C5984
19525a90295B3681P5236d14033a6647F8493L9142a3551k90474A3266i10j89102
19514a90012L1315B1122b01359A03925d0458l01047J63009M858b8410C52031b66436
19502B57494c15566A48603b33387A7780K37975L2820H1674k3964b18933B9302
19491A52321A6435d4675B7438a55236o8730e8921l6809J971j05329P8948F3891
19479E1405a37397e317j97641d0806k5454o7232e947I5333b22878J9497G2869
19467a86256g3322k52975a04464l31223A56491c02385E0198d9976J7646o9966
19457a02296p2671b3655A44978C5784c9084A06164E1191b49377P8674o6985j4765
$$ plain form
19446 -252453 175325 74538 -177955 -31412 204498 -99385 -366513 -108539 -14473 -138477
19436 -138477 -80376 69991 -261539 84979 12741 -394154 76640 43641 -570285 -83142 -30106
19424 -68205 154881 22082 -171629 72448 -262701 234422 14891 195196 5292 44629 -136911
19412 -41855 13019 -26728 -71190 -54469 80782 -190571 37340 -425931 77075 -148871 -198988
19401 -198988 132507 33253 -305041 88007 198694 -78601 85677 -101142 66806 483796
19391 483796 178721 81114 128299 244416 82006 36748 -331101 -166776 -182825 -122140 -93367
19380 -93367 -69223 -110348 -160787 132086 74034 -209577 -295614 28489 14175 -254772 53457
19368 80718 -152866 -148941 18393 -258511 -48348 -140465 99102 -91746 89345 -198910 -185976
$$ packed form
19446b52453A75325G4538a77955c1412B04498i9385k67128a08539a4473j24004
19436a38477N8101F9991b61539H4979A2741c94154G6640l2999e70285h3142c0106
19424f8205A54881B2082a71629G2448b62701B34422A4891J80305E292L9337a36911
19412d1855A3019b6728m4462J6721H0782a90571C7340d25931G7075a48871n0117
19401a98988A32507C3253c05041H8007J10687g8601H5677a01142F6806M16990
19391D83796A78721H1114M7185J16117H2006C6748c31101J64325j6049O0685K8773
19380i3367K4144m1125n0439A32086n8052b09577q6037B8489A4175b54772E3457
19368H0718a52866L925A8393b58511d8348r2117I9102i1746H9345a98910J2934
$$ plain form
19357 -185976 -70319 144872 -210032 -18143 -108385 -88188 224099 -203983 21254 -302588
19346 158255 168949 -181763 41294 -118587 -17129 -16285 -118042 59403 -117355 -65109 -152848
19335 -152848 214397 -125160 -168535 162773 -157240 -308179 -287861 -303105 -307639 -369684 -17627
19323 -25143 -34556 -156071 -9221 -102316 -6480 -65956 -345221 59009 -11186 236373 89498 -44506
19310 -87142 -175656 -83221 -41943 129514 -242728 -124484 -360892 6592 10634 -80528 38605
19298 -20843 25073 21475 -162443 5787 347185 22214 23966 -165980 38642 -205610 -201517 -256582
19286 -256582 127749 -87119 -200227 261521 -25300 -226299 -11791 -242693 92539 219284
19276 219284 115339 33499 -13392 -351572 -155765 -26487 -57905 -142676 -129062 42838 4389
$$ packed form
19357a85976g0319A44872b10032a8143r0242K0197B24099b03983B1254c02588
19346A58255J0694a81763D1294a18587a7129Q44j01757E9403a17355N2246q7739
19335a52848B14397a25160m3375A62773a57240j50939K0318j5244m534o2045a7627
19323b5143r413j21515i221r3095f480n9476k79265E9009a1186B36373H9498d4506
19310h7142q8514h3221M1278A29514b42728J18244k36408F592M042h0528C8605
19298b0843B5073l598a62443E787L41398B2214J752a65980C8642b05610M093n5065
19286b56582A27749h7119j13108B61521b5300k00999a1791k30902I2539J26745
19276B19284j03945C3499a3392l38180a55765b6487l1418q4771J3614D2838D389
$$ plain form
19264 -49423 -290740 -171288 -431540 -122894 26658 -18567 -76940 114200 79719 78064 221147
19253 221147 -77934 -297304 31373 -180653 -55277 -339053 -162714 -70265 -170498 -82537
19242 -154555 -250213 -95904 -19783 -207421 -237631 22743 -52689 94706 -92372 -104268 -61947
19231 -61947 152414 -70636 -15615 50025 54259 -211730 -230599 -127582 -20169 -29255 -409940
19220 -409940 -15699 -101536 -81453 -88018 -128327 129069 -242295 -84986 156685 -168014 -184697
19209 -184697 -355733 -53752 87842 41790 84162 -3662 132898 -149586 -217708 9796 -16677
19197 -62228 147226 -6640 -24973 -343825 168871 -341797 -114952 203729 83546 -313088
19186 47544 151738 -11691 -269715 128512 -138486 -32969 -157041 209632 117988 -157799
$$ packed form
19264d9423k41317J19452k60252a22894B6658a8567n8373A14200l4481j655J43083
19253B21147g7934k19370C1373a80653e5277k83776a62714g0265j00233h2537
19242a54555r5658i5904a9783j87638l0210B2743e2689I4706i2372j1896M2321
19231f1947A52414g0636a5615E0025M234b11730j8869J03017b0169r086l80685
19220d09940a5699q5837K0083o565m0309A29069b42295h4986A56685a68014j6683
19209a84697j71036e3752H7842D1790M2372c662A32898a49586o8122I796a6677
19197f2228A47226f640j8333l18852A68871c41797a14952B03729H3546c13088
19186D7544J04194a1691k58024A28512a38486c2969j24072B09632r1644a57799
$$ plain form
19175 9373 -168752 -346416 112817 -37079 -153759 -161114 -50400 -65819 -436840 25459 -8586
19163 -76338 89573 123740 -87260 -204866 10881 50771 -120624 140675 155690 -156393 -9165
19151 -195600 151019 -124670 -272068 -278982 84176 111180 -208465 -357551 -122539 98658
19140 -187531 92213 -134812 160734 157728 17401 35861 36875 112355 55328 -166178 103662
19128 71498 -142125 -33616 101499 167652 -91336 -160275 -208927 -41549 -17946 5477 -270220
19116 -288146 145476 -338087 145425 -70636 -54002 -120149 39047 -198031 57383 -30772 135602
19104 -218020 164635 -246562 25891 143072 -96235 232108 228611 -185246 -148478 -23945 -70030
19093 -70030 140595 4068 -128854 327495 -159459 302895 111633 -32722 277491 -235868
$$ packed form
19175I373a68752j77664A12817c7079j16680p355e0400j5419l71021B5459h586
19163g6338H9573L4167h7260j17606A0881L9890a20624A40675J5015a56393i165
19151a95600A51019a24670j47398o914H4176K7004b08465j49086a22539I8658
19140a87531I2213a34812A60734l006A7401J8460J014P5480E5328a66178A03662
19128G1498a42125c3616A01499O6153i1336o8939m8652d1549a7946E477b70220
19116b88146A45476c38087A45425g0636J6634o6147C9047a98031E7383c0772A35602
19104b18020A64635b46562B5891J17181i6235B32108l497a85246L6768b3945m6085
19093g0030A40595D068a28854C27495a59459C02895A11633c2722B77491b35868
$$ plain form
19082 -34857 -292663 -47565 -202406 65174 -186826 -161682 128538 115128 -165615 76282 -123054
19070 -199710 57595 -20065 -302418 69176 -37789 -227710 -225143 85272 23671 69358 -292837
19058 -151914 14010 79839 -203563 -21460 -304205 434684 -286245 49886 213907 55971
19047 208598 -270851 -86750 -166345 45907 -119527 34645 -45089 -40023 83707 -220713 27449
19035 -18982 -99116 113421 -87882 3338 43012 -52483 48344 68217 29176 242086 9382 -83318
19022 405000 -443504 172238 167385 -343875 275563 -36685 -48901 -274999 103436 -217267
19011 -411270 49630 -268477 -219964 314919 134043 284242 -74499 -24826 -112342 21041 -119295
18999 228907 -93872 132399 -241787 -43880 323716 -42895 109475 -251745 5646 92271 -16464
$$ packed form
19082c4857k57806d7565j54841F5174a86826K5144A28538j3410a65615G6282a23054
19070a99710E7595b0065k82353F9176c7789j89921K567H5272B3671M5687b92837
19058a51914A4010O5829b03563b1460k82745D34684b86245D9886J64021E5971
19047B08598b70851h6750p9595D5907a19527C4645d5089N066H3707b20713B7449
19035a8982q0134A13421h7882C338L9674e2483D8344J9873B9176K12910I382h3318
19022D05000d43504A72238m853c43875B75563c6685j2216k26098A03436b17267
19011d11270D9630b68477M8513C14919A34043J50199g4499b4826q7516B1041a19295
18999B28907i3872A32399b41787d3880C23716d2895A09475b51745E646Q6625a6464
$$ plain form
18987 24374 -147632 252675 -75014 -97452 -1592 -180780 -153183 -401191 -416526 -23273 -74678
18976 -74678 250232 -24990 -118994 49488 -226162 -24344 36389 -177375 345678 437130 -52532
18964 -258875 -72910 120347 -64272 -121760 -127396 -75435 172293 -351922 -96026 -424755 -13820
18952 158885 72532 -61941 -84999 -309337 -224610 214032 -35802 -308157 81317 127097 16335
18940 39033 128826 280833 -137612 -181866 -76494 -47501 -128007 119431 -138143 -184226 168881
18928 97962 83188 -96718 -48080 141279 -221441 113385 42025 -123320 -180710 102095 39306
18916 49049 -14440 -117621 -165968 38689 -165155 271326 -127743 -189529 -61460 -96382 -46143
18904 40350 83942 81220 23269 -107594 106459 -146375 -197336 -613149 -26099 -54339 -34708
$$ packed form
18987B4374a47632B52675g5014k2438a592j79188K7597k48008j5335b3273n1405
18976g4678B50232b4990r4004D9488b26162b4344C6389a77375C45678R1452e2532
18964b58875g2910A20347f4272n7488n636N1961A72293c51922i6026l28729a3820
18952A58885G2532f1941k3058k24338Q4727B14032c5802k72355H1317M5780A6335
18940C9033Q9793J52007a37612m4254g6494K8993q0506A19431a38143m6083A68881
18928I7962j4774i6718d8080A41279b21441A13385D2025a23320n7390A02095C9306
18916D9049a4440j03181m8347C8689a65155B71326a27743o1786f1460l4922d6143
18904D0350M3592k722B3269a07594A06459a46375n0961m15813b6099k8240J9631
$$ plain form
18893 -34708 23883 -16533 -167681 -207635 -254145 25590 -156882 -53603 -238300 -410915 -21851
18881 -73625 -270422 -148587 -41696 -215199 -116739 47722 -544 -195593 17595 22028 -304078
18869 151485 61048 -116171 -167905 -272124 140031 -122469 -20150 -121926 -121722 27496 -40560
18857 123421 -144547 -65979 -75282 -237472 -189067 -214088 -47335 -362989 -230138 -98146 -55895
18846 -55895 -39917 41852 41217 -78940 155096 -400765 -201267 28631 -210052 -289381 47167
18834 -97942 -110272 312623 -92138 -10248 -96417 -41480 -142942 234212 72620 -311820 69059
18822 203962 211167 -265508 130229 -309900 -198887 -135652 54646 51528 16966 -92034 248138
18810 -158 61017 -249360 185822 204205 74795 -233941 218148 117801 -232486 -417658 103480
$$ packed form
18893c4708B3883a6533j51148l9954m6510B5590a56882e3603j84697j72615b1851
18881g3625j96797J21835d1696j73503R8460D7722e44j95049A7595M433c04078
18869A51485F1048a16171n1734j04219A40031a22469b0150j01776K04B7496d0560
18857A23421a44547f5979r303j62190M8405k5021d7335l15654J32851i8146M2251
18846e5895J5978D1852o35g8940A55096d00765J99498B8631b10052p9329D7167
18834i7942j2330C12623i2138a0248q6169d1480j01462B34212G2620c11820F9059
18822B03962P205b65508A30229c09900J11013O3235E4646l118A6966i2034B48138
18810a58F1017b49360A85822J8383G4795b33941B18148j00347b32486j85172A03480
$$ plain form
18798 -262721 174140 -90980 -428210 366114 62285 78057 -120450 78403 -365906 -239422
18788 -239422 -148663 73541 270504 309891 140692 -107608 297025 -147068 41240 -45274
18777 155263 -48115 7011 70275 37916 -548762 -213097 -206687 -166536 -1378 165711 -201305
18765 39469 104846 -340634 -324901 -150885 -191809 -324491 -284656 -285759 24161 -147615 -37431
18753 235355 -176326 117968 -410145 204097 20458 -116279 160276 -87488 -239156 -157631
18743 -157631 -209156 -133402 13222 107010 129353 111578 180533 -158368 100319 -257797 -43237
18731 -5640 -322695 -191000 -34081 -177003 135933 135392 80546 -235118 182104 18665 -36396
18719 -334064 128157 -256876 137291 90437 71104 -167845 197323 -157830 -139119 33805
$$ packed form
18798b62721A74140i0980l37230C66114F2285J5772a20450G8403c65906J26484
18788b39422R0759G3541J96963L9387A40692a07608B97025a47068D1240d5274
18777A55263d8115G011O3264l2359e48762b13097O410M0151a378A65711b01305
18765C9469O5377c40634J5733a50885m0924j32682L9835j103B4161a47615c7431
18753B35355a76326A17968d10145B04097B0458a16279A60276h7488j51668Q1525
18743a57631n1525P5754A3222R3788K2343j7775O8955a58368A00319b57797d3237
18731e640l17055J31695c4081j42922A35933n41n4846b35118A82104A8665c6396
18719c34064A28157b56876A37291m6854j9333a67845A97323a57830J8711C3805
$$ plain form
18708 -53259 18189 179065 -238258 -5443 65365 -288260 -70203 -154683 75196 143794 -16004
18696 -184954 -168238 130240 -157524 264168 -179123 9795 126267 -21767 86986 173227 23542
18684 -22210 -191037 246928 -69729 -47746 -134619 -242552 47662 28420 130921 416293 -22184
18672 24694 -177629 -385706 -225895 -10359 78111 -62450 225393 -112030 18630 124632
18662 124632 110807 -159158 -360493 -230993 278384 227361 -254105 29187 -33392 2760 182888
18651 182888 87252 -10834 167051 -67572 -275270 -63823 198991 -125507 292857 38611
18640 51539 -234333 165493 112867 231740 -261798 -331718 -260168 -183056 -27431 104163 -225032
18628 -131595 -456117 254997 -97715 -10095 -176111 -148658 -371696 -39219 27597 203067
$$ packed form
18708e3259A8189J60876b38258e443F5365b88260g0203q4480G5196O8598a6004
18696a84954J6716A30240a57524B64168a79123I795J16472b1767H6986Q6241B3542
18684b2210j68827B46928f9729K1983q6873j07933D7662j9242J02501K85372b2184
18672B4694a77629k08077J59811a0359G8111f2450B25393a12030A8630J06002
18662A24632j3825a59158k01335J29500B78384n1023b54105B9187c3392B760J80128
18651A82888H7252a0834A67051f7572k07698f3823A98991a25507B92857C8611
18640E1539b34333A65493n2626J18873b61798o9920P1550P7112b7431A04163b25032
18628a31595l24522B54997i7715a0095j66016K7453k23038c9219B7597J75470
$$ plain form
18618 203067 -46522 54707 -492520 148999 -278962 208683 54791 123606 -81770 168700
18607 -440508 -23734 -11466 54882 54593 -219362 134353 101911 -167155 -226286 184905 -290240
18595 -180683 -69158 -63797 -300909 -282122 -145825 -210915 -135365 -160197 92796 66401 -229595
18583 -327461 -82151 -57809 315636 -63713 -266802 -74050 -200576 572 -179295 -101122 120809
18571 -135878 -199289 -130514 -90914 113770 -102850 -317454 -97122 139207 -208154 -219486
18561 -219486 -261515 -187403 56389 45200 215386 -131530 -139501 22149 96919 -150924 120335
18549 12562 165554 -335199 151864 382684 -59669 -304299 -30427 187883 -24432 -165685
18539 -165685 -975 -76048 72776 88423 10707 -226985 155000 -96299 -11998 56037 -142943
$$ packed form
18618B03067d6522E4707d92520A48999b78962B08683E4791O8815h1770A68700
18607d40508b3734a1466E4882k89b19362A34353l2442a67155n9131A84905b90240
18595a80683f9158N361k37112J8787J36297o5090P5550k4832I2796k6395b29595
18583c27461h2151K4342C15636f3713k03089g4050j26526E72a79295P8173A20809
18571a35878o3411O8775L9600A13770a02850k14604i7122A39207b08154j1332
18561b19486m2029P4112E6389j1189J70186a31530p971B2149P4770a50924A20335
18549A2562J52992c35199A51864K30820e9669k44630c0427A87883b4432j41253
18539a65685i75p5073G2776J5647A0707b26985A55000i6299a1998E6037a42943
$$ plain form
18527 -8318 -109008 105467 -173767 219192 135580 -54922 -105820 300540 -97566 -173326 -147665
18516 -147665 18725 364957 -18862 -57096 191087 308573 -156577 -169371 95213 -67027 -164824
18505 -164824 -24688 -201477 -126062 -181364 75689 -22191 -481614 -331271 -15007 -269077 -166653
18494 -166653 17534 67290 -141179 -72833 -217262 166246 -88353 -272703 -141430 -23237
18483 -15715 152702 32490 -30885 287711 -345267 -323811 40595 -54229 125764 -31266 -26775
18472 -26775 -124873 -128108 99080 58698 102507 37448 135235 -240301 -34154 7547 -66433 275189
18459 -175821 -138115 -277349 169038 -558526 252933 -139782 231216 -70862 18986 -118844
18448 -55581 -5302 -163683 64323 -233418 87261 -104244 -123824 -78524 -80867 -132010 -144761
$$ packed form
18527h318j00690A05467a73767B19192q3612e4922n0898C00540i7566p5760K5661
18516a47665A8725L46232a8862l8234A91087J17486a56577j2794I5213f7027r7797
18505a64824b4688j76789P5415n5302G5689b2191m59423J50343a5007k54070J02424
18494a66653A7534M9756a41179O8346j44429A66246h8353j84350J31273b3237
18483a5715A52702C2490c0885B87711c45267K1456D0595e4229A25764c1266M491
18472b6775r8098l235I9080m0382M3809C7448R7787b40301c4154G547f6433B75189
18459a75821L7706j39234A69038e58526B52933a39782B31216g0862A8986a18844
18448e5581e302j58381F4323b33418H7261a04244j9580M5300k343n1143j2751
$$ plain form
18437 -144761 14307 -196651 132104 -54894 106595 -166794 181545 -367620 8082 -331713
18426 -148765 20537 20019 -331521 -259884 134066 -147531 -55369 -18621 89055 -32533 127729
18414 24694 -472587 -98680 -9644 -109632 -188469 211160 -157551 109558 -75463 -244916 302828
18402 136368 107242 252598 -146552 115949 -21648 -137959 -120790 27075 124468 -46428 -56693
18391 -56693 146963 -88569 -185201 130311 -159794 -185612 142961 -90222 -217824 64607 42349
18380 42349 -363150 73 79107 -114669 -41139 96274 40149 -91411 -140898 5285 -115320 -197503
18368 -197503 33607 163861 206279 283226 -56622 20005 51341 44326 -8956 125970 -22381
18356 -37297 -477982 72931 203004 16428 -247636 -212370 -91988 -11721 -117056 -462691 -105556
$$ packed form
18437a44761A4307a96651A32104e4894A06595a66794A81545c67620H082c31713
18426a48765B0537n18c31521P1637A34066a47531e5369a8621H9055c2533A27729
18414B4694d72587i8680i644r9988p8837B11160a57551A09558g5463j69453C02828
18402A36368k9126J45356a46552A15949b1648j16311J7169B7075R7393d6428j0265
18391e6693A46963h8569r6632A30311a59794k5818A42961i0222j27602F4607k2258
18380D2349c63150G3P9034a14669d1139I6274D0149i1411m9487E285a15320q2183
18368a97503C3607J30254M2418P6947e6622B0005L1336p015h956A25970b2381
18356c7297m40685G2931J30073A6428b47636L5266i1988a1721j05335l45635a05556
$$ plain form
18344 203361 -58904 66289 -180966 -98376 -260976 20383 188359 -164248 -137358 109152
18333 79371 -223810 -18476 -113268 -18918 3935 -421803 -221485 -255284 -468823 -205579 -55887
18321 -71870 -117389 40790 10144 354242 105868 -140681 -52643 -64544 297254 -21650 -376042
18310 -376042 -241363 -287698 -92000 -50405 -123126 -160974 -135590 142070 -202628 61037 -71301
18298 157304 23448 -292983 -179139 -349095 -101537 179881 47857 99761 -154785 231878
18287 -13298 184500 -408886 172183 41655 414185 67240 -131554 -141512 -253095 127279
18276 -78316 -61583 243322 -10896 -69644 211056 -116293 192762 220296 -246750 -217815 -287018
18265 -287018 195150 63334 -80292 83353 70565 1532 235723 31699 248252 -110505 277455
$$ packed form
18344B03361e8904F6289a80966Q2590j62600B0383J67976a64248K6890A09152
18333G9371b23810a8476r4792a8918C935d21803K00318l3799k13539b05579e5887
18321g1870m5519D0790A0144L44098A05868a40681e2643j1901B97254b1650l54392
18310c76042J34679m6335i2000M1595p2721l7848K5384A42070b02628F1037g1301
18298A57304B3448b92983J13844j69956a01537A79881D7857N1904a54785B31878
18287a3298A84500d08886A72183D1655L72530F7240a31554r958j11583A27279
18276g8316J6733B43322a0896n8748B11056a16293A92762K7534b46750K8935o9203
18265b87018A95150F3334h0292H3353j2788A532K34191C1699K16553a10505B77455
$$ plain form
18253 44593 -132855 189387 16013 3529 -75997 -107357 -316249 -331709 91238 -148693 -176423
18242 -176423 -507339 -267443 -12186 24471 120841 -160553 217824 -303147 45601 -136700
18231 -269194 114504 131989 -244011 170890 -249081 -173759 -167300 -32086 100530 -180571
18220 141880 375771 47711 -43223 -399645 -294733 -182810 -507184 -129932 -309559 -312616
18210 -312616 155964 -120062 -29563 44764 -38669 57112 112584 -94942 -197810 -5822 -92573
18199 -92573 -152442 6706 -412369 80015 -161749 -106214 275908 -151845 -57205 -173509 -185053
18188 -185053 -65977 -64237 -279619 69347 -22237 252559 -11260 -126697 360054 -116337 -258645
18177 -258645 -24186 160523 -112248 -195342 123515 150315 -147123 -444279 -35674 129864
$$ packed form
18253D4593a32855A89387A6013C529g5997l1360k08892j5460I1238a48693k7730
18242a76423l30916K39896a2186B4471R6370a60553B17824c03147D5601a36700
18231b69194A14504J7485b44011A70890b49081P5322O459c2086A00530a80571
18220A41880K33891D7711d3223l56422J04912J11923l24374a29932j79627l057
18210c12616A55964a20062b9563D4764c8669E7112N5472i4942j02868e822q6751
18199i2573n9869F706d12369H0015a61749N5535B75908a51845e7205j16304j1544
18188a85053f5977J740k15382F9347b2237B52559a1260j15437C60054a16337j42308
18177b58645b4186A60523a12248q3094A23515K6800a47123k97156c5674A29864
$$ plain form
18166 136710 -109865 -208601 -277394 -153684 220140 -29294 385575 192689 -61393 235729
18155 6879 230958 -102116 -17137 -124371 -18995 -90875 214264 -162069 -20831 -98283 -83369
18144 -83369 139144 -161055 -303221 195630 -92652 67728 -76738 -255102 -26803 120773
18133 -2507 -410279 -275657 34469 54353 -84195 147342 -21011 10274 -455039 -143542 -343473
18122 -343473 502176 151388 -73079 123462 94164 -55056 43819 -204669 12842 -131073
18111 -18203 -367220 -223047 -112829 -162785 239160 227737 63600 127056 -17695 -198528 184583
18099 -137986 185439 138873 18657 -14789 -66667 787 -78266 -119321 -114704 199738 -77797 -180153
18087 -180153 -70260 -146494 116956 -70372 68899 -63906 162514 -101414 125419 -7907 172223
$$ packed form
18166A36710a09865r8736o8793J23710B20140b9294C85575A92689f1393B35729
18155F879K24079a02116a7137j07234a8995p1880B14264a62069b0831p7452J4914
18144h3369A39144a61055j42166A95630i2652F7728g6738j78364b6803A20773
18133b507m07772J34622C4469J9884h4195A47342b1011A0274d55039a43542j99931
18122c43473E02176A51388g3079A23462k9298e5056D3819b04669A2842a31073
18111a8203l49017J44173J10218m9956B39160j1423F3600O3456a7695j80833A84583
18099a37986A85439m6566A8657a4789n1878G87g8266m1055M617A99738g7797j02356
18087a80153g0260p6234A16956g0372F8899f3906A62514a01414A25419g907A72223
$$ plain form
18075 67448 -109113 -186410 6384 -116050 215326 243270 -164094 30436 186522 7841 6045
18064 6045 57504 -243261 -130757 116662 205657 139029 -53907 -298762 -20832 -343864 -87448
18052 -68986 185303 -30115 140479 -205958 38673 -42773 167303 -129545 139123 -125791
18041 -96273 -315554 -412288 79499 -146508 534 221390 33084 -101436 -10195 -59321 270041
18029 322064 -64055 112635 42705 -303446 -187673 -93968 -115020 21459 27285 -140637 3340
18017 -196882 -324259 193066 271270 139928 124805 178784 -183098 27510 -181647 -128212
18007 -128212 -125062 226858 3501 -211417 231881 -157931 -58593 -49821 63282 -32307 -650331
17996 -650331 196323 -295109 -320045 -59284 207496 -49467 -130175 112023 173725 65281 -66622
$$ packed form
18075F7448a09113p7297F384a16050B15326K7944a64094C0436J56086G841j796
18064F045N1459b43261J12504A16662Q8995o6628e3907k44855b0832l23032h7448
18052f8986A85303c0115A40479b05958C8673d2773A67303a29545A39123a25791
18041i6273k19281r6734G9499a46508E34K20856C3084a01436a0195m9126B70041
18029C22064f4055A12635D2705c03446J15773R3705k1052B1459N826a40637C340
18017a96882j27377A93066P8204j31342j5123N3979a83098B7510a81647N3435
18007a28212L150B26858C501b11417B31881a57931e8593Q772F3282c2307o18024
17996f50331A96323b95109k4936e9284B07496d9467q0708A12023O1702F5281f6622
$$ plain form
17984 -214871 -13310 89404 203431 -229961 -50221 -145220 -286252 167812 245079 51891 -240006
17972 46915 -88357 93046 19307 167176 -93186 -196682 140702 -89257 -133767 247342 140304
17961 140304 294585 147684 -155236 100796 -51394 125993 -116174 84137 146920 -35674
17950 86988 53061 -7864 258645 -148097 178326 -15514 152421 -106976 -104711 36133 10111
17938 -135520 90721 -181506 -144942 282282 -107771 21119 40911 352409 -102632 -66245
17928 -66245 140547 -36163 -178152 -191566 -207795 275714 130282 -88725 337436 -68965 442629
17916 144341 -157937 123850 -193786 118977 57275 15846 2055 -62101 -242596 -188336 163662
17904 -143529 311297 -37198 -269579 -69431 -169626 30003 -44081 -201855 -40143 63715 50770
$$ packed form
17984b14871a3310H9404J14027b29961e0221r4999j41032A67812P7267E1891b40006
17972D6915h8357I3046A9307J47869i3186j03496A40702h9257m4510B47342j07038
17961A40304J54281j46901a55236A00796e1394A25993a16174H4137O2783c5674
17950H6988l3927g864B58645a48097A78326a5514A52421a06976K265C6133A0111
17938a35520I0721a81506L6564B82282a07771B1119J9792L11498a02632L6387
17928f6245A40547c6163j41989j3414j6229B75714A30282h8725C37436f8965D42629
17916A44341a57937A23850a93786A18977E7275A5846B055f2101j80495N4260A63662
17904a43529C11297c7198k32381f9431j00195C0003d4081j57774d0143F3715j2945
$$ plain form
17893 50770 -3762 -67091 -45913 -77155 -331701 58947 -227127 -214191 122725 64567 -300771
17881 -151711 -171678 191820 61436 -108413 -44169 -2628 54631 333663 96316 -145834 62409
17869 -103447 55060 -10585 -134769 26477 -121900 56788 46757 1747 -163703 -227267 -68996
17857 -252411 334444 -43183 206368 155107 -20535 -205645 -243220 9671 -37002 230438 213126
17846 213126 371983 105510 -82562 -48370 129443 160522 -5725 48044 -328564 -87936 70383
17834 113472 -146224 216392 41339 20758 7124 -164 185677 -19251 -34873 -368091 -76692
17822 -213792 -235540 -121093 409652 207441 -284303 -233039 -192282 261984 -164603 -141093
17812 -141093 219872 -20083 -93432 -51595 15419 139285 28684 291012 -186683 65939 261340
$$ packed form
17893E0770c762o3329K1178l1242k54546E8947b27127J2936A22725n8158c00771
17881a51711j9967A91820F1436a08413d4169b628E4631K79032I6316a45834F2409
17869a03447E5060a0585j24184B6477a21900E6788j0031A747a63703o3564f8996
17857b52411C34444d3183B06368n1261b0535j85110l7575I671c7002B30438j7312
17846B13126J58857A05510h2562L4192A29443L1079e725D8044c28564h7936G0383
17834A13472a46224B16392D1339k0581G124a64A85677a9251j5622l33218g6692
17822b13792k1748J14447D09652k02211b84303N1264M0757B61984a64603K3510
17812a41093B19872b0083p3349M1837A5419J23866B8684K62328a86683F5939J95401
$$ plain form
17801 261340 -130004 38657 82467 132263 -200754 68818 -93415 -112390 228239 112572 -29831
17789 20682 -387415 -372631 -204864 -285734 26657 132997 246092 317011 -57985 248887 -90594
17777 93213 -139229 -49144 -404956 68935 9249 219801 217271 52782 -81366 60133 -55054
17765 137436 -87407 -121547 -261863 116260 173462 37361 -34165 270777 -223553 149315
17754 -7475 -118211 25869 -111817 -9989 -51858 186347 157580 229405 -225720 -89415 99127
17742 -261581 -123190 -256342 -87417 -343814 163759 -93068 38159 -388629 28078 259829
17732 259829 -231869 -198682 -341475 -184650 213737 114025 40478 109308 -15905 123162
17721 -185523 156509 -147370 173453 -15093 -51317 169553 101495 -6165 -330724 160451
$$ packed form
17801B61340a30004C8657M3810M9796b00754F8818i3415j8975B28239A12572b9831
17789B0682c87415J4784J67767q0870B6657J06340J13095P0919e7985B48887i0594
17777I3213a39229d9144l55812F8935I249K10552k530E2782h1366F0133e5054
17765A37436h7407l4140j40316A16260N7202C7361c4165B70777b23553A49315
17754g475j10736B5869a11817i989m1869A86347k8767P1825b25720h9415I9127
17742b61581a23190j33152h7417k56397A63759i3068C8159c88629B8078K31751
17732B59829b31869L3187j42793J56825B13737r9712D0478O8830a5905A23162
17721a85523A56509a47370A73453a5093l6224A69553o8058f165l24559A60451
$$ plain form
17710 -20684 -495431 385316 -66286 159784 29201 -134128 -41416 -163291 67141 -202770
17699 -25852 204595 109851 -244129 71538 -42536 223365 -110329 240883 11338 -19347 85189
17687 132243 -25670 -202609 252422 75615 -94784 110514 176826 424007 98295 165046 200821
17676 200821 72502 -54413 100512 10041 132789 -45481 -247296 -367106 -378143 -129771
17665 51902 -220056 -27743 34411 -114792 141834 -59725 -48082 -145423 95905 -8671 11742
17653 211459 -88760 -22911 121154 -107648 12040 -189040 75770 254099 -469550 -190614
17642 24732 -35395 77609 145598 -111175 3899 115480 -73665 -14508 111784 -170099 -127504
17631 -127504 167049 543959 -172596 -254741 164235 100078 20839 -124867 -45878 -9932 248023
$$ packed form
17710b0684m74747C85316f6286A59784B9201a34128d1416j21875F7141b02770
17699b5852B04595r4744b44129G1538d2536B23365a10329B40883A1338a9347H5189
17687A32243b5670j76939B52422G5615i4784A10514O6312K47181I8295O6751L5775
17676B00821G2502e4413A00512A0041J22748d5481k01815j19810j1037a29771
17665E1902b20056b7743C4411a14792A41834e9725J1643r7341I5905h671A1742
17653B11459h8760b2911A21154a07648A2040a89040G5770J78329d69550a90614
17642B4732c5395G7609O7989a11175C899J11581g3665a4508A11784a70099M2595
17631a27504A67049L76910a72596q2145A64235o4157B0839a24867d5878i932B48023
$$ plain form
17619 129683 -83181 -151360 -145861 80887 -45309 98868 -108788 -185434 -162557 -15122 70790
17607 181112 -243561 328185 32578 40215 193827 53988 60518 -51660 45210 187883 106461
17596 106461 -20098 -10838 72883 -175164 14068 258855 -314589 -220 158089 -96920 45818
17584 351635 199536 46066 -129436 -287323 104713 -240327 -144428 -165031 -133536 140915
17573 126518 122985 96882 205755 194821 28442 64384 -128374 14148 -2893 249570 -142122
17561 71199 159971 -159087 -233645 -19818 119852 150143 -12345 14452 44639 327693 227974
17550 227974 73555 306112 -236200 -167927 195922 144193 -74756 194952 -374159 302528
17539 -278899 88839 93984 -50888 237426 -69180 -263318 512669 276239 -110971 -61954 136103
$$ packed form
17619A29683h3181o8179N499H0887d5309I8868a08788p6646K2877a5122G0790
17607A81112b43561C28185C2578P637J53612E3988O530e1660D5210J42673q1422
17596A06461b0098R260G2883a75164A4068K44787c14589b20A58089i6920D5818
17584C51635j52099D6066a29436j57887A04713b40327R5899k0603L1495A40915
17573A26518l533k6103J08873j0934B8442L5942a28374A4148b893B49570a42122
17561G1199Q8772a59087p4558a9818A19852L0291a2345A4452L0187K83054r9719
17550B27974G3555K32557b36200O8273A95922n1729g4756A94952c74159C02528
17539b78899H8839N145e0888B37426f9180j94138E12669k36430a10971M9017A36103
$$ plain form
17527 266728 -2816 20875 -10384 120365 -14451 -200844 -334464 56135 249079 367288 123560
17515 179677 122991 311395 -149392 -195596 122577 100961 61200 -66220 269998 297714 -285106
17503 -147455 173059 -209415 196498 -230157 -193217 -188126 147709 265607 260055 120667
17492 132997 -87798 60164 -3514 165246 72312 -115254 37291 -337134 21440 389092 38023
17480 -38845 182027 224102 247929 610975 347694 290986 -17394 -270745 176366 -49289 182657
17468 25977 233067 402626 384048 -250886 242259 256187 1614 324081 360316 285868 121776
17456 147705 59933 22126 -75904 -138593 198336 56873 211898 -17327 137441 78048 162730
17445 162730 307315 404384 312567 2341 205992 22381 293487 62736 114103 108081 319026
$$ packed form
17527B66728b816B0875a0384A20365a4451j86393j33620E6135J92944J18209A23560
17515A79677n6686J88404a49392m6204A22577k1616l9761f6220B69998K7716b85106
17503a47455A73059b09415A96498b30157L6940N091A47709J17898n552A20667
17492A32997h7798F0164c514A65246G2312a15254C7291c37134B1440L67652C8023
17480c8845A82027M2075K3827L63046k63281n6708a7394k53351A76366d9289A82657
17468B5977K07090J69559j8578b50886B42259J3928A614L22467L6235p4448A21776
17456A47705E9933B2126g5904o2689A98336E6873J55025a7327A37441n9393Q4682
17445A62730J44585R7069r1817B341K03651B2381K71106F2736N1367o022K10945
$$ plain form
17434 319026 422417 -10130 -15469 -16270 226975 207003 34982 166609 43412 -33346 147242
17422 319309 59881 35301 166850 52537 285197 441925 298862 625485 6314 195604
17412 195604 325402 -19351 215073 190934 298173 -127508 -178555 255129 333572 -90241
17401 -173861 326513 178665 549708 -145398 400154 223413 14100 -11097 92946 269096
17391 269096 486622 -47826 55844 174161 -34636 281276 174067 -70505 154248 295389
17381 295389 -19056 211296 -241252 83506 269634 43921 362226 -249716 -113457 80085
17370 107227 72383 185293 270396 -42212 284633 262252 214091 -33125 27582 75323 13549
17358 132321 102370 428571 -98649 212520 388344 130299 96673 -23582 -159280 -4815 27115
$$ packed form
17434C19026J03391a0130n339q01B26975j9972C4982J31627D3412c3346A47242
17422C19309E9881k4580J31549E2537K32660J56728j43063L26623F314J89290
17412A95604J29798a9351B15073k4139J07239a27508n1047B55129P8443i0241
17401a73861C26513j47848L71043a45398D00154j76741A4100a1097I2946J76150
17391B69096K17526d7826E5844J18317c4636B81276j07209g0505A54248J41141
17381B95389a9056B11296b41252H3506J86128D3921L18305b49716a13457H0085
17370A07227l4844J12910Q5103d2212B84633k2381m8161c3125B7582M7741A3549
17358A32321k9951L26201i8649B12520J75824A30299l3626b3582j35698d815B7115
$$ plain form
17346 115679 109948 306353 68332 33502 227629 -32990 182666 64737 131787 172658 -85813
17334 -139269 142408 -5549 101171 351386 321627 206852 -316673 -113270 13867 173076
17324 173076 263402 80362 331429 214896 -28710 18518 296745 -106899 346395 101436
17313 104014 -123377 -64399 80239 275788 91924 510377 -12526 -206231 281768 188576
17303 188576 287180 -79016 584233 284324 234172 130075 141854 253438 415225 -95873
17292 -33594 2840 24686 273337 267330 103562 160456 -73839 622345 307532 230953 199615
17281 199615 23823 106873 397798 117053 214780 237238 222921 70646 223770 -13944 157886
17269 443881 173831 438141 525863 168522 126563 -75108 121100 109031 155483 105796 25000
$$ packed form
17346A15679n731J96405F8332C3502J94127c2990A82666F4737O7050M0871h5813
17334a39269A42408e549A01171K50215k9759j14775c16673a13270A3867J59209
17324A73076R0326H0362K51067j16533b8710A8518K78227a06899C46395A01436
17313A04014a23377N8978H0239J95549I1924M18453a2526j93705B81768r3192
17303A88576R8604g9016E84233B84324n0152j04097J1779J11584J61787i5873
17292c3594B840K1846K48651o007A03562N6894g3839F22345C07532p6579l1338
17281A99615B3823Q3050K90925A17053R7727K2458j4317G0646J53124a3944A57886
17269D43881A73831K64310Q7722A68522m1959g5108A21100j2069M6452m9687B5000
$$ plain form
17257 154906 177246 -17167 236975 184325 52498 483784 211524 268799 162947 188456 28663
17245 312160 124044 348205 309142 -75645 227842 323873 38653 329491 294202 -95580 405265
17233 46565 -189377 11641 290146 131180 156013 78216 -135428 148367 124515 54961 402184
17222 402184 -83988 323173 497041 -200451 -6009 -163013 -10662 189013 81876 384012
17212 384012 221906 357359 213469 20471 244343 175617 167112 182545 463035 334843
17202 334843 345636 172400 -17107 -199217 375513 -154522 245219 210659 84524 263903
17192 263903 239499 99670 224795 166501 -3015 417761 141779 77459 427380 216490 -92835
17180 355815 207490 -8833 -72405 91006 209095 495771 325222 169680 576898 147567
$$ packed form
17257A54906K2340a7167B36975n2650E2498M31286B11524N7275j05852K5509B8663
17245C12160A24044K24161l9063g5645B27842R6031C8653K90838l5289i5580D05265
17233D6565a89377A1641K78505A31180K4833p7797a35428A48367k3852E4961L47223
17222D02184h3988C23173J73868b00451f009j57004a0662A89013H1876L02136
17212C84012j62106J35453j43890B0471K23872o8726q505J5433K80490j28192
17202C34843J0793A72400a7107j82110C75513a54522B45219l4560H4524J79379
17192B63903k4404I9670J25125n8294c015D17761A41779o4320L49921k10890i2835
17180C55815j48325h833o3572I1006J18089K86676j70549j55542M07218A47567
$$ plain form
17169 605707 445270 308393 375243 241258 376765 280168 682902 288563 247142 -41138
17158 502028 344445 53896 291545 541037 116510 88037 184430 537976 358756 302929
17148 302929 312889 93066 658080 229615 273966 330463 498097 231184 191867 820553 370583
17136 285529 264995 43546 141576 513900 554017 385274 397925 745692 600080 598009 314206
17125 314206 376027 409016 333725 433683 304774 488065 166034 346476 126438 344592
17115 344592 190610 448936 357261 530690 52915 93560 676460 561991 344648 422417
17105 422417 359599 312121 272999 501727 402946 500213 379269 440187 302819 368192 568422
17094 568422 595501 7570 429564 271291 551707 530011 240808 357593 734636 360716
$$ packed form
17169F05707j60437j36877O6850j33985J35507r6597M02734B88563m1421d1138
17158E02028j57583E3896K37649K49492A16510k8473R6393L53546j79220n5827
17148C02929R960I3066N65014B29615M4351N6497J67634B31184l9317O28686C70583
17136B85529k0534D3546R8030L72324M0117j68743J2651L47767j45612k071k83803
17125C14206O1821L2989p5291R9958j28909J83291A66034J80442A26438K18154
17115C44592j53982K58326r1675J73429E2915M0645N82900j14469k17343P7769
17105D22417o2818m7478l9122K28728r8781R7267j20944O0918j37368O5373K00230
17094E68422K7079G570M21994j58273K80416k1696B40808J16785L77043C60716
$$ plain form
17083 233885 745839 424862 500379 582812 498487 500926 638253 91743 270222 787077 626322
17072 626322 340768 126444 311382 443465 327289 582242 550578 300653 520398 359947
17062 359947 474762 408401 543621 708805 171345 273784 273076 574805 731873 455615
17052 455615 607351 435262 887087 474714 501170 576727 582493 747983 380290 709109
17042 709109 638067 693153 691208 582762 325991 486257 700847 793022 301403 459008
17032 459008 424673 582914 954233 741151 457598 579945 744358 202251 535101 691974
17022 691974 721687 889180 836974 426063 558483 528037 637213 387262 782272 712170
17012 712170 179553 869447 778095 567177 388869 437071 676100 892742 840689 641634
$$ packed form
17083B33885N11954l20977P5517Q2433q4325K439J37327I1743J78479N16855j60755
17072F26322k85554A26444J84938J32083j16176K54953l1664k49925K19745j60451
17062C59947J14815o6361J35220J65184A71345J02439p08L01729J57068k76258
17052D55615J51736j72089M51825m12373K6456P5557N766J65490l67693L28819
17042G09109p1042N5086j945j08446k56771J60266K14590R2175C01403J57605
17032D59008l4335J58241L71319k13082k83553J22347J64413B02251L32850J56873
17022F91974K9713J67493n2206m10911J32420l0446J09176k49951L95010p0102
17012G12170A79553O89894r1352k10918j78308M8202K39029K16642n2053j99055
$$ plain form
17002 641634 643436 695005 495485 893371 683372 860266 753325 872840 532440 781044
16992 781044 709769 994420 787452 743891 1117853 1066375 904685 914509 460399 953462
16982 953462 686369 578477 792094 710658 886855 585639 895102 739120 802784 1092444
16972 1092444 1110337 557829 696318 928818 918058 1002999 950148 997973 839895 839155 1125459
16961 1125459 494905 741535 961035 1141074 822896 1105861 845714 1244960 1202378 1306714
16951 1306714 1159664 1519873 914702 819036 1331148 948991 830769 986746 1411267 1238770
16941 1238770 1432370 1237650 1161586 1162090 1292566 1172820 1119065 1604388 1282471 1582592
16931 1582592 1363067 1353654 1145524 1584688 1212516 1305786 1238209 1324320 1295953 1559319
$$ packed form
17002F41634J802N1569j99520L97886k09999J76894j06941J19515l40400K48604
16992G81044p1275K84651k06968m3561L73962n1478j61690R824m54110M93063
16982I53462k67093j07892K13617q1436J76197l01216L09463j55982O3664K89660
16972A092444J7893n52508J38489K32500j0760Q4941n2851M7825j58078p40K86304
16961A125459D94905K46630K19500J80039l18178K82965k60147L99246m2582J04336
16951A306714j47050L60209o05171r5666N12112l82157j18222J55977M24521j72497
16941A238770J93600j94720p6064N04J30476j19746n3755M85323l21917L00121
16931A582592k19525r413k08130M39164l72172R3270o7577Q6111k8367K63366
$$ plain form
16921 1559319 1405912 1363134 1341713 1305344 1372150 1516506 1665826 1450059 1457020 1595453
16911 1595453 1561520 1240525 1829819 1608251 1706547 1692100 1678618 1782564 1686511 1728653
16901 1728653 1733239 1563153 1909970 1381114 1852681 1765482 1982399 1921353 1794874 2055126
16891 2055126 2080113 1741484 2328552 2187044 2134171 2199282 2350127 1995425 2229309 2111546
16881 2111546 2123061 2491076 2196098 2375718 2262719 2637062 2486446 2342772 2374524 2427677
16871 2427677 2522408 2567877 2671433 2736395 2611547 2800657 2789547 2708775 2649111 2974822
16861 2974822 2834032 3062767 2939070 2876697 2840935 3162973 3171562 3634091 3506414 3448154
16851 3448154 3578953 3507482 3133346 3553170 3583237 3403905 3770396 3497403 3692894 3998388
$$ packed form
16921A559319j53407m2778k1421l6369O6806J44356J49320k15767O961J38433
16911A595453l3933l20995N89294k21568R8296j4447j3482J03946r6053M2142
16901A728653M586j70086L46817n28856M71567q7199K16917o1046j26479K60252
16891B055126K4987l38629N87068j41508n2873O5111J50845l54702K33884j17763
16881B111546J1515L68015k94978J79620j12999L74343j50616j43674L1752N3153
16871B427677R4731M5469J03556O4962j24848J89110j1110q0772n9664L25711
16861B974822j40790K28735j23697o2373l5762L22038Q589M62529j27677n8260
16851C448154J30799p1471l74136M19824L0067j79332L66491k72993J95491L05494
$$ plain form
16841 3998388 3771294 3944461 3968430 4103822 4173168 4111214 4498722 4577172 4425417 4565908
16831 4565908 4505704 4834838 4681036 4564943 4950089 4783043 5309492 5331110 5175195 5358386
16821 5358386 5629664 5506504 5595068 5745698 6184625 5963850 6048465 6324309 6237280 6293959
16811 6293959 6375549 6786830 6852172 6819225 7342980 7288898 7499868 7661426 7673891 8143230
16801 8143230 8016023 8364207 8526679 8549215 9092997 8947562 9351157 9721471 10105602 10105226
16791 10105226 10286086 10363977 10669803 11203883 11517157 11767166 12129378 12464533 13585708
16782 13585708 13046288 13599552 14129172 14510466 14984115 15568806 15711749 16659114 16875072
16773 16875072 17359184 17660241 18432267 19069232 19756478 20690191 20954958 22067676 22750338
$$ packed form
16841C998388k27094J73167K3969J35392O9346o1954L87508P8450j51755J40491
16831D565908o0204L29134j53802j16093L85146j67046N26449K1618j55915J83191
16821E358386K71278j23160Q8564J50630M38927k20775Q4615K75844q7029N6679
16811F293959Q1590M11281O5342l2947N23755n4082K10970J61558J2465M69339
16801H143230j27207L48184J62472K2536N43782j45435M03595L70314L84131l76
16791A0105226J80860P7891L05826N34080L13274K50009L62212L35155J121175
16782A3585708n39420N53264N29620L81294M73649N84691J42943R47365K15958
16773A6875072M84112L01057P72026O36965O87246R33713K64767J112718O82662
$$ plain form
16764 22750338 23736101 24259006 25410811 26275683 27358617 28364603 29677306 30793222
16756 30793222 32081867 33740986 34831367 36588924 38364936 40171803 41731913 43779823
16748 43779823 45730889 48102860 50414001 52778807 55597558 58384018 61286697 64639798
16740 64639798 68160193 71564258 75625536 79538673 83995610 88699172 93750805 98658239
16732 98658239 104066445 109266547 115120128 120988430 126805324 133013897 138650448 144051859
16724 144051859 149512534 154386703 158773392 162792848 166079277 168244421 170014397 170452095
16716 170452095 170038876 168302841 166179172 163230166 159453662 154771361 150155422 144480769
16708 144480769 138705361 132867715 127019646 121039810 115346697 109501952 103805562 98168469
$$ packed form
16764B2750338R85763N22905J151805Q64872J082934J005986J312703J115916
16756C0793222J288645J659119J090381J757557J776012J806867J560110K047910
16748D3779823J951066K371971K311141K364806K818751K786460K902679L353101
16740F4639798L520395L404065M061278L913137M456937M703562N051633M907434
16732I8658239N408206N200102N853581N868302N816894O208573N636551N401411
16724A44051859N460675M874169M386689M019456L286429K165144J769976M37698
16716A70452095m13219j736035k123669k949006l776504m682301m615939n674653
16708A44480769n775408n837646n848069n979836n693113n844745n696390n637093
$$ plain form
16700 98168469 93332953 88320070 83814861 79489769 75161314 71263905 67345902 63788664
16692 63788664 60939585 57932244 55029325 52187234 49555307 47303340 45127713 42709296
16684 42709296 40846264 39179830 37094510 35625397 34171977 32657850 31048485 29647406
16676 29647406 28551340 27413705 26531728 25427333 24612105 23895180 22406312 21641213 20859786
16667 20859786 19989914 19436571 18860244 18310017 17675094 17107541 16459569 15987026 15550702
16658 15550702 14782753 14283127 14113253 13950605 13455682 12513771 12440678 12519602 11918102 11460712
16648 11460712 11168615 10929300 10449918 10380949 10105784 9531536 9646886 9144744 8957936
16639 8957936 8869325 8652927 8511948 8136940 8045537 7993416 7662689 7389239 7030000 7300538
$$ packed form
16700I8168469m835516n012883m505209m325092m328455l897409l918003l557238
16692F3788664k849079l007341k902919k842091k631927k251967k175627k418417
16684D2709296j863032j666434k085320j469113j453420j514127j609365j401079
16676B9647406j096066j137635q81977j104395q15228p16925j488868p65099p81427
16667B0859786q69872n53343n76327n50227o34923n67553o47972m72543m36324
16658A5550702p67949m99626j69874j62648m94923r41911p3093P8924o01500m57390
16648A1460712k92097k39315m79382o8969k75165n74248J15350n02142j86808
16639H957936q8611k16398j40979l75008r1403n2121l30727k73450l59239K70538
$$ plain form
16629 7300538 6762031 6565680 6739308 6289338 6404271 6073540 6102175 5870183 5630640 5773382
16619 5773382 5435449 5546327 5096542 5154185 5370020 4983758 4818766 4897694 4764696 4719777
16609 4719777 4768351 4709156 4627752 4257979 4395623 4389951 3636238 4313986 4009949 3835627
16599 3835627 3999949 3954048 3659250 3949322 3822372 3212242 3560447 3500654 3151825 2953944
16589 2953944 3554039 3167763 3163247 3163401 3004869 2708408 2722595 3133522 2880695 2832043 2669421
16578 2669421 2752479 2530422 2957970 2764449 2544616 2341172 2624421 2457847 2499562 2157408
16568 2157408 2648731 2235491 2500764 1943740 1750924 2164242 2415166 1918977 2185925
16559 2185925 2037238 2168461 1908494 2131780 1890022 1973126 1858572 1768573 2223559 1916396
$$ packed form
16629G300538n38507j96351J73628m49970J14933l30731K8635k31992k39543J42742
16619E773382l37933J10878m49785N7643K15835l86262j64992P8928j32998m4919
16609D719777M8574n9195q1404l69773J37644n672p53713O77748l04037j74322
16599C835627J64322m5901k94798K90072j26950o10130L48205n9793l48829j97881
16589B953944O00095l86276m516J54j58532k96461J4187M10927k52827m8652j62622
16578B669421Q3058k22057M27548j93521k19833k03444K83249j66574M1715l42154
16568B157408M91323m13240K65273n57024j92816M13318K50924m96189K66948
16559B185925j48687J31223k59967K23286k41758Q3104j14554q9999M54986l07163
$$ plain form
16549 1916396 1834930 1789073 1848928 1743889 1600674 1829734 1822057 1693958 1944937 1669004
16539 1669004 1644848 1804283 1369488 1749698 1385032 1410285 1278893 1324393 1213876 1305402
16529 1305402 1121419 1530107 1278012 1530221 1454508 1154560 1222682 1142416 1758217 1417510
16519 1417510 1271388 1139417 1467218 1144401 1290890 1324543 1371149 1362698 1429711 940633
16509 940633 1177946 1374860 999910 1015499 1057453 1121334 1041383 933021 912835 1086032
16499 1086032 1107387 1026190 1024538 725877 1114376 1395651 619678 1065576 920300 657658
16489 657658 1179428 960254 1039378 1044357 956288 629763 722778 851222 1196936 580457
16478 833082 694140 873295 852160 863146 873603 809537 958069 930755 712859 591158
$$ packed form
16549A916396q1466m5857N9855j05039j43215K29060p677j28099K50979k75933
16539A669004k4156J59435m34795L80210l64666K5253j31392M5500j10517R1526
16529A305402j83983M08688k52095K52209p5713k99948O8122q0266O15801l40707
16519A417510j46122j31971L27801l22817J46489L3653M6606q451O7013m89078
16509I40633K37313J96914l74950J5589M1954O3881p9951j08362k0186J73197
16499A086032K1355q1197j652k98661L88499K81275F19678M45898j45276k62642
16489F57658N21770k19174P9124M979q8069l26525R3015J28444L45714E80457
16478H33082j38942J79155k1135J0986J0457o4066J48532k7314k17896j21701
$$ plain form
16468 591158 705339 914670 695398 802273 868640 813523 534874 747498 765310 830660
16458 830660 773584 632544 812535 814666 899414 696362 729592 174992 529106 622861 585612
16447 585612 689194 356458 649316 570219 681057 656807 400676 604511 646182 488726
16437 488726 849239 660768 677930 514801 442547 461462 506771 396761 510647 743442
16427 743442 932067 487879 298520 336219 439828 378349 674710 773883 450555 424425
16417 424425 817635 939940 529308 487465 636730 758411 324433 139157 400181 439512
16407 439512 678516 270683 636013 768252 342182 453963 442032 610902 653855 912686
16397 912686 443449 396131 -42650 551046 627687 586444 560197 706413 512716 258405
$$ packed form
16468E91158J14181K09331k19272J06875O6367n5117k78649K12624J7812O5350
16458H30660n7076j41040J79991K131Q4748k03052L3230A74992L54114R3755l7249
16447E85612J03582l32736K92858p9097J10838k4250k56131K03835M1671j57456
16437D88726L60513j88471J7162j63129p2254J8915M5309j10010J13886K32795
16427G43442J88625m44188j89359L7699J03609o1479K96361R9173l23328k6130
16417D24425L93210J22305m10632m1843J49265J21681C24433A39157K61024L9331
16407D39512K39004B70683L65330J32239C42182J11781j1931J68870M2953K58831
16397I12686D43449m7318d2650E51046P6641m1243k6247J46216j93697k54311
$$ plain form
16387 258405 367801 324114 345507 172627 278942 188566 432835 529419 376118 296888
16377 296888 236660 319162 27169 403796 314798 496066 200660 654936 184167 459455
16367 459455 195222 477817 233030 275541 359886 204176 432098 734594 524955 37892
16356 74144 159323 323936 525895 259412 133187 315536 360646 235929 485830 387510
16346 387510 140135 290361 -55872 408240 -243661 426719 174547 294404 341415 524679
16336 524679 659884 331932 267412 483829 101148 438737 -100382 212031 255607 312607
16326 312607 352737 119672 471243 246445 162261 110754 244538 120004 34736 119690
16316 119690 412646 50361 113500 443446 181000 186984 338559 279660 216119 -8879 157502
$$ packed form
16387B58405J09396m3687K1393A72627J06315r0376K44269R6584j53301p9230
16377B96888o0228Q2502B7169L76627q8998J81268B00660M54276A84167K75288
16367D59455A95222K82595B33030M2511Q4345j55710K27922L02496k09639C7892
16356G4144Q5179J64613K01959B59412j26225J82349M5110j24717K49901r8320
16346C87510A40135J50226e5872D08240b43661D26719A74547J19857M7011J83264
16336E24679J35205l27952o4520K16417A01148L37589a00382B12031M3576N7000
16326C12607M0130A19672L51571k24798q4184n1507J33784A20004C4736Q4954
16316A19690K92956E0361O3139L29946A81000N984J51575n8899o3541h879A57502
$$ plain form
16304 174062 44537 460749 237359 185540 243520 80142 164325 168061 -17343 43903 244449
16293 244449 343636 616124 168008 268505 182078 123018 318043 104008 475795 107556
16282 405106 -421622 233837 171172 200263 -265729 234084 260502 225956 113031 133181
16272 133181 396791 195446 293334 170579 245778 306166 301019 -260443 -175357 78745 172852
16261 172852 358572 248576 11973 -26431 402492 -7780 65114 91274 -168600 121797 335947
16250 335947 -29941 232998 59856 180571 13567 247753 72961 25197 47710 288650 59388
16238 165834 11408 117822 480535 394892 271709 166046 252657 436710 49309 42204 260420
16227 260420 281999 218799 10442 226914 90787 393285 -6849 -63531 -4220 242831 114986
$$ packed form
16304A74062D4537M16212k23390n1819N7980H0142Q4183L736a7343D3903K00546
16293B44449R9187K72488A68008J00497q6427n9060J95025A04008L71787A07556
16282D05106d21622B33837o2665K9091b65729B34084K6418l4546j12925K0150
16272A33181K63610A95446R7888j22755P5199O0388n147b60443Q5086G8745R4107
16261A72852J85720j09996A1973b6431D02492g780F5114K6160a68600A21797K14150
16250C35947b9941B32998E9856J20715A3567K34186G2961B5197K2513K40940E9388
16238A65834A1408J06414L62713q5643j23183j05663Q6611J84053D9309p105K18216
16227B60420K1579o3200A0442K16472I0787L02498f849n6682d220B42831A14986
$$ plain form
16215 225292 269640 186572 -10632 -54879 56795 60495 -207578 264184 -81059 -26955 422967
16203 -50743 -78575 291788 -1545 -184354 -204588 -232911 -1192 -41775 136790 101142 260518
16192 260518 -117728 328537 -109827 129160 312754 7939 307544 245213 -193702 211511
16181 227555 16285 -242027 -128978 199332 203604 -96033 169555 166679 422380 -148999 66191
16169 9505 113215 201032 -12060 -164842 6046 531003 -311860 63803 213976 -26826 -17449
16158 -17449 173700 135550 464077 -8783 201583 -129179 335394 29699 -77358 178533 -10530
16146 -72956 -227099 -4988 131298 350130 142248 129995 188565 169402 -203068 44780 317859
16135 317859 -55416 188419 351364 -156428 200299 -188484 -81433 1013 66507 -150408
$$ packed form
16215B25292M4348q3068a0632m4247E6795L700b07578B64184h1059b6955D22967
16203e0743k7832B91788a545j82809k0234k8323a192m0583A36790l5648J59376
16192B60518a17728C28537a09827A29160J83594G939K99605o2331a93702B11511
16181B27555A6285b42027J13049A99332M272i6033A69555k876K55701a48999F6191
16169I505J03710Q7817a2060j52782F046N24957c11860F3803J50173b6826R377
16158a7449A73700l8150L28527h783B01583a29179C35394B9699g7358A78533a0530
16146g2956j54143d988A31298K18832A42248j2253N8570j9163b03068D4780K73079
16135C17859e5416A88419J62945a56428B00299a88484h1433A013O5494a50408
$$ plain form
16124 -102946 -219454 -192454 98176 53109 193173 -23894 194144 85660 -209692 12208 -84568
16112 48255 231087 62879 -71307 -124796 -63062 -50799 80040 301976 348610 284657 -220558
16100 683322 -138808 310965 168789 280944 131226 -48249 -67002 58567 285338 39137
16089 -135050 -71387 5491 -88039 -140939 272154 54297 -122343 436232 23437 4189 -76659
16077 270591 114015 -26819 -47688 41221 -419291 160263 -222870 -171419 245024 223145
16067 223145 131204 124668 -213825 156556 -289734 34371 7904 161350 36344 -235605 -133459
16056 -133459 -175221 13303 153641 -15141 -48140 26356 13970 -186792 -111520 32459 -230577
16044 77181 -135308 242118 -15187 -147910 -66745 209939 54562 15225 -117607 -489825
$$ packed form
16124a02946j16508K7000I8176m5067J40064b3894A94144H5660b09692A2208h4568
16112D8255J82832F2879g1307n3489O1734J2263H0040K21936M6634o3953b20558
16100F83322a38808C10965j42176J12155A31226d8249j8753E8567K26771C9137
16089a35050O3663E491h8039n2900B72154E4297a22343D36232B3437D189g6659
16077B70591A14015b6819k0869D1221d19291A60263b22870N1451B45024k1879
16067B23145r1941o536b13825A56556b89734C4371G904J53446C6344b35605J02146
16056a33459m1762A3303J40338a5141l2999B6356j2386a86792P5272C2459b30577
16044G7181a35308B42118a5187j32723f6745B09939E4562A5225a17607l72218
$$ plain form
16034 -489825 -211261 -114164 103369 -108465 271922 -8733 -71343 -124399 139350 92920 -206161
16022 -32076 214037 -69113 106979 4360 104816 -56046 11062 91503 -48529 286443 -295359
16010 -44474 103670 -187838 158825 -155290 -109481 260505 142257 -213764 -15018 -299890
16000 -299890 -170287 9447 139848 100151 176354 80402 192482 -121860 -66607 -22939 58545
15988 -159119 -49311 -35519 150770 153818 -106987 267049 125862 246078 -22869 118439
15977 539726 -73012 -108459 -31956 -475833 46413 -154175 -196128 133788 9100 217516 -206791
15965 -305993 -128196 17625 -248363 -307761 182936 -17259 298118 125843 49745 29270
15955 29270 117787 -23835 -386518 -21617 -79049 -290327 12996 -262996 99048 54569 -54366
$$ packed form
16034d89825b11261R7097A03369a08465B71922h733o2610n3056A39350m6430b06161
16022c2076B14037f9113A06979D360J00456e6046A1062Q0441d8529B86443b95359
16010d4474A03670a87838A58825a55290M5809B60505j18248b13764a5018k84872
16000b99890J29603I447J30401l9697P6203H0402J12080a21860N5253b2939E8545
15988a59119d9311J3792A50770L048a06987B67049A25862J20216b2869A18439
15977E39726g3012l5447c1956m43877D6413a54175m1953A33788I100K08416b06791
15965c05993a28196A7625b48363n9398A82936a7259B98118A25843D9745k0475
15955B9270Q8517b3835l62683b1617n7432k11278A2996b62996I9048m4479e4366
$$ plain form
15943 -103726 152252 123846 -186807 294466 191828 -6166 254983 269725 115499 -105903
15932 131715 102042 -234826 25178 78546 9859 -156810 200059 11294 -38347 -323313 -206387
15921 -206387 51843 -5365 -80915 -57333 -132976 94324 226550 53206 14685 -120148 151738
15909 -139743 115900 -257735 135624 280108 -294095 -80810 50035 -153274 -14597 220069
15898 -205405 164412 -380680 219481 51568 -461686 198285 -89147 -159554 -394941 17148
15887 -334934 -120760 113370 227161 19810 131916 -316898 -79696 -246402 -150737 -251930
15877 -251930 -70224 -136970 15000 -67644 334800 24649 131808 -3800 154319 208385 -106719
15865 -170164 -166774 200350 142312 15041 59944 14260 210452 2242 -72747 400630 16149
$$ packed form
15943a03726A52252k8406a86807B94466j02638f166B54983J4742A15499a05903
15932A31715k9673b34826B5178N3368I859a56810B00059A1294c8347k84966J16926
15921b06387E1843e365p5550K3582p5643I4324J32226E3206A4685a20148A51738
15909a39743A15900b57735A35624J44484b94095h0810E0035a53274a4597B20069
15898b05405A64412c80680B19481E1568d61686A98285h9147p0407k35387A7148
15887c34934a20760A13370J13791A9810J12106c16898g9696j66706R5665j01193
15877b51930g0224o6746A5000f7644C34800B4649J07159c800A54319N4066a06719
15865a70164L390B00350n8038A5041M4903A4260J96192B242g2747D00630A6149
$$ plain form
15853 71114 -123990 -43625 49087 271014 60939 -121119 -279703 241884 -41310 -306417
15843 -306417 -170439 201732 143814 -64240 131385 -93095 -191060 128197 -86152 79063 -149743
15831 134663 -263858 -189957 183525 279455 -377827 -99358 -136805 -237402 331083 160725
15820 -197171 226462 -233961 -25313 204781 70094 225434 306149 29131 19283 -255580 160072
15808 -130172 75028 -111087 -144544 106622 288881 139935 -210065 -169077 38173 -6012 11802
15796 -358528 18302 -26817 190535 -110519 207926 15184 216003 -9105 107088 419182
15786 419182 127960 -217291 191215 119112 395342 50948 -304209 210525 266520 -88480
15775 -147717 -232056 -105262 -340118 119731 -378066 163419 -33952 -174879 -127281 111780
$$ packed form
15853G1114a23990d3625D9087K21927F0939a21119j58584B41884d1310k65107
15843c06417J35978B01732n7918f4240A31385i3095r7965A28197h6152G9063a49743
15831A34663b63858P3901A83525R5930c77827i9358l7447j00597C31083A60725
15820a97171B26462b33961b5313B04781G0094J55340Q0715B9131r848b55580A60072
15808a30172G5028a11087l3457A06622J82259A39935b10065M0988C8173f012A1802
15796c58528A8302b6817A90535a10519B07926A5184K00819i105A07088L12094
15786D19182A27960b17291A91215p2103K76230E0948c04209B10525N5995h8480
15775a47717q4339a05262k34856A19731c78066A63419c3952j40927M7598A11780
$$ plain form
15764 236468 67530 85208 -36411 58372 3738 -157755 -40211 333309 181876 207361 40964
15752 4636 -89939 -181378 64515 76836 57936 -126527 68139 -126553 212626 -144671 -66540
15740 -16221 -205947 295444 67992 -54530 16966 -22962 141974 197570 -13658 -144979 -188533
15729 -188533 -259123 -166973 -139075 -144739 -49533 19746 -352613 42987 185769 -47126 -223045
15718 -223045 -114917 111754 -25465 62264 -93176 161977 -147974 -219793 105837 101112 160537
15707 160537 -6929 -53110 79470 -190280 -106525 253370 58428 60464 -14052 -230009 35696
15695 132448 -86850 -269555 206288 -323221 181257 -158701 505541 -72972 2521 260102
15685 260102 91928 94379 106107 17899 -453392 -9743 -1489 -147272 359283 -122124 -52308
$$ packed form
15764B36468F7530J7678c6411E8372C738a57755d0211C33309j51433K5485D0964
15752D636h9939r1439F4515J2321j8900a26527F8139a26553B12626a44671f6540
15740a6221j89726B95444F7992e4530A6966b2962A41974N5596a3658j31321m3554
15729a88533p0590R2150K7898n664d9533A9746c52613D2987J42782d7126j75919
15718b23045J08128A11754b5465F2264i3176A61977a47974p1819A05837m725N9425
15707A60537f929m6181G9470a90280Q3755B53370E8428K036a4052k15957C5696
15695A32448h6850j82705B06288c23221A81257a58701E05541g2972B521K57581
15685B60102I1928K451J1728A7899d53392i743a489j45783C59283a22124e2308
$$ plain form
15673 -70640 181152 -171636 135555 -69580 -136621 88007 108764 -134624 65686 -128614 43166
15661 -70508 148130 -50343 11132 -243043 -126362 -9043 -159257 -134393 24304 -160399 108792
15649 87499 -120666 42553 -70959 -35927 -23786 26831 -75190 233308 -126878 190224 26892
15637 -88528 -87039 -22638 -109156 -118021 -336706 -68309 -38898 92805 -32148 -309293 -37123 -263152
15625 -263152 -81007 -19499 36284 -45906 363180 89160 307709 69512 -6243 -44362 -39393
15614 -39393 -120638 -63559 209064 -285229 -5639 -89833 -167098 -65525 -213548 -24202 -213682
15603 -213682 183000 -80250 225393 58503 -170679 -223992 39705 274461 -414368 -246297
15593 -246297 -125232 15479 -164495 -369243 -82985 241026 3949 104033 -117669 49903
$$ packed form
15673g0640A81152a71636A35555f9580o7041H8007K0757a34624F5686a28614D3166
15661g0508A48130e0343A1132b43043J16681i043j50214K4864B4304a60399A08792
15649H7499a20666D2553g0959L5032J2141B6831g5190B33308a26878A90224B6892
15637h8528J489b2638q6518q865k18685f8309K9411I2805c2148k77145c7123k26029
15625b63152h1007a9499C6284d5906C63180H9160K18549F9512f243l8119M969
15614c9393q1245N7079B09064b85229e639q4194p7265f5525j48023b4202j89480
15603b13682A83000h0250B25393E8503a70679n3313C9705K34756d14368J68071
15593b46297J21065A5479a64495k04748h2985B41026C949J00084a17669D9903
$$ plain form
15582 -52440 48880 108212 -54938 5346 -112809 97580 124117 -43860 75088 -143497 -374595
15571 -374595 -126832 182589 -145896 226181 -270579 -36650 -160359 -218886 -11743 -79247
15561 -79247 1438 142625 161443 33526 167941 -13714 -116521 291505 -107022 -239059 -53142
15549 -80821 -151572 99073 -69017 -50818 -149954 -58180 -224905 178814 139106 343977 326534
15538 326534 142238 -393907 176806 13925 -22597 61563 -131907 14016 126530 -13117
15527 -96406 -90586 218947 124219 -201823 -273247 -5565 70718 122050 312699 138210 16240
15515 -22532 -306491 29384 -183581 89209 -223444 77723 -184448 108662 -77473 65818 -210508
15503 96297 -410785 -111894 -11192 -101415 -319574 -92790 310847 368552 -190317 -379796
$$ packed form
15582e2440D8880N9332e4938E346a12809I7580K6537d3860G5088a43497k31098
15571c74595a26832A82589a45896B26181b70579c6650j23709n8527a1743o7504
15561g9247A438J41187J8818C3526J34415a3714j02807B91505a07022j32037e3142
15549h0821p0751I9073f9017J8199r9136e8180j66725A78814l9708K04871j7443
15538C26534A42238c93907A76806A3925b2597F1563a31907A4016J12514a3117
15527i6406N820B18947r4728b01823p1424e565G0718N1332J90649A38210A6240
15515b2532k83959B9384a83581H9209b23444G7723a84448A08662g7473F5818b10508
15503I6297d10785a11894a1192r0223k18159i2790C10847N7705a90317j89479
$$ plain form
15493 -379796 -168420 -147577 -75742 95110 -167696 -245292 -46788 39778 -211521 -28347 -494336
15482 -494336 93125 50412 -21540 153278 -118616 -135679 165046 -108430 39067 14657 -233009
15470 216957 -91948 -204584 131478 -162101 -130033 109334 297162 68754 135992 772 112107
15459 112107 -96023 -69799 312841 366506 98849 240932 5568 -18930 34357 22163 -77439
15447 -83477 -179559 -32679 63088 -48154 -3518 -284370 512 168207 -283698 -59444 -10485 -66933
15435 -66933 10704 -97920 313417 -95945 426939 -94335 -111097 -133248 -175574 -33045 158767
15423 -247561 -143046 75007 -105092 -23985 137400 78616 -114065 12159 -105345 49047
15412 19439 49911 24934 51274 -166209 -218405 143035 -34884 62707 11775 -179479 96285
$$ packed form
15493c79796a68420K0843P1835I5110a67696p7596d6788C9778b11521b8347m65989
15482d94336I3125m2713b1540A53278a18616j7063A65046a08430C9067A4657b33009
15470B16957i1948j12636A31478a62101L2068A09334J87828F8754O7238G72J11335
15459A12107i6023K6224C12841N3665I8849J42083E568a8930C4357j2194g7439
15447h3477r6082c2679F3088d8154c518k80852E12J67695b83698e9444a0485n6448
15435f6933A0704i7920C13417i5945D26939i4335j6762k2151m2326c3045A58767
15423b47561J04515G5007a05092b3985A37400n8784a14065A2159a05345D9047
15412A9439L0472B4934K6340a66209n2196A43035c4884F2707A1775a79479I6285
$$ plain form
15400 134416 -163995 237976 8007 132929 90545 -10945 -132536 -164382 252826 124648
15389 204909 175902 210317 37821 133138 -181151 -83098 -329749 210279 -63751 -527291 -342341
15378 -342341 117364 177128 -81923 87417 -268415 -377345 281758 333381 -77374 -283745
15368 -283745 83068 -190650 174509 -97692 -212398 376965 274011 -110231 -20748 -224886
15358 -224886 -156827 -52875 -325360 54001 -69886 125259 237653 66682 -61821 52830 -247013
15346 -87696 34628 10965 -11661 54856 193071 48923 9296 -194831 144049 -289984 144652
15334 71010 -324244 156993 59050 231678 -124106 -134243 24802 156129 -137822 -240930
15324 -240930 61937 -71403 368983 23404 71899 -21861 52372 153436 208321 138825 -185058
$$ packed form
15400A34416a63995B37976H007J24922m2384a0945j21591l1846B52826A24648
15389B04909k9007L4415C7821R5317a81151h3098k46651B10279f3751m63540J84950
15378c42341A17364N9764h1923H7417b68415j08930B81758N1623g7374k06371
15368b83745H3068a90650A74509i7692j14706C76965j02954a10231b0748k04138
15358b24886O8059e2875k72485E4001f9886A25259J12394F6682f1821E2830b47013
15346h7696C4628A0965a1661E4856J38215D8923I296a94831A44049b89984A44652
15334G1010c24244A56993E9050J72628a24106j0137B4802J31327a37822j03108
15324b40930F1937g1403C68983B3404M8495b1861E2372J01064N4885o9496a85058
$$ plain form
15312 -28907 -243888 -170550 -124158 -255499 198723 -208558 46253 28821 24 51721 -47873
15300 56402 328684 105717 -449073 39134 50728 -76405 116270 212924 -96209 13909 101403
15289 101403 276885 274071 -197084 -132119 245693 33601 -144262 -46970 -173244 107640
15278 116589 112318 -34923 -255385 78859 -162410 -64782 -330811 106219 12300 296374 -128718
15266 -146241 -30382 9719 171471 130033 179810 -281739 129598 57067 -259735 19290 48750
15255 48750 -66495 123535 222121 167673 156419 232320 194032 580547 824306 1729312 1788944
15244 1788944 1567992 1939079 1236663 613790 180738 -10937 86585 23020 29660 -37544
15233 15334 -95480 -78046 188239 230101 -132199 -129223 270392 9834 38597 45217 -139435
$$ packed form
15312b8907k14981P3338M6392j31341A98723b08558D6253j7432B4N1697d7873
15300E6402K72282A05717d49073C9134J1594g6405A16270R6654i6209A3909Q7494
15289A01403J75482k814a97084O4965B45693C3601a44262d6970j26274A07640
15278A16589m271c4923k20462G8859a62410f4782k66029A06219A2300K84074a28718
15266a46241c0382I719J61752m1438M9777b81739A29598E7067b59735A9290K9460
15255D8750f6495A23535R8586n4448j1254P5901l8288L86515K43759R05006N9632
15244A788944k20952L71087p02416F13790A80738a0937H6585B3020O640c7544
15233A5334i5480J7434A88239M1862a32199K976B70392I834K8763O620a39435
$$ plain form
15221 -141977 395185 17266 -185143 51834 118971 75749 -342764 -39638 401543 -93697 182120
15209 -46881 176419 82409 44557 99500 183216 138139 -100644 68775 -123109 -103027 -16548
15197 56247 7858 -184345 213135 -35175 541471 -112193 7819 4372 130460 103935 -30802
15185 -90585 -192032 34159 71571 130621 166502 29205 -58471 180910 362381 23257 398566
15174 398566 -11056 167999 73610 157297 -105495 608850 53418 154444 107586 -140694
15163 55540 85208 95728 -271412 235708 52350 104620 -24362 31120 34517 -44540 -449511
15152 -449511 -57277 127253 -36325 15204 -149177 179410 205090 304301 -1164 239522 238739
15141 238739 154177 293378 511640 180250 -60055 -182701 -32101 269718 -11698 -83232
$$ packed form
15221a41977C95185A7266a85143E1834O7137m3222c42764c9638D01543i3697A82120
15209d6881A76419H2409l7852N4943Q3716m5077a00644F8775a23109K0082a6548
15197E6247G858a84345B13135c5175E41471a12193G819l447J26088k6525c0802
15185i0585j01447C4159L7412N9050L5881B9205e8471A80910J81471B3257L75309
15174C98566a1056A67999G3610Q3687a05495F08850E3418J01026m6858a40694
15163E5540K9668J0520b71412B35708E2350N2270b4362C1120L397d4540m04971
15152d49511e7277A27253c6325A5204a49177A79410K5680R9211a164B39522p83
15141B38739q4562J39201K18262A80250f0055j22646c2101B69718a1698p1534
$$ plain form
15131 -83232 284985 -220696 3715 -6801 50769 199543 243692 -48737 -65877 81764 267488
15120 267488 79848 366490 195617 252124 6274 40650 170161 368857 38687 -46533 -58581
15109 -58581 102695 -38007 143200 233249 -11191 236191 -249680 363257 174493 95192
15099 95192 130524 -250411 -83668 131443 6106 22615 78044 64115 127001 135527 204492 111825
15087 111825 37073 260740 376535 685587 82124 129018 270800 63520 2086 503282 137474
15075 52427 361101 -2860 281480 78999 45463 -10170 -100237 135929 452649 -69592 228082
15063 70184 281482 -146627 40171 80260 465689 67391 -201997 346495 121140 85600
15053 85600 167285 -15736 191031 64610 66665 -95814 218493 160471 430312 261593 -60798
$$ packed form
15131h3232B84985b20696C715f801E0769J48774M4149d8737j7140H1764J85724
15120B67488G9848K86642j70873N6507F274L4376J29511J98696C8687d6533j2048
15109e8581A02695c8007A43200R0049a1191B36191b49680C63257A74493p9301
15099I5192L5332b50411h3668A31443F106J6509N5429j3929O2886Q526O8965r2667
15087A11825C7073K23667J15795L09052H2124M6894J41782F3520B086N01196A37474
15075E2427L08674b860B81480G8999l3536a0170r0067A35929L16720f9592B28082
15063G0184K11298a46627D0171M0089L85429F7391b01997C46495A21140l5540
15053H5600Q1685a5736A91031F4610K055i5814B18493n8022K69841j68719f0798
$$ plain form
15041 203485 305946 38712 155196 -113571 138048 -166346 273833 410720 157976 171879
15031 171879 112748 230247 -87904 -12472 -113271 559549 245540 288306 248025 18890 91885
15020 91885 165681 368471 22576 410553 -67176 -38719 297317 70907 191034 391375 286939
15009 286939 95777 5700 -44796 6759 233552 229733 14107 90050 32085 421937 -198496
14997 331423 -106276 109490 181847 122003 203834 -109005 28268 -175076 191369 181452 -17893
14985 154273 78356 149166 253260 84088 209940 383789 278672 265137 33115 182152
14975 182152 445988 261436 124530 419681 194233 435978 215915 -63453 190296 537671
14965 537671 272099 152740 -24415 169478 119842 317626 -195401 -243903 68617 320863
$$ packed form
15041B03485J02461C8712J16484a13571A38048a66346B73833J36887A57976J3903
15031A71879n9131J17499h7904a2472j00799E59549B45540M2766m0281A8890P2995
15020I1885P3796K02790B2576L87977f7176K8457B97317G0907J20127K00341j04436
15009B86939I5777E700d4796F759K26793l819A4107P5943C2085L89852a98496
14997C31423a06276A09490P2357n9844Q1831a09005B8268a75076A91369r917a7893
14985A54273p5917P0810J04094H4088J25852J73849j05117j3535C3115J49037
14975A82152K63836j84552A24530K95151A94233K41745B15915f3453A90296L47375
14965E37671k65572j19359b4415A69478m9636J97784a95401m8502F8617K52246
$$ plain form
14955 320863 160905 15288 323803 410256 603067 68502 366512 292178 249374 607041
14945 607041 -50772 326790 461049 -128127 282266 -87837 119940 108511 381548 334990
14935 334990 366792 139245 -16620 240346 217295 534354 420929 389477 98873 268049
14925 268049 150138 333455 444018 527071 -20859 521472 348099 196646 258326 324373
14915 324373 75410 300768 280418 378099 281938 -92884 346400 533318 -39401 128246 210192
14904 210192 293679 266271 145880 316032 600596 324181 290284 237372 530197 73989
14893 372441 181811 417088 120372 269260 360931 390978 352894 22002 230668 170483
14883 170483 142433 532179 360115 197799 226474 261898 162502 -11447 174254 173275 429762
$$ packed form
14955C20863j59958A5288L08515Q6453J92811F8502K98010p4334m2804L57667
14945F07041e0772C26790J34259a28127B82266h7837A19940j1429K73037m6558
14935C34990L1802A39245a6620B40346k3051L17059j13425l1452I8873J69176
14925B68049j17911J83317J10563Q3053b0859E21472j73373j51453O1680O6047
14915C24373G5410K25358k0350R7681r6161i2884C46400J86918c9401A28246Q1946
14904B10192Q3487k7408j20391J70152K84564k76415l3897n2912K92825G3989
14893C72441A81811K35277A20372J48888R1671L0047l8084B2002K08666o0185
14883A70483k8050L89746j72064j62316K8675L5424r9396a1447A74254r79K56487
$$ plain form
14872 429762 320216 455842 496073 2042 182523 283298 272565 373375 294574 82794 184094
14861 184094 102553 654628 187378 454439 354645 813168 251771 202130 631032 34971
14850 258509 383472 291959 77553 265866 229550 382118 33128 570921 269983 339047
14840 339047 469889 435756 75306 479757 322377 200244 591855 328695 122597 555014
14830 555014 299094 632130 475030 178587 647605 205078 305861 487641 316123 855329
14820 855329 743590 548148 283698 662279 353790 212520 924417 804835 516383 345457
14810 345457 100333 741146 215465 560730 316467 390427 286944 507614 561778 671699
14800 671699 255824 208238 496936 390924 657862 299000 456548 308637 424579 414236
$$ packed form
14872D29762j09546J35626M0231B042J80481J00775j0733J00810p8801H2794J01300
14861A84094q1541N52075A87378K67061r9794M58523B51771m9641M28902C4971
14850B58509J24963r1513G7553J88313l6316J52568C3128N37793B69983O9064
14840C39047J30842l4133G5306M04451j57380j22133L91611k63160A22597M32417
14830E55014k55920L33036j57100A78587M69018B05078J00783J81780j71518N39206
14820H55329j11739j95442k64450L78581l08489j41270P11897j19582k88452j70926
14810C45457A00333O40813B15465L45265k44263P3960j03483K20670N4164J09921
14800F71699B55824m7586K88698j06012K66938B99000J57548j47911J15942j0343
$$ plain form
14790 414236 793824 593948 529984 279170 365765 666098 917751 434794 661187 449794
14780 449794 465453 667943 563251 462282 560508 581420 411012 487614 750168 639164
14770 639164 484006 681161 387283 455689 612932 470503 593012 451124 406043 331323
14760 331323 703033 662971 594610 498739 582614 373599 630792 740373 788492 716309 461786
14749 461786 621944 594859 591293 656797 502929 376569 726612 270105 492870 470103
14739 470103 610746 815133 560504 583874 437255 691529 516799 397374 761736 735479
14729 735479 839319 1064914 996562 586382 831152 461020 664153 521469 922013 906622
14719 906622 843465 905745 854012 756034 677266 732902 605225 682979 797726 611915 480935
$$ packed form
14790D14236L79588j99876o3964k50814Q6595L00333K51653D34794K26393k11393
14780D49794J5659K02490j04692j00969R8226K0912j70408P6602K62554j11004
14770F39164j55158J97155k93878O8406J57243j42429J22509j41888m5081p4720
14760C31323L71710m0062o8361r5871Q3875k09015K57193J09581M8119p2183k54523
14749D61786J60158k7085l566O5504j53868j26360L50043B70105K22765k2767
14739D70103J40643K04387k54629K3370j46619K54274j74730j19425L64362k6257
14729G35479J03840K25595o8352m10180K44770l70132K03133j42684M00544j5391
14719I06622o3157O2280n1733r7978p8768N5636j27677P7754J14747j85811j30980
$$ plain form
14708 480935 236170 758474 803473 894498 1012283 777258 894706 771739 917724 677226
14698 677226 579840 972121 476010 900571 794462 865367 486374 830358 527009 978144
14688 978144 768490 723437 991924 837787 698272 1001786 527778 824872 1093683 477289
14677 941937 728614 1257506 807817 682625 853493 909377 924801 927837 923777 764031 931470
14666 931470 581570 913815 780888 1074121 652496 795160 1182331 1005568 1055885 1041513
14656 1041513 974228 995446 1090153 767915 1068033 1080711 1257544 1173781 847997 1261364
14646 1261364 1266473 733965 864233 1291374 1058608 938696 999006 1065701 1054034 1222105
14636 1222105 1094962 1225535 841258 1220897 1377458 864348 1055720 1217333 1034204
$$ packed form
14708D80935B36170N22304M4999R1025J17785k35025J17448j22967J45985k40498
14698F77226r7386L92281D76010M24561j06109P0905l78993L43984l03349M51135
14688I78144k09654m5053K68487j54137j39515L03514m74008K97094K68811D77289
14677I41937k13323N28892m49689j25192J70868N5884J5424L036m060j59746J67439
14666I31470l49900L32245j32927K93233m21625J42664L87171j76763N0317j4372
14656A041513o7285K1218R4707l22238L00118J2678J76833q3763l25784M13367
14646A261364N109n32508J30268M27141k32766j19912O0310O6695j1667J68071
14636A222105j27143J30573l84277L79639J56561n13110J91372J61613j83129
$$ plain form
14627 1034204 1193491 1242972 1025350 1060403 1510618 1167366 851015 1144714 1129186 1165485
14617 1165485 1410789 1159445 1422336 1370138 1211445 1246054 1376451 1261055 1406386 1024707
14607 1024707 1440579 1212685 1338234 1300647 1544671 1551718 1280239 1499427 1588818 1595751
14597 1595751 1478741 1478426 1371375 1426822 1363704 1774849 1559437 1449978 1746277 1426219
14587 1426219 1696754 1535941 1665814 1519461 1582689 1586569 1968210 1921946 1824063 1423189
14577 1423189 1762120 1696023 1450223 1686350 1980133 1740427 1527349 1471019 2049455 2098473
14567 2098473 2042129 2234574 2137021 2275309 2109839 1901119 2626757 2280227 2564571 2378367
14557 2378367 2575158 2470044 2934569 2848297 3237977 3261970 3872659 4655207 5826400 9742529
$$ packed form
14627A034204J59287M9481k17622L5053M50215l43252l16351K93699j5528L6299
14617A165485K45304k51344K62891n2198j58693L4609J30397j15396J45331l81679
14607A024707M15872k27894J25549l7587K44024P047k71479K19188Q9391O933
14597A595751j17010l15j07051N5447o3118M11145k15412j09459K96299l20058
14587A426219K70535j60813J29873j46353O3228L880L81641m6264r7883m00874
14577A423189L38931o6097k45800K36127K93783k39706k13078n6330N78436M9018
14567B098473n6344J92445r7553J38288j65470k08720P25638l46530K84344j86204
14557B378367J96791j05114M64525q6272L89680K3993O10689P82548J171193L916129
$$ plain form
14547 9742529 19174435 35260653 47845069 24133683 8976070 6602374 5707054 2569608
14538 1966146 1850770 1911852 1674927 1700708 2076487 1535220 1894257 1866691 2013406 2146203
14528 2146203 1869246 1985491 2314876 2036380 2239564 2121058 2226828 2282862 2211738 1900041
14518 1900041 2059627 2210792 2165153 2202332 2081403 2402389 1866369 2142485 2357395 2393916
14508 2393916 2444848 2477060 2783140 2752550 2727344 2352643 2945964 2682457 2892376 2960520
14498 2960520 2709738 2903776 2726679 3086930 2830130 2609793 3239376 2924338 3034762
14489 3034762 3082979 3264741 3381653 3413797 3208363 2534102 3648146 3406833 3794088 3459702
14479 3459702 3591466 3614533 3459676 3599690 3391977 3543315 3694093 3819413 3921539 4077614
$$ packed form
14547I742529R431906J6086218J2584416k3711386H976070k373696q95320B569608
14538A966146j15376O1082k36925K5781L75779n41267L59037k7566J46715J32797
14528B146203k76957J16245L29385k78496K03184j18506J05770N6034p1124l11697
14518A900041J59586J51165m5639L7179j20929L20986n36020K76116K14910L6521
14508B393916N0932L2212L06080l0590k5206l74701N93321k63507K09919O8144
14498B960520k50782J94038j77097L60251k56800k20337O29583l15038J10424
14489C034762M8217J81762J16912L2144k05434o74261J114044k41313L87255l34386
14479C459702J31764K3067j54857J40014k07713J51338J50778J25320J02126J56075
$$ plain form
14469 4077614 3837038 4026444 3914300 4019680 4137542 4209124 4127251 4339062 4520758 4492118
14459 4492118 4451476 4481744 4345795 4565104 4447535 4401911 4641474 4814550 4806090 4598054
14449 4598054 4703187 4950908 5064301 5192592 4948101 5056648 5572112 5478793 5218782 5687082
14439 5687082 5608184 5540993 6064009 5635472 5843620 6018626 5786549 6062288 6083169 6168749
14429 6168749 6218536 6638369 6580687 6562660 6626736 6762882 6795863 7242296 7120940 7159601
14419 7159601 7148651 7623190 7320061 7604613 7819600 7803438 7776317 7918326 8298577 8248108
14409 8248108 7949280 8544943 8412834 8533671 8850018 8898502 9077454 9273212 9491884 9561533
14399 9561533 9946617 9838821 10017904 10194808 10309086 10375097 10783553 10855108 10997318 11308577
$$ packed form
14469D077614k40576J89406j12144J05380J17862P1582q1873K11811J81696k8640
14459D492118m0642L0268j35949K19309j17569m5624K39563J73076q460k08036
14449D598054J05133K47721J13393J28291k44491J08547N15464r3319k60011M68300
14439E687082p8898o7191N23016m28537K08148J75006k32077K75739K0881Q5580
14429F168749M9787M19833n7682j8027O4076J36146L2981M46433j21356L8661
14419G159601j0950M74539l03129K84552K14987j6162k7121J42009L80251n0469
14409H248108k98828N95663j32109J20837L16347M8484J78952J95758K18672O9649
14399I561533L85084j07796J79083J76904J14278O6011M08456P1555J42210L11259
$$ plain form
14389 11308577 11466886 11532324 11947195 11940564 12253309 12444393 13007456 12566268 12975147 13534749
14379 13534749 13564261 14026125 13965431 14473653 14782351 14842768 15260469 15354886 15732948 16373892
14369 16373892 16509647 17033751 17175416 17219757 17877021 18191091 18563867 18891771 19560225
14360 19560225 19897047 20530738 20897146 21511425 21247044 22141586 22851339 23135261 23770192
14351 23770192 24304259 25258134 25768204 26207170 26890301 27740369 28277240 29176924 29976791
14342 29976791 30672128 31768395 32153957 33277794 34466817 35480619 36450826 37274281 38527342
14333 38527342 39736539 40880193 42496098 43674849 45209656 46005088 47835326 49648028
14325 49648028 50666388 52511647 54896429 56559270 58602661 60628229 62875163 65162658
$$ packed form
14389A1308577J58309O5438M14871o631L12745J91084N63063m41188M08879N59602
14379A3534749K9512M61864o0694N08222L08698O0417M17701R4417L78062O40944
14369A6373892J35755N24104J41665M4341O57264L14070L72776L27904O68454
14360A9560225L36822O33691L66408O14279k64381Q94542P09753K83922O34931
14351B3770192N34067R53875N10070M38966O83131Q50068N36871Q99684P99867
14342B9976791O95337J096267L85562J123837J189023J013802R70207Q23455J253061
14333C8527342J209197J143654J615905J178751J534807P95432J830238J812702
14325D9648028J018360J845259K384782J662841K043391K025568K246934K287495
$$ plain form
14317 65162658 67421352 70513554 72606483 76000740 78928148 82117073 86051299 89167854
14309 89167854 92870549 97199904 101671212 106132485 111101297 115863896 121636916 127341688
14301 127341688 133707580 140459234 147408034 154622899 162686928 171191656 180225789 189669167
14293 189669167 199865082 210548442 221844037 234389582 246971100 260429315 274476821
14286 274476821 289198728 304155314 319952733 335950952 352177042 368202404 384339847
14279 384339847 399999684 414800756 428707060 441213633 452024326 460320685 465936754
14272 465936754 466344820 462962392 459367203 457723864 456336926 451243534 442963552 432773155
14264 432773155 420231004 405984674 390375695 374222564 357955917 341491230 325310959
$$ packed form
14317F5162658K258694L092202K092929L394257K927408L188925L934226L116555
14309H9167854L702695M329355M471308M461273M968812M762599N773020N704772
14301A27341688O365892O751654O948800P214865Q064029Q504728R034133R443378
14293A89669167J0195915J0683360J1295595J2545545J2581518J3458215J4047506
14286B74476821J4721907J4956586J5797419J5998219J6226090J6025362J6137443
14279C84339847J5659837J4801072J3906304J2506573J0810693Q296359N616069
14272D65936754M08066l382428l595189j643339j386938n093392q279982j0190397
14264D32773155j2542151j4246330j5608979j6153131j6266647j6464687j6180271
$$ plain form
14257 325310959 309388067 294064354 278893987 264479951 251167340 239159418 227308170
14250 227308170 215110711 203792288 193619558 183642037 174282970 165849343 158116580
14243 158116580 150024751 143080238 136211557 129629264 123630198 118483235 113333042 108214060
14235 108214060 103702295 98993463 95066113 90990457 87952307 84635107 80987764 77685122
14227 77685122 74592203 72127288 69013565 66448476 64287500 61974528 60066773 57789917
14219 57789917 55871630 54145789 52139116 50274824 48688308 47634704 46424843 44537514
14211 44537514 43300938 41555311 40578786 39525781 38952228 38157274 36282718 35298835 34400135
14202 34400135 33458323 32765739 32437098 31488232 30131805 29449177 28718404 27736183 27527067
$$ packed form
14257C25310959j5922892j5323713j5170367j4414036j3312611j2007922j1851248
14250B27308170j2197459j1318423j0172730r977521r359067q433627p732763
14243A58116580q091829o944513o868681o582293n999066n146963n150193n118982
14235A08214060m511765m708832l927350m075656l038150l317200l647343l302642
14227G7685122l092919k464915l113723k565089k160976k312972j907755k276856
14219E7789917j918287j725841k006673j864292j586516j053604j209861j887329
14211D4537514j236576j745627r76525j053005n73553p94954j874556r83883q98700
14202C4400135r41812o92584l28641r48866j356427o82628p30773r82221k09116
$$ plain form
14193 27527067 26964389 26113634 25367723 24674953 24572667 23753444 23260181 22459727 22089699
14184 22089699 21268816 21112599 21001450 20228943 19699284 19256438 19183505 18304206 18239137 17867878
14174 17867878 17622792 17132745 16677702 16402857 16147446 16024105 15701595 15044022 15037775 14648266
14164 14648266 14585877 14226616 13569092 13590845 13623447 12951731 13030471 12654328 12572014 12343057
14154 12343057 12044733 11646509 11337814 11302971 11369519 11168988 11085648 10664913 10613000 10375059
14144 10375059 10462825 10204061 9947684 9815977 9614496 9710319 9626750 9398535 9314284 8795070
14134 8795070 8994680 8871983 8890523 8216478 8296786 8440814 8213958 8236935 7868624 8013983
14124 8013983 7952626 7620470 7634878 7037947 7226520 7178377 6819807 6956199 6997658 6734140
$$ packed form
14193B7527067n62678q50755p45911o92770j02286q19223m93263q00454l70028
14184B2089699q20883j56217j11149p72507n29659m42846p2933q79299o5069l71259
14174A7867878k45086m90047m55043k74845k55411j23341l22510o57573o247l89509
14164A4648266o2389l59261o57524K1753L2602o71716P8740l76143q2314k28957
14154A2343057k98324l98224l08695l4843O6548k00531q3340m20735n1913k37941
14144A0375059Q7766k58764k56377j31707k01481R5823q3569k28215q4251n19214
14134H795070J99610j22697J8540o74045Q0308J44028k26856K2977l68311J45359
14124H013983o1357l32156J4408n96931J88573m8143l58570J36392M1459k63518
$$ plain form
14114 6734140 6653094 6575093 7016986 6408866 6426671 6239916 6506189 6411657 5944117 6366254
14104 6366254 6176523 6086373 5898072 5744734 5452512 5625373 5275871 5584054 5372272 5516568
14094 5516568 5069406 5154788 5618138 5047204 5026009 5111547 4968590 5142864 5002958 4969754
14084 4969754 4610965 4822887 4745945 4662247 4347875 4583852 4409676 4496621 4289310 4792391
14074 4792391 4200805 4318449 3966497 4031387 4160132 4060551 4133902 3936798 3494468 4002435
14064 4002435 4065345 3767484 4013761 3776990 3895780 3976783 3914935 3623227 3534612 3752585
14054 3752585 3717711 3507215 3768161 3682048 3029201 3363339 3282837 3251840 3586928 3420887
14044 3420887 3407157 3211701 3285843 2889141 3299728 3011055 2851867 2897094 2825449 3306272
$$ packed form
14114F734140q1046p8001M41893o08120J7805j86755K66273r4532m67540M22137
14104F366254j89731r0150j88301j53338k92222J72861l49502L08183k11782J44296
14094E516568m47162Q5382M63350n70934k1195Q5538j42957J74274j39906l3204
14084D969754l58789K11922p6942q3698l14372K35977j74176Q6945k07311N03081
14074D792391n91586J17644l51952O4890J28745r9581P3351j97104m42330N07967
14064D002435O2910k97861K46277k36771J18790Q1003o1848k91708q8615K17973
14054C752585l4874k10496K60946q6113o52847L34138q0502l0997L35088j66041
14044C420887j3730j95456P4142l96702M10587k88673j59188M5227p1645M80823
$$ plain form
14034 3306272 2714761 3008103 2744892 2839142 2947133 3056497 3118780 2527274 2798441 2660199
14024 2660199 2853151 2722937 2438252 2657089 2499727 2606007 2543054 2293971 2426912 2566132
14014 2566132 2114703 2270537 2405416 2299726 2435652 2367731 2287468 2391103 2285921 2263974
14004 2263974 2138362 1925139 1757372 2017901 1993485 1898037 2174235 1756546 1689529 1937235
13994 1937235 1880385 1876848 1893662 1913551 2192155 2677824 4845344 12019046 27855536 47265403
13984 47265403 31285405 13748545 7623264 5176181 4199221 3603479 3412584 3070161
13976 3070161 2924783 2672006 2897884 2681709 2586398 2586587 2470845 2270763 2420538 2688319
13966 2688319 2205048 1976469 2218711 1725035 2168004 2437830 2004104 1917555 1900866 1986402
$$ packed form
14034C306272n91511K93342k63211R4250J07991J09364O2283n91506K71167j38242
14024B660199J92952j30214k84685K18837j57362J06280o2953k49083J32941J39220
14014B566132m51429J55834J34879j05690J35926o7921q0263J03635j05182k1947
14004B263974j25612k13223j67767K60529k4416r5448K76198m17689o7017K47706
13994A937235n6850l537J6814J9889K78604M85669K167520P173702J5836490J9409867
13984D7265403j5979998A3748545o125281k447083r76960n95742j90895l42423
13976C070161j45378k52777K25878k16175r5311J89j15742k00082J49775K67781
13966B688319m83271k28579K42242m93676M42969K69826m33726q6549j6689Q5536
$$ plain form
13956 1986402 1746091 1797335 1887091 1873099 1935211 1594622 1842114 1861102 1817839 1724908 1628408
13945 1628408 1656738 1742004 1627556 1677331 1601237 1707577 1803253 1417852 1982123 1621077
13935 1621077 1669616 1435024 1693609 1635450 1441901 2090791 1636895 1457046 1440644 1412663
13925 1412663 1899308 1494325 1598630 1588893 1697280 1240851 1372333 1507206 1528411 1398644
13915 1398644 1344017 1976175 1606014 1526089 1526960 1383579 1345558 1442079 1534982 1242881 1117353
13904 1117353 1484708 1474304 1316226 1420848 1189806 1171552 910438 1320978 1388786 1133153
13894 1133153 1230471 1422189 1470230 1227455 1104587 1130060 1156605 1317365 1027746 1142348
13884 1142348 1193208 1158767 1168396 1380638 1355429 1221310 1335631 1398560 868095 1060876
$$ packed form
13956A986402k40311N1244Q9756j3992O2112l40589K47492J8988m3263r2931r6500
13945A628408K8330Q5266j14448M9775p6094J06340R5676l85401N64271l61046
13935A621077M8539k34592K58585n8159j93549O48890m53896j79849j6402k7981
13925A412663M86645m04983J04305r737J08387m56429J31482J34873K1205j29767
13915A398644n4627O32158l70161p9925Q71j43381l8021R6521R2903k92101j25528
13904A117353L67355j0404j58078J04622k31042j8254k61114M10540O7808k55633
13894A133153R7318J91718M8041k42775j22868K5473K6545J60760k89619J14602
13884A142348N0860l4441R629K12242k5209j34119J14321O2929n30465J92781
$$ plain form
13874 1060876 1040870 1015577 1088191 1476355 953067 827555 956660 1403500 1194070 1604590
13864 1604590 1109235 1198993 965465 873533 1259082 828681 1088926 1077148 970584 862044
13854 862044 1036170 1080353 1243904 905077 888754 1041007 834170 1119675 995074 1028617
13844 1028617 912555 990865 1091963 983800 1234127 646204 781215 501306 1230534 877441
13834 877441 908410 732456 766147 859967 690936 1215910 1058109 1200775 842439 781871
13824 781871 1017653 1144579 862364 709990 670738 875538 451612 885883 461794 700252
13814 700252 940396 1159907 1131595 849709 985255 796134 818103 902387 730869 770894
13804 770894 718266 855848 860927 952923 615801 664068 764994 576760 862502 1045455
$$ packed form
13874A060876k0006k5293P2614L88164n23288j25512J29105M46840k09430M10520
13864A604590m95355Q9758k33528r1932L85549m30401K60245j1778j06564j08540
13854H62044J74126M4183J63551l38827j6323J52253k06837K85505j24601L3543
13844A028617j16062P8310J01098j08163K50327n87923J35011k79909P29228l53093
13834H77441L0969j75954L3691R3820j69031N24974j57801J42666l58336o0568
13824G81871K35782J26926k82215j52374l9252K04800m23926M34271m24089K38458
13814G00252K40144K19511k8312k81886J35546j89121K1969Q4284j71518M0025
13804G70894n2628J37582N079R1996l37122M8267J00926j88234K85742J82953
$$ plain form
13794 1045455 1197531 843862 872728 575894 791539 866600 1003201 713889 574162 748058
13784 748058 749170 732596 498711 434394 916965 663157 422547 750974 788322 792579 631870
13773 631870 647843 535600 708804 913771 656804 835221 633794 594440 493251 923700
13763 923700 588563 783456 491936 716779 545612 616566 662870 678156 914461 628911
13753 628911 547238 400134 333956 802823 604891 1085961 561301 270798 803051 604804
13743 604804 318581 663387 656173 917985 745142 366672 664144 911360 410167 600428
13733 600428 667824 302648 582803 560694 645432 789809 847698 532919 573472 678422
13723 678422 357632 593422 540812 448329 372330 524607 508877 606956 476188 170436
$$ packed form
13794A045455J52076l53669K8866k96834K15645P5061J36601k89312j39727J73896
13784G48058J112j6574k33885o4317M82571k53808k40610L28427L7348M257j60709
13773F31870J5973j12243J73204K04967k56967J78417k01427l9354j01189M30449
13763I23700l35137J94893k91520K24843j71167P0954M6304J5286K36305k85550
13753F28911q1673j47104o6178M68867j97932M81070n24660B70798N32253j98247
13743F04804k86223L44806p214K61812j72843C66672K97472K47216D10167J90261
13733F00428O7396C02648K80155k2109Q4738J44377N7889l14779M0553J04950
13723F78422l20790K35790n2610r2483p5999J52277j5730R8079j30768A70436
$$ plain form
13712 300597 736971 452100 394281 533568 906391 589048 549046 429322 256219 599453
13702 599453 145781 189503 588767 135830 536612 530941 469247 531349 292102 328702 582519
13691 582519 325686 585233 617582 561297 640519 576613 634639 424599 483720 606298 400980
13680 400980 557839 236949 566120 773340 282012 167486 603685 411593 915283 462301
13670 462301 596839 328648 662979 481338 233192 576008 236524 590360 335631 383168
13660 383168 417418 91770 188785 283530 329918 349124 489659 696519 408653 624013 602861
13649 602861 591698 339067 221613 354705 508391 601344 230279 403404 52329 635338
13639 635338 622604 312817 161923 634642 368589 517143 628193 366497 602509 641857
$$ packed form
13712C00597M36374k84871n7819J39287L72823l17343m0002j19724j73103L43234
13702E99453A45781M3722L99264A35830M00782n671o1694O2102k39247L6600K53817
13691E82519k56833K59547L2349n6285P9222o3906N8026k10040N9121J22578k05318
13680D00980J56859B36949L29171K07220B82012j14526M36199j92092N03690m52982
13670D62301J34538k68191L34331j81641B33192L42816B36524L53836k54729M7537
13660C83168L4250I1770R7015R4745M6388J9206J40535K06860k87866K15360k1152
13649F02861j1163k52631j17454J33092J53686R2953B30279J73125E2329N83009
13639F35338j2734l09787j50894M72719k66053J48554J11050k61696K36012L9348
$$ plain form
13629 641857 697794 201612 138792 657395 443236 542177 269312 403688 490662 498222 115975
13617 437566 502008 140181 234472 153541 542794 318391 333365 247621 237721 445255 310507
13606 310507 337279 354974 247788 423126 180061 155090 295148 325860 438067 398736
13596 398736 335080 916100 103586 492246 297832 335287 208218 453173 533118 369816
13586 369816 112065 369536 448033 473133 357374 163976 511178 405996 -32129 288649
13575 361489 616412 555618 -13484 70708 222589 106479 1338 396402 471322 278095 292846
13564 292846 197611 382202 174225 282938 174709 468904 381834 -180698 321746 418143
13554 418143 276604 597202 243623 71462 311599 87441 444595 230800 245737 538615
$$ packed form
13629F41857N5937B01612o2820N18603k14159R8941B69312J34376Q6974P560A15975
13617D37566O4442A40181R4291q0931L89253k24403J4974q5744r900K07534j34748
13606C10507K6772J7695j07186J75338A80061k4971J40058L0712J12207l9331
13596C98736o3656N81020A03586L88660j94414L7455j27069K44955P9945j63302
13586C69816A12065K57471P8497K5100j15759A63976L47202j05182c2129B88649
13575C61489K54923o0794a3484G0708J51881A06479A338L95064P4920j93227J4751
13564B92846r5235J84591A74225J08713j08229K94195q7070a80698C21746R6397
13554D18143j41539L20598B43623G1462K40137H7441L57154k13795J4937K92878
$$ plain form
13544 538615 493152 288905 412788 369083 338589 259648 353178 404631 335548 172053 -140740
13532 416789 284794 396047 487837 124229 140606 146174 -23204 281934 232781 378550 505154
13521 505154 98345 212071 181316 -69308 166946 276785 134203 515384 478174 321139
13511 321139 219482 188935 296460 429585 -53614 236071 651364 314537 195148 50952
13500 178344 173279 -146171 36651 96378 326704 202245 138424 420271 262467 558961
13490 558961 174947 593285 314261 436247 496400 350531 360083 40679 439876 -169513
13479 174610 492231 -84380 24472 329172 319968 462129 488441 336416 402600 280601 159118
13468 159118 358080 53466 242492 465484 71307 136557 284828 267249 322411 355245 5190
$$ packed form
13544E38615m5463k04247J23883m3705l0494p8941R3530N1453o9083j63495a40740
13532D16789j31995J11253R1790A24229J6377N568b3204B81934m9153J45769J26604
13521E05154I8345J13726l0755f9308A66946J09839A34203L81181l7210j57035
13511C21139j01657l0547J07525J33125e3614B36071M15293C14537j19389E0952
13500A78344n065a46171C6651N9727K30326j24459o3821K81847j57804K96494
13490E58961A74947M18338k79024J21986O0153j45869R552D0679L99197a69513
13479A74610L17621h4380B4472L04700r204J42161K6312j52025O6184j21999j21483
13468A59118J98962E3466J89026K22992G1307O5250J48271j7579N5162L2834E190
$$ plain form
13456 122447 82126 13315 126417 343432 277189 200336 401658 527965 64517 133040 -172888
13444 375971 291661 495594 295552 219789 395215 75249 109688 164905 568855 79833 -96256
13432 534174 206221 591471 -148645 266474 142981 211709 348063 430514 138875 39539
13421 105607 143534 335005 274901 239618 145787 133444 239569 6893 293927 162718 -7283
13409 306527 255394 123212 394833 100443 95523 -258962 367395 110897 320138 425137
13399 425137 268121 100781 139656 213358 -38654 379709 31650 186545 38703 425026
13389 425026 255323 398010 92762 444258 -3998 82756 292238 366261 132111 142672 47104
13377 175594 160347 -19132 387149 198943 121095 15123 313174 301291 300062 136176 435462
$$ packed form
13456A22447m0321A3315J13102K17015o6243p6853K01322J26307F4517O8523a72888
13444C75971q4310K03933k00042p5763J75426G5249L4439N5217M03950G9833i6256
13432E34174B06221L85250a48645B66474j23493O8728J36354Q2451A38875C9539
13421A05607L7927J91471o0104l5283r3831j2343J06125F893K87034j31209g283
13409C06527n1133A23212K71621A00443m920b58962C67395A10897K09241J04999
13399D25137j57016A00781L8875P3702c8654C79709C1650J54895C8703L86323
13389D25026j69703J42687I2762L51496c998H2756K09482P4023A32111J0561D7104
13377A75594j5247a9132C87149j88206p7848A5123K98051j1883j229A36176K99286
$$ plain form
13366 435462 238024 266132 -47159 110038 25577 273270 189913 172521 381019 78412 -53765
13354 142021 513932 167581 416784 106427 -122635 -36053 353563 -156954 283784 299521
13344 299521 200187 499985 487085 185703 284079 156417 254014 427621 350248 384189 453925
13333 453925 514115 -96994 507052 192884 336272 461457 257896 214474 120834 224175
13323 224175 122435 178158 75154 -76758 323158 -415 231935 263582 53747 219702 198352
13312 198352 13289 292399 13520 247657 429300 548316 212328 362526 293374 171917
13302 171917 139602 176735 141268 301378 297577 11924 27220 46530 187016 2642 198325
13291 198325 -60324 321059 51125 41524 145219 135829 90910 269826 115100 200213 -238575
$$ packed form
13366D35462j97438K8108d7159A10038B5577K47693q3357j7392K08498G8412e3765
13354A42021L71911A67581K49203A06427a22635c6053C53563a56954B83784J5737
13344B99521r9334K99798j2900A85703R8376j27662R7597J73607p7373L3941O9736
13333D53925O0190i6994E07052A92884J43388J25185k03561m3422r3640J03341
13323B24175j01740N5723G5154g6758C23158d15B31935L1647E3747J65955k1350
13312A98352A3289K79110A3520K34137J81643J19016B12328J50198o9152j21457
13302A71917l2315L7133l5467J60110l801A1924J5296J9310J40486B642J95683
13291A98325f0324C21059E1125r601J03695r390m4919J78916A15100Q5113b38575
$$ plain form
13279 69434 325657 393939 442677 230339 -3456 43812 81469 -188306 -39722 216619 -202065
13267 248201 327498 -209869 299685 129056 330114 109669 225255 124002 104228 166042
13257 166042 96652 292392 96473 -91790 120325 76559 -30527 -266338 121590 137054 353468
13246 353468 148164 86725 11634 312179 247689 -51467 413750 -133162 -108292 177647
13235 -97050 370899 46429 318049 253377 -320987 38281 306624 575416 321739 235700
13225 235700 122153 122927 139407 106722 -21996 -263965 498330 285437 -116464 12476 320172
13214 320172 150095 147069 47890 314949 400037 152731 -45015 -170704 269698 -11068 -5483
13202 126522 22720 236554 20882 -326586 308589 159988 -43155 -46471 -30324 -126893 187621
$$ packed form
13279F9434K56223O8282M8738k12338c456D3812L7657a88306c9722B16619b02065
13267B48201P9297b09869B99685A29056K01058A09669J15586j01253j9774O1814
13257A66042o9390J95740I6473i1790A20325m3766c0527k35811A21590J5464K16414
13246C53468A48164o1439A1634L00545o4490e1467D13750a33162K4870A77647
13235i7050C70899D6429K71620o4672c20987C8281K68343K68792k53677q6039
13225B35700j13547P74J6480l2685b1996k41969D98330k12893a16464A2476L07696
13214C20172A50095l026D7890K67059Q5088A52731d5015j25689B69698a1068e483
13202A26522B2720K13834B0882c26586C08589j48601d3155l316J6147r6569A87621
$$ plain form
13190 142568 98416 431023 512260 -96405 -42167 16834 -68486 244665 -58487 314371 -22447
13178 270519 65622 -13923 343261 59530 346377 64171 -156880 1028 208322 -189603 -38762
13166 153063 175708 67601 231801 398740 17189 -54559 107244 14312 330312 114953
13155 135916 145362 73418 -55602 -51876 282450 -164662 161755 619114 31026 -30867 82233
13143 183015 -1565 232573 257823 147460 304100 -33112 31837 5695 104481 39435 89089
13132 89089 -27656 379006 63979 15984 150351 -42075 324460 87668 103226 140991 190477
13121 190477 227577 134962 105819 -6588 -50994 19755 -29295 45348 240460 146506 -120177
13109 -189125 268487 -98897 162146 -300796 -64447 -617 114927 177540 -29304 178978 123617
$$ packed form
13190A42568m4152L32607Q1237i6405d2167A6834f8486B44665e8487C14371b2447
13178B70519F5622a3923C43261E9530K86847F4171a56880A028K07294a89603c8762
13166A53063K2645F7601J64200J66939A7189e4559A07244A4312L16000A14953
13155A35916R446p1944e5602L726B82450a64662A61755M57359C1026c0867H2233
13143A83015a565B32573K5250j10363J56640c3112C1837E695R8786C9435M9654
13132H9089b7656C79006F3979A5984J34367d2075C24460H7668J5558L7765M9486
13121A90477L7100r2615k9143f588m4406A9755b9295D5348J95112r3954a20177
13109a89125B68487i8897A62146c00796f4447f17A14927O2613b9304A78978n5361
$$ plain form
13098 123617 258619 12746 99738 -62767 155945 71441 289549 249459 11525 -81682 341255
13086 -151473 129190 8389 110360 54417 199002 287254 -108544 19616 132690 -94341 -300691
13075 -300691 -168328 -8236 201800 96850 282252 205893 247873 116274 22773 158894 -128132
13063 9423 158995 -53992 34567 -98228 -201369 -72464 103864 238901 45179 249816 280087
13052 280087 418676 332146 -73778 9353 84893 49808 -8676 208459 -105525 270572 270226
13041 270226 -60242 308323 385636 -96304 181884 -122917 31902 355374 28428 -140235
13030 -88689 86477 139365 119631 34748 -48304 72269 -41900 -114177 119933 155455 331500
13019 331500 119499 5731 104862 -105943 261645 59289 48949 91747 -76686 153185 76695
$$ packed form
13098A23617J35002A2746Q6992f2767A55945G1441K18108m0090A1525h1682C41255
13086a51473A29190H389J01971E4417J44585Q8252a08544A9616J13074i4341k06350
13075c00691J32363h236B01800I6850J85402p6359M1980A16274B2773J36121a28132
13063I423J49572e3992C4567i8228j03141g2464A03864J35037D5179K04637L0271
13052B80087J38589q6530g3778I353P5540l5085h676B08459a05525B70572l46
13041B70226f0242C08323P7313i6304A81884a22917C1902L23472B8428a40235
13030h8689H6477N2888j9734C4748d8304G2269d1900p2277A19933L5522J76045
13019C31500A19499E731R9131a05943B61645E9289j0340M2798g6686A53185p6490
$$ plain form
13008 76695 446567 28263 -213558 607023 218387 -86871 34299 155238 250985 32719 22929
12997 22929 249771 436812 194405 227190 123042 48335 -387493 -105629 68086 157843
12987 157843 -46985 -121323 47349 164735 -232165 196235 98171 221379 305956 242339 419989
12976 419989 -80981 617879 157952 217798 61495 139778 -98911 -180268 -73297 57242 -182073
12964 -50497 78954 -113104 200265 -343939 271293 -91794 220190 -91088 9043 -35324 153982
12952 -8261 -169223 -110974 -166787 166838 24462 -157296 -112846 253806 71862 -231658 27063
12940 33357 -144510 94636 -70522 494994 -12749 -74879 60567 203816 -143395 -199915 139170
12928 -79581 -16938 -64478 -151745 -16295 -134791 24666 95336 90962 177545 271887 -129408
$$ packed form
13008G6695L69872B8263b13558F07023B18387h6871C4299J20939R5747C2719r790
12997B2929K26842J87041A94405L2785j04148D8335c87493a05629F8086Q9757
12987A57843d6985p4338D7349J17386b32165A96235r8064J23208Q4577o3617J77650
12976D19989h0981F17879A57952N9846F1495P8283i8911q1357g3297E7242a82073
12964e0497G8954a13104B00265c43939B71293i1794B20190i1088I043c5324A53982
12952h261j60962N8249n5813A66838B4462a57296M4450B53806G1862b31658B7063
12940C3357a44510I4636g0522D94994a2749o2130F0567J43249a43395n6520A39170
12928g9581a6938m7540q7267a6295j18496B4666P0670m374Q6583R4342a29408
$$ plain form
12916 -96780 -46278 171367 -156292 -9849 -248489 52900 -109849 37851 -182367 -12598 -88500
12905 -88500 44429 24881 398015 296075 -32049 264994 231914 -83076 215856 -36887 158246
12893 83479 -104155 -212501 -42020 33864 117205 -48940 118430 310744 -36455 86914 405365
12882 405365 2462 29361 15560 -128910 172071 -369755 -77065 292067 -39922 -338542 94258
12870 134956 83499 244632 446985 -327417 -84487 146188 -279172 44237 -118082 107823
12859 -15839 154087 23210 259894 43146 158584 -183636 139269 -59980 -218811 -344006
12849 -344006 237237 118007 -145876 -111796 255409 369968 24673 -88385 343996 68517
12838 108804 -111039 150760 52577 149728 102955 -43858 -225272 150035 -86223 217290
$$ packed form
12916i6780d6278A71367a56292i849k38640E2900a09849C7851a82367a2598p5902
12905h8500D4429j9548L73134j01940c2049B64994l3080h3076B15856c6887A58246
12893H3479a04155j08346d2020C3864Q3341d8940A18430J92314c6455H6914L18451
12882D05365B462K6899j3801a28910A72071c69755g7065B92067c9922k98620I4258
12870A34956n1457J61133K02353c27417h4487A46188b79172D4237a18082A07823
12859a5839A54087B3210K36684D3146J15438a83636A39269e9980j58831j25195
12849c44006B37237A18007a45876L4080B55409J14559B4673h8385C43996F8517
12838A08804a11039A50760E2577R7151m6773d3858j81414A50035h6223B17290
$$ plain form
12827 69632 233223 -193607 -130899 150945 397557 -14388 -23440 183973 112426 -34610 -57380
12816 -57380 33336 166383 33440 164540 -5487 110626 -166922 23932 41874 -276929 87061
12804 -202670 124316 104222 255096 -344090 141381 261507 120762 25760 -125873 -107788
12794 -107788 116758 -175502 23719 -57208 -60745 18507 114286 163923 -115895 -101037 309977
12782 -83444 -81448 357415 418181 -121038 -115595 221980 24917 197282 138755 275243 35573
12770 5191 203272 304169 50193 86639 -35021 112866 134368 72201 -130426 -253732 197665
12758 224380 40433 114101 320538 262114 49046 -81639 -166831 73350 289813 418083 49704
12746 -280119 321868 73756 -65113 5843 66825 376484 -93284 -26849 -62282 350692 34614
$$ packed form
12827F9632J63591a93607O2708A50945K46612a4388r052A83973p1547c4610k2770
12816e7380C3336J33047C3440J31100e487A10626a66922B3932J7942b76929H7061
12804b02670A24316k0094J50874c44090A41381J20126A20762B5760a25873J8085
12794a07788A16758a75502B3719e7208l537A8507R5779M9637a15895J4858C09977
12782h3444J996C57415O0766a21038N443B21980B4917J72365n8527J36488C5573
12770E191J98081J00897E0193L6446c5021A12866K1502o2167a30426j23306A97665
12758B24380D0433P3668K06437n8424D9046h1639q5192G3350K16463J28270D9704
12746b80119C21868G3756f5113E843O0982L09659i3284b6849l5433C50692C4614
$$ plain form
12734 21329 -1575 -167431 -16570 406568 -133453 -26162 -2273 377213 16128 138189 32098
12722 -44271 -341 -85517 367274 -273013 82738 -245536 336811 -192417 -415530 49417 -178106
12710 45866 146615 435772 -72779 -104612 47793 170313 379123 203060 107639 -325790
12699 -206980 -44123 -78249 313314 -168948 57123 -66758 130736 -25833 -209336 257313
12688 -213720 -160328 -64936 -220207 -69641 41910 324140 87459 16715 79245 247189 -73930
12676 51800 61739 -276362 318907 175258 -18891 86028 60402 192224 22793 -100757 74318
12664 -52411 186694 241595 -56198 -156845 51136 211647 147697 77119 128178 392145 110565
12652 232401 345997 120748 187512 -234105 96080 219069 19210 44429 -132879 -9744 28392
$$ packed form
12734B1329a575j65856a6570D06568a33453b6162b273C77213A6128J22061C2098
12722d4271c41q5176C67274b73013H2738b45536C36811a92417k23113D9417a78106
12710D5866J00749K89157g2779l1833D7793J22520K08810j76063r5421c25790
12699b06980d4123l4126C13314a68948E7123f6758A30736b5833j83503B57313
12688b13720N3392f4936j55271f9641D1910K82230H7459A6715O2530J67944g3930
12676E1800R939b76362C18907j43649a8891H6028k5626J31822B2793a00757G4318
12664e2411A86694N4901e6198j00647E1136J60511o3950p0578N1059K63967A10565
12652B32401J13596A20748O6764b34105I6080J22989A9210K5219a32879i744B8392
$$ plain form
12640 8469 -6619 -116134 -166069 144451 108423 5565 94411 -105170 -4435 258878 265037 300100
12628 300100 485584 342637 160810 397482 297163 293065 311509 59532 68599 -8994 73481
12616 115950 -32996 -83621 15396 25988 8758 -18106 127575 82807 -289973 158834 226706
12605 226706 589517 104299 256113 -61005 11783 -106486 172860 454993 138600 48938
12594 -78177 -160737 138341 161842 -260764 92876 -27649 -147087 103390 -100819 -98251 -221390
12583 -221390 46070 134728 286029 -179150 171037 -91371 295362 140114 -184568 312153
12572 -34363 6189 -192774 37850 215198 -42610 213789 -139286 154556 -105382 199648
12561 -45547 279382 95222 124456 254148 132542 222388 95438 251495 190490 449679 469314
$$ packed form
12640H469f619j09515m9935A44451l6028E565Q8846a05170d435B58878O159L5063
12628C00100J85484j42947A60810K36672j00319m098J8444E9532R067h994G3481
12616A15950c2996n0625A5396J0592H758a8106A27575m4768b89973A58834O7872
12605B26706L62811A04299J51814f1005A1783a06486A72860K82133A38600D8938
12594g8177q2560A38341K3501b60764I2876b7649j19438A03390a00819K568j23139
12583b21390D6070Q8658J51301a79150A71037i1371B95362A40114a84568C12153
12572c4363F189a92774C7850J77348d2610B13789a39286A54556a05382A99648
12561d5547B79382I5222K9234J29692j21606Q9846I5438J56057o1005K59189J9635
$$ plain form
12550 469314 40376 -515889 92113 -11086 -83210 103372 -62854 -10563 -65937 189420 -208486
12538 -98563 -66318 184 13201 105631 -121351 -382996 305674 130399 314593 96443 186077
12527 186077 -168108 -213757 25517 -243645 -15880 -363402 -152276 302135 -18 128350 53502
12515 -86856 89496 -162890 8694 -62574 37653 -15056 67130 -284307 58790 19880 -336765
12503 -143491 52066 101526 189274 398726 55667 56746 7117 243491 -122751 3619 77470
12492 77470 116009 12906 -37536 -35492 -249351 -184987 -95759 -222377 567391 40313 -351245
12480 -148081 -70628 187920 34429 -254211 -216417 55273 -154315 -110794 -176801 -27286 105598
12468 327424 -99265 -282488 113937 62536 70066 -111634 -90802 -67505 117926 -55110 -62886
$$ packed form
12550D69314D0376e15889I2113a1086p2124A03372f2854a0563n5374A89420b08486
12538i8563L2245A84J3017R2430a21351k61645C05674A30399J84194I6443Q9634
12527A86077a68108m5649B5517b43645a5880l47522a52276C02135a8A28350E3502
12515h6856H9496a62890H694f2574C7653a5056F7130b84307E8790A9880c36765
12503a43491E2066M9460Q7748K09452E5667J079G117K36374a22751C619P3851
12492G7470L8539A2906c7536K044k13859O4364Q9228j26618E67391D0313c51245
12480a48081g0628A87920C4429b54211L7794E5273a54315M3521o6007b7286A05598
12468C27424i9265j83223A13937n1401P530a11634K0832K3297A17926e5110p776
$$ plain form
12457 -62886 147603 -23312 112432 59207 18015 -2387 70164 -8563 -353783 -90374 -62188
12446 -62188 -4501 105659 257765 -87671 -94479 -293530 389814 -62058 -155453 50009 -69259
12434 19445 -31280 33855 108154 64109 -57488 -150621 130294 261515 -70541 83254 18994
12422 112599 407686 -105855 286979 -200288 30193 76852 -59870 75075 143232 56977 -111884
12410 156182 153562 -113279 28315 74423 45499 -106706 467004 -165245 181435 -32983 -612154
12399 -612154 -134826 161609 -167555 35611 -211553 74043 102613 -243150 -20602 -35311
12389 -35311 93870 -54428 -103778 379957 107018 167978 30496 -182501 -169115 -164458 102691
12377 -117613 -165439 411699 142035 109387 186307 150675 35374 -79454 70166 202083 11830
$$ packed form
12457f2886A47603b3312A12432n3225A8015b387G0164h563l45220i0374K8186
12446f2188d501A05659J52106h7671o808j99051C89814f2058r3395E0009f9259
12434A9445c1280C3855P4299m4045e7488r3133A30294J31221g0541H3254A8994
12422A12599K95087a05855B86979b00288C0193M6659e9870G5075O8157E6977a11884
12410A56182k620a13279B8315M6108k8924a06706D67004a65245A81435c2983n79171
12399f12154a34826A61609a67555C5611b11553G4043K8570b43150b0602j4709
12389c5311I3870e4428m9350C79957A07018O0960C0496a82501J3386M657A02691
12377a17613m7826D11699A42035l2648P6920l5632C5374g9454G0166J31917A1830
$$ plain form
12365 63885 -52428 145493 23076 87822 142363 14741 -121802 5661 201773 87262 -247038
12353 -4013 117677 -104003 245961 -24562 -20454 -225262 149499 29786 -46840 -367587 332684
12341 -346499 92150 59382 31240 -54605 -6423 397594 148489 57005 -235863 178280 217867
12330 217867 -141762 166243 455783 37572 285821 -156710 190485 -148616 236157 163763
12320 163763 148145 -541657 161496 -114293 -1579 -219501 296781 249663 -112608 -63562
12310 -63562 -37025 65256 -59788 -83890 -57496 -196612 118200 134116 263464 -38419 139353
12298 -161722 -46131 178389 -101212 197328 -30791 -229716 284095 -192109 -26358 -7429
12287 -891 -123856 6378 119201 -140823 -158600 45874 -65387 -131905 -112333 74963 133776 24853
$$ packed form
12365F3885e2428A45493B3076O4746N4541A4741a21802E661J96112H7262b47038
12353d013A17677a04003B45961b4562M108k04808A49499B9786d6840l20747C32684
12341c46499I2150l2768k8142e4605f423C97594A48489E7005b35863A78280L9587
12330B17867a41762A66243K89540C7572K48249a56710A90485a48616B36157p2394
12320A63763j5618e41657A61496a14293a579k17922B96781m7118a12608M9046
12310f3562K6537F5256e9788k4102K6394j39116A18200J5916J29348c8419A39353
12298a61722d6131A78389a01212A97328c0791j98925B84095a92109b6358g429
12287h91j22965F378J12823a40823j7777D5874f5387o6518J9572G4963N8813B4853
$$ plain form
12274 348249 366603 -25603 -273127 393239 -156301 162461 -118241 -93102 -36094 57350
12263 167187 98047 20667 149412 -219413 429402 -305897 -46766 -105787 259463 -210214
12252 343290 208506 243347 -139374 -35064 39864 -362165 203519 311250 251315 -174584
12241 295461 20493 126789 308537 41648 -159968 -13718 79401 48512 29996 383519 407145
12230 407145 197585 -105764 155077 -57327 177595 -95565 257588 234847 151145 -32554
12219 144171 138711 225588 254919 129993 -92940 -4743 189397 23158 118763 -183382 83143
12207 469525 52998 127034 -27183 -243073 19461 91643 213235 333207 -143499 7994 115235
12196 115235 206973 178652 126327 227310 -227318 200136 31151 108915 78311 117815 -2726
$$ packed form
12274C48249J8354b5603k47524C93239a56301A62461a18241K5139c6094E7350
12263A67187o9140B0667J28745b19413D29402c05897d6766n9021B59463b10214
12252C43290j34784L4841a39374c5064C9864c62165B03519J07731n9935a74584
12241B95461B0493J06296J81748D1648a59968a3718G9401l0889j8516L53523K3626
12230D07145A97585a05764A55077e7327A77595i5565B57588k2741q3702c2554
12219A44171n460Q6877K9331j24926i2940d743A89397B3158R5605a83382H3143
12207D69525E2998P4036b7183k15890A9461P2182J21592J19972a43499G994J07241
12196A15235R1738k8321n2325J00983b27318B00136C1151P7764l0604L9504b726
$$ plain form
12184 -23369 202402 317544 70822 195464 -151560 105554 197128 -13904 345392 270138
12174 270138 358585 243018 394884 96231 185800 350262 256016 201054 -93787 37334 415370
12163 415370 195248 -163197 -91313 360602 153588 178565 59171 400714 -7710 404742
12152 67142 -181880 -67202 212785 207387 -106314 -125945 186880 55849 193974 183100 327579
12141 327579 127960 89450 62653 -87568 -27151 286138 85826 42662 -55631 130156 404040
12130 404040 -380074 -14493 250659 102700 -258257 -58697 90495 -18915 442719 18494
12119 19147 100614 180334 -188924 76259 47296 -6623 -43125 -19463 -39967 -48690 -119863 -22641
12106 6956 438189 127353 149484 -419899 -93625 -157521 261633 -48023 1164 -389194 -164894
$$ packed form
12184b3369B02402J15142G0822J24642a51560A05554R1574a3904C45392p5254
12174B70138Q8447j15567J51866I6231Q9569J64462r4246n4962i3787C7334L78036
12163D15370A95248a63197P1884C60602A53588K4977E9171L41543g710D04742
12152F7142a81880f7202B12785n398a06314j9631A86880E5849J38125j0874J44479
12141C27579A27960l8510k6797h7568b7151B86138H5826D2662e5631A30156K73884
12130D04040c80074a4493B50659A02700b58257e8697I0495a8915D42719A8494
12119A9147Q1467P9720a88924G6259k8963f623l6502a9463k0504q723p1173b2641
12106F956M31233A27353K2131d19899i3625o3896B61633d8023A164c89194a64894
$$ plain form
12094 -263574 2254 -78256 -372662 207155 275498 -233847 -34682 -62725 155070 30338 342091
12083 342091 70525 -59092 169345 2703 438410 -108145 96610 314134 758367 1632398
12073 1632398 941994 173476 127462 186442 158443 24736 -111667 -175962 -81797 350457
12062 -73481 -492796 97657 -414020 171051 -75363 -72553 201473 158407 270492 -89591 -25597
12050 -326562 135291 -95260 -97087 -129016 118024 126875 -29256 -212209 32162 311169 -163798
12038 -106851 -98368 -107901 -472290 -16547 199960 51211 37345 -188042 53429 -49062 -125059
12027 -125059 12415 -129173 44168 -159962 -276560 192811 375663 -193278 -37706 -19565
12017 -19565 306707 -252423 190079 -61026 6288 285661 -101600 55792 29717 -68575 -186232
$$ packed form
12094b63574B254g8256k94406B07155O8343b33847c4682k8043A55070C0338L11753
12083C42091G0525e9092A69345B703M35707a08145I6610K17524M44233Q74031
12073A632398o90404A73476m6014N8980k7999B4736a11667o4295h1797C50457
12062g3481m19315I7657d14020A71051g5363K810B01473m3066J12085h9591b5597
12050c26562A35291i5260j827l1929A18024Q851b9256j82953C2162K79007a63798
12038a06851Q483r533l64389a6547A99960E1211j3866a88042E3429d9062p5997
12027a25059A2415a29173D4168a59962j16598A92811J82852a93278c7706J8141
12017a9565C06707b52423A90079f1026F288K79373a01600E5792k6075f8575j17657
$$ plain form
12006 -186232 -19407 -164475 48300 -187701 16118 -30625 71170 -176358 -87856 -62813 -15601
11994 56767 -23785 -236966 175715 73287 75375 -47970 189724 240565 80467 87717 17008
11982 201861 173098 -57842 -45367 113549 -108944 -135921 -95496 -47616 -104503 -184950 21966
11970 182736 -576364 69433 -199480 -39672 96032 181533 -120673 -48215 95770 324078 313184
11959 313184 -38445 -279293 -165123 -188411 -172468 -23121 164460 171406 204589 117976 -260595
11947 319797 53472 223845 -149905 195671 148707 206233 -274915 -94103 24423 249062
11937 249062 31905 -48848 -293628 -3428 -73833 -213277 186574 -362586 132260 -4946 -173326
11926 -173326 -193608 -199796 -53471 27398 347028 -109416 394519 -196643 -114612 4471 -147076
$$ packed form
12006a86232a9407j45068D8300a87701A6118c0625G1170a76358h7856K5043a5601
11994E6767b3785k13181A75715G3287K088d7970A89724N0841H0467P250A7008
11982B01861k8763e7842J2475A13549a08944k6977M0425d7616n6887q0447B1966
11970A82736e76364F9433a99480c9672I6032Q5501a20673d8215I5770K28308j0894
11959C13184c8445k40848J14170k3288J5943b3121A64460O946L3183q6613b60595
11947C19797E3472J70373a49905A95671m6964N7526b74915i4103B4423K24639
11937B49062C1905d8848k44780c428p0405j39444A86574c62586A32260d946j68380
11926a73326k0282o188e3471B7398L19630a09416C94519a96643Q2031D471a47076
$$ plain form
11914 -130510 -193908 191819 -344455 -75037 328363 -30952 43470 -191090 189326 283323
11904 283323 -130159 -140292 -330700 159635 -361623 178351 220786 -167786 31712 127406
11894 127406 171998 137751 -81877 80457 101160 -173249 65724 -274389 -260910 181293 120856
11883 120856 151822 88910 -140495 -50588 -39533 119048 -167510 -225310 4692 -228352 -33688
11871 -42585 139222 117185 35008 -157735 81950 -168539 159142 188935 168546 -101771 -214628
11860 -214628 -205209 157005 -54929 -245359 116336 131259 89948 -209086 -243944 -249463 -177489
11849 -177489 1655 -419167 -67851 -229234 311181 -289292 1258 130741 13099 106532 -160275
11837 -114836 -193295 -110302 -35707 56247 -52450 -4388 -213436 12563 101072 -248496 -20167
$$ packed form
11914a30510o3398A91819c44455g5037C28363c0952D3470a91090A89326R3997
11904B83323a30159j0133j90408A59635c61623A78351M2435a67786C1712R5694
11894A27406M4592l4247h1877H0457K0703a73249F5724b74389J3479A81293o0437
11883A20856L0966o2912a40495e0588J1055A19048a67510n7800D692b28352c3688
11871d2585A39222k2037C5008a57735H1950a68539A59142K9793k0389a01771j12857
11860b14628R419A57005e4929j90430A16336J4923m1311b09086l4858n519P1974
11849a77489A655d19167f7851j61383C11181b89292A258J29483A3099R3433a60275
11837a14836p8459Q2993c5707E6247e2450d388k09048A2563Q8509b48496b0167
$$ plain form
11825 -225332 -219119 30402 -239748 -110535 -102531 -303150 34349 135643 -124012 192679 -304609
11813 13376 -86593 -171098 69637 -183344 6815 93906 -71841 38554 -145463 116783 -188288
11801 -129236 -99951 27913 -36780 3538 138071 -8391 -98231 -348423 -78787 170404 -194520
11789 185242 -190582 -110028 8205 -182237 87666 30943 -29895 120772 38083 -63366 -135690
11778 -135690 -61963 114584 75675 76675 229290 157293 -181764 -130520 -173377 10872 -131574
11766 -197377 -232485 -20478 199406 68614 28649 -102492 90315 -180956 293705 -230769
11755 -316 70023 -115941 -22226 245601 -300360 286783 -384329 25844 268917 92240 -47567
11743 -320244 31797 59227 -76324 91924 -112296 126643 6347 360561 126128 103083 -71275
$$ packed form
11825b25332O213C0402b39748a10535Q004k00619C4349J01294a24012A92679c04609
11813A3376h6593q4505F9637a83344F815Q7091g1841C8554a45463A16783a88288
11801a29236K9285B7913c6780C538J34533h391q9840k50192g8787A70404a94520
11789A85242a90582Q0554H205a82237H7666C0943b9895A20772C8083f3366p2324
11778a35690f1963A14584l8909J000J52615p1997a81764N1244m2857A0872a31574
11766a97377l5108b0478A99406F8614B8649a02492I0315a80956B93705b30769
11755c16G0023a15941b2226B45601c00360B86783c84329B5844K43073I2240d7567
11743c20244C1797K7430g6324I1924a12296A26643F347L54214A26128k3045g1275
$$ plain form
11731 76084 -11784 93896 -124950 -107507 219933 82424 -181774 155128 60792 -193525 -285779
11720 -285779 -61936 -38409 -231496 141912 -6147 246160 -225899 230904 354333 42671
11709 -71374 5240 -47765 202231 185174 -349223 -219646 37968 198449 -108356 28217 480053
11698 480053 -219784 140912 42614 -32696 -154376 350164 29125 -71342 -74548 -84604 188644
11686 -76637 -162098 -8396 115931 80164 294064 -171644 272346 63075 -88569 -29682 -69845
11675 -69845 107443 -279719 94473 319692 -253408 -151484 -12747 289301 81596 85662 -35600
11663 -96223 115902 -148008 -31223 -28229 101775 49585 -315257 146080 -132706 -58616 -62432
11652 -62432 55329 45566 -165560 170463 -216616 -58222 240683 -256210 -88887 181281 -44594
$$ packed form
11731G6084a1784I3896a24950J7443B19933H2424a81774A55128F0792a93525r2254
11720b85779f1936K3527j93087A41912f147B46160b25899B30904J23429D2671
11709g1374E240d7765B02231j7057c49223J29577C7968J60481a08356B8217M51836
11698D80053b19784A40912D2614c2696j21680C50164B9125g1342l206j0056A88644
11686g6637q5461h396A15931l5767K13900a71644B72346F3075h8569b9682m0163
11675f9845A07443b79719I4473K25219b53408J01924a2747B89301H1596M066c5600
11663i6223A15902a48008c1223K994A01775D9585c15257A46080a32706e8616l816
11652f2432E5329r763a65560A70463b16616e8222B40683b56210h8887A81281d4594
$$ plain form
11640 -54643 7726 -107594 -75956 -49430 132232 -171298 221922 -118653 -327478 365725
11629 -20954 30285 306698 252499 74381 126304 -25003 -1735 -157497 133472 29230 -364987
11617 243167 148131 -214383 -167734 175715 281219 -195540 18974 9626 -119532 -161 73486
11605 323310 -103941 143444 -36122 58789 360957 141853 104610 -27849 -73435 -31465 58582
11593 8662 38687 -6463 -36174 -50272 -74131 -36496 150481 -161019 174364 -36374 11314
11581 10356 92661 62394 -24527 -140420 107441 -392427 85706 -100347 -62505 172294 -80132
11569 -2019 95667 86256 192239 202636 48980 -310703 181323 41365 210981 259835 -92031
11557 11077 -236707 510670 -81419 181710 -273562 225695 31410 -22361 -211897 -47153
$$ packed form
11640e4643G726a07594L1638K6526A32232a71298B21922a18653k08825C65725
11629b0954C0285K76413n4199G4381N1923b5003a735j55762A33472B9230c64987
11617B43167r5036b14383M6649A75715J05504a95540A8974r348a19532a61G3486
11605C23310a03941A43444c6122E8789L02168A41853l7243b7849m5586c1465E8582
11593H662L0025f463k9711j4098k3859c6496A50481a61019A74364c6374A1314
11581A0356Q2305l0267b4527j15893A07441c92427H5706a00347L7842A72294h0132
11569b019I5667r411J05983J0397D8980c10703A81323D1365J69616M8854i2031
11557A1077b36707E10670h1419A81710b73562B25695C1410b2361j89536d7153
$$ plain form
11546 -97101 1536 -69887 37234 312434 216309 -132312 139867 107520 -260068 74112 34101
11534 44208 -5256 98947 -85151 193901 1959 -70376 38534 174406 167097 260175 198506 -503042
11521 195088 28485 -98728 1589 44667 299030 301407 6659 -6416 31630 -94552 96134 76603
11509 76603 165586 318344 -125506 68709 62963 -105693 420135 -87390 -274381 -185567 197326
11497 182442 -129720 295365 154982 70950 64599 13387 -175380 127089 -65858 92647 -104886
11485 89144 -193978 -3609 -119068 -213156 -40079 513148 70575 10202 9441 -22407 4386 230623
11473 230623 212756 163328 -6947 -92113 75938 -76503 -131730 493477 224027 -206703 56177
11461 -104483 3254 -258856 -342653 406945 -36395 181312 -40786 48832 -416455 -6561 91226
$$ packed form
11546i7101A536f9887C7234K75200r6125a32312A39867l2347b60068G4112C4101
11534D4208e256I8947h5151A93901A959g0376C8534J35872p309R3078o1669e03042
11521A95088B8485i8728A589M3078K54363K377F659f416C1630i4552I6134j9531
11509G6603Q8983J52758a25506F8709n746a05693D20135h7390j86991Q8814A97326
11497A82442a29720B95365j40383G0950o351A3387a75380A27089f5858I2647a04886
11485H9144a93978c609j15459r4088d0079E13148G0575A0202p61b2407D386K26237
11473B30623j7867m9428f947q5166G5938g6503n5227D93477B24027b06703E6177
11461a04483C254b58856q3797D06945c6395A81312d0786D8832d16455f561I1226
$$ plain form
11449 98727 142378 125990 -146249 50048 -123927 53110 277529 70944 194151 -71581 -101491
11438 -101491 189339 69239 135273 298800 179148 215339 -19946 -62787 77355 -243620 258715
11426 -111889 -31143 -421977 -87564 117396 -58592 -95412 -73276 -132968 67654 188790 -25085
11414 201080 -144063 206614 -80604 -111044 -39881 61717 -61542 92246 152732 37785 38859
11403 38859 35671 110578 256683 -177414 -44298 269464 332647 -31430 345185 440999 143976
11391 150965 -28175 3645 -74186 146317 -3790 -170830 314650 -96638 -228179 -182180 -73174
11379 -186555 -141052 139659 172742 -64440 -9348 365147 -208485 -216898 476254 -305909 -37572
11367 -164749 -193220 -106266 -56386 -45374 -113440 -308392 200578 -81579 -382430 42518 -194984
$$ packed form
11449I8727M3651j6388a46249E0048a23927E3110K24419G0944J23207g1581k9910
11438a01491A89339F9239O6034J63527j19652L6191a9946m2841G7355b43620B58715
11426a11889c1143l90834h7564A17396e8592l6820K2136n9692F7654J21136b5085
11414B01080a44063B06614h0604l0440c9881F1717f1542I2246O0486C7785J074
11403C8859l188P4907J46105a77414d4298B69464O3183c1430C45185R5814A43976
11391A50965b8175C645g4186A46317c790j67040C14650i6638j31541M5999g3174
11379a86555M5503A39659L3083f4440i348C65147b08485q413D76254c05909c7572
11367a64749k8471Q6954M9880J1012o8066j94952B00578h1579l00851D2518a94984
$$ plain form
11355 178130 -62731 -131891 8715 -44674 64152 -179775 -205759 52878 217296 6137 -15043
11343 -141695 -408982 -36451 -40347 147067 -63574 275893 -193590 237257 -59377 -72411 -249716
11332 -249716 -190149 -107149 -75150 -79355 216145 44586 205767 54485 -282347 53198 20973
11320 194808 30633 -149147 31391 123451 -113899 -189908 -2046 -493 -176055 357396 71879
11308 -17146 275060 313584 -197338 -326205 -212116 8482 61230 63700 267188 -219197 78182
11296 -151396 -135272 -117586 56008 -240113 -32424 -405691 56407 -100281 -285993 -58233 55820
11284 59960 126714 -353339 -137967 -56934 14864 -117144 52569 216869 -182698 -33069 271937
11272 118903 -139257 90489 20235 -29947 69430 21392 -225267 -116361 -137002 -31450 -132596
$$ packed form
11355A78130f2731o9160H715d4674F4152a79775k5984E2878J64418F137a5043
11343a41695k67287c6451l896A47067f3574B75893a93590B37257e9377j3034j77305
11332b49716N9567Q3000L1999m205B16145D4586J61181E4485b82347E3198B0973
11320A94808C0633a49147C1391R2060a13899p6009b046d93j75562C57396G1879
11308a7146B75060L8524a97338j28867J14089H482N2748K470K03488b19197G8182
11296a51396J6124J7686E6008b40113c2424l73267E6407a00281j85712e8233E5820
11284E9960O6754c53339a37967e6934A4864a17144E2569J64300a82698c3069B71937
11272A18903a39257I0489B0235b9947F9430B1392b25267J08906k0641c1450j01146
$$ plain form
11261 -132596 -137711 -101798 -190807 43566 -81572 -102557 -280686 -92641 -8517 142041 -115544
11249 62291 17763 -38816 -396920 -242623 31859 19735 -109068 -73252 -34385 21902 -73751
11237 -159134 173151 42365 96700 -55072 -91054 -221974 139081 2031 -202554 -123203 -153649
11226 -153649 55487 14923 129842 231264 177970 -101863 -22850 35204 -203898 -123957 -59674
11214 157797 53873 -172895 -258148 -72031 239703 -78410 -177650 -335165 13834 43729 -21048
11202 -85295 -47700 11290 -169291 159119 63970 -226327 -113604 62237 -303430 -165712
11192 -165712 230957 -121819 -206042 -308586 154273 -242810 -32716 66762 -5844 57201 -154863
11180 25494 356632 -228105 150673 -177665 -122894 -143405 -61774 -73038 312295 112865
$$ packed form
11261a32596n115L5913q9009D3566h1572k0985j78129i2641h517A42041a15544
11249F2291A7763c8816l58104J54297C1859j2124a09068L5816c4385B1902g3751
11237a59134A73151D2365N4335e5072l5982j30920A39081B031b02554P9351l0446
11226a53649E5487A4923J14919J01422n3294a01863b2850C5204b03898P9941e9674
11214A57797E3873a72895q5253g2031B39703g8410r9240j57515A3834K9895b1048
11202h5295L7595A1290a69291A59119F3970b26327J12723F2237c03430J37718
11192a65712B30957a21819q4223j02544A54273b42810c2716F6762e844E7201a54863
11180B5494L31138b28105A50673a77665N4771k0511f1774j1264C12295A12865
$$ plain form
11169 -147463 -55515 10969 -309840 -179879 52052 -306206 50175 -31169 263903 -13666 -42985
11158 -42985 -147412 -231075 -64427 -20863 -166120 66474 -29393 112913 119136 21648 118216
11147 118216 170086 118133 136091 270602 -99813 164975 -49144 -55263 -197650 182234 1522
11135 85341 208334 173975 93439 191136 148777 -8947 184252 136644 157316 -199825 253387
11123 112313 545459 111369 98646 -44240 107173 349368 87034 213610 -109057 -134952
11113 -134952 48788 162256 223702 -509013 55768 117503 144397 150077 220374 128090 176503
11102 176503 133220 111148 -53050 59490 -156107 -274710 307385 -37176 -178412 187624
11091 -105003 246401 189849 -48889 86091 69332 9877 293337 83370 91292 32316 179120
$$ packed form
11169a47463e5515A0969c09840J29961E2052c06206E0175c1169B63903a3666k9319
11158d2985j04427q3663f4427b0863j45257F6474b9393A12913O223B1648R6568
11147A18216N1870n1953J7958J34511i9813A64975d9144o119j42387A82234A522
11135H5341J22993l4359q0536R7697m2359h947A84252m7608K0672a99825B53387
11123A12313M33146A11369j2723d4240A07173K42195H7034J26576a09057k5895
11113a34952D8788J13468O1446e09013E5768O1735K6894N680P0297r2284M8413
11102A76503m3283k2072e3050E9490a56107j18603C07385c7176j41236A87624
11091a05003B46401n6552d8889H6091j6759I877K83460H3370P922C2316J46804
$$ plain form
11080 179120 124822 169128 207328 -12323 81146 162303 332310 274943 53117 152582 267166
11069 267166 455059 341945 230842 128015 631526 150575 253014 419675 277377 409011
11059 409011 187154 682737 734720 552028 380917 388714 373141 567510 399185 599979
11049 599979 647661 585078 522192 556172 510664 394784 691860 656919 329077 616294 442135
11038 442135 539192 527822 289228 619679 579783 397196 678704 213209 526054 680092
11028 680092 622963 311311 732726 587918 638522 878533 291181 619565 597562 243185
11017 701168 270541 285754 576640 228762 514337 420254 314629 400930 586763 522675
11007 522675 366230 534955 695367 631478 322742 131613 521318 654230 541721 681440
$$ packed form
11080A79120n4298M4306L8200a2323H1146Q1157J70007n7367E3117R9465J14584
11069B67166J87893j13114j11103j02827N03511A50575J02439J66661j42298J31634
11059D09011A87154M95583N1983j82692j71111P797j5573J94369j68325K00794
11049E99979M7682o2583o2886L3980m5508j15880K97076l4941l27842K87217j74159
11038D42135R7057j1370k38594L30451l9896j82587K81508B13209L12845J54038
11028F80092n7129C11311M21415j44808N0604K40011B91181L28384k2003B43185
11017G01168B70541J5213K90886B28762K85575r4083j05625Q6301J85833o4088
11007E22675j56445J68725J60412o3889l08736A31613L89705J32912j12509J39719
$$ plain form
10997 681440 473016 568373 627894 566257 529618 522110 661802 671109 552234 653980 487933
10986 487933 549009 551427 922212 841162 982415 880915 928159 1118799 1248099 1051928
10976 1051928 1351257 1498787 1423856 1859262 2098661 2135722 2437120 2296278 2167895 2029089
10966 2029089 1809451 1588732 1360783 1241298 1336641 1398473 1136793 1312389 1442351 1144251
10956 1144251 1246103 1225496 1465414 1355798 1107450 711361 853398 702264 571050 29420
10945 358793 517133 194144 307327 215400 135960 336802 245314 53024 223344 -123305
10934 -257050 -49184 -91727 127961 -66220 -222717 315799 48353 -171183 99237 395475
10924 395475 -121110 -116814 -63736 365419 -167823 139058 182330 79703 195700 -315276
$$ packed form
10997F81440k08424R5357N9521o1637l6639p508J39692R307j18875J01746j66047
10986D87933O1076K418L70785q1050J41253j01500M7244J90640J29300j96171
10976A051928K99329J47530p4931M35406K39399L7061L01398j40842j28383j38806
10966B029089k19638k20719k27949j19485R5343O1832k61680J75596J29962k98100
10956A144251J01852k0607K39918j09616k48348l96089J42037j51134j31214B9420
10945C58793J58340A94144J13183r1927p9440K00842r1488E3024J70320a23305
10934b57050d9184m2543A27961f6220j56497C15799D8353a71183I9237K96238
10924C95475a21110M296N3078C65419a67823A39058M3272G9703J15997c15276
$$ plain form
10913 58805 -88513 5271 -14619 8564 -45745 12936 111703 98663 -64507 74261 266219 174091
10901 174091 -77441 113483 -187019 7937 227437 138785 57842 -108837 183459 542669
10891 542669 -18153 -242677 106518 -125313 -142385 59269 -22180 261509 -82166 137309
10880 -53988 -160740 -273725 14357 -182167 131735 -79943 50213 -94711 135260 340018
10870 340018 64793 89957 60623 -99065 170664 -255846 253602 -221178 252412 -246213
10859 338540 22744 -107874 -169051 68646 -361799 -29566 378405 19231 67813 -110934 -231806
10848 -231806 -296704 -171896 59282 -60185 60682 -232151 -316897 -112808 46892 -4809 -20084
10837 -20084 -166113 -91981 -17072 59466 -69978 33764 309161 -244273 -144542 -167619 -1166
$$ packed form
10913E8805h8513E271a4619H564d5745A2936R8767j3040f4507G4261J91958r2128
10901A74091g7441A13483a87019G937K19500q8652E7842a08837A83459L59210
10891E42669a8153k24524A06518a25313j7072E9269b2180B61509h2166A37309
10880e3988j06752j12985A4357a82167A31735g9943E0213i4711A35260K04758
10870C40018F4793K5164k9334i9065A70664b55846B53602b21178B52412b46213
10859C38540B2744a07874o1177F8646c61799b9566C78405A9231M8582a10934j20872
10848b31806o4898J24808E9282f0185F0682b32151q4746a12808D6892d809j5275
10837b0084j46029P4132a7072E9466f9978C3764K75397b44273R9731k3077a166
$$ plain form
10825 -63943 94999 -324265 -3536 48113 -51682 -137970 -69079 192535 -238837 -144033 165784
10813 -228260 -42636 -144101 -19263 112784 -1134 -233024 -274083 -196273 -82526 -383888 -62242
10801 -65382 -163735 242332 91503 -250289 60557 330184 -127519 -228564 17558 97949 214449
10790 214449 207631 141207 -79289 -51006 179549 -55952 -105328 82853 23871 164839 148224
10779 148224 44414 -233118 146676 264288 -68858 177097 -65517 -394343 23313 23780 -160459
10767 27375 -14850 -72299 -424149 -88231 -39075 -208509 26475 -195 -318504 -69812 -252164
10756 -252164 -37847 -74688 -136412 -114310 -259141 95270 -231784 -87975 -33093 -99060 -125716
10745 -125716 -64190 -64755 101304 50190 -81210 177966 -97352 -320272 -100457 -56150 17074
$$ packed form
10825f3943I4999c24265c536D8113e1682q6288O8891A92535b38837R4804A65784
10813b28260d2636j01465a9263A12784a134k31890m1059P7810h2526l01362f2242
10801f5382r8353B42332I1503b50289F0557K69627a27519j01045A7558Q0391J16500
10790B14449o818o6424g9289K8283A79549e5952m9376H2853B3871J40968j6615
10779A48224D4414b33118A46676J17612f8858A77097f5517l28826B3313M67a60459
10767B7375a4850n7449l51850h8231c9075j69434B6475a95l18309f9812j82352
10756b52164c7847l6841o1724K2102j44831I5270b31784h7975c3093o5967k6656
10745a25716O1526n65A01304E0190h1210A77966i7352k22920a00457M4307A7074
$$ plain form
10733 -166604 144390 -283470 -190777 -350736 -154955 -72709 -193595 -242011 -149912 -134701
10723 -134701 47418 -417329 -210871 -95751 41957 -252428 62578 -288018 -95881 254821
10712 -56574 -8394 -96103 243364 -9870 325331 -147885 -113028 185257 -167312 -279761 54763
10700 -290524 94387 -13026 -44947 258015 113919 -40247 -238942 75581 -103169 138316
10689 100455 -97406 -39218 -136536 -75732 -131214 -132511 68415 -148331 31899 -322178 155023
10677 -260739 18392 200167 -99205 -55108 196569 -210205 385371 89153 -132379 -197627
10667 -197627 133456 -208119 -98018 -224600 -39676 -97898 -54026 312267 -141180 -13988
10656 -18128 -97128 125607 -218493 37880 -120542 -267144 213389 -58188 -145934 -150246 -85738
$$ packed form
10733a66604A44390b83470R2693j59959a54955g2709j20886m8416R2099J5211
10723a34701D7418d17329K06458i5751D1957b52428F2578b88018i5881B54821
10712e6574h394q7709B43364i870C25331a47885L4857A85257a67312j12449E4763
10700b90524I4387a3026l1921B58015A13919d0247j98695G5581a03169A38316
10689A00455i7406c9218r7318O0804n5482j297F8415a48331C1899c22178A55023
10677b60739A8392J81775i9205M4097A96569b10205C85371H9153a32379o5248
10667a97627A33456b08119i8018j26582c9676n8222M3872C12267a41180a3988
10656a8128p9000A25607b18493C7880a20542j46602B13389e8188q7746m312O4508
$$ plain form
10645 -85738 133285 11000 -27064 -114416 139095 45479 -3423 129966 202893 -140426 -145800
10634 -145800 139166 307525 -247068 253827 -126889 183449 -94442 114725 -85642 -19080
10623 -260313 277462 -109660 -137789 -100890 -41907 -89307 246104 -119306 -26157 -202406
10613 -202406 -380664 -83544 -115383 -64355 229714 -54673 -11589 -21246 -202799 9386 97033
10602 97033 278471 242817 59369 -71607 105434 -224803 -401690 -73741 28799 145434 136909
10591 136909 78164 -112803 48210 -100402 -185018 -68987 -41887 -164016 -146707 75610 23546
10579 -609415 -76996 -127485 85749 61109 108721 -62622 -106051 236205 -78291 -43786 187185
10567 85902 -295743 176553 311507 -119900 107434 -276667 2985 -165993 61112 243645
$$ packed form
10645h5738A33285A1000b7064q7352A39095D5479c423A29966P2927a40426n374
10634a45800A39166J68359b47068B53827a26889A83449i4442A14725h5642a9080
10623b60313B77462a09660k8129L6899d1907m7400B46104a19306b6157j76249
10613b02406j78258h3544l1839N1028B29714e4673a1589r657j81553I386Q7647
10602I7033J81438l5654E9369g1607A05434b24803j76887g3741B8799J16635q525
10591A36909n8745a12803D8210a00402q4616f8987K7100j22129J7309G5610B3546
10579f09415g6996n0489H5749k4640M7612f2622m3429B36205g8291L4505A87185
10567H5902b95743A76553J34954a19900A07434b76667B985a65993F1112J82533
$$ plain form
10557 243645 -56741 -63654 -115380 -87136 -77292 268665 -379617 -101839 52026 692 268225
10546 268225 -93431 169267 -202783 193985 2353 -154811 92207 -111517 -407468 213113
10535 -147932 37324 -314374 -329668 147966 -194601 -68969 -40303 -23727 123811 -18606 136342
10523 -122879 88397 35735 56638 -468009 -158947 -165766 -227421 -151111 158719 -28316 -111778
10512 -111778 -35131 -23562 -135125 178047 -33245 -87245 51725 -145747 -93142 134996 135430
10501 135430 78312 91817 -73348 -182638 -81823 -55310 -11425 -343610 273954 446401 -68582
10489 -332910 -237956 56274 -242041 -259511 202857 204693 -62555 365923 -89617 -124877 393710
10477 363629 179196 53396 -35316 -225861 90865 -23468 -76244 -82845 430192 64587 103046
$$ packed form
10557B43645e6741o913n1726K8244R844B68665c79617a01839E2026F92K67533
10546B68225i3431A69267b02783A93985B353a54811I2207a11517k95951B13113
10535a47932C7324c14374j5294A47966a94601f8969K8666J6576A23811a8606A36342
10523a22879H8397C5735K0903d68009a58947o819o1655P6310A58719b8316q3462
10512a11778c5131J1569j11563A78047c3245n4000E1725a45747N2605A34996M34
10501A35430n7118J3505g3348j09290h1823K6513a1425l32185B73954J72447f8582
10489c32910R4954E6274b42041j7470B02857J836f2555C65923h9617l5260C93710
10477C63629A79196E3396c5316j90545I0865b3468n2776o601D30192F4587L8459
$$ plain form
10466 103046 -172619 251866 -335908 15622 65340 -7152 -273733 51644 -100481 -162912 -99559
10455 -99559 58639 35718 253299 -251672 -68236 50007 -111743 119548 -49391 -332736 -259067
10444 -259067 12839 1301 -67121 24986 118137 -76280 -192679 46690 -24236 72482 9283 -192117
10431 107229 77329 -312475 -26584 36839 -48253 82669 -67506 182535 -205569 -80254 30960
10419 64809 -73176 -28188 -78931 -27236 -202624 -68832 -170999 56584 162725 365450 -175173
10407 -174170 -135960 393179 -174397 48169 -153656 -257301 -28816 -209468 -11346 -91140
10397 -91140 324760 10221 -315040 198085 -65463 11591 164381 -58342 102730 266188
10387 266188 97240 7757 -66275 -14068 -45913 -68397 39157 113271 35251 -20689 147826
$$ packed form
10466A03046a72619B51866c35908A5622M9718g152k66581E1644a00481o2431O3353
10455i9559E8639k2921K17581b51672f8236E0007a11743A19548d9391k83345P3669
10444b59067A2839A301f7121B4986R3151g6280j16399D6690b4236G2482I283a92117
10431A07229k9900c12475b6584C6839d8253H2669f7506A82535b05569h0254C0960
10419F4809g3176b8188n0743b7236j75388f8832j02167E6584J06141K02725a75173
10407a74170L8210C93179a74397D8169a53656j03645b8816j80652a1346p9794
10397i1140C24760A0221c15040A98085f5463A1591J52790e8342A02730J63458
10387B66188I7240G757f6275a4068l1845k2484C9157P4114C5251b0689A47826
$$ plain form
10375 196462 17678 385811 376817 -47973 112316 229962 48293 -22707 200227 148139 465027
10364 465027 217297 304846 348249 201932 219145 -19423 203590 494351 187495 207744
10354 207744 441869 -79638 -294229 278527 306701 513356 301002 275214 82558 225120
10344 225120 160126 376173 231462 299499 111393 -130379 40501 49473 -49689 300209 119140
10332 200763 220204 226496 524288 -157758 -184819 -91249 -46308 210919 -68142 67555 67441
10321 67441 -176500 254325 -126904 76642 339281 215921 -48506 -107020 68640 31192 155811
10310 155811 -237407 235832 37907 166286 -170985 26158 15660 33476 52980 -193704
10299 -92075 160949 -37092 -47428 -73435 172924 -192994 -171478 -15917 191711 164814 -229235
$$ packed form
10375A96462A7678L68133q994d7973A12316J17646D8293b2707B00227n2088L16888
10364D65027B17297Q7549M3403j46317J7213a9423B03590K90761A87495K0249
10354B07744K34125g9638k14591B78527K8174K06655k12354k5788H2558J42562
10344B25120o4994K16047j44711O8037A11393a30379D0501Q972d9689C00209A19140
10332B00763J9441O292K97792a57758k7061i1249M4941B10919f8142F7555j14
10321F7441a76500B54325a26904G6642K62639j23360d8506n8514F8640C1192J24619
10310A55811b37407B35832C7907J28379a70985B6158j0498J7816J9504a93704
10299i2075A60949c7092j0336k6007A72924a92994K1516a5917A91711k6897b29235
$$ plain form
10287 -220137 203341 -318747 -20693 135103 39136 329571 -138642 11516 214299 87960
10276 -251640 -219090 -15681 169308 -216720 -15301 79408 127511 1835 -1659 5190 48452 -237282
10263 14348 89701 140864 238584 -50342 -97155 163643 265749 464915 259551 8688 -99334
10251 139159 202207 202143 -39361 52861 315172 -104415 41455 45180 -127406 129134 378833
10240 378833 -278928 39405 -217272 93799 -352663 330925 73610 -116497 -9125 -207514
10230 -207514 284580 257010 183198 117648 -194350 -56223 -63222 -194038 190316 108159 -258153
10218 158005 -78581 -264435 -45083 -238971 137705 -9817 -303919 -111651 -278862 94025
10207 -258820 -311258 49851 -36040 -299211 282236 -138659 194623 -210266 409357 -82620
$$ packed form
10287b20137B03341c18747b0693A35103C9136K90435a38642A1516K02783H7960
10276b51640L2550a5681A69308b16720a5301G9408M8103A835a659E190M3262b37282
10263A4348P5353N1163R7720e0342m6813A63643J02106J99166k05364H688i9334
10251A39159O3048o4c9361E2861K62311a04415D1455L725a27406A29134K49699
10240C78833b78928C9405b17272I3799c52663C30925G3610a16497i125j98389
10230b07514B84580k7570p3812o5550a94350e6223o999j30816A90316q2157b58153
10218A58005g8581j85854d5083j93888A37705i817k94102a11651j67211I4025
10207b58820n2438D9851c6040k63171B82236a38659A94623b10266D09357h2620
$$ plain form
10196 89578 -17180 172552 -234548 -241301 -355340 50629 281766 -317729 124665 -141968
10185 -4305 -57262 154094 -216127 -233892 -101655 -77065 69608 -9054 -96929 217199 -6923
10173 -20396 156999 -146590 -3019 -122438 -120288 24925 126621 13681 392752 -12200 -52655
10162 -52655 33650 -130158 -218104 -241438 -17670 -132244 1304 109694 24744 119156 204911
10151 204911 262139 -228694 246660 97925 -216950 -205635 -24542 94908 -216397 -307538 151642
10139 -333114 -719 -67664 -205605 -383773 47316 152039 -104351 -388493 50914 -103269 -261819
10128 -261819 319946 98606 -139847 -140900 -41634 -64344 -131 155246 -33226 -267733 84129
10116 237176 33147 -202768 -148956 -432049 -93226 52494 -118618 -60 -186354 83213 -34163
$$ packed form
10196H9578a7180A72552b34548o753j14039E0629K31137c17729A24665a41968
10185d305n2957A54094b16127j7765a01655K4590F9608i054q7875B17199f923
10173b0396A56999a46590c019j19419K150B4925J01696A3681L79071a2200m0455
10162e2655C3650a30158q7946k3334a7670j14574A304J08390B4744R4412Q5755
10151B04911N7228b28694B46660I7925b16950J1315b4542I4908b16397r1141A51642
10139c33114g19o6945j37941j78168D7316J04723a04351k84142E0914a03269j58550
10128b61819C19946I8606a39847j053d1634k2710a31A55246c3226k34507H4129
10116B37176C3147b02768N3812k83093i3226E2494a18618f0j86294H3213c4163
$$ plain form
10104 -263228 -55094 -395713 -321342 -136621 -260916 116929 -149768 22656 -316389 -204926
10094 -204926 -281248 8979 91582 217264 -9489 233391 153172 8544 -196810 -129589 -396725
10083 -396725 -95346 -96807 -210650 -319899 -226633 -94953 115121 -249456 -215946 -40793 11050
10071 -250878 -246727 -117816 -86992 84493 -50587 18078 -233965 -93492 159441 -169188 133859
10059 -84116 -262890 -2009 227125 -188627 34680 159643 -214369 40549 132178 97398 -307708
10047 -86673 -206708 -93200 -99341 -264634 -348997 92048 -103686 -478794 -164536 -62748 -52686
10036 -52686 -173124 -121261 4036 -82764 49853 -32583 -102335 -133852 -52547 166412 -111283
10024 22345 90503 234054 90451 -55065 -191956 -63955 -121305 250659 -53009 -69649 -7869
$$ packed form
10104b63228e5094l40619P4371a36621j24295A16929a49768B2656c16389J11463
10094b04926p6322H979Q2603J25682i489B33391q0219H544a96810O7221k67136
10083c96725i5346j461j13843j09249R3266i4953A15121b49456L3510d0793A1050
10071b50878M151a17816L0824H4493e0587A8078b33965i3492A59441a69188A33859
10059h4116j78774b009B27125a88627C4680J24963b14369D0549R1629l4780c07708
10047h6673j20035i3200o141j65293q4363I2048a03686l75108a64536f2748J0062
10036e2686j20438N1863D036h2764D9853c2583o9752l1517e2547A66412a11283
10024B2345O8158J43551I0451e5065j36891f3955n7350B50659e3009j6640g869
$$ plain form
10012 -479397 -69479 170399 229266 7655 -290522 -74929 -129015 -158106 -144460 52631 -169353
10000 141312 60198 178088 19929 -202983 -25853 -133950 110077 101920 111255 141564 44564
9988 -239814 -97344 -179479 -201759 -201154 108995 33756 -261379 -317976 190383 -33260 202951
9976 -135825 -102356 -56926 -55689 -70326 -153699 -94456 -93818 61823 181820 -41785 -198009 -36271
9963 -183855 -68084 -191888 -510841 87696 -239549 9076 250161 -319626 -228779 -444272 -86507
9951 4684 765 174472 112669 -160023 -18306 28347 115133 -405459 143972 -62425 -86061 28199
9938 -57836 -8166 -230721 -150782 -267750 116734 -283064 -186931 -78196 6862 -446543 8248
9926 -35369 -80531 225356 -77780 102434 131777 73493 -99635 -283848 -38826 160612 64703
$$ packed form
10012d79397f9479A70399N8867G655b90522g4929n4086k9091J3646E2631a69353
10000A41312F0198J17890A9929b02983b5853j08097A10077q157R335L0309D4564
9988b39814i7344q2135k2280O05A08995C3756b61379n6597A90383c3260B02951
9976a35825L3469M5430J237j4637q3373N9243O38F1823J19997d1785j56224c6271
9963a83855f8084j23804l18953H7696b39549I076K41085c19626R0847k15493h6507
9951D684G65J73707o1803a60023a8306B8347Q6786d05459A43972f2425k3636B8199
9938e7836h166k22555P9939j16968A16734b83064R6133g8196F862d46543H248
9926c5369m5162B25356g7780A02434K9343n8284i9635j84213c8826A60612F4703
$$ plain form
9914 31449 65604 -208045 106710 35431 324079 -204944 -148109 91348 -88256 66598 -149927
9902 -256485 34474 322046 -3927 -258394 -75102 -107556 -123794 118277 -110356 -110687 -9692 -94766
9890 -94766 -106639 -192598 179248 10851 -399056 -242319 -197249 -304144 -156594 76121 128197
9879 128197 -200238 -238098 27668 74109 -48022 173768 -112036 -225601 55559 10272 189377
9868 189377 309665 356749 -261886 241984 -179670 -32986 82708 -184404 205983 -179965
9857 -134347 33830 162937 318188 -305466 -202850 49569 -294449 17615 -214179 -424803
9847 -424803 -130135 -126499 -95864 -225886 222569 -131660 -193387 178803 -178409 -200765 -297132
9836 -297132 -224485 -376023 141183 -254030 -97772 107936 -118437 60941 26004 -224008
$$ packed form
9914C1449L4155b08045A06710C5431K88648b04944N6835I1348h8256F6598a49927
9902b56485C4474K87572c927k54467g5102l2454j6238A18277a10356l31i692q5074
9890i4766j1873q5959A79248A0851c99056J56737M5070j06895J47550G6121N2076
9879A28197b00238l7860B7668M6441d8022A73768a12036j13565E5559A0272J79105
9868A89377J20288M7084b61886B41984a79670c2986H2708a84404B05983a79965
9857a34347C3830J29107J55251c05466J02616D9569b94449A7615b14179k10624
9847d24803a30135L636L0635j30022B22569a31660o1727A78803a78409k2356r6367
9836b97132P2647j51538A41183b54030i7772A07936a18437F0941B6004b24008
$$ plain form
9825 -261960 -195552 87026 25310 9506 77619 -75286 -302566 -184609 -60076 47148 -202997
9813 -455949 111593 198994 -42941 9630 -414487 8708 -229652 -234662 195728 -69719 267211
9801 -155321 -75158 285290 151840 -165489 -164874 118099 -43065 64095 -166643 242707 -53010
9789 49283 -68795 -78678 -214020 41866 -130460 -16666 67743 -132367 -130527 -162565 126255
9777 -60877 187500 -257712 -74021 -90795 -272745 -16028 -199353 19746 -25213 -65492 -274179
9766 -274179 -229556 -351210 -56617 15695 53138 -114015 -209319 6424 -134637 -23842 208737
9754 246570 -128614 80956 135570 -281730 -447510 44774 385730 -116657 -418864 94622
9743 -184027 -137003 -100048 -100668 -206046 -40449 -408846 61680 30977 -336645 -43634 -191350
$$ packed form
9825b61960O6408H7026B5310I506O8113g5286k27280J17957f0076D7148b02997
9813d55949A11593Q7401d2941I630d14487H708b29652n010A95728f9719B67211
9801a55321g5158B85290j33450a65489O15A18099d3065F4095a66643B42707e3010
9789D9283f8795r883j35342D1866a30460a6666F7743a32367J840l2038A26255
9777f0877A87500b57712g4021j6774j81950a6028j83325A9746b5213m0279k08687
9766b74179M4623j21654e6617A5695L7443a14015r5304F424a34637b3842B08737
9754B46570a28614H0956N4614b81730j65780D4774L40956a16657l02207I4622
9743a84027M7024L6955o20j05378d0449l68397F1680l0703c36645d3634j47716
$$ plain form
9732 -191350 -10722 -6847 -137950 196759 -98420 -17139 -28026 34644 -49633 53155 118523
9721 118523 -112699 -88314 -295445 -90986 222900 58110 -357050 -25887 -132889 -42580 -96508
9710 -96508 88763 -252768 -386132 -21214 222713 -134307 97365 -233921 -198314 -258830 -81615
9698 -12164 -68123 -86497 -191900 17028 -162740 -355561 106384 -48418 -120242 91060 -84650
9686 29222 66622 -196272 -91832 24126 -251971 60839 15270 106938 -82283 -260739 -296967
9675 -296967 27030 -260146 -154864 -11058 -18770 33217 -420701 203309 31262 -124356 331699
9663 94683 -414023 28117 36718 27926 -180023 196832 6814 -10818 -151080 100013 -85795
9651 157172 -255182 275077 176525 1152 51630 169385 -129988 -360646 -62710 198761 226304
$$ packed form
9732a91350a0722L875j31103A96759i8420a7139j0887C4644d9633E3155O5368
9721A18523a12699K4385k07131i0986B22900E8110c57050b5887j07002d2580n3928
9710i6508H8763b52768j33364b1214B22713a34307I7365b33921L5607o0516h1615
9698a2164n5959j8374j05403A7028a62740j92821A06384d8418p1824I1060h4650
9686B9222L7400a96272i1832B4126b51971F0839A5270R1668h2283j78456l6228
9675b96967B7030b60146J05282a1058p712C3217d20701B03309C1262a24356C31699
9663I4683d14023B8117Q601q792a80023A96832F814a0818j40262A00013h5795
9651A57172b55182B75077r8552A152N0478J17755a29988k30658f2710A98761K7543
$$ plain form
9640 226304 231624 239017 186546 49755 -86326 -262592 110316 -149716 -244276 -84703 -304120
9629 -304120 -155160 -165284 87309 -50858 183044 37595 -355503 37565 74775 -450989 114136
9617 -83220 -20662 -246517 36133 -16298 292468 76056 95915 -25979 -86953 -382272 -209728
9606 -209728 16753 -143428 48506 54256 -121392 -194104 -38433 105279 -161546 -77021 39218
9594 17488 36183 159177 -93264 117644 262054 -248426 120143 -334440 -433694 358244
9583 1850 -330989 -51596 -204151 -250187 182504 -16813 -133339 41257 -343350 120597 71858
9572 71858 -77654 -184481 -149515 317638 -258702 4984 144407 -150085 135453 -230327 -2023
9560 -213245 141154 50698 -259919 -447301 127583 -140628 -12717 108547 149661 -21927
$$ packed form
9640B26304N320P393n2471D9755h6326j76266A10316a49716r4560h4703k19417
9629c04120J48960j0124H7309e0858A83044C7595c55503C7565L7210d50989A14136
9617h3220b0662k25855C6133a6298B92468G6056J9859b5979o0974k95319J72544
9606b09728A6753a43428D8506N750a21392p2712c8433A05279a61546g7021C9218
9594A7488J8695J22994i3264A17644J44410b48426A20143c34440r9254C58244
9583A850c30989e1596j52555m6036A82504a6813j16526D1257c43350A20597m8739
9572G1858g7654j06827L4966C17638b58702D984J39423a50085A35453b30327b023
9560b13245A41154E0698b59919j87382A27583a40628a2717A08547M1114b1927
$$ plain form
9549 -140938 69165 -37585 -179756 -353219 -174150 -391236 -147216 -89189 279523 -368833
9538 93333 -302264 -256490 -29861 -79998 93159 156327 -204182 94038 -144702 -99295 -16192
9526 -103209 4114 -23619 429329 -151201 215734 120363 -105031 90589 -153226 -60255 -124929
9515 -124929 -139961 204844 45724 -141281 -127440 65548 204019 -198754 -334730 -362718 -137355
9503 100034 -65280 -120617 -312773 10084 -122955 -29560 -137852 -205443 -217675 -153759 95791
9491 -226237 31275 43639 -210222 112662 -201947 128565 -89721 -339985 -113771 383869
9480 -354332 182924 157946 -1322 -131364 158453 -69181 -216850 -153745 -91654 -265032 9139
9468 -317269 -402021 -83045 -324935 2612 -208292 -242399 -8555 -85209 4269 -156776 -125127 -297536
$$ packed form
9549a40938F9165c7585j42171j73463a74150k17086a47216N8027B79523c68833
9538I3333c02264M5774b9861n0137I3159O3168b04182I4038a44702M5407a6192
9526a03209D114b3619D29329a51201B15734r5371a05031I0589a53226f0255o4674
9515a24929j5032B04844D5724a41281J3841F5548J38471a98754j35976k7988a37355
9503A00034f5280n5337j92156A0084a22955b9560j08292o7591j2232O3916I5791
9491b26237C1275J2364b10222A12662b01947A28565h9721k50264a13771C83869
9480c54332A82924k4978a322j30042A58453f9181j47669O3105O2091j73378I139
9468c17269q4752h3045k41890B612b08292l4107h555p6654D269a56776L1649j72409
$$ plain form
9456 -297536 48183 -426119 101975 223286 9070 -110977 -118691 -143053 -468 -193736 -106551
9445 -106551 -84457 -190490 -84275 136807 205930 -234314 -297092 44085 -54308 116004 271938
9434 271938 -184573 -323579 -165835 118690 -106490 -63781 -154785 40108 -57471 -337293
9424 -337293 214083 37495 -52472 -120734 169972 -122865 64283 91629 -89158 -70924 -46239
9413 -46239 361129 29931 93058 259788 79675 -214010 94347 115192 59592 32322 -56481
9401 132439 163463 68679 -132497 -70176 -8260 13237 -365895 161661 -62198 153086 526173
9390 526173 19936 -21135 84729 -47199 242882 -132364 60762 -355463 -332955 7859 148955
9379 148955 135006 -927 -144566 -113230 -85860 6657 20838 -28890 -198885 -58488 26878 -285947
$$ packed form
9456b97536D8183d26119A01975J21311I070a10977p714k4362d68j93268Q7185
9445a06551K2094j06033h4275A36807O9123b34314o2778D4085e4308A16004J55934
9434B71938a84573j39006J57744A18690a06490M2709r1004D0108e7471k79822
9424c37293B14083C7495e2472o8262A69972a22865F4283K7346h9158J8234K4685
9413d6239C61129B9931O3127J66730G9675b14010I4347K0845n5600k7270e6481
9401A32439L1024F8679a32497O2321h260A3237c65895A61661f2198A53086L73087
9390E26173A9936b1135H4729d7199B42882a32364F0762c55463K2508G859J41096
9379A48955j3949i27j43639L1336K7370F657J4181b8890j69995e8488B6878b85947
$$ plain form
9366 -326160 -179969 -11276 -156573 -158321 15830 1063 -38957 -521150 187178 -81972 -178527
9355 -178527 -159843 -16935 97344 -55880 36430 125355 -79132 -131900 -51117 45687 -209122
9343 114740 -6893 -240588 -298420 -150153 82941 -47041 30379 -207906 -116800 -24445 41136
9331 32864 -11063 4128 30789 51159 -77855 97113 -202117 -288002 -126077 -9819 -4292 264860
9318 -106891 -168136 -121499 -109809 -503569 152355 238759 -130256 -8968 165852 -148658 -154006
9307 -154006 -122088 122994 70306 -133771 202695 -232172 -295242 -126090 -119204 -57404 -113159
9296 -113159 -91472 74793 16193 -223332 -35558 -22969 -63364 -192049 32537 91603 -327736
9284 -320811 115523 -430017 -160365 1529 64675 156066 -230741 -233480 -70984 115868 -7507
$$ packed form
9366c26160J46191a1276j45297j748A5830A063c8957m82193A87178h1972r6555
9355a78527J8684a6935I7344e5880C6430Q8925g9132n2768e1117D5687b09122
9343A14740f893k33695n7832J48267H2941d7041C0379b07906R1106b4445D1136
9331C2864a1063D128K6661K0370g7855I7113b02117q5885a26077i819d292B64860
9318a06891o1245M6637J1690l93760A52355Q6404a30256h968A65852a48658n348
9307a54006L1918A22994n2688a33771B02695b32172o3070a26090O886e7404n5755
9296a13159K1687G4793A6193b23332c5558J2589m0395j28685C2537N9066c27736
9284c20811A15523d30017a60365A529O3146R1391b30741k739g0984A15868g507
$$ plain form
9272 120647 -138931 53512 -180994 -36264 84745 -38998 74097 -28936 -31471 -12666 -105958
9261 -105958 106022 -101131 -117008 93356 -17171 -148211 7308 -272195 62930 114890 -133505
9249 306913 219736 -324176 -168011 -214745 -592205 -66578 -261810 -95391 71332 -114854 38285
9237 -44305 161689 83012 64364 -391284 -297030 -116676 -234126 -117365 -6006 89551 -134469
9225 -200934 29121 -176491 -40738 -144275 35766 120687 -212836 -129647 -30649 -401943 -152883
9213 -152711 -105613 106817 -21184 -166433 -165822 -195761 -408520 -235565 98148 198435 -99429
9201 183941 -180622 119529 -105853 -221916 -72226 -309159 -176393 -82508 -177270 -316152
9191 -316152 -155405 100286 623 404119 -120910 -350059 111312 137025 -126949 -64410 110477
$$ packed form
9272A20647a38931E3512a80994c6264H4745c8998G4097b8936k535a2666r3292
9261a05958A06022a01131j5877I3356a7171j31040G308b72195F2930N1960a33505
9249C06913q7177c24176J56165m6734l77460f6578j95232i5391G1332a14854C8285
9237d4305A61689p8677j8648c91284R4254a16676j17450J16761f006H9551a34469
9225b00934B9121a76491d0738j03537C5766Q4921b12836Q3189c0649l71294a52883
9213a52711M7098A06817b1184j45249O11k9939k12759J72955I8148J00287i9429
9201A83941a80622A19529a05853j16063g2226k36933J32766h2508r4762j38882
9191c16152a55405A00286F23M03496a20910k29149A11312K5713a26949O2539A10477
$$ plain form
9179 -374970 -329481 -97206 -59095 -109667 -65848 49665 190495 11984 3091 -159760 -83177
9168 -83177 66090 136805 -49005 49366 1803 53751 -73803 302602 -154697 -62741 67502 -281609
9155 129124 -170014 30824 81074 -186976 14700 -114562 102022 223698 -179695 225983
9144 292181 225293 -150438 67403 -150138 69748 -163212 -273723 -19147 -159263 250008
9133 -272670 163851 46675 1615 -290536 -167489 201800 -282466 -88773 32471 73958 164599
9122 164599 -2160 27706 -139565 -182918 -87693 -12574 39365 -269990 -251039 -91518 259455
9110 119555 77305 141452 309292 -42380 -98896 3395 -270335 5205 -111562 194356 -165663
9098 -85562 19179 -96114 131149 34941 -342087 -247560 -136841 301031 -64800 -31100 -109685
$$ packed form
9179c74970M5489i7206L8111n0572M3819D9665J40830A1984C091a59760P6583
9168h3177F6090P0715d9005D9366A803N1948g3803C02602a54697f2741F7502b81609
9155A29124a70014C0824N0250a86976A4700a14562A02022J21676a79695B25983
9144B92181o6888a50438F7403a50138F9748a63212j10511a9147j40116B50008
9133b72670A63851D6675A615b90536J23047B01800b82466h8773C2471M1487R0641
9122A64599b160B7706a39565m3353h7693a2574C9365b69990J8951i1518B59455
9110A19555m2250O4147J67840d2380n6516C395b70335E205a11562A94356a65663
9098h5562A9179i6114A31149C4941c42087R4527J10719C01031f4800c1100p8585
$$ plain form
9087 -109685 -113351 293212 -128368 105589 17893 -75392 40285 62477 -143231 306201 -93116
9075 -211419 -163646 -54885 -69383 327399 -91118 -287764 285407 -95447 -56099 63273 33142
9064 33142 27270 -119391 112618 19555 -229820 -195779 45358 -176526 80335 5352 14169 -33516
9051 -245847 -78643 -205131 -372189 -438130 119499 51884 127204 -9374 -136393 -512718 106310
9039 -29923 307433 -334901 146968 16145 -112793 -235643 -46638 19354 -128825 -363448
9029 -363448 202138 -109203 -50431 51227 -6527 -261907 243861 -179999 131481 -77944 64781
9017 328910 -540425 -359959 -242510 -173648 76193 23099 -103455 2288 28080 -107467 146644
9005 244999 -13305 -209592 40424 -141306 -204857 -446178 -81203 -288347 -370372 -39975 37821
$$ packed form
9087a09685l666B93212a28368A05589A7893g5392D0285K2192a43231C06201i3116
9075b11419M7773e4885j4498C27399i1118j96646B85407i5447L9348F3273l0131
9064C3142n872a19391A12618A9555b29820L4041D5358a76526H0335E352Q817c3516
9051b45847g8643j26488j67058o5941A19499E1884P5320i374j27019l76325A06310
9039b9923C07433c34901A46968A6145a12793j22850d6638A9354a28825k34623
9029c63448B02138a09203e0431E1227f527k55380B43861a79999A31481g7944F4781
9017C28910e40425J80466J17449O8862G6193B3099a03455B288K5792a07467A46644
9005B44999a3305j96287D0424a41306o3551k41321h1203k07144q2025c9975C7821
$$ plain form
8993 254012 -484481 -101507 -47249 324049 138091 -81146 -73410 -117417 205290 -23966 -256194
8982 -256194 -192504 -96154 -129636 -33374 -28300 146891 -128816 -261133 -114518 24318 -150937
8970 106926 -219875 1502 -2250 -972 228714 -52463 -302117 -181500 -89846 25663 -197405
8958 -372351 272296 -172125 -182540 -21015 -150411 -22139 -66440 -97615 133500 -270341 -263344
8947 -263344 -88347 -73883 -86833 -16883 32196 -461 80712 -105128 -18324 -64125 -116094 325976
8934 83317 226329 175811 -83087 -2509 -384816 11301 29345 -182792 238331 307370 567724
8923 567724 2090708 5684734 13900475 16236302 4254056 879258 738244 554329 328781
8914 328781 74377 -133783 -260888 -64454 -140829 232194 260658 368372 -22978 169984 -140923
$$ packed form
8993B54012d84481a01507d7249C24049A38091h1146P736m4007B05290b3966k32228
8982b56194O3690i6154l3482c3374N074A46891a28816j32317a14518B4318a50937
8970A06926b19875A502b250i72B28714e2463k49654J20617h9846B5663a97405
8958c72351B72296a72125j0415b1015j29396b2139m4301l1175A33500b70341O997
8947b63344h8347J4464j2950a6883C2196d61H0712a05128a8324m5801n1969C25976
8934H3317J43012n0518h3087b509l82307A1301J8044a82792B38331O9039K60354
8923E67724J522984L594026Q215741K335827D254056H79258j41014j83915k25548
8914C28781G4377a33783j27105f4454p6375B32194K8464J07714b2978A69984a40923
$$ plain form
8902 45545 -3471 192762 -147922 50695 184720 84719 -97213 14861 -438999 5262 -269575
8890 301699 77216 -210944 10015 335040 125613 -141639 256214 -325389 238450 10349
8879 -240803 135614 -242001 -103541 -6304 -107040 -9044 75391 203494 -9123 -213570 177650
8867 126668 -176367 -183870 -162646 -212528 -13959 -89807 145441 -108438 82442 16960 133870
8856 133870 -179889 69673 90246 90102 -58933 -76864 45064 209680 -1046 41556 -138427 -110590
8844 -110590 -83632 71836 205149 -76247 -240764 189420 193250 -93806 -15804 -92685 67740
$$ packed form
8902D5545c471A92762a47922E0695J34025H4719i7213A4861d38999E262b69575
8890C01699G7216b10944A0015L25025A25613a41639B56214c25389B38450A0349
8879b40803A35614b42001a03541f304j00736i044G5391J28103i123k04447A77650
8867A26668a76367p503K1224m9882a3959p5848A45441a08438H2442A6960J16910
8856A33870a79889F9673K0573j44e8933j7931D5064J64616a046D1556a38427K7837
8844a10590K6958G1836J33313g6247j64517A89420L830i3806a5804p6881F7740
$$ [...]
##END NTUPLES=NMR SPECTRUM
##END=
