
##TITLE=UV1232_M7_1357-1247_50_7230683_0sIhplZAvN
##JCAMPDX= 6.0         $$ Bruker NMR JCAMP-DX V2.0
##DATA TYPE= NMR SPECTRUM
##DATA CLASS= NTUPLES
##ORIGIN= BRUKER
##OWNER= Administrator
$$ 1.72 TOPSPIN		Version 2.1
$$ 2013-01-18 18:48:22.520 -0500  Administrator@X
$$ Compression mode = diff/dup
##.OBSERVE FREQUENCY= 400.02188249412
##.OBSERVE NUCLEUS= ^1H
##.ACQUISITION MODE= SIMULTANEOUS (DQD)
##.ACQUISITION SCHEME= undefined
##.AVERAGES= 64
##.DIGITISER RES= 22
##SPECTROMETER/DATA SYSTEM= spect
##.PULSE SEQUENCE= noesygpps1d.comp
##.SOLVENT NAME= COFFEE_meoh
##.SHIFT REFERENCE= INTERNAL, COFFEE_meoh, 1, 14.96152
##AUDIT TRAIL= $$ (NUMBER, WHEN, WHO, WHERE, PROCESS, VERSION, WHAT)
$$ ##TITLE= Audit trail, TOPSPIN		Version 2.1
$$ ##JCAMPDX= 5.01
$$ ##ORIGIN= Bruker BioSpin GmbH
$$ ##OWNER= Administrator
$$ $$ E:\/data/COFFEE/nmr/UV1232_M7_1357-1247_50_7230683_0sIhplZAvN/22/pdata/1/auditp.txt
$$ ##AUDIT TRAIL=  $$ (NUMBER, WHEN, WHO, WHERE, PROCESS, VERSION, WHAT)
(   1,<2013-01-18 18:48:16.731 -0500>,<Administrator>,<X>,<go>,<TOPSPIN 2.1>,
      <created by zg
	started at 2013-01-18 18:36:46.995 -0500,
	POWCHK enabled, PULCHK disabled,
       configuration hash MD5:
       86 BA 57 50 F2 9D 5C 9B 26 00 A9 28 5F 66 2E 89
       data hash MD5: 64K
       6C CE E7 0C 65 1E E8 35 6B 54 D1 E2 F0 63 2B E9>)
(   2,<2013-01-18 18:48:19.763 -0500>,<Administrator>,<X>,<proc1d>,<TOPSPIN 2.1>,
      <Start of raw data processing
       efp LB = 0.3 FT_mod = 6 PKNL = 1 PHC0 = 0 PHC1 = 0 SI = 128K 
       data hash MD5: 128K
       96 58 B6 66 DC 23 ED 3B E6 3A EC E2 EB 35 D3 0B>)
(   3,<2013-01-18 18:48:20.804 -0500>,<Administrator>,<X>,<proc1d>,<TOPSPIN 2.1>,
      <pk PHC0 = -83.22144 PHC1 = 0 
       data hash MD5: 128K
       A4 6C A9 55 61 5F 77 43 08 11 FE F0 07 9C 81 0F>)
(   4,<2013-01-18 18:48:21.463 -0500>,<Administrator>,<X>,<proc1d>,<TOPSPIN 2.1>,
      <abs ABSG = 1 
       data hash MD5: 128K
       78 36 06 3E 07 60 DD E7 32 0E AB 35 49 72 A5 93>)
(   5,<2013-01-18 18:48:21.662 -0500>,<Administrator>,<X>,<proc1d>,<TOPSPIN 2.1>,
      <abs ABSG = 2 
       data hash MD5: 128K
       A4 33 6C D3 B5 EB DF CD 51 0E 73 F8 31 8B 76 7F>)
(   6,<2013-01-18 18:48:21.830 -0500>,<Administrator>,<X>,<proc1d>,<TOPSPIN 2.1>,
      <abs ABSG = 3 
       data hash MD5: 128K
       18 16 67 82 FE C0 81 3C C5 2D 70 74 E1 D8 3B 78>)
(   7,<2013-01-18 18:48:22.014 -0500>,<Administrator>,<X>,<proc1d>,<TOPSPIN 2.1>,
      <abs ABSG = 4 
       data hash MD5: 128K
       F8 E6 02 AB E9 03 58 E9 14 20 79 50 6B E4 E0 52>)
(   8,<2013-01-18 18:48:22.198 -0500>,<Administrator>,<X>,<proc1d>,<TOPSPIN 2.1>,
      <abs ABSG = 5 
       data hash MD5: 128K
       C1 2F F8 E4 5B 54 44 A9 2A B4 B4 AB F9 3C B0 D7>)
$$ ##END=
$$ 
$$ $$ hash MD5
$$ $$ F4 BC D3 14 D8 97 18 44 EA 0E 62 B9 CD 30 05 A9
##$RELAX= 
##$RELAX= 
##$RELAX= 
##$RELAX= 
##$RELAX= 
##$RELAX= 
##$RELAX= 
##$RELAX= 
$$ Bruker specific parameters
$$ --------------------------
##$DU= <E:\>
##$EXPNO= 22
$$ [...]
##$TP07= 0
##$TPNAME0= <>
##$TPNAME1= <>
##$TPNAME2= <>
##$TPNAME3= <>
##$TPNAME4= <>
##$TPNAME5= <>
##$TPNAME6= <>
##$TPNAME7= <>
##$TPOAL= (0..7)
0.5 0.5 0.5 0.5 0.5 0.5 0.5 0.5
##$TPOFFS= (0..7)
0 0 0 0 0 0 0 0
##$TUNHIN= 0
##$TUNHOUT= 0
##$TUNXOUT= 0
##$USERA1= <user>
##$USERA2= <user>
##$USERA3= <user>
##$USERA4= <user>
##$USERA5= <user>
##$V9= 5
##$VALIST= <valist>
##$VCLIST= <CCCCCCCCCCCCCCC>
##$VD= 0
##$VDLIST= <DDDDDDDDDDDDDDD>
##$VPLIST= <PPPPPPPPPPPPPPP>
##$VTLIST= <TTTTTTTTTTTTTTT>
##$WBST= 1024
##$WBSW= 4
##$XGAIN= (0..3)
0 0 0 0
##$XL= 0
##$YL= 0
##$YMAX_a= 5691250
##$YMIN_a= -11672186
##$ZGOPTNS= <>
##$ZL1= 120
##$ZL2= 120
##$ZL3= 120
##$ZL4= 120
##$ABSF1= 14.96152
##$ABSF2= -5.596662
##$ABSG= 5
##$ABSL= 3
##$ALPHA= 0
##$AQORDER= 0
##$ASSFAC= 0
##$ASSFACI= 0
##$ASSFACX= 0
##$ASSWID= 0
##$AUNMP= <proc_prof1d_extract.lims>
##$AXLEFT= 0
##$AXNAME= <>
##$AXNUC= <1H>
##$AXRIGHT= 0
##$AXTYPE= 0
##$AXUNIT= <>
##$AZFE= 0.1
##$AZFW= 0.1
##$BCFW= 0
##$BC_mod= 0
##$BYTORDP= 0
##$COROFFS= 0
##$CY= 15
##$DATMOD= 1
##$DC= 0
##$DFILT= <>
##$DTYPP= 0
##$F1P= 0
##$F2P= 0
##$FCOR= 0.5
##$FTSIZE= 131072
##$FT_mod= 6
##$GAMMA= 0
##$GB= 0
##$INTBC= 1
##$INTSCL= 1
##$ISEN= 128
##$LB= 0.3
##$LEV0= 0
##$LPBIN= 0
##$MAXI= 10000
##$MC2= 0
##$MEAN= 0
##$ME_mod= 0
##$MI= 0
##$NCOEF= 0
##$NC_proc= -2
##$NLEV= 6
##$NOISF1= 0
##$NOISF2= 0
##$NSP= 0
##$NTH_PI= 0
##$NZP= 0
##$OFFSET= 14.96152
##$PC= 1
##$PHC0= -83.22144
##$PHC1= 0
##$PH_mod= 1
##$PKNL= yes
##$PPARMOD= 0
##$PPDIAG= 0
##$PPIPTYP= 0
##$PPMPNUM= 2147483647
##$PPRESOL= 1
##$PSCAL= 4
##$PSIGN= 0
##$PYNMP= <proc.py>
##$REVERSE= no
##$SF= 400.020009430372
##$SI= 131072
##$SIGF1= 0
##$SIGF2= 0
##$SINO= 400
##$SIOLD= 131072
##$SPECTYP= <>
##$SREGLST= <1H.CDCl3>
##$SSB= 0
##$STSI= 131072
##$STSR= 0
##$SW_p= 8223.68421052631
##$SYMM= 0
##$S_DEV= 0
##$TDeff= 65536
##$TDoff= 0
##$TI= <>
##$TILT= no
##$TM1= 0
##$TM2= 0
##$TOPLEV= 0
##$USERP1= <user>
##$USERP2= <user>
##$USERP3= <user>
##$USERP4= <user>
##$USERP5= <user>
##$WDW= 1
##$XDIM= 131072
##$YMAX_p= 412009537
##$YMIN_p= -26805
##$CURPLOT= <Network HP LaserJet P1505>
##$CURPRIN= <$Network HP LaserJet P1505>
##$DFORMAT= <normdp>
##$LAYOUT= <+/1D_H.xwp>
##$LFORMAT= <normlp>
##$PFORMAT= <normpl>
##$SURQMSG= 1
$$ End of Bruker specific parameters
$$ ---------------------------------
##NTUPLES= NMR SPECTRUM
##VAR_NAME=  FREQUENCY,     SPECTRUM/REAL,   SPECTRUM/IMAG
##SYMBOL=    X,             R,               I
##VAR_TYPE=  INDEPENDENT,   DEPENDENT,       DEPENDENT
##VAR_FORM=  AFFN,          ASDF,            ASDF
##VAR_DIM=   131072,        131072,          131072
##UNITS=     HZ,            ARBITRARY UNITS, ARBITRARY UNITS
##FACTOR=    0.0627417313425164, 1,          1
##FIRST=     8223.62146879497, 2008,         -54171
##LAST=      0,             2922,            -54508
##MIN=       0,             -26805,          0
##MAX=       8223.62146879497, 412009537,    0
$$ Real data points
##PAGE= N=1
##DATA TABLE= (X++(R..R)), XYDATA
$$ [...]
61652D38161J674P57J73M31P43O04P05J609K605K883K884L460M281M288L334K198
$$ 438161 439835 440592 440765 441196 441939 442543 443248 444857 447462 450345 453229 456689 460970 465258 468592 470790
61636D70790J227M7j313k180k278k149k181k105j869k110l175m263m343l547k878
$$ 470790 472017 472064 470751 468571 466293 464144 461963 459858 457989 455879 452704 448441 444098 440551 437673
61621D37673k782k754k312j592q63j29N14O67K00m39q26j120j620k196k645l247
$$ 437673 434891 432137 429825 428233 427370 427241 427755 428422 428622 428183 427357 426237 424617 422421 419776 416529
61605D16529m263n188n265m666m300m457m459l942l495l609l821l565l148l058
$$ 416529 412266 407078 401813 397147 392847 388390 383931 379989 376494 372885 369064 365499 362351 359293
61591C59293k939k161j066o30j002j296r60m50m04p60j024r22n17k6K42N5m84
$$ 359293 356354 354193 353127 352497 351495 350199 349239 348789 348385 347625 346601 345679 345162 345136 345378 345433 344949
61574C44949r73j048o24P7N73M26j78m27J15Q85J123R84J142J550J465O75p7j38
$$ 344949 343976 342928 342304 342381 342954 343380 343202 342775 342890 343775 344898 345882 347024 348574 350039 350714 350637 350499
61556C50499L29Q30J185J377J342J162J045Q99M31j91k96L32J011J001M96L26
$$ 350499 350828 351658 352843 354220 355562 356724 357769 358668 359099 358908 358612 358944 359955 360956 361452 361778
61540C61778R35J894K368J922J000N80J120K027K445K371K365K438K065J308R60
$$ 361778 362713 364607 366975 368897 369897 370477 371597 373624 376069 378440 380805 383243 385308 386616 387576
61525C87576J256J327M87p56j508j692j739j709j477j404j896k515k355j330l64
$$ 387576 388832 390159 390646 389890 388382 386690 384951 383242 381765 380361 378465 375950 373595 372265 371901
61510C71901j42l09j65L64P82P52M40J46m8k26l69l18k3L95Q66J435J900J685
$$ 371901 371759 371450 371285 371649 372431 373183 373623 373769 373721 373495 373126 372808 372785 373180 374046 375481 377381 379066
61492C79066N13r16j423o23O70J440J428J041P12N95O13N83M26K86K60J40k66
$$ 379066 379579 378663 377240 376617 377287 378727 380155 381196 381908 382503 383116 383699 384125 384411 384671 384811 384545
61475C84545o73o30k39O4L05Q84J621J753J111M47K34K5m69n68K67J264J263M17
$$ 384545 383872 383242 383003 383067 383372 384256 385877 387630 388741 389188 389422 389447 388978 388410 388677 389941 391204 391621
61457C91621j21J07M95O36Q90J480J983K040J912J879J699J097L72N4K22N79J035
$$ 391621 391500 391607 392102 392738 393628 395108 397091 399131 401043 402922 404621 405718 406090 406144 406366 406945 407980
61440D07980J748K670L446L872M101M294M299L895L251K820K726K552J875Q92
$$ 407980 409728 412398 415844 419716 423817 428111 432410 436305 439556 442376 445102 447654 449529 450421
61426D50421K20J89N24P44O51M43M59Q26J237J180N39j77m19k60j99m52q59j361
$$ 450421 450641 450830 451354 452098 452749 453192 453651 454477 455714 456894 457433 457256 456837 456577 456378 455926 455067 453706
61408D53706k060k778l015k558j750j075p75q56j160j365j316j277j476j512q44
$$ 453706 451646 448868 445853 443295 441545 440470 439695 438839 437679 436314 434998 433721 432245 430733 429889
61393D29889J76N52L4m55j20P04J212J192Q93M84R4j6J87L29K52L81J076K007
$$ 429889 430065 430617 430651 430196 430076 430780 431992 433184 434077 434561 434655 434639 434826 435155 435407 435788 436864 438871
61375D38871K643K945L101L082K913K999L601M252M273L659L009K787K975L166
$$ 438871 441514 444459 447560 450642 453555 456554 460155 464407 468680 472339 475348 478135 481110 484276
61361D84276K756J489J44O7J531L211L871L925M492N588O341O604P157Q367R719
$$ 484276 487032 488521 488665 488732 490263 493474 497345 501270 505762 511350 517691 524295 531452 539819 549538
61346E49538J0717J1360J1599J1173J0173Q953P391N030K182K1q22j020j520k343
$$ 549538 560255 571615 583214 594387 604560 613513 620904 625934 628116 628137 627315 626295 624775 622432
61332F22432k931l206l709m813o211p159p118o273n344m772m252l338k281j678
$$ 622432 619501 616295 612586 607773 601562 594403 587285 581012 575668 570896 566644 563306 561025 559347
61318E59347j498j131m10J71M54J069K530M393N796O408O601O960Q018R996J2467
$$ 559347 557849 556718 556308 556479 556933 558002 560532 564925 570721 577129 583730 590690 598708 608704 621171
61303F21171J4501J5543J5852J5863J5420J4063J1777Q932N651J807k273n677
$$ 621171 635672 651215 667067 682930 698350 712413 724190 733122 738773 740580 738307 732630
61291G32630p683q508r003r753j0664j1286j1267j0460q901o982n427m728m562
$$ 732630 724947 716439 707436 697683 687019 675733 664466 654006 645105 638123 632696 627968 623406
61278F23406m093k924j466k47P76J897L020L719L851L688L567L613L807M050M236
$$ 623406 619313 616389 614923 614676 615452 617349 620369 624088 627939 631627 635194 638807 642614 646664 650900
61263F50900M398M676N076N499O153P525R620J1569J2428J2153J1321J0131Q215
$$ 650900 655298 659974 665050 670549 676702 684227 693847 705416 717844 729997 741318 751449 759664
61250G59664N316J721j981n169p397q659r398r844r663q638p359o587o225n635
$$ 759664 764980 766701 764720 759551 752154 743495 734097 724253 714590 705952 698593 692006 685781 680146
61236F80146m763m135l801l214k286j614j396r82N5J155J642J744K227L360M762
$$ 680146 675383 671248 667447 664233 661947 660333 658937 657955 658010 659165 660807 662551 664778 668138 672900
61221F72900N901O360N942N039M530M880N452N264M219L197K935L201L187K472
$$ 672900 678801 685161 691103 696142 700672 705552 711004 716268 720487 723684 726619 729820 733007 735479
61207G35479J469R56J233J852K231K361K630L205L961N026O760R095J1419J3341
$$ 735479 736948 737904 739137 740989 743220 745581 748211 751416 755377 760403 767163 776258 787677 801018
61193H01018J5159J7212J9128K0101J9762J8424J6624J4621J2299R412N993K589
$$ 801018 816177 833389 852517 872618 892380 910804 927428 942049 954348 963760 969753 972342
61181I72342q1j745k735l523m436n724p550r702j1596j2722j3022j2818j2617
$$ 972342 972261 970516 967781 964258 959822 954098 946548 936846 925250 912528 899506 886688 874071
61168H74071j2951j3985j5193j5791j5584j5073j4756j4676j4718j4822j4680
$$ 874071 861120 847135 831942 816151 800567 785494 770738 756062 741344 726522 711842
61157G11842j3775j2022j0049q460p201n847m219k415n39J196K387K816K825K927
$$ 711842 698067 686045 675996 667536 660335 654488 650269 647854 647315 648511 650898 653714 656539 659466
61143F59466L100K722J230j226l792n568o331o505o382n689m247k642j580p57
$$ 659466 662566 665288 666518 665292 661500 655932 649601 643096 636714 631025 626778 624136 622556 621799
61129F21799Q27L363N929P867R601J1677J3756J5246J6290J7473J8889K0192K1256
$$ 621799 622626 625989 631918 639785 649386 661063 674819 690065 706355 723828 742717 762909 784165
61116G84165K2186K2886K3182K3156K2942K2428K1530K0525J9570J8270J6259
$$ 784165 806351 829237 852419 875575 898517 920945 942475 963000 982570 1000840 1017099
61105A017099J3932J1998J0438Q587O135L407O35k392n701q818j1395j3836j6805
$$ 1017099 1031031 1043029 1053467 1062054 1068189 1071596 1072231 1069839 1064138 1055320 1043925 1030089 1013284
61092A013284k0223k3134k4601k4669k4197k3870k3556k2784k1541k0206j8873
$$ 1013284 993061 969927 945326 920657 896460 872590 849034 826250 804709 784503 765630
61081G65630j7296j5488j3772j2204j0477q620p149o224n336m174l127k453j620
$$ 765630 748334 732846 719074 706870 696393 687773 680624 674400 669064 664890 661763 659310 657690
61068F57690j84J267J888J901K270L321M516N470O294P024P473P793Q492R723
$$ 657690 657506 658773 660661 662562 664832 668153 672669 678139 684433 691457 698930 706723 715215 724938
61054G24938J1091J2230J3178J4120J5246J6831J8982K1227K2843K3649K4125
$$ 724938 736029 748259 761437 775557 790803 807634 826616 847843 870686 894335 918460
61043I18460K4779K5656K6435K6704K6291K5623K5457K5876K5966K5020K3604
$$ 918460 943239 968895 995330 1022034 1048325 1073948 1099405 1125281 1151247 1176267 1199871
61032A199871K2768K2608K2456K2140K2105K2465K2937K3629K4925K6616K8145
$$ 1199871 1222639 1245247 1267703 1289843 1311948 1334413 1357350 1380979 1405904 1432520 1460665
61021A460665K9734L2268L5928L9917M3624M7067N0227N3103N6534O1673O8458
$$ 1460665 1490399 1522667 1558595 1598512 1642136 1689203 1739430 1792533 1849067 1910740 1979198
61010A979198P5997Q4641R5934J10017J24885J39110J53682J70318J90084K15046
$$ 1979198 2055195 2139836 2235770 2345787 2470672 2609782 2763464 2933782 3123866 3338912
61000C338912K49216K95882L55935M30996N25936O45219P89137R58001J157786
$$ 3338912 3588128 3884010 4239945 4670941 5196877 5842096 6631233 7589234 8747020
60991H747020J394676J663445J947827K231322K492211K676012K686130K434063
$$ 8747020 10141696 11805141 13752968 15984290 18476501 21152513 23838643 26272706
60983B6272706J920887J266020O42605J79394p9712j45874n4819J17972K38556
$$ 26272706 28193593 29459613 30102218 30281612 30201900 30056026 30001207 30119179 30357735
60974C0357735J57852j96597p67501j407426j969131k365658k571177k596292
$$ 30357735 30515587 30318990 29551489 28144063 26174932 23809274 21238097 18641805
60966A8641805k472870k247799j971843j685867j415552j174840r69642p99214
$$ 18641805 16168935 13921136 11949293 10263426 8847874 7673034 6703392 5904178
60958E904178o58815n43670m50405l75772l16230k69083k32490k04100j80954
$$ 5904178 5245363 4701693 4251288 3875516 3559286 3290203 3057713 2853613 2672659
60949B672659j61070j44076j29925j17815j06754r6398q6896p8426p1218o5736
$$ 2672659 2511589 2367513 2237588 2119773 2013019 1916621 1829725 1751299 1680081 1614345
60939A614345o2351o0861o0364n9702n8242n6271n4275n1939m8406m3779l9418
$$ 1614345 1551994 1491133 1430769 1371067 1312825 1256554 1202279 1150340 1101934 1058155 1018737
60928A018737l6265l3595l0236k6364k3059k0592j8324j5999j4055j2606j1215
$$ 1018737 982472 948877 918641 892277 869218 848626 830302 814303 800248 787642 776427
60917G76427r788q760q122p186n526l532j762m84J13j8l41j31M96P73N21L43L19
$$ 776427 766639 757879 749757 742571 737045 733513 731751 731267 731380 731362 731021 730890 731386 732159 732680 733023 733342
60900G33342l45j907l400m063m552n863p659q674q414p629p275p668q465q947
$$ 733342 732997 731090 727690 723627 719075 713212 705553 696879 688465 680836 673561 665893 657428 648481
60886F48481q552p547o903p058p269o653n530m986n464o483p592q746r750j0018
$$ 648481 639929 632382 625479 618421 611152 604499 598969 593983 588519 582036 574444 565698 555948 545930
60872E45930r163p558o041n259n202n301n059m602m339m138l381j994p21k1N83
$$ 545930 536767 529209 523168 517909 512707 507406 502347 497745 493406 489268 485887 483893 483172 483151 483734
60857D83734J548K418K602K423K539K787K630K309K570L354L869L891L965M268
$$ 483734 485282 487700 490302 492725 495264 498051 500681 502990 505560 508914 512783 516674 520639 524907
60843E24907M295L888L576L526L081J823L65m70p81j294k327l496m201m103l309
$$ 524907 529202 533090 536666 540192 543273 545096 545461 544991 544210 542916 540589 537093 532892 528789 525480
60828E25480k386j969k143k423k355j942j418r59o70n93o49q24j318k228l122
$$ 525480 523094 521125 518982 516559 514204 512262 510844 509885 509215 508622 507973 507149 505831 503603 500481
60813E00481l420l172l026l390m103m901n670o192o197n783n292m723l870l111
$$ 500481 497061 493889 490863 487473 483370 478469 472799 466607 460410 454627 449335 444612 440742 437631
60799D37631l286m490n598n532m495l504l065k854k481k053j917k114k181j562
$$ 437631 434345 429855 424257 418725 414230 410726 407661 404807 402326 400273 398356 396242 394061 392499
60785C92499l25P42J000P82Q98J476J850J625J191J069J303J743K380L180L935
$$ 392499 392174 392916 393916 394698 395596 397072 398922 400547 401738 402807 404110 405853 408233 411413 415348
60770D15348M473M673M271L230K217K053K547K693K159J729J946K221J877J239
$$ 415348 419821 424494 428765 431995 434212 436265 438812 441505 443664 445393 447339 449560 451437 452676
60756D52676R44Q07J36j158k477l240l159k263j204j003j835k538k062j005q41
$$ 452676 453620 454427 454563 453405 450928 447688 444529 442266 441062 440059 438224 435686 433624 432619 431778
60741D31778j907l133l692l917m392n022n366n324n033m502l746l074k899l210
$$ 431778 429871 426738 423046 419129 414737 409715 404349 399025 393992 389490 385744 382670 379771 376561
60727C76561l492l170k199j112n03m66p09r95j181r24L2J204J624J058L67L14
$$ 376561 373069 369899 367700 366588 366085 365619 364910 363915 362734 361810 361842 363046 364670 365728 366095 366409
60711C66409O01O10N18Q97J617K031K087K407L147L620L359K905L077L777M093
$$ 366409 367010 367620 368138 369035 370652 372683 374770 377177 380324 383944 387303 390208 393285 397062 401155
60696D01155L524K706K663L553M548M950M959M966M614L347J740J215K126L058
$$ 401155 404679 407385 410048 413601 418149 423099 428058 433024 437638 440985 442725 443940 446066 449124
60682D49124K605J140J00Q3M97P28P89Q24Q29Q46R61R69N23l72j322k052k587
$$ 449124 451729 452869 452969 453052 453549 454277 455066 455890 456719 457565 458526 459495 460018 459646 458324 456272 453685
60665D53685l075l667m474n308n676n369m835m599m492l938k831j670q47l02J46
$$ 453685 450610 446943 442469 437161 431485 426116 421281 416682 412190 408252 405421 403751 402904 402602 402748
60650D02748N57R86J491J941K089J892J565J281R92N01l08j246j821j719j315
$$ 402748 403305 404291 405782 407723 409812 411704 413269 414550 415542 416043 415735 414489 412668 410949 409634
60635D09634j324j895k429k399j872j110k09O24J077J310J853K579K542J391J67
$$ 409634 408310 406415 403986 401587 399715 398605 398396 399020 400097 401407 403260 405839 408381 409772 409939
60620D09939l8N41R90J085J034O03l48j004m99N42O47l82j295j321j028j013j015
$$ 409939 409901 410442 411432 412517 413551 414154 413806 412802 412303 412845 413492 413110 411815 410494 409466 408453 407438
60603D07438p65o70r72j073m34M43O13p0q01p39K70J620K448K395K055K375L530
$$ 407438 406673 406003 405031 403958 403524 403967 404580 404510 403709 402970 403240 404860 407308 409703 411758 414133 417663
60586D17663M742N266N137M824M474L823K651J176J5l52j12L3k68o37n38J67J549
$$ 417663 422405 427671 432808 437632 442106 445929 448580 449756 449771 449419 449307 449340 449072 448435 447897 448064 449613
60569D49613L825O660Q836R452R169R482J0904J2702J4186J5413J6626J7745J8482
$$ 449613 453438 460098 468934 478386 487555 497037 507941 520643 534829 550242 566868 584613 603095
60556F03095J8285J6399J2687Q218M267Q54k795o586r446j0837j1154j0534q495
$$ 603095 621380 637779 650466 658684 662951 663805 661010 654424 644978 634141 622987 612453 603958
60543F03958n270k273n81K68J384L204N633Q704J2419J6357K0088K3621K7086
$$ 603958 598688 596415 595834 596102 597486 600690 606323 615027 627446 643803 663891 687512 714598
60530G14598L0372L3312L5761L7138L6472L3236K7856K1067J3321N070k864r576
$$ 714598 744970 778282 814043 851181 887653 920889 948745 969812 983133 988203 985339 975763
60518I75763j4548j7729j9478k0442k1027k0930j9681j7587j5521j3818j2045
$$ 975763 961215 943486 924008 903566 882539 861609 841928 824341 808820 795002 782957
60507G82957r863p328m436j156J938M086N567P587J0793J4782J9265K4544L0545
$$ 782957 773094 765766 761330 760174 762112 766198 771765 779352 790145 804927 824192 848736 879281
60494H79281L6576M2520M9135N6521O3353O8389P1699P3642P3646P0992O6003
$$ 879281 915857 958377 1007512 1064033 1127386 1195775 1267474 1341116 1414762 1485754 1551757
60483A551757N9408N1305M1791L1933K2902J4462N300n315j7046k9302m1623n3418
$$ 1551757 1611165 1662470 1704261 1736194 1759096 1773558 1778858 1773543 1756497 1727195 1685572 1632154
60471A632154o4016p2930p9610q3282q3625q1248p6988p1151o3970n6309m9165
$$ 1632154 1568138 1495208 1415598 1332316 1248691 1167443 1090455 1019304 955334 899025 849860
60460H49860m2834l7198l2425k8729k5772k3027k0402j7982j5549j3005j0814
$$ 849860 807026 769828 737403 708674 682902 659875 639473 621491 605942 592937 582123
60449E82123r453q785q448q312p992o734m580k934k893l667l668k644j573r61
$$ 582123 572670 563885 555437 547125 539133 532399 527819 524885 521992 518325 514657 512013 510440 509479
60435E09479n94o00j382k466k738j969j043o71p89j208j790j992j365n45o19j462
$$ 509479 508885 508285 506903 504437 501699 499730 498687 498016 497227 496019 494229 492237 490872 490327 489708 488246
60419D88246j907j662j653k139j986n15J174J655R90K39m5J25P91J732K091J343
$$ 488246 486339 484677 483024 480885 478899 478384 479558 481213 482203 482442 482397 482522 483313 485045 487136 488479
60403D88479K90J32Q84J571J738J742J729J413R95J250K285L035K639J640J176
$$ 488479 488769 488901 489785 491356 493094 494836 496565 497978 498973 500223 502508 505543 508182 509822 510998
60388E10998J397J518J204J016J397J953K164K145K193K031J235J71k35K65R30
$$ 510998 512395 513913 515117 516133 517530 519483 521647 523792 525985 528016 529251 529422 529187 529452 530382
60373E30382J172J286J735K283K388K112J988K167K198J688P98O5n1N66J641K684
$$ 530382 531554 532840 534575 536858 539246 541358 543346 545513 547711 549399 550197 550262 550211 550777 552418 555102
60357E55102L305L404L122K793K824L334L918M102L987M048M321M435M449M880
$$ 555102 558407 561811 564933 567726 570550 573884 577802 581904 585891 589939 594260 598695 603144 608024
60343F08024N630N663M353K485J213M98n93k368m100n065n270n091m733m227l642
$$ 608024 613654 619317 623670 626155 627368 627866 627273 624905 620805 615740 610470 605379 600646 596419 592777
60328E92777l196l121l338l312k599j613j302j875k488k519k357k458k402j633
$$ 592777 589581 586460 583122 579810 577211 575598 574296 572421 569933 567414 565057 562599 560197 558564
60314E58564m94L50J011J973L028L643M179N615Q082J0614J2424J3669J4799J5944
$$ 558564 558070 558420 559431 561404 564432 568075 572254 577869 585951 596565 608989 622658 637457 653401
60300F53401J7082J8246J9323K0074K0232J9322J6678J2228O922J687l687r708
$$ 653401 670483 688729 708052 728126 748358 767680 784358 796586 803508 805195 801508 791800
60288G91800j5555j9450k0712k0349j9484j8202j6329j4303j2683j1442j0312
$$ 791800 776245 756795 736083 715734 696250 678048 661719 647416 634733 623291 612979
60277F12979r307q522p875p310o860o260n102l625k720k777k996k394j073j6K17
$$ 612979 603672 595150 587275 579965 573105 566845 561743 558118 555398 552621 549625 547231 546158 546142 546359
60262E46359K0O0M19O29M18J50L20P86R21O54O97J416K084J915J253R43R22M78
$$ 546359 546379 546439 546858 547487 547905 548055 548375 549161 550082 550736 551433 552849 554933 556848 558101 559044 559966 560444
60244E60444l39p02m73n69j561k813l432l283k686j823q80k26O2M09J114J915
$$ 560444 560105 559403 558930 558361 556800 553987 550555 547272 544586 542763 541883 541657 541719 542128 543242 545157
60228E45157K452K787L147L546L892M152M187L855L398L377L965M724N210N426
$$ 545157 547609 550396 553543 557089 560981 565133 569320 573175 576573 579950 583915 588639 593849 599275
60214E99275N544N623N734N992O284O399O488O860P280P047O052N127M972N205
$$ 599275 604819 610442 616176 622168 628452 634851 641339 648199 655479 662526 668578 673705 678677 683882
60200F83882M930L823K294Q71j31n57m79l72q87k296m131n532o070o130o323o550
$$ 683882 688812 692635 694929 695800 695669 695112 694633 694261 693374 691078 686947 681415 675345 669215 662892 656342
60184F56342o202n285m655m734m782m102l216k956l030k559j589q45l84K21N56
$$ 656342 650140 644855 640200 635466 630684 626582 623366 620410 617380 614821 613232 612387 612003 612224 612780
60169F12780k13j620k057j028K04O02N60N77K00p88j413r16r1j48q83j172o51
$$ 612780 612567 610947 608890 607862 608066 608668 609228 609805 610005 609217 607804 606888 606797 606649 605766 604594 603943
60152F03943J11P48J400K106K698L142L441L430L134K977L132L188K921K910L680
$$ 603943 604054 604802 606202 608308 611006 614148 617589 621019 624153 627130 630262 633450 636371 639281 642961
60137F42961M728N126M734M112L665L564M115N358O467O403N133L547K307J390
$$ 642961 647689 652815 657549 661661 665326 668890 673005 678363 684830 691233 696366 699913 702220 703610
60123G03610P21N47J056K061L150L922M184M198M536N338N966N807N118M593M324
$$ 703610 704331 704878 705934 707995 711145 715067 719251 723449 727985 733323 739289 745096 750214 754807 759131
60108G59131L754K567J082k14j115j673k142k932m251n726o680o763o188n443
$$ 759131 762885 765452 766534 766320 765205 763532 761390 758458 754207 748481 741801 735038 728850 723407
60094G23407m916m714m590m099k981j432P5J063J253P74K11J25M66P64Q13O98
$$ 723407 718491 713777 709187 705088 702107 700675 700750 701813 703066 703840 704051 704176 704642 705406 706219 706917
60078G06917K30r88k748m187m908n523o670q057q947r152q990q641q060p295o524
$$ 706917 707147 706159 703411 699224 694316 688793 682123 674066 665119 655967 646977 638336 630276 622981 616457
60063F16457n917n670n808n782m786k906j378j180j832k145j820j541j656j588
$$ 616457 610540 604870 599062 593280 588494 585588 584210 583030 581198 579053 577233 575692 574036 572448
60049E72448o73Q48K044K367K266K565L292L543K840K083K434L554L939K937J360
$$ 572448 571775 572623 574667 577034 579300 581865 585157 588700 591540 593623 596057 599611 603550 606487 607847
60034F07847K8j178k398l230l563m003m665m637l543k627l172m586n300m986m631
$$ 607847 607875 606697 604299 601069 597506 593503 588838 584201 580658 578031 574859 570273 564973 559987 555356
60019E55356m805n083n115n115n204n156m890m590m355m268m536n028m958l840
$$ 555356 550551 545468 540353 535238 530034 524878 519988 515398 511043 506775 502239 497211 492253 488413
60005D88413k385j670j631j329m80K30L35J69J42K73N36R97J470J676J792K230
$$ 488413 486028 484358 482727 481398 480918 481148 481483 481652 481794 482067 482603 483600 485070 486746 488538 490768
59989D90768K835L022K755K671L073L421L086K101R59K6o03j036j487k008k363
$$ 490768 493603 496625 499380 502051 505124 508545 511631 513732 514691 514717 514114 513078 511591 509583 507220
59974E07220k347k098j817j395p80l74n49r67r74n89m03n15k60Q42K367L393L392
$$ 507220 504873 502775 500958 499563 498783 498409 497860 496893 495919 495330 494927 494412 494152 494994 497361 500754 504146
59957E04146K625J887J784K088K000J201L18JM9q9l52k68J78N58O23L49m43j754
$$ 504146 506771 508658 510442 512530 514530 515731 516049 516050 516099 516010 515658 515390 515568 516126 516749 517098 516655 514901
59939E14901k912l075k215j052j82K30J45k13k06N86J656K269K587L282M286M883
$$ 514901 511989 508914 506699 505647 505465 505695 505840 505627 505421 506007 507663 509932 512519 515801 520087 524970
59923E24970N031N468O389P014O840O446O551O933O759N596L747J901P46O29J323
$$ 524970 530001 535469 541858 548872 555712 562158 568709 575642 582401 587997 591744 593645 594391 595020 596343
59908E96343K288L121L588L442K671J771J325J392J691K146K687K840K280J557
$$ 596343 598631 601752 605340 608782 611453 613224 614549 615941 617632 619778 622465 625305 627585 629142
59894F29142J545K228K862L230L746M304M036K619R79K50O14J500K369K942L169
$$ 629142 630687 632915 635777 639007 642753 647057 651093 653712 654691 654941 655555 657055 659424 662366 665535
59879F65535L289L587L898L791L313L019L117L069K305Q66q34k407l502l891l798
$$ 665535 668824 672411 676309 680100 683413 686432 689549 692618 694923 695789 694955 692548 689046 685155 681357
59864F81357l762l997m179l940l272k426j717j396j434j461j296j225j420j416
$$ 681357 677595 673598 669419 665479 662207 659781 658064 656668 655234 653773 652477 651252 649832 648416
59850F48416p71J95J056K202M136O171P057O831O758P385Q010Q371R331J1139
$$ 648416 647645 647840 648896 651098 655234 661405 668462 675293 682051 689436 697446 705817 715148 726287
59836G26287J2282J1214Q405N647L850K564J310L84K80R61J800J967Q96j370m372
$$ 726287 738569 749783 758188 763835 767685 770249 771559 771943 772223 773184 774984 776951 777847 776477 772105
59821G72105p656j0818j3203j4214j3988j3228j2250j0871r293q229p849p359
$$ 772105 764449 753631 740428 726214 712226 698998 686748 675877 666584 658355 650506 643147
59809F43147o214m950m274l910l142j991j080o32l12J03N21Q68J054P28l37j593
$$ 643147 636933 631983 627709 623799 620657 618666 617586 616954 616642 616745 617266 618134 619188 619916 619579 617986
59793F17986j984j050M88J343P37j036k882l711l243k190j598j977k915l554l444
$$ 617986 616002 614952 615440 616783 617520 616484 613602 609891 606648 604458 602860 600883 597968 594414 590970
59778E90970k967k823l127l305k894k122j467j042p00l71N7P28J345J268N91M92
$$ 590970 588003 585180 582053 578748 575854 573732 572265 571223 570523 570152 570209 570937 572282 573550 574141 574633
59762E74633J764L623M874N629O668P627P403O208N593O230P144P477P567P701
$$ 574633 576397 580020 584894 590523 597191 604818 612221 618429 624022 630252 637396 644873 652440 660141
59748F60141P293O140N211N224N451M973M132L747L576K776J301k03j461k580
$$ 660141 667434 673574 678785 684009 689460 694433 698565 702312 705888 708664 709965 709762 708301 705721
59734G05721l368l581l538l599l383k358r96l37o07j132j571k238l119l519l088
$$ 705721 702353 698772 695234 691635 688252 685894 684898 684561 683954 682822 681251 679013 675894 672375 669287
59719F69287k476k505l125l586l380k608j601n70L17P67N93J20J29J050K297K724
$$ 669287 666811 664306 661181 657595 654215 651607 650006 649436 649753 650520 651113 651233 651362 652412 654709 657433
59703F57433J876N23q9N77J990L119L293K700K092J998K332K715K856K441J257
$$ 657433 659309 659832 659743 660320 662310 665429 668722 671422 673514 675512 677844 680559 683415 685856 687113
59688F87113k04q69m59j55r96k172k133j012m55j062j576j115o58j532l520n407
$$ 687113 686909 686040 685581 685426 684430 682258 680125 679113 678658 677596 676020 674905 674247 672715 669195 663788
59672F63788o543o889o351n067l897l678m159m345l653k312r11M2M37P18J391
$$ 663788 657245 650356 644005 638938 635041 631363 627204 622859 619206 616894 615983 616025 616462 617180 618571
59657F18571K215K503K340K686L902N104N478N373N373N136M058K397Q27o23k317
$$ 618571 620786 623289 625629 628315 632217 637321 642799 648172 653545 658681 662739 665136 665963 665340 663023
59642F63023m087n414o302p100p768q004p911p724p126n586l403j652j020j100
$$ 663023 658936 653522 647220 640120 632352 624348 616437 608713 601587 596001 592598 590946 589926 588826
59628E88826j094q11q66j857l492m691m792m322m128m074l446k393j933k408l100
$$ 588826 587732 586921 586055 584198 580706 576015 571223 566901 562773 558699 555253 552860 550927 548519 545419
59613E45419l497l799l850k954j289k02j99J0J477L230L758L246K861K693J954
$$ 545419 541922 538123 534273 531319 530030 529828 529629 529639 531116 534346 538104 541350 544211 546904 548858
59598E48858P52J47N34J234J580J415P55j29n46k00J94m5l71JN31Q0j117j674
$$ 548858 549610 549757 550291 551525 553105 554520 555275 555146 554600 554400 554594 554549 554178 554179 554710 554790 553673 551999
59580E51999j152n94p45j094r44l93Q7K13k02j090j746j389l37K40j59q03r19
$$ 551999 550847 550253 549508 548414 547470 547077 547164 547377 547175 546085 544339 542950 542613 542853 542694 541891 540972
59563E40972o34m81o10p61n80J61J186J639R45k90q28l02M91P54N21K03ok1L41
$$ 540972 540338 539857 539247 538486 537906 538067 539253 540892 541837 541547 540719 540417 540908 541662 542183 542386 542380 542359 542700
59544E42700J275K824M822O829Q377R638J1375J3826J6098J7327J7799J8011J7111
$$ 542700 543975 546799 551621 558450 566827 576465 587840 601666 617764 635091 652890 670901 688012
59531F88012J3598P615J375l019n297o325o618o080m712k982j574r31r45j178
$$ 688012 701610 709225 710600 707581 702284 695959 689341 683261 678549 675567 673993 673062 672117 670939
59517F70939j499k162l104l743m019m942p231r883j1153j0678r601q729p779o548
$$ 670939 669440 667278 664174 660431 656412 651470 644239 634356 623203 612525 602924 594195 586416 579868
59503E79868n665n602n813n421m230k749j569r95r60j068r81p66o30n36l98l64
$$ 579868 574203 568601 562788 557367 553137 550388 548819 547824 546864 545796 544815 544049 543419 542883 542485 542121
59487E42121m10J1J241K581K962K352J741J777K172K491K817L368M026M431M261
$$ 542121 541711 541722 542963 545544 548506 550858 552599 554376 556548 559039 561856 565224 569250 573681 577942
59472E77942L485K585K340K963L715L785L217K493J731R77P45J405K356K766K842
$$ 577942 581427 584012 586352 589315 593030 596815 600032 602525 604256 605233 605978 607383 609739 612505 615347
59457F15347L444M664N810O593P347Q082Q378Q226Q054P876P221N927M214K095
$$ 615347 618791 623455 629265 635858 643205 651287 659665 667891 675945 683821 691042 696969 701183 703278
59443G03278m03k616l851m560n787p473q387p950o971o327n919n266m306l146
$$ 703278 702875 700259 696408 691848 686061 678588 670201 662251 655280 648953 643034 637768 633462 630316
59429F30316j740k23J066K127L312M798O494Q439J0653J2736J4359J5908J7873
$$ 630316 628576 628353 629419 631546 634858 639656 646150 654589 665242 677978 692337 708245 726118
59416G26118J9840K1022K1513K2025K2617K2824K2674K2145J9815J3869M812m287
$$ 726118 745958 766980 788493 810518 833135 855959 878633 900778 920593 934462 939274 934987
59404I34987j0757j4220j5299j4042j0452n337K69N567R283R692O187R4o697j2987
$$ 934987 924230 910010 894711 880669 870217 864880 865149 870716 879999 889691 895878 895972 889275 876288
59390H76288j7768j9767j8693j6078j3853j2437j0941q720n996l395j529o88n30
$$ 876288 858520 838753 820060 803982 790129 777692 766751 758031 752035 748640 747111 746423 745893
59377G45893l79j44m36j535k890l852m245l984k918j405k79J92N91J300J897K022
$$ 745893 745514 745370 744934 743399 740509 736657 732412 728428 725510 724105 723826 724018 724609 725909 727806 729828
59361G29828K057K496L381M746O808R260J1148J2018J2472J3170J3958J4473J4899
$$ 729828 731885 734381 737762 742508 749316 758576 769724 781742 794214 807384 821342 835815 850714
59348H50714J5557J6343J6985J7339J7134J6167J4966J4388J4260J3313J0840
$$ 850714 866271 882614 899599 916938 934072 950239 965205 979593 993853 1007166 1018006
59337A018006P521M196Q11k860o446r525j2184j4447j5987j6877j7722j8555j8628
$$ 1018006 1025527 1029723 1030534 1027674 1021228 1011703 999519 985072 969085 952208 934486 915931 897303
59324H97303j7864j7335j7558j7446j5945j3742j2281j1882j1868j1794j1577
$$ 897303 879439 862104 844546 827100 811155 797413 785132 773250 761382 749588 738011
59313G38011j1004j0095r448r362r212q478p695p469p253o167m458l103k406k024
$$ 738011 727007 716912 707464 698102 688890 680412 672717 665248 657995 651828 647370 644267 641861 639837
59299F39837j889k056j940p61J394L792O128Q625J1284J3885J6499J9199K1381
$$ 639837 637948 635892 633952 633191 634585 638377 644505 653130 664414 678299 694798 713997 735378
59286G35378K1962K0179J5857R343J752n136r978j2653j3607j2921j0634p337
$$ 735378 757340 777519 793376 802719 804471 799335 789357 776704 763097 750176 739542 732205
59274G32205l755p5L599O638Q480R462J0327J1178J1569J1330J0637R523P987
$$ 732205 728450 728375 731974 738612 747092 756554 766881 778059 789628 800958 811595 821118 829105
59261H29105O298M687K951Q16j625m125o473q161q588q016p557p677p567o572
$$ 829105 835403 840090 843041 843857 842232 838107 831634 823473 814885 806869 799312 791635 784068 777496
59247G77496n367m747m214k866r62O24J936L589N301O186O361O931Q160Q884Q125
$$ 777496 772129 767382 763168 760302 759340 759964 761900 765489 770790 776976 783337 790268 798428 807312 815437
59232H15437O388M892M068L298J820l76k595m312n864p835r931j1205j1496j1667
$$ 815437 821825 826717 830785 834083 835903 835527 832932 828620 822756 814921 804990 793785 782289 770622
59218G70622j2108j2066j1115j0147r938r770q610o966o084n924n353m085l001
$$ 770622 758514 746448 735333 725186 715248 705478 696868 689902 683818 677894 672541 668456 665455
59205F65455k525j989q83M07J327J824J988J836J634J833K414K864K944K994L412
$$ 665455 662930 660941 660058 660465 661792 663616 665604 667440 669074 670907 673321 676185 679129 682123 685535
59190F85535M151M818N008M589L943L714M093M575M679M564M513M301L581K552
$$ 685535 689686 694504 699512 704101 708044 711758 715851 720426 725105 729669 734182 738483 742064 744616
59176G44616J748J379J272J210J027O93N43J019J984K758L083L333L579L298K335
$$ 744616 746364 747743 749015 750225 751252 751945 752488 753507 755491 758249 761332 764665 768244 771542 773877
59161G73877J279L40j164l520n791p067p762q727r900j0681j0999j1082j0829
$$ 773877 775156 775496 774332 770812 765021 757954 750192 741465 731565 720884 709885 698803 687974
59148F87974j0239r838r838r569q612p669p384p137o149m926m443m503m277l767
$$ 687974 677735 667897 658059 648490 639878 632209 624825 617688 611539 606613 602170 597667 593390 589623
59134E89623l554l498l023k285j888j750j317m88O26K240M190N379N175M690N316
$$ 589623 586069 582571 579548 577263 575375 573625 572308 571820 572446 574686 578876 584255 589430 594120 599436
59119E99436O694P598Q107R252J0957J2157J2697J3346J4011J3704J2414J1386
$$ 599436 606130 613728 621835 631087 642044 654201 666898 680244 694255 707959 720373 731759
59107G31759J1286J1456J1205J0540R471P786N712L706J588j019l573n109n738
$$ 731759 743045 754501 765706 776246 785717 793503 799215 802921 804509 803490 799917 794808 789070
59094G89070o332o852o466n241m189l593k787j710j134j107q20l64j020l187n462
$$ 789070 782738 775886 769420 764179 759990 756397 753610 751900 750766 749659 748839 748475 747455 744268 738806
59079G38806o506o612o743p143p520p684p366o308n013m512m969n338m786l674
$$ 738806 732300 725688 718945 711802 704282 696598 689232 682924 677911 673399 668430 663092 658306 654632
59065F54632k726k144j893k085k569k877k825k575k027r54J82N30O5m26o70j175
$$ 654632 651906 649762 647869 645784 643215 640338 637513 634938 632911 631957 632139 632669 632734 632308 631638 630463
59049F30463j903j920q43L43N83J11j05K80O81L18j050k799l823l595k722k019
$$ 630463 628560 626640 625797 626140 626723 626834 626729 627009 627690 628008 626958 624159 620336 616741 614019 612000
59033F12000j415m66N43J007J234K181M024O006P644R076J0193J0538J0142R582
$$ 612000 610585 610119 610662 611669 612903 615084 619108 625114 632758 641834 652027 662565 672707 682289
59019F82289R130Q664Q249P896O968M850K126J3j223k300l526m525n101n227m405
$$ 682289 691419 700083 708332 716228 723196 728046 730172 730185 728962 726662 723136 718611 713510 708283 703878
59004G03878k244M80K571L968N325O443O628O290O492P069O870N767M680L708
$$ 703878 701634 702114 704685 708653 713978 720421 727049 733339 739831 746900 753770 759537 764217 767925
58990G67925K142L45m36l80j112k999m488m705m620m863m479k850j037P9J245
$$ 767925 770067 770412 769976 769596 768484 765485 760997 756292 751672 746809 742330 739480 738443 738522 739767
58975G39767L273N420O680P365Q206R065R670J0543J2061J3462J3889J3607J3325
$$ 739767 743040 748460 755140 762505 770711 779776 789446 799989 812050 825512 839401 853008 866333
58962H66333J3081J2641J2085J1338R910P792N665L694J117k363n884q782j1532
$$ 866333 879414 892055 904140 915478 925388 933180 938845 942539 943656 941293 935409 926627 915095
58949I15095j4556j7165j8517j8716j8285j7400j6262j5265j4209j2372r871p887
$$ 915095 900539 883374 864857 846141 827856 810456 794194 778929 764720 752348 742477 734590
58937G34590o977o328n263m275l865l529k678j572o93j57k38j279k608k895k114
$$ 734590 727613 721285 716022 711747 707882 704353 701675 700103 699410 699253 699015 697736 695128 692233 690119
58922F90119j742k388k776j889o01l7J58O82J085O87oj06K84O14J010J878L159
$$ 690119 688377 685989 683213 681324 680723 680686 680844 681526 682611 683298 683292 683186 683470 684084 685094 686972 690131
58905F90131M735O705Q695R894J0428J1513J3535J5276J5851J5983J6519J7056
$$ 690131 694866 701571 710266 720160 730588 742101 755636 770912 786763 802746 819265 836321
58893H36321J7117J7287J8103J9050J9770K0967K2950K4581K4865K4249K3188
$$ 836321 853438 870725 888828 907878 927648 948615 971565 996146 1021011 1045260 1068448
58882A068448K0824J6596J1812Q030M908J212l073p136j0888j4515j7361j8674
$$ 1068448 1089272 1105868 1117680 1125710 1130618 1131830 1128757 1121621 1110733 1096218 1078857 1060183
58870A060183j8874j8675j7838j6007j3996j2782j2024j0899r695r257r559j0077
$$ 1060183 1041309 1022634 1004796 988789 974793 962011 949987 939088 929393 920136 910577 900500
58858I00500j0790j1675j2027j1497j0983j1263j1697j1485j1169j1478j1725
$$ 900500 889710 878035 866008 854511 843528 832265 820568 809083 797914 786436 774711
58847G74711j0916r575q878q774q511q218q400q560p969p151p040p319p137o819
$$ 774711 763795 754220 745342 736568 728057 719839 711439 702879 694910 687759 680719 673400 666263 659444
58833F59444p204p766p133n190l152j823j146j089j556j731q59N58J516K098L094
$$ 659444 652240 644474 637341 632151 628999 627176 626030 624941 623385 621654 620795 621353 622869 624967 628061
58818F28061M516N640O193O358O060N253M422L828K874J257q9l05N8J54L49J158
$$ 628061 632577 638217 644410 650768 656828 662081 666503 670331 673205 674462 674373 674068 674126 674280 674629 675787
58802F75787J675P59r42j840j816k137l372m880o036o612o309n157m028l585l286
$$ 675787 677462 678221 677279 675439 673623 671486 668114 663234 657198 650586 644277 639120 635092 631507 628221
58787F28221k404j311n07O27K715M857N732N523N327N395N404N633O293O535N611
$$ 628221 625817 624506 623999 624626 627341 632198 637930 643453 648780 654175 659579 665212 671505 678040 683651
58772F83651M204L021J133k388o134p793p278o407o025n565m982m945n284n167
$$ 683651 687855 690876 692009 689621 683487 675694 668416 662009 655984 650419 645437 640492 635208 630041
58758F30041m726m679m700l905k666k102k050j410k55K80J13L00J142J936K566
$$ 630041 625315 620636 615936 612031 609365 607263 605213 603803 603548 603828 603941 604241 605383 607319 609885
58743F09885L607M911N704O042O661P519P944P977Q090Q012P371P006P935R404
$$ 609885 613492 618403 624107 630149 636810 644329 652273 660250 668340 676352 683723 690729 698664 708068
58729G08068R767Q921Q115P681O914N774M912M251L348K853L698N229O041O237
$$ 708068 717835 726756 734871 742552 749466 755240 760152 764403 767751 770604 774302 779531 785572 791809
58715G91809O951P993Q072P054N903M619K377m48k582m017n881q311j0479j2414
$$ 791809 798760 806753 814825 821879 827782 832401 834778 834330 831748 827731 821850 813539 803060 790646
58701G90646j4713j6751j7447j7528j8589k0167k0274j8704j7172j6166j4441
$$ 790646 775933 759182 741735 724207 705618 685451 665177 646473 629301 613135 598694
58690E98694j1897j0134r636q981p540o442o198n794m854m418m734m463k931j132
$$ 598694 586797 576663 567027 558046 550506 544064 537866 532072 527218 522800 518066 513603 510672 509540
58676E09540J83J451K666K926K337K398L704N159O107P338R297J1275J2996J5110
$$ 509540 509723 511174 513840 516766 519103 521501 525205 530364 536471 543809 553106 564381 577377 592487
58662E92487J7325J7917J5932J2238P867L068j621n182p651j0077j2511j3727
$$ 592487 609812 627729 643661 655899 663766 666834 665213 660031 652380 642303 629792 616065
58650F16065j3302j2144j0726q773o834o048o070n382l913k978k481q38J899L649
$$ 616065 602763 590619 579893 571120 564286 558238 552168 546786 542873 539895 537414 536576 538475 542124
58636E42124L738L933N114N734M863L994M309M537L227J063n71j571k225k215
$$ 542124 545862 549795 554909 560643 565506 569500 573809 578346 581573 582636 582065 580494 578269 576054
58622E76054j739j871k672k718j508l69K3R19L031M961N576N890P017Q016P442
$$ 576054 574315 572444 569772 567054 565546 565177 565200 566119 569150 574111 579687 585577 592594 600610 608052
58607F08052N548L480J564k67j643k426l115l700l486k610k232k550k420j522
$$ 608052 613600 617080 618644 618377 616734 614308 611193 607493 604007 601397 599165 596615 594195 592673
58593E92673j031j409j537p62K22J314L644P264J0373J1867J2623J3329J3257
$$ 592673 591642 590233 588696 587934 588156 589470 593114 600378 610751 622618 635241 648570 661827
58580F61827J2243J1592J1699J1035Q765O273M843L942L079L119M414N801O863
$$ 661827 674070 685662 697361 708396 717161 723434 728277 732219 735298 738417 742831 748632 755495
58567G55495Q977J2712J6458J9133K1917K5662K8874K9977K9498K8292K5719K1384
$$ 755495 764472 777184 793642 812775 834692 860354 889228 919205 948703 976995 1002714 1024098
58555A024098J6541J2006O788N88m526o937p874q994r703r015q071q370r269r583
$$ 1024098 1040639 1052645 1059433 1060021 1055495 1048558 1040684 1031690 1021987 1012972 1004901 996531 987262 977679
58541I77679j0088j2151j5146j7442j8818j9877k0359j9886j9185j8801j7794
$$ 977679 967591 955440 940294 922852 904034 884157 863798 843912 824727 805926 788132
58530G88132j5373j2494j0289q280n729l318j919j031k5N40K00k66l42q17k054
$$ 788132 772759 760265 749976 741696 735967 732649 730730 729699 729674 730214 730414 730148 729806 728989 726935
58515G26935k923k820k867l738m259l637l056l470l845l223k529k608k603j907
$$ 726935 724012 721192 718325 714587 710328 706691 703635 700165 696320 693097 690568 687960 685357 683450
58501F83450j631k378k792k118j905l207m312l422j422R3J397L060M044L674L490
$$ 683450 681819 679441 676649 674531 672626 669419 665107 661685 660263 660356 661753 664813 668857 672531 676021
58486F76021M841O613P491Q391J0414J2522J3513J4295J5820J6880J6242J4901
$$ 676021 680862 687475 694966 703357 713771 726293 739806 754101 769921 786801 803043 817944
58474H17944J3914J2128Q428M072M62l172p490j0850j1918j2099j2730j2332r381
$$ 817944 831858 843986 852414 856486 856948 853776 846286 835436 823518 811419 798689 786357 776976
58461G76976n431k605l65K434M741N559O517R073J1477J1707J0923J0771R872
$$ 776976 771545 768940 768575 771009 775750 781309 787826 796899 808376 820083 831006 841777 851649
58448H51649O509K304m74k844o478r625r858q662q873r521p761m334k434k328
$$ 851649 858158 860462 859988 857144 850666 841041 831183 822521 813648 804127 796366 792032 789598 787270
58434G87270j561L94J922K900M515O135O165N389N888P390Q036P858Q075Q062
$$ 787270 785709 786103 788025 790925 795440 801575 807740 813129 819017 826407 834443 842301 850376 858438
58420H58438O389L797J872M4k776n085m933l765m437o692q210q717r429r876q998
$$ 858438 864827 868624 870496 870540 867764 862679 857746 853981 849544 842852 834642 825925 816496 806620 797622
58405G97622p942q127q134o200l880l383l301j259J312J723J284K983N688N905
$$ 797622 789680 781553 773419 767219 763339 759956 756655 755396 756708 758431 759715 762698 768386 774291
58391G74291M011L328M107L749K218J850K439J746M74J525M512O027N307M813
$$ 774291 778302 781630 785737 789486 791704 793554 795993 797739 798213 799738 804250 810277 815584 820397
58377H20397N347N296M558M702N374M942M314N663P963Q334P215P491R209R878
$$ 820397 825744 831040 835598 840300 845674 850616 854930 860593 868556 876890 884105 891596 900805 910683
58363I10683R460J0109J1549J1593J0726J1213J2293J1223Q494O980O593M966
$$ 910683 920143 930252 941801 953394 964120 975333 987626 998849 1007343 1014323 1020916 1025882
58351A025882K685K408L449K766Q35R03K913L808L455M525O838P679P494R395
$$ 1025882 1028567 1030975 1034424 1037190 1038025 1038928 1041841 1045649 1049104 1053629 1060467 1068146 1075640 1085035
58337A085035J3115J5216J5164J5542J6524J5955J4507J4810J5889J4506J1400
$$ 1085035 1098150 1113366 1128530 1144072 1160596 1176551 1191058 1205868 1221757 1236263 1247663
58326A247663R955R407O164J247o77N55O60j006p68J823L187K831L936O452O913
$$ 1247663 1257618 1267025 1273189 1274436 1273759 1274314 1274974 1273968 1273200 1275023 1278210 1281041 1284977 1291429 1298342
58311A298342N575O368R251J0191R118J0213J3700J5283J4354J4783J6854J6635
$$ 1298342 1303917 1310285 1319536 1329727 1338845 1349058 1362758 1378041 1392395 1407178 1424032 1440667
58299A440667J4143J3737J5524J4948J1933J1583J4545J5706J3940J4009J7087
$$ 1440667 1454810 1468547 1484071 1499019 1510952 1522535 1537080 1552786 1566726 1580735 1597822
58288A597822J8611J7506J8238K1635K2881K0920K0497K2683K2867K0416K0687
$$ 1597822 1616433 1633939 1652177 1673812 1696693 1717613 1738110 1760793 1783660 1804076 1824763
58277A824763K4899K7828K8044L0498L6258L9907L9987M1620M5927M7451M5165
$$ 1824763 1849662 1877490 1905534 1936032 1972290 2012197 2052184 2093804 2139731 2187182 2232347
58266B232347M5109M8784N0174M7769M8008N2874N5865N4468N4756N9036O0981
$$ 2232347 2277456 2326240 2376414 2424183 2472191 2525065 2580930 2635398 2690154 2749190 2810171
58255B810171N7941N6119N8422N9222N6252N5533N9333O1638O0680O3226P1279
$$ 2810171 2868112 2924231 2982653 3041875 3098127 3153660 3212993 3274631 3335311 3398537 3469816
58244C469816P7718Q0318Q6219R7205J05072J07346J12415J23061J30737J32703
$$ 3469816 3547534 3627852 3714071 3811276 3916348 4023694 4136109 4259170 4389907 4522610
58234D522610J38279J51042J61857J67141J76224J92568K06286K13991K26665
$$ 4522610 4660889 4811931 4973788 5140929 5317153 5509721 5716007 5929998 6156663
58225F156663K48527K68265K81301K99539L28253L55475L76114M03358M43375
$$ 6156663 6405190 6673455 6954756 7254295 7582548 7938023 8314137 8717495 9160870
58216I160870M83146N17232N60895O21720O85438P46135Q21579R20884J028208
$$ 9160870 9644016 10161248 10722143 11343863 12029301 12775436 13597015 14517899 15546107
58207A5546107J138183J274165J449898J649784J872099K152762K519321K965932
$$ 15546107 16684290 17958455 19408353 21058137 22930236 25082998 27602319 30568251
58199C0568251L507069M209677N136624O311256P776971R625594J1914660J4632127
$$ 30568251 34075320 38284997 43421621 49732877 57509848 67135442 79050102 93682229
58191I3682229J7802876K1518990K5745633L0186701L4454754L8176000M0591707
$$ 93682229 111485105 133004095 158749728 188936429 223391183 261567183 302158890
58184C02158890M0134032L4971223K4465782J0105687n181556j8640891k8688755
$$ 302158890 342292922 377264145 401729927 411835614 406654058 388013167 359324412
58177C59324412l4806016l7091696l6114928l2851254k8368308k3478886j8719525
$$ 359324412 324518396 287426700 251311772 218460518 190092210 166613324 147893799
58170A47893799j4547847j1391152r474153q677097q602945q785136q875777q717490
$$ 147893799 133345952 121954800 112480647 103803550 95200605 86415469 77539692 68822202
58162F8822202q296633p655347o851486n968053n101964m317649l630252l039793
$$ 68822202 60525569 52870222 46018736 40050683 34948719 30631070 27000818 23961025
58154B3961025k553723k166757j850203j580281j356357j178537j030359q98468
$$ 23961025 21407302 19240545 17390342 15810061 14453704 13275167 12244808 11346340
58146A1346340p88296p04867o36651n72790n18627m79871m47648m12944l80679
$$ 11346340 10558044 9853177 9216526 8643736 8125109 7645238 7197590 6784646 6403967
58137F403967l56247l32515l02907k73898k52286k32725k09428j87809j73398
$$ 6403967 6047720 5715205 5412298 5138400 4886114 4653389 4443961 4256152 4082754
58128D082754j61172j46798j36677j36020j38069j35535j31954j31672j29548
$$ 4082754 3921582 3774784 3638107 3502087 3364018 3228483 3096529 2964857 2835309
58119B835309j20948j11606j07143j02655r2768q2491p7868p4907o7924o0328
$$ 2835309 2714361 2602755 2495612 2392957 2300189 2217698 2139830 2064923 1996999 1936671
58109A936671n7238n5415n0271m5276m4943m5759m3103m0142m1009m2106l8964
$$ 1936671 1879433 1824018 1773747 1728471 1683528 1637769 1594666 1554524 1513515 1471409 1432445
58098A432445l4971l4734l5293l2318k8676k8409k8485k4851k0714k0545k1621
$$ 1432445 1397474 1362740 1327447 1295129 1266453 1238044 1209559 1184708 1163994 1143449 1121828
58087A121828j9651j7113j7901j9198j6890j3873j4891j7861j8274j7477j8905
$$ 1121828 1102177 1085064 1067163 1047965 1031075 1017202 1002311 984450 966176 948699 929794
58076I29794k0567j9064j6834j7850k0047j9401j7479j7833j8754j6812j3835
$$ 929794 909227 890163 873329 855479 835432 816031 798552 780719 761965 745153 731318
58065G31318j3259j3213j0331o810o604p940o740m272m401o110n771m281n104
$$ 731318 718059 704846 694515 687705 681101 673161 666421 662149 657748 651638 645867 641586 636482
58052F36482p503q215p742q761j0308r571p496o945p302o283m944n567o859o397
$$ 636482 628979 620764 613022 604261 593953 584382 576886 569941 562639 556356 551412 545845 538986 532589
58038E32589n480o375p396o016m200n171p377p298n840o255p916p886o775p337
$$ 532589 527109 520734 513338 507322 503122 497951 490574 483276 477436 471181 463265 455379 448604 441267
58024D41267q991r058p917p796q101o856n081m889n129l688k029k542l571k230
$$ 441267 432276 423218 415301 407505 399404 392548 387467 382578 377449 373761 371732 369190 365619 363389
58010C63389N8J14j027k39J580J292k60L27K590L000J316O29J638K128J643J718
$$ 363389 363447 363561 362534 362295 363875 365167 364907 365234 367824 370824 372140 372769 374407 376535 378178 379896
57994C79896J943N76j540k084j584k208l290k580r09q81j928j481j25o22k578
$$ 379896 381839 382415 380875 378791 377207 374999 371709 369129 368220 367339 365411 363930 363805 363183 360605
57979C60605l157k507l320n391n722m005l043l527l210j633r88j771j866o39J41
$$ 360605 357448 354941 351621 346230 340508 336503 333460 329933 326723 325090 324102 322331 320465 319826 319967
57964C19967p1J88J080J101L39N62J700J735L44p22j028j862l217l653l269l547
$$ 319967 319896 320084 321164 322265 322604 323166 324866 326601 326945 326223 325195 323333 320116 316463 313194 309647
57948C09647m283l854k370j529j473r28J7L48P55K549M623N011M730O367R397
$$ 309647 305364 301510 299140 297611 296138 295210 295227 295575 296330 298879 303502 308513 313243 319610 329007
57933C29007J0835J0151R665J0213J0325R619R174Q563O248K912P53l87k477n132
$$ 329007 339842 349993 359658 369871 380196 389815 398989 407552 413800 416712 417465 417078 414601 409469
57919D09469o039n432n958p810q256o537n136n380n603m647l535k722j124J227
$$ 409469 403430 397998 392040 384230 375974 369437 364301 358921 353318 348671 345136 342414 341290 342517
57905C42517K636K711K846L285K755J442J073J656J343q7r18r47j777l332l616
$$ 342517 345153 347864 350710 353995 356750 358192 359265 360921 362264 362177 361259 360312 358535 355203 351587
57890C51587k469j948k409j895j21O51l84j252q58m51m92L77K103K461P71r53
$$ 351587 349118 347170 344761 342866 342745 343396 343012 341760 340902 340451 339959 340336 342439 344900 345671 344718
57874C44718j761l175n573o691n382l685l340l305k400j554j565j345j75P70P15
$$ 344718 342957 339782 334209 327518 322136 318451 315111 311806 309406 307852 306287 304942 304767 305537 306252
57859C06252P85J778K766L226M178N930P054O912O848P644Q169P683P092O834
$$ 306252 307037 308815 311581 314807 318985 324915 331969 338881 345729 353373 361542 369225 376317 383151
57845C83151N952M358L466L417K358l70k855l715m060n029n993o501p433q807
$$ 383151 389103 393461 396927 400344 402702 402332 399477 395762 391702 386673 380680 374179 366746 357939
57831C57939r002p597o469o642o576n106l510l005k704j754j094j325j141K70
$$ 357939 348937 341340 334871 328229 321653 316547 313037 310032 307328 305574 304480 303155 302014 302284
57817C02284J421R48k28p73r72j303j103k70k62j716l049l055k798l402m016l753
$$ 302284 303705 304653 304425 303652 302680 301377 300274 300004 299742 298026 294977 291922 289124 285722 281706 277953
57801B77953l531m211m793m263l421l179k900k041j622k336l010k543j680j310
$$ 277953 274422 270211 265418 261155 257734 254555 251655 249614 247992 245656 242646 240103 238423 237113
57787B37113q31L61J584K504L976N926O577N471M847O247Q038Q312P974Q638R638
$$ 237113 236282 236643 238227 240731 244707 250633 257210 262681 267528 273775 281813 290125 298099 306737 316375
57772C16375R559Q894Q688Q233O538M561L630L073J679N9p13j400l139n091n873
$$ 316375 325934 334828 343516 351749 358287 362848 366478 369551 371230 371289 370576 369176 366037 360946 355073
57757C55073o076o913p619o761n158m871n989o793o614o311o313o216o002n941
$$ 355073 348997 342084 334465 327704 322546 317675 311686 304893 298279 291968 285655 279439 273437 267496
57743B67496n606m586l540l198l030k338j718j893k077j129N54J898K983M380
$$ 267496 261890 257304 253764 250566 247536 245198 243480 241587 239510 238381 238935 240833 243816 248196
57729B48196N550N644N088M837M842M709M906N754O208N270L700K766K333J665
$$ 248196 253746 259390 264478 269315 274157 278866 283772 289526 295734 301004 304704 307470 309803 311468
57715C11468J060R40M76j116k898l585l573l857m067l539l225m351o053o482n644
$$ 311468 312528 313468 313944 312828 309930 306345 302772 298915 294848 291309 288084 283733 277680 271198 265554
57700B65554m997m869m357l333k522j930j040k60m44j340k045k531l142l260k269
$$ 265554 260557 255688 251331 247998 245476 243546 242506 242246 241802 240462 238417 235886 232744 229484 227215
57685B27215j147j302k233k208q42P80K199L929O025Q012J0122J3038J6594K0129
$$ 227215 226068 224766 222533 220325 219483 220263 222462 226391 232416 240428 250550 263588 280182 300311
57671C00311K3902K8861L5284M2821N1375O0670O9413P5974P9030P6463O5013
$$ 300311 324213 353074 388358 431179 482554 543224 612637 688611 767641 844104 909117
57660I09117M3227J4373j5247m0555n9244p0521p4549p2829o7330n9337n0124
$$ 909117 952344 966717 951470 910915 851671 781150 706601 633772 566442 507105 456981
57649D56981m1735l5424l0207k4630j9196j5319j2896j0816r027q050p284n851
$$ 456981 415246 379822 349615 324985 305789 290470 277574 266758 257731 249681 242397 236546
57637B36546m436m121m116k955j193n64r64q39j41l08j434k016j566j124j110
$$ 236546 232110 227989 223873 220918 219725 219161 218197 217358 217217 216909 215475 213459 211893 210769 209659
57622B09659r31p78j425k173j463K17N22j172k772k710j941j868k317k590k681
$$ 209659 208728 207950 206525 204352 202889 203106 203628 202456 199684 196974 195033 193165 190848 188258 185577
57607A85577k542j646j95O02J75o46j010r77p80m37l56r99j749j492m81j83j030
$$ 185577 183035 181389 181194 181796 181971 181325 180315 179338 178558 178121 177765 176766 175017 173525 173044 172861 171831
57590A71831j905k082k112k454k704k593k396k108j476j032j587k681k979k378
$$ 171831 169926 167844 165732 163278 160574 157981 155585 153477 152001 150969 149382 146701 143722 141344
57576A41344k110k611k952k640k338k423k385k060j984k221k261k213k603k951
$$ 141344 139234 136623 133671 131031 128693 126270 123885 121825 119841 117620 115359 113146 110543 107592
57562A07592k265j020o98j218r05N54J344M29q84j268j259j691k021j582j039
$$ 107592 105327 104307 103609 102391 101486 102040 103384 103813 102929 101661 100402 98711 96690 95108 94069
57547I4069j253j863k122k149k243j977r46L58J256J723J912J715J277J103J115
$$ 94069 92816 90953 88831 86682 84439 82462 81516 81874 83130 84853 86765 88480 89757 90860 91975
57532I1975N96n72j567j891j902j754j032J80J002J019P89P22O50P02J413K562
$$ 91975 92571 91999 90432 88541 86639 84885 83853 84033 85035 86054 86843 87565 88215 88917 90330 92892
57516I2892L217L208L290L594L414K847K999M102M997N120N297N956O166N339
$$ 92892 96109 99317 102607 106201 109615 112462 115461 119563 124560 129680 134977 140933 147099 152438
57502A52438M273L647K993K055J614J935J826M50j244k030k136k297k351j975
$$ 152438 156711 160358 163351 165406 167020 168955 170781 171231 169987 167957 165821 163524 161173 159198
57488A59198j792k372l019k754j868j374j525j794j781j402p71l87p53j469j526
$$ 159198 157406 155034 152015 149261 147393 146019 144494 142700 140919 139517 138746 138359 137606 136137 134611
57473A34611q68n69j080j577j514j433j618j400o39m54j439k460k326j435p20
$$ 134611 133743 133174 132094 130517 129003 127570 125952 124552 123913 123459 122020 119560 117234 115799 115079
57458A15079j26O79J221J062Q04J086J435J178O62N22N78M72M75O77L71o86j376
$$ 115079 114953 115632 116853 117915 118719 119805 121240 122418 123080 123602 124180 124652 125127 125804 126175 125489 124113
57441A24113p09O22J333J281J039O34Mj41O78J504J114q1n82O1Q77R84M41k47
$$ 124113 123404 124026 125359 126640 127679 128313 128317 128176 128854 130358 131472 131391 130809 130870 131747 132731 133172 132925
57423A32925o41n10q3P1j65k69n1m7n43j036j192j434j911j860p93N15J053P95
$$ 132925 132284 131774 131691 131762 131597 131328 131277 131230 130687 129651 128459 127025 125114 123254 122461 122976 124029 124824
57405A24824K13n27j208j319r09p13q24l08J034J898J376M48L95Q94R38N43K67
$$ 124824 125037 124510 123302 121983 121074 120361 119537 119229 120263 122161 123537 123985 124380 125274 126212 126755 127022
57388A27022k9n21m95N34J583J474O03J10J04N9J98J022K050K454K434K571K529
$$ 127022 126993 126472 125977 126511 128094 129568 130171 130281 130385 130444 130642 131664 133714 136168 138602 141173 143702
57371A43702J731P69O05R43Q80O61J213K307K783K384J881J510Q03p7k87K37N25
$$ 143702 145433 146202 146807 147750 148630 149291 150504 152811 155594 157978 159859 161369 162172 162095 161808 162045 162570
57354A62570K0o91p80j21P91J217O74m06q75k98L62J71l83l35J70L38J15j3j15
$$ 162570 162590 161899 161119 160998 161789 163006 163680 163274 162399 162101 162463 162634 162251 161916 162086 162424 162539 162526 162411
57335A62411n35r21o76k9L12K16l6m64r55p95L27J432J507R60P16O04q3j066j519
$$ 162411 161876 160955 160279 160250 160562 160778 160742 160278 159323 158528 158855 160287 161794 162754 163470 164074 163991 162925 161406
57316A61406j439j225n26R35K040J488j24j067r80q67r43l98O30Q44r3q71m92
$$ 161406 159967 158742 158216 159151 161191 162679 162555 161488 160508 159641 158698 158300 158930 159774 159681 158810 158318
57299A58318M52R32P92M65K98N23J121J597J554J403J730K172J886R15Q7k43l80
$$ 158318 158770 159702 160494 160959 161257 161780 162901 164498 166052 167455 169185 171357 173243 174158 174245 174002 173622
57282A73622n01o76j448l207n222o430o916p594q679r619j0227j0693j0727r939
$$ 173622 173121 172445 170997 167790 162568 156138 149222 141628 132949 123330 113103 102410 91683 81744
57268H1744q806q012p147n325k866r55J89J335K616L336L396L543M029M344M352
$$ 81744 72938 64926 57779 52454 49588 48633 48822 50157 52773 56109 59505 63048 67077 71421 75773
57253G5773M526M968N242N201N065M842M600M826N494N453M030K574K772M091
$$ 75773 80299 85267 90509 95710 100775 105617 110217 115043 120537 125990 130020 132594 135366 139457
57239A39457M624M034L619L846L873L492L405L563L212K722L274M540M758L562
$$ 139457 144081 148115 151734 155580 159453 162945 166350 169913 173125 175847 179121 183661 188419 191981
57225A91981K548K559K584K028J949K921L684L111K045J825K309K513K218J889
$$ 191981 194529 197088 199672 201700 203649 206570 210254 213365 215410 217235 219544 222057 224275 226164
57211B26164J831K206L041L768L615K879K763L572M175L733K751K033J747J927
$$ 226164 227995 230201 233242 237010 240625 243504 246267 249839 254014 257747 260498 262531 264278 266205
57197B66205K682L508L535K912K737L353L977M206M542M996M757L791L274L835
$$ 266205 268887 272395 275930 278842 281579 284932 288909 293115 297657 302653 307410 311201 314475 318310
57183C18310M695N126N369N491M858L485K579K875L618M006M475N684P237Q241
$$ 318310 323005 328131 333500 338991 343849 347334 349913 352788 356406 360412 364887 370571 377808 386049
57169C86049Q387P932P323P181P856Q783R186R372J0235J1657J2706J3344J4321
$$ 386049 394436 402368 409691 416872 424728 433511 442697 452069 462304 473961 486667 500011 514332
57156E14332J5498J5949J5846J6407J7810J9030J9914K1496K3818K5554K6252
$$ 514332 529830 545779 561625 578032 595842 614872 634786 656282 680100 705654 731906
57145G31906K6932K8057K8872K9346L0640L2960L5023L6263L7496L8875L9462
$$ 731906 758838 786895 815767 845113 875753 908713 943736 979999 1017495 1056370 1095832
57134A095832L9510M0706M3296M5506M6647M8200N0790N2911N3909N5448N8480
$$ 1095832 1135342 1176048 1219344 1264850 1311497 1359697 1410487 1463398 1517307 1572755 1631235
57123A631235O1522O3667O6488P1045P5697P9092Q2789Q8607R5699J02548J09803
$$ 1631235 1692757 1756424 1822912 1893957 1969654 2048746 2131535 2220142 2315841 2418389 2528192
57112B528192J18791J29267J40838J54611J71372J90327K11656K38102K71969
$$ 2528192 2646983 2776250 2917088 3071699 3243071 3433398 3645054 3883156 4155125
57103D155125L13147L62368M23773N02007N99756P20740Q72044J060427J289092
$$ 4155125 4468272 4830640 5254413 5756420 6356176 7076916 7948960 9009387 10298479
57094A0298479J560385J877378K238423K632884L045126L458885L855131M212077
$$ 10298479 11858864 13736242 15974665 18607549 21652675 25111560 28966691 33178768
57086C3178768M512752M747027M902022M960442M915984M773924M513199M056545
$$ 33178768 37691520 42438547 47340569 52301011 57216995 61990919 66504118 70560663
57078G0560663L316866K297235J132344J0472r47552j733646k401795k998408
$$ 70560663 73877529 76174764 77307108 77317580 76370028 74636382 72234587 69236179
57070F9236179l535637l999543m362970m597323m686919m637209m469553m211409
$$ 69236179 65700542 61700999 57338029 52740706 48053787 43416578 38947025 34735616
57062C4735616l891956l540146l179951k826940k490982k180167j900119j651716
$$ 34735616 30843660 27303514 24123563 21296623 18805641 16625474 14725355 13073639
57054A3073639j432513j240024j072334r26847q00679o92031n99884n22534m57519
$$ 13073639 11641126 10401102 9328768 8401921 7601242 6909211 6309327 5786793 5329274
57045E329274m02659l56419l17342k83843k54587k28761k06045j86372j69476
$$ 5329274 4926615 4570196 4252854 3969011 3714424 3485663 3279618 3093246 2923770
57036B923770j54691j41459j29831j19959j11247j02666r3877q5387p7518o9956
$$ 2923770 2769079 2627620 2497789 2377830 2266583 2163917 2070040 1984653 1907135 1837179
57026A837179o2408n5003m7735m0057l1376k1412r856L777J9527L6564N3676O9396
$$ 1837179 1774771 1719768 1672033 1631976 1600600 1579188 1569332 1573109 1592636 1629200 1682876 1752272
57014A752272Q0793Q2642O9666M0968K131l7790p1623r6537j12440j19749j19274
$$ 1752272 1833065 1915707 1985373 2026341 2028472 1990682 1919059 1822522 1710082 1590333 1471059
57003A471059j12949j03261r1972q0048o8456n8185m9554m2270l6125l1083k6765
$$ 1471059 1358110 1254849 1162877 1082829 1014373 956188 906634 864364 828239 797156 770391
56992G70391k2585j8394j4441j0755p220m184k257j329m90R94L036M958N709M010
$$ 770391 747806 729412 714971 704216 696996 692812 690555 689226 688736 689730 692766 697724 703433 707443
56978G07443q15p834j4963k0648k4584k6879k7454k6443k4425k1847j8743j5242
$$ 707443 706628 698794 683831 663183 638599 611720 584266 557823 533398 511551 492808 477566
56966D77566j1748q428n088j710J497M737Q534J2805J6742J9923K2706K5027K5551
$$ 477566 465818 457390 452302 450592 452089 456826 465360 478165 494907 514830 537536 562563 588114
56953E88114K2694J6155P097k773j1845j8884k3397k5624k5857k4069k0568j6571
$$ 588114 610808 626963 634060 631287 619442 600558 577161 551537 525680 501611 481043 464472
56941D64472j3404j1206q860n347p63M077Q698J3315J8245K3430K8637L3662L7706
$$ 464472 451068 439862 431002 425655 424892 428969 437667 450982 469227 492657 521294 554956 592662
56928E92662L8800L4718K4946J1374l120j6274k6684l3539l6937l7868l7173l4843
$$ 592662 631462 666180 691126 702500 699380 683106 656422 622883 585946 548078 510905 476062
56916D76062l0870k6094k1609j7801j4702j2642j1668j0903r446p554o005m809
$$ 476062 445192 419098 397489 379688 364986 352344 340676 329773 320327 312773 306768 301959
56904C01959l503k231j401o73N09J751K300K535L482N049O123O370O610P390Q479
$$ 301959 298456 296225 294824 294151 294660 296411 298711 301246 304728 309777 315900 322270 328880 336270 344749
56889C44749R931J2269J5327J8093J9972K1022K0770J8048J2431M783l787j2423
$$ 344749 354680 366949 382276 400369 420341 441363 462133 480181 492612 497395 493608 481185
56877D81185j9808k4351k5706k5036k3332k0437j6115j0944n584r9N516J0983
$$ 481185 461377 437026 411320 386284 362952 342515 326400 315456 309872 309773 315289 326272
56865C26272J6457K2665K9837L7306M4556N1863N9414O6228P0054O7909N7245
$$ 326272 342729 365394 395231 432537 477093 528956 588370 654598 724652 792561 849806
56854H49806L8074J4190q954k7908m2041n1247n4757n2688m6872l9162l0160k0310
$$ 849806 887880 902070 893116 865208 823167 771920 717163 664475 617603 578441 548281 527971
56842E27971j0750k010O980J7438K9174M1408N4189O7938Q2300R6203J08136J15183
$$ 527971 517221 515211 522191 539629 568803 610211 664400 732338 814638 910841 1018977 1134160
56830A134160J12697R6678O7041K8357j2461m9066p7346r5675j04108j03596r6028
$$ 1134160 1246857 1343535 1410576 1438933 1426472 1377406 1300060 1204385 1100277 996681 900653
56819I00653q4376p1517n8667m5641l2593k0387r206J950J3826K6094L8349N0773
$$ 900653 816277 744760 686093 640452 607859 587472 578266 580216 594042 620136 658485 709258
56807G09258O3149P3938Q0719Q0830P1654N1979K3930p324l6489o0145p6219q3486
$$ 709258 772407 846345 927064 1007894 1079548 1131527 1155457 1148133 1111644 1051499 975280 891794
56795H91794q2636p6595o8405n9363m9627l9645l0137k1466j3712o676M67Q475
$$ 891794 809158 732563 664158 604795 555168 515523 485386 463920 450208 443532 443999 452474
56783D52474J6730K3787K9540L5211M0592M2805L8932K8681J3858l268k0078l3733
$$ 452474 469204 492991 522531 557742 598334 641139 680071 708752 722610 719342 699264 665531
56771F65531m2789m7870m9890m8746m4663l9324l4272k9399k4377k0261j8048
$$ 665531 622742 574872 524982 476236 431573 392249 357977 328578 304201 283940 265892
56760B65892j6698j4337j0869p833o224n756n802n726m835l161j867j851k471
$$ 265892 249194 234857 223988 216155 209931 204175 198373 192647 187812 184651 182784 180933 178462
56747A78462k627k418k586l068l235l031k772k356j626r35n29n8M72K85p84j512
$$ 178462 175835 173417 170831 167763 164528 161497 158725 156369 154743 153808 153279 153221 153693 153978 153194 151682
56731A51682j027k23k39o65n85k76l31j76Q19J656J024l99q16O9J059J577J955
$$ 151682 150655 150432 150193 149528 148943 148667 148336 148160 148979 150635 151659 151260 150444 150513 151572 153149 155104
56714A55104J998J203K69N68J967K880K514J657J079O42K19J54M92P07M83Pn09
$$ 155104 157102 158305 158574 159142 161109 163989 166503 168160 169239 169881 170100 170254 170746 171453 171936 171943 171434
56697A71434r05q75m78m25j062j584j223n69n97r47n58M49R52O58L78N60Q19Q79
$$ 171434 170529 169654 169176 168751 167689 166105 164882 164313 163716 162769 162211 162660 163612 164270 164648 165208 166027 166906
56679A66906R02R50R86J293K031K659K737K784L464M401M826M885N147N396N019
$$ 166906 167808 168758 169744 171037 173068 175727 178464 181248 184712 189113 193939 198824 203971 209367 214386
56664B14386M167L428K860K412K565L414L886L193K303K481L188L038K189J911
$$ 214386 218553 221981 224841 227253 229818 233232 237118 240311 242614 245095 248283 251321 253510 255421
56650B55421K316K368J853J508J294K72j744l942n886p742r260r941j0034j0085
$$ 255421 257737 260105 261958 263466 264760 265032 263288 259346 253460 245718 236458 226517 216483 206398
56636B06398r785q638p379p180p799q013p472o608n225k998r08k82o56m86K97
$$ 206398 196613 187975 180596 173416 165617 157604 150132 143524 138299 135301 134393 134111 133455 132969 133266
56621A33266M34j62k67L54N85J44P6P59J304J292J294J348P41l55p68j90M80Q09
$$ 133266 133700 133538 133271 133625 134210 134354 134430 135189 136493 137785 139079 140427 141168 140813 140045 139855 140335 141144
56603A41144J210J503J036L78Q51K122K321J043R4N66J307J133O37P22J058J092
$$ 141144 142354 143857 144893 145271 146122 148244 150565 151608 151702 152268 153575 154708 155345 156067 157125 158217
56587A58217J098J235R48K46J55J070J888J679R52M80J04m33o02%Q41J324J582
$$ 158217 159315 160550 161498 161744 161899 162969 164857 166536 167488 167968 168072 167639 167037 167037 167878 169202 170784
56570A70784J850J949J913K153K664K896K812K986L511L875M105M840O084P111
$$ 170784 172634 174583 176496 178649 181313 184209 187021 190007 193518 197393 201498 206338 212422 219533
56556B19533P692Q149Q141O943N058L909L711L270K176J413J413J344R16J055
$$ 219533 227225 235374 243515 250458 255516 259425 263136 266406 268582 269995 271408 272752 273668 274723
56542B74723K013K450J386l66j520j753j258k62M46j57j753k800k682k326k307
$$ 274723 276736 279186 280572 280206 278686 276933 275675 275413 275859 275702 273949 271149 268467 266141 263834
56527B63834k007j215q36j204j336p63n02j296k332k676k602k629k535k237k394
$$ 263834 261827 260612 259776 258572 257236 256473 255971 254675 252343 249667 247065 244436 241901 239664 237270
56512B37270l262m060m197m007l813l490l285l643l873k674m82N93j97j164r60
$$ 237270 234008 229948 225751 221744 217931 214441 211156 207513 203640 200966 200484 201077 200880 199716 198756
56497A98756m25o06q26k08M92J30r48j575j370o30M18J342J510J020P09P35L98
$$ 198756 198331 197725 196899 196691 197183 197313 196365 194790 193420 192790 193208 194550 196060 197080 197789 198524 198922
56480A98922k26p8R65J574J059L51K12J26k40k20L95P26M59M51R66J080O16O60
$$ 198922 198696 198618 199583 201157 202216 202567 202779 202905 202665 202445 202840 203566 204025 204476 205442 206522 207138 207798
56462B07798J333J119m72j669j147O5O51J038J826K149J280K05p7k03q93j286
$$ 207798 209131 210250 209778 208109 206962 207027 207678 208716 210542 212691 213971 214176 214099 213896 213003 211717
56446B11717m45Q38J297J019O87L03q3J70R99J193L73k23O3J40o32j112n62j07
$$ 211717 211272 212110 213407 214426 215113 215416 215333 215503 216502 217695 218068 217845 217908 218048 217416 216304 215742 215635
56428B15635m77m26Q17J661O97p38o56N40J204J074P88K67m66l49R16J698Q78
$$ 215635 215158 214732 215549 217210 217907 217169 216513 217053 218257 219331 220119 220386 219920 219571 220487 222185 223063
56411B23063j23K53J063Q52N03J561L136L183J865J085J461K035K322K557K509
$$ 223063 222940 223193 224256 225108 225611 227172 230308 233491 235356 236441 237902 239937 242259 244816 247325
56396B47325J952J617K106K700K651K538K797K391O79r03r21l13o58j562j798
$$ 247325 249277 250894 253000 255700 258351 260889 263686 266077 266756 265853 264932 264619 263961 262399 260601
56381B60601j674k109k657k616k771l866m660l792k273j755j659m99J226J963
$$ 260601 258927 256818 254161 251545 248774 244908 240248 236456 234183 232428 230769 230270 231496 233459
56367B33459J892K196K608K176J566K065L040K898J792J132J067O81k3m78j004
$$ 233459 235351 237547 240155 242331 243897 245962 249002 251900 253692 254824 255891 256572 256549 256071 255067
56352B55067j935k247j112K73N12L53J099K073K103K042L127M264L728K322J896
$$ 255067 253132 250885 249773 250046 250558 250911 252010 254083 256186 258228 261355 265619 269347 271669 273565
56337B73565J968Q76p60r77l5K17j77M07J791K221J619J628K543L033K843K976
$$ 273565 275533 276409 275649 274672 274637 274854 274677 275084 276875 279096 280715 282343 284886 287919 290762 293738
56321B93738L319K754J550J153J703K086K113K409K553J732P11Q06J509J483J158
$$ 293738 297057 299811 301361 302514 304217 306303 308416 310825 313378 315110 315821 316627 318136 319619 320777
56306C20777J818K914K946K251K219K594K322K179L540N296N165L470K497K745
$$ 320777 322595 325509 328455 330706 332925 335519 337841 340020 343560 348856 354021 357491 359988 362733
56292C62733K885K904L974N574N974N380N492O288O291N645N803O513O298N563
$$ 362733 365618 368522 372496 378070 384044 389424 394916 401204 407495 413140 418943 425456 431754 437317
56278D37317O005P281P474O593O390O998P029O666P298Q423Q366P767Q857J1446
$$ 437317 443322 450603 458077 464670 471060 478058 485087 491753 499051 507474 515840 523607 532464 543910
56264E43910J3158J3546J4426J6258J7736J8900K1054K3783K5658K7712L2345
$$ 543910 557068 570614 585040 601298 619034 637934 658988 682771 708429 736141 768486
56253G68486L8919M4504M9004N5309O4146P3045Q0931Q9426R8800J06796J12606
$$ 768486 807405 851909 900913 956222 1020368 1093413 1174344 1263770 1362570 1469366 1581972
56242A581972J18046J23698J27516J28360J27364J24704J18501J08059R4950Q0001
$$ 1581972 1700018 1823716 1951232 2079592 2206956 2331660 2450161 2558220 2653170 2733171
56232B733171O2411M2504K2124J686j9738m0911n8606p1999q3285r3382j00647
$$ 2733171 2795582 2838086 2860210 2861896 2842158 2801247 2742641 2670642 2587357 2493975 2393328
56221B393328j04543j06740j07786j06375j02831r9540r7007r3065q6997q0813
$$ 2393328 2288785 2182045 2074259 1967884 1865053 1765513 1668506 1575441 1488444 1407631
56211A407631p5663p0522o5143o0668n6689n1482m5751m2156m0514l7645l2711
$$ 1407631 1331968 1261446 1196303 1135635 1078946 1027464 981713 939557 899043 861398 828687
56200H28687k8420k6071k3803k0760j8629j7793j6316j3871j2447j2002j0001
$$ 828687 800267 774196 750393 729633 711004 693211 676895 663024 650577 638575 628574
56189F28574o394m474n264n773m392l269l630l422j667o07j373j835q30k58j011
$$ 628574 622180 617706 612442 606669 602277 599008 595378 591956 590289 589682 588309 586474 585644 585386 584375
56174E84375j111J94P59j34j71J397K054Q61L74J701K390J428J518L857N488M560
$$ 584375 583264 583458 584217 584083 583912 585309 587363 588224 588598 590299 592689 594117 595635 599492 604980 609540
56158F09540L626M866O497O749P031Q369Q960Q129Q385J0825J2735J2561J2870
$$ 609540 613166 618032 624529 631278 638309 646678 655638 663767 672152 682977 695712 708273 721143
56145G21143J5574J8583K0135K2155K6312L0982L5039M0493M8474N6747O4002
$$ 721143 736717 755300 775435 797590 823902 854884 889923 930416 978890 1035637 1099639
56134A099639P2364Q2970R3322J01623J09060J15174J15877J09165R8360Q6861
$$ 1099639 1172003 1254973 1348295 1449918 1558978 1674152 1790029 1899194 1997554 2084415
56124B084415P4468O1635N1959M6898M2756L6210K8235J9810R073l895j4797k1232
$$ 2084415 2158883 2220518 2272477 2319375 2362131 2398341 2426576 2446386 2455459 2451564 2436767 2415535
56112B415535k6071l1732l6704m0999m8910o2238p6392q7306r6513j05279j09805
$$ 2415535 2389464 2357732 2321028 2280029 2231119 2168881 2092489 2005183 1908670 1803391 1693586
56101A693586j07079r9930r1667q1223o8202n6754m9404m2566l3185k4294j9031
$$ 1693586 1586507 1486577 1394910 1313687 1245485 1188731 1139327 1096761 1063576 1039282 1020251
56090A020251j4972r626n662n219m764j283K106K283K094M430O248M623K980N005
$$ 1020251 1005279 995653 989991 984772 980008 978725 980831 983114 985208 989638 995886 1000509 1003489 1008494
56076A008494P914Q050P620R519J1108R675Q521J0993J3977J3864J3415J5931
$$ 1008494 1016408 1024458 1032078 1041597 1052705 1062380 1070901 1081894 1095871 1109735 1123150 1139081
56064A139081J8346J7017J4725J4979J5054J1807Q582R118J0368Q639O870Q512
$$ 1139081 1157427 1174444 1189169 1204148 1219202 1231009 1239591 1248709 1259077 1267716 1274586 1283098
56052A283098J0316Q871P930J1321J5002J4362J2964J5511J8666J7649J5561J7073
$$ 1283098 1293414 1302285 1310215 1321536 1336538 1350900 1363864 1379375 1398041 1415690 1431251 1448324
56040A448324J9195J7622J5914J8879K3150K3824K4122K8696L3877L4511L3970
$$ 1448324 1467519 1485141 1501055 1519934 1543084 1566908 1591030 1619726 1653603 1688114 1722084
56029A722084L7230M0790L9788L8229M1349M4874M2971L9815M1854M5749M5616
$$ 1722084 1759314 1800104 1839892 1878121 1919470 1964344 2007315 2047130 2088984 2134733 2180349
56018B180349M4928M9152N4058N3685N2425N6504O1328O0393N8591O2984O8665
$$ 2180349 2225277 2274429 2328487 2382172 2434597 2491101 2552429 2612822 2671413 2734397 2803062
56007B803062O8087O6012P0403P7092P8821Q0520Q9606J00139J03467J05322J14939
$$ 2803062 2871149 2937161 3007564 3084656 3163477 3243997 3333603 3433742 3537209 3642531 3757470
55996C757470J26738J31121J33588J43946J56473J61171J64541J77910J95169
$$ 3757470 3884208 4015329 4148917 4292863 4449336 4610507 4775048 4952958 5148127
55987E148127K04394K11383K28384K49954K64254K77580L02162L30869L50919
$$ 5148127 5352521 5563904 5792288 6042242 6306496 6584076 6886238 7217107 7568026
55978G568026L70977M06206M48593M82531N17037N70103O34384O93240P57011
$$ 7568026 7939003 8345209 8793802 9276333 9793370 10363473 10997857 11691097 12448108
55969A2448108Q45920R51578J056023J173815J331562J522320J728907J975477
$$ 12448108 13294028 14245606 15301629 16475444 17807006 19329326 21058233 23033710
55961B3033710K303417K715831L206924L828096M659249N736348P081423Q775430
$$ 23033710 25337127 28052958 31259882 35087978 39747227 45483575 52564998 61340428
55953F1340428J0909108J3491436J6515179K0065704K4195019K8695335L3172274
$$ 61340428 72249536 85740972 102256151 122321855 146516874 175212209 208384483
55946B08384483L7279482M0498555M1534332L8390039K9681205J6063033J78408
$$ 208384483 245663965 286162520 327696852 366086891 395768096 411831129 412009537
55939D12009537j4859543k6896628l5016485l9118928l9640849l7471467l3697936
$$ 412009537 397149994 370253366 335236881 296117953 256477104 219005637 185307701
55932A85307701k9242677k4726020k0550217j6947301j3958284j1498514r485267
$$ 185307701 156065024 131339004 110788787 93841486 79883202 68384688 58899421
55925E8899421p867604o572093n507442m623917l909266l332116k843008k423625
$$ 58899421 51031817 44459724 38952282 34328365 30419099 27086983 24243975 21820350
55917B1820350k083247j810735j575164j368310j202980j073079r55110q45511
$$ 21820350 19737103 17926368 16351204 14982894 13779914 12706835 11751725 10906214
55909A0906214p59044o93134o28754n63788n12373m73578m32057l87711l54641
$$ 10906214 10147170 9454036 8825282 8261494 7749121 7275543 6843486 6455775 6101134
55900F101134l32266l05909k74779k52197k38994k22611k01987j88422j81994
$$ 6101134 5768868 5462959 5188180 4935983 4696989 4474378 4272391 4083969 3901975
55891C901975j70932j54407j43344j38357j28642j13217j02330r7289q8772p5777
$$ 3901975 3731043 3576636 3433292 3294935 3166293 3053076 2950746 2853457 2764685 2688908
55881B688908o6984o2622n3472l8707k7062j9723r294L719J0135Q410N478J005
$$ 2688908 2621924 2559302 2505830 2467123 2440061 2420338 2411044 2414763 2424898 2433308 2438786 2439791
55869B439791j2913l5482n6241p1322q5808r9435j05024j02332r8929r6179q8292
$$ 2439791 2426878 2391396 2335155 2263833 2178025 2078590 1973566 1871234 1772305 1676126 1587834
55858A587834p6146o7935o4741n9197m9837m3378m1294l7306l0203k6338k7335
$$ 1587834 1511688 1443753 1379012 1319815 1269978 1226600 1185306 1148000 1117797 1091459 1064124
55847A064124k7371k4740k4400k7207k7854k5342k4549k5910k4331j9734j7850
$$ 1064124 1036753 1012013 987613 960406 932552 907210 882661 856751 832420 812686 794836
55836G94836j9247j8270j4132j2376j4015j3914j1262j0988j3369j2879r008p590
$$ 794836 775589 757319 743187 730811 716796 702882 691620 680632 667263 654384 645376 637786
55824F37786r664r563o043m814p717r582q323q168j0318j0218o870n349p208p527
$$ 637786 628122 618559 612516 607702 599985 590403 582080 573912 563594 553376 546506 541157 533949 526422
55810E26422m371k089k394j131L033N530M581M569P513R374P990O759P292O170
$$ 526422 522051 519962 517568 516437 519470 525000 529581 534150 541663 551037 559027 565786 573078 579248
55796E79248K121j124k204m894j0520j4926j5941j6678j8506j7997j3915j0150
$$ 579248 581369 580245 578041 573147 562627 547701 531760 515082 496576 478579 464664 454514
55784D54514q652o347k180k85k795o016o968p543r092r191o910n246n362m236
$$ 454514 445862 439515 437335 437050 434255 428239 421271 413728 404636 395445 388535 383289 377927 373691
55770C73691o94K025K287K620L837K818j133l978l784l832o098p671o693n908
$$ 373691 372997 375022 377309 379929 383766 386584 385451 381473 377689 373857 367759 360088 353395 347487
55756C47487p108p723o104m739n193n197l661l349n644p766p887p913q757q151
$$ 347487 340379 332656 326552 321813 316620 311423 307762 304413 298769 291003 283116 275203 266446 258295
55742B58295n663m488n693o104m330l267m157m027j791q77k692l454r61J292M31
$$ 258295 252632 248144 242451 236347 232017 228750 224593 220566 218775 217898 215206 211752 210791 212083 212514
55727B12514j007l99J99j308k748k088j508l026m462l671k533k978l250j712l58
$$ 212514 211507 211108 211307 209999 207251 205163 203655 200629 196167 192496 189963 186985 183735 182023 181665
55712A81665q46j072Q20K857L008K667L252L265J881J408K967L810K011k16r27
$$ 181665 180819 179747 180567 183424 186432 189099 192351 195616 197497 198905 201872 205682 207693 207477 206550
55697B06550j839m133n345l955k722l810m821l418j659j886k305p58R77P86M21
$$ 206550 204711 200578 195233 191278 188556 184746 179925 176507 174848 172962 170657 169899 170876 171662 172083
55682A72083K072M087M202L682M364M878L664K491L071L407J412j017j459j315
$$ 172083 174155 178242 182444 186126 190490 195368 199032 201523 204594 208001 209413 208396 206937 205622
55668B05622k672m016l215j839k274l250k460r97r51j098Q02L534M431L925M124
$$ 205622 202950 198934 195719 193880 191606 188356 185896 184899 183948 182850 183652 187186 191617 195542 199666
55653A99666M698M007K644K223K178R78r40k418l968o163p678p565p312q007p889
$$ 199666 204364 208371 211015 213238 215416 216394 215454 213036 209068 202905 195227 187662 180350 172343 164454
55638A64454n579l021k253j946l07J235O92p74j137j097j963k499j380l17j177
$$ 164454 158875 155854 153601 151655 151348 152583 153275 152501 151364 150267 148304 145805 144425 144108 142931
55623A42931k397j860q93j649k877k254p56p08j472j066k04p56j897j698r54j606
$$ 142931 140534 138674 137781 136132 133255 131001 130245 129537 128065 126999 126795 126039 124142 122444 121490 119884
55607A19884k813k417r25l87o29k25K32o29j797j427k80k33p78l76K45m44j479
$$ 119884 117071 114654 113729 113342 112713 112488 112720 112091 110294 108867 108587 108354 107576 107200 107445 107001 105522
55590A05522j082j72o31j536p84Q70J095P3k74K4l00o02M86J907J805J136J943
$$ 105522 104440 104268 103637 102101 101317 102187 103282 103355 103081 103105 102805 102203 102689 104596 106401 107537 109480
55573A09480L295K818J213J160K605L168K621K887L984L957K725K206K637K321
$$ 109480 112775 115593 116806 117966 120571 123739 126360 129247 133231 137188 139913 142119 144756 147077
55559A47077J053L65L33n39k180k867k440k561l575l986l226k332j808j194p35
$$ 147077 148130 148495 148828 148289 146109 143242 140802 138241 134666 130680 127454 125122 123314 122120 121385
55544A21385j098j726j585j037p63J21K363M139L228O65p63p72j181k166k307
$$ 121385 120287 118561 116976 115939 115176 115297 117660 121799 125027 125692 124929 124157 122976 120810 118503
55529A18503j861k486l945m298l300k544k388j737p58q50j870k190j442o43J17
$$ 118503 116642 114156 110211 105913 102613 100069 97681 95944 95186 94336 92466 90276 88834 88191 88308
55514H8308J418K424J811M12J63Q36O52m34r81j055j887k979k774j811k022l184
$$ 88308 89726 92150 93961 94373 94536 95372 96024 95590 94609 93554 91667 88688 85914 84103 82081 78897
55498G8897l327k366k024k296j437N23J684J794K467L713L748K559K159K853K672
$$ 78897 75570 73204 71180 68884 67447 67970 69654 71448 73915 77628 81376 83935 86094 88947 91619
55483I1619J167L69J120J715J184P66J114R29l63j332j104o94p09j92J201K108
$$ 91619 92786 93155 94275 95990 97174 97940 99054 99983 99620 98288 97184 96490 95781 95589 96790 98898
55467I8898J692Q51L85n7m96j79O35N21p82j842j876j679j724j427p39n00o87
$$ 98898 100590 101441 101826 101769 101273 101094 101729 102250 101468 99626 97750 96071 94347 92920 92181 91681 90994
55450I0994k43R31J656J480J121P79pq11p26k36n05r48j5J730K075Q31J38P64
$$ 90994 90751 91682 93338 94818 95939 96718 96711 95900 95174 94938 94433 93485 93470 95200 97275 98106 98244 99008
55432I9008J013rr57q66o01p04l40P00J191P01L93P41N99n24j353r36M7Q19J496
$$ 99008 100021 100012 99055 98189 97588 96884 96544 97244 98435 99136 99529 100270 100869 100345 98992 98056 98103 98922 100418
55413A00418J977J721J120J163J438N81j032j390q0R98O78r1n27j155j976j903
$$ 100418 102395 104116 105236 106399 107837 108418 107386 105996 105916 106914 107592 107501 106974 105819 103843 101940
55397A01940r31n62j250j608r86m85o35m78K15J94p48r74J50R36J96q44p95k28
$$ 101940 101009 100447 99197 97589 96603 96118 95483 95005 95220 95414 94666 93692 93842 94778 94974 94130 93335 93107
55379I3107j52k66m7L7l29m87j45j12p64j326j389j620k249k526k163j713j077
$$ 93107 92955 92689 92642 92679 92350 91863 91718 91606 90842 89516 88127 86507 84258 81732 79569 77856 76779
55362G6779M47K218K475J024l39o11n81n94K35J813K481J661Q56J027J211O58
$$ 76779 77226 79444 81919 82943 82604 81993 81412 80818 81053 82866 85347 87008 87864 88891 90102 90760
55346I0760J78K91K42k34k59K24K4q82r13K27P61o4o26J08Q23M68P8M93O79o4
$$ 90760 90938 91229 91471 91237 90978 91202 91226 90344 89431 89658 90419 90355 89729 89837 90660 91128 91206 91699 92378 92314
55326I2314n75q2K10n35j113n79Pk05j43Q90J503O61k82KM78j50j042j043q92
$$ 92314 91739 91657 91867 91332 90219 89640 89647 89442 89299 90189 91692 92353 92071 92073 92551 92401 91359 90316 89424
55307H9424j438j519mJ688J562J79n04j48K25M15Q24J070O66K81O63J264J373
$$ 89424 87986 86467 86463 88151 89713 89892 89388 89240 89465 89880 90704 91774 92440 92721 93384 94648 96021
55290I6021J356J470Q89n49j278l22Q57O55j12J09R15J010O02N84N47l09j291
$$ 96021 97377 98847 99736 99187 97909 97587 98444 99099 98987 99096 100011 101021 101623 102207 102754 102445 101154
55273A01154j316q54r12j071m42M45N57K38L18L69l19j019p27n5j37o09n07k12
$$ 101154 99838 98984 98072 97001 96559 97004 97561 97799 98117 98486 98167 97148 96421 96366 96229 95620 95113 94901
55255I4901n45r80o14n6l33q23k81Q54J213Q21O58O33k9q68p62N3M07J94J75K00
$$ 94901 94356 93376 92762 92706 92373 91550 91269 92123 93336 94157 94815 95448 95419 94551 93789 93842 94249 94443 94618 94818
55235I4818m23j180q37M73J331J068L16l11o62m82K61P44K74n05n44k8J33j15
$$ 94818 94395 93215 92378 92851 94182 95250 95566 95255 94593 94111 94372 95116 95390 94885 94341 94313 94446 94331
55217I4331j52Q3K87O52J390J874J439M81j96m94n85k97J49j03j056j332l33N28
$$ 94331 94179 94262 94549 95201 96591 98465 99904 100385 100189 99695 99110 98813 98962 98859 97803 96471 96138 96666
55199I6666J15m27L38J577J617P06K49L16L6l36N2P41O35M5M7M20J23o21p16k37
$$ 96666 96781 96354 96692 98269 99886 100592 100841 101157 101193 100857 100909 101650 102285 102330 102377 102797 102920 102299 101583 101346
55179A01346k15p17r30p56o58l67N60J404J230N82N18O52pr19p67K12P38P72J203
$$ 101346 101131 100414 99484 98728 98070 97703 98263 99667 100897 101479 101997 102649 102642 101723 100956 101168 101906 102678 103881
55160A03881J713J223J29j37L56K08o45p44K70J066R58P84J013Q95Q1o39p41p16
$$ 103881 105594 106817 106946 106809 107165 107373 106728 105984 106254 107320 108278 109062 110075 110970 111051 110412 109671 108955
55142A08955q88q89n99m24m09j92O1j69p05r39r49j133j095l28L91j17j425j974
$$ 108955 108067 107178 106579 106155 105746 105554 105615 105446 104741 103802 102853 101720 100625 100297 100688 100571 99146 97172
55124I7172j389o25p8O61J252P60m64q35K02J548K225K289J839P60l17l69M57
$$ 97172 95783 95158 95080 95741 96993 97753 97289 96454 96656 98204 100429 102718 104557 105317 105000 104631 105088
55107A05088R63P41M71M01P3l60j49N04N45q1k51L70P86M70J99N60J084J332J562
$$ 105088 106051 106792 107263 107664 107737 107377 107228 107732 108277 108196 107945 108315 109101 109571 109770 110330 111414 112746 114308
55088A14308J817J596Q51J93k02p58j365j263m11K49J86j44l79p12j094j054n91
$$ 114308 116125 117721 118572 118765 118563 117805 116440 115177 114766 115015 115201 115057 114678 113966 112872 111818 111227
55071A11227k31rN10J113J021J92n21o72o13n33k35R2l2m40n44m27o02q53n97
$$ 111227 110996 110987 111497 112610 113631 113823 113302 112630 112017 111484 111249 111341 111309 110869 110325 109898 109296 108443 107846
55052A07846j88m68j123r91j03K37m60j097p52J33P30Q42N94J47p6K41O33N20
$$ 107846 107658 107190 106067 105076 104973 105210 104750 103653 102901 103034 103764 104606 105200 105347 105271 105512 106145 106665
55034A06665K71O13J256J364J035R09P49m3p95l17Q84J102J69l10L13P99K50o05
$$ 106665 106936 107549 108805 110169 111204 112113 112862 112819 112024 111707 112591 113693 113862 113552 113865 114664 114914 114309
55016A14309j009j241j417q31O33J861K028J519P97k74j480j976j596j180j087
$$ 114309 113300 112059 110642 109811 110444 112305 114333 115852 116649 116375 114895 112919 111323 110143 109056
55001A09056o43L98J207J263J205J535J704J094j6j000j466j062L05J741K018
$$ 109056 108413 108811 110018 111281 112486 114021 115725 116819 116803 115803 114337 113275 113580 115321 117339
54986A17339J137K75N4J11L26J070K017K168J362M24k95j148j856j638q35o73
$$ 117339 118476 118751 118805 118916 119242 120312 122329 124497 125859 126283 125988 124840 122984 121346 120511 119838
54970A19838j181j036O7Q18N33J71M65Q24Q47J132J811J899J035K22K9l23j133
$$ 119838 118657 117621 117688 118506 119039 119210 119675 120499 121346 122478 124289 126188 127223 127445 127474 127151 126018
54953A26018j267o8J281J514J029P57O18J98k53n50j100j797j626l28Q31R11O36
$$ 126018 124751 124683 125964 127478 128507 129264 129882 130080 129827 129277 128177 126380 124754 124426 125257 126168 126804
54936A26804R40J520J877K425L369L741K817J456Q57J058J661K879M717O241O857
$$ 126804 127744 129264 131141 133566 136935 140676 143493 144949 145806 146864 148525 151404 156121 162362 169219
54921A69219P289Q131Q533P537N652L811J774j024l917n733o427o743o853o520
$$ 169219 176508 184639 193172 200709 206361 210172 211946 210922 207005 201272 194845 188102 181249 174729
54907A74729o037n813n566m870m027l446k904k208j860k080j985q22O68J252R10
$$ 174729 168692 162879 157313 152443 148416 144970 142066 139858 137998 135918 133933 133111 133779 135031 135941
54892A35941M97L08J11J46Q69J990K699K804K856L359M382N699O877P509P662
$$ 135941 136438 136746 136857 137003 137872 139862 142561 145365 148221 151580 155962 161661 168538 176047 183709
54877A83709P697P499O539M848L032J230r37l196m590n017n460o302o761o566
$$ 183709 191406 198905 205444 210292 213324 214554 213617 210421 205831 200814 195354 189052 182291 175725
54863A75725o626p195o956n053k668j405j255j383j740k508k985k430j340o66
$$ 175725 169099 161904 154948 149895 147227 145822 144567 143184 141444 138936 135951 133521 132181 131515
54849A31515n01n16r14j769k238j630n57LO5R9l5n28q24n06k73q40j612j557p88
$$ 131515 131014 130498 129584 127815 125577 123947 123390 123393 123458 123557 123522 122994 122170 121664 121391 120551 118939 117382 116594
54830A16594j06L26P87J078R03O46P40Q16L59l26p01q52r61o43K24Q50O40K01
$$ 116594 116488 116814 117601 118679 119582 120228 120968 121784 122143 121817 121116 120264 119303 118660 118884 119734 120374 120575
54812A20575L58R18J293J468J434O90o80j453q93L5K07L2L52P89O05K74N90J044
$$ 120575 120933 121851 123144 124612 126046 126736 126056 124603 123710 123745 123952 123984 124336 125125 125730 126004 126594 127638
54794A27638O53k19m70q3J45J74N47J149J465J658K045K091J285M04N19J252J490
$$ 127638 128291 128072 127602 127519 127664 127838 128385 129534 130999 132657 134702 136793 138078 138482 139001 140253 141743
54777A41743J251J388J923K222K425L183M249M860N167N916O981P605P761P815
$$ 141743 142994 144382 146305 148527 150952 154135 158384 163244 168411 174327 181308 188913 196674 204489
54763B04489P244N192K146m99k332m000n547o265o137n961n971n695n116m718
$$ 204489 211733 216925 219071 218572 216240 212240 206693 200428 194291 188330 182359 176664 171548 166830
54749A66830m379l533k432j947k085j973j410j096j264j274p75j58L27Q97J496
$$ 166830 162451 158918 156486 154539 152454 150481 149071 147975 146711 145437 144662 144504 144831 145728 147224
54734A47224J706J474J268J464K196L550N150O025N716N112N245N801N865N462
$$ 147224 148930 150404 151672 153136 155332 158882 164032 170057 175773 180885 186130 191931 197796 203258
54720B03258N164M684L245R87j347l672o127p848p831o728o142o318o077n003
$$ 203258 208422 213106 216351 217338 215991 212319 206192 198344 190513 183785 177643 171325 165248 160245
54706A60245m001l582l216k611k218k091j618o97l7l0l40p28j259j629j396q50
$$ 160245 156244 152662 149446 146835 144617 142526 140908 140211 140174 140144 139804 139076 137817 136188 134792 133942
54690A33942o08m86N7N67R0j041j404n72M04P35Q04J023J100P65J54o82j683k187
$$ 133942 133334 132848 132905 133472 133562 132521 131117 130545 130949 131684 132488 133511 134611 135376 135530 134848 133165 130978
54672A30978j563l80K16J74L08O36M75M7L70J321J571O68l04n72o28r58j255j343
$$ 130978 129415 129035 129251 129425 129733 130369 130844 130891 131261 132582 134153 134821 134517 133945 133317 132359 131104 129761
54654A29761j507j489n99P58J189M31j50K50P14L95q8M8L60J16l97n40l80k60
$$ 129761 128254 126765 126166 126924 128113 128544 128394 128644 129358 129753 129665 129713 130073 130189 129792 129252 128872 128612
54636A28612j11J53K94L63P90J404J289J47j125j721j802j612q46M34J328J256
$$ 128612 128501 128654 128948 129311 130101 131505 132794 132941 131816 130095 128293 126681 125835 126269 127597 128853
54620A28853P23L03j12m89k42N83P92k47j379j230j78L80Q4k30lM85Q68J055R41
$$ 128853 129576 129879 129767 129278 129036 129619 130411 130164 128785 127555 127377 127757 127841 127611 127608 128093 128961 130016 130957
54601A30957M44j64n18n67m63k03K30O14P23O02L82J05j27j54m3m3k02l60n00
$$ 130957 131401 131237 130719 130152 129689 129486 129716 130330 131053 131655 132037 132142 132015 131861 131818 131775 131573 131213 130713
54582A30713o76o39j36M99O54L52J65K47K24Op7j9j67m26k71K91O16M38J42r0
$$ 130713 130037 129398 129262 129761 130415 130767 130932 131179 131403 131409 131332 131313 131146 130720 130449 130740 131356 131794 131936 131846
54562A31846m98q95o07L85J127R52L05p3l8J70L46J82n45j308j170k6J143J572
$$ 131846 131348 130453 129846 130231 131358 132310 132615 132542 132504 132674 133020 133202 132657 131349 130179 130153 131296 132868
54544A32868J493J395J281J099J112J436J717J676J415J032L97m44j194j718j999
$$ 132868 134361 135756 137037 138136 139248 140684 142401 144077 145492 146524 146921 146477 145283 143565 141566
54529A41566j789r45q2o0p88j292j042m16P2K40j4n67p79k44L67J66m50l76L51
$$ 141566 139777 138832 138750 138690 137902 136610 135568 135152 135224 135464 135450 134883 134104 133860 134227 134393 133943 133567 133918
54510A33918O39K39J4K36K18j51l3O48P24l12j299j139l20P5j09l79m49j64N67
$$ 133918 134557 134796 134810 135046 135264 135113 135080 135728 136452 136140 134841 133702 133382 133457 133348 132969 132520 132356 132923
54491A32923J246J023n3q22n50K84R72J420J593J190L47k75m22l89j18P01J551
$$ 132923 134169 135192 135139 134317 133767 134051 135023 136443 138036 139226 139573 139298 138876 138487 138369 139070 140621
54474A40621J425N38K00P65J196J027J063J562J536O52J10O34J195Q35K32K45
$$ 140621 142046 142584 142784 143549 144745 145772 146835 148397 149933 150585 150695 151329 152524 153359 153591 153836
54458A53836L27l08j166j409j228j071o48J85O59L65J39N91R01L09m10l00J07
$$ 153836 154163 153855 152689 151280 150052 148981 148333 148518 149177 149542 149681 150272 151173 151482 151072 150772 150879
54441A50879p0l52Q9O73L40n97j030q98q60p97j93N08M26k17m87l01k62l08R8
$$ 150879 150809 150457 150546 151219 151559 150962 149932 149034 148174 147377 147184 147692 148118 147901 147414 147113 146851 146543 146641
54422A46641O60N17l17q97o92n6N37Q28O17L1l39k49k44o71r24m15L76Q26J285
$$ 146641 147301 147818 147501 146604 145912 145856 146393 147221 147838 147869 147530 147281 147037 146366 145442 145027 145403 146229 147514
54403A47514K257L169L173K517J956J443N85j39NO08O47R6k15o2O9J11L84O69
$$ 147514 149771 152940 156113 158630 160586 162029 162614 162475 162480 163088 163735 163831 163616 163554 163623 163734 164118 164787
54385A64787L38n61j301j439j027k05O72Q72J30p53q88m20O9O04J262J386M87
$$ 164787 165125 164564 163263 161824 160797 160592 161264 162136 162266 161513 160625 160205 160274 160878 162140 163526 164013
54368A64013o01o73J61Q51J064J276J670K054K481K949K883K021J259J502K235
$$ 164013 163412 162739 162900 163751 164815 166091 167761 169815 172296 175245 178128 180149 181408 182910 185145
54353A85145K417K131K004J663L14j528k577k764l131l824l895l142k534k546
$$ 185145 187562 189693 191697 193360 193674 192146 189569 186805 183674 179850 175955 172813 170279 167733
54339A67733k509j932j289j106j271j506j660j375l90P93J327J123P18K65l99
$$ 167733 165224 163292 162003 160897 159626 158120 156460 155085 154695 155488 156815 157938 158656 158921 158522
54324A58522r17o53J94P44O04Q6n19j005r06j27M16q4r72j041m25j98m52l30J78
$$ 158522 157605 156952 157146 157890 158494 158580 158061 157056 156150 156023 156439 156355 155383 154342 153917 153719 153267 152937 153115
54305A53115P4q62j623j625j370j219p96L5P11Q41O05P3p76j307o19J016K217
$$ 153115 153189 152327 150704 149079 147709 146490 145694 145729 146440 147281 147886 147959 147183 145876 145257 146273 148490
54288A48490K253J747J445J384J433J638J710J196L62k0J11Q3k58l64j71l21r22
$$ 148490 150743 152490 153935 155319 156752 158390 160100 161296 161658 161638 161749 161832 161574 161210 161039 160718 159796
54271A59796j277j072p26l14O44J924K370J527M41J49L33J15m76o32J19J380K252
$$ 159796 158519 157447 156721 156407 157051 158975 161345 162872 163313 163462 163795 163910 163434 162802 162921 164301 166553
54254A66553K075J156O12J047J698J532P73K97j6r93k396k986k423j657j186m43
$$ 166553 168628 169784 170396 171443 173141 174673 175446 175743 175727 174734 172338 169352 166929 165272 164086 163643
54238A63643O20Q89j77j426j588r27m64l86j79K83O53Q01Q89R80R58P10J98l35
$$ 163643 164263 165152 164975 163549 161961 161034 160570 160184 160005 160288 160941 161742 162631 163611 164569 165279 165477 165142
54220A65142m27k0J87l32r26o37K40M95j74q89j102j113r72k47Q35J277P51P0
$$ 165142 164715 164695 164882 164550 163624 162987 163227 163722 163548 162659 161557 160444 159472 159225 160060 161337 162088 162158
54202A62158k27n43j113j359r62m21n5M91J218J351O36k8oR9l59q39n19L49Q90
$$ 162158 161931 161388 160275 158916 157954 157533 157478 157969 159187 160538 161174 161146 161140 161239 160880 160041 159522 159871 160761
54183A60761Q21N03K25J22K71L95N8m65k57Q56J762J524O24J66M70J022J258Q77
$$ 160761 161582 162085 162310 162432 162703 163098 163156 162691 162434 163290 165052 166576 167200 167366 167836 168858 170116 170993
54165A70993n1r12j027o30o37j218j490r84m14l94m89k10ol27n82j16N54M86j58
$$ 170993 170942 170030 169003 168373 167736 166518 165028 164044 163630 163236 162747 162537 162531 162204 161622 161506 162060 162546 162388
54146A62388l95J6L56J56j75l8N65J054Q91J95k42J34P96P61on51m12k02m33o68
$$ 162388 161993 162009 162365 162521 162346 162308 162873 163927 164818 165013 164771 164905 165701 166462 166456 165905 165493 165291 164858 164190
54126A64190m19J7J64J51K48K57j8k86k54p8J34O40J372J606R10p8m48n8O77J493
$$ 164190 163771 163788 163952 164103 164351 164608 164590 164304 164050 163972 164106 164746 166118 167724 168634 168556 168108 168050 168727 170220
54106A70220K156K217J465K80q53j676j780o80J173K287J839Q84J005K283L376
$$ 170220 172376 174593 176058 176338 175485 173809 172029 171349 172522 174809 176648 177532 178537 180820 184196
54091A84196L421K962L102M292N936O898O462N001L458K171O59j344l320m640
$$ 184196 187617 190579 193681 197973 203909 210807 217269 222270 225728 227899 228558 227214 223894 219254
54077B19254n180m978m051k893k406k784l129k636j608p79k98N5K57K79M79J085
$$ 219254 214074 209096 205045 202152 199746 196962 193833 191197 189589 188810 188512 188567 188824 189103 189582 190667
54061A90667J684J726J294R44J063J662K499L119L172K811K441K042J300M01j06
$$ 190667 192351 194077 195371 196315 197378 199040 201539 204658 207830 210641 213082 215124 216424 216825 216719
54046B16719k27m73q42p55k19O5j1L15J287K107K295K483L167L821L985M176M863
$$ 216719 216492 216019 215177 214422 214203 214268 214257 214572 215859 217966 220261 222744 225911 229732 233717 237893 242756
54029B42756N451N234M561M199M237M394M640M763M117K631J327J053J400J635
$$ 242756 248207 253441 258002 262201 266438 270832 275472 280235 284352 286983 288310 289363 290763 292398
54015B92398J781J982J692N64o26r70o97n57p07j113k215m033n419n483n041n380
$$ 292398 294179 296161 297853 298417 297791 296821 296124 295567 294860 293747 291532 287499 282080 276597 271556 266176
53999B66176o149n924m508l160k628k383j874j403j401j816k336k706k678k241
$$ 266176 260027 254103 249595 246435 243807 241424 239550 238147 236746 234930 232594 229888 227210 224969
53985B24969j792j641j557j301j198j605k166k264j852j270o27m4K4n55j050p47
$$ 224969 223177 221536 219979 218678 217480 215875 213709 211445 209593 208323 207696 207652 207676 207121 206071 205324
53969B05324j8K55q0n01o86n82k1Q94J445J175P23R83J810K358K408K479K816
$$ 205324 205306 205561 205481 204980 204294 203712 203691 204585 206030 207205 207928 208911 210721 213079 215487 217966 220782
53952B20782L117L139K989K941L367M476N858O771P277Q374J0482J2791J4585
$$ 220782 223899 227038 230027 232968 236335 240811 246669 253440 260717 269091 279573 292364 306949
53939C06949J6148J7448J7089J3869Q640L303j275n147p869q764q224p331o440
$$ 306949 323097 340545 357634 371503 380143 383446 382171 377024 369155 360391 352167 344836 338396
53926C38396n324m310l923l726k820j288R6J248K523L467L304K551K614L684M503
$$ 338396 333072 328762 324839 321113 318293 317005 317101 318349 320872 324339 327643 330194 332808 336492 340995
53911C40995M392M155M654N678O651P388P768P490O549N387M315L324K355J272
$$ 340995 345387 349542 354196 359874 366525 373913 381681 389171 395720 401107 405422 408746 411101 412373
53897D12373j80j795k681k418j985k551l821m623m725m866n271n465n442n755
$$ 412373 412193 410398 407717 405299 403314 400763 396942 392319 387594 382728 377457 371992 366550 360795
53883C60795o373o657o419o023n563m979m772n388o132n972n215n026n414n193
$$ 360795 354422 347765 341346 335323 329760 324781 320009 314621 308489 302517 297302 292276 286862 281669
53869B81669m043l071l030l378l456l384l361l285l274l571l721k990j700r77
$$ 281669 277626 274555 271525 268147 264691 261307 257946 254661 251387 247816 244095 241105 239405 238428
53855B38428j023r78o26p61j539j939j443r28j201j818k004j753j351p35P1O62
$$ 238428 237405 236427 235801 235040 233501 231562 230119 229191 227990 226172 224168 222415 221064 220329 220400 221062
53839B21062Q10O41J44o75j143n66M33M92l98q53l34R2k96p86p35o17p45n01K70
$$ 221062 221872 222513 222657 221982 220839 220273 220706 221198 220800 219947 219613 219705 219409 218623 217888 217271 216526 216025 216295
53820B16295N08k71q56k06P52O51j42l12K12N02M85R92K116K944K947K595K435
$$ 216295 216803 216532 215676 215470 216222 216873 216731 216419 216631 217133 217618 218610 220726 223670 226617 229212 231647
53803B31647K433K394K384K618L203L994M584M649M494M760N503O075O115N938
$$ 231647 234080 236474 238858 241476 244679 248673 253257 257906 262400 267160 272663 278738 284853 290791
53789B90791N703N038L830K601J686Q49J88L60J259J524K52j650k785l094l331
$$ 290791 296494 301532 305362 307963 309649 310498 310686 311046 312305 313829 314081 312431 309646 306552 303221
53774C03221l454k904k027j899k801l945m690n034m974m317l348k841l162l856
$$ 303221 299767 296863 294836 292937 290136 286191 281501 276467 271493 267176 263828 260987 257825 253969
53760B53969m264m157l643k891k056j224m85j43n64j607k465k486j886j357j243
$$ 253969 249705 245548 241905 239014 236958 235734 235249 235106 234542 232935 230470 227984 226098 224741 223498
53745B23498j445j738j854j492p68l23n32r14q02k66J67L96P31J109J077N42o1
$$ 223498 222053 220315 218461 216969 216201 215878 215346 214432 213630 213364 213531 213927 214658 215767 216844 217386 217325
53728B17325m65q39j197j073j32J176K034K171J954J657J123L87P0O29J427J363
$$ 217325 216860 216021 214824 213751 213619 214795 216829 219000 220954 222611 223734 224121 224191 224820 226247 227610
53712B27610L88l50j24M81O70O69J060J674K004K142K345K202J390Q16J678L526
$$ 227610 227998 227648 227524 228005 228675 229344 230404 232078 234082 236224 238569 240771 242161 242977 244655 248181
53696B48181M615M214L252K564J932J168Q14J101J308Q80K35p8k13m36n53m46
$$ 248181 252796 257010 260262 262826 264758 265926 266740 267841 269149 270029 270264 270186 269973 269537 268984 268538
53680B68538m41o16n37j59r9n61q23m13R0M3k70l51l73o47r09q40o92o94m91J62
$$ 268538 268097 267481 266944 266785 266686 266125 265302 264889 264979 265022 264752 264401 264028 263381 262472 261632 260940 260246 259755 259917
53660B59917P24O38J50j93l50m59l32R7L89K50O0K16N43P94J043J085L33j038
$$ 259917 260641 261279 261429 261236 260886 260427 260095 260192 260581 260831 260891 261107 261650 262444 263487 264572 264905 263867
53642B63867j831j415o69m89l81M13J360J552J403J930K882L110K482J986J980
$$ 263867 262036 260621 259952 259463 259082 259495 260855 262407 263810 265740 268622 271732 274214 276200 278180
53627B78180J856J443J380J781J832J146M89N69J043J300J468J992K680K942K738
$$ 278180 280036 281479 282859 284640 286472 287618 288107 288676 289719 291019 292487 294479 297159 300101 302839
53612C02839K712L339M294M818M597M141M192M915N809O345O384N970N207M378
$$ 302839 305551 308890 313184 318002 322599 326740 330932 335847 341656 348001 354385 360355 365562 369940
53598C69940L802L367K631J548O27K01K5j96m22o49j057j487j386o68mJ18RK6
$$ 369940 373742 377109 379740 381288 381915 382116 382141 381945 381523 380874 379817 378330 376944 376276 376272 376390 376399 376425
53580C76425j29p76j528j872j976k274k676k785k541k171j788j462j318j220q35
$$ 376425 376296 375520 373992 372120 370144 367870 365194 362409 359868 357697 355909 354447 353129 351909 351074
53565C51074l14k30n75o15j38O4m30q33m80Lj26l02M03J512J733R06J02q4m9j42
$$ 351074 350760 350530 349955 349340 349202 349266 348836 348003 347523 347526 347400 347098 347501 349013 350746 351652 351754 351670 351621 351479
53545C51479j64k5j3k07l71m11m07k05L89J092J385J223J062J359K354L948N423
$$ 351479 351315 351290 351277 351070 350699 350288 349881 349676 350065 351157 352542 353765 354827 356186 358540 362488 367911
53528C67911N856N310N002N704O703P084P174P683Q285Q328Q393R581J1532J2669
$$ 367911 373767 379077 384079 389783 396486 403570 410744 418427 426712 435040 443433 453014 464546 477215
53514D77215J2399J1749J1694J2162J2863J3927J5293J6491J7376J8264J9082
$$ 477215 489614 501363 513057 525219 538082 552009 567302 583793 601169 619433 638515
53503F38515J9278J8833J8480J8596J8612J7978J6983J6259J5990J5972J5992
$$ 638515 657793 676626 695106 713702 732314 750292 767275 783534 799524 815496 831488
53492H31488J5822J5223J4334J3764J4084J5254J6624J7371J7135J6351J5777
$$ 831488 847310 862533 876867 890631 904715 919969 936593 953964 971099 987450 1003227
53481A003227J5548J5147J4382J3801J3668J3392J2587J1968J2292J2911J2529
$$ 1003227 1018775 1033922 1048304 1062105 1075773 1089165 1101752 1113720 1126012 1138923 1151452
53470A151452J0980R273Q023O916N527L730J365j570m406o399p783r357j1165
$$ 1151452 1162432 1171705 1179728 1186644 1192171 1195901 1197266 1195696 1191290 1184891 1177108 1167751 1156586
53457A156586j2435j2841j2869j2938j2980j2995j3226j3726j4361j5234j6353
$$ 1156586 1144151 1131310 1118441 1105503 1092523 1079528 1066302 1052576 1038215 1022981 1006628
53446A006628j7144j7008j6263j5719j5591j5595j5772j6167j6013j4512j2294
$$ 1006628 989484 972476 956213 940494 924903 909308 893536 877369 861356 846844 834550
53435H34550j0826j0344r644p977n930m149k577j266o99p64n32M70J696K735L932
$$ 834550 823724 813380 803736 795759 789829 785680 783103 781837 781138 780374 779842 780312 782008 784743 788675
53420G88675N437O651P249P837Q935J0209J1305J2597J4328J5821J6352J6314
$$ 788675 794112 800763 808012 815849 824784 834993 846298 858895 873223 889044 905396 921710
53408I21710J6664J7678J8937K0197K1612K3261K4962K6518K7838K8917K9852
$$ 921710 938374 956052 974989 995186 1016798 1040059 1065021 1091539 1119377 1148294 1178146
53397A178146L0751L1647L2758L4609L7366M0236M2109M2863M3317M3982M4531
$$ 1178146 1208897 1240544 1273302 1307911 1345277 1385513 1427622 1470485 1513802 1557784 1602315
53386A602315M4636M4432M4097M3627M3211M3079M2843M1780L9918L8054L6458
$$ 1602315 1646951 1691383 1735480 1779107 1822318 1865397 1908240 1950020 1989938 2027992 2064450
53375B064450L4422L1415K7962K4995K2832K1071J8930J5599J0977O045J830k037
$$ 2064450 2098872 2130287 2158249 2183244 2206076 2227147 2246077 2261676 2272653 2278698 2280528 2278491
53363B278491o772j2504j8000k2529k6717l1104l5119l8106m0343m2223m3392
$$ 2278491 2271719 2259215 2241215 2218686 2191969 2160865 2125746 2087640 2047297 2005074 1961682
53352A961682m3567m3311m3140m2633m1348l9914l9205l8946l8123l6504l4772
$$ 1961682 1918115 1874804 1831664 1789031 1747683 1707769 1668564 1629618 1591495 1554991 1520219
53341A520219l3446l2507l2009l2210l2970l3586l3330l2020l0054k8090k6457
$$ 1520219 1486773 1454266 1422257 1390047 1357077 1323491 1290161 1258141 1228087 1199997 1173540
53330A173540k4806k2660k0287j8464j7259j5802j3626j1483j0300r949r711r385
$$ 1173540 1148734 1126074 1105787 1087323 1070064 1054262 1040636 1029153 1018853 1008904 999193 989808
53318I89808r221r161q920q609q565q651q296p259n917m766l967l340k588j520
$$ 989808 980587 971426 962506 953897 945332 936681 928385 921126 915209 910443 906476 903136 900548 899028
53304H99028j95J208K606L952N047N804O604P941R673J1131J2038J2820J3944
$$ 899028 898833 900041 902647 906599 911646 917450 924054 931995 941668 952799 964837 977657 991601
53291I91601J5458J7242J9077K0444K0944K1021K1504K2294K2341K1210J9763
$$ 991601 1007059 1024301 1043378 1063822 1084766 1105787 1127291 1149585 1171926 1193136 1212899
53280A212899J8861J8202J7077J5452J3699J1848R874Q178P020N797L622M08l116
$$ 1212899 1231760 1249962 1267039 1282491 1296190 1308038 1317912 1326090 1333110 1338907 1342529 1342937 1339821
53267A339821o258q773j0689j2130j3331j4493j5779j7349j9147k0671k1468k1809
$$ 1339821 1333563 1324790 1314101 1301971 1288640 1274147 1258368 1241019 1221872 1201201 1179733 1157924
53255A157924k2296k2878k3060k3034k3552k4516k4833k4153k3546k3758k3914
$$ 1157924 1135628 1112750 1089690 1066656 1043104 1018588 993755 969602 946056 922298 898384
53244H98384k2937k1293k0174j9720j9278j8873j9078j9676j9703j8942j8259
$$ 898384 875447 854154 833980 814260 794982 776109 757031 737355 717652 698710 680451
53233F80451j8295j8627j8507j7726j6496j4977j3237j1410r700q348p544p209
$$ 680451 662156 643529 625022 607296 590800 575823 562586 551176 541476 533128 525584 518375
53221E18375p020o791o626o561o430o349o883q244r662j0070r352q482q408r085
$$ 518375 511355 504564 497938 491377 484947 478598 471715 463471 453809 443739 434387 425905 417497 408412
53207D08412r601r130p732o265n392m813l905k865k617l476m605n036m671m067
$$ 408412 398811 389681 381949 375684 370292 365479 361574 358709 356092 352616 348011 342975 338304 334237
53193C34237l719l901m558n143n052m479m248m567m687m115l357l028k986k942
$$ 334237 330518 326617 322059 316916 311864 307385 303137 298570 293883 289768 286411 283383 280397 277455
53179B77455l146l710l932l126j744r19j132j896k463k325j457n03l67j060j505
$$ 277455 274309 270599 266667 263541 261797 260878 259746 257850 255387 253062 251605 251102 250735 249675 248170
53164B48170r38lJ64n06j151j223q77l45K97P67P23K22l23o45p93r14j117j389
$$ 248170 247232 247229 247393 246887 245736 244513 243636 243291 243588 244355 245078 245300 244977 244332 243539 242625 241508 240119
53146B40119j519j336j060j056j185r37l12J12J11J21L53M51K67J51J59j05m61
$$ 240119 238600 237264 236204 235148 233963 233026 232714 232826 232937 233058 233411 233862 234129 234280 234439 234334 233873
53129B33873n9J090J653Q56k20k05O12J051R36J028J577K161K573K843K701K020
$$ 233873 233814 234904 236557 237413 237193 236988 237600 238651 239587 240615 242192 244353 246926 249769 252470 254490
53113B54490J407J397J446O99n46j191q93l46j77m55j103j941k472k359j970j841
$$ 254490 255897 257294 258740 259439 258893 257702 256809 256463 256286 255831 254728 252787 250315 247956 245986 244145
53097B44145j875j761j638j645j313l09O80P66J59k68k98k94k36O7K14k68r44
$$ 244145 242270 240509 238871 237226 235913 235604 236284 237050 237209 236941 236643 236349 236113 236180 236394 236126 235182
53080B35182j070r15j218j738j549o92j95m23o36l30J47M36O19N87kr67j632j787
$$ 235182 234112 233197 231979 230241 228692 228000 227805 227382 226746 226416 226563 226999 227618 228205 228203 227236 225604 223817
53062B23817j805j747j300o25l38m39j87P69J862K394K215J461L72o39j252j601
$$ 223817 222012 220265 218965 218340 218002 217563 217376 218145 220007 222401 224616 226077 226449 225810 224558 222957
53046B22957j800j446k89R33J269Q77O55Q15Q68P24O47L47n97j535j377l74J44
$$ 222957 221157 219711 219422 220355 221624 222501 223156 223971 224839 225563 226210 226557 225960 224425 223048 222674 222818
53029B22818j38k28K04K07n38q75k6J061J200O55L03J30l60r46j022o35l09j53
$$ 222818 222680 222452 222656 222863 222325 221450 221424 222485 223685 224340 224643 224773 224413 223467 222445 221810 221501 221348
53011B21348J00M44O36O46O55Q07J185J707J898J282J64n13l86q0j85n29q18j211
$$ 221348 221448 221892 222528 223174 223829 224636 225821 227528 229426 230708 230872 230359 229973 229893 229708 229179 228361 227150
52993B27150j761j898j119K52J424J934J764J081L16M3L83Q14Q94Q37J082J591
$$ 227150 225389 223491 222372 222624 224048 225982 227746 228827 229143 229186 229569 230383 231277 232114 233196 234787
52977B34787J916J747J197O94O20Q30O88j43j081j306p64rP19J491K000J781J127
$$ 234787 236703 238450 239647 240341 240961 241791 242479 242336 241255 239949 239185 239176 239895 241386 243386 245167 246294
52960B46294P61O45J8j204k120k165j778j403q80k27p5p07j463j661j446j184
$$ 246294 247055 247700 247718 246514 244394 242229 240451 239048 238168 237941 237866 237159 235696 234035 232589 231405
52944B31405p80j77J30k00o77o55k34L6K0J4J78L49L00o1n82q95q34p24q75r75
$$ 231405 230625 230448 230578 230378 229701 229046 228812 228848 228868 228882 229060 229409 229709 229648 229066 228171 227337 226613 225738 224763
52924B24763o42k93n82j082p06N27J334J017L16j3j95m60k66O45J466J453J036
$$ 224763 224121 223828 223246 222164 221458 221985 223319 224336 224652 224639 224444 223984 223718 224363 225829 227282 228318
52907B28318R12Q35K31o65j178j112n39O05J907K152P27j217k051j657j138r38
$$ 228318 229230 230065 230296 229631 228453 227341 226802 227407 229314 231466 232193 230976 228925 227268 226130 225192
52891B25192m87M31J153J127N56j44p78j144j003m41J25M52N70N05K88J55L67
$$ 225192 224705 225136 226289 227416 227972 227828 227050 225906 224903 224462 224587 225039 225609 226114 226402 226557 226924
52874B26924P35P84L18l21n62JJ320K725L357L003K303J956K026K277K694L171
$$ 226924 227659 228443 228761 228440 227878 227879 229199 231924 235281 238284 240587 242543 244569 246846 249540 252711
52858B52711L149K137M50j087k042k586k942l116l207l463l931m235l923l011
$$ 252711 255860 257997 258447 257360 255318 252732 249790 246674 243467 240004 236073 231838 227915 224904
52844B24904k117j912k343k657k318j644j130n75M70J628J960J355P25O93Q54
$$ 224904 222787 220875 218532 215875 213557 211913 210783 210208 210678 212306 214266 215621 216346 217039 217893
52829B17893O72K78Mj26n1M64J201J373O44l03p20o61m88j21N68J164J175P87
$$ 217893 218565 218843 218847 218721 218670 219134 220335 221708 222352 222049 221329 220668 220180 220059 220627 221791 222966 223753
52811B23753O55J159K186L265L653K800J037o43j674k278k635k523k014j669j638
$$ 223753 224408 225567 227753 231018 234671 237471 238508 237865 236191 233913 231278 228755 226741 225072 223434
52796B23434j421r62r86j681k053j452o90o68q22o3J285J865J204J34n15n76j23
$$ 223434 222013 221051 220065 218384 216331 214879 214189 213521 212699 212636 213921 215786 216990 217124 216609 216033 215910
52779B15910O62J188R15J59k49m2L15M25K84L3l8N23J617K160J135j010k656k779
$$ 215910 216572 217760 218675 218834 218585 218543 218858 219283 219567 219600 219562 220085 221702 223862 224997 223987 221331 218552
52761B18552j781o93j46j11j66J23O86R74P35M82P58J262J242O17Q8K39R09J508
$$ 218552 216771 216078 215932 215821 215655 215778 216464 217438 218173 218655 219413 220675 221917 222534 222622 222861 223770 225278
52743B25278J625J400J328J634J820J269J81o31q82r34p81O2J344J914J374Q03
$$ 225278 226903 228303 229631 231265 233085 234354 234535 233904 233022 232088 231307 231369 232713 234627 236001 236804
52727B36804J149J865J981J545J043L21q40j814k010j894k068k046j252m35o54
$$ 236804 237953 239818 241799 243344 244387 244708 243868 242054 240044 238150 236082 234036 232784 232349 231695
52712B31695j335r92L58J146N55n34j095j156j150j196j259j271r53k35K99J46
$$ 231695 230360 229368 229726 230872 231427 230893 229798 228642 227492 226296 225037 223766 222813 222578 222877 223023
52696B23023k23j12K14J13K0Q43K178K601J877J318J677K068J517L42o03j067
$$ 223023 222800 222688 222902 223015 223035 223878 226056 228657 230534 231852 233529 235597 237114 237456 236853 235786
52680B35786j199j047p93p64q87p48m02l51n80n23j53j19n14n35J44O47J48r06
$$ 235786 234587 233540 232747 231983 231096 230348 229946 229595 229015 228492 228339 228220 227706 227171 227315 227962 228110 227204
52662B27204j428j029j68N72R20J033J371K113K756K792K638L072L877M041L349
$$ 227204 225776 224747 224579 225151 226071 227104 228475 230588 233344 236136 238774 241846 245723 249764 253113
52647B53113K603K068R72r47k594l011k747k854l236k935j604J23J412J820J410
$$ 253113 255716 257784 258756 257809 255215 252204 249457 246603 243367 240432 238828 238951 240363 242183 243593
52632B43593Q35R58J898K722K549J644J045J341K166K658K125M83j625l294m058
$$ 243593 244428 245386 247284 250006 252555 254199 255244 256585 258751 261409 263534 264017 262392 259098 255040
52617B55040m058l633l028k405j729p73L06P14mr87r82j25K55l27q28l74M55O62
$$ 255040 250982 247349 244321 241916 240187 239414 239720 240434 240430 239443 238461 238336 238591 238264 237436 237062 237517 238179
52599B38179K11k61m45l58K8N90R24Q90Q74J158J539J827K118K231J659M68m00
$$ 238179 238390 238129 237684 237326 237354 237944 238868 239758 240632 241790 243329 245156 247274 249505 251164 251632 251232
52582B51232k61M89J088J351J380J058M03j14k06k11m78p89r10j068j412j528
$$ 251232 250971 251460 252548 253899 255279 256337 256740 256626 256420 256209 255731 254942 254032 252964 251552 250024
52566B50024j101m88r9J66M10K93k61n79k41J26j53o92p44n31p92j431j632j168
$$ 250024 248923 248435 248336 248502 248912 249205 248944 248365 248124 248250 248097 247405 246661 246130 245338 243907 242275 241107
52548B41107n81k05J12L48K48n2j03J45K99K40K02K45K27L07P62J365J584J381
$$ 241107 240526 240321 240433 240781 241029 240977 240874 241019 241318 241558 241760 242005 242232 242539 243301 244666 246250 247631
52530B47631J185J066O94K01K95J227K239K411J632N17k63l70J14P09Q91N84J64
$$ 247631 248816 249882 250576 250777 251072 252299 254538 256949 258581 259098 258835 258465 258579 259288 260179 260763 260927
52513B60927j7J62P02J485K126K283K099J969J890J546R46M54M3q21k284l642
$$ 260927 260910 261072 261774 263259 265385 267668 269767 271736 273626 275172 276118 276572 276615 275794 273510 269868
52497B69868m129l774l027k044q40J79N18L50L55P37Q93L10o72j269j152o50k20
$$ 269868 265739 261965 258938 256894 256054 256233 256751 257101 257456 258193 259086 259396 258724 257455 256303 255653 255433
52480B55433k2N1K10N82J009J073N66j07l24j4L19M10O09J238K040K592K916L268
$$ 255433 255411 255462 255672 256254 257263 258336 258902 258795 258471 258457 258776 259186 259795 261033 263073 265665 268581 271849
52462B71849L529L387K940K582K235J306m02k188l099k905k227j866k096k510
$$ 271849 275378 278765 281705 284287 286522 287828 287426 285238 282139 279234 277007 275141 273045 270535
52448B70535k477j888j374j536k106k229j560p05l65m81m71q3K98J12p62j849
$$ 270535 268058 266170 264796 263260 261154 258925 257365 256660 256295 255814 255343 255260 255558 255670 254908 253059
52432B53059k422k085j081m0N74P09N80L70P9m18j030j288p87J94Q80J011J150
$$ 253059 250637 248552 247471 247431 248005 248714 249294 249664 249743 249325 248295 247007 246220 246414 247294 248305 249455
52415B49455J709K181J938J262R38J121J362J565K111L100M223N371O700Q023
$$ 249455 251164 253345 255283 256545 257483 258604 259966 261531 263642 266742 270965 276336 283036 291059
52401B91059Q891R290R507R224P614M588J174j644l828n624o796p029o560n915
$$ 291059 299950 309240 318747 327971 335585 340173 341347 339703 335875 330251 323455 316426 309866 303951
52387C03951n293m653m011l315k351j131n4N54P53P39O29O68J126J766J941J528
$$ 303951 298658 294005 289994 286679 284328 283197 283143 283697 284450 285189 285818 286486 287612 289378 291319 292847
52371B92847J225J580K184K377K194K110K155J904J240N57K10J29Jl77r04j275
$$ 292847 294072 295652 297836 300213 302407 304517 306672 308576 309816 310373 310583 310712 310713 310336 309432 308157
52355C08157j267j019q33q00p59o39n15l26R8O99J249J723K277K790K858K287
$$ 308157 306890 305871 305038 304238 303479 302840 302325 301999 302097 302796 304045 305768 308045 310835 313693 315980
52339C15980J300K35n66o75O3J111J722J906K375L454M670N472N829N957O033
$$ 315980 317280 317515 316949 316274 316337 317448 319170 321076 323451 326905 331575 337047 342876 348833 354866
52324C54866O279O811P316P417P322P472P623P144O262N973O554P077O806O098
$$ 354866 361145 367956 375272 382689 390011 397483 405106 412250 418512 424485 431039 438116 444922 451020
52310D51020N629N612O251P888J0098J1549J1550J0971J0911J1258J1261J0911
$$ 451020 456649 462261 468512 476400 486498 498047 509597 520568 531479 542737 553998 564909
52298E64909J0834J1301J2066J2765J2901J1960J0079Q187O879N743M347L161
$$ 564909 575743 587044 599110 611875 624776 636736 646815 655002 661881 667624 671971 675132
52286F75132K808L017L094K958K922K916K744K620K749K751K178J253M57q4k43
$$ 675132 677940 680957 684051 687009 689931 692847 695591 698211 700960 703711 705889 707142 707599 707515 707272
52271G07272M47J958L177L099K160J504J414J365J164R92O86J11l6J130L221M821
$$ 707272 707719 709677 712854 715953 718113 719617 721031 722396 723560 724552 725238 725349 725313 726443 729664 734485
52255G34485N223N064N257O080P369Q795R834J0097R797R451R216Q949Q646Q231
$$ 734485 739708 744772 750029 756109 763478 772273 782107 792204 802001 811452 820668 829617 838263 846494
52241H46494P294N714M228L615L686L799L936M324M421L493K032J386J838K217
$$ 846494 853788 859502 863730 867345 871031 874830 878766 883090 887511 891004 893036 894422 896260 898477
52227H98477J579L42n43p07l91r7l79j306k062j780q59n05j004j373r69l93l60
$$ 898477 900056 900398 899855 899148 898757 898660 898281 896975 894913 893133 892274 891769 890765 889392 888423 888030 887670
52210H87670o49p13n35k42M81J807L117L569L164K677K713L209L785M213M630
$$ 887670 887021 886308 885773 885531 886012 887819 890936 894505 897669 900346 903059 906268 910053 914266 918896
52195I18896N422O787Q303R118Q712P327N647M180L037J988O78r83k574l526l739
$$ 918896 924318 931105 939408 948526 957238 964565 970212 974392 977429 979417 980095 979112 976538 973012 969273
52180I69273l716l989m604n174n306m969m531m372m496m614m571m420m090l398
$$ 969273 965557 961568 956964 951790 946484 941515 936984 932612 928116 923502 918931 914511 910421 907023
52166I07023k494j811j480j219r27p50m22O13K029K492J407q2o34n35q84j578
$$ 907023 904529 902718 901238 900019 899092 898342 897920 898533 900562 903054 904461 904379 903745 903210 902326 900748
52150I00748j479k97R37J360J230J204J473J844K040J806J205P13N26P7j126k437
$$ 900748 899269 898972 899909 901269 902499 903703 905176 907020 909060 910866 912071 912784 913310 913387 912261 909824
52134I09824k711j859q45k21M44J568K843L754M245M632N313O544Q068R137R371
$$ 909824 907113 905254 904409 904188 904632 906200 909043 912797 917042 921674 926987 933531 941599 950736 960107
52119I60107R364R803J0352J0212R472Q936Q758Q259P147O002N412N397N799O512
$$ 960107 969471 979274 989626 999838 1009310 1018246 1027004 1035263 1042410 1048412 1053824 1059221 1065020 1071532
52105A071532P277P863Q458R251R868R966J0121J1111J2467J2756J1352Q934O294
$$ 1071532 1078809 1086672 1095130 1104381 1114249 1124215 1134336 1145447 1157914 1170670 1182022 1190956 1197250
52092A197250L699J497J89l47p81j254j291r49r91j722k556l018l268l364l022
$$ 1197250 1200949 1202446 1202635 1202288 1201507 1200253 1198962 1198013 1197022 1195300 1192744 1189726 1186458 1183094 1180072
52077A180072k366k082k483l202m008m995n825n812n008m251l831l169k035j004
$$ 1180072 1177706 1175624 1173141 1169939 1165931 1160936 1155111 1149299 1144291 1140040 1136209 1133040 1131005 1130001
52063A130001l07O71K225L692M541N123N832O459O866P290P497O647M696K869
$$ 1130001 1129694 1130365 1132590 1136282 1140823 1145946 1151778 1158237 1165103 1172393 1179890 1186537 1191233 1194102
52049A194102J985J319l1j590k280k070j831k039k498k964l310l278k688j690
$$ 1194102 1196087 1197406 1197375 1195785 1193505 1191435 1189604 1187565 1185067 1182103 1178793 1175515 1172827 1171137
52035A171137o26Q5r6j341k844l533l493l756m589n183n299n804p007p920p932
$$ 1171137 1170511 1170596 1170500 1169159 1166315 1162782 1159289 1155533 1150944 1145761 1140462 1134658 1127651 1119731 1111799
52020A111799p860q359q572p640o340n877n950n458m430l804l816l989m311n152
$$ 1111799 1103939 1095580 1087008 1079368 1073028 1067151 1061201 1055743 1051313 1047509 1043693 1039704 1035393 1030241
52006A030241o331p413q687j0647j2829j4249j4739j4850j4684j3912j2760j1886
$$ 1030241 1023910 1016497 1007810 997163 984334 970085 955346 940496 925812 911900 899140 887254
51994H87254j1475j1328j1623j2594j3717j4296j4621j5510j6803j7529j7435
$$ 887254 875779 864451 852828 840234 826517 812221 797600 782090 765287 747758 730323
51983G30323j7267j7444j7528j7166j6579j5909j4938j3666j2407j1185r727q106
$$ 730323 713056 695612 678084 660918 644339 628430 613492 599826 587419 576234 566507 558401
51971E58401o654n190l209q61J085K403L680N153O148O006M941L565K108M91j263
$$ 558401 551747 546557 543348 542487 543572 545975 549655 554808 560956 566962 571903 575468 577576 578067 576804
51956E76804k955m371n333n889o308o593o152m527k297o20J36O74J715L335N456
$$ 576804 573849 569478 564145 558256 551948 545355 539203 534676 532379 531759 531895 532569 534284 537619 543075
51941E43075Q128J1010J3163J3910J3632J3335J3553J3860J3369J1707R550Q011
$$ 543075 551203 562213 575376 589286 602918 616253 629806 643666 657035 668742 678292 686303
51929F86303P395O856N602M023L192L543M715O310Q050R269R090P155L583j630
$$ 686303 693698 700554 706156 710179 713371 716914 721629 727939 735989 745258 754348 761503 765086 763456
51915G63456q386j5584k1371k4623k5625k5157k3597k1170j8272j5133j1720q323
$$ 763456 755070 739486 718115 693492 667867 642710 619113 597943 579671 564538 552818 544495
51903E44495n745m413l861l571l809n076p065q859j0037j0893j1570j1625j0763
$$ 544495 538750 534337 530476 526905 523096 518020 510955 502096 492059 481166 469596 457971 447208
51890D47208r518q693q266p307n172k413j58J240K462M116N905P178P839Q269
$$ 447208 437690 428997 420731 413424 408252 405839 405681 406921 409383 413499 419404 426582 434421 442690
51876D42690Q631Q839R025R458R894R506P658M568J044k129m466n811o291o206
$$ 442690 451321 460160 469185 478643 488537 498043 505701 510269 511313 509184 504718 498907 492616 486410
51862D86410n753m939l781k500j457r21q59r32q14n68n87j132k039l007m009n210
$$ 486410 480657 475718 471937 469437 467980 467059 466200 465268 464454 463886 463299 462167 460128 457121 453112 447902
51846D47902o579p717q163p788o923o096n558n138m554l751k783j604k50R10J534
$$ 447902 441323 433606 425443 417655 410732 404636 399078 393940 389386 385635 382852 381248 380998 381908 383442
51831C83442J786K041K231K026J630J638K037K072J322L04l79q19j270j444r01
$$ 383442 385228 387269 389500 391526 393156 394794 396831 398903 400225 400529 400150 399331 398061 396617 395716
51816C95716J92J218J767J748J238N53J11p3m91j379k274k672k656k510k149j462
$$ 395716 395908 397126 398893 400641 401879 402432 402543 402470 401979 400600 398326 395654 392998 390488 388339 386877
51800C86877q22o32o52k65P24J915K744K769J873M99n69r44q48n23P5P48Q88K62
$$ 386877 386055 385423 384771 384506 385230 387145 389889 392658 394531 395030 394461 393517 392669 392146 392221 392969 393857 394119
51782C94119n69j051j287j493j432r19k30N27J763L542N059N745O302P642R386
$$ 394119 393550 392499 391212 389719 388287 387368 387138 387665 389428 392970 398029 403774 410076 417718 427104
51767D27104J0274R774Q338O429M147J669p24k912m684n617n749n899o564p076
$$ 427104 437378 447152 455490 461919 466066 467735 467011 464099 459415 453798 448049 442150 435586 428510
51753D28510o687n961n972o593o709n889m700l512k202r79m21m44k75M20J160
$$ 428510 421823 415862 409890 403297 396588 390699 385999 382487 380285 379306 378885 378441 378166 378586 379746
51738C79746J588J949K447K850K948K885K834K835K917K966K587J600M56k51l78
$$ 379746 381334 383283 385730 388580 391528 394413 397247 400082 402999 405965 408552 410152 410608 410357 409979
51723D09979N2J194K740L639L293K478K065J531m1k018k804k095j086n26j09J70
$$ 409979 410031 411225 413965 417604 420897 423375 425440 426971 426930 424912 422108 420013 418927 418401 418292 418462
51707D18462k88j329j789j117o0O59J151J421R59j88j024r62n97n14l09N46J656
$$ 418462 418174 416845 415056 413939 413879 414538 415689 417110 418069 417881 416857 415895 415298 414784 414475 415021 416677
51690D16677K226J954R32p01k471l636m001m088m219m105l616l148k852k364j695
$$ 416677 418903 420857 421789 421088 418617 414981 410980 406892 402673 398568 394952 391804 388952 386588 384893
51675C84893j515k036k460k090j276p18m80k22K44J099K610M644O612Q234R661
$$ 384893 383378 381342 378882 376792 375516 374798 374318 374096 374340 375439 378049 382693 389305 397539 407200
51660D07200J0602J0243Q446O161M171K259J59j645k710l243l269k178K4J957
$$ 407200 417802 428045 436491 442652 446823 449082 449241 447596 444886 441643 438374 436196 436220 438177
51646D38177K498K298K461K467Q81k222n098o629p402q161q489p698o157m912
$$ 438177 440675 442973 445434 447901 448782 446560 441462 434833 427431 419270 410781 403083 396926 392014
51632C92014m368m050l518k901k418j817o92Q17K059K684K992L212K887J518n25
$$ 392014 387646 383596 380078 377177 374759 372942 372250 373067 375126 377810 380802 384014 386901 388419 387894
51617C87894k295l304l682l532k880k205k124k524k698k479k407k650k684k277
$$ 387894 385599 382295 378613 375081 372201 369996 367872 365348 362650 360171 357764 355114 352430 350153
51603C50153j883j732j333l29R29K118L431M872N851O155O631Q146J0244J1512
$$ 350153 348270 346538 345205 344876 345805 347923 351354 356226 362077 368232 374863 383009 393253 404765
51589D04765J0959Q607N131J474j470l291m132m238l730k845j776k24K233N175
$$ 404765 415724 424331 429462 430936 429466 426175 422043 417805 414075 411230 409454 409230 411463 416638
51575D16638P505Q814R819J1090J2236J2756J2908J3147J3368J3286J2956J2480
$$ 416638 424143 432957 442776 453866 466102 478858 491766 504913 518281 531567 544523 557003
51563E57003J1914J1881J3478J6967K1229K5137K8727L2444L5867L7891L7556
$$ 557003 568917 580798 594276 611243 632472 657609 686336 718780 754647 792538 830094
51552H30094L4242K7853J9468J0977L300m270j2262j9573k4855k8506l1904l5210
$$ 830094 864336 892189 911657 922634 925934 921664 909402 889829 864974 836468 804564 769354
51540G69354l7276l7416l6050l3668l0357k6443k2634j9300j6267j3368j0647
$$ 769354 732078 694662 658612 624944 594587 568144 545510 526210 509943 496575 485928
51529D85928q098n746l913k774j877o64O66J426J341O62m37j915l400m364m709
$$ 485928 477830 472084 468171 465397 463520 462856 463522 464948 466289 466951 466514 464599 461199 456835 452126
51514D52126m748m780m961n397n834n638m564l291k703k917l430l906m227m167
$$ 452126 447378 442598 437637 432240 426406 420768 416204 412913 410210 407293 403863 399957 395730 391563
51500C91563l656l142l089l332l389l139k728k146j377o97k73J51O67P89K35m13
$$ 391563 387907 384765 381676 378344 374955 371816 369088 366942 365565 364868 364595 364746 365413 366202 366437 366024
51484C66024m44q0m7m93j032j477j754j522o16L38N89K81P7M1k71q46j135q69
$$ 366024 365580 365500 365453 364960 363928 362451 360697 359175 358559 358897 359486 359767 359844 359885 359614 358768 357633 356764
51466C56764k82L30O92M51l54r94q69m10m24q87j207j315j591j891j627p50J45
$$ 356764 356482 356812 357504 357955 357601 356607 355738 355328 354904 354017 352810 351495 349904 348013 346386 345636 345781
51449C45781P98J535K552L602M471N217N951O846Q097R421R905Q971P161N384
$$ 345781 346579 348114 350666 354268 358739 363956 369907 376753 384850 394271 404176 413147 420308 425692
51435D25692L829K397J617J987K789K741J692N43m15j859l978n869o682o519n860
$$ 425692 429521 431918 433535 435522 438311 441052 442744 443287 442872 441013 437035 431166 424484 417965 412105
51420D12105m973m130l643l347k730j809j244j402j904k250k274j916j202n87
$$ 412105 407132 403002 399359 396012 393282 391473 390229 388827 386923 384673 382399 380483 379281 378694
51406C78694o23j103j195n70K10N81O56Q24J253J957K870L651L946L967M328N191
$$ 378694 378071 376968 375773 375203 375413 375994 376650 377474 378727 380684 383554 387205 391151 395118 399446 404637
51390D04637O046O468O660P166Q374J0328J2701J5019J7194J9700K2960K6840
$$ 404637 410683 417151 423811 430977 439351 449679 462380 477399 494593 514293 537253 564093
51378E64093L1105L5816M0731M4923M7703M9445N0510M9878M5965L8610K9174
$$ 564093 595198 631014 671745 716668 764371 813816 864326 914204 960169 998779 1027953
51367A027953J8789P722l625j4296k3641l1632l8133m2716m5370m6531m6263m4333
$$ 1027953 1046742 1054464 1050839 1036543 1012902 981270 943137 900421 855051 808520 762257 717924
51355G17924m1181l7911l5109l2441k9550k6504k3277j9794j6603j4570j3626
$$ 717924 676743 638832 603723 571282 541732 515228 491951 472157 455554 440984 427358
51344D27358j2704j1163r345p635n959m502l829l873l710k846j900j560j669j728
$$ 427358 414654 403491 394146 386511 380552 376050 372221 368348 364638 361792 359892 358332 356663 354935
51330C54935j609j284o45Q9M17L58N21J105J593J702J794K037K001J495J048J089
$$ 354935 353326 352042 351397 351486 351903 352261 352782 353887 355480 357182 358976 361013 363014 364509 365557 366646
51314C66646J331J279P66j81j299j811j117J27N72j1n99p73j343k670l763l799
$$ 366646 367977 369256 370022 369841 368542 366731 365614 365741 366313 366302 365703 364930 363587 360917 357154 353355
51298C53355l316l079k918k592k642l319l624k583p58N49R52Q63M08l66p32P0
$$ 353355 350039 346960 344042 341450 338808 335489 331865 329282 328524 329073 330025 330888 331296 330930 330198 330268
51282C30268J740L287M242M755M938M889M939N137M899L878K652J835J114L4q67
$$ 330268 332008 335295 339537 344292 349230 354119 359058 364195 369094 372972 375624 377459 378573 378607 377740
51267C77740p34K41J161J707K126K274J846J251J213J534J251J05j104j645j601
$$ 377740 377006 377247 378408 380115 382241 384515 386361 387612 388825 390359 391610 391715 390611 388966 387365
51252C87365j470j664k429l570m312m055l191k584k468k501k609k978l331l074
$$ 387365 385895 384231 381802 378232 373920 369865 366674 364090 361622 359121 356512 353534 350203 347129
51238C47129k188j237n42K2M67O36O60P52O79J26m70l23M75J018R42Q29J081J337
$$ 347129 344941 343704 343162 343184 343651 344287 344947 345699 346378 346504 346034 345711 346186 347204 348146 348975 350056 351393
51220C51393J357J600K405L240L349K706J857J179P26M99M84N97Q46J320J850
$$ 351393 352750 354350 356755 359995 363344 366050 367907 369086 369812 370311 370795 371392 372238 373558 375408
51205C75408K028J793J621J860K184K053J459Q57N10L08J00l9kJ50K30J15j46
$$ 375408 377436 379229 380850 382710 384894 386947 388406 389263 389773 390081 390181 390142 390140 390290 390520 390635 390489
51188C90489l60l75k54j76j59l2K90O11P07O20N92P03P23M30j40q34j643k575
$$ 390489 390129 389754 389500 389324 389165 389133 389423 390034 390741 391361 391953 392656 393379 393809 393669 392835 391192 388617
51170C88617l299l246k249q42K41P17P43N78N65J172K471L673L693K309L80j107
$$ 388617 385318 382072 379823 378981 379222 379939 380682 381260 381825 382997 385468 389141 392834 395143 395523 394416
51154C94416j836j988j776j463j439j963k880l723m007l534k603j906j808j897
$$ 394416 392580 390592 388816 387353 385914 383951 381071 377348 373341 369807 367204 365298 363490 361593
51140C61593j539q33m34n71p64n89j28M71J203J797J752J069M53M35Q48J418K299
$$ 361593 360054 359221 358787 358216 357452 356863 356735 357206 358409 360206 361958 363027 363480 363915 364763 366181 368480
51123C68480L560M632M875M328L541K862K296J796J374J063R97J268J619J577
$$ 368480 372040 376672 381547 385875 389416 392278 394574 396370 397744 398807 399804 401072 402691 404268
51109D04268J119P26P31R57J213J549J830J613Q03p3o32j121j787k250k015j198
$$ 404268 405387 406113 406844 407801 409014 410563 412393 414006 414809 414736 414104 412983 411196 408946 406931 405733
51093D05733l12L25N32J01r04j936k456k363j735o38N43J102Q63N08O59J073J183
$$ 405733 405421 405746 406278 406379 405475 403539 401083 398720 396985 396347 396890 397992 398855 399363 400022 401095 402278
51076D02278R34O29M12M46J039K051K605K100J125Q05J518K784M065N035N440
$$ 402278 403212 403841 404253 404699 405738 407789 410394 412494 413619 414424 415942 418726 422791 427826 433266
51061D33266N417N700O872Q584J0102J1434J3197J5414J7097J7221J5641J3078
$$ 433266 438683 444383 451255 459839 469941 481375 494572 509986 527083 544304 559945 573023
51049E73023J0482Q554P644P825Q791R616R052O640L363N18j860m616p650r704
$$ 573023 583505 592059 599703 607528 616319 625935 634987 641627 644990 645508 643648 639032 631382 621678
51035F21678j0175r900r575q607o397l784k207k172l282n032o673p122o102m729
$$ 621678 611503 601603 592028 583421 577024 573240 571033 568861 565579 560547 553874 546752 540650 535921
51021E35921m061l626k430p51K53K77J54O57J926L694N316O004N917O345P949
$$ 535921 531860 528234 525804 525053 525306 525583 525737 526394 528320 532014 537330 543334 549251 555596 563545
51006E63545R602J0028R733R962J0505J0245R292Q740Q522P367M931K241q1k337
$$ 563545 573147 583175 592908 602870 613375 623620 632912 641652 650174 657541 662472 664713 664632 662295
50992F62295m313n035m520m219n036o168o529o046m934k931k8K972N399P454R395
$$ 662295 657982 652947 648427 644208 639172 633004 626475 620429 615495 612564 612536 615508 620907 628361 637756
50977F37756J0853J1527J1698J1569J0936R998R638J0270J1312J2329J3871J6429
$$ 637756 648609 660136 671834 683403 694339 704337 713975 724245 735557 747886 761757 778186
50965G78186J9357K1750K3722K6041K8852L1578L3732L5285L6391L7242L7925
$$ 778186 797543 819293 843015 869056 897908 929486 963218 998503 1034894 1072136 1110061
50954A110061L8076L7002L4488L1192K8029K5512K3794K2799K2038K0874J9345
$$ 1110061 1148137 1185139 1219627 1250819 1278848 1304360 1328154 1350953 1372991 1393865 1413210
50943A413210J8264J8286J9337K1055K3105K4744K4869K2974J9580J5345J0436
$$ 1413210 1431474 1449760 1469097 1490152 1513257 1538001 1562870 1585844 1605424 1620769 1631205
50932A631205N122J68m024q022j2418j6808k0488k3704k7378l1773l6210m0014
$$ 1631205 1636327 1636495 1632471 1624449 1612031 1595223 1574735 1551031 1523653 1491880 1455670 1415656
50920A415656m3055m5321m6624m6908m6455m5545m4118m1939l8926l5270l1344
$$ 1415656 1372601 1327280 1280656 1233748 1187293 1141748 1097630 1055691 1016765 981495 950151
50909I50151k7577k4371k1942k0153j8565j6959j5764j5555j5941j5587j3783
$$ 950151 922574 898203 876261 856108 837543 820584 804820 789265 773324 757737 743954
50898G43954j1489j0107r618q811p122n287m072l282k396j400o91n75j037j642
$$ 743954 732465 722358 712740 703929 696807 691520 687448 684166 681770 680370 679679 679104 678067 676425
50884F76425j660q06K19N67N38J155K572L842M497N214O485P587P583O709O022
$$ 676425 674765 673959 674178 674745 675283 676438 679010 682852 687349 692563 699048 706635 714218 720927 726949
50869G26949O146O950Q086R340J0561J1645J2542J3262J4050J5435J7681K0352
$$ 726949 733095 740045 748131 757471 768032 779677 792219 805481 819531 834966 852647 872999
50857H72999K2876K5306K7904L0347L2361L4854L9120M4829N0199N4395N8450
$$ 872999 895875 921181 949085 979432 1011793 1046647 1085767 1130596 1180795 1235190 1293640
50846A293640O3297O8309P2556P6240P9810Q2742Q4277Q4609Q4163Q2357P8255
$$ 1293640 1356937 1425246 1497802 1574042 1653852 1736594 1820871 1905480 1989643 2072000 2150255
50835B150255P1997O4639N6837M8693M0545L2969K6149J9980J4788J1242R755
$$ 2150255 2222252 2286891 2343728 2392421 2432966 2465935 2492084 2512064 2526852 2538094 2547849
50824B547849J0346J2827J6664K1065K5615L0346L4689L7111L6467L3061K7471
$$ 2547849 2558195 2571022 2587686 2608751 2634366 2664712 2699401 2736512 2772979 2806040 2833511
50813B833511J9027O695q789k4925l9656n2718o4797p6261q6872r5932j02397
$$ 2833511 2852538 2859233 2850444 2825519 2785863 2733145 2668348 2592087 2505215 2409283 2306886
50802B306886j05501j05407j02994r8964r3560q7024p9755p1956o3677n5248m7284
$$ 2306886 2201385 2095978 1992984 1894020 1800460 1713436 1633681 1561725 1498048 1442800 1395516
50791A395516m0169l3779k7757k1811j5974j0762o887m467k813j356l96n20j527
$$ 1395516 1355347 1321568 1293811 1272000 1256026 1245264 1238377 1233910 1231097 1229741 1229345 1228825 1227298
50778A227298k581l211l633m141m822n765p045q484r804j1061j2518j4202j5865
$$ 1227298 1224717 1221506 1217873 1213732 1208910 1203145 1196100 1187616 1177812 1166751 1154233 1140031 1124166
50765A124166j7303j8419j9120j9425j9565j9648j9460j8804j7781j6456j4673
$$ 1124166 1106863 1088444 1069324 1049899 1030334 1010686 991226 972422 954641 938185 923512
50754I23512j2543j0635r215p736n750l812k687j965l73K581O114R370J2338J5424
$$ 923512 910969 900334 891119 883383 877633 873821 871134 869169 868796 871377 877491 886861 899199 914623
50740I14623J8794K2393K6019K9176L1403L3021L5075L8159M1616M4219M5430
$$ 914623 933417 955810 981829 1011005 1042408 1075429 1110504 1148663 1190279 1234498 1279928
50729A279928M5684M5659M5587M5266M4418M2929M0893L8562L6232L3951L1275
$$ 1279928 1325612 1371271 1416858 1462124 1506542 1549471 1590364 1628926 1665158 1699109 1730384
50718A730384K7521K2488J6742J0911M940j389p363j1503j3074j2764j1526r373
$$ 1730384 1757905 1780393 1797135 1808046 1812986 1811597 1804234 1792731 1779657 1766893 1755367 1745994
50706A745994n765p41M920J0374J5061J8620K0889K1852K1319J8947J4792R412
$$ 1745994 1740229 1739488 1744408 1754782 1769843 1788463 1809352 1831204 1852523 1871470 1886262 1895674
50694A895674L067m729j4320k4815l4396m1585m6009m8178m8892m8632m7262m4492
$$ 1895674 1898741 1894012 1879692 1854877 1820481 1778896 1732887 1684709 1635817 1587185 1539923 1495431
50682A495431m0693l6766l3049k9040k4447j9889j5965j2325q214l443J797P482
$$ 1495431 1454738 1417972 1384923 1355883 1331436 1311547 1295582 1283257 1275043 1271600 1273397 1280879
50670A280879J3384J8608K2328K4679K6294K7255K7155K5928K3923K1428J8709
$$ 1280879 1294263 1312871 1335199 1359878 1386172 1413427 1440582 1466510 1490433 1511861 1530570
50659A530570J6160J3931J1761R742Q635Q735R071Q622P723P276P097O300N066
$$ 1530570 1546730 1560661 1572422 1582164 1590799 1599534 1608605 1617227 1624950 1632226 1639323 1645623 1650689
50646A650689M684N953Q600J2157J6303K0299K3374K5822K8623L1889L4639L6269
$$ 1650689 1655373 1661326 1669926 1682083 1698386 1718685 1742059 1767881 1796504 1828393 1863032 1899301
50634A899301L7025L6881L5241L2268K9292K7313K5990K4717K3708K3336K3264
$$ 1899301 1936326 1973207 2008448 2040716 2070008 2097321 2123311 2148028 2171736 2195072 2218336
50623B218336K2932K2052J9765J4154L835j0067k4335l5884m3138m5693m3746
$$ 2218336 2241268 2263320 2283085 2297239 2301074 2291007 2266672 2230788 2187650 2141957 2098211
50612B098211l8073k9977k1006j2654o059j526J512L604M454L274j21n108j1114
$$ 2098211 2060138 2030161 2009155 1996501 1990442 1988916 1990428 1994032 1998486 2001760 2001639 1996531 1985417
50599A985417j8237k6623l5571m3615m9595n3444n5798n7097n7301n6342n4407
$$ 1985417 1967180 1940557 1904986 1861371 1811776 1758332 1702534 1645437 1588136 1531794 1477387
50588A477387n1761m8579m5150m1826l8728l5798l3223l1251k9447k6859k3275
$$ 1477387 1425626 1377047 1331897 1290071 1251343 1215545 1182322 1151071 1121624 1094765 1071490
50577A071490j9640j6661j3752j0188o524l782j712Q45M013O625Q021Q879R912
$$ 1071490 1051850 1035189 1021437 1011249 1004725 1000943 999231 1000076 1004089 1010714 1018735 1027614 1037526
50564A037526J0885J1395J1758J2528J3767J5292J7103J9120K1021K2708K4462
$$ 1037526 1048411 1059806 1071564 1084092 1097859 1113151 1130254 1149374 1170395 1193103 1217565
50553A217565K6322K7824K8695K9236K9684K9723K9037K7872K6656K5553K4751
$$ 1217565 1243887 1271711 1300406 1329642 1359326 1389049 1418086 1445958 1472614 1498167 1522918
50542A522918K4658K5300K6026K6381K6975K8854L2250L6427M0648M4728M8727
$$ 1522918 1547576 1572876 1598902 1625283 1652258 1681112 1713362 1749789 1790437 1835165 1883892
50531A883892N2559N6088N9454O3202O8014P4137Q0954Q7336R2546R6586R9664
$$ 1883892 1936451 1992539 2051993 2115195 2183209 2257346 2338300 2425636 2518182 2614768 2714432
50520B714432J01605J01916J00165R6118Q9714Q1114P0578N8176M3789K7513R917
$$ 2714432 2816037 2917953 3018118 3114236 3203950 3285064 3355642 3413818 3457607 3485120 3495037
50509C495037q193k6135m3427n9645p4166q6041r4373r8982j00405r8902r3883
$$ 3495037 3486844 3460709 3417282 3357637 3283471 3197430 3103057 3004075 2903670 2804768 2710885
50498B710885q4832p2488n8411m3524k7800j1373M887J9943L2994M3114M9236
$$ 2710885 2626053 2553565 2495154 2451630 2423830 2412457 2417344 2437287 2470281 2513395 2562631
50487B562631N0750M7608L9714K6937R903r834l0685n1359p0314q5855r7356j05509
$$ 2562631 2613381 2660989 2700703 2727640 2737543 2727709 2697024 2645665 2575351 2489496 2392140 2286631
50475B286631j10792j12497j10065j04597r8062r1374q4174p6222o8032o0159
$$ 2286631 2175839 2063342 1953277 1848680 1750618 1659244 1575070 1498848 1430816 1370657
50465A370657n2686m5682l9541l4663l1082k8479k6324k4103k1705j9493j7643
$$ 1370657 1317971 1272289 1232748 1198085 1167003 1138524 1112200 1088097 1066392 1046899 1029256
50454A029256j5569j2455q313m099o98J796L767N489P071Q750J0799J3131J5269
$$ 1029256 1013687 1001232 992919 988820 988122 989918 993685 999174 1006245 1014995 1025794 1038925 1054194
50441A054194J6791J7786J8690J9681K0431K0504J9755J8205J5817J2721R463
$$ 1054194 1070985 1088771 1107461 1127142 1147573 1168077 1187832 1206037 1221854 1234575 1244038
50430A244038O671M539K969K054J927K244K379K170K018K211K756L891O114R430
$$ 1244038 1250709 1255248 1258217 1260271 1262198 1264442 1266821 1268991 1271009 1273220 1275976 1279867 1285981 1295411
50416A295411J3120J6569J9945K3777K8325L3519L9041M4186M8152N0843N2971
$$ 1295411 1308531 1325100 1345045 1368822 1397147 1430666 1469707 1513893 1562045 1612888 1665859
50405A665859N5046N6668N7132N6280N4326N1283M7041M1744L5451K7809J8556
$$ 1665859 1720905 1777573 1834705 1890985 1945311 1996594 2043635 2085379 2120830 2148639 2167195
50394B167195Q152k578j3317k4230l5155m5338n4001o0743o5347o7549o7207o4421
$$ 2167195 2175347 2172769 2159452 2135222 2100067 2054729 2000728 1939985 1874638 1807089 1739882 1675461
50382A675461n9436n2587m4427l5692k6990j8550j0319k343M993J1087J5501J8114
$$ 1675461 1616025 1563438 1519011 1483319 1456329 1437779 1427460 1425117 1430110 1441197 1456698 1474812
50370A474812J8862J7523J3940Q300R65p789j7470k6974l5025m1051m5206m7612
$$ 1474812 1493674 1511197 1525137 1533437 1534402 1526613 1509143 1482169 1447144 1406093 1360887 1313275
50358A313275m8098m6871m4684m2054l8835l4929l0957k7586k4566k0986j6529
$$ 1313275 1265177 1218306 1173622 1131568 1092733 1057804 1026847 999261 974695 953709 937180
50347I37180j1937q204n529l296j009Q67J138q93m632q759j2461j5635j8078j9145
$$ 937180 925243 917039 911510 908214 907205 908072 909210 908317 903685 894926 882465 866830 848752 829607
50333H29607j8421j6271j3443j0452p586n105l130j451K06J880L413M641N475
$$ 829607 811186 794915 781472 771020 763434 758329 755199 753748 753954 755834 759247 763888 769363
50320G69363O002O530P266P942Q038P443O571N841N366N042M658L930L021K776
$$ 769363 775365 781895 789161 797103 805141 812584 819155 824996 830362 835404 840062 843992 847013 849789
50306H49789L834N521O423O170N771N948O116N594M944N250O505P583P656O936
$$ 849789 853623 859144 865567 871737 877508 883456 889572 895166 900110 905360 911865 919448 927104 934040
50292I34040O108N586N397N348N062M007J657k082o442r993j1731j1964j1691
$$ 934040 940148 945734 951131 956479 961541 965548 967205 965123 958681 948688 936957 924993 913302
50279I13302j1271j0230q362o127l886j514R05K771L792M455N237N993O536P134
$$ 913302 902031 891801 883439 877312 873426 871912 872817 875588 879380 883835 889072 895065 901601 908735
50265I08735P831Q015P324O488O492P283Q075Q607R341J0583J2064J3413J4489
$$ 908735 916566 924581 931905 938393 944885 952168 960243 968850 978191 988774 1000838 1014251 1028740
50252A028740J5255J5770J6244J6790J7139J6860J5823J4263J2565J1119J0148
$$ 1028740 1043995 1059765 1076009 1092799 1109938 1126798 1142621 1156884 1169449 1180568 1190716
50241A190716R507Q824P967P090O194M989L209P36k528o343r814j2105j3451j4592
$$ 1190716 1200223 1209047 1217014 1224104 1230298 1235287 1238496 1239232 1236704 1230361 1220547 1208442 1194991 1180399
50227A180399j5246j4227j1364q092n708m171l291l816o341j0116j3979j7660
$$ 1180399 1165153 1150926 1139562 1131470 1125762 1121591 1118300 1114484 1108143 1098027 1084048 1066388
50215A066388k1132k3503k3891k2886k1902k1407k0880k0037j8963j7428j5212
$$ 1066388 1045256 1021753 997862 974976 953074 931667 910787 890750 871787 854359 839147
50204H39147j2999j1694j1085j0283r323r112r724j0031r327q271p806p966q126
$$ 839147 826148 814454 803369 793086 783763 774651 764927 754896 745569 737298 729492 721526 713400
50191G13400p797o820n343l901l112l073l340l455l150k263r55J79O95Q59J136
$$ 713400 705603 698783 693440 689539 686427 683354 680014 676559 673409 671146 670191 670370 671065 671924 673060
50176F73060J376J174P36P41J344K091K623K972L167L195L201L256L129K691K259
$$ 673060 674436 675610 676346 677087 678431 680522 683145 686117 689284 692479 695680 698936 702065 704756 707015
50161G07015K052J778J319J203J636J803J098M11R87K540L842M689N779O884O895
$$ 707015 709067 710845 712164 713367 715003 716806 717904 718315 719302 721842 725684 730373 736152 743036 749931
50146G49931N775M846M818N066N194N840P312Q963J0622J3381J7955K3347K8063
$$ 749931 755706 760552 765370 770436 775630 781470 788782 797745 808367 821748 839703 863050 891113
50133H91113L1830L5125L7838L9377L9656L9121L8109L6831L5592L4518L3352
$$ 891113 922943 958068 995906 1035283 1074939 1114060 1152169 1189000 1224592 1259110 1292462
50122A292462L1862L0000K7360K3146J7091R823J956o482j5247k3325k9874l5022
$$ 1292462 1324324 1354324 1381684 1404830 1421921 1431744 1433700 1427218 1411971 1388646 1358772 1323750
50110A323750l9047m1401m1436l9634l7188l4559l1385k7708k4396k2113k0550
$$ 1323750 1284703 1243302 1201866 1162232 1125044 1090485 1059100 1031392 1006996 984883 964333
50099I64333j9058j7631j6891j7108j7629j7440j6236j4548j2839j0953q843p178
$$ 964333 945275 927644 910753 893645 876016 858576 842340 827792 814953 804000 795157 787979
50087G87979o444n912m520k701k083l182m570m800m097l470l125k633j930j184
$$ 787979 781535 775623 771103 768402 766319 763137 758567 753767 749670 746200 743075 740442 738512 737328
50073G37328j33J537L401M643N093N280N657O283P157Q233R141R405Q944Q099
$$ 737328 737195 738732 742133 746776 751869 757149 762806 769089 776246 784479 793620 803025 811969 820068
50059H20068P240O532N977N382M496L354K257J325L53o92j432j668j769k120k454
$$ 820068 827308 833840 839817 845199 849695 853049 855306 856631 856984 856292 854860 853192 851423 849303 846849
50044H46849k224j410n68j50RN00J704L227M112L966L725M709O872Q744R359R455
$$ 846849 844625 843215 842647 842497 842506 843006 844710 847937 852049 856015 859740 864449 871321 880065 889424 898879
50028H98879J0289J1915J3216J3292J2266J0964J0313J0765J1954J3104J3970
$$ 898879 909168 921083 934299 947591 959857 970821 981134 991899 1003853 1016957 1030927
50017A030927J4980J6327J7494J8044J8263J8513J8565J8103J7419J6902J6258
$$ 1030927 1045907 1062234 1079728 1097772 1116035 1134548 1153113 1171216 1188635 1205537 1221795
50006A221795J4944J3063J1192R547Q068O992O568O156M380L71n595j2587j9670
$$ 1221795 1236739 1249802 1260994 1270541 1278609 1285601 1292169 1298325 1302705 1303076 1297481 1284894 1265224
49993A265224k6045l1156l4891l7461l9004l9518l9032l7616l5327l2478k9787
$$ 1265224 1239179 1208023 1173132 1135671 1096667 1057149 1018117 980501 945174 912696 882909
49982H82909k7779k6136k4028k1134j7968j5207j3059j1339r882q655p595o515
$$ 882909 855130 828994 804966 783832 765864 750657 737598 726259 716377 707722 700127 693612
49970F93612n247l922k973k626k538k187j573j050n67L39J665K809L573M601O309
$$ 693612 688365 684443 681470 678844 676306 674119 672546 671496 670929 671268 672933 675742 679315 683916 690225
49955F90225Q055Q986R220R429R707R536Q691P383N668L456J049r58k394l658
$$ 690225 698280 707266 716486 725915 735622 745158 753849 761232 766900 770356 771405 770447 768053 764395
49941G64395n146o902q745j0252j0886j0599j0159j0276j0611j0348r600r372
$$ 764395 759249 752347 743602 733350 722464 711865 701706 691430 680819 670471 660871 651499
49929F51499r976j0380r527p717o144n462n264m789l705k206o38Q45K225L392
$$ 651499 641523 631143 621616 613899 607755 602293 597029 592240 588535 586329 585691 586536 588761 592153
49915E92153M132M496M912N651O353O494O218O284P180Q578R762J0289J0207R909
$$ 592153 596285 600781 605693 611344 617697 624191 630409 636693 643873 652451 662213 672502 682709 692618
49901F92618R767R745R374Q320O813N275L731J951N6j641l289n399p920j0037
$$ 692618 702385 712130 721504 729824 736637 741912 745643 747594 747650 746009 742720 737321 729401 719364
49887G19364j1175j1741j2442j3209j3255j2116j0174q238o909o380o525p005
$$ 719364 708189 696448 684006 670797 657542 645426 635252 627014 620105 613725 607200 600195
49875F00195p305o965n887m510l486l043k674j668N9J847L039L710M502N834P483
$$ 600195 592890 585925 580038 575528 572042 568999 566325 564657 564716 566563 569602 573312 577814 583648 591131
49860E91131Q907R866J0588J1310J1889J1957J1433J0602R663Q417O625M523K741
$$ 591131 600038 609904 620492 631802 643691 655648 667081 677683 687346 695763 702388 706911 709652
49847G09652J661R95P4j510l552n447o817p839q895r886j0093q913o647m427l303
$$ 709652 711313 712308 712382 710872 707320 701873 695056 687217 678322 668436 658343 649430 642783 638356 635053
49832F35053l414l939l825k629p95Q53J817K145K170K282K896M247O002P361P794
$$ 635053 631639 627700 623875 621246 620451 621304 623121 625266 627436 629718 632614 636861 642863 650224 658018
49817F58018P564P310P218O899O113N259M951N154N012L675J232j316l028l814
$$ 658018 665582 672892 680110 687009 693122 698381 703332 708486 713498 717173 718405 717089 714061 710247
49803G10247m238m812n641o537p270p727q026q342q495p887o212m071k614k485
$$ 710247 706009 701197 695556 689019 681749 674022 665996 657654 649159 641272 635060 630989 628375 625890
49789F25890l383m508n160m942l783j987n8J534K433K455J811J119R29J326K195
$$ 625890 622507 617999 612839 607897 604114 602127 602069 603603 606036 608491 610302 611421 612350 613676 615871
49774F15871L561N318O921P885Q338Q643Q656P984O718N273L690J807Rj087j658
$$ 615871 619432 624750 631671 639556 647894 656537 665193 673177 679895 685168 688858 690665 690674 689587 687929
$$ [...]
##END NTUPLES=NMR SPECTRUM
##END=
