
##TITLE=UV1234_M7_1357-1247_90_7240071_1BhuKbzNkE
##JCAMPDX= 6.0         $$ Bruker NMR JCAMP-DX V2.0
##DATA TYPE= NMR SPECTRUM
##DATA CLASS= NTUPLES
##ORIGIN= BRUKER
##OWNER= Administrator
$$ 1.72 TOPSPIN		Version 2.1
$$ 2013-01-18 20:01:02.568 -0500  Administrator@X
$$ Compression mode = diff/dup
##.OBSERVE FREQUENCY= 400.02188249412
##.OBSERVE NUCLEUS= ^1H
##.ACQUISITION MODE= SIMULTANEOUS (DQD)
##.ACQUISITION SCHEME= undefined
##.AVERAGES= 64
##.DIGITISER RES= 22
##SPECTROMETER/DATA SYSTEM= spect
##.PULSE SEQUENCE= noesygpps1d.comp
##.SOLVENT NAME= COFFEE_meoh
##.SHIFT REFERENCE= INTERNAL, COFFEE_meoh, 1, 14.96159
##AUDIT TRAIL= $$ (NUMBER, WHEN, WHO, WHERE, PROCESS, VERSION, WHAT)
$$ ##TITLE= Audit trail, TOPSPIN		Version 2.1
$$ ##JCAMPDX= 5.01
$$ ##ORIGIN= Bruker BioSpin GmbH
$$ ##OWNER= Administrator
$$ $$ E:\/data/COFFEE/nmr/UV1234_M7_1357-1247_90_7240071_1BhuKbzNkE/22/pdata/1/auditp.txt
$$ ##AUDIT TRAIL=  $$ (NUMBER, WHEN, WHO, WHERE, PROCESS, VERSION, WHAT)
(   1,<2013-01-18 20:00:56.771 -0500>,<Administrator>,<X>,<go>,<TOPSPIN 2.1>,
      <created by zg
	started at 2013-01-18 19:49:26.818 -0500,
	POWCHK enabled, PULCHK disabled,
       configuration hash MD5:
       86 BA 57 50 F2 9D 5C 9B 26 00 A9 28 5F 66 2E 89
       data hash MD5: 64K
       CE E9 5B 6D 05 13 BB C2 59 61 33 51 CC 20 24 D9>)
(   2,<2013-01-18 20:00:59.834 -0500>,<Administrator>,<X>,<proc1d>,<TOPSPIN 2.1>,
      <Start of raw data processing
       efp LB = 0.3 FT_mod = 6 PKNL = 1 PHC0 = 0 PHC1 = 0 SI = 128K 
       data hash MD5: 128K
       66 10 2D 43 CD 3A 15 06 B1 10 78 F3 E4 9B 38 1D>)
(   3,<2013-01-18 20:01:00.880 -0500>,<Administrator>,<X>,<proc1d>,<TOPSPIN 2.1>,
      <pk PHC0 = -83.51257 PHC1 = 0 
       data hash MD5: 128K
       E1 62 27 55 41 16 4C A2 95 C5 CE BE E3 00 CF 45>)
(   4,<2013-01-18 20:01:01.568 -0500>,<Administrator>,<X>,<proc1d>,<TOPSPIN 2.1>,
      <abs ABSG = 1 
       data hash MD5: 128K
       7C 22 8F 04 37 FB 7B 9D 4C 12 20 33 C0 16 E0 CB>)
(   5,<2013-01-18 20:01:01.755 -0500>,<Administrator>,<X>,<proc1d>,<TOPSPIN 2.1>,
      <abs ABSG = 2 
       data hash MD5: 128K
       69 E4 86 20 A8 F3 B1 D1 14 9B DF 4E D9 C5 E8 83>)
(   6,<2013-01-18 20:01:01.943 -0500>,<Administrator>,<X>,<proc1d>,<TOPSPIN 2.1>,
      <abs ABSG = 3 
       data hash MD5: 128K
       19 EA 4D C6 B0 5C E5 A0 F5 07 06 33 87 3B 44 DD>)
(   7,<2013-01-18 20:01:02.115 -0500>,<Administrator>,<X>,<proc1d>,<TOPSPIN 2.1>,
      <abs ABSG = 4 
       data hash MD5: 128K
       D5 B6 60 5D 33 60 77 DD FA 0F D4 15 E5 B9 53 1A>)
(   8,<2013-01-18 20:01:02.271 -0500>,<Administrator>,<X>,<proc1d>,<TOPSPIN 2.1>,
      <abs ABSG = 5 
       data hash MD5: 128K
       EC A8 F4 73 C6 23 DD 3E 49 9D A0 8B ED 6D 2B 77>)
$$ ##END=
$$ 
$$ $$ hash MD5
$$ $$ A3 4E 3C 67 2A 39 9C CE 30 35 2A B6 22 A5 8C CB
##$RELAX= 
##$RELAX= 
##$RELAX= 
##$RELAX= 
##$RELAX= 
##$RELAX= 
##$RELAX= 
##$RELAX= 
$$ Bruker specific parameters
$$ --------------------------
##$DU= <E:\>
##$EXPNO= 22
$$ [...]
##$TP07= 0
##$TPNAME0= <>
##$TPNAME1= <>
##$TPNAME2= <>
##$TPNAME3= <>
##$TPNAME4= <>
##$TPNAME5= <>
##$TPNAME6= <>
##$TPNAME7= <>
##$TPOAL= (0..7)
0.5 0.5 0.5 0.5 0.5 0.5 0.5 0.5
##$TPOFFS= (0..7)
0 0 0 0 0 0 0 0
##$TUNHIN= 0
##$TUNHOUT= 0
##$TUNXOUT= 0
##$USERA1= <user>
##$USERA2= <user>
##$USERA3= <user>
##$USERA4= <user>
##$USERA5= <user>
##$V9= 5
##$VALIST= <valist>
##$VCLIST= <CCCCCCCCCCCCCCC>
##$VD= 0
##$VDLIST= <DDDDDDDDDDDDDDD>
##$VPLIST= <PPPPPPPPPPPPPPP>
##$VTLIST= <TTTTTTTTTTTTTTT>
##$WBST= 1024
##$WBSW= 4
##$XGAIN= (0..3)
0 0 0 0
##$XL= 0
##$YL= 0
##$YMAX_a= 5461607
##$YMIN_a= -12029306
##$ZGOPTNS= <>
##$ZL1= 120
##$ZL2= 120
##$ZL3= 120
##$ZL4= 120
##$ABSF1= 14.96159
##$ABSF2= -5.596592
##$ABSG= 5
##$ABSL= 3
##$ALPHA= 0
##$AQORDER= 0
##$ASSFAC= 0
##$ASSFACI= 0
##$ASSFACX= 0
##$ASSWID= 0
##$AUNMP= <proc_prof1d_extract.lims>
##$AXLEFT= 0
##$AXNAME= <>
##$AXNUC= <1H>
##$AXRIGHT= 0
##$AXTYPE= 0
##$AXUNIT= <>
##$AZFE= 0.1
##$AZFW= 0.1
##$BCFW= 0
##$BC_mod= 0
##$BYTORDP= 0
##$COROFFS= 0
##$CY= 15
##$DATMOD= 1
##$DC= 0
##$DFILT= <>
##$DTYPP= 0
##$F1P= 0
##$F2P= 0
##$FCOR= 0.5
##$FTSIZE= 131072
##$FT_mod= 6
##$GAMMA= 0
##$GB= 0
##$INTBC= 1
##$INTSCL= 1
##$ISEN= 128
##$LB= 0.3
##$LEV0= 0
##$LPBIN= 0
##$MAXI= 10000
##$MC2= 0
##$MEAN= 0
##$ME_mod= 0
##$MI= 0
##$NCOEF= 0
##$NC_proc= -2
##$NLEV= 6
##$NOISF1= 0
##$NOISF2= 0
##$NSP= 0
##$NTH_PI= 0
##$NZP= 0
##$OFFSET= 14.96159
##$PC= 1
##$PHC0= -83.51257
##$PHC1= 0
##$PH_mod= 1
##$PKNL= yes
##$PPARMOD= 0
##$PPDIAG= 0
##$PPIPTYP= 0
##$PPMPNUM= 2147483647
##$PPRESOL= 1
##$PSCAL= 4
##$PSIGN= 0
##$PYNMP= <proc.py>
##$REVERSE= no
##$SF= 400.020009399002
##$SI= 131072
##$SIGF1= 0
##$SIGF2= 0
##$SINO= 400
##$SIOLD= 131072
##$SPECTYP= <>
##$SREGLST= <1H.CDCl3>
##$SSB= 0
##$STSI= 131072
##$STSR= 0
##$SW_p= 8223.68421052631
##$SYMM= 0
##$S_DEV= 0
##$TDeff= 65536
##$TDoff= 0
##$TI= <>
##$TILT= no
##$TM1= 0
##$TM2= 0
##$TOPLEV= 0
##$USERP1= <user>
##$USERP2= <user>
##$USERP3= <user>
##$USERP4= <user>
##$USERP5= <user>
##$WDW= 1
##$XDIM= 131072
##$YMAX_p= 419378102
##$YMIN_p= -305558
##$CURPLOT= <Network HP LaserJet P1505>
##$CURPRIN= <$Network HP LaserJet P1505>
##$DFORMAT= <normdp>
##$LAYOUT= <+/1D_H.xwp>
##$LFORMAT= <normlp>
##$PFORMAT= <normpl>
##$SURQMSG= 1
$$ End of Bruker specific parameters
$$ ---------------------------------
##NTUPLES= NMR SPECTRUM
##VAR_NAME=  FREQUENCY,     SPECTRUM/REAL,   SPECTRUM/IMAG
##SYMBOL=    X,             R,               I
##VAR_TYPE=  INDEPENDENT,   DEPENDENT,       DEPENDENT
##VAR_FORM=  AFFN,          ASDF,            ASDF
##VAR_DIM=   131072,        131072,          131072
##UNITS=     HZ,            ARBITRARY UNITS, ARBITRARY UNITS
##FACTOR=    0.0627417313425164, 1,          1
##FIRST=     8223.62146879497, 1155,         -52914
##LAST=      0,             3680,            -53204
##MIN=       0,             -305558,         0
##MAX=       8223.62146879497, 419378102,    0
$$ Real data points
##PAGE= N=1
##DATA TABLE= (X++(R..R)), XYDATA
$$ [...]
$$ plain form
63953 640097 665409 693047 723639 757855 796170 839100 887760 943961 1009506 1085568 1173033
63942 1173033 1273286 1388259 1519579 1667969 1833537 2016212 2215531 2430236 2658455
63933 2658455 2898149 3146932 3401470 3657399 3909866 4153797 4383611 4593285 4777219
63924 4777219 4931041 5051572 5136477 5184314 5194545 5166930 5101049 4997139 4857638 4687445
63914 4687445 4492361 4277501 4047334 3806682 3560904 3314993 3072825 2837420 2611550
63905 2611550 2397829 2198339 2014514 1847362 1697521 1564890 1448396 1346459 1257672 1180824
63895 1180824 1114235 1055574 1002730 954685 911208 871812 835480 801410 769490 739862 712454
63884 712454 687252 664589 644616 626633 609485 592748 577167 563804 552964 544049 536268 529338
$$ packed form
63953F40097K5312K7638L0592L4216L8315M2930M8660N6201O5545P6062Q7465
63942A173033J00253J14973J31320J48390J65568J82675J99319K14705K28219
63933B658455K39694K48783K54538K55929K52467K43931K29814K09674J83934
63924D777219J53822J20531Q4905M7837J0231k7615o5881j03910j39501j70193
63914D687445j95084k14860k30167k40652k45778k45911k42168k35405k25870
63905B611550k13721j99490j83825j67152j49841j32631j16494j01937q8787p6848
63895A180824o6589n8661n2844m8045m3477l9396l6332l4070l1920k9628k7408
63884G12454k5202k2663j9973j7983j7148j6737j5581j3363j0840q915p781o930
$$ plain form
63872 529338 523586 519451 516900 515432 514759 515344 518020 523213 530856 540982 553857 569408 586980 606075
63858 606075 626960 650199 675810 703356 732654 763848 796794 830932 865845 901389 937064
63847 937064 971789 1004682 1035734 1065213 1092593 1116494 1135617 1149359 1157630 1160498 1158141 1150785
63835 1150785 1138579 1121726 1100700 1076060 1048019 1016567 982083 945474 907626 869120 830646
63824 830646 793145 757109 722145 687774 654487 623429 595094 568877 543989 520329 498333
63813 498333 478378 460630 445146 431750 419924 409026 398633 388566 378750 369220 360160 351787
63801 351787 344182 337270 330882 324805 318860 313063 307625 302752 298404 294252 289860 285016 280040 275603
63787 275603 272077 269088 266012 262800 259981 257849 256137 254581 253340 252525 251734 250568 249327 248658 248507
$$ packed form
63872E29338n752m135k551j468o73N85K676N193P643J0126J2875J5551J7572J9095
63858F06075K0885K3239K5611K7546K9298L1194L2946L4138L4913L5544L5675
63847I37064L4725L2893L1052K9479K7380K3901J9123J3742Q271K868k357p356
63835A150785j2206j6853k1026k4640k8041l1452l4484l6609l7848l8506l8474
63824H30646l7501l6036l4964l4371l3287l1058k8335k6217k4888k3660k1996
63813D98333j9955j7748j5484j3396j1826j0898j0393j0067r816r530r060q373
63801C51787p605o912o388o077n945n797n438m873m348m152m392m844m976m437
63787B75603l526k989l076l212k819k132j712j556j241q15p91j166j241o69j51
$$ plain form
63772 248507 247979 246387 244119 242235 241387 241324 241399 241357 241504 242084 242701 242631 241703 240512 239595 238845 238069 237706 238350
63753 238350 239735 240882 241338 241612 242201 242827 243071 243225 243902 245101 246265 247151 248131 249591 251532 253804
63737 253804 256293 258760 260892 262667 264302 265712 266478 266655 267122 268652 270866 272752 274125 275965 279156
63722 279156 283434 287889 292087 296316 300910 305744 310336 314167 316913 318573 319398 319573 319038 317679 315565
63707 315565 312890 309887 306982 304776 303537 302856 302132 301235 300443 299931 299742 300118 301296 303063 305116 307804
63691 307804 311720 316362 320005 321443 321295 321030 321183 321194 320622 319753 319053 318718 318793 319233 319770 320133 320380 320660
63673 320660 320735 320327 319915 320554 322635 325316 327508 329046 330588 332619 334897 336719 337555 337539 337388 337637 337820
63656 337820 336726 333697 329423 325232 321815 318941 316180 313471 310940 308504 305930 303248 300940 299573
$$ packed form
63772B48507n28j592k268j884q48o3P5m2J47N80O17p0r28j191r17p50p76l63O44
63753B38350J385J147M56K74N89O26K44J54O77J199J164Q86R80J460J941K272
63737B53804K489K467K132J775J635J410P66J77M67J530K214J886J373J840L191
63722B79156M278M455M198M229M594M834M592L831K746J660Q25J75n35j359k114
63707C15565k675l003k905k206j239o81p24q97p92n12j89L76J178J767K053K688
63691C07804L916M642L643J438j48k65J53J1n72q69p00l35P5M40N37L63K47K80
63673C20660P5m08m12O39K081K681K192J538J542K031K278J822Q36j6j51K49J83
63656C37820j094l029m274m191l417k874k761k709k531k436k574k682k308j367
$$ plain form
63642 299573 299197 299216 299000 298571 298522 299325 300990 303340 306268 309632 313181 316814 320677 324838 329089 333284
63626 333284 337742 343069 349641 357387 366024 375366 385440 396352 408088 420525 433808 448537 465276
63613 465276 483917 503962 525464 549174 575447 603451 631827 659774 687016 712954 736438
63602 736438 756308 771748 782208 787500 788129 785144 779525 771929 762986 753446 743838 734146 723936
63589 723936 712628 699671 684773 668129 650248 631468 611861 591687 571736 553057 536424
63578 536424 522087 509833 499206 489870 481932 475821 471823 469823 469535 470732 473166 476450 480242 484474
63564 484474 489269 494698 500671 506953 513223 519298 525417 532180 539993 548768 558435 569672 583786 601766
63550 601766 623622 648737 676569 706790 738909 772109 805450 837792 867285 891229 907077
$$ packed form
63642B99573l76J9k16m29m9Q03J665K350K928L364L549L633L863M161M251M195
63626C33284M458N327O572P746Q637R342J0074J0912J1736J2437J3283J4729J6739
63613D65276J8641K0045K1502K3710K6273K8004K8376K7947K7242K5938K3484
63602G36438J9870J5440J0460N292O29k985n619p596q943r540r608r692j0210
63589G23936j1308j2957j4898j6644j7881j8780j9607k0174j9951j8679j6633
63578E36424j4337j2254j0627r336p938o111l998k000k88J197K434L284L792M232
63564D84474M795N429N973O282O270O075O119O763P813Q775R667J1237J4114J7980
63550F01766K1856K5115K7832L0221L2119L3200L3341L2342K9493K3944J5848
$$ plain form
63539 907077 913824 912393 904681 892526 877553 861468 845830 831439 818242 805862 793988 782223
63527 782223 769914 756348 741001 723467 703445 681056 657128 632864 609135 586138 563676
63516 563676 541659 520351 500342 482328 466781 453643 442346 432214 422864 414242 406333 399033
63504 399033 392329 386431 381545 377537 373982 370533 367091 363627 360088 356589 353458 350887 348726 346816
63490 346816 345342 344582 344393 344277 343944 343524 343250 343264 343773 345053 347094 349521 352056 354876 358367 362680
63474 362680 367650 372877 377672 381214 383095 383680 383694 383458 382707 381040 378346 374846 370912 366867 362865
63459 362865 358964 355364 352396 350194 348624 347698 347755 348904 350606 352299 354265 357224 361083 364803 367792
63444 367792 370883 375485 382171 390596 400477 411989 425265 440096 456418 474774 496067 520847
$$ packed form
63539I07077O747j431p712j2155j4973j6085j5638j4391j3197j2380j1874j1765
63527G82223j2309j3566j5347j7534k0022k2389k3928k4264k3729k2997k2462
63516E63676k2017k1308k0009j8014j5547j3138j1297j0132r350q622p909p300
63504C99033o704n898m886m008l555l449l442l464l539l499l131k571k161j910
63490C46816j474p60j89j16l33m20k74J4N09J280K041K427K535K820L491M313
63474C62680M970N227M795L542J881N85J4k36p51j667k694l500l934m045m002
63459C62865l901l600k968k202j570r26N7J149J702J693J966K959L859L720K989
63444C67792L091M602O686Q425R881J1512J3276J4831J6322J8356K1293K4780
$$ plain form
63432 520847 548736 578205 606867 632287 652966 668751 680454 689255 696402 703167 710750 720217
63420 720217 732511 748434 768363 791971 818305 846251 874867 903200 929858 953022 971065
63409 971065 983120 989024 988995 983718 974636 963484 951264 937943 923375 908042 892460 876217 858251
63396 858251 838031 815850 792027 766552 739773 712775 686588 661427 637141 614099 593105
63385 593105 574616 558484 544385 532077 521291 511813 503710 497220 492430 489331 488206 489522 493310
63372 493310 498867 505255 511969 519121 527253 537052 549027 563204 579143 596396 614963 635378 658300
63359 658300 683931 711744 740908 771031 802226 834218 865643 894611 919818 940699 956681
63348 956681 966930 971043 969518 963341 953491 941037 927251 913110 898834 884158 868917 853067
$$ packed form
63432E20847K7889K9469K8662K5420K0679J5785J1703Q801P147O765P583R467
63420G20217J2294J5923J9929K3608K6334K7946K8616K8333K6658K3164J8043
63409I71065J2055N904k9n277r082j1152j2220j3321j4568j5333j5582j6243j7966
63396H58251k0220k2181k3823k5475k6779k6998k6187k5161k4286k3042k0994
63385E93105j8489j6132j4099j2308j0786r478q103o490m790l099j125J316L788
63372D93310N557O388O714P152Q132R799J1975J4177J5939J7253J8567K0415K2922
63359F58300K5631K7813K9164L0123L1195L1992L1425K8968K5207K0881J5982
63348I56681J0249M113j525o177r850j2454j3786j4141j4276j4676j5241j5850
$$ plain form
63336 853067 836281 817820 796893 773207 747305 720442 693860 668114 643285 619815 598666
63325 598666 580478 565109 552324 542471 536044 532899 532352 533612 535447 535702 532088 523741 511618 497360
63311 497360 482279 467384 453533 441053 429554 418549 408096 398612 390313 383097 376768 371158
63299 371158 366159 361822 358254 355281 352377 349164 345837 342880 340484 338401 336285 333928 331231 328200
63285 328200 325076 322297 320174 318590 317149 315675 314478 313953 313968 313874 313228 312213 311233 310395 309736 309610 310319
63268 310319 311418 311997 311722 311193 311129 311663 312579 313787 315214 316566 317557 318186 318620 319052 319808 321251 323245
63251 323245 325048 326035 326325 326391 326381 326195 325995 326154 326799 327809 329160 330875 332754 334584 336605 339283 342635
63234 342635 346186 349624 353059 356520 359713 362514 365356 368792 372926 377480 382198 386930 391509 395849
$$ packed form
63336H53067j6786j8461k0927k3686k5902k6863k6582k5746k4829k3470k1149
63325E98666j8188j5369j2785r853o427l145n47J260J835K55l614q347j2123j4258
63311D97360j5081j4895j3851j2480j1499j1005j0453r484q299p216o329n610
63299C71158m999m337l568k973k904l213l327k957k396k083k116k357k697l031
63285C28200l124k779k123j584j441j474j197n25J5r4o46j015r80q38o59j26P09
63268C10319J099N79k75n29o4N34R16J208J427J352R91O29M34M32P56J443J994
63251C23245J803R87K90O6j0j86k00J59O45J010J351J715J879J830K021K678L352
63234C42635L551L438L435L461L193K801K842L436M134M554M718M732M579M340
$$ plain form
63220 395849 400036 404143 408073 411847 415868 420582 425919 431403 436845 442603 448934 455370 461042 465631
63206 465631 469765 474389 479816 485434 490189 493285 494597 494639 494146 493513 492531 490783 488307 485747 483819
63191 483819 482832 482810 483861 486171 489732 494350 499905 506483 514284 523526 534315 546401 559147 571978
63177 571978 584838 597959 611213 624047 636117 647659 659107 670641 682304 694215 706337
63166 706337 718163 728986 738515 746963 754579 761269 766680 770333 771651 770144 765723 758677 749184 737068
63152 737068 722287 705539 688027 670588 653318 636124 619319 603428 588628 574785 561950
63141 561950 550417 540242 531128 522984 516248 511311 507832 505003 502358 499990 498104 496831 496423 497069
63127 497069 498352 499470 500346 502063 505660 510760 516008 520791 525843 532014 538998 545676 551306 556011
$$ packed form
63220C95849M187M107L930L774M021M714N337N484N442N758O331O436N672M589
63206D65631M134M624N427N618M755L096J312M2m93o33r82j748k476k560j928
63191D83819r87k2J051K310L561M618N555O578P801R242J0789J2086J2746J2831
63177E71978J2860J3121J3254J2834J2070J1542J1448J1534J1663J1911J2122
63166G06337J1826J0823R529Q448P616O690N411L653J318j507m421p046r493j2116
63152G37068j4781j6748j7512j7439j7270j7194j6805j5891j4800j3843j2835
63141E61950j1533j0175r114q144o736m937l479k829k645k368j886j273m08O46
63127D97069J283J118Q76J717L597N100N248M783N052O171O984O678N630M705
$$ plain form
63113 556011 560334 564764 569579 574745 579922 584862 589702 594575 599067 602606 605496 608943 613633 618711
63099 618711 622710 625291 627514 630457 634137 637944 641631 645599 650385 656133 662448 668674 674413 679753
63085 679753 684830 689284 692502 694344 695206 695292 694377 692465 690072 687420 683884 678817 672543 665966 659443
63070 659443 652721 645796 639035 632496 625909 619497 614118 610255 607520 605511 604592 605348 607672 610967 614953
63055 614953 619723 625187 631064 637440 644900 653940 664558 676500 689625 703850 718836 733943 748613
63042 748613 762881 777409 792784 808684 823991 837820 850276 862057 873584 884715 895077
63031 895077 904376 912563 919960 927056 933860 939559 943167 944418 943719 941365 937185 930917 922512 912059
63017 912059 899831 886509 872939 859565 846391 833601 821766 811220 801734 793203 786334 782126
$$ packed form
63113E56011M323M430M815N166N177M940M840M873M492L539K890L447M690N078
63099F18711L999K581K223K943L680L807L687L968M786N748O315O226N739N340
63085F79753N077M454L218J842Q62Q6r15j912k393k652l536n067o274o577o523
63070F59443o722o925o761o539o587o412n379l863k735k009r19P56K324L295L986
63055F14953M770N464N877O376P460R040J0618J1942J3125J4225J4986J5107J4670
63042G48613J4268J4528J5375J5900J5307J3829J2456J1781J1527J1131J0362
63031H95077R299Q187P397P096O804N699L608J251o99k354m180o268q405j0453
63017I12059j2228j3322j3570j3374j3174j2790j1835j0546r486q531o869m208
$$ plain form
63005 782126 780794 781698 784317 788850 795796 805335 817401 832036 849316 868961 890280 912594 935559
62992 935559 959058 982921 1006955 1031188 1055847 1080981 1106172 1130731 1154108 1176086 1196713
62981 1196713 1216174 1234560 1251492 1265957 1276775 1283342 1285770 1284257 1278503 1267808 1251666 1230260
62969 1230260 1204582 1176071 1145857 1114222 1081035 1046741 1012572 979571 947838 917161 887972
62958 887972 861013 836141 812235 788527 765433 743729 723392 703778 684602 666120 648469
62947 648469 631495 615311 600486 587335 575385 563859 552481 541556 531471 522465 514689 508057
62935 508057 502076 496216 490536 485547 481358 477380 473144 469043 465811 463507 461452 459142 456756 454703
62921 454703 453147 452113 451676 451703 451729 451422 450972 450659 450189 448965 447081 445549 445230 445775 445984 445160 443811
$$ packed form
63005G82126j332R04K619M533O946R539J2066J4635J7280J9645K1319K2314K2965
62992I35559K3499K3863K4034K4233K4659K5134K5191K4559K3377K1978K0627
62981A196713J9461J8386J6932J4465J0818O567K428j513n754j0695j6142k1406
62969A230260k5678k8511l0214l1635l3187l4294l4169l3001l1733l0677k9189
62958H87972k6959k4872k3906k3708k3094k1704k0337j9614j9176j8482j7651
62947F48469j6974j6184j4825j3151j1950j1526j1378j0925j0085r006p776o632
62935E08057n981n860n680m989m189l978m236m101l232k304k055k310k386k053
62921D54703j556j034m37K7K6l07m50l13m70j224j884j532l19N45K09q24j349
$$ plain form
62904 443811 442978 443099 443706 444103 444108 444086 444502 445633 447641 450671 454765 459755 465354 471275 477277 483203 489068
62887 489068 494948 500735 506150 511084 515740 520267 524447 527959 530740 532726 533437 532327 529584 526086
62873 526086 522419 518335 513355 507462 500884 493648 485873 478200 471319 465116 458800 451937 444941 438450
62859 438450 432667 427481 422879 418947 415647 412831 410363 408184 406430 405473 405513 406018 405917 404640 402710
62844 402710 401070 400089 399503 399033 398593 398011 397065 395837 394630 393484 392169 390722 389576 388948 388532 388097
62828 388097 388012 388714 389815 390308 389719 388689 388214 388594 389338 389884 390113 390163 390079 389827 389547 389621 390420 392051 394274
62809 394274 396569 398268 398880 398501 397882 397871 398711 399987 401252 402502 403923 405408 406642 407574 408484 409507
62793 409507 410374 410825 411076 411591 412509 413662 415252 418149 423193 430227 438136 445871 453370 461433 470855
$$ packed form
62904D43811q33J21O07L97Nk2M16J131K008L030M094M990N599N921O002N926N865
62887D89068N880N787N415M934M656M527M180L512K781J986P11j110k743l498
62873E26086l667m084m980n893o578p236p775p673o881o203o316o863o996o491
62859D38450n783n186m602l932l300k816k468k179j754r57M0N05j01j277j930
62844D02710j640r81n86m70m40n82r46j228j207j146j315j447j146o28m16m35
62828C88097q5P02J101M93n89j030m75L80P44N46K29N0q4k52k80P4P99J631K223
62809C94274K295J699O12l79o19j1Q40J276J265J250J421J485J234R32R10J023
62793D09507Q67M51K51N15R18J153J590K897N044P034P909P735P499Q063R422
$$ plain form
62778 470855 481691 493233 504618 515557 526544 538291 550944 563956 576752 589268 601732
62767 601732 614107 626059 637357 647954 657584 665524 670947 673460 673248 670807 666561 660644 652935
62754 652935 643357 632055 619247 604987 589390 573125 557349 542861 529521 516701 504198 492351
62742 492351 481372 470974 460892 451408 443078 435997 429690 423742 418232 413408 409181 405253 401687
62729 401687 398962 397317 396275 395112 393718 392730 392800 393950 395667 397432 399081 400823 403059 406060 409724
62714 409724 413776 418278 423738 430557 438510 446970 455547 464339 473722 484192 496327 510519 526654
62701 526654 544251 563021 583107 604788 628216 653537 680972 710651 742629 777233 815079
62690 815079 856387 900412 945799 991333 1036080 1079034 1119110 1155388 1186914 1212280 1230029
$$ packed form
62778D70855J0836J1542J1385J0939J0987J1747J2653J3012J2796J2516J2464
62767F01732J2375J1952J1298J0597R630P940N423K513k12k441m246n917p709
62754F52935r578j1302j2808j4260j5597j6265j5776j4488j3340j2820j2503j1847
62742D92351j0979j0398j0082r484q330p081o307n948n510m824m227l928l566
62729D01687k725j645j042j163j394r88P0J150J717J765J649J742K236L001L664
62714D09724M052M502N460O819P953Q460Q577Q792R383J0470J2135J4192J6135
62701E26654J7597J8770K0086K1681K3428K5321K7435K9679L1978L4604L7846
62690H15079M1308M4025M5387M5534M4747M2954M0076L6278L1526K5366J7749
$$ plain form
62679 1230029 1239632 1241603 1236387 1223675 1203246 1176053 1143888 1108210 1069792 1029323 987688 945688
62667 945688 904003 863442 824651 787505 751497 716933 685119 657017 632269 609921 589536
62656 589536 571043 554073 538246 523842 511381 500603 490547 480624 470967 461792 453190 445675
62644 445675 440025 436135 432669 428439 423696 419572 416607 414401 412486 410871 409701 408790 407650 405796
62630 405796 403054 399773 396666 394249 392469 390978 389570 388173 386616 384752 382705 380780 379188 378108
62616 378108 377795 378307 379158 379600 379317 378621 377952 377422 376878 376227 375591 375249 375401 375970 376741 377708 379108 381042
62598 381042 383345 385951 389059 392678 396397 399991 403911 408682 414115 419755 425893 433364 442295 451721
62584 451721 460603 468571 475552 481370 486092 490148 493565 495526 495209 492808 489234 484987 479788 473297
$$ packed form
62679A230029R603J971n216j2712k0429k7193l2165l5678l8418m0469m1635m2000
62667I45688m1685m0561l8791l7146l6008l4564l1814k8102k4748k2348k0385
62656E89536j8493j6970j5827j4404j2461j0778j0056r923r657r175q602p515
62644D45675n650l890l466m230m743m124k965k206j915j615j170r11j140j854
62630D05796k742l281l107k417j780j491j408j397j557j864k047j925j592j080
62616C78108l13N12Q51M42k83o96o69n30n44o51o36l42J52N69P71R67J400J934
62598C81042K303K606L108L619L719L594L920M771N433N640O138P471Q931R426
62584D51721Q882P968O981N818M722M056L417J961l17k401l574m247n199o491
$$ plain form
62570 473297 465836 458378 451927 446779 442278 437509 432355 427578 423640 419891 415353 410096 405310 402064
62556 402064 400365 399440 398540 397345 395848 394089 392096 390110 388725 388414 388859 389111 388703 388240 388579 389774
62540 389774 391289 392948 395045 397590 400039 401897 403135 403915 404289 404345 404310 404331 404372 404444 404774 405723 407644 410749
62522 410749 414921 419780 425235 431788 439920 449308 459216 469593 481226 494736 510088 527297 546862
62509 546862 569044 593183 618308 644146 671027 699091 728019 757334 786402 814244 839844
62498 839844 862731 882909 900268 914498 925609 934186 941078 947123 953216 960248 968745 978666 989654
62485 989654 1001457 1014230 1028633 1045547 1065256 1086758 1107960 1126623 1141037 1150109 1153357 1150941
62473 1150941 1143239 1130115 1110816 1084828 1052609 1015373 974436 931111 886924 843383 801353
$$ packed form
62570D73297p461p458o451n148m501m769n154m777l938l749m538n257m786l246
62556D02064j699r25r00j195j497j759j993j986j385l11M45K52m08m63L39J195
62540C89774J515J659K097K545K449J858J238P80L74N6l5K1M1P2L30R49J921L105
62522D10749M172M859N455O553Q132R388R908J0377J1633J3510J5352J7209J9565
62509E46862K2182K4139K5125K5838K6881K8064K8928K9315K9068K7842K5600
62498H39844K2887K0178J7359J4230J1111Q577O892O045O093P032Q497R921J0988
62485I89654J1803J2773J4403J6914J9709K1502K1202J8663J4414R072L248k416
62473A150941p702j3124j9299k5988l2219l7236m0937m3325m4187m3541m2030
$$ plain form
62462 801353 760897 721869 684601 649958 618834 591609 568057 547720 530329 515838 504163
62451 504163 495038 488084 482792 478453 474461 470857 468304 467316 467770 469386 472230 476201 480368 483652 486273
62436 486273 489739 495006 501187 506554 510362 513042 514872 515284 513686 510368 506221 501796 496968 491411
62422 491411 485089 478298 471436 464889 459041 454251 450584 447575 444435 440690 436572 432693 429465 426955
62408 426955 425077 423615 422133 420290 418310 416821 416093 415768 415486 415441 415998 417043 418117 419095 420346 422221
62392 422221 424684 427503 430508 433515 436277 438775 441487 445147 450081 455825 461449 466330 470696 475418
62378 475418 481310 488523 496517 504459 511757 518396 524905 531898 539602 547880 556706 566419 577442 589940
62364 589940 603923 619608 637569 658567 683222 711739 743977 779885 819772 863784 911112
$$ packed form
62462H01353m0456l9028l7268l4643l1124k7225k3552k0337j7391j4491j1675
62451E04163r125o954n292m339l992l604k553r88M54J616K844L971M167L284K621
62436D86273L466N267O181N367L808K680J830M12j598l318m147m425m828n557
62422D91411o322o791o862o547n848m790l667l009l140l745m118l879l228k510
62408D26955j878j462j482j843j980j489p28l25k82m5N57J045J074R78J251J875
62392D22221K463K819L005L007K762K498K712L660M934N744N624M881M366M722
62378D75418N892P213P994P942P298O639O509O993P704Q278Q826R713J1023J2498
62364E89940J3983J5685J7961K0998K4655K8517L2238L5908L9887M4012M7328
$$ plain form
62353 911112 960180 1009720 1059108 1107366 1152501 1192450 1226255 1253670 1274071 1286738 1292102 1291632
62341 1291632 1286234 1275612 1259543 1238927 1215015 1188261 1158635 1126667 1093483 1060045 1026976
62330 1026976 994956 964713 936611 910670 886920 865297 845261 825995 807100 788716 770915
62319 770915 753311 735448 717361 699579 682680 666905 652102 637994 624543 612027 600803
62308 600803 591157 583345 577431 572927 568957 565038 561497 558790 556747 554842 552999 551634 550994 550960 551488
62293 551488 552802 555040 557986 561176 564075 566280 567835 569246 570843 572273 572981 572970 572639 572094 571265 570583
62277 570583 570785 571903 573164 574097 575126 576818 579197 582183 586127 591393 597833 605164 613633 623950
62263 623950 636843 652969 672870 696665 724067 755034 790014 829250 872250 918395 967611
$$ packed form
62353I11112M9068M9540M9388M8258M5135L9949L3805K7415K0401J2667N364m70
62341A291632n398j0622j6069k0616k3912k6754k9626l1968l3184l3438l3069
62330A026976l2020l0243k8102k5941k3750k1623k0036j9266j8895j8384j7801
62319G70915j7604j7863j8087j7782j6899j5775j4803j4108j3451j2516j1224
62308F00803r646p812n914m504l970l919l541k707k043j905j843j365o40l4N28
62293E51488J314K238K946L190K899K205J555J411J597J430P08j1l31n45q29o82
62277E70583K02J118J261R33J029J692K379K986L944N266O440P331Q469J0317
62263F23950J2893J6126J9901K3795K7402L0967L4980L9236M3000M6145M9216
$$ plain form
62252 967611 1019782 1073678 1126982 1177314 1222890 1262550 1295716 1322200 1341584 1353018 1356054 1351418
62240 1351418 1340378 1323611 1301308 1274058 1242806 1208064 1170159 1130374 1090913 1053365 1017906
62229 1017906 984398 953539 926394 903279 883705 867043 852725 840071 828446 817630 807675
62218 807675 798479 789665 780731 771190 760804 749902 739220 729165 719429 709574 699728 690377 681681
62205 681681 673383 665356 657901 651476 646364 642599 640017 638355 637424 637244 637960 639678 642407 646079 650565
62190 650565 655743 661559 667911 674555 681320 688387 696075 704400 713153 722386 732329 742683 752503 761099
62176 761099 768715 775973 783060 789902 796868 804799 814395 826016 840033 857010 877450 901573 929345
62163 929345 960546 994748 1031224 1068712 1105326 1139135 1169040 1194742 1215694 1230663 1238773 1240507
$$ packed form
62252I67611N2171N3896N3304N0332M5576L9660L3166K6484J9384J1434L036m636
62240A351418j1040j6767k2303k7250l1252l4742l7905l9785l9461l7548l5459
62229A017906l3508l0859k7145k3115j9574j6662j4318j2654j1625j0816r955
62218H07675r196q814q934r541j0386j0902j0682j0055r736r855r846r351q696
62205F81681q298q027p455o425n112l765k582j662r31j80P16J718K729L672M486
62190F50565N178N816O352O644O765P067P688Q325Q753R233R943J0354R820Q596
62176G61099P616P258P087O842O966P931R596J1621J4017J6977K0440K4123K7772
62163I29345L1201L4202L6476L7488L6614L3809K9905K5702K0952J4969Q110J734
$$ plain form
62151 1240507 1237069 1229108 1216759 1200542 1181250 1158984 1133238 1104260 1073586 1042895 1012930 983894
62139 983894 956267 930726 907648 887238 869825 855502 843586 832882 822507 812265 802390 793256
62127 793256 785224 778363 772173 765781 758560 750630 742821 736186 731370 728333 726698 726285 727116 728995 731502
62112 731502 734611 739001 745457 754072 764325 775761 788285 801764 815626 828933 840796 850650
62100 850650 858292 863816 867648 870548 873370 876567 879983 883222 885996 887889 888027 885531 880429 873713
62086 873713 866452 859300 852991 848655 847116 848183 851120 855658 862108 870692 881259 893676 908036
62073 908036 924329 942182 961053 980480 1000142 1019920 1040022 1060856 1082672 1105360 1128599
62062 1128599 1152132 1175791 1199227 1221570 1241503 1257940 1270598 1279551 1284183 1283115 1275636 1262828
$$ packed form
62151A240507l438p961j2349j6217j9292k2266k5746k8978l0674l0691k9965k9036
62139I83894k7627k5541k3078k0410j7413j4323j1916j0704j0375j0242r875r134
62127G93256q032o861o190o392p221p930p809o635m816l037j635m13Q31J879K507
62112G31502L109M390O456Q615J0253J1436J2524J3479J3862J3307J1863R854
62100H50650P642N524L832K900K822L197L416L239K774J893J38k496n102o716
62086H73713p261p152o309m336j539J067K937M538O450Q584J0567J2417J4360
62073I08036J6293J7853J8871J9427J9662J9778K0102K0834K1816K2688K3239
62062A128599K3533K3659K3436K2343J9933J6437J2658Q953M632j068p479j2808
$$ plain form
62050 1262828 1246707 1228393 1207637 1183966 1157578 1128987 1098493 1066366 1033170 999508 965750
62039 965750 932294 899816 868891 839560 811595 785049 760133 736699 714302 692927 673243
62028 673243 655909 640887 627673 616037 606184 598128 591214 584475 577337 569817 562110 554262 546360
62015 546360 538760 531845 525588 519559 513443 507451 502147 498018 495270 493938 493984 495263 497527 500593 504469
62000 504469 509214 514683 520576 526786 533511 540824 548241 554987 560696 565573 569808 573119 575055 575491
61986 575491 574571 572360 568865 564346 559295 554058 548690 543259 538065 533415 529263 525204 520899 516475
61972 516475 512394 508857 505492 501845 498110 494982 492729 490812 488662 486380 484301 482263 479957 477814
61958 477814 476735 476809 476971 476316 475305 475163 476384 478338 480347 482651 486119 491223 497574 504473 511765
$$ packed form
62050A262828j6121j8314k0756k3671k6388k8591l0494l2127l3196l3662l3758
62039I65750l3456l2478l0925k9331k7965k6546k4916k3434k2397k1375j9684
62028F73243j7334j5022j3214j1636r853q056o914o739p138p520p707p848p902
62015E46360p600o915o257o029o116n992n304m129k748j332M6J279K264L066L876
62000E04469M745N469N893O210O725P313P417O746N709M877M235L311J936M36
61986E75491r20k211l495m519n051n237n368n431n194m650m152m059m305m424
61972E16475m081l537l365l647l735l128k253j917k150k282k079k038k306k143
61958D77814j079P4J62o55j011j42J221J954K009K304L468N104O351O899P292
$$ plain form
61943 511765 520004 529853 541463 554519 568648 583574 599045 614924 631286 648183 665314 682229
61931 682229 698839 715350 731556 746563 759438 769918 778273 784660 788924 790901 790661 788433 784450
61918 784450 778918 772063 764186 755738 747372 739918 734228 730847 729743 730563 733391 739017 748068 759948
61904 759948 773086 786212 798899 810766 820777 827780 831351 831707 829139 824067 817339 809781 801394
61891 801394 791507 779876 767294 754962 743522 732818 722285 711444 700268 689287 679181 670128
61879 670128 661622 652984 643930 634545 624996 615515 606599 598897 592720 587784 583581 580054 577734 577122
61865 577122 578033 579772 581991 585153 590008 596803 605262 615258 627122 641152 657031 674036 691852
61852 691852 711070 732751 757504 784918 813875 843361 872999 902826 932679 961877 989501
$$ packed form
61943E11765Q239R849J1610J3056J4129J4926J5471J5879J6362J6897J7131J6915
61931F82229J6610J6511J6206J5007J2875J0480Q355O387M264J977k40k228l983
61918G84450n532o855p877q448q366p454n690l381j104Q20K828N626R051J1880
61904G59948J3138J3126J2687J1867J0011P003L571L56k568n072o728p558q387
61891H01394r887j1631j2582j2332j1440j0704j0533j0841j1176j0981j0106r053
61879F70128q506q638r054r385r549r481q916p702o177m936m203l527k320o12
61865E77122R11J739K219L162M855O795Q459R996J1864J4030J5879J7005J7816
61852F91852J9218K1681K4753K7414K8957K9486K9638K9827K9853K9198K7624
$$ plain form
61841 989501 1014872 1037595 1057122 1072478 1082686 1087466 1087337 1083014 1075021 1064071 1051491 1038857
61829 1038857 1027266 1017251 1009288 1003987 1001784 1002867 1007348 1015001 1024658 1034393 1042662 1048891 1052730
61816 1052730 1053199 1049170 1040366 1027330 1010519 990013 966127 939793 912162 884143 856328 829034
61804 829034 802329 776342 751636 728953 708519 689899 672677 656963 643092 631180 621226 613378
61792 613378 607693 603727 600643 597765 594839 591817 588658 585468 582693 580923 580385 580601 580673 579985 578595
61777 578595 576974 575567 574741 574891 576176 578136 579968 581365 582804 584802 587147 589191 590761 592426 594841
61762 594841 598115 601940 606105 610653 615641 621027 626818 633136 639834 646142 650918 653471 654019 653320 651928
61747 651928 649937 647245 643840 639844 635446 630819 626002 620961 615876 611182 607093 603213 598988 594524
$$ packed form
61841I89501K5371K2723J9527J5356J0208M780j29m323p993j0950j2580j2634
61829A038857j1591j0015p963n301k203J083M481P653R657R735Q269O229L839
61816A052730M69m029q804j3036j6811k0506k3886k6334k7631k8019k7815k7294
61804H29034k6705k5987k4706k2683k0434j8620j7222j5714j3871j1912r954p848
61792F13378n685l966l084k878k926l022l159l190k775j770n38K16P2o88j390
61777E78595j621j407q26J50J285J960J832J397J439J998K345K044J570J665K415
61762E94841L274L825M165M548M988N386N791O318O698O308M776K553N48o99j392
61747F51928j991k692l405l996m398m627m817n041n085m694m089l880m225m464
$$ plain form
61733 594524 590606 587852 586223 585505 585836 587427 589959 592638 594781 596169 596927 597328 597704 598332 599387 601000
61717 601000 603228 605798 608102 609746 611043 612630 614557 616013 616110 614777 612770 610904 609374 607684 605183
61702 605183 601805 598376 596022 595101 594814 594013 592259 589963 587564 584980 581900 578370 574854 571883 569758
61687 569758 568444 567539 566446 564811 562813 560867 559146 557529 555813 553694 550681 546603 542197 538618
61673 538618 536092 533568 530083 526002 522419 519726 517501 515599 514455 514158 513893 512686 510302 507152 503756
61658 503756 500588 498138 496680 496073 495997 496234 496635 497092 497719 498762 500142 501388 502342 503597 505915 509406
61642 509406 513610 518102 522598 526735 530261 533301 535919 537556 537506 535968 534037 532454 530871 528563 525379
61627 525379 521758 518258 515375 513377 511896 510040 507355 504407 501978 500026 498035 496171 495235 495352 495412
$$ packed form
61733E94524l918k754j629p18L31J591K532K679K143J388P58M01L76O28J055J613
61717F01000K228K570K304J644J297J587J927J456R7j333k007j866j530j690k501
61702F05183l378l429k354r21k87q01j754k296k399k584l080l530l516k971k125
61687E69758j314r05j093j635j998j946j721j617j716k119l013m078m406l579
61673E38618k526k524l485m081l583k693k225j902j144k97k65j207k384l150l396
61658E03756l168k450j458o07p6K37M01M57O27J043J380J246R54J255K318L491
61642E09406M204M492M496M137L526L040K618J637n0j538j931j583j583k308l184
61627E25379l621l500k883j998j481j856k685k948k429j952j991j864r36J17O0
$$ plain form
61612 495412 494199 491531 487956 483784 478977 473689 468293 462885 457244 451311 445325 439425 433510 427675
61598 427675 422446 418303 415141 412371 409439 406147 402644 399256 396255 393650 391342 389475 388375 387935
61584 387935 387335 385738 383254 380962 379925 380243 380998 381028 379910 378355 377524 377773 378253 377942 376789 375543
61568 375543 374772 374544 374825 375480 375904 375465 374529 374300 375244 376320 376362 375623 375232 375518 375777 375583 375390 375703 376438
61549 376438 377462 379079 381432 383814 385211 385415 385163 385232 385756 386425 386969 387295 387414 387503 387925 388990 390712
61532 390712 392935 395622 398742 401842 404062 404933 404996 405219 405815 406093 405596 404844 404532 404391 403470 401416 398901
61515 398901 396721 395039 393695 392776 392507 392860 393597 394560 395675 396814 397843 398692 399229 399266 398886 398541 398555
61498 398555 398702 398631 398500 398848 399889 401381 403189 405486 408213 410777 412569 413560 414079 414228 413933 413451 413449
$$ packed form
61612D95412j213k668l575m172m807n288n396n408n641n933n986n900n915n835
61598D27675n229m143l162k770k932l292l503l388l001k605k308j867j100m40
61584C87935o00j597k484k292j037L18P55L0j118j555q31K49M80l11j153j246
61568C75543p71k28K81O55M24m39r36k29R44J076M2p39l91K86K59j94j93L13P35
61549C76438J024J617K353K382J397K04k52O9N24O69N44L26J19Q9M22J065J722
61532C90712K223K687L120L100K220Q71O3K23N96K78m97p52l12j41r21k054k515
61515C98901k180j682j344r19k69L53P37R63J115J139J029Q49N37L7l80l45J4
61498C98555J47p1j31L48J041J492J808K297K727K564J792R91N19J49k95m82k
$$ plain form
61481 413449 414363 415874 417149 417571 417251 416880 417089 417846 418483 418366 417494 416403 415617 415303 415333 415401 415136 414361
61463 414361 413361 412680 412585 412888 413334 413901 414643 415442 416122 416665 417189 417860 418911 420501 422401 424007 424929
61446 424929 425407 425962 426870 428198 430061 432425 434870 437007 439073 441629 444722 447821 450611 453316 456207
61431 456207 459294 462661 466543 470823 474975 478842 482981 487782 492669 496662 499475 501602 503575 505666
61417 505666 508026 510554 512720 514034 514661 515109 515429 515218 514336 513058 511547 509795 508156 507211 506872 506185
61401 506185 504436 501926 499314 496736 494060 491561 489602 487850 485560 482714 480297 479185 479167 479355 479265
61386 479265 479126 479253 479495 479462 479125 478918 479191 479782 480327 480925 482204 484603 487844 491239 494348 497155 499756
61369 499756 502182 504537 506983 509479 511694 513344 514639 516239 518690 521872 525053 527598 529619 531836
$$ packed form
61481D13449R14J511J275M22l20l71K09P57O37j17q72j091p86l14L0O8k65p75
61463D14361j000o81r5L03M46N67P42P99O80N43N24O71J051J590J900J606R22
61446D24929M78N55R08J328J863K364K445K137K066K556L093L099K790K705K891
61431D56207L087L367L882M280M152L867M139M801M887L993K813K127J973K091
61417E05666K360K528K166J314O27M48L20k11q82j278j511j752j639r45l39o87
61401E06185j749k510k612k578k676k499j959j752k290k846k417j112j8J88r0
61386D79265j39J27K42l3l37k07K73N91N45N98J279K399L241L395L109K807K601
61369D99756K426K355K446K496K215J650J295J600K451L182L181K545K021K217
$$ plain form
61355 531836 534811 538442 542219 545833 549408 553353 558162 564284 571879 580660 590096 599838 609802 619819
61341 619819 629337 637638 644312 649420 653224 655831 657241 657667 657646 657662 657610 656780 654423 650342 645038 639457
61325 639457 634650 631365 629694 629122 629103 629502 630342 631297 631856 632072 632756 634644 637610 640985 644422 647968
61309 647968 651411 654231 656502 659363 664046 670626 678170 686053 694581 704321 715310 727084 738873
61296 738873 749405 757018 760655 760687 758371 754510 749006 741589 732472 722201 711260 700015 688742
61283 688742 677614 666836 656888 648360 641455 635880 631285 627568 624821 623252 623217 624900 627879 631434
61269 631434 635414 640297 646229 652595 658943 665741 673663 682579 691935 701824 712850 725112 738124
61256 738124 751747 766370 781953 797603 812365 825782 837374 846199 851444 853058 851466 847183
$$ packed form
61355E31836K975L631L777L614L575L945M809O122P595Q781R436R742R964J0017
61341F19819R518Q301O674N108L804K607J410M26k1J6n2q30k357m081n304n581
61325F39457m807l285j671n72j9L99Q40R55N59K16O84J888K966L375L437L546
61309F47968L443K820K271K861M683O580P544P883Q528R740J0989J1774J1789
61296G38873J0532P613L637L2k316l861n504p417r117j0271j0941j1245j1273
61283F88742j1128j0778r948q528o905n575m595l717k747j569l5J683K979L555
61269F31434L980M883N932O366O348O798P922Q916R356R889J1026J2262J3012
61256G38124J3623J4623J5583J5650J4762J3417J1592Q825N245J614j592m283
$$ plain form
61244 847183 841073 834365 827692 820483 812036 802895 794382 786933 779755 772237 764843 758337 752774 747738
61230 747738 743090 739001 735609 733053 731641 731587 732736 734837 737881 741838 746263 750598 754810 759378 764625
61215 764625 770307 775765 780271 783361 785214 786676 788504 790610 792386 793770 795407 797556 799397 799966
61201 799966 799495 799323 800517 803045 806406 810648 816442 824349 834332 846016 859208 873928 889979 906644
61187 906644 922958 938267 952345 964986 975626 983526 988264 989997 989333 987023 983636 979287 973672
61174 973672 966516 958063 949008 939785 929993 918691 905368 890533 875238 860105 844991 829600
61162 829600 814113 799017 784491 770287 756239 742657 730194 719468 710856 704438 700014 697261
61150 697261 695911 695678 696097 696733 697712 699813 703840 709838 716937 723805 729242 732562 733637 732629 729760
$$ packed form
61244H47183o110o708o673p209q447r141q513p449p178p518p394o506n563n036
61230G47738m648m089l392k556j412n4J149K101L044L957M425M335M212M568N247
61215G64625N682N458M506L090J853J462J828K106J776J384J637K149J841N69
61201G99966m71j72J194K528L361M242N794P907R983J1684J3192J4720J6051J6665
61187I06644J6314J5309J4078J2641J0640P900M738J733o64k310l387m349n615
61174I73672p156q453r055r223r792j1302j3323j4835j5295j5133j5114j5391
61162H29600j5487j5096j4526j4204j4048j3582j2463j0726q612o418m424k753
61150F97261j350k33M19O36R79K101M027N998P099O868N437L320J075j008k869
$$ plain form
61135 729760 725407 720266 715138 710513 706594 703689 702216 702341 704002 707381 712909 720638 730098 741025
61121 741025 753754 768524 784882 802260 820707 840439 860953 881338 901343 921481 942069
61110 942069 962782 983126 1002704 1020838 1036574 1049460 1060002 1069136 1077482 1085114 1091616 1096200
61098 1096200 1098160 1097393 1094180 1088375 1079291 1066571 1050711 1032480 1012246 990240 967064 943495
61086 943495 919984 896800 874539 854115 836156 820575 806689 793740 781473 770367 761063 753463
61074 753463 746710 740285 734764 731114 729371 728526 727684 726986 727231 728907 731772 735251 738989 743000 747464
61059 747464 752546 758334 764806 771839 779472 788172 798598 810874 824369 838493 853451 869897 888025
61046 888025 907401 927582 948511 970411 993665 1018658 1045287 1072737 1100217 1127715 1155545
$$ packed form
61135G29760m353n141n128m625l919k905j473J25J661L379N528P729R460J0927
61121G41025J2729J4770J6358J7378J8447J9732K0514K0385K0005K0138K0588
61110I42069K0713K0344J9578J8134J5736J2886J0542R134Q346P632O502M584
61098A096200J960p67l213n805r084j2720j5860j8231k0234k2006k3176k3569
61086I43495k3511k3184k2261k0424j7959j5581j3886j2949j2267j1106r304p600
61074G53463o753o425n521l650j743q45q42o98K45J676K865L479L738M011M464
61059G47464N082N788O472P033P633Q700J0426J2276J3495J4124J4958J6446J8128
61046H88025J9376K0181K0929K1900K3254K4993K6629K7450K7480K7498K7830
$$ plain form
61035 1155545 1183455 1211016 1238631 1267112 1296255 1324991 1353166 1382000 1412262 1443182 1473922
61024 1473922 1505088 1537889 1572682 1609397 1648662 1691310 1737257 1786024 1838006 1894037 1953858
61013 1953858 2016201 2080547 2147900 2219857 2297871 2383580 2478982 2585936 2705972 2840603 2991286
61002 2991286 3159184 3345796 3554076 3788907 4057306 4369539 4740258 5188184 5735557
60993 5735557 6409787 7246016 8286348 9574550 11149318 13038647 15254804 17788664
60985 17788664 20601310 23608561 26660448 29535957 31982229 33800628 34933952 35491822
60977 35491822 35693623 35771365 35893033 36128114 36435735 36662080 36567712 35906907 34533893
60968 34533893 32469638 29883626 27011487 24071551 21224156 18570672 16166867 14035570
$$ packed form
61035A155545K7910K7561K7615K8481K9143K8736K8175K8834L0262L0920L0740
61024A473922L1166L2801L4793L6715L9265M2648M5947M8767N1982N6031N9821
61013A953858O2343O4346O7353P1957P8014Q5709R5402J06954J20036J34631J50683
61002B991286J67898J86612K08280K34831K68399L12233L70719M47926N47373
60993E735557O74230Q36229J040332J288202J574768J889329K216157K533860
60985A7788664K812646L007251L051887K875509K446272J818399J133324N57870
60977C5491822K01801P7742J21668K35081L07621K26345r4368o60805j373014
60968C4533893k064255k586012k872139k939936k847395k653484k403805k131297
$$ plain form
60960 14035570 12177639 10581239 9227098 8090552 7143899 6359388 5710551 5172164 4721227
60951 4721227 4338812 4010461 3725041 3474204 3252550 3056584 2882758 2727162 2587124
60942 2587124 2461912 2351221 2253632 2166917 2089005 2017987 1951762 1888520 1827615 1769616 1715541
60931 1715541 1666132 1621598 1581890 1547317 1518826 1497315 1482613 1473481 1468679 1467565 1469601 1473825
60919 1473825 1479214 1485150 1491156 1496419 1499969 1501143 1499564 1494807 1486445 1474340 1458611 1439310 1416462
60906 1416462 1390493 1362355 1333093 1303370 1273559 1244136 1215686 1188427 1161954 1135743 1109800
60895 1109800 1084536 1060044 1035939 1012083 989040 967479 947432 928559 910885 894736 880007
60884 880007 866024 852247 838689 825567 813029 801473 791627 783761 776983 769757 761281 752039 742916
$$ packed form
60960A4035570j857931j596400j354141j136546r46653p84511o48837n38387m50937
60951D721227l82415l28351k85420k50837k21654j95966j73826j55596j40038
60942B587124j25212j10691r7589q6715p7912p1018o6225o3242o0905n7999n4075
60931A715541m9409m4534l9708l4573k8491k1511j4702r132m802j114K036M224
60919A473825N389N936O006N263L550J174j579m757q362j2105j5729j9301k2848
60906A416462k5969k8138k9262k9723k9811k9423k8450k7259k6473k6211k5943
60895A109800k5264k4492k4105k3856k3043k1561k0047j8873j7674j6149j4729
60884H80007j3983j3777j3558j3122j2538j1556r846p866o778p226q476r242r123
$$ plain form
60871 742916 733995 724524 714021 703029 692514 682756 673241 663617 654233 645544 637492 629870 622906
60858 622906 616934 611672 606363 600586 594468 588186 581851 575906 571039 567429 564537 561843 559379 557301
60844 557301 555392 553378 551446 550077 549508 549626 550153 550569 550014 547747 543792 538953 534148 529852 526151
60829 526151 523080 520838 519696 519713 520581 521898 523669 526312 530038 534395 538652 542514 546223 550047 553943
60814 553943 557720 561187 564015 565650 565640 564078 561665 559307 557617 556655 556047 555307 554119 552415 550318
60799 550318 548034 545711 543264 540370 536750 532482 527920 523271 518385 513050 507357 501584 495841 490079
60785 490079 484428 479192 474373 469537 464456 459601 455602 452374 449258 445980 442921 440341 437891 435211
60771 435211 432561 430421 428827 427548 426698 426648 427455 428852 430769 433387 436682 440391 444578 449758 456195
$$ packed form
60871G42916q921r471j0503j0992j0515r758r515r624r384q689q052p622o964
60858F22906n972n262n309n777o118o282o335n945m867l610k892k694k464k078
60844E57301j909k014j932j369n69J18N27M16n55k267l955m839m805m296l701
60829E26151l071k242j142J7Q68J317J771K643L726M357M257L862L709L824L896
60814E53943L777L467K828J635j0j562k413k358j690r62o08p40j188j704k097
60799E50318k284k323k447k894l620m268m562m649m886n335n693n773n743n762
60785D90079n651n236m819m836n081m855l999l228l116l278l059k580k450k680
60771D35211k650k140j594j279q50n0Q07J397J917K618L295L709M187N180O437
$$ plain form
60756 456195 463363 470425 477092 483758 490841 498221 505408 512113 518427 524291 528986 531580 532036 531526 531267
60741 531267 531228 530299 527554 522936 516796 509300 500466 490508 480059 470159 461799 455078 448959 442381 435604
60726 435604 429883 425800 422553 419127 415461 412063 409039 406168 403593 401800 400898 400390 399696 398653 397554
60711 397554 396884 396915 397334 397426 396829 395986 395557 395628 395833 396080 396705 397833 399023 399712 399823 399854 400493 402183 404907
60692 404907 408290 411980 415893 420085 424498 428967 433338 437521 441604 446119 451895 459246 467416 475250
60678 475250 482447 489678 497418 505187 512335 519133 526507 534725 542890 549874 555311 559366 561846 562063
60664 562063 559609 554888 548712 541667 534045 526136 518305 510886 504236 498709 494276 490324 486298 482472
60650 482472 479676 478193 477372 476482 475468 474629 473939 473078 471880 470364 468439 465924 462798 459237 455497
$$ packed form
60756D56195P168P062O667O666P083P380P187O705O314N864M695K594M56n10k59
60741E31267l9r29k745m618o140p496q834r958j0449r900q360o721o119o578o777
60726D35604n721m083l247l426l666l398l024k871k575j793r02n08o94j043j099
60711C97554o70L1M19R2n97q43m29P1K05K47O25J128J190O89J11L1O39J690K724
60692D04907L383L690L913M192M413M469M371M183M083M515N776P351Q170P834
60678D75250P197P231P740P769P148O798P374Q218Q165O984N437M055K480K17
60664E62063k454m721o176p045p622p909p831p419o650n527m433l952m026l826
60650D82472k796j483q21q90j014q39o90q61j198j516j925k515l126l561l740
$$ plain form
60635 455497 451921 448882 446484 444477 442732 441592 441488 442359 443734 445234 446682 447910 448892 449946 451345
60620 451345 452716 453318 453017 452554 452674 453376 454273 455258 456422 457524 457994 457573 456704 456147 456289 456889 457446 457733
60602 457733 457930 458316 458957 459732 460464 460940 460979 460688 460484 460670 461151 461870 463324 466140 470145 474387 478188
60585 478188 481702 485178 488244 490442 492151 494319 497285 500368 502714 504107 504856 505329 505868 506898 508725
60570 508725 511419 515110 520235 527150 535667 545370 556337 569096 583807 600010 617415 636422 657341
60557 657341 679424 701183 721518 739836 755125 765718 770467 769779 765144 757978 749283 740024 731159
60544 731159 723226 716358 710828 707295 706419 708449 713381 721403 733018 748756 768819 793119 821685
60531 821685 854880 892962 935330 980331 1025794 1069469 1108987 1141971 1166689 1182525 1189545 1187850
$$ packed form
60635D55497l576l039k398k007j745j140j04Q71J375J500J448J228R82J054J399
60620D51345J371O02l01m63J20P02Q97R85J164J102M70m21q69n57J42O00N57K87
60602D57733J97L86O41P75P32M76L9k91k04J86M81P19J454K816M005M242L801
60585D78188L514L476L066K198J709K168K966L083K346J393P49M73N39J030J827
60570E08725K694L691N125O915Q517R703J0967J2759J4711J6203J7405J9007K0919
60557F57341K2083K1759K0335J8318J5289J0593M749o88m635p166q695r259q865
60544G31159p933o868n530l533q76K030M932Q022J1615J5738K0063K4300K8566
60531H21685L3195L8082M2368M5001M5463M3675L9518L2984K4718J5836P020j695
$$ plain form
60519 1187850 1177799 1160675 1138686 1114139 1088792 1063783 1039634 1016262 993479 971798 952542
60508 952542 936936 925213 916747 910934 907749 907515 910307 915792 923780 934864 950254 970930 997296
60495 997296 1029916 1070134 1119415 1178146 1245493 1320335 1401742 1488470 1578488 1669301 1758423
60484 1758423 1843464 1922157 1992682 2053870 2105025 2145677 2175471 2193901 2199985 2192441 2170270 2133027
60472 2133027 2080686 2013748 1933606 1842471 1742951 1638198 1532431 1430329 1335259 1248365 1169578
60461 1169578 1098854 1036010 980175 930409 886530 848498 815205 784902 756882 731921 710808
60450 710808 693189 678144 665162 654022 644275 635511 627846 621568 616366 611382 606066 600672 595843
60437 595843 591963 588932 586374 583940 581550 579413 577827 576889 576405 575986 575260 574036 572325 570151 567390
$$ packed form
60519A187850j0051j7124k1989k4547k5347k5009k4149k3372k2783k1681j9256
60508I52542j5606j1723q466n813l185k34K792N485P988J1084J5390K0676K6366
60495I97296L2620M0218M9281N8731O7347P4842Q1407Q6728R0018R0813Q9122
60484A758423Q5041P8693P0525O1188N1155M0652K9794J8430O084p544k2171l7243
60472B133027n2341o6938q0142r1135r9520j04753j05767j02102r5070q6894p8787
60461A169578p0724o2844n5835m9766m3879l8032l3293l0303k8020k4961k1113
60450G10808j7619j5045j2982j1140r747q764p665o278n202m984n316n394m829
60437E95843l880l031k558k434k390k137j586r38m84m19p26j224j711k174k761
$$ plain form
60422 567390 563998 560418 557515 555827 554908 553676 551480 548757 546534 545416 545166 545206 545284 545519 545970 546479
60406 546479 546987 547713 548741 549593 549544 548394 546703 545233 544401 544345 545129 546610 548288 549643 550609 551426 552129
60389 552129 552571 553024 554283 556808 559997 562700 564371 565353 566138 566810 567343 567985 569003 570316 571647 572862
60373 572862 573883 574452 574370 573928 573716 573993 574525 575044 575587 576304 577213 578250 579332 580343 581247 582226 583440
60356 583440 584690 585658 586448 587443 588563 589251 589410 589796 591077 592991 594936 596908 599184 601439 603008 603993
60340 603993 605298 607413 609777 611546 612402 612371 611490 610126 609152 609158 609602 609302 607827 606049 605265 606043 608034
60323 608034 610623 613422 616113 618175 619157 619257 619296 619834 620535 620666 620025 619007 618004 617292 617473 619335 623016
60306 623016 627879 633552 640613 649824 661117 673921 688270 704975 724700 747258 771724 796660
$$ packed form
60422E67390l392l580k903j688r19j232k196k723k223j118k50M0P8K35M51N09
60406E46479N08P26J028Q52m9j150j691j470q32n6P84J481J678J355R66Q17P03
60389E52129M42M53J259K525L189K703J671R82P85O72N33O42J018J313J331J215
60373E72862J021N69q2m42k12K77N32N19N43P17R09J037J082J011R04R79J214
60356E83440J250R68P90R95J120O88J59L86J281J914J945J972K276K255J569R85
60340F03993J305K115K364J769Q56l1q81j364r74OM44l00j475j778p84P78J991
60323F08034K589K799K691K062R82J00L9N38P01J31o41j018j003p12J81J862L681
60306F23016M863N673P061R211J1293J2804J4349J6705J9725K2558K4466K4936
$$ plain form
60294 796660 820148 840192 855462 865520 870208 869074 861670 848302 830297 809534 787785 766335
60282 766335 746004 727325 710607 695920 683146 672128 662690 654508 647186 640519 634483 628875 623280
60269 623280 617660 612676 608969 606313 603927 601599 599955 599506 599957 600703 601603 602875 604468 605991 607192
60254 607192 608254 609562 611350 613585 616067 618608 621096 623321 624808 625056 623995 621999 619409 616307
60240 616307 612845 609443 606350 603302 600051 597122 595579 595974 597773 599899 601590 602718 603580 604553 605856
60225 605856 607518 609621 612453 616226 620690 625306 629903 634814 640188 645482 649985 653763 657661 662362
60211 662362 667686 672936 677687 682041 686332 690850 695756 700971 706126 710882 715348 719900 724430 728172
60197 728172 730620 732261 733823 734907 734096 730635 725395 719798 714362 708869 703424 698471 693875 688925
$$ packed form
60294G96660K3488K0044J5270J0058M688j134p404j3368j8005k0763k1749k1450
60282G66335k0331j8679j6718j4687j2774j1018r438q182p322o667o036n608n595
60269F23280n620m984l707k656k386k328j644m49M51P46R00J272J593J523J201
60254F07192J062J308J788K235K482K541K488K225J487K48j061j996k590l102
60240F16307l462l402l093l048l251k929j543L95J799K126J691J128Q62R73J303
60225F05856J662K103K832L773M464M616M597M911N374N294M503L778L898M701
60211F62362N324N250M751M354M291M518M906N215N155M756M466M552M530L742
60197G28172K448J641J562J084q11l461n240n597n436n493n445m953m596m950
$$ plain form
60183 688925 683493 678484 674688 671722 668528 664636 660471 656691 653743 651873 650971 650290 648816 646258 643516
60168 643516 641916 641940 642782 643162 642518 641387 640665 640598 640603 640008 638784 637511 636819 636925 637546 638134 638332 638329 638674
60149 638674 639701 641336 643519 646529 650589 655367 660209 664832 669493 674487 679721 684840 689593 694058
60135 694058 698658 703919 710013 716542 722940 729081 735301 741867 748656 755351 761683 767423 772418 776778
60121 776778 780878 785051 789381 793786 798105 802045 805320 807972 810332 812465 813907 814267 813954 814015 815146
60106 815146 817088 819065 820669 822115 823665 825002 825407 824557 822903 821028 818832 815690 811418 806610 801868
60091 801868 797119 792070 787035 782805 779691 777183 774697 772316 770512 769401 768573 767626 766521 765372 764092
60076 764092 762474 760507 758344 755858 752392 747176 740006 731382 722024 712428 702957 694090 686286 679646
$$ packed form
60183F88925n432n009l796k966l194l892m165l780k948j870r02o81j474k558k742
60168F43516j600K4Q42L80o44j131p22o7Nn95j224j273o92J06O21N88J98lL45
60149F38674J027J635K183L010M060M778M842M623M661M994N234N119M753M465
60135F94058M600N261O094O529O398O141O220O566O789O695O332N740M995M360
60121G76778M100M173M330M405M319L940L275K652K360K133J442L60l13O1J131
60106H15146J942J977J604J446J550J337M05q50j654j875k196l142m272m808m742
60091H01868m749n049n035m230l114k508k486k381j804j111q28r47j105j149j280
60076G64092j618j967k163k486l466n216p170q624r358r596r471q867p804o640
$$ plain form
60062 679646 673880 668617 663650 658922 654503 650571 647192 644037 640548 636606 632875 630226 628864 628265
60048 628265 627932 627871 628247 628931 629687 630583 631825 633289 634675 636126 638225 641116 643945 645526 645361 643742
60032 643742 641090 637621 633576 629305 624940 620344 615560 611041 607210 603932 600624 596749 592103 586808
60018 586808 581304 576284 572315 569416 567194 565373 563987 562877 561327 558599 554850 551104 548140 545683
60004 545683 543024 540121 537590 535714 534108 532600 531776 532170 533359 534527 535654 537434 540015 542555 544271
59989 544271 545339 546440 547868 549553 551620 554349 557608 560778 563392 565628 568004 570594 572738 573634
59975 573634 573204 572135 570951 569423 567249 565034 563907 564102 564522 563939 562176 559871 557650 555926 555094
59960 555094 555319 556344 557875 559992 562862 566259 569702 572884 575613 577648 579032 580312 581922 583515
$$ packed form
60062F79646n766n263m967m728m419l932l379l155l489l942l731k649j362n99
60048F28265l33o1L76O84P56Q96J242J464J386J451K099K891K829J581j65j619
60032F43742k652l469m045m271m365m596m784m519l831l278l308l875m646n295
60018E86808n504n020l969k899k222j821j386j110j550k728l749l746k964k457
60004E45683k659k903k531j876j606j508q24L94J189J168J127J780K581K540J716
59989E44271J068J101J428J685K067K729L259L170K614K236K376K590K144Q96
59975E73634m30j069j184j528k174k215j127J95M20n83j763k305k221j724q32
59960E55094K25J025J531K117K870L397L443L182K729K035J384J280J610J593
$$ plain form
59946 583515 584466 584846 585291 585989 586433 586300 585990 586087 586769 587879 589147 590228 590931 591560 592686 594507 596892
59929 596892 600044 604485 610149 616101 621508 626397 631106 635583 639795 644348 649977 656629 663692 670966
59915 670966 678718 686797 694390 700863 706313 711038 714938 717763 719583 720565 720444 718697 715329 711164 707191
59900 707191 703743 700505 697191 693934 691012 688542 686703 685962 686693 688570 690733 692625 694396 696492 699180
59885 699180 702554 706537 710724 714659 718510 723079 728793 735150 741525 748020 754937 761855 768054 773611
59871 773611 779124 784299 787716 788353 786647 783711 780084 775684 770420 764353 757646 750816 744662 739417
59857 739417 734334 728699 722958 718149 714430 710896 706865 702568 698467 694642 691304 689221 689064 690582
59843 690582 692985 696017 700225 706221 714085 723531 734392 746822 761084 777120 794091 810431 824554
$$ packed form
59946E83515R51L80M45O98M44j33l10R7O82J110J268J081P03O29J126J821K385
59929E96892L152M441N664N952N407M889M709M477M212M553N629O652P063P274
59915F70966P752Q079P593O473N450M725L900K825J820R82j21j747l368m165l973
59900G07191l448l238l314l257k922k470j839p41P31J877K163J892J771K096K688
59885F99180L374L983M187L935L851M569N714O357O375O495O917O918O199N557
59871G73611N513N175L417O37j706k936l627m400n264o067o707o830o154n245
59857G39417n083n635n741m809l719l534m031m297m101l825l338k083j57J518
59843F90582K403L032M208N996P864R446J0861J2430J4262J6036J6971J6340J4123
$$ plain form
59830 824554 835658 843858 849737 854075 857888 862227 867446 872661 876162 876505 873268 866869 857850 846520
59816 846520 833274 818987 804833 791649 779579 768337 757622 747274 737335 728137 720098 713153
59804 713153 706599 699870 693341 687924 683830 680182 675989 671130 666217 661827 658188 655300 652973 650885
59790 650885 648939 647541 647238 648072 649472 650667 651048 650331 648778 647179 646232 645874 645554 645137 645128 645867 646964
59773 646964 647806 648283 648709 649231 649709 650065 650423 650921 651564 652158 652284 651581 650298 649300 649115 649209 648737 647909 647948
59754 647948 649544 652007 654238 656052 658075 660723 663731 666470 668284 668780 668233 667582 667537 667859 667927 667794
59738 667794 668018 668528 668457 667272 665436 663706 662410 661648 661497 661568 661022 659693 658649 658837 659550 659186 657468
59721 657468 655908 655902 657089 657943 657447 655773 653795 652345 651726 651629 651550 651364 651352 651723 652449 653603 655440 657960
$$ packed form
59830H24554J1104Q200N879M338L813M339N219N215L501L43l237o399r019j1330
59816H46520j3246j4287j4154j3184j2070j1242j0715j0348r939r198q039o945
59804G13153o554o729o529n417m094l648m193m859m913m390l639k888k327k088
59790F50885j946j398l03Q34J400J195L81p17j553j599r47l58l20m17rP39J097
59773F46964Q42M77M26N22M78L56L58M98O43N94J26p03j283r98j85R4m72q28L9
59754F47948J596K463K231J814K023K648L008K739J814M96n47o51m5L22O8j33
59738F67794K24N10p1j185j836j730j296p62j51P1n46j329j044J88P13l64j718
59721F57468j560oJ187Q54m96j674j978j450o19r7p9j86j2L71P26J154J837K520
$$ plain form
59703 657960 660764 663525 666321 669370 672779 676713 681426 686761 691942 696200 699456 702203 704890 707633
59689 707633 710230 712236 713296 713677 714230 715483 716991 717858 717717 716897 715811 714580 713148 711403 709161
59674 709161 706262 702688 698425 693394 687730 682040 677108 673320 670417 667796 665111 662808 662014 663468
59660 663468 666495 669531 671871 674404 678374 683949 690388 697049 703626 709825 715479 720692 725294 728478
59646 728478 729608 729108 727820 725751 722188 716846 710122 702460 694387 687075 681713 678099 674716 670564
59632 670564 666160 662482 659748 657596 655631 653241 649612 644589 639156 634507 630907 627762 624391 620416
59618 620416 615893 611508 608223 606270 604795 602813 600122 596980 593465 589771 586701 585190 585403 586772
59604 586772 588720 590904 593021 594866 596521 598097 599406 600201 600596 600886 601076 600886 600114 598762 597002 595208
$$ packed form
59703F57960K804K761K796L049L409L934M713N335N181M258L256K747K687K743
59689G07633K597K006J060L81N53J253J508Q67j41q20j086j231j432j745k242
59674G09161k899l574m263n031n664n690m932l788k903k621k685k303p94J454
59660F63468L027L036K340K533L970N575O439O661O577O199N654N213M602L184
59646G28478J130n00j288k069l563n342o724p662q073p312n362l614l383m152
59632F70564m404l678k734k152j965k390l629n023n433m649l600l145l371l975
59618F20416m523m385l285j953j475j982k691l142l515l694l070j511K13J369
59604E86772J948K184K117J845J655J576J309P95L95K90J90j90p72j352j760j794
$$ plain form
59588 595208 593787 592753 591764 590780 590301 590641 591370 591851 591982 591946 591635 590829 589600 588044 585927 583203 580557
59571 580557 578828 578056 577753 577811 578391 579061 579021 578246 577606 577593 577659 577132 576134 575137 574123 572760 571139 569897
59553 569897 569590 570196 571177 571902 572187 572609 574204 577632 582568 587937 592855 597451 602833 610212 620020 631931
59537 631931 645555 660869 677988 696819 716730 735962 751412 759999 760987 756517 749499 741581 733503
59524 733503 726378 721302 718176 716074 714643 714039 713662 712280 709657 706866 704502 701536 696525 689196 680297
59509 680297 670585 660589 650845 641691 633080 624972 617601 611125 605487 600892 597882 596488 595778 594724
59495 594724 593135 591391 589811 588752 588746 589787 590838 590868 590228 590299 591775 593913 595561 596403 597064 598397 600927
59478 600927 604664 609181 613880 618268 622103 625473 628810 632587 636781 640771 643887 646018 647633 649372
$$ packed form
59588E95208j421j034r89r84m79L40P29M81J31l6l11q06j229j556k117k724k646
59571E80557j729p72l03N8N80O70m0p75o40j3O6n27r98r97j014j363j621j242
59553E69897l07O06R81P25K85M22J595L428M936N369M918M596N382P379R808J1911
59537F31931J3624J5314J7119J8831J9911J9232J5450Q587R88m470p018p918q078
59524G33503p125n076l126k102j431o04l77j382k623k791k364k966n011p329q899
59509F80297r712r996r744r154q611q108p371o476n638m595l010j394p10j054
59495E94724j589j744j580j059oJ041J051L0o40P1J476K138J648Q42O61J333K530
59478F00927L737M517M699M388L835L370L337L777M194L990L116K131J615J739
$$ plain form
59464 649372 651634 654233 656417 657606 658305 659915 663482 668920 675596 683066 690890 698350 705056 711564
59450 711564 718804 726955 735328 743163 750055 755725 759904 762433 763116 761565 757612 751719 744553 736303
59436 736303 726929 716983 707545 699266 692015 685586 680243 676325 673735 672107 671199 671010 671868 674586 680118
59421 680118 688744 699798 712470 726667 742807 760950 780519 800889 821963 844006 867003 890286
59409 890286 912621 932336 947225 954834 953689 944739 931271 916987 904166 893690 886217 882640
59397 882640 883481 888335 895684 902670 905296 900136 886667 867681 847018 827109 808716 792161 777948
59384 777948 766385 757371 750740 746335 743715 742212 741478 741742 743367 746325 750192 754456 758725 762847
59370 762847 767001 771602 776958 783048 789753 797204 805708 815271 825335 835079 843982 852016 859405 866314
$$ packed form
59464F49372K262K599K184J189O99J610L567N438O676P470P824P460O706O508
59450G11564P240Q151Q373P835O892N670M179K529O83j551l953n893p166q250
59436G36303r374r946r438q279p251o429n343l918k590j628r08j89Q58K718N532
59421F80118Q626J1054J2672J4197J6140J8143J9569K0370K1074K2043K2997K3283
59409H90286K2335J9715J4889P609j145q950j3468j4284j2821j0476p473l577
59397H82640Q41M854P349O986K626n160j3469j8986k0663j9909j8393j6555j4213
59384G77948j1563r014o631m405k620j503p34K64J625K958L867M264M269M122
59370G62847M154M601N356O090O705P451Q504R563J0064R744Q903Q034P389O909
$$ plain form
59356 866314 872789 878849 884548 889979 895310 900749 906479 912684 919677 927844 937374 948211 960327 973820
59342 973820 988425 1003067 1016312 1027324 1036141 1042988 1047665 1049784 1049279 1046378 1041214 1033798 1024365
59329 1024365 1013503 1001884 989975 978005 966092 954381 943135 932641 922962 913892 905274 897270
59317 897270 890131 883779 877845 872072 866403 860688 854728 848738 843362 838846 834475 829256 823012 816355
59303 816355 809693 802847 795772 789032 783110 777735 772387 767292 763277 760738 759316 758772 759698 763071 769449
59288 769449 778940 791678 807851 827186 848629 870495 890651 906641 916172 918012 912542 901380
59276 901380 886547 870071 854086 840614 830766 824306 820421 818917 820250 824306 829715 834870 839461
59263 839461 844419 850313 856262 860658 862614 862383 860491 856893 851117 843080 833543 823694 814346 805583
$$ packed form
59356H66314O475O060N699N431N331N439N730O205O993Q167R530J0837J2116J3493
59342I73820J4605J4642J3245J1012Q817O847M677K119n05k901n164p416r433
59329A024365j0862j1619j1909j1970j1913j1711j1246j0494r679r070q618q004
59317H97270p139o352n934n773n669n715n960n990n376m516m371n219o244o657
59303H16355o662o846p075o740n922n375n348n095m015k539j422n44R26L373O378
59288G69449R491J2738J6173J9335K1443K1866K0156J5990R531J840n470j1162
59276I01380j4833j6476j5985j3472r848o460l885j504J333M056N409N155M591
59263H39461M958N894N949M396J956k31j892l598n776q037r537r849r348q763
$$ plain form
59249 805583 797134 788935 781309 774778 769798 766571 764948 764571 765220 766959 769921 774052 779158 784991 791172
59234 791172 797283 803243 809371 815809 822034 827232 830988 833366 834581 834995 835133 835177 834561 832675 829814
59219 829814 826808 823819 820372 816722 814240 813865 814797 815352 814729 813394 812071 810984 809937 808619 806829
59204 806829 804657 802396 800109 797501 794412 791171 788250 785793 783697 781847 780042 778105 776340 775470
59190 775470 775739 776491 777098 777882 779582 782235 785212 788073 790716 792984 794870 797014 800158 804028 807435
59175 807435 809645 811097 812698 815042 818464 823182 829054 835702 843204 852149 862636 873609 883681
59162 883681 892322 899830 906325 911263 913948 914171 912278 908738 903690 896902 888185 877794 866344 854334
59148 854334 841973 829457 817132 805283 793909 782863 772038 761318 750487 739393 728203
$$ packed form
59249H05583q449q199p626o531m980l227j623l77O49J739K962M131N106N833O181
59234G91172O111N960O128O438O225N198L756K378J215M14J38M4o16j886k861
59219H29814l006k989l447l650k482l75R32N55o23j335j323j087j047j318j790
59204H06829k172k261k287k608l089l241k921k457k096j850j805j937j765q70
59190G75470K69P52O07P84J700K653K977K861K643K268J886K144L144L870L407
59175H07435K210J452J601K344L422M718N872O648P502Q945J0487J0973J0072
59162H83681Q641P508O495M938K685K23j893l540n048o788q717j0391j1450j2010
59148H54334j2361j2516j2325j1849j1374j1046j0825j0720j0831j1094j1190
$$ plain form
59137 728203 717470 707910 699998 693676 688460 683955 680176 677317 675304 673828 672671 671811 671321 671395 672397
59122 672397 674610 678007 682500 688313 695764 704749 714784 725573 737178 749599 762516 775557 788468
59109 788468 800928 812494 822897 832227 840690 848316 854905 860111 863615 865401 865798 865033 862877 859040
59095 859040 853840 848063 842204 836238 830173 824390 819339 815213 812039 809745 808045 806573 805123 803391
59081 803391 800605 796011 789827 783124 776516 769636 762211 754958 748787 743563 738423 733111 728347 724876
59067 724876 722681 721230 720074 719068 718273 717760 717339 716532 714967 712814 710629 708806 707337 706100 705118
59052 705118 704474 704122 703886 703609 703274 702985 702819 702731 702690 702834 703267 703646 703196 701364 698397 695193 692602 690893
59034 690893 689728 688506 686861 684987 683575 683408 684976 688331 693114 698795 705054 712024 720056 729240
$$ packed form
59137G28203j0733r560p912o322n216m505l779k859k013j476j157q60m90P4J002
59122F72397K213L397M493N813P451Q985J0035J0789J1605J2421J2917J3041J2911
59109G88468J2460J1566J0403R330Q463P626O589N206L504J786L97p65k156l837
59095H59040n200n777n859n966o065n783n051m126l174k294j700j472j450j732
59081H03391k786m594o184o703o608o880p425p253o171n224n140n312m764l471
59067G24876k195j451j156j006p95n13m21q07j565k153k185j823j469j237r82
59052G05118o44l52k36k77l35k89j66q8m1J44M33L79m50j832k967l204k591j709
59034F90893j165j222j645j874j412j67J568L355M783N681O259O970Q032R184
$$ plain form
59020 729240 739223 749383 759064 767776 775369 781916 787207 790540 791414 790370 788712 787335 786106 784446
59006 784446 782190 779846 778337 778481 780357 783148 786017 789151 793473 799273 805710 811841 817511 822891
58992 822891 827661 831245 833563 835051 836101 836800 836992 836245 833985 830082 825272 820684 816980 814133 811904
58977 811904 810278 809488 809824 811400 814073 817718 822640 829415 838263 848784 860402 872736 885460 898263
58963 898263 911139 924325 937629 950212 961350 971039 979442 986123 990292 991590 990144 985938 978622
58950 978622 967963 954251 938314 921331 904451 888279 872750 857656 843140 829656 817699
58939 817699 807688 799728 793287 787514 782079 777230 772875 768248 763000 757993 754311 751890 749790 747491
58925 747491 745238 743410 742281 742137 742838 743400 742832 741313 739842 738831 737915 737107 737107 738173 739569 740596
$$ packed form
59020G29240R983J0160R681Q712P593O547N291L333Q74j044j658j377j229j660
59006G84446k256k344j509J44J876K791K869L134M322N800O437O131N670N380
58992H22891M770L584K318J488J050O99J92p47k260l903m810m588l704k847k229
58977H11904j626p90L36J576K673L645M922O775Q848J0521J1618J2334J2724J2803
58963H98263J2876J3186J3304J2583J1138R689Q403O681M169J298j446m206p316
58950I78622j0659j3712j5937j6983j6880j6172j5529j5094j4516j3484j1957
58939H17699j0011p960o441n773n435m849m355m627n248n007l682k421k100k299
58925G47491k253j828j129j44P01N62n68j519j471j011r16q08%J066J396J027
$$ plain form
58909 740596 741569 743363 746543 751281 757618 765392 774334 784574 796591 810328 824804 839072 853210
58896 853210 867940 883575 899793 916189 932560 948809 965101 982164 1001023 1022265 1045567
58885 1045567 1069908 1094070 1117009 1137944 1156212 1171140 1182222 1189452 1193227 1193801 1190968 1184417
58873 1184417 1174278 1161246 1146309 1130473 1114519 1098803 1083273 1067772 1052342 1037252 1022828
58862 1022828 1009269 996488 984105 971680 958966 945930 932630 919197 905792 892409 878908
58851 878908 865455 852747 841389 831170 821407 811866 802800 794112 785188 775831 766742 758579 751015
58838 751015 743234 735059 726999 719368 711991 704791 698131 692443 687858 684346 681829 679979 678210 676239
58824 676239 674489 673696 674150 675510 677330 679481 682078 685247 689089 693628 698544 703085 706565 708994 711030
$$ packed form
58909G40596R73J794L180M738O337P774Q942J0240J2017J3737J4476J4268J4138
58896H53210J4730J5635J6218J6396J6371J6249J6292J7063J8859K1242K3302
58885A045567K4341K4162K2939K0935J8268J4928J1082P230L775N74k833o551
58873A184417j0139j3032j4937j5836j5954j5716j5530j5501j5430j5090j4424
58862A022828j3559j2781j2383j2425j2714j3036j3300j3433j3405j3383j3501
58851H78908j3453j2708j1358j0219r763r541r066q688q924r357r089q163p564
58838G51015p781q175q060p631p377p200o660n688m585l512k517j850j769j971
58824F76239j750p93M54J360J820K151K597L169L842M539M916M541L480K429K036
$$ plain form
58809 711030 713247 715635 717868 719808 721569 723188 724418 724855 724227 722588 720278 717631 714773 711753 708756
58794 708756 705869 702724 698802 694210 689816 686337 683615 681073 678651 676993 676855 678635 682326 687608
58780 687608 693987 701011 708296 715355 721705 727319 732709 738284 743743 748237 750815 750695 747609 742223
58766 742223 735784 728972 721533 713404 705542 698960 693422 687958 682356 677237 672921 669188 666146 664286
58752 664286 663484 662886 662013 661183 660598 659971 659470 660144 662698 666497 670468 674591 679793 686703 695053 704032
58736 704032 712724 720533 727741 735496 744694 754921 764896 773763 781514 788363 794339 799569 804443 809271
58722 809271 814058 818755 823543 828754 834702 841614 849561 858288 867203 875617 882993 888985 893254 895435
58708 895435 895373 893341 889781 884718 877684 868449 857539 845592 832327 816709 798285 777987 757441
$$ packed form
58809G11030K217K388K233J940J761J619J230M37o28j639k310k647k858l020k997
58794G08756k887l145l922m592m394l479k722k542k422j658j38J780L691N282
58780F87608O379P024P285P059O350N614N390N575N459M494K578j20l086n386
58766G42223o439o812p439q129p862o582n538n464n602n119m316l733l042j860
58752F64286q02n98q73q30n85o27n01O74K554L799L971M123N202O910Q350Q979
58736G04032Q692P809P208P755R198J0227R975Q867P751O849N976N230M874M828
58722H09271M787M697M788N211N948O912P947Q727Q915Q414P376N992M269K181
58708H95435o2k032l560n063p034r235j0910j1947j3265j5618j8424k0298k0546
$$ plain form
58695 757441 737823 719555 702654 687021 672544 659281 647485 637312 628577 620908 614028 607814
58683 607814 602186 597052 592308 587897 583927 580631 578111 576237 574988 574665 575500 577267 579667 582916 587502
58668 587502 593552 600984 610116 621335 634195 647658 661377 675817 690690 704122 714023 719688
58656 719688 721543 719964 715237 708171 699798 690463 679958 668530 657163 646779 637715 629972 623484
58643 623484 618019 613282 609298 606370 604559 603530 603015 603117 603913 605008 605710 605612 604886 604028 603381 602934 602544
58626 602544 602330 602701 603950 605906 608105 610255 612474 615202 618913 623772 629496 635663 642152 649141 656540
58611 656540 663695 669817 674594 678169 680698 682216 682890 683088 683000 682297 680353 676879 672211 666956 661549
58596 661549 656420 652379 650245 649877 650060 649780 649349 649901 652137 656104 661900 669780 679563 690633 702609
$$ packed form
58695G57441j9618j8268j6901j5633j4477j3263j1796j0173q735p669o880o214
58683F07814n628n134m744m411l970l296k520j874j249l23Q35J767K400L249M586
58668E87502O050P432R132J1219J2860J3463J3719J4440J4873J3432R901N665
58656G19688J855j579m727p066q373r335j0505j1428j1367j0384r064p743o488
58643F23484n465m737l984k928j811j029n15J02P96J095P02r8p26q58o47m47l90
58626F02544k14L71J249J956K199K150K219K728L711M859N724O167O489O989P399
58611F56540P155O122M777L575K529J518O74J98q8p03j944l474m668n255n407
58596F61549n129m041k134l68J83k80m31N52K236L967N796P880R783J1070J1976
$$ plain form
58581 702609 715459 728846 741950 754068 764810 773642 779990 784093 787048 789657 791884 793953 797238
58568 797238 803321 812545 824235 838092 854608 874117 896093 919566 943805 968371 992740 1016055
58556 1016055 1037167 1054898 1068357 1077136 1081406 1081932 1079822 1075931 1070523 1063688 1055938 1048019 1040210
58543 1040210 1032183 1023444 1013463 1001579 987503 971978 956165 940227 923250 904892 886342 869198
58531 869198 854013 840467 828366 817785 808612 800595 793750 788329 784587 782795 783129 785169 787883
58518 787883 790479 793012 795817 798687 800964 802103 801836 800116 797291 794014 790698 787331 783958 780905
58504 780905 778263 775728 773272 771351 770010 768370 765623 762089 758716 755930 753568 751553 749971 748699
58490 748699 747458 746125 744706 743376 742921 744630 749186 756002 764121 773411 784419 797381 811879 827155
$$ packed form
58581G02609J2850J3387J3104J2118J0742Q832O348M103K955K609K227K069L285
58568G97238O083R224J1690J3857J6516J9509K1976K3473K4239K4566K4369K3315
58556A016055K1112J7731J3459Q779M270N26k110l891n408o835p750p919p809
58543A040210q027q739r981j1884j4076j5525j5813j5938j6977j8358j8550j7144
58531H69198j5185j3546j2101j0581r173q017o845n421l742j792L34K040K714
58518G87883K596K533K805K870K277J139k67j720k825l277l316l367l373l053
58504G80905k642k535k456j921j341j640k747l534l373k786k362k015j582j272
58490G48699j241j333j419j330m55J709M556O816Q119R290J1008J2962J4498J5276
$$ plain form
58476 827155 842290 856420 869121 880254 889204 894902 896946 895986 892621 886830 879088 870965 863579
58463 863579 856345 848505 841210 836619 835340 836206 838459 842624 849050 856953 865419 874311 883617 892661
58449 892661 900506 906644 910974 913420 913850 912078 907910 901545 893906 886230 879360 873669 869446 866853
58435 866853 865677 865549 866305 867806 869737 872043 875185 879517 884788 890816 898107 907048 916908 926469 935310
58420 935310 943633 951113 956892 960625 962614 962985 961543 958505 954643 950656 946948 943826 941204 938218
58406 938218 933863 928016 921367 914630 908439 903616 900622 898879 897432 896206 895919 896936 898986 901803
58392 901803 905281 909100 912876 916506 919742 921838 922373 922076 922023 922376 922775 923441 924850 926758 928730 931332
58376 931332 935575 941485 948448 956696 966994 978924 990957 1002366 1013760 1025559 1037258 1048510
$$ packed form
58476H27155J5135J4130J2701J1133Q950N698K044r60l365n791p742q123p386
58463H63579p234p840p295m591j279Q66K253M165O426P903Q466Q892R306R044
58449H92661P845O138M330K446M30j772m168o365p639p676o870n691m223k593
58435H66853j176j28P56J501J931K306L142M332N271O028P291Q941R860R561Q841
58420I35310Q323P480N779L733J989L71j442l038l862l987l708l122k622k986
58406I38218m355n847o649o737o191m823k994j743j447j226k87J017K050K817
58392I01803L478L819L776L630L236K096N35k97n3L53L99O66J409J908J972K602
58376I31332M243N910O963Q248J0298J1930J2033J1409J1394J1799J1699J1252
$$ plain form
58364 1048510 1059720 1071183 1082678 1094239 1106284 1118701 1130768 1142288 1153813 1165470 1176530
58353 1176530 1186479 1195663 1204456 1212574 1219540 1225284 1230064 1234259 1238324 1242556 1247110 1252654 1260436 1271004
58339 1271004 1283462 1296832 1311469 1328011 1345722 1363326 1380882 1399202 1417852 1435443 1451617
58328 1451617 1466957 1481129 1493002 1502634 1511336 1519573 1526573 1532169 1537330 1542603 1547726 1553013 1559437
58315 1559437 1567017 1574861 1583149 1593351 1606001 1619836 1633679 1647699 1662485 1678333 1695752 1715133
58303 1715133 1735661 1756096 1776672 1798602 1821654 1844198 1865813 1887761 1910577 1933316 1955603
58292 1955603 1978331 2001826 2025411 2049250 2074429 2100679 2126348 2151285 2177409 2205693 2235035
58281 2235035 2264969 2296967 2331846 2368268 2405151 2443400 2483986 2526383 2570113 2615727 2663126
$$ packed form
58364A048510J1210J1463J1495J1561J2045J2417J2067J1520J1525J1657J1060
58353A176530R949R184Q793Q118O966N744M780M195M065M232M554N544P782J0568
58339A271004J2458J3370J4637J6542J7711J7604J7556J8320J8650J7591J6174
58328A451617J5340J4172J1873R632Q702Q237P000N596N161N273N123N287O424
58315A559437P580P844Q288J0202J2650J3835J3843J4020J4786J5848J7419J9381
58303A715133K0528K0435K0576K1930K3052K2544K1615K1948K2816K2739K2287
58292A955603K2728K3495K3585K3839K5179K6250K5669K4937K6124K8284K9342
58281B235035K9934L1998L4879L6422L6883L8249M0586M2397M3730M5614M7399
$$ plain form
58270 2663126 2711047 2759446 2810249 2864511 2920987 2978698 3038588 3101325 3165793 3231174 3298353
58259 3298353 3367884 3438745 3510427 3583902 3659266 3734914 3810496 3888203 3969663 4054149 4141259
58248 4141259 4232627 4329303 4430190 4534791 4644781 4761218 4883149 5010665 5146215 5290941
58238 5290941 5442953 5601315 5768406 5946032 6132586 6326686 6530338 6745918 6973324
58229 6973324 7212860 7467579 7739822 8028697 8333850 8658475 9005849 9376442 9771310
58220 9771310 10194643 10650125 11138787 11663483 12231263 12848315 13517311 14243207 15036650
58211 15036650 15908035 16863717 17912517 19070866 20357757 21791248 23395321 25204755
58203 25204755 27259466 29602493 32291019 35405109 39044861 43334096 48441651 54600675
$$ packed form
58270B663126M7921M8399N0803N4262N6476N7711N9890O2737O4468O5381O7179
58259C298353O9531P0861P1682P3475P5364P5648P5582P7707Q1460Q4486Q7110
58248D141259R1368R6676J00887J04601J09990J16437J21931J27516J35550J44726
58238E290941J52012J58362J67091J77626J86554J94100K03652K15580K27406
58229F973324K39536K54719K72243K88875L05153L24625L47374L70593L94868
58220I771310M23333M55482M88662N24696N67780O17052O68996P25896P93443
58211A5036650Q71385R55682J048800J158349J286891J433491J604073J809434
58203B5204755K054711K343027K688526L114090L639752M289235N107555O159024
$$ plain form
58195 54600675 62114110 71366397 82845260 97131143 114823487 136432478 162277424
58188 162277424 192401013 226505732 263897456 303315882 342537195 377992673 405053959
58181 405053959 419378102 418716383 403899329 378258698 346047243 311062264 276120121
58174 276120121 243137472 213329631 187355637 165462992 147621762 133589168 122928364
58167 122928364 115033854 109150204 104380942 99776165 94556517 88352581 81261044 73675463
58159 73675463 66044527 58719420 51919643 45758006 40275051 35466372 31299052 27720317
58151 27720317 24666169 22070431 19868479 17997459 16399926 15028741 13845937 12817886
58143 12817886 11914765 11113208 10395485 9746419 9153645 8609216 8107564 7642750 7210053
$$ packed form
58195E4600675P513435R252287J1478863J4285883J7692344K1608991K5844946
58188A62277424L0123589L4104719L7391724L9418426L9221313L5455478K7061286
58181D05053959J4324143o61719j4817054k5640631l2211455l4984979l4942143
58174B76120121l2982649k9807841k5973994k1892645j7841230j4032594j0660804
58167A22928364p894510n883650m769262m604777n219648o203936p091537p585581
58159G3675463p630936p325107o799777o161637n482955m808679m167320l578735
58151B7720317l054148k595738k201952j871020j597533j371185j182804j028051
58143A2817886r03121q01557p17723o49066n92774n44429n01652m64814m32697
$$ plain form
58134 7210053 6808380 6437996 6097276 5784263 5499325 5242979 5012498 4803637 4614213
58125 4614213 4442953 4286161 4138513 3996224 3857030 3718620 3580071 3443783 3313293
58116 3313293 3189864 3073281 2964441 2864420 2772034 2684904 2602247 2524419 2450738 2380048
58106 2380048 2312537 2248747 2187620 2127645 2069180 2013609 1960964 1910275 1861504 1815243 1771324
58095 1771324 1729413 1690130 1653898 1619610 1586145 1554183 1524863 1497741 1471856 1447650 1425865
58084 1425865 1405502 1384852 1363755 1342972 1322143 1300235 1277321 1254137 1230551 1206138 1181583
58073 1181583 1157887 1134938 1112425 1091285 1072583 1055775 1039731 1024639 1011189 998803 986429
58062 986429 974380 963611 953951 944745 936472 929821 923842 916838 908596 900016 891161 881419 871024
$$ packed form
58134G210053m01673l70384l40720l13013k84938k56346k30481k08861j89424
58125D614213j71260j56792j47648j42289j39194j38410j38549j36288j30490
58116C313293j23429j16583j08840j00021r2386q7130q2657p7828p3681p0690
58106B380048o7511o3790o1127n9975n8465n5571n2645n0689m8771m6261m3919
58095A771324m1911l9283l6232l4288l3465l1962k9320k7122k5885k4206k1785
58084A425865k0363k0650k1097k0783k0829k1908k2914k3184k3586k4413k4555
58073A181583k3696k2949k2513k1140j8702j6808j6044j5092j3450j2386j2374
58062I86429j2049j0769r660r206q273o651n979p004q242q580q855r742j0395
$$ plain form
58049 871024 860681 850247 839487 829516 821657 815395 809267 803182 797952 793039 786881 779260 771401
58036 771401 763833 756029 748088 740952 734801 728833 722633 716296 709291 700808 691244 681890 673148 664524
58022 664524 656220 649130 643212 637401 631277 625441 620230 615438 611372 608703 607043 604928 601460 596996
58008 596996 592263 587868 584518 582514 581126 579559 578316 578392 579435 580119 580117 580243 580774 581110 581090 581158 581197 580600
57990 580600 579556 578917 578739 578358 577873 578078 578797 578818 577635 575858 573732 570780 567128 563685 560615 557082
57974 557082 552900 549060 546191 543812 541552 539768 538519 537278 536232 536469 538170 539844 540095 539135 537878
57959 537878 536647 535564 535232 536073 537585 538921 539657 539534 538205 535748 532910 530399 528439 527157 526662
57944 526662 526506 525888 524709 523726 523505 524101 525924 529850 536023 543440 551227 559545 568781 578686 588850
$$ packed form
58049H71024j0343j0434j0760r971p859o262o128o085n230m913o158p621p859
58036G71401p568p804p941p136o151n968o200o337p005q483r564r354q742q624
58022F64524q304p090n918n811o124n836n211m792m066k669j660k115l468m464
58008E96996m733m395l350k004j388j567j243P6J043O84kJ26N31L36k0O8L9n97
57990E80600j044o39j78l81m85K05P19K1j183j777k126k952l652l443l070l533
57974E57082m182l840k869k379k260j784j249j241j046K37J701J674K51r60j257
57959E37878j231j083l32Q41J512J336P36j23j329k457k838k511j960j282m95
57944E26662j56o18j179r83k21N96J823L926O173P417P787Q318R236R905J0164
$$ plain form
57929 588850 599363 610443 621853 633020 643306 652072 659087 664912 670211 674664 677335 678095 677707
57916 677707 676442 673734 669403 664206 658892 653659 648724 644321 639887 634483 628334 622716 617908 612643
57902 612643 606172 599478 593548 587800 581311 574482 568240 562453 556466 550629 546085 543316 541835 540998
57888 540998 540355 539568 538821 539015 540877 544153 548187 552823 558059 563284 567635 570818 573021 574391 575205
57873 575205 576099 577418 578688 579333 579602 580150 580968 581335 580609 578731 576259 574199 573301 573084 572157 569992 567763
57856 567763 566820 567018 567321 567414 567772 568599 569733 571311 573555 576037 578058 579615 581107 582160 581774 579788
57840 579788 577326 575504 574330 573167 571669 569880 567845 565545 563019 560374 557724 555139 552503 549517
57826 549517 546101 542724 540085 538545 538073 538581 539944 541793 543644 545332 547047 549035 551449 554406 557786
$$ packed form
57929E88850J0513J1080J1410J1167J0286Q766P015N825N299M453K671P60l88
57916F77707j265k708m331n197n314n233m935m403m434n404o149n618m808n265
57902F12643o471o694n930n748o489o829o242n787n987n837m544k769j481q37
57888E40998o43p87p47J94J862L276M034M636N236N225M351L183K203J370Q14
57873E75205Q94J319J270O45K69N48Q18L67p26j878k472k060q98k17r27k165k229
57856E67763r43J98L03R3L58Q27J134J578K244K482K021J557J492J053l86j986
57840E79788k462j822j174j163j498j789k035k300k526k645k650k585k636k986
57826E49517l416l377k639j540m72N08J363J849J851J688J715J988K414K957L380
$$ plain form
57811 557786 561023 563392 564613 564975 564915 564700 564581 564942 566087 567872 569674 570766 570756 569721 568066 566408
57795 566408 565470 565702 566767 567770 568300 568934 570355 572326 574142 575740 577538 579292 580142 579971 579866 580815
57779 580815 582677 584813 587016 589287 591352 593058 594869 597341 600355 603361 606158 609026 612308 616155
57765 616155 620437 624584 627830 629912 631319 632622 633926 635140 636249 637002 636824 635601 634162 633577 634211
57750 634211 635781 637845 639786 640768 640352 639001 637569 636504 635849 635625 635746 635912 636097 636813 638386 640229
57734 640229 641336 641318 640484 639197 637587 635631 633036 629364 624853 620824 618615 618244 618621 618862 618737 618043
57718 618043 616418 613980 611574 610077 609719 610122 610657 610729 610072 608899 607580 606216 604735 603255 602047 601194
57702 601194 600606 600298 600435 601138 602431 604265 606452 608750 611202 614116 617490 620752 623335 625163 626245
$$ packed form
57811E57786L237K369J221L62o0k15j19L61J145J785J802J092j0j035j655j658
57795E66408r38K32J065J003N30O34J421J971J816J598J798J754Q50j71j05R49
57779E80815J862K136K203K271K065J706J811K472L014L006K797K868L282L847
57765F16155M282M147L246K082J407J303J304J214J109P53j78j223j439n85O34
57750F34211J570K064J941R82m16j351j432j065o55k24J21J66J85P16J573J843
57734F40229J107j8q34j287j610j956k595l672m511m029k209l71L77K41j25o94
57718F18043j625k438k406j497l58M03N35P2o57j173j319j364j481j480j208q53
57702F01194n88l08J37P03J293J834K187K298K452K914L374L262K583J828J082
$$ plain form
57687 626245 626269 625150 623657 622820 622834 623156 623673 625191 628615 634062 640952 648723 657454 668042 681791
57672 681791 699657 722040 749477 783265 824974 875403 934268 1000620 1072891 1148164 1221397
57661 1221397 1285463 1332368 1355616 1352720 1326096 1281536 1225715 1164631 1103135 1044677 991165
57650 991165 943519 902410 868293 840869 819035 801504 787307 775844 766788 759931 754937 751291
57638 751291 748641 746957 746094 745401 744145 742258 740418 739410 739551 740558 741857 743186 745015 747996 751841
57623 751841 755210 757027 757466 757304 756820 755932 755025 754847 755628 756813 757721 758189 758712 760144 762936 766349 768861
57606 768861 769825 770362 772068 775260 779059 782796 786477 790124 793571 796962 800662 804558 808047 810845 813289
57591 813289 815734 818158 820424 822495 824301 825825 827414 829623 832624 836011 839172 841686 843506 845023
$$ packed form
57687F26245K4j119j493q37J4L22N17J518L424N447O890P771Q731J0588J3749
57672F81791J7866K2383K7437L3788M1709N0429N8865O6352P2271P5273P3233
57661A221397O4066M6905K3248k896k6624m4560n5821o1084o1496n8458n3512
57650I91165m7646m1109l4117k7424k1834j7531j4197j1463r056o857m994l646
57638G51291k650j684q63o93j256j887j840j008J41J007J299J329J829K981L845
57623G51841L369J817M39j62m84q88r07j78P81J185R08M68N23J432K792L413K512
57606G68861R64N37J706L192L799L737L681L647L447L391L700L896L489K798K444
57591H13289K445K424K266K071J806J524J589K209L001L387L161K514J820J517
$$ plain form
57577 845023 846721 848526 849807 850347 850898 852272 854239 855937 857072 858130 859645 861839 864650 867490 869420
57562 869420 870326 871537 874387 878463 882252 885264 888343 892049 895992 899884 903986 908193 911859 914996
57548 914996 918614 923288 928354 933117 937984 943656 949928 956138 962257 968712 975434 981824 987598 993130
57534 993130 998958 1005219 1011467 1016927 1021131 1024404 1027459 1030621 1033872 1037575 1042365 1048202 1054233 1059939
57520 1059939 1065756 1072229 1079241 1086536 1094362 1103037 1112347 1121958 1132042 1142973 1154683 1166755 1178852
57507 1178852 1190662 1201688 1211527 1220139 1227636 1234126 1240034 1246080 1252498 1258689 1264037 1268689 1273193
57494 1273193 1277820 1282756 1288436 1295016 1301807 1307958 1313551 1319422 1326004 1332919 1339662 1346110 1352374 1358617
57480 1358617 1365130 1372137 1379456 1386680 1393777 1401187 1409256 1417870 1426741 1435767 1444991 1454407 1463933 1473509
$$ packed form
57577H45023J698J805J281N40N51J374J967J698J135J058J515K194K811K840J930
57562H69420R06J211K850M076L789L012L079L706L943L892M102M207L666L137
57548I14996L618M674N066M763M867N672O272O210O119O455O722O390N774N532
57534I93130N828O261O248N460M204L273L055L162L251L703M790N837O031N706
57520A059939N817O473P012P295P826Q675R310R611J0084J0931J1710J2072J2097
57507A178852J1810J1026R839Q612P497O490N908O046O418O191N348M652M504
57494A273193M627M936N680O580O791O151N593N871O582O915O743O448O264O243
57480A358617O513P007P319P224P097P410Q069Q614Q871R026R224R416R526R576
$$ plain form
57466 1473509 1483082 1492560 1501869 1511087 1520531 1530623 1541531 1552927 1564247 1575201 1585939 1596730
57454 1596730 1607686 1618844 1630335 1642396 1655247 1668871 1682728 1695831 1707469 1717933 1728314
57443 1728314 1739554 1751902 1765201 1779262 1793769 1808195 1822066 1835300 1848204 1861197 1874458
57432 1874458 1887748 1900715 1913535 1926957 1941352 1956042 1970110 1983696 1997849 2013102 2028828
57421 2028828 2044055 2058396 2072057 2085499 2099220 2113380 2127618 2141677 2156150 2171901 2188754
57410 2188754 2205569 2221758 2237924 2254702 2271883 2289127 2306710 2324911 2343315 2361484 2379819
57399 2379819 2399029 2419009 2438903 2458103 2476658 2494903 2513210 2531995 2551512 2571615 2591954
57388 2591954 2612335 2632801 2653575 2675028 2697339 2720072 2742428 2764134 2785726 2807821 2830531
$$ packed form
57466A473509R573R478R309R218R444J0092J0908J1396J1320J0954J0738J0791
57454A596730J0956J1158J1491J2061J2851J3624J3857J3103J1638J0464J0381
57443A728314J1240J2348J3299J4061J4507J4426J3871J3234J2904J2993J3261
57432A874458J3290J2967J2820J3422J4395J4690J4068J3586J4153J5253J5726
57421B028828J5227J4341J3661J3442J3721J4160J4238J4059J4473J5751J6853
57410B188754J6815J6189J6166J6778J7181J7244J7583J8201J8404J8169J8335
57399B379819J9210J9980J9894J9200J8555J8245J8307J8785J9517K0103K0339
57388B591954K0381K0466K0774K1453K2311K2733K2356K1706K1592K2095K2710
$$ plain form
57377 2830531 2853699 2877255 2901200 2925695 2951226 2978031 3005201 3031153 3055336 3078775 3102599
57366 3102599 3126861 3151251 3176157 3202173 3229166 3256480 3283665 3310477 3336711 3362645 3389125
57355 3389125 3416593 3444514 3472300 3500158 3528437 3556774 3584728 3612642 3641060 3669805 3698526
57344 3698526 3727587 3757467 3787709 3817517 3846996 3876752 3906585 3935808 3964642 3994089 4024368
57333 4024368 4054621 4084309 4113883 4143841 4174117 4204719 4236078 4268363 4301077 4333670 4366076
57322 4366076 4398412 4430693 4462995 4495429 4527887 4560309 4593207 4627306 4662541 4697967 4732752
57311 4732752 4766795 4800351 4833671 4867088 4900910 4935138 4969648 5004619 5040259 5076258 5112142
57300 5112142 5148053 5184496 5221359 5257997 5294291 5330842 5367930 5405132 5442182 5479528 5517654
$$ packed form
57377B830531K3168K3556K3945K4495K5531K6805K7170K5952K4183K3439K3824
57366C102599K4262K4390K4906K6016K6993K7314K7185K6812K6234K5934K6480
57355C389125K7468K7921K7786K7858K8279K8337K7954K7914K8418K8745K8721
57344C698526K9061K9880L0242K9808K9479K9756K9833K9223K8834K9447L0279
57333D024368L0253K9688K9574K9958L0276L0602L1359L2285L2714L2593L2406
57322D366076L2336L2281L2302L2434L2458L2422L2898L4099L5235L5426L4785
57311D732752L4043L3556L3320L3417L3822L4228L4510L4971L5640L5999L5884
57300E112142L5911L6443L6863L6638L6294L6551L7088L7202L7050L7346L8126
$$ plain form
57289 5517654 5556379 5595084 5633134 5670000 5705544 5740378 5775391 5810799 5846175 5881446 5917062
57278 5917062 5953025 5988560 6023144 6057178 6091224 6125245 6159141 6193522 6229316 6266806 6305484
57267 6305484 6344725 6384319 6424469 6465322 6506444 6546862 6585991 6624321 6662682 6700926 6738048
57256 6738048 6773607 6808320 6843108 6878272 6913723 6949242 6984172 7017633 7049517 7080760 7112306
57245 7112306 7144324 7176689 7209549 7242978 7276657 7310386 7344391 7378743 7413013 7446993 7481186
57234 7481186 7515981 7550741 7584336 7616304 7646927 7676362 7704251 7730147 7753871 7775458 7794986
57223 7794986 7812492 7828062 7842122 7855491 7868688 7881190 7891903 7900462 7907660 7914562 7921860 7930132
57211 7930132 7939887 7950946 7962579 7974676 7988135 8003567 8020294 8037233 8054210 8071765 8090084
$$ packed form
57289E517654L8725L8705L8050L6866L5544L4834L5013L5408L5376L5271L5616
57278E917062L5963L5535L4584L4034L4046L4021L3896L4381L5794L7490L8678
57267F305484L9241L9594M0150M0853M1122M0418L9129L8330L8361L8244L7122
57256F738048L5559L4713L4788L5164L5451L5519L4930L3461L1884L1243L1546
57245G112306L2018L2365L2860L3429L3679L3729L4005L4352L4270L3980L4193
57234G481186L4795L4760L3595L1968L0623K9435K7889K5896K3724K1587J9528
57223G794986J7506J5570J4060J3369J3197J2502J0713Q559P198O902P298Q272
57211G930132R755J1059J1633J2097J3459J5432J6727J6939J6977J7555J8319
$$ plain form
57200 8090084 8108865 8127816 8146673 8165050 8182860 8200536 8218298 8235513 8251343 8265693 8278867
57189 8278867 8290709 8300809 8309338 8316880 8323488 8328554 8331604 8332723 8332289 8330790 8328808 8326654 8324056 8320552
57175 8320552 8316029 8310344 8302645 8291698 8276894 8258515 8237148 8213460 8188426 8163093 8137934 8112944
57163 8112944 8088538 8065877 8046140 8029742 8016401 8005639 7997070 7990488 7985825 7982968 7981593 7981225 7981330
57150 7981330 7981160 7979769 7976495 7971355 7964672 7956305 7945385 7930712 7911294 7886755 7857436 7823930 7786435
57137 7786435 7744928 7700246 7654548 7610319 7569269 7532543 7501506 7477526 7461141 7451997 7449540 7453157
57125 7453157 7461693 7473341 7486202 7498777 7510235 7520769 7531681 7544722 7561427 7583463 7613407
57114 7613407 7654525 7709584 7780066 7866367 7968266 8085349 8217689 8366637 8535241 8728338
$$ packed form
57200H090084J8781J8951J8857J8377J7810J7676J7762J7215J5830J4350J3174
57189H278867J1842J0100Q529P542O608N066L050J119m34j499j982k154k598l504
57175H320552m523n685p699j0947j4804j8379k1367k3688k5034k5333k5159k4990
57163H112944k4406k2661j9737j6398j3341j0762q569o582m663k857j375l68J05
57150G981330j70j391l274n140o683q367j0920j4673j9418k4539k9319l3506l7495
57137G786435m1507m4682m5698m4229m1050l6726l1037k3980j6385r144k457L617
57125G453157Q536J1648J2861J2575J1458J0534J0912J3041J6705K2036K9944
57114G613407M1118N5059P0482Q6301J01899J17083J32340J48948J68604J93097
$$ plain form
57104 8728338 8952667 9216700 9530032 9903158 10348284 10880499 11518683 12286765 13215461
57095 13215461 14342835 15712585 17371673 19368735 21751483 24560686 27821954 31538924
57087 31538924 35689567 40225941 45078446 50164117 55394476 60679416 65928591 71049745
57079 71049745 75934671 80428333 84302470 87270981 89058164 89481634 88495596 86176911
57071 86176911 82682386 78212395 72989594 67243024 61193108 55041978 48970023 43132801
57063 43132801 37655038 32625432 28096362 24087673 20591572 17578032 15001578 12808961
57055 12808961 10945991 9362404 8014473 6865430 5884397 5045197 4325832 3708168 3177144
57046 3177144 2719931 2325668 1985446 1691813 1438005 1217791 1026005 858750 712856
$$ packed form
57104H728338K24329K64033L13332L73126M45126N32215O38184P68082R28696
57095A3215461J127374J369750J659088J997062K382748K809203L261268L716970
57087C1538924M150643M536374M852505N085671N230359N284940N249175N121154
57079G1049745M884926M493662L874137K968511J787183M23470r86038k318685
57071H6176911l494525m469991n222801n746570o049916o151130o071955n837222
57063D3132801n477763n029606m529070m008689l496101l013540k576454k192617
57055A2808961j862970j583587j347931j149043r81033q39200p19365o17664n31024
57046C177144m57213l94263l40222k93633k53808k20214j91786j67255j45894
$$ plain form
57037 712856 585321 473472 375455 290242 217096 155049 102740 58543 20893 -11347 -38780
57026 -38780 -61613 -79782 -92889 -100363 -101919 -97622 -87091 -68644 -39467 3430 62676 140659
57014 140659 239604 360934 504085 664813 832756 989679 1111534 1175902 1171430 1102718
57004 1102718 986935 845095 694516 546342 406909 279685 166369 67640 -16306 -85887
56994 -85887 -142560 -188507 -225557 -254684 -276597 -292134 -301803 -305558 -303719 -297736 -289373 -279294 -267150
56981 -267150 -253071 -238505 -225563 -216149 -211758 -213335 -220718 -232386 -246113 -259839 -272089 -282060
56969 -282060 -289634 -295096 -298605 -300055 -299377 -296636 -291706 -284183 -273791 -260542 -244409 -225222 -203197
56956 -203197 -179255 -154618 -130519 -108751 -92092 -83416 -84107 -93403 -109074 -128400 -148803 -168358
$$ packed form
57037G12856j27535j11849r8017q5213p3146o2047n2309m4197B0893a1347k7433
57026c8780k2833j8169j3107p474j556M297J0531J8447K9177C430N9246P7983
57014A40659R8945J21330J43151J60728J67943J56923J21855O4368m472o8712
57004A102718j15783j41840j50579j48174j39433j27224j13316F7640a6306o9581
56994h5887n6673m5947l7050k9127k1913j5537r669l755J839N983Q363J0079J2144
56981b67150J4079J4566J2942R414M391j577p383j1668j3727j3726j2250r971
56969b82060p574n462l509j450O78K741M930P523J0392J3249J6133J9187K2025
56956b03197K3942K4637K4099K1768J6659Q676o91r296j5671j9326k0403j9555
$$ plain form
56944 -168358 -186164 -202091 -215985 -227241 -235155 -239440 -240222 -237663 -231704 -222042 -208198 -189684 -166253
56931 -166253 -138057 -105639 -70065 -33401 810 27873 43345 44935 33500 12284 -14928 -45205
56919 -45205 -76433 -106748 -134568 -159158 -180604 -198962 -213805 -224930 -233147 -239773 -245432 -249888
56907 -249888 -253082 -255680 -258285 -260706 -262494 -263792 -265023 -266009 -266048 -264837 -262656 -259636 -255446 -249873 -243102
56892 -243102 -235146 -225513 -213707 -199570 -182851 -163081 -140337 -115663 -90200 -64477 -39356 -17371
56879 -2008 4695 3403 -3636 -14274 -26864 -39820 -51541 -60845 -67223 -70640 -71141 -68549 -62412 -52105
56865 -52105 -36863 -15711 12307 47591 89787 138304 192586 251364 311665 368811 417293 451675
56853 451675 467611 463459 441443 406796 365346 321778 279549 241270 208618 182361 162990 151257
$$ packed form
56944a68358j7806j5927j3894j1256p914m285p82K559N959R662J3844J8514K3431
56931a66253K8196L2418L5574c3401H10K7063J5472J590j1435A2284a4928l0277
56919d5205l1228l0315k7820k4590k1446j8358j4843j1125q217o626n659m456
56907b49888l194k598k605k421j788j298j231r86l9J211K181L020M190N573O771
56892b43102P956R633J1806J4137J6719J9770K2744K4674K5463K5723K5121a7371
56879b008D695j292c636j0638j2590j2956j1721r304o378l417n01K592O137J0307
56865e2105J5242a5711A2307L5284M2196M8517N4282N8778O0301N7146M8482L4382
56853D51675J5936m152k2016l4647m1450m3568m2229l8279l2652k6257j9371j1733
$$ plain form
56841 151257 148079 154259 170517 197510 235742 285708 348023 422831 508771 602633 699580 792688
56829 792688 872261 927291 949654 937714 896106 832602 755430 672346 590082 513399 444732
56818 444732 385029 334837 294662 264783 245211 235908 237023 248991 272374 307427 353634 409634
56806 409634 473321 541538 609264 669106 712227 730967 721941 687549 634659 571375 504268 437609
56794 437609 374134 315945 264715 221348 185700 156935 134501 118766 110548 110055 116679 129859
56782 129859 149576 175640 206799 240850 275193 306601 330681 342609 339305 321128 291455 254676
56770 254676 214428 173188 132793 94886 60805 31212 5985 -15466 -33788 -49369 -62366 -72982
56758 -72982 -81789 -89694 -97393 -104879 -111593 -116983 -120782 -122968 -123862 -124345 -125509 -127753 -130343 -132083 -132417
$$ packed form
56841A51257l178O180J6258K6993L8232M9966O2315P4808Q5940R3862R6947R3108
56829G92688P9573N5030K2363j1940m1608o3504p7172q3084q2264p6683o8667
56818D44732n9703n0192m0175k9879j9572r303J115J1968K3383L5053M6207N6000
56806D09634O3687O8217O7726N9842M3121J8740r026l4392n2890o3284o7107o6659
56794D37609o3475n8189n1230m3367l5648k8765k2434j5735q218m93O624J3180
56782A29859J9717K6064L1159L4051L4343L1408K4080J1928l304j8177k9673l6779
56770B54676m0248m1240m0395l7907l4081k9593E985a5466j8322j5581j2997j0616
56758g2982q807p905p699p486o714n390l799k186q94m83j164k244k590j740l34
$$ plain form
56743 -132417 -131809 -131214 -131295 -132064 -133084 -133961 -134600 -135027 -135167 -135014 -134858 -135033 -135438 -135654 -135498 -135100 -134392 -133006
56725 -133006 -130849 -128369 -125989 -123646 -121192 -118909 -117243 -116256 -115662 -115211 -114584 -113171 -110485 -106879 -103380
56710 -103380 -100686 -98617 -96685 -94905 -93795 -93725 -94495 -95609 -96829 -98391 -100621 -103398 -106030 -107740 -108216
56695 -108216 -107729 -106817 -105922 -105194 -104504 -103610 -102312 -100475 -98005 -94969 -91696 -88605 -85913 -83555 -81372 -79188
56679 -79188 -76833 -74311 -71958 -70108 -68589 -66828 -64594 -62337 -60571 -59085 -56963 -53397 -48366 -42611
56665 -42611 -36959 -31602 -26104 -20241 -14597 -9916 -5961 -1593 3829 9689 15109 20241 25953 32455
56651 32455 38887 44337 48727 52440 55422 57044 56742 54481 50485 44804 37368 28378 18296 7429
56636 -4196 -16377 -28432 -39706 -50120 -59861 -68706 -76090 -81804 -86227 -89827 -92797 -95151 -96862 -97883
$$ packed form
56743a32417O08N95q1p69j020q77o39m27j40J53J56j75m05k16J56L98P08J386
56725a33006K157K480K380K343K454K283J666R87N94M51O27J413K686L606L499
56710a03380K694K069J932J780J110P0p70j114j220j562k230k777k632j710m76
56695a08216M87R12Q95P28O90Q94J298J837K470L036L273L091K692K358K183K184
56679g9188K355K522K353J850J519J761K234K257J766J486K122L566N031N755
56665d2611N652N357N498N863N644M681L955a593C829N860N420N132N712O502
56651C2455O432N450M390L713K982J622l02k261l996n681p436q990j0082G429
56636d196j2181j2055j1274j0414r741q845p384n714m423l600k970k354j711j021
$$ plain form
56622 -97883 -98344 -98677 -99194 -99665 -99733 -99607 -99695 -99667 -98660 -96590 -94495 -93237 -92490 -91415 -89735 -87680 -85393
56605 -85393 -82945 -80610 -78604 -76797 -75047 -73513 -72271 -70974 -69283 -67359 -65515 -63675 -61575 -59232
56591 -59232 -56846 -54535 -52509 -51149 -50482 -49896 -48859 -47624 -46735 -46104 -45104 -43375 -41049 -38386 -35706
56576 -35706 -33544 -32274 -31608 -30885 -29828 -28640 -27493 -26378 -25395 -24710 -24137 -23097 -21035 -17715 -13249 -8031
56560 -8031 -2484 3370 9932 17389 25266 32809 39468 44847 48633 51058 53057 55437 58096 60468 62428
56545 62428 64295 66251 68317 70549 72672 73788 73234 71686 70698 71127 72520 74012 75186 76030 76657 77229
56529 77229 77717 77661 76556 74559 72422 70679 69267 67942 66667 65483 64321 63039 61494 59556 57204
56514 57204 54508 51425 47852 43997 40331 36945 33356 29235 24867 20582 16352 12382 9449 7953
$$ packed form
56622i7883m61l33n17m71o8J26q8K8J007K070K095J258P47J075J680K055K287
56605h5393K448K335K006J807J750J534J242J297J691J924J844J840K100K343
56591e9232K386K311K026J360O67N86J037J235Q89O31J000J729K326K663K680
56576c5706K162J270O66P23J057J188J147J115R83O85N73J040K062L320M466N218
56560h031b484C370O562P457P877P543O659N379L786K425J999K380K659K372J960
56545F2428J867J956K066K232K123J116n54j548r88M29J393J492J174Q44O27N72
56529G7229M88n6j105j997k137j743j412j325j275j184j162j282j545j938k352
56514E7204k696l083l573l855l666l386l589m121m368m285m230l970k933j496
$$ plain form
56500 7953 7207 6399 5720 5700 5961 5715 5052 4619 4309 3564 2846 3460 5694 8335 10328 11854 13411 14854
56482 14854 15893 16699 17508 18220 18809 19552 20520 21421 22161 23027 24148 25335 26567 27937 29119 29708 30156
56465 30156 31376 33186 34248 34015 33672 34490 36128 37369 37802 37917 38091 38323 38688 39346 40256 41321 42591
56448 42591 44011 45267 46141 46649 46686 46111 45415 45576 46806 48131 48745 49160 50339 52204 53760 54424 54599
56431 54599 55135 56705 59468 62852 65852 67913 69364 70755 72157 73423 74698 76221 77962 79862 82106
56416 82106 84713 87179 88974 90186 91244 92241 92907 93092 92950 92709 92473 92105 91251 89721 87842 86198
56400 86198 85026 84224 83769 83589 83219 82358 81632 81880 82712 82959 82656 83212 85142 87055 87743 88010 89331 91723
56382 91723 94239 96644 99176 101199 101569 100184 98033 95902 94119 93282 93902 95333 96231 96292 96516 97576
$$ packed form
56500G953p46q08o79k0K61k46o63m33l10p45p18O14K234K641J993J526J557J443
56482A4854J039Q06Q09P12N89P43R68R01P40Q66J121J187J232J370J182N89M48
56465C0156J220J810J062k33l43Q18J638J241M33J15J74K32L65O58R10J065J270
56448D2591J420J256Q74N08L7n75o96J61J230J325O14M15J179J865J556O64J75
56431E4599N36J570K763L384L000K061J451J391J402J266J275J523J741J900K244
56416H2106K607K466J795J212J058R97O66J85j42k41k36l68q54j530j879j644
56400H6198j172q02m55j80l70q61p26K48Q32K47l03N56J930J913O88K67J321K392
56382I1723K516K405K532K023L70j385k151k131j783q37O20J431Q98O1K24J060
$$ plain form
56366 97576 98905 99737 100175 100808 101887 103264 104647 105573 105546 104538 103119 101919 101172 100821 100792 101058 101617
56349 101617 102461 103462 104421 105367 106590 108226 110013 111635 113016 114094 114739 115146 115884 117190 118685 120140
56333 120140 122024 124816 128218 131549 134483 136941 138858 140626 143191 146926 150913 154104 156716 159630
56319 159630 162837 165591 167826 170325 173457 176628 179048 180331 180480 180124 180602 182885 186344 189478 191887
56304 191887 194614 198423 202752 206705 210280 214119 218577 223503 228504 233152 237192 240714 243892 246641
56290 246641 248869 250926 253265 255835 258430 261520 265907 271511 277300 282670 288137 294342 301053 307594
56276 307594 313739 319600 325020 329716 334053 339147 345931 354164 362607 370302 377584 385603 395022 405574
56262 405574 416848 428847 441629 455220 470270 488063 509264 533301 559693 589323 623589
$$ packed form
56366I7576J329Q32M38O33J079J377J383R26k7j008j419j200p47l51k9K66N59
56349A01617Q44J001R59R46J223J636J787J622J381J078O45M07P38J306J495J455
56333A20140J884K792L402L331K934K458J917J768K565L735L987L191K612K914
56319A59630L207K754K235K499L132L171K420J283J49l56M78K283L459L134K409
56304A91887K727L809M329L953L575L839M458M926N001M648M040L522L178K749
56290B46641K228K057K339K570K595L090M387N604N789N370N467O205O711O541
56276C07594O145N861N420M696M337N094O784Q233Q443P695P282Q019R419J0552
56262D05574J1274J1999J2782J3591J5050J7793K1201K4037K6392K9630L4266
$$ plain form
56251 623589 662819 706558 754999 809056 869220 935346 1007488 1086016 1170911 1261744 1358182
56240 1358182 1459581 1564186 1669623 1774102 1876104 1972943 2060859 2136801 2199223 2246970
56230 2246970 2278556 2293090 2291009 2273355 2240973 2194943 2137187 2070095 1995820 1916150 1832685
56219 1832685 1746880 1660247 1574564 1491427 1411562 1335009 1261948 1192795 1127622 1066184 1008618
56208 1008618 955455 906781 861964 820326 781526 745237 711123 679328 650469 624981 602781
56197 602781 583572 567002 552626 540182 529802 521487 514567 508242 502394 497253 492654 488352 484700
56184 484700 482065 479917 477523 475272 474071 473627 472719 471219 470442 471147 472467 473305 473687 474106 474468 474331
56168 474331 473584 472410 471150 470400 470672 471806 473328 475376 478495 482617 487131 491975 497632 504059 510718
$$ packed form
56251F23589L9230M3739M8441N4057O0164O6126P2142P8528Q4895R0833R6438
56240A358182J01399J04605J05437J04479J02002R6839Q7916P5942O2422M7747
56230B246970L1586J4534k081j7654l2382m6030n7756o7092p4275p9670q3465
56219A832685q5805q6633q5683q3137p9865p6553p3061o9153o5173o1438n7566
56208A008618n3163m8674m4817m1638l8800l6289l4114l1795k8859k5488k2200
56197F02781j9209j6570j4376j2444j0380q315o920o325n848n141m599m302l652
56184D84700k635k148k394k251j201m44r08j500p77P05J320Q38L82M19L62j37
56168D74331p47j174j260p50K72J134J522K048L119M122M514M844N657O427O659
$$ plain form
56153 510718 517683 525552 534128 542454 550397 558944 568649 579031 589897 601949 615647 630688 647108
56140 647108 665669 686715 710033 736509 768550 807991 854811 908724 970696 1041775 1121514
56129 1121514 1208699 1302640 1402302 1504615 1604838 1698503 1782645 1856024 1919140 1973702 2021317
56118 2021317 2062761 2098459 2128578 2152189 2167409 2173321 2171099 2162607 2148715 2129580 2105531 2076482
56106 2076482 2041003 1996991 1943103 1879158 1805901 1725272 1640557 1555507 1473229 1395952 1325165
56095 1325165 1261623 1205677 1157841 1118435 1086692 1061085 1040756 1025767 1015872 1010068 1007544 1007910
56083 1007910 1010273 1013360 1016943 1021841 1028152 1034775 1041150 1048043 1056006 1064500 1073245 1083007 1094233 1106301
56069 1106301 1118975 1133263 1149943 1168438 1187942 1208286 1228850 1248199 1265850 1283047 1300733
$$ packed form
56153E10718O965P869Q576Q326P943Q547R705J0382J0866J2052J3698J5041J6420
56140F47108J8561K1046K3318K6476L2041L9441M6820N3913O1972P1079P9739
56129A121514Q7185R3941R9662J02313J00223R3665Q4142P3379O3116N4562M7615
56118B021317M1444L5698L0119K3611J5220N912k222q492j3892j9135k4049k9049
56106B076482l5479m4012n3888o3945p3257q0629q4715q5050q2278p7277p0787
56095A325165o3542n5946m7836l9406l1743k5607k0329j4989r895n804k524L66
56083A007910K363L087L583M898O311O623O375O893P963Q494Q745R762J1226J2068
56069A106301J2674J4288J6680J8495J9504K0344K0564J9349J7651J7197J7686
$$ plain form
56058 1300733 1318108 1334262 1349735 1365238 1380242 1394261 1408272 1423495 1439857 1456924 1475206
56047 1475206 1495272 1516606 1538581 1561465 1585363 1609383 1633078 1657590 1684226 1713087 1744060
56036 1744060 1777659 1813580 1849952 1885463 1921032 1958227 1997478 2038994 2083668 2131513 2180801
56025 2180801 2230292 2280774 2332936 2385566 2437626 2490340 2545323 2602249 2660372 2720718 2784679
56014 2784679 2851910 2921647 2994723 3072270 3153861 3238872 3328186 3422587 3521094 3622876 3729160
56003 3729160 3841189 3958078 4078849 4204854 4337970 4478146 4624907 4779263 4941843
55994 4941843 5111283 5286948 5471199 5666480 5872477 6088762 6317765 6562169 6821772
55985 6821772 7095989 7386949 7697091 8026483 8375917 8749873 9152863 9585871 10050284
$$ packed form
56058A300733J7375J6154J5473J5503J5004J4019J4011J5223J6362J7067J8282
56047A475206K0066K1334K1975K2884K3898K4020K3695K4512K6636K8861L0973
56036A744060L3599L5921L6372L5511L5569L7195L9251M1516M4674M7845M9288
56025B180801M9491N0482N2162N2630N2060N2714N4983N6926N8123O0346O3961
56014B784679O7231O9737P3076P7547Q1591Q5011Q9314R4401R8507J01782J06284
56003C729160J12029J16889J20771J26005J33116J40176J46761J54356J62580
55994D941843J69440J75665J84251J95281K05997K16285K29003K44404K59603
55985F821772K74217K90960L10142L29392L49434L73956M02990M33008M64413
$$ plain form
55976 10050284 10552201 11098680 11692986 12338154 13042206 13815222 14664715 15599138 16632855
55967 16632855 17782815 19064354 20496423 22107951 23934455 26014115 28395321 31146141
55959 31146141 34353715 38125159 42603841 47988666 54542016 62599362 72590227 85040694
55951 85040694 100523937 119569889 142565292 169657985 200683778 235124755 272001786
55944 272001786 309547131 344771901 373487565 391302467 395305066 385320277 363807833
55937 363807833 334582083 301385483 267131140 233824470 202741252 174597760 149701415
55930 149701415 128092364 109634620 94060252 81018640 70139525 61072443 53495671
55923 53495671 47124578 41726147 37119143 33159775 29733729 26756025 24162858 21898098
$$ packed form
55976A0050284N01917N46479N94306O45168P04052P73016Q49493R34423J033717
55967A6632855J149960J281539J432069J611528J826504K079660K381206K750820
55959C1146141L207574L771444M478682N384825O553350Q057346R990865J2450467
55951H5040694J5483243J9045952K2995403K7092693L1025793L4440977L6877031
55944B72001786L7545345L5224770K8715664J7814902M002599r984789k1512444
55937C63807833k9225750l3196600l4254343l3306670l1083218k8143492k4896345
55930A49701415k1609051j8457744j5574368j3041612j0879115r067082p576772
55923E3495671o371093n398431m607004l959368l426046k977704k593167k264760
$$ plain form
55915 21898098 19911178 18163381 16625579 15269086 14065366 12993228 12038449 11186249
55907 11186249 10420448 9729394 9106199 8542880 8029744 7560403 7132138 6741101 6381719
55898 6381719 6050591 5746546 5466852 5207395 4966396 4744091 4539005 4348177 4170681
55889 4170681 4007357 3857423 3718808 3591495 3477192 3375965 3286456 3209116 3146182 3098641
55879 3098641 3066063 3048989 3048459 3063221 3089908 3125401 3166246 3206090 3236620 3251220 3245848 3217313
55867 3217313 3163746 3086676 2990068 2877218 2750722 2614926 2475731 2337822 2204087 2077400
55857 2077400 1960616 1854753 1759220 1673703 1597992 1530371 1468415 1411387 1359991 1314055 1272259
55846 1272259 1233820 1198485 1165169 1132548 1100770 1070791 1042340 1014404 987326 962415 939711
$$ packed form
55915B1898098j986920j747797j537802j356493j203720j072138r54779q52200
55907A1186249p65801o91054o23195n63319n13136m69341m28265l91037l59382
55898F381719l31128l04045k79694k59457k40999k22305k05086j90828j77496
55889D170681j63324j49934j38615j27313j14303j01227q9509p7340o2934m7541
55879C098641l2578j7074n30J4762K6687L5493M0845L9844L0530J4600n372k8535
55867C217313n3567p7070r6608j12850j26496j35796j39195j37909j33735j26687
55857B077400j16784j05863r5533q5517p5711o7621o1956n7028n1396m5936m1796
55846A272259l8439l5335l3316l2621l1778k9979k8451k7936k7078k4911k2704
$$ plain form
55835 939711 918037 896985 876999 857769 838552 819960 803482 789324 776441 764470 753845
55824 753845 744248 734846 725885 718100 710668 701665 690618 678836 667269 655857 644906 635174 626468
55811 626468 617995 610157 604195 599986 596200 592926 592209 595395 601553 608960 616653 623978 630074 634453
55797 634453 637035 637334 634612 628957 621048 610869 597997 583181 568250 554242 540938 528387 517538
55784 517538 509098 502897 498486 495219 491770 486812 480277 472854 464472 454751 444795 436861 432016 429510
55770 429510 428553 429202 431283 433889 436331 438246 438603 435931 429886 421459 411565 400660 389621 379449
55756 379449 369940 360222 350708 342889 336928 331196 324595 317707 311117 304376 297313 290783 285183 279602
55742 279602 273320 266905 261030 255378 249590 244232 240013 236987 235127 234679 235278 235760 235509 235112 235108 235064 234445
$$ packed form
55835I39711k1674k1052j9986j9230j9217j8592j6478j4158j2883j1971j0625
55824G53845r597r402q961p785p432r003j1047j1782j1567j1412j0951r732q706
55811F26468q473p838n962m209l786l274p17L186O158P407P693P325O096M379
55797F34453K582K99k722n655p909j0179j2872j4816j4931j4008j3304j2551j0849
55784E17538q440o201m411l267l449m958o535p423q382r721r956p934m845k506
55770D29510r57O49K081K606K442J915L57k672o045q427r894j0905j1039j0172
55756C79449r509r718r514p819n961n732o601o888o590o741p063o530n600n581
55742B79602o282o415n875n652n788n358m219l026j860m48N99M82k51l97mm4o19
$$ plain form
55725 234445 233310 231568 228631 224556 220547 217530 215120 212589 209923 207282 204391 201291 198884 197986
55711 197986 198459 199743 201499 203325 204786 206203 208451 211462 213989 215392 216466 217775 218370 217157 214461
55696 214461 211151 207061 201507 194814 188178 182320 177126 172329 167854 163785 160501 158473 157524 156857 156185
55681 156185 156129 157083 158493 159846 161530 164004 166848 169346 171353 172932 173786 173724 173018 171677 169136 165387
55665 165387 161649 159075 157476 156160 155279 155404 156412 157910 160288 164219 169359 174526 179043 183145 187189
55650 187189 191260 195287 198842 200974 201014 199466 197445 195335 192520 188379 182993 176955 170870 164976 159038
55635 159038 152778 146562 141255 137183 133755 130447 127611 125871 125215 125143 125242 125203 124718 123820 122882 121967 120731
55618 120731 119264 118248 117785 116826 114471 111185 108088 105690 104006 103166 103030 102772 101725 100216 98793
$$ packed form
55725B34445j135j742k937m075m009l017k410k531k666k641k891l100k407q98
55711A97986M73J284J756J826J461J417K248L011K527J403J074J309N95j213k696
55696B14461l310m090n554o693o636n858n194m797m475m069l284k028r49o67o72
55681A56185n6R54J410J353J684K474K844K498K007J579Q54o2p06j341k541l749
55665A65387l738k574j599j316q81J25J008J498K378L931N140N167M517M102M044
55650A87189M071M027L555K132M0j548k021k110k815m141n386o038o085n894n938
55635A59038o260o216n307m072l428l308k836j740o56p2R9l9m85q98r38r15j236
55618A20731j467j016m63r59k355l286l097k398j684q40j36k58j047j509j423
$$ plain form
55603 98793 97207 95053 92904 91734 91516 91413 91081 90820 90645 90167 89426 88972 89067 89458 89873 90135 89971 89361
55585 89361 88921 89235 89976 90337 90185 90044 90081 89935 89597 89729 90992 93513 96960 100693 103971 106586 109221
55568 109221 112729 117165 121960 126697 131116 134662 136828 137856 138391 138478 137519 135167 131689 127514 123048
55553 123048 118849 115385 112518 109750 106919 104204 101635 99075 96576 94181 91577 88551 85656 83783
55539 83783 83178 83413 84162 85293 86325 86632 86214 85628 85138 84553 83885 83441 83190 82695 81811 80850 79913 78655
55521 78655 76904 75033 73544 72684 72556 73162 74191 75128 75646 75733 75605 75782 76922 78992 80872 81454 80980
55504 80980 80590 80732 80878 80802 81094 82119 83274 83798 83688 83394 83067 82552 81726 80438 78394 75494 72156
55487 72156 69095 66846 65544 64960 64703 64580 64731 65285 66018 66668 67341 68228 69085 69520 69638 69806 69906 69506
$$ packed form
55603I8793j586k154k149j170k18j03l32k61j75m78p41m54R5L91M15K62j64o10
55585H9361m40L14P41L61j52j41L7j46l38J32J263K521L447L733L278K615K635
55568A09221L508M436M795M737M419L546K166J028N35Q7r59k352l478m175m466
55553A23048m199l464k867k768k831k715k569k560k499k395k604l026k895j873
55539H3783o05K35P49J131J032L07m18n86m90n85o68m44k51m95q84r61r37j258
55521G8655j751j871j489q60j28O06J029R37N18Q7j28J77J140K070J880N82m74
55504H0980l90J42J46p6K92J025J155N24j10k94l27n15q26j288k044k900l338
55487G2156l061k249j302n84k57j23J51N54P33O50O73Q87Q57M35J18J68J00m00
$$ plain form
55469 69506 68782 68448 68551 68085 66241 63497 61000 59322 58307 57816 57970 58651 59262 59233 58651 58176 58334 58989
55451 58989 59643 60140 60753 61598 62381 62932 63501 64160 64423 63940 63219 63036 63356 63476 63075 62447 61839 61237 60805
55432 60805 60827 61125 61133 60703 60387 60777 61986 63768 65644 66913 67105 66573 66205 66475 67225 68317 69965 72303
55414 72303 75139 78270 81605 84866 87643 89856 91729 93221 93922 93627 92620 91309 89887 88380 86667
55399 86667 84511 81930 79475 77722 76616 75777 75184 74918 74449 72966 70462 67766 65529 63906 63106 63278
55383 63278 63762 63443 62149 60836 60123 59588 58897 58573 58962 59263 58469 56692 54854 53525 52768 52692 53422 54674
55365 54674 55981 57194 58325 59141 59387 59253 59196 59422 59818 60200 60423 60451 60555 61057 61724 61839 61178 60460 60412
55346 60412 60850 61186 61449 62142 63247 64071 64145 63856 63982 64783 65657 65718 64752 63551 63114 63619 64435 65024 65305
$$ packed form
55469F9506p24l34J03m66j844k744k497j678j015m91J54O81O11k9n82m75J58O55
55451E8989O54M97O13Q45P83N51N69O59K63m83p21j83L20J20m01o28o08o02m32
55432F0805K2K98Qm30l16L90J209J782J876J269J92n32l68K70P50J092J648K338
55414G2303K836L131L335L261K777K213J873J492P01k95j007j311j422j507j713
55399H6667k156k581k455j753j106q39n93k66m69j483k504k696k237j623q00J72
55383F3278M84l19j294j313p13n35o91l24L89L01p94j777j838j329p57p6P30J252
55365E4674J307J213J131Q16K46j34n7K26L96L82K23K8J04N02O67J15o61p18m8
55346F0412M38L36K63O93J105Q24P4k89J26Q01Q74O1r66j201m37N05Q16N89K81
$$ plain form
55327 65305 65209 64598 63817 63673 64440 65416 65898 66084 66578 67389 67965 67930 67332 66370 65321 64583 64458 64926 65802
55308 65802 66841 67596 67560 66747 65782 65159 64811 64650 65031 66224 67789 68933 69240 68730 67594 66271 65436
55291 65436 65405 65800 66126 66360 66614 66660 66336 66056 66307 66876 67153 67042 67030 67439 68125 68850 69477 69822 69715 69200
55271 69200 68429 67466 66452 65712 65338 64946 64240 63595 63608 64257 65015 65598 66123 66628 67028 67480 68235 69032 69189
55252 69189 68460 67467 67083 67604 68647 69691 70601 71641 72943 74048 74283 73691 73212 73667 74858 75961 76423
55235 76423 76087 74816 72644 70155 68107 66681 65519 64510 64071 64534 65617 66643 67142 67165 67169 67585 68375
55218 68375 69136 69658 70179 70977 71979 72908 73494 73394 72359 70785 69686 69678 70318 70739 70539 69698 68186 66311
55200 66311 65050 65219 66548 68145 69663 71290 72825 73603 73406 72725 72119 71877 72293 73561 75323 76896
$$ packed form
55327F5305r6o11p81j44P67R76M82J86M94Q11N76l5n98r62j049p38j25M68Q76
55308F5802J039P55l6q13r65o23l48j61L81J193J565J144L07n10j136j323q35
55291F5436l1L95L26K34K54M6l24k80K51N69K77j11j2M09O86P25O27L45j07n15
55271F9200p71r63j014p40l74l92p06o45J3O49P58N83N25N05M00M52P55P97J57
55252F9189p29r93l84N21J043J044R10J040J302J105K35n92m79M55J191J103M62
55235G6423l36j271k172k489k048j426j162j009m39M63J083J026M99K3MM16P90
55218F8375P61N22N21P98J002R29N86j00j035j574j099qO40M21k00q41j512j875
55200F6311j261J69J329J597J518J627J535P78j97o81o06k42M16J268J762J573
$$ plain form
55184 76896 78005 78766 79001 78332 76980 75696 74688 73366 71498 69890 69420 69888 70350 70245 69763 69373 69460
55167 69460 70249 71707 73452 74899 75532 75153 74060 72916 72161 71590 70848 70205 70355 71494 73104 74683
55151 74683 76055 76879 76614 75368 74145 73678 73506 72780 71615 70913 71012 71306 71324 71525 72628 74498 76132
55134 76132 76729 76454 76049 75886 75657 74950 73876 72916 72311 71887 71446 71049 70852 70866 70989 71125 71246 71403 71722
55115 71722 72186 72457 72160 71438 71007 71406 72249 72458 71413 69832 69264 70546 72886 74758 75590 76113 77007
55098 77007 77893 78064 77646 77373 77534 77911 78622 80161 82381 84186 84714 84385 84283 84713 84883 84015 82344 80854
55080 80854 80177 80036 79774 79216 78757 78700 78883 79066 79339 79881 80538 80935 80899 80569 80253 80312 80844 81303 80806 79203
55060 79203 77468 76590 76431 76247 76006 76440 77822 79392 80158 79764 78539 77159 76322 76311 76780 77311 78077 79508
$$ packed form
55184G6896J109P61K35o69j352j284j008j322j868j608m70M68M62j05m82l90Q7
55167F9460P89J458J745J447O33l79j093j144p55n71p42o43J50J139J610J579
55151G4683J372Q24k65j246j223m67j72p26j165p02R9K94J8K01J103J870J634
55134G6132N97k75m05j63k29p07j074r60o05m24m41l97j97J4J23J36J21J57L19
55115G1722M64K71k97p22m31L99Q43K09j045j581n68J282K340J872Q32N23Q94
55098G7007Q86J71m18k73J61L77P11J539K220J805N28l29j02M30J70q68j671j490
55080H0854o77j41k62n58m59n7J83J83K73N42O57L97l6l30l16N9N32M59m97j603
55060G9203j735q78j59j84k41M34J382J570P66l94j225j380q37j1M69N31P66J431
$$ plain form
55042 79508 81426 83034 83778 83660 82783 81266 79690 78852 78836 78911 78675 78720 79814 81861 84032 85564 86130
55025 86130 85779 84810 83563 82170 80692 79467 78902 78917 79040 79106 79342 79710 79792 79511 79339 79498 79579 79301 79068
55006 79068 79302 79787 80145 80539 81317 82273 82832 82838 82738 83090 84140 85659 87003 87631 87734 88007 88605 88834 88207
54987 88207 87286 86984 87471 88273 89038 89590 89567 88760 87656 86968 86652 85991 84691 83354 82748 83070 84056 85368
54969 85368 86718 87868 88717 89254 89389 88981 88055 86867 85837 85515 86407 88507 91081 93186 94451 95158
54953 95158 95684 96092 96293 96317 96341 96533 96952 97569 98408 99596 101111 102497 103125 102853 102172 101651 101519 101870 102836
54934 102836 104219 105370 105864 106124 106956 108640 110952 113910 117981 123440 129970 137069 144496 152085 159379
54919 159379 165788 171091 175493 179018 180992 180434 177094 171883 166034 160025 153651 147011 140854 135778
$$ packed form
55042G9508J918J608P44j18q77j517j576q38j6P5k36M5J094K047K171J532N66
55025H6130l51r69j247j393j478j225n65J5J23O6K36L68Q2k81j72J59Q1k78k33
55006G9068K34M85L58L94P78R56N59Oj00L52J050J519J344O28J03K73N98K29o27
54987H8207r21l02M87Q02P65N52k3q07j104o88l16o61j300j337o06L22R86J312
54969H5368J350J150Q49N37J35m08r26j188j030l22Q92K100K574K105J265P07
54953I5158N26M08K01K4K4J92M19O17Q39J188J515J386O28k72o81n21j32L51R66
54934A02836J383J151M94K60Q32J684K312K958M071N459O530P099P427P589P294
54919A59379O409N303M402L525J974n58l340n211n849o009o374o640o157n076
$$ plain form
54905 135778 131513 127366 123094 119092 115860 113517 111751 110056 108212 106606 105937 106439 107585 108633 109310
54890 109310 109856 110665 112019 113944 116173 118419 120816 123883 127968 132979 138736 145217 152285 159443 166109
54875 166109 171925 176691 180218 182328 182769 181132 177239 171650 165375 158956 152229 145068 137906 131355
54861 131355 125794 121431 118244 115710 113205 110879 109515 109273 109239 108535 107132 105232 102758 100018 98093
54846 98093 97735 98405 99061 99310 99145 98281 96636 94859 93436 91838 89542 87327 86365 86412 86236 85643 85641 86553
54828 86553 87367 87277 86679 86183 85742 85333 85536 86674 88023 88602 88351 87961 87862 87938 88033 88277 88921 90017 91246
54809 91246 92115 92465 92696 93262 94154 95174 96405 97862 98978 99128 98561 98136 98220 98562 99182 100434 102096
54792 102096 103275 103549 103432 103434 103311 102701 101900 101641 102419 104177 106222 107448 107309 106722 107312 109550 112311
$$ packed form
54905A35778m265m147m272m002l232k343j766j695j844j606o69N02J146J048O77
54890A09310N46Q09J354J925K229K246K397L067M085N011N757O481P068P158O666
54875A66109N816M766L527K110M41j637l893n589o275o419o727p161p162o551
54861A31355n561m363l187k534k505k326j364k42l4p04j403j900k474k740j925
54846I8093l58O70O56K49j65q64j645j777j423j598k296k215r62M7j76n93kR12
54828H6553Q14r0n98m96m41m09K03J138J349N79k51l90r9P6R5K44O44J096J229
54809I1246Q69L50K31N66Q92J020J231J457J116J50n67m25Q4L42O20J252J662
54792A02096J179K74j17Kj23o10q01k59P78J758K045J226j39n87N90K238K761
$$ plain form
54775 112311 114443 116018 117810 120371 124044 129048 135086 141533 148412 156362 165164 173195 179085 183122
54761 183122 186172 187973 187569 184922 180938 176072 170052 163061 156245 150698 146469 142811 139043 135064
54747 135064 131306 128276 126026 124173 122516 121266 120472 119713 118824 118454 119285 120942 122275 122662 122555 122909
54731 122909 124471 127383 131031 134458 137361 140473 144547 149361 154295 159438 165252 171320 176376 179618
54717 179618 181196 181252 179333 175148 169299 162843 156450 150266 144263 138490 133185 128718 125205 122228 119368
54702 119368 116966 115782 115806 115992 115435 114382 113728 113896 114550 115107 115148 114491 113209 111564 109806 108106 106673
54685 106673 105707 105183 104929 104953 105327 105717 105475 104471 103384 102827 102531 101827 100680 99679 99154 98818 98328 97750
54667 97750 97344 97268 97695 98840 100556 102074 102519 101738 100438 99424 98860 98324 97510 96672 96313 96541 96879 96726
$$ packed form
54775A12311K132J575J792K561L673N004O038O447O879P950Q802Q031N890M037
54761A83122L050J801m04k647l984m866o020o991o816n547m229l658l768l979
54747A35064l758l030k250j853j657j250p94p59q89l70Q31J657J333L87j07L54
54731A22909J562K912L648L427K903L112M074M814M934N143N814O068N056L242
54717A79618J578N6j919m185n849o456o393o184o003n773n305m467l513k977k860
54702A19368k402j184K4J86n57j053o54J68O54N57M1o57j282j645j758j700j433
54685A06673r66n24k54K4L74L90k42j004j087n57k96p04j147j001n25l36m90n78
54667I7750m06p6M27J145J716J518M45p81j300j014n64n36q14q38l59K28L38j53
$$ plain form
54649 96726 95890 94619 93265 92117 91472 91599 92523 94023 95925 98208 100635 102546 103373 103327 103228 103572 104126
54632 104126 104473 104576 104556 104285 103591 102645 101777 101016 100174 99294 98638 98320 98284 98539 99039 99401 99241 98833 98939
54613 98939 99845 101005 101767 102012 101863 101277 100295 99361 99010 99381 100309 101597 102958 103983 104511 104822 105177 105412
54595 105412 105304 105045 104945 104830 104253 103217 102212 101555 101111 100722 100549 100810 101468 102300 103126 103895 104686 105658
54577 105658 106866 108086 108913 109062 108508 107461 106344 105698 105872 106688 107491 107603 106854 105796 105326 105839 106762
54560 106762 107187 106992 106914 107401 107972 108072 108070 108696 109763 110186 109352 107906 106987 107185 108418 110384 112689 114731
54542 114731 115934 116230 116169 116414 117137 117982 118586 119001 119512 120210 121014 121928 122840 123124 122066 119890 117821 116710
54524 116710 116099 115107 113770 112849 112610 112561 112360 112255 112461 112656 112342 111390 110061 108732 107656 106792 105892 104959
$$ packed form
54649I6726q36j271j354j148o45J27R24J500J902K283K427J911Q27m6r9L44N54
54632A04126L47J03k0k71o94r46q68p61q42q80o56l18l6K55N00L62j60m08J06
54613I8939R06J160P62K45j49n86r82r34l51L71R28J288J361J025N28L11L55K35
54595A05412j08k59j00j15n77j036j005o57m44l89j73K61O58Q32Q26P69P91R72
54577A05658J208J220Q27J49n54j047j117o46J74Q16Q03J12p49j058m70N13R23
54560A06762M25j95p8M87N71J00kO26J067M23q34j446r19J98J233J966K305K042
54542A14731J203K96o1K45P23Q45O04M15N11O98Q04R14R12K84j058k176k069j111
54524A16710o11r92j337r21k39m9k01j05K06J95l14r52j329j329j076q64r00r33
$$ plain form
54506 104959 104466 104780 105592 106335 107032 108144 109655 110902 111440 111520 111572 111654 111633 111468 111099 110462 109792 109565 109927
54487 109927 110443 110577 110140 109206 107972 106825 106210 106266 106874 108073 109982 112239 114083 115242 116235 117504
54471 117504 118719 119369 119626 120111 121056 122143 122983 123361 123138 122384 121608 121509 122405 123974 125493 126267 126040 125136
54453 125136 124089 123030 121668 119958 118439 117642 117418 117161 116490 115487 114425 113593 113226 113351 113813 114526
54437 114526 115495 116494 117051 117030 116859 116931 117134 117326 117846 119016 120441 121426 121878 122220 122508 122379 121852 121525 121791
54418 121791 122423 123111 123865 124568 124707 124013 123011 122500 122674 123130 123533 123887 124266 124735 125524 126924 128862 130784
54400 130784 132078 132544 132434 132221 132356 133063 134160 135103 135329 134680 133516 132435 131876 131930 132481 133399 134535
54383 134535 135586 136130 135946 135263 134611 134368 134458 134476 134064 133210 132287 131865 132325 133473 134565 134918 134584 134302
$$ packed form
54506A04959m93L14Q12P43O97J112J511J247N38Q0N2Q2k1j65l69o37o70k27L62
54487A09927N16J34m37r34j234j147o15N6O08J199J909K257J844J159R93J269
54471A17504J215O50K57M85R45J087Q40L78k23p54p76r9Q96J569J519P74k27r04
54453A25136j047j059j362j710j519p97k24k57o71j003j062q32l67J25M62P13
54437A14526R69R99N57k1j71P2K03J92N20J170J425R85M52L42K88j29n27l27K66
54418A21791O32O88P54P03J39o94j002n11J74M56M03L54L79M69P89J400J938J922
54400A30784J294M66j10k13J35P07J097R43K26o49j164j081n59N4N51R18J136
54383A34535J051N44j84o83o52k43R0J8m12q54r23m22M60J148J092L53l34k82
$$ plain form
54365 134302 134700 135681 136698 137479 138243 139254 140448 141561 142417 143013 143488 144147 145385 147395 149923 152381
54349 152381 154266 155514 156482 157501 158425 158707 158018 156687 155330 154077 152427 149932 146842 144001 142189
54334 142189 141581 141724 141969 141972 141745 141236 140134 138323 136365 135155 135075 135719 136345 136329 135384 133895 132986 133573
54316 133573 135148 136035 135160 133046 130885 129252 128190 127890 128471 129411 129951 129968 129883 129862 129686 129331 128972 128433
54298 128433 127282 125616 124128 123215 122526 121641 120738 120329 120680 121699 123028 124066 124304 123927 123772 124388 125469
54281 125469 126415 127079 127645 128116 128384 128578 128903 129243 129334 129235 129240 129359 129298 129006 128880 129304 130156 130921 131177 130974
54261 130974 130801 131153 132097 133328 134681 136299 138116 139515 139924 139592 139304 139404 139564 139467 139150 138543 137326
54244 137326 135559 133954 133064 132576 131864 130939 130302 130104 130022 129908 129912 129908 129444 128490 127734 127771 128359 128800 128834 128778 128981
$$ packed form
54365A34302L98R81J017P81P64J011J194J113Q56N96M75O59J238K010K528K458
54349A52381J885J248R68J019R24K82o89j331j357j253j650k495l090k841j812
54334A42189o08J43K45Lk27n09j102j811j958j210q0O44O26j6r45j489r09N87
54316A33573J575Q87q75k114k161j633j062l00N81R40N40J7q5k1j76l55l59n39
54298A28433j151j666j488r13o89q85r03m09L51J019J329J038K38l77j55O16J081
54281A25469R46O64N66M71K68J94L25L40R1r9NJ19o1k92j26M24Q52P65K56k03
54261A30974j73L52R44J231J353J618J817J399M09l32k88J00J60r7l17o07j217
54244A37326j767j605q90m88p12r25o37j98q2j14Mmm64r54p56L7N88M41L4n6K03
$$ plain form
54223 128981 129445 129902 130067 129905 129814 130341 131496 132512 132616 131926 131269 131191 131482 131654 131543 131308 131066 130643 129660
54204 129660 127962 126073 124998 125301 126472 127596 128493 129684 131231 132276 132074 130988 130020 129621 129496 129402
54188 129402 129615 130442 131623 132476 132532 131916 131119 130494 130005 129454 128852 128412 128223 128104 127889 127737 128070 129218
54170 129218 131104 133171 134638 135005 134375 133296 132312 131716 131536 131523 131313 130934 130995 131930 133087 133139 131566 129255
54152 129255 127461 126692 126786 127431 128134 128194 127378 126314 125705 125441 125082 124858 125453 126890 128384 129317 129689 129620
54134 129620 129178 128889 129620 131516 133551 134608 134656 134488 134653 135065 135452 135760 136172 136902 137875 138574 138513 137980
54116 137980 137931 138889 140266 141058 140886 140057 138987 137999 137403 137275 137298 137243 137374 137911 138398 138232 137711 137828 139006
54097 139006 140752 142613 144653 146659 147731 147334 146235 145686 145999 146594 147160 147972 149105 150086 150542 150627 150624
$$ packed form
54223A28981M64M57J65j62r1N27J155J016J04o90o57p8K91J72j11k35k42m23r83
54204A29660j698j889j075L03J171J124Q97J191J547J045k02j086r68l99j25r4
54188A29402K13Q27J181Q53N6o16p97o25m89n51o02m40j89j19k15j52L33J148
54170A29218J886K067J467L67o30j079r84n96j80j3k10l79O1R35J157N2j573k311
54152A29255j794p69R4O45P03O0q16j064o09k64l59k24N95J437J494R33L72o9
54134A29620m42k89P31J896K035J057M8j68J65M12L87L08M12P30R73O99o1n33
54116A37980m9R58J377P92j72q29j070r88n96j28K3n5J31N37M87j66n21J17J178
54097A39006J746J861K040K006J072l97j099n49L13N95N66Q12J133R81M56Q5l
$$ plain form
54080 150624 150656 151031 152324 154664 157248 159052 159962 161000 163478 168036 174229 180845 186826 192085 197246
54065 197246 202428 206651 208744 208482 206418 202926 198118 192604 187576 183879 181381 179450 177641 175802
54051 175802 173980 172545 172064 172668 173724 174361 174211 173543 172927 172978 174131 176347 179139 182058 185028 188102
54035 188102 191196 194311 197757 201828 206395 211047 215466 219468 222920 225944 228990 232382 235931 239315
54021 239315 242634 246181 249873 253448 257064 261104 265321 268786 270961 272326 273681 275235 276750 278198
54007 278198 279756 281240 282007 281520 279765 277045 273589 269433 264577 259079 253109 247022 241408 236878 233570
53992 233570 230892 227959 224392 220607 217211 214353 211747 209165 206605 204080 201551 199063 196712 194475
53978 194475 192299 190394 189113 188438 187787 186589 184945 183489 182591 181874 180733 179246 178282 178513 179467 179986
$$ packed form
54080A50624L2L75J293K340K584J804R10J038K478M558O193O616N981N259N161
54065A97246N182M223K093k62k064l492m808n514n028l697k498j931j809j839
54051A75802j822j435m81O04J056O37j50o68o16N1J153K216K792K919K970L074
54035A88102L094L115L446M071M567M652M419M002L452L024L046L392L549L384
54021B39315L319L547L692L575L616M040M217L465K175J365J355J554J515J448
54007B78198J558J484P67m87j755k720l456m156m856n498n970o087n614m530l308
53992B33570k678k933l567l785l396k858k606k582k560k525k529k488k351k237
53978A94475k176j905j281o75o51j198j644j456q98p17j141j487r64K31R54N19
$$ plain form
53962 179986 179595 179043 179325 180558 182082 183302 184051 184398 184608 185164 186381 187984 189435 190627 191951 193715
53946 193715 195866 198208 200520 202514 204094 205632 207616 210094 212868 216178 220528 225784 231081 235840
53932 235840 240265 244531 248152 250735 252882 255718 259647 264115 268518 272893 277745 283562 290566 298705
53918 298705 307835 317992 329277 341326 353066 363236 371053 376223 378662 378616 376942 374839 373201
53905 373201 372374 372403 373175 374318 375319 375875 376011 375818 375292 374411 373188 371570 369456 366897 364159 361508
53889 361508 358993 356491 353873 351037 347810 343944 339270 333894 328143 322280 316321 310222 304172 298580
53875 298580 293759 289698 286125 282638 278883 274784 270594 266561 262633 258691 254924 251632 248721 245791
53861 245791 242741 239787 236823 233328 229193 225161 222008 219603 217247 214645 212014 209405 206547 203444
$$ packed form
53962A79986l91n52K82J233J524J220P49L47K10N56J217J603J451J192J324J764
53946A93715K151K342K312J994J580J538J984K478K774L310M350N256N297M759
53932B35840M425M266L621K583K147K836L929M468M403M375M852N817P004Q139
53918B98705R130J0157J1285J2049J1740J0170P817N170K439m6j674k103j638
53905C73201q27K9P72J143J001N56J36j93n26q81j223j618k114k559k738k651
53889C61508k515k502k618k836l227l866m674n376n751n863n959o099o050n592
53875B98580m821m061l573l487l755m099m190m033l928l942l767l292k911k930
53861B45791l050k954k964l495m135m032l153k405k356k602k631k609k858l103
$$ plain form
53847 203444 200705 199007 198453 198618 199034 199478 199794 199658 198743 197226 195869 195277 195147 194660 193677 193053 193508
53830 193508 194604 195202 194663 193248 191562 190012 188698 187518 186400 185571 185426 186008 186914 187890 189117 190578
53814 190578 191547 191258 189819 187972 186200 184673 183808 184137 185549 187352 189205 191423 194261 197469 200827
53799 200827 204542 208809 213387 217990 222778 228047 233590 238750 243129 247044 251213 255973 260829 264895
53785 264895 267841 270147 272218 273623 273742 272936 272334 272396 272436 271808 270860 270206 269615 268238 265713 262459 259001
53768 259001 255531 252087 248693 245226 241503 237648 234160 231424 229295 227180 224504 221078 217160 213314
53754 213314 210203 208330 207710 207655 207121 205614 203681 202215 201285 200037 197848 195157 192922 191565 190808 190307
53738 190307 190004 189854 189603 188967 187977 187037 186703 187300 188657 190225 191499 192314 192734 192852 192811 192918 193513 194689
$$ packed form
53847B03444k739j698n54J65M16M44L16j36r15j517j357n92j30m87r83o24M55
53830A93508J096N98n39j415j686j550j314j180j118q29j45N82R06R76J227J461
53814A90578R69k89j439j847j772j527q65L29J412J803J853K218K838L208L358
53799B00827L715M267M578M603M788N269N543N160M379L915M169M760M856M066
53785B64895K946K306K071J405J19q06o02O2M0o28r48o54n91j377k525l254l458
53768B59001l470l444l394l467l723l855l488k736k129k115k676l426l918l846
53754B13314l111j873o20n5n34j507j933j466r30j248k189k691k235j357p57n01
53738A90307l03j50k51o36r90r40l34N97J357J568J274Q15M20J18m1J07N95J176
$$ plain form
53720 194689 196172 197469 198186 198332 198321 198518 198722 198332 197096 195537 194443 194110 194221 194296 194063 193481 192772 192439
53702 192439 193055 194844 197503 200421 203010 204923 206176 207169 208519 210662 213515 216520 219057 220815 221817
53687 221817 222186 222030 221542 221009 220604 220271 219927 219665 219572 219478 219143 218711 218752 219729 221475 223244 224215 224025 222918
53668 222918 221400 219738 217948 216271 215369 215736 217019 218220 218543 217875 216638 215446 214814 214823 215107 215394 215880
53651 215880 216767 217664 217945 217551 216865 215953 214672 213534 213557 214962 216757 218000 218825 219757 220732 221434 221981
53634 221981 222558 222751 222065 220872 220073 219915 219858 219576 219441 219930 221066 222571 224172 225729 227386 229568 232505
53617 232505 235865 239235 242726 246572 250317 253126 254904 256389 258059 259718 261382 263784 267458 271866
53603 271866 275988 279465 282659 285917 289258 292575 295656 298132 299812 301018 302223 303495 304688 306090
$$ packed form
53720A94689J483J297P17J46j1J97K04l90j236j559j094l33J11P5k33n82p09l33
53702A92439O16J789K659K918K589J913J253R93J350K143K853L005K537J758J002
53687B21817L69j56m88n33m05l33l44k62r3r4l35m32M1R77J746J769R71j90j107
53668B22918j518j662j790j677r02L67J283J201L23o68j237j192o32RK84K87M86
53651B15880Q87Q97K81l94o86r12j281j138K3J405J795J243Q25R32R75P02N47
53634B21981N77J93o86j193p99j58n7k82j35M89J136J505J601J557J657K182K937
53617B32505L360L370L491L846L745K809J778J485J670J659J664K402L674M408
53603B71866M122L477L194L258L341L317L081K476J680J206J205J272J193J402
$$ plain form
53589 306090 308313 311395 314436 316474 317508 318393 319794 321488 322730 323014 322322 320784 318426 315367 311985
53574 311985 308690 305583 302573 299777 297587 296293 295829 295870 295965 295583 294334 292370 290404 289194 289023 289721
53558 289721 290977 292483 293924 295048 295723 295853 295332 294246 293055 292359 292420 292962 293526 294030 294899 296617 299142
53541 299142 301880 304294 306377 308407 310383 312016 313236 314360 315673 317208 319140 322094 326621 332441
53527 332441 338531 344055 349003 353919 359209 364949 371211 378296 386507 395777 405690 415839 426041 436214
53513 436214 446272 456414 467349 479942 494484 510449 527020 543762 560747 578227 596325
53502 596325 614922 633660 651986 669366 685594 701000 716288 731989 747987 763629 778421
53491 778421 792557 806713 821435 836789 852397 867619 881928 895416 908897 923153 938122
$$ packed form
53589C06090K223L082L041K038J034Q85J401J694J242K84o92j538k358l059l382
53574C11985l295l107l010k796k190j294m64M1R5l82j249j964j966j210j71O98
53558B89721J256J506J441J124O75J30n21j086j191o96O1N42N64N04Q69J718K525
53541B99142K738K414K083K030J976J633J220J124J313J535J932K954M527N820
53527C32441O090N524M948M916N290N740O262P085Q211R270R913J0149J0202J0173
53513D36214J0058J0142J0935J2593J4542J5965J6571J6742J6985J7480J8098
53502E96325J8597J8738J8326J7380J6228J5406J5288J5701J5998J5642J4792
53491G78421J4136J4156J4722J5354J5608J5222J4309J3488J3481J4256J4969
$$ plain form
53480 938122 953062 967411 981086 994048 1006150 1017525 1028555 1039187 1048766 1056898 1064007 1070605
53468 1070605 1076422 1080747 1083328 1084330 1083659 1080990 1076412 1070352 1062838 1053487 1042435 1030617 1018781
53455 1018781 1006680 993630 979470 964552 949073 932947 916216 899105 881706 864048 846528
53444 846528 829918 814703 800607 786912 773132 759284 745692 732699 720573 709566 699950 691891
53432 691891 685188 679243 673475 667877 663086 659853 658502 658877 660649 663537 667310 671793 676990 683194
53418 683194 690878 700339 711389 723460 736105 749344 763432 778389 794022 810381 827850 846653
53406 846653 866542 887295 909239 932841 957874 983555 1009661 1037005 1066463 1097890 1130463
53395 1130463 1163939 1199020 1236418 1275947 1316671 1357664 1398447 1439035 1479855 1521427 1563761
$$ packed form
53480I38122J4940J4349J3675J2962J2102J1375J1030J0632R579Q132P109O598
53468A070605N817M325K581J002o71k669m578o060p514r351j1052j1818j1836
53455A018781j2101j3050j4160j4918j5479j6126j6731j7111j7399j7658j7520
53444H46528j6610j5215j4096j3695j3780j3848j3592j2993j2126j1007r616q059
53432F91891o703n945n768n598m791l233j351L75J772K888L773M483N197O204
53418F83194P684R461J1050J2071J2645J3239J4088J4957J5633J6359J7469J8803
53406H46653J9889K0753K1944K3602K5033K5681K6106K7344K9458L1427L2573
53395A130463L3476L5081L7398L9529M0724M0993M0783M0588M0820M1572M2334
$$ plain form
53384 1563761 1606107 1647599 1688160 1728436 1768705 1808151 1845495 1880186 1912618 1943154 1971348
53373 1971348 1996354 2017938 2036692 2053199 2067227 2077951 2084850 2088160 2088318 2085094 2077482 2064539
53361 2064539 2046226 2023257 1996244 1965302 1930609 1892969 1853409 1812328 1769475 1724853 1679314
53350 1679314 1634035 1589665 1546210 1503579 1461989 1421779 1382985 1345178 1307793 1270752 1234639
53339 1234639 1200015 1166564 1133319 1099897 1067144 1036243 1007456 980120 953730 928575 905294
53328 905294 884156 864883 847042 830538 815818 803486 793627 785577 778472 771782 765227 758590 752014
53315 752014 746151 741514 737859 734722 732337 731384 731907 733235 735016 737605 741204 745423 750115 756034 764066
53300 764066 774083 785048 796046 806933 818234 830775 845142 861217 878457 896758 916588
$$ packed form
53384A563761M2346M1492M0561M0276M0269L9446L7344L4691L2432L0536K8194
53373A971348K5006K1584J8754J6507J4028J0724O899L310J58l224p612j2943
53361B064539j8313k2969k7013l0942l4693l7640l9560m1081m2853m4622m5539
53350A679314m5279m4370m3455m2631m1590m0210l8794l7807l7385l7041l6113
53339A234639l4624l3451l3245l3422l2753l0901k8787k7336k6390k5155k3281
53328I05294k1138j9273j7841j6504j4720j2332r859q050p105o690o555o637o576
53315G52014n863m637l655l137k385r53N23J328J781K589L599M219M692N919Q032
53300G64066J0017J0965J0998J0887J1301J2541J4367J6075J7240J8301J9830
$$ plain form
53289 916588 937975 959950 981525 1002835 1024643 1047041 1069349 1091031 1111970 1131790 1149712
53278 1149712 1165310 1178920 1191098 1202011 1211439 1219006 1224307 1227201 1228007 1227092 1224235 1218881 1211097
53265 1211097 1201785 1191741 1180899 1168729 1155013 1139916 1123484 1105421 1085300 1063026 1039232
53254 1039232 1015118 991519 968028 943504 917552 891155 865603 841289 817803 794775 772144
53243 772144 749915 728177 707279 687495 668521 649633 630407 611058 592045 573562 555417
53232 555417 537218 518780 500534 483507 468572 455716 444201 433467 423644 415143 408025 401891
53220 401891 396206 390583 384827 378882 372752 366404 359779 352904 345942 339034 332155 325230 318426 312210
53206 312210 306978 302655 298747 294844 290941 287254 283861 280689 277696 274902 272264 269718 267311 265091
$$ packed form
53289I16588K1387K1975K1575K1310K1808K2398K2308K1682K0939J9820J7922
53278A149712J5598J3610J2178J0913R428P567N301K894Q06r15k857n354p784
53265A211097r312j0044j0842j2170j3716j5097j6432j8063k0121k2274k3794
53254A039232k4114k3599k3491k4524k5952k6397k5552k4314k3486k3028k2631
53243G72144k2229k1738k0898j9784j8974j8888j9226j9349j9013j8483j8145
53232E55417j8199j8438j8246j7027j4935j2856j1515j0734r823q501p118o134
53220D01891n685n623n756n945o130o348o625o875o962o908o879o925o804o216
53206C12210n232m323l908l903l903l687l393l172k993k794k638k546k407k220
$$ plain form
53192 265091 262869 260357 257607 255109 253289 252001 250708 249092 247390 246004 244849 243224 240540 237154
53178 237154 234255 232744 232423 232379 231930 230932 229449 227598 225632 223760 221891 219898 218058 216758 215860 214906
53162 214906 213944 213474 213431 212984 211715 210288 209429 208865 207932 206758 206041 205924 205902 205746 205725 205846 205616 204777 203750
53143 203750 203069 202768 202553 202294 202115 202162 202412 202590 202326 201606 200987 201089 201977 203336 205084 207346 209904 212203
53125 212203 213941 215161 215730 215316 214099 212940 212540 212796 213218 213592 213997 214553 215440 216782 218250 219184 219386
53108 219386 219367 219504 219416 218695 217773 217429 217699 217889 217493 216472 214793 212449 209988 208298 207643 207393 206914 206209
53090 206209 205430 204263 202284 199691 197260 195668 195041 195068 195283 195327 195203 195294 195964 197080 198020 198235 197811 197416
53072 197416 197626 198320 198890 199037 199054 199211 199265 198930 198545 198626 198884 198348 196578 194184 191931 189940 188083 186579
$$ packed form
53192B65091k222k512k750k498j820j288j293j616j702j386j155j625k684l386
53178B37154k899j511l21m4m49r98j483j851j966j872j869j993j840j300q98r54
53162B14906r62m70m3m47j269j427q59n64r33j174p17j17k2j56k1J21k30q39j027
53143B03750o81l01k15k59j79M7K50J78k64p20o19J02Q88J359J748K262K558K299
53125B12203J738J220N69m14j217j159m00K56M22L74M05N56Q87J342J468R34K02
53108B19386j9J37q8p21r22l44K70J90l96j021j679k344k461j690o55k50m79p05
53090B06209p79j167j979k593k431j592o27K7K15M4j24R1O70J116R40K15m24l95
53072A97416K10O94N70J47J7J57N4l35l85Q1K58n36j770k394k253j991j857j504
$$ plain form
53054 186579 185643 184968 184155 183373 183023 182998 182882 182766 183129 183946 184661 185215 186363 188555 191071 192792 193484 193731
53036 193731 193810 193243 191536 188946 186373 184640 183919 183680 183155 181967 180344 178709 177191 175693 174334 173581
53020 173581 173929 175484 177770 179923 181265 181888 182455 183312 184072 184331 184426 184907 185544 185556 184880 184400 184676 185111
53002 185111 184868 184038 183307 182862 182361 181781 181527 181642 181594 181089 180541 180391 180375 179916 178977 178078 177516 177006 176232
52983 176232 175505 175590 176883 178928 180878 182377 183835 185756 187987 189787 190607 190542 190065 189527 189011 188475 187924
52966 187924 187515 187554 188284 189596 191008 191985 192292 192049 191601 191333 191450 191846 192189 192138 191476 190149 188356 186509
52948 186509 184918 183501 182000 180454 179230 178601 178531 178884 179514 180092 180161 179597 178787 178149 177650 176953 175874
52931 175874 174554 173358 172745 172979 173736 174228 173983 173331 172887 172758 172567 172126 171715 171743 172386 173485 174534 174867
$$ packed form
53054A86579r36o75q13p82l50k5j16j16L63Q17P15N54J148K192K516J721O92K47
53036A93731P9n67j707k590k573j733p21k39n25j188j623j635j518j498j359p53
53020A73581L48J555K286K153J342O23N67Q57P60K59R5M81O37J2o76m80K76M35
53002A85111k43q30p31m45n01n80k54J15m8n05n48j50j6m59r39q99n62n10p74
52983A76232p27Q5J293K045J950J499J458J921K231J800Q20o5m77n38n16n36n51
52966A87924m09L9P30J312J412R77L07k43m48k68J17L96L43n1o62j327j793j847
52948A86509j591j417j501j546j224o29p0L53O30N78O9n64q10o38m99o97j079
52931A75874j320j196o13K34P57M92k45o52m44j29j91m41m11K8O43J099J049L33
$$ plain form
52913 174867 174198 173001 172117 171971 172350 172878 173408 173981 174619 175214 175482 175189 174640 174733 176092 178224 179906 180467
52895 180467 180328 180296 180749 181562 182430 183102 183528 183882 184166 183939 182879 181560 181047 181573 182226 182212 181755 181385 180974
52876 180974 180122 179030 178266 177947 177835 178049 179032 180816 182972 185217 187522 189673 191386 192880 194632 196471
52860 196471 197738 198622 200460 204070 208361 211366 212361 212241 211986 211589 210521 208574 205905 202757 199514
52845 199514 196742 194778 193389 192070 190571 188941 187195 185276 183315 181624 180343 179264 178175 177227
52831 177227 176798 177039 177673 178250 178478 178357 178144 178202 178722 179481 180048 180258 180379 180660 180922 180836 180567 180820 182140
52812 182140 184325 186695 188818 190859 193228 195965 198460 199834 199714 198597 197287 195964 194041 191046
52798 191046 187348 183812 180953 178783 177265 176435 175958 175132 173655 172152 171516 171868 172480 172641 172223 171389
$$ packed form
52913A74867o69j197q84j46L79N28N30N73O38N95K68k93n49R3J359K132J682N61
52895A80467j39l2M53Q13Q68O72M26L54K84k27j060j319n13N26O53j4m57l70m11
52876A80974q52j092p64l19j12K14R83J784K156K245K305K151J713J494J752J839
52860A96471J267Q84J838L610M291L005R95j20k55l97j068j947k669l148l243
52845A99514k772j964j389j319j499j630j746j919j961j691j281j079j089r48
52831A77227m29K41O34N77K28j21k13N8N20P59N67K10J21K81K62q6k69K53J320
52812A82140K185K370K123K041K369K737K495J374j20j117j310j323j923k995
52798A91046l698l536k859k170j518q30m77q26j477j503o36L52O12J61m18q34
$$ plain form
52782 171389 170280 169194 168662 168921 169475 169654 169557 169958 171120 172196 172203 171303 170633 170924 171829 172692 173476 174552
52764 174552 175945 177325 178601 179988 181410 182361 182597 182521 182535 182367 181535 180244 179220 178669 178032 176997 176242
52747 176242 176763 178710 181223 183252 184285 184484 184437 184714 185394 186053 186350 186428 186569 186738 186847 187202 188136 189319
52729 189319 190070 190380 191032 192488 194220 195453 196060 196301 196092 195107 193441 191617 189953 188370 186832 185596
52713 185596 184834 184277 183445 182140 180610 179242 178159 177171 176150 175380 175281 175780 176255 176301 176283 176828 177932 178965
52695 178965 179484 179677 179923 180242 180409 180408 180541 180998 181457 181281 180253 179032 178671 179652 181602 183836 185811 186971
52677 186971 186818 185585 184447 184467 185496 186571 187167 187436 187438 186916 186021 185488 185691 186023 185669 184694 184000 184419
52659 184419 186119 188657 191222 192984 193621 193582 193734 194740 196771 199619 202874 206064 208712 210314 210433
$$ packed form
52782A71389j109j086n32K59N54J79r7M01J162J076Pr00o70K91R05Q63P84J076
52764A74552J393J380J276J387J422R51K36p6J4j68q32j291j024n51o37j035p55
52747A76242N21J947K513K029J033J99m7K77O80O59K97P8J41J69J09L55R34J183
52729A89319P51L10O52J456J732J233O07K41k09r85j666j824j664j583j538j236
52713A85596p62n57q32j305j530j368j083r88j021p70r9M99M75M6j8N45J104J033
52695A78965N19J93K46L19J67jJ33M57M59j76j028j221l61R81J950K234J975J160
52677A86971j53j233j138K0J029J075N96K69Kn22q95n33K03L32l54r75o94M19
52659A84419J700K538K565J762O37l9J52J006K031K848L255L190K648J602J19
$$ plain form
52644 210433 209130 207250 205867 205241 204657 203454 201861 200566 199806 199316 198955 198921 199378 200202 201118 201869 202273
52627 202273 202332 202288 202384 202616 202802 202764 202282 201091 199218 197214 195715 194805 194083 193354 192849 192707 192576 191993 191032
52608 191032 190316 190373 191074 191811 192164 192253 192379 192509 192396 192111 192046 192247 192168 191386 190260 189508 189349 189486 189801 190543
52588 190543 191826 193367 194811 196002 196923 197713 198822 200660 202882 204410 204589 204084 204228 205509 207082
52573 207082 207810 207463 206647 205855 205017 204027 203265 203215 203699 203927 203376 202275 201115 200096 199296 198983 199293 199819
52555 199819 200029 200032 200472 201622 203002 203987 204405 204407 204093 203527 202844 202076 201058 199734 198527 198117 198753 199855
52537 199855 200434 200016 199157 198842 199349 199993 200110 199948 200211 201080 202212 203463 204928 206323 207071 207159 207215 207459
52519 207459 207307 206439 205610 205724 206615 207462 208144 209410 211799 215103 218918 223002 226925 229954 231686 232459
$$ packed form
52644B10433j303j880j383o26n84j203j593j295p60m90l61l4M57Q24R16P51M04
52627B02273N9m4R6K32J86l8m82j191j873k004j499r10p22p29n05j42j31n83r61
52608A91032p16N7P01P37L53Q9J26J30j13k85o5K01p9p82j126p52j59J37L15P42
52588A90543J283J541J444J191R21P90J109J838K222J528J79n05J44J281J573
52573B07082P28l47q16p92q38r90p62n0M84K28n51j101j160j019q00l13L10N26
52555A99819K10LM40J150J380R85M18Kl14n66o83p68j018j324j207m10O36J102
52537A99855N79m18q59l15N07O44J17j62K63Q69J132J251J465J395P48Q8N6K44
52519B07459j52q68q29J14Q91Q47O82J266K389L304L815M084L923L029J732P73
$$ plain form
52503 232459 232858 233008 232564 231202 228968 226338 224049 222660 222097 221760 221168 220342 219483 218578 217558 216639 216165
52486 216165 216177 216342 216338 216144 215969 216113 216933 218669 221100 223468 225007 225635 225990 226685 227691 228541 229022 229443
52468 229443 230178 231216 232283 233227 234134 235168 236435 237898 239324 240366 240925 241302 241822 242293 242103 240835
52452 240835 238621 235840 232727 229435 226304 223808 222191 221283 220733 220352 220151 220127 220162 220193 220315 220538 220520 219841
52434 219841 218585 217383 216710 216404 216079 215784 215820 216025 215739 214625 213161 212065 211492 211128 210928 211364 212779
52417 212779 214736 216281 216838 216726 216693 217086 217695 218371 219472 221484 224429 227943 231801 235976 240206 244006
52401 244006 247368 251100 256045 262071 268131 273219 276881 278879 278876 276728 272854 267987 262712 257516 253086
52386 253086 250027 248123 246310 243820 241110 239285 238670 238477 238000 237614 238160 239686 241351 242517 243378 244427
$$ packed form
52503B32459L99J50m44j362k234k630k289j389n63l37n92q26q59r05j020r19m74
52486B16165J2J65mj94j75J44Q20J736K431K368J539O28L55O95J006Q50M81M21
52468B29443P35J038J067R44R07J034J267J463J426J042N59L77N20M71j90j268
52452B40835k214k781l113l292l131k496j617r08n50l81k01k4L5L1J22K23j8o79
52434B19841j256j202o73l06l25k95L6K05k86j114j464j096n73l64k00M36J415
52417B12779J957J545N57j12l3L93O09O76J101K012K945L514L858M175M230L800
52401B44006L362L732M945O026O060N088L662J998lk148l874m867n275n196m430
52386B53086l059j904j813k490k710j825o15j93m77l86N46J526J665J166Q61J049
$$ plain form
52370 244427 245767 247275 249051 251264 253678 255765 257300 258478 259352 259549 258862 257862 257464 257820 258042 257298
52354 257298 255922 255100 255508 256681 257818 258793 260000 261444 262524 262830 262762 263085 264041 265192 266086 266791 267645
52337 267645 268656 269376 269491 269374 269892 271615 274333 277429 280570 283879 287531 291464 295578 300041 305201
52322 305201 311203 317793 324436 330583 335827 339972 343067 345408 347389 349265 351081 352906 355082 358054
52308 358054 361963 366567 371588 376865 382069 386694 390679 394825 400122 406706 413837 420801 427364 433423
52294 433423 438799 443593 448161 452431 455734 457725 459039 460512 462062 462922 462826 462349 462104 462248 462872 464294
52278 464294 466615 469336 471751 473551 474906 476175 477735 479813 482247 484565 486553 488637 491488 495289
52264 495289 499553 503582 506951 509590 511609 513148 514412 515778 517728 520428 523411 525993 528146 530724
$$ packed form
52370B44427J340J508J776K213K414K087J535J178Q74J97o87j000l98L56K22p44
52354B57298j376q22M08J173J137R75J207J444J080L06o8L23R56J151Q94P05Q54
52337B67645J011P20J15j17N18J723K718L096L141L309L652L933M114M463N160
52322C05201O002O590O643O147N244M145L095K341J981J876J816J825K176K972
52308C58054L909M604N021N277N204M625L985M146N297O584P131O964O563O059
52294D33423N376M794M568M270L303J991J314J473J550Q60r6m77k45J44O24J422
52278D64294K321K721K415J800J355J269J560K078K434K318J988K084K851L801
52264D95289M264M029L369K639K019J539J264J366J950K700K983K582K153K578
$$ plain form
52250 530724 534614 539836 545645 551274 556274 560379 563568 566331 569383 572890 576191 578534 579949 581244
52236 581244 583221 586066 589437 592984 596733 600957 605664 610339 614413 617941 621559 625646 629840 633622
52222 633622 637123 640966 645371 649784 653502 656409 659024 662010 665695 669841 673738 676744 678948 681187
52208 681187 684280 688340 692897 697495 701932 706128 710094 714019 718084 722158 725984 729721 734013 739353
52194 739353 745553 751990 758196 764076 769694 775085 780152 784597 787997 790118 791085 791102 790100 787873 784557
52179 784557 780804 777367 774526 771878 768607 764187 759004 754241 750931 749024 747471 745141 741663 737600
52165 737600 734091 732113 731748 732135 732418 732674 733554 735138 736709 737722 738382 738956 739077 738289 736916 735823
52149 735823 735458 735638 736171 737146 738565 740213 742040 744281 746993 749770 752047 753431 753705 752828 751101 749051
$$ packed form
52250E30724L890N222N809N629N000M105L189K763L052L507L301K343J415J295
52236E81244J977K845L371L547L749M224M707M675M074L528L618M087M194L782
52222F33622L501L843M405M413L718K907K615K986L685M146L897L006K204K239
52208F81187L093M060M557M598M437M196L966L925M065M074L826L737M292N340
52194G39353O200O437O206N880N618N391N067M445L400K121R67J7j002k227l316
52179G84557l753l437k841k648l271m420n183m763l310j907j553k330l478m063
52165G37600l509j978l65L87K83K56Q80J584J571J013O60N74J21p88j373j093
52149G35823l65J80N33R75J419J648J827K241K712K777K277J384K74q77j727k050
$$ plain form
52133 749051 747026 745183 743977 744157 745950 748610 751277 754079 757893 763118 769265 775788 782774 790503
52119 790503 798775 807072 815202 823317 831324 838655 844788 849748 853886 857283 859625 860688 860758 860421 860079
52104 860079 859873 860056 861141 863468 866751 870378 874162 878475 883401 888031 890995 891769 891062 889779 887969
52089 887969 885100 881106 876636 872319 868361 865026 862911 862238 862220 861760 860696 859832 859747 860150 860585 861133 862000
52072 862000 862758 862607 861344 859626 858171 857053 855958 854897 854387 854926 856484 858569 860742 862986 865588
$$ packed form
52133G49051k025j843j206J80J793K660K667K802L814N225O147O523O986P729
52119G90503Q272Q297Q130Q115Q007P331O133M960M138L397K342J063P0l37l42
52104H60079k06J83J085K327L283L627L784M313M926M630K964P74p07j283j810
52089H87969k869l994m470m317l958l335k115o73j8m60j064q64q5M03M35N48Q67
52072H62000P58j51j263j718j455j118j095j061n10N39J558K085K173K244K602
$$ [...]
##END NTUPLES=NMR SPECTRUM
##END=
