
##TITLE=UV1234_M7_1357-1247_90_7240071_1BhuKbzNkE
##JCAMPDX= 6.0         $$ Bruker NMR JCAMP-DX V2.0
##DATA TYPE= NMR SPECTRUM
##DATA CLASS= NTUPLES
##ORIGIN= BRUKER
##OWNER= Administrator
$$ 1.72 TOPSPIN		Version 2.1
$$ 2013-01-25 02:31:53.842 -0500  Administrator@X
$$ Compression mode = diff/dup
##.OBSERVE FREQUENCY= 400.02188249412
##.OBSERVE NUCLEUS= ^1H
##.ACQUISITION MODE= SIMULTANEOUS (DQD)
##.ACQUISITION SCHEME= undefined
##.AVERAGES= 8
##.DIGITISER RES= 22
##SPECTROMETER/DATA SYSTEM= spect
##.PULSE SEQUENCE= zg30
##.SOLVENT NAME= COFFEE_meoh
##.SHIFT REFERENCE= INTERNAL, COFFEE_meoh, 1, 14.98509
##AUDIT TRAIL= $$ (NUMBER, WHEN, WHO, WHERE, PROCESS, VERSION, WHAT)
$$ ##TITLE= Audit trail, TOPSPIN		Version 2.1
$$ ##JCAMPDX= 5.01
$$ ##ORIGIN= Bruker BioSpin GmbH
$$ ##OWNER= Administrator
$$ $$ E:\/data/COFFEE/nmr/UV1234_M7_1357-1247_90_7240071_1BhuKbzNkE/30/pdata/1/auditp.txt
$$ ##AUDIT TRAIL=  $$ (NUMBER, WHEN, WHO, WHERE, PROCESS, VERSION, WHAT)
(   1,<2013-01-25 02:31:45.858 -0500>,<Administrator>,<X>,<go>,<TOPSPIN 2.1>,
      <created by zg
	started at 2013-01-25 02:30:40.014 -0500,
	POWCHK enabled, PULCHK disabled,
       configuration hash MD5:
       86 BA 57 50 F2 9D 5C 9B 26 00 A9 28 5F 66 2E 89
       data hash MD5: 64K
       76 19 C0 BC 11 56 5B B5 32 D4 9D CA EB 8B 25 AF>)
(   2,<2013-01-25 02:31:48.920 -0500>,<Administrator>,<X>,<proc1d>,<TOPSPIN 2.1>,
      <Start of raw data processing
       efp LB = 0 FT_mod = 6 PKNL = 1 PHC0 = 0 PHC1 = 0 SI = 32K 
       data hash MD5: 32K
       7A D1 CF F3 0E 29 74 AA F1 A6 93 D7 D2 B7 3B DB>)
(   3,<2013-01-25 02:31:49.373 -0500>,<Administrator>,<X>,<proc1d>,<TOPSPIN 2.1>,
      <pk PHC0 = 95.60852 PHC1 = 0 
       data hash MD5: 32K
       47 FA AD 84 47 80 B6 C4 90 D5 A0 CD 06 9B 02 F5>)
(   4,<2013-01-25 02:31:49.592 -0500>,<Administrator>,<X>,<proc1d>,<TOPSPIN 2.1>,
      <abs ABSG = 1 
       data hash MD5: 32K
       DE F8 BF 95 25 79 64 81 F3 6D D7 28 14 21 9B EF>)
(   5,<2013-01-25 02:31:49.748 -0500>,<Administrator>,<X>,<proc1d>,<TOPSPIN 2.1>,
      <abs ABSG = 2 
       data hash MD5: 32K
       B7 2F 57 D9 F3 80 E1 EC EF 12 47 2B F7 7C 13 3F>)
(   6,<2013-01-25 02:31:49.889 -0500>,<Administrator>,<X>,<proc1d>,<TOPSPIN 2.1>,
      <abs ABSG = 3 
       data hash MD5: 32K
       F8 09 CA 1C 1C B7 07 C6 2F F5 4C 50 F4 72 6E 0F>)
(   7,<2013-01-25 02:31:50.045 -0500>,<Administrator>,<X>,<proc1d>,<TOPSPIN 2.1>,
      <abs ABSG = 4 
       data hash MD5: 32K
       11 53 41 FF AA 4A C3 2B E5 F3 DA 54 85 D7 BD D6>)
(   8,<2013-01-25 02:31:50.201 -0500>,<Administrator>,<X>,<proc1d>,<TOPSPIN 2.1>,
      <abs ABSG = 5 
       data hash MD5: 32K
       DD F2 29 F5 4B 86 BC 92 80 F4 89 67 DC 64 0E 3B>)
$$ ##END=
$$ 
$$ $$ hash MD5
$$ $$ D3 8F DE 43 2D DD B8 4C 5D B2 0D 7C 71 60 0A B2
##$RELAX= 
##$RELAX= 
##$RELAX= 
##$RELAX= 
##$RELAX= 
##$RELAX= 
##$RELAX= 
$$ Bruker specific parameters
$$ --------------------------
##$DU= <E:\>
##$EXPNO= 30
$$ [...]
150 150 150 150 150 150 150 150
##$TP07= 0
##$TPNAME0= <>
##$TPNAME1= <>
##$TPNAME2= <>
##$TPNAME3= <>
##$TPNAME4= <>
##$TPNAME5= <>
##$TPNAME6= <>
##$TPNAME7= <>
##$TPOAL= (0..7)
0.5 0.5 0.5 0.5 0.5 0.5 0.5 0.5
##$TPOFFS= (0..7)
0 0 0 0 0 0 0 0
##$TUNHIN= 0
##$TUNHOUT= 0
##$TUNXOUT= 0
##$USERA1= <user>
##$USERA2= <user>
##$USERA3= <user>
##$USERA4= <user>
##$USERA5= <user>
##$V9= 5
##$VALIST= <valist>
##$VCLIST= <CCCCCCCCCCCCCCC>
##$VD= 0
##$VDLIST= <DDDDDDDDDDDDDDD>
##$VPLIST= <PPPPPPPPPPPPPPP>
##$VTLIST= <TTTTTTTTTTTTTTT>
##$WBST= 1024
##$WBSW= 4
##$XGAIN= (0..3)
0 0 0 0
##$XL= 0
##$YL= 0
##$YMAX_a= 674463
##$YMIN_a= -572581
##$ZGOPTNS= <>
##$ZL1= 120
##$ZL2= 120
##$ZL3= 120
##$ZL4= 120
##$ABSF1= 14.98509
##$ABSF2= -5.573092
##$ABSG= 5
##$ABSL= 3
##$ALPHA= 0
##$AQORDER= 0
##$ASSFAC= 0
##$ASSFACI= 0
##$ASSFACX= 0
##$ASSWID= 0
##$AUNMP= <proc_prof1d_extract_pilot.lims>
##$AXLEFT= 0
##$AXNAME= <>
##$AXNUC= <1H>
##$AXRIGHT= 0
##$AXTYPE= 0
##$AXUNIT= <>
##$AZFE= 0.1
##$AZFW= 0.1
##$BCFW= 0
##$BC_mod= 0
##$BYTORDP= 0
##$COROFFS= 0
##$CY= 15
##$DATMOD= 1
##$DC= 0
##$DFILT= <>
##$DTYPP= 0
##$F1P= 0
##$F2P= 0
##$FCOR= 0.5
##$FTSIZE= 32768
##$FT_mod= 6
##$GAMMA= 0
##$GB= 0
##$INTBC= 1
##$INTSCL= 1
##$ISEN= 128
##$LB= 0
##$LEV0= 0
##$LPBIN= 0
##$MAXI= 10000
##$MC2= 0
##$MEAN= 0
##$ME_mod= 0
##$MI= 0
##$NCOEF= 0
##$NC_proc= -8
##$NLEV= 6
##$NOISF1= 0
##$NOISF2= 0
##$NSP= 0
##$NTH_PI= 0
##$NZP= 0
##$OFFSET= 14.98509
##$PC= 1
##$PHC0= 95.60852
##$PHC1= 0
##$PH_mod= 1
##$PKNL= yes
##$PPARMOD= 0
##$PPDIAG= 0
##$PPIPTYP= 0
##$PPMPNUM= 2147483647
##$PPRESOL= 1
##$PSCAL= 4
##$PSIGN= 0
##$PYNMP= <proc.py>
##$REVERSE= no
##$SF= 400.02
##$SI= 32768
##$SIGF1= 0
##$SIGF2= 0
##$SINO= 400
##$SIOLD= 32768
##$SPECTYP= <>
##$SREGLST= <1H.CDCl3>
##$SSB= 0
##$STSI= 32768
##$STSR= 0
##$SW_p= 8223.68421052631
##$SYMM= 0
##$S_DEV= 0
##$TDeff= 65536
##$TDoff= 0
##$TI= <>
##$TILT= no
##$TM1= 0
##$TM2= 0
##$TOPLEV= 0
##$USERP1= <user>
##$USERP2= <user>
##$USERP3= <user>
##$USERP4= <user>
##$USERP5= <user>
##$WDW= 1
##$XDIM= 32768
##$YMAX_p= 476490909
##$YMIN_p= -740946
##$CURPLOT= <Network HP LaserJet P1505>
##$CURPRIN= <$Network HP LaserJet P1505>
##$DFORMAT= <normdp>
##$LAYOUT= <+/1D_H.xwp>
##$LFORMAT= <normlp>
##$PFORMAT= <normpl>
##$SURQMSG= 1
$$ End of Bruker specific parameters
$$ ---------------------------------
##NTUPLES= NMR SPECTRUM
##VAR_NAME=  FREQUENCY,     SPECTRUM/REAL,   SPECTRUM/IMAG
##SYMBOL=    X,             R,               I
##VAR_TYPE=  INDEPENDENT,   DEPENDENT,       DEPENDENT
##VAR_FORM=  AFFN,          ASDF,            ASDF
##VAR_DIM=   32768,         32768,           32768
##UNITS=     HZ,            ARBITRARY UNITS, ARBITRARY UNITS
##FACTOR=    0.250966925370066, 1,           1
##FIRST=     8223.43324360094, 34539,        -63996
##LAST=      0,             -116271,         -126819
##MIN=       0,             -740946,         0
##MAX=       8223.43324360094, 476490909,    0
$$ Real data points
##PAGE= N=1
##DATA TABLE= (X++(R..R)), XYDATA
$$ [...]
$$ plain form
19523 -206781 -12951 -187636 -368034 -86683 81223 46883 243773 -362388 175794 -147760
19512 -123503 -103405 -378447 16789 89950 265995 -14354 160031 -163539 41241 123982 -3644
19500 67001 -289775 -320647 -64919 -174538 -60176 -108804 -162246 -141912 -10266 -150741 181210
19488 -96755 335699 32142 -116806 -246180 -160170 -356897 -390052 -300107 258695 72660 32470
19476 -242931 -332376 70384 176689 -72 100689 -81039 210588 305957 11377 -24983 -131072
19465 -131072 19329 46619 -370814 188280 -6642 355896 -17295 -3523 11318 -167609 -208780
19454 -208780 115595 114247 -83554 -386823 -69750 -103031 119310 17287 -59686 48367 20106
19442 59846 -263393 -274687 -599336 142711 -104709 -105116 2510 -199320 -254632 -266833 -552222
$$ packed form
19523b06781a2951j74685j80398h6683H1223l4340J96890c62388A75794a47760
19512a23503K0098k75042A6789P3161J76045a4354A60031a63539D1241Q2741c644
19500F7001b89775l0872f4919j09619f0176m8628n3442K0334a0266j40475A81210
19488i6755C35699C2142a16806j29374Q6010j96727l3155Q9945B58695G2660C2470
19476b42931q9445G0384J06305g2A00689h1039B10588R5369A1377b4983j06089
19465a31072A9329K7290c70814A88280f642C55896a7295c523A1318a67609m1171
19454b08780A15595j348h3554l03269f9750l3281A19310A7287e9686D8367B0106
19442E9846b63393j1294l24649A42711a04709m07B510a99320n5312j2201k85389
$$ plain form
19431 -552222 -312467 -63421 -163464 59784 3235 -347614 108114 -88883 -62126 -123779 -19734
19419 -253419 72582 5554 -55025 329926 127288 226326 -180718 -49169 -167247 56932 76698
19408 76698 -305075 -331053 -165275 -199418 -263280 181553 205832 -139525 338932 275175 176246
19397 176246 109352 191195 -118294 -167639 -463339 232178 50263 -125658 -45160 181564
19386 -343544 -11453 -38778 -55323 20310 -92708 -97628 -78449 364006 -15192 -305726 -33813
19374 408287 -71747 -23238 52694 145385 371597 81594 -39084 -40557 332107 -93125 -47147
19363 -47147 -143292 24752 -183010 -157008 87891 -34688 -16740 -77512 69952 224968 -56219
19351 -36054 189901 -110182 130910 -65942 -7636 -105676 35299 -240210 55048 -59129 -77313
$$ packed form
19431e52222K39755f3421j00043E9784C235c47614A08114h8883K6757o1653a9734
19419b53419G2582E554e5025C29926A27288R9038a80718d9169j18078E6932J9766
19408G6698c05075k5978a65275l4143o3862A81553K4279a39525C38932o3757r8929
19397A76246o6894Q1843a18294m9345k95700B32178E0263a25658d5160A81564
19386c43544a1453k7325j6545B0310i2708m920J9179C64006a5192k90534c3813
19374D08287g1747b3238E2694R2691K26212H1594c9084j473C32107i3125M5978
19363d7147r6145B4752a83010K6002H7891c4688a6740o0772F9952J55016e6219
19351c6054A89901a10182A30910f5942g636r8040C5299b40210E5048e9129j8184
$$ plain form
19340 -77313 -14934 -133839 -15314 42876 37896 -109882 -73670 -242885 -314920 49150 167769
19329 167769 -169554 -101112 62599 -4724 -408518 57549 84944 -12656 -258274 -8449 44119
19317 -112986 -48976 -173855 -141639 -63764 61352 108489 -214012 -182684 174397 -178166 -9894
19305 78516 46176 -80772 -166002 -231148 38425 -117737 65721 -118487 -46625 -295462 -62589
19293 -288309 -92020 -330323 229433 58744 -166707 -103939 -199822 -139679 249776 -192253
19282 173478 -67259 -298681 -83780 40640 -70071 -250667 -2504 6229 -12212 -171890 -81699
19270 136635 328321 -38481 146552 -118998 -388241 -201401 294162 138258 265591 24280
19259 103826 -39465 -114403 104203 -184406 -134499 -65680 78834 48831 -262256 -114103 56602
$$ packed form
19340g7313a4934j18905a5314D2876m980a09882L6212j69215p2035D9150J18619
19329A67769a69554O8442F2599d724m03794E7549K7395a2656k45618h449D4119
19317a12986d8976j24879L2216f3764F1352M7137b14012L1328A74397a78166i894
19305G8516l2340h0772q5230o5146C8425a17737F5721a18487d6625k48837f2589
19293b88309i2020k38303B29433E8744a66707O2768r5883O0143B49776a92253
19282A73478f7259k31422h3780D0640g0071j80596b504F229a2212j59678h1699
19270A36635J91686c8481A46552a18998k69243J86840B94162A38258J27333B4280
19259A03826c9465p4938A04203a84406M9907f5680G8834l0003b62256a14103E6602
$$ plain form
19247 -9469 -30975 -393971 -184840 -59330 -192599 8646 54809 104815 255853 -236927 -53566
19235 258583 -224006 136010 94743 -236301 61354 133833 -85125 14866 192596 -159752
19224 181095 117734 90968 43185 41104 -123060 44036 126374 -66173 -78466 -124545 66557
19212 -14748 -204126 -242638 -363193 165853 130285 20467 102006 125005 11087 -139870 -226640
19201 -226640 -116364 -134604 156639 -21957 -196429 -245253 -113224 -236838 -434860 -104479
19190 -105138 -103802 121788 -211331 229482 -39466 -205684 132429 -31260 -46191 -204466
19180 -204466 -210937 -312323 -70540 -140435 -87502 -382812 -175853 210833 111233 21653 85596
19169 85596 114653 -168365 -269339 82418 -106535 1008 -212755 -346583 67694 -132174 -385390
$$ packed form
19247i469k1506l62996a84840e9330j33269H646M6163N0006J51038b36927e3566
19235B58583b24006A36010m1267b36301F1354P2479h5125A4866J77730a59752
19224A81095o3361k6766D3185k081a23060D4036Q2338f6173j2293m6079F6557
19212a4748j89378l8512j20555A65853l5568B0467Q1539K2999A1087a39870q6770
19201b26640J10276j8240A56639b1957j74472m8824a13224j23614j98022a04479
19190a05138J336A21788b11331B29482c9466j66218A32429c1260j4931j58275
19180b04466o471j01386g0540o9895N2933k95310a75853B10833r9600B1653O3943
19169H5596K9057a68365j00974H2418a06535A008b12755j33828F7694a32174k53216
$$ plain form
19158 -385390 -70526 40724 -128008 -371827 272562 -97722 52648 -263846 -250842 -143681
19148 -143681 -142680 -102522 -192569 -293462 -244382 -38135 -35571 136350 165282 127090 -315344
19136 -205984 -312651 243427 -176982 -63271 -343239 -25348 -148578 -45801 75599 -51610
19125 -8848 -200885 90888 -164023 -173079 164914 -42751 -156524 -29742 -115544 271845 -180112
19113 -157468 -93589 -49337 61797 61482 -262169 -173605 -118143 -56005 100213 22053 -37567
19101 314147 133164 62940 137657 -159825 -72478 -383146 73350 -69172 119782 -304420
19090 -359705 31293 -395226 -63227 -239677 -55823 -180113 -330540 -261691 2097 -60701 127154
19078 -69797 102085 -14601 -64339 140659 -268194 81300 138821 -283457 -26381 164840 -163248
$$ packed form
19158c85390g0526D0724a28008k43819B72562i7722E2648b63846J3004J07161
19148a43681J001M0158r0047j00893M9080c8135K564A36350K8932l8192c15344
19136b05984j06667B43427a76982f3271k79968b5348j23230d5801G5599e1610
19125h848j92037I0888a64023r056A64914d2751j13773b9742q5802B71845a80112
19113a57468O3879M4252F1797l15b62169Q8564N5462e6005A00213B2053c7567
19101C14147A33164F2940P4717a59825g2478l10668G3350f9172A19782c04420
19090c59705C1293c95226f3227j76450e5823j24290j50427O8849B097f0701A27154
19078f9797A02085a4601m9738A40659b68194H1300N7521b83457b6381A64840a63248
$$ plain form
19066 -98279 212453 163616 227954 -24491 -192093 -237358 286267 -189412 -351667 -36518 19396
19054 -397155 134072 73011 65599 -15691 158866 -101794 -127728 405360 -13935 -316590 184540
19042 209033 32624 79440 -186775 -154232 36660 265189 90252 -6891 144927 268260 -53348
19030 -273646 -185484 -92585 -74353 14279 158260 -48060 -76053 -142742 -100361 -338265 74481
19018 -192269 56872 -212997 -62165 -253948 -115162 127682 -262602 -189724 188238 106358
19008 106358 -155872 -140245 -114651 190825 -237240 -346753 -28993 -17831 -214004 293910
18997 95715 -165971 -369465 -226399 345968 182711 84945 -65257 -311129 -81507 -27054
18986 51472 194181 -162074 306911 -59606 256211 -24623 172506 -374701 22435 178857
$$ packed form
19066i8279B12453m8837O4338b4491j67602m5265B86267a89412j62255c6518A9396
19054c97155A34072o1061p412a5691A58866a01794k5934D05360a3935l02655A84540
19042B09033C2624M6816a86775L2543C6660K28529I0252f891A44927J23333e3348
19030b73646Q8162i2585J8232A4279J43981d8060k7993o6689M2381k37904G4481
19018a92269E6872b12997f2165j91783a15162A27682b62602P2878A88238q1880
19008A06358a55872J5627K5594A90825b37240j09513b8993J1162j96173B93910
18997I5715a65971k03494J43066C45968j63257H4945f5257k45872h1507b7054
18986E1472J42709a62074C06911e9606B56211b4623A72506c74701B2435J56422
$$ plain form
18976 178857 106916 -272425 -131857 134682 129339 65730 647 -118180 -323919 39994 -110367
18964 43989 107260 -47550 24347 -375849 73194 -174479 74397 -18947 -150164 35613 -166595
18952 -59971 -313588 -273079 -377243 6394 160146 90750 -92140 -233571 -221637 -28775 -236830
18941 -236830 36644 -72878 42952 364016 -16468 57266 329913 -169518 134767 -144144
18930 -40060 153146 98881 398355 131802 -102381 141495 -174958 -158216 -95922 -85473
18920 -85473 -4003 -12067 29195 -79681 -216212 -318376 232606 -441550 25801 -247717 -97450
18908 96145 -190136 -89314 -154739 15475 190043 -55487 -34226 21051 127040 -281506 -136807
18896 -155682 92861 -35163 65151 -211826 -6246 -33317 -118210 -112050 -79471 432634 -75249
$$ packed form
18976A78857p1941b72425a31857A34682n343o3609F47a18180k05739C9994a10367
18964D3989O3271d7550B4347c75849G3194a74479G4397a8947j31217C5613a66595
18952e9971k53617M0509j04164F394J53752o9396i2140j41431J1934b8775k08055
18941b36830C6644g2878D2952L21064a6468E7266K72647a69518A34767a44144
18930d0060A53146n4265K99474A31802a02381A41495a74958J6742O2294J0449
18920h5473d003q064B9195g9681j36531j02164B32606d41550B5801b47717i7450
18908I6145a90136h9314o5425A5475J74568e5487K1261B1051J05989b81506a36807
18896a55682I2861c5163F5151b11826f246k7071q4893O160L2579D32634g5249
$$ plain form
18884 -13316 -335726 -176678 -198569 241686 -216954 118255 114541 -277897 112001 -181062
18873 331544 -145387 -441830 -223220 -236822 155225 -118606 60695 -306091 114134 -215987
18862 190164 73254 -740946 -192714 250109 -156533 189355 -79455 149363 -188761 -34348
18851 -83288 63456 11711 -101915 -206198 -72601 -196684 148521 -34359 -185788 -112199 128759
18839 13653 -136602 146815 -127137 -186226 -11220 -97626 -74720 -77686 100844 23982 -285447
18827 -205790 6261 69893 -124205 -143875 14979 85879 162678 57423 -7751 14437 23781 137026
18815 137026 108461 33673 253709 234341 38020 -77677 19024 -34532 -116873 118074 -72353
18803 -149389 76392 51544 147770 -89499 -166762 266131 173176 -4396 -265467 399533 -34559
$$ packed form
18884a3316l22410J59048k1891B41686b16954A18255l714b77897A12001a81062
18873C31544a45387k96443K18610j3602A55225a18606F0695c06091A14134b15987
18862A90164G3254g40946a92714B50109a56533A89355g9455A49363a88761c4348
18851h3288F3456A1711a01915j04283g2601j24083A48521c4359j51429P3589A28759
18839A3653a36602A46815a27137n9089a1220q6406K2906k966A00844B3982b85447
18827b05790F261O3632a24205j9670A4979P0900P6799E7423g751A4437R344J13245
18815A37026k8565C3673K20036j9368C8020g7677A9024c4532q2341A18074g2353
18803a49389G6392k4848R6226h9499p7263B66131r2955d396k61071C99533c4559
$$ plain form
18791 209491 147912 64700 -192799 11338 -281342 110004 -88373 19675 -140513 -246872
18781 -246872 -294416 -229691 159898 -170764 -21829 77768 -53760 173366 36857 165282 -20109
18769 209336 -131488 -95730 -76736 -121253 -88166 -128847 228780 -18290 138197 -110420 -24503
18757 132508 -113627 74441 -215934 -257176 167586 -180709 70260 -308422 134302 16600
18746 -90934 -399454 -51852 -167301 -71121 -23170 -40631 -217448 -129689 -219897 53981 -276339
18734 34490 -500506 -187100 173705 -29960 288175 314283 9309 452969 -199667 -278957 -69515
18722 151732 106048 75178 4669 -75456 -201614 183518 69545 308567 -255319 -171672 -129458
18711 -129458 -158820 -309548 -171155 -139075 -138534 194481 -287058 -77353 -194693 -227175 324808
$$ packed form
18791B09491o1579F4700a92799A1338b81342A10004h8373A9675a40513j06359
18781b46872m7544O4725A59898a70764b1829G7768e3760A73366C6857J28425b0109
18769B09336a31488L5758J8994m4517L3087m0681B28780a8290A38197a10420b4503
18757A32508a13627G4441b15934m1242A67586a80709G0260c08422A34302A6600
18746i0934l08520e1852j15449g1121b3170j7461j76817Q7759r0208E3981b76339
18734C4490e00506a87100A73705b9960B88175K6108I309M43660a99667p9290f9515
18722A51732m5684l0870D669g5456j26158A83518F9545K39022b55319Q3647M2214
18711a29458k9362j50728J38393L2080N41A94481b87058g7353j17340l2482C24808
$$ plain form
18699 302802 -164892 -27882 116581 -103572 49411 -148900 16669 -98017 -13567 71566 -405891
18687 -499279 -135465 -17365 -83292 23690 -116887 -76889 -151358 154090 2363 148606 -334385
18675 227330 46138 -296407 199261 -351082 -229974 -258783 -142758 -166403 -512842 -45738
18664 -59210 -154929 161595 -119082 -259047 45312 -101095 -133488 160246 -46589 -341073
18654 -341073 85123 -452917 -191292 -122421 -109981 -254412 -109358 33730 31949 -89073 166503
18642 426328 300744 -416482 -37269 -294618 -347438 29777 -118510 295250 238371 -47461
18631 -362882 337418 -121545 -151708 84669 -154304 -5794 11352 -9996 298123 235981 103636
18619 -235611 95684 -83094 -266406 -416257 -254579 43932 -261750 -177026 -96776 -120266 105562
$$ packed form
18699C02802a64892b7882A16581a03572D9411a48900A6669i8017a3567G1566d05891
18687d99279a35465a7365o5927B3690a16887L9998p4469A54090B363J46243c34385
18675B27330D6138b96407A99261c51082J21108k8809J16025k3645l46439d5738
18664e9210r5719A61595a19082j39965D5312a01095l2393A60246d6589k94484
18654c41073H5123d52917a91292O8871J2440j44431a09358C3730j781h9073A66503
18642D26328j25584d16482c7269k57349n2820B9777a18510B95250n6879d7461
18631c62882C37418a21545l0163H4669a54304e794A1352i996B98123o2142A03636
18619b35611I5684h3094j83312j49851J61678D3932b61750Q4724Q0250k3490A05562
$$ plain form
18607 128611 -36325 -63868 -381637 150732 -238346 -90209 -175512 -68256 -43599 113824 -37416
18595 -24212 -293961 -188487 -198192 -333803 72142 -19638 94775 -186301 -76141 -175787 298093
18583 107859 -134269 -59263 -186734 356348 119570 -175937 -270906 -180821 45005 57211
18573 57211 -70773 -108808 -12208 -76857 -181712 19058 39208 -108568 -110838 -483836 50752
18561 36386 -34331 -26334 14242 -100375 -469136 -183665 189338 49271 -100520 -32620 -216343
18550 -216343 -278947 -25559 88131 -163821 231492 -118808 15342 149535 44134 -168362
18539 16865 118996 24159 334107 -167858 -283583 -150236 -57290 -223799 29530 31122 308150
18528 308150 -174890 31407 41562 64726 45239 337833 150017 111634 -151782 -351571
$$ packed form
18607A28611c6325k7543l17769A50732b38346i0209q5303f8256K4657A13824c7416
18595b4212k69749J05474r705j35611G2142a9638I4775a86301g6141r9646B98093
18583A07859a34269e9263j27471C56348A19570a75937r4969R0085D5005J2206
18573E7211g0773l8035a2208o4649j04855A9058K0150a08568k270l72998E0752
18561C6386c4331P997A4242a00375l68761a83665A89338D9271a00520c2620j83723
18550b16343o2604b5559H8131a63821B31492a18808A5342J34193D4134a68362
18539A6865J02131B4159L09948a67858j15725J33347e7290j66509B9530J592K77028
18528C08150a74890C1407J0155K3164j9487K92594A50017l8383a51782j99789
$$ plain form
18518 -351571 34797 -77855 -264698 -218857 -249913 -37908 -175079 -346605 -73722 43394 -105046
18506 -136549 -289682 -185528 -29846 -305345 -258366 -88809 28061 -413875 -227075 73674
18495 -168882 -390465 168587 96003 162287 -224754 -207201 271754 -111435 89405 8081 212194
18484 212194 57772 -180728 -243347 13571 -66395 173462 -104600 149189 -34559 -390031
18474 -390031 -286728 -115620 21402 3753 -255696 -493184 90698 30286 -75936 10409 68210
18463 68210 154189 66943 -132486 203335 -94800 -199566 291023 -72986 -28649 -237027 173719
18451 -39751 -99327 -158729 164866 -32810 127260 392610 -30535 -412114 163056 215303 -26766
18439 -165035 -116096 41034 -18266 -37885 223758 118969 48654 -223723 -280068 106343 -49941
$$ packed form
18518c51571C4797g7855j86843M5841l1056c7908j37171j71526g3722D3394a05046
18506a36549j53133J04154b9846k75499M6979h8809B8061d13875J86800G3674
18495a68882k21583A68587p2584O6284b24754J7553B71754a11435H9405H081K04113
18484B12194E7772a80728o2619A3571f6395A73462a04600A49189c4559l55472
18474c90031J03303a15620B1402C753b55696k37488I0698C0286g5936A0409N7801
18463F8210Q5979F6943a32486B03335i4800j04766B91023g2986b8649k08378A73719
18451c9751n9576n9402A64866c2810A27260K65350c0535l81579A63056N2247b6766
18439a65035M8939D1034a8266j9619B23758j04789D8654b23723n6345A06343d9941
$$ plain form
18427 -97225 -17741 -173730 -230452 -47613 514606 -141634 -189374 96054 14373 -52103 38665
18415 -233836 -108133 -140803 -346690 -113946 -143703 -87257 -6119 -504350 -198400 5586 -120773
18403 103033 159210 -189489 -81873 105256 200492 -155520 2264 -69598 130693 -144640 -87390
18392 -87390 232663 143954 -472823 58954 -258576 -129547 -218012 238557 257337 -294049
18381 -234209 133094 177456 5622 -59288 -82514 -131003 -222069 -150173 -318866 -277989 230769
18369 206883 -8403 -290938 151194 -418277 -305636 -94056 -259044 -3612 8715 -114343 498546
18357 322183 -61378 -238145 -66017 -77986 -58643 86095 -44077 88998 -337720 13781 165097
18346 165097 -121243 -186372 -6256 -337226 33913 -441270 187924 -122991 104124 -136145
$$ packed form
18427i7225a7741j55989n6722d7613E14606a41634m7740I6054A4373e2103C8665
18415b33836a08133l2670k05887a13946k9757N6446f119m98231a98400E586a20773
18403A03033N6177a89489h1873A05256R5236a55520B264f9598A30693a44640N7250
18392h7390B32663q8709d72823E8954b58576J29029q8465B38557J8780b94049
18381b34209A33094M4362E622e9288k3226m8489r1066P1896j68693M0877B30769
18369B06883h403k82535A51194d18277J12641i4056j64988c612H715a14343D98546
18357C22183f1378j76767f6017j1969J9343H6095d4077H8998c37720A3781J51316
18346A65097a21243o5129f256l30970C3913d41270A87924a22991A04124a36145
$$ plain form
18335 73532 -92375 -186044 -191690 -185813 59591 303278 -216908 157210 165983 219471 136021 148713
18323 148713 -346724 -152700 -108714 -294866 -159196 -63561 210410 -5142 -20878 -96814 -277172
18312 -277172 -10906 42110 -76450 -67221 -202355 188920 237411 142524 84740 -216632 -21396
18300 -205301 -212260 -184691 -332278 93086 31775 205001 87101 -77014 -47584 284339 -156234
18288 -59792 88567 -113872 283747 -90027 212266 -154477 -164462 149953 249305 -80381 316053
18276 -81065 -137011 -188398 -44746 156246 -147783 -153993 -2296 224624 341114 -106781 -97082
18265 -97082 84371 -1319 -45212 79473 -274219 -106313 29627 124375 5943 172 247584 72098
18252 -205113 -315095 -52730 -141808 304999 -248620 -299328 -149635 386846 -83035 -37010
$$ packed form
18335G3532i2375r3669n646N877E9591K43687b16908A57210Q773N3488q3450J2692
18323A48713c46724a52700M3986j86152J35670f3561B10410e142j5736p5936j80358
18312b77172a0906D2110g6450R229j35134A88920M8491r4887n7784b16632b1396
18300b05301o959K7569j47587I3086C1775J73226H7101g7014K9430B84339a56234
18288e9792H8567a13872B83747i0027B12266a54477r985A49953R9352h0381C16053
18276h1065n5946n1387d4746A56246a47783o210b296B24624J16490a06781R699
18265i7082H4371a319m3893G9473b74219a06313B9627R4748E943A72K47412G2098
18252b05113j09982e2730q9078C04999b48620n0708a49635C86846h3035c7010
$$ plain form
18241 16717 -185831 -122011 -83103 -6757 -113324 -63664 49339 40893 -100410 -40437 93494
18229 -137648 78856 92474 -172072 274122 85596 -53398 -134002 196788 -176246 -3031 -87533
18218 -87533 50887 -74578 -123228 -25624 37314 -111066 197434 -184201 35388 -155245 -165063
18207 -165063 -367944 -175639 -102885 162621 1118 -106063 -67582 61495 -82600 295381 156666
18196 156666 -102538 -99016 197716 -105845 -92824 109759 99364 -308270 -68211 15597 52018
18185 52018 -129863 -275379 -3498 -210031 -203209 20301 -93484 85398 119137 -179157 -131015
18174 -131015 -5122 200761 346949 300255 202741 684 180871 -367585 -87498 -15051 -162367
18163 -162367 -212224 -216593 122275 877 -85409 57345 -204925 124922 -77437 -13021 327902
$$ packed form
18241A6717a85831O3820L8908f757j06567M9660D9339q446a00410d0437I3494
18229a37648G8856J3618a72072B74122H5596e3398q0604A96788a76246c031q4502
18218h7533E0887g4578m8650b5624C7314a11066A97434a84201C5388a55245r818
18207a65063k02881a75639P2754A62621A118a06063L8481F1495h2600B95381j38715
18196A56666a02538L522A97716a05845J3021A09759j0395c08270f8211A5597L6421
18185E2018a29863j45516c498k06533O822B0301i3484H5398L3739a79157M8142
18174a31015e122B00761J46188m6694r7514F84J80187c67585h7498a5051j47316
18163a62367m9857m369A22275H77h5409E7345b04925A24922g7437a3021C27902
$$ plain form
18151 -163657 189604 -112548 -22294 25895 34217 126495 -271123 -4469 -204780 159945 116745
18140 116745 -133131 -222884 174986 -309518 49306 -52679 -8646 -14934 -207041 208657 -154726
18128 239290 -209281 -120032 185773 -291843 304918 74096 -245181 57778 128718 -103868
18117 45370 77390 64103 -151303 -248053 99797 -19460 -82431 473288 -149792 -170095 31537
18105 -15838 96706 285887 116251 -63822 7165 -114171 -271873 -68731 -70005 -169053 168253
18093 419810 -50678 -221135 -134216 -85762 -23399 107103 -111709 -24041 -32929 -112383 239460
18081 7162 299298 124781 52202 -134000 125411 -91950 324431 312615 -201004 -222956 -22335
18069 263509 -84960 -170720 270287 -82360 -46321 356986 106031 108901 17450 -122519 10226
$$ packed form
18151a63657A89604a12548b2294B5895Q322R2278b71123d469k00311A59945m3200
18140A16745a33131q9753A74986c09518D9306e2679h646o288j92107B08657a54726
18128B39290b09281Q9249A85773b91843C04918G4096b45181E7778P0940a03868
18117D5370L2020j3287a51303r6750I9797a9460o2971D73288a49792k0303C1537
18105a5838I6706J89181A16251f3822G165a14171j57702f8731j274r9048A68253
18093D19810e0678j70457Q6919M8454b3399A07103a11709b4041q888p9454B39460
18081G162K92136A24781E2202a34000A25411i1950C24431j1816b01004k1952b2335
18069B63509h4960q5760B70287h2360L6039C56986A06031K870A7450a22519A0226
$$ plain form
18057 157956 37244 185464 -170356 -151735 -83346 20784 4309 214889 156883 -178862 -137335
18046 -137335 53573 216071 -71143 90347 -24860 5444 76253 344332 -259057 -21494 -55264
18035 -55264 51939 18487 -235653 165721 85028 -329899 -90014 231585 148880 86219 78137
18024 78137 41022 117407 11464 151461 -271427 -271129 -171885 229612 -161144 -196575 193200
18012 -374372 -215637 -100354 -97120 21993 232387 -45820 192292 93794 114127 -78354 -34794
18000 -33348 -32276 12922 -137330 -121468 -117587 54314 115734 -317583 21449 -242534 -234269 2884
17987 -104725 144559 13975 176336 230630 53988 187915 -385418 -143509 -62493 -10668
17976 261791 -102497 -110517 89548 112789 -72629 -353036 -208648 -123270 131065 338236 -154805
$$ packed form
18057A57956C7244J48220a70356J8621O8389B0784D309K10580n8006a78862M1527
18046a37335E3573J62498g1143I0347b4860E444P0809K68079b59057b1494l3770
18035e5264E1939A8487b35653A65721q0693c29899i0014B31585q2705o2661q082
18024G8137l7115P6385A1464J39997b71427K98R9244B29612a61144l5431A93200
18012c74372J58735a00354L234B1993K10394d5820A92292I3794K0333g8354c4794
18000c3348J072A2922a37330J5862L881E4314O1420c17583B1449b42534Q265B884
17987a04725A44559A3975J62361N4294E3988J33927c85418a43509f2493a0668
17976B61791a02497q020H9548K3241g2629k80407J44388Q5378A31065K07171a54805
$$ plain form
17964 70498 25518 24725 5993 -152472 -26958 -133744 -15657 39669 96868 -196744 -206009 -48698
17951 72842 -508338 260293 11076 42392 -130181 190349 -6964 -94044 168549 32950 61947
17940 61947 304269 -29536 -109536 105633 -289083 -13288 -224914 -155379 -16194 -389025 -121861
17928 109639 -165115 -209909 31438 -155544 230322 323625 -90753 131837 79244 139982 197515
17917 197515 -127110 430370 33815 536991 108788 52301 83483 -47595 -130996 -39337 156533
17905 -55072 159197 -94965 16331 -70483 263991 -21163 175665 191132 680 -165498 -17908
17893 107747 -56383 128326 283739 -183142 -58886 -179451 -245283 -72393 -134540 288529
17882 125989 43665 -57416 58724 -285665 -73648 -35527 -60222 -40440 -126131 45716 51285
$$ packed form
17964G0498B5518p93E993a52472b6958j06786a5657C9669N7199a96744r265d8698
17951G2842e08338B60293A1076L1316a30181A90349f964q7080A68549C2950K8997
17940F1947K42322b9536q0000A05633b89083a3288k11626O9535a6194l72831a21861
17928A09639a65115m4794C1438a55544B30322R3303i0753A31837n2593O0738N7533
17917A97515a27110D30370C3815N03176A08788E2301L1182d7595q3401c9337A56533
17905e5072A59197i4965A6331g0483B63991b1163A75665J5467F80a65498a7908
17893A07747e6383A28326J55413a83142e8886j20565o5832g2393o2147B88529
17882A25989D3665e7416E8724b85665g3648c5527k4695J9782q5691D5716N569
$$ plain form
17871 51285 -154601 165743 130025 -191507 -32474 -27716 -158350 123874 260866 -76995 191435
17859 -146026 129051 126400 -286832 -216026 -168004 -429299 -290460 61432 368298 -20480 -48233
17848 -48233 77225 -37260 -18151 285800 -76166 145041 202754 270259 46440 140006 106887
17837 106887 -114855 291464 -242685 -137105 122392 -31681 414368 -147911 198095 -118812
17826 63990 167377 335111 -146060 388841 6125 -71770 -72188 -108429 108650 179502 -331173
17814 -87320 -307343 -19882 -174896 82966 6582 481089 100641 64393 194528 194732 -116991
17802 -169754 258926 -117274 349801 -111335 -183364 -201821 90543 -167020 23279 382172
17792 382172 -301609 105551 25580 57387 -55520 321022 45767 71494 -153331 93200 101168
$$ packed form
17871E1285a54601A65743l5718a91507c2474M758j30634A23874J36992g6995A91435
17859a46026A29051k651b86832P0806M8022k61295J38839F1432L06866b0480k7753
17848d8233G7225c7260a8151B85800g6166A45041N7713O7505D6440R3566l3119
17837A06887a14855B91464b42685J05580A22392c1681D14368a47911A98095a18812
17826F3990J03387J67734a46060C88841F125g1770m18l6241A08650P0852c31173
17814h7320k20023a9882j55014H2966F582M74507A00641l6248J30135K04a16991
17802a69754B58926a17274C49801a11335p2029j8457I0543a67020B3279L58893
17792C82172c01609A05551B5580L1807e5520C21022D5767K5727a53331I3200P968
$$ plain form
17781 101168 102322 -100275 -127468 -243162 -195976 251159 6527 140225 -142814 -32449 190478
17769 -96544 -189197 248528 240097 -14310 -77962 -102511 -323139 -132009 79007 -63163 -31179
17757 -188715 -24121 -282798 -277946 -92453 12153 -220035 -95036 57954 46929 225628 -84883
17745 40878 242479 157226 26575 39411 181555 317321 -10555 116170 -38001 183082 -117826
17733 -51232 -25958 102860 -20612 -219104 -8592 -109420 111240 130919 -210634 159757 -41357
17721 -177602 412188 351872 -233014 80340 -50007 -77158 545005 -90793 -226664 -29216 226448
17709 235241 -135512 -248264 239497 25648 46427 792 -194699 -26792 168559 187673 332038
17698 332038 -24578 -314651 -123513 -105481 -146433 40646 -102136 -221694 258312 -300282
$$ packed form
17781A01168J154a00275k7193j15694M7186B51159F527J33698a42814c2449A90478
17769i6544r2653B48528q431a4310o3652k4549k20628a32009G9007f3163c1179
17757a88715b4121k58677M852i2453A2153b20035i5036E7954j1025J78699h4883
17745D0878K01601q5253B6575J2836J42144J35766a0555A16170c8001A83082a17826
17733e1232K5274A02860b0612j98492h592j00828A11240J9679b10634A59757d1357
17721a77602D12188o0316b33014H0340e0007k7151E45005i0793j35871b9216B26448
17709B35241a35512j12752B39497B5648K0779G92a94699b6792A68559J9114J44365
17698C32038b4578k90073a23513J8032m0952D0646a02136j19558B58312c00282
$$ plain form
17687 -22705 30289 -56713 65960 44893 87987 -357617 -125884 96984 -292848 -209427 163821
17675 -28064 -39689 -277102 -72042 78800 -122730 364524 39807 119871 255071 159622 -212745
17663 6915 339513 -48559 -42346 122653 -179784 -129555 145597 312260 200813 96887 -161117
17651 -100040 -325019 -72064 261507 -445411 -124405 -93352 136327 21422 221240 -402938
17640 46465 -64416 122249 -225703 98341 36217 -203776 59991 -33334 76200 152663 348811
17629 348811 32222 -15918 -44074 91055 586101 -194509 34651 49822 29656 178477 248704
17618 248704 230548 71449 135816 -227201 25828 -56059 243082 37481 -138218 15969 380165
17607 380165 63736 95605 129563 -69795 -160663 -123569 2082 -195710 -124169 59191 33078
$$ packed form
17687b2705C0289e6713F5960k1067M3094c57617a25884I6984b92848Q3421A63821
17675b8064j1625k37413g2042G8800a22730C64524C9807Q0064J35200r5449b12745
17663F915L32598d8559O213A22653a79784N0229A45597J66663j11447I6887a61117
17651a00040k24979g2064B61507d45411a24405L1053A36327B1422J99818d02938
17640D6465f4416A22249b25703I8341C6217b03776E9991c3334G6200P6463J96148
17629C48811C2222a5918k8156I1055M95046a94509C4651J5171k0166J48821P0227
17618B48704j8156G1449O4367b27201B5828e6059B43082C7481a38218A5969L64196
17607C80165F3736L1869L3958f9795r0868L7094B082a95710P1541E9191k6113
$$ plain form
17596 33078 353910 -108054 62586 152437 -151117 149612 329582 169338 -116941 288406
17585 -263977 -218271 27360 -112241 -201875 -143223 357629 -45748 -263694 -5488 -178448 -83364
17573 219523 227952 -44650 -64247 -222921 88183 72810 -239290 -124744 -10027 193754 -66159
17561 225405 -287451 88590 -202417 -10500 201008 -98997 181044 -264870 120929 193071
17551 193071 330731 104428 12925 277105 158511 41092 148386 116926 133901 321989
17541 321989 208401 24557 -45623 329470 63048 31292 216759 291160 35811 452318 -148068
17529 124434 241442 392557 630929 187162 314179 21312 -101734 74994 -22374 -301062
17519 -301062 48796 114461 329897 -81971 352995 -62780 -132070 156030 323303 61133 33029
$$ packed form
17596C3078L20832a08054F2586Q9851a51117A49612J79970j60244a16941B88406
17585b63977M5706B7360a12241q9634N8652C57629d5748k17946e488j72960h3364
17573B19523Q429d4650j9597j58674H8183j5373b39290J14546a0027A93754f6159
17561B25405b87451H8590b02417a0500B01008i8997A81044b64870A20929P2142
17551A93071J37660A04428A2925K64180j18594D1092J07294l1460J6975J88088
17541C21989j13588B4557d5623C29470F3048C1292J85467P4401C5811M16507a48068
17529A24434J17008J51115K38372A87162J27017B1312a01734G4994b2374k78688
17519c01062D8796O5665K15436h1971C52995f2780o9290A56030J67273F1133k8104
$$ plain form
17508 33029 285053 223405 -260207 -199667 193655 221564 487254 137931 46843 -151292
17497 -121165 188605 -105976 -237989 -54286 -77306 295411 19033 164533 -69043 299609
17486 113362 231199 140998 16139 -211530 -137799 174433 81636 312400 268193 -53341 -13379
17474 -152775 -169587 205766 -138380 150563 377924 -254293 147582 230156 199337 72770
17463 50370 338714 1165 173493 397198 -1503 270805 39100 -62294 -180696 344263 65900
17451 135189 332530 347368 250512 270587 118456 183934 299440 161137 186939 179832 206513
17440 206513 185492 126327 310644 -22866 259841 436347 -117284 452148 115134 171531
17430 171531 -170796 13994 362152 753576 -91513 279370 361272 185040 438076 131720
$$ packed form
17508C3029K52024o1648b60207O0540A93655K7909K65690A37931D6843a51292
17497a21165A88605a05976j32013e4286k3020B95411A9033J45500f9043B99609
17486A13362J17837r0201A6139b11530P3731A74433H1636K30764m4207e3341a3379
17474a52775j6812B05766a38380A50563K27361b54293A47582Q2574l0819G2770
17463E0370K88344A165J72328K23705a503B70805C9100f2294j18402C44263F5900
17451A35189J97341J4838r6856K0075A18456O5478J15506j38303K5802p107K6681
17440B06513k1021n9165J84317b2866B59841J76506a17284D52148A15134N6397
17430A71531a70796A3994L48158L91424i1513B79370Q1902j76232K53036A31720
$$ plain form
17419 328341 274283 460651 145319 338593 223922 323653 428509 182380 394537 95598
17408 -68140 568192 178832 245864 266050 145138 167623 -10474 208176 285461 247305 348065
17397 348065 508733 515469 -5867 193522 135365 91630 -38121 136412 574151 197353 549
17385 -64524 89310 470257 234057 252495 -162741 30341 252005 382019 163514 25030
17374 465361 240814 308565 213821 511946 204550 114879 84989 -132164 249717 201715
17364 201715 506876 429282 289355 299020 246247 70064 127883 -144528 -85648 14300 297335
17353 297335 353476 -90550 164090 -94269 157456 101360 -134443 -80720 305078 14250 384017
17342 384017 70240 368422 179217 32891 91853 162377 125543 235005 92779 92286 99316
$$ packed form
17419C28341n4058J86368A45319J93274j14671R9731J04856A82380K12157I5598
17408f8140E68192A78832O7032K0186j20912K2485a0474B08176P7285l8156J00760
17397C48065J60668O736e867A93522n8157m3735c8121A36412M37739A97353E49
17385f4524H9310L80947B34057J8438a62741C0341K21664J30014A63514B5030
17374D65361k24547O7751r4744K98125B04550q9671k9890a32164B49717m8002
17364B01715L05161p7594j39927R665n2773G0064N7819a44528N8880A4300K83035
17353B97335N6141i0550A64090i4269A57456n6096a34443N3723C05078A4250L69767
17342C84017G0240K98182A79217C2891N8962P0524l6834J09462I2779m93P030
$$ plain form
17331 99316 -26550 296324 28693 122795 -30130 -94270 387463 306475 373097 133971 -129807
17319 177132 230715 -46874 35327 673932 91226 674350 -219567 440955 436981 227906 -44477
17307 -13117 126275 165609 300333 102393 251618 405759 -6703 174004 205536 63852 158895
17296 158895 125757 18090 297357 441518 177597 397446 73727 316525 -18524 410379
17285 234674 105662 89266 228341 115730 333688 425011 296280 408365 66990 -62696
17274 158836 442437 269011 178988 345183 132215 85567 48819 -118573 116481 383500
17264 383500 187520 149994 379946 149211 286308 -150077 121254 -56305 345481 457731
17254 457731 355809 55947 235390 291038 57530 236257 171618 383766 240249 270169
$$ packed form
17331I9316b6550B96324B8693R4102c0130o4140C87463q0988O6622A33971a29807
17319A77132N3583d6874C5327O38605I1226N83124b19567D40955l974k09075d4477
17307a3117A26275L9334J34724A02393J49225J54141f703A74004L1532F3852R5043
17296A58895l3138A8090K79267J44161A77597K19849G3727K42798a8524D10379
17285B34674A05662j6396J39075j12611K17958R1323j28731J12085F6990f2696
17274A58836K83601j73426r0023J66195A32215m6648l6748a18573A16481K67019
17264C83500A87520l7526K29952A49211J37097a50077A21254e6305C45481J12250
17254D57731j01922E5947J79443N5648E7530J78727o4639K12148j43517K9920
$$ plain form
17244 270169 321221 225935 99497 -104948 410695 257218 -94394 -94863 92324 232835 257101
17233 257101 138579 157087 -182350 329617 102687 152421 398206 40493 -141641 262341
17222 39940 368062 -31582 378369 505285 356791 441194 -261188 655308 389523 498093
17212 498093 304173 244649 239603 424634 280716 155470 317101 368091 241388 209686
17202 209686 381637 81235 338416 522483 386895 -230488 554170 154738 323219 358049
17192 358049 288246 8065 205477 350754 30266 184107 190033 86439 328836 294110 -103077
17180 86816 403267 248184 276568 305123 237723 268611 324549 556642 144144 248119 126261
17169 126261 369522 121471 322981 492075 151186 179152 246301 280439 -25441 188950
$$ packed form
17244B70169N1052r5286I9497a04948D10695j53477i4394m69I2324J40511K4266
17233B57101j18522J8508a82350C29617A02687M9734K45785D0493a41641B62341
17222C9940L28122c1582C78369J26916j48494Q4403b61188F55308k65785J08570
17212D98093j93920n9524n046J85031j43918j25246J61631N0990j26703l1702
17202B09686J71951H1235K57181J84067j35588b30488E54170A54738J68481L4830
17192C58049o9803H065J97412J45277C0266J53841N926H6439K42397l4726a03077
17180H6816L16451j55083K8384K8555o7400L0888N5938K32093A44144J03975j21858
17169A26261K43261A21471K01510J69094A51186K7966O7149L4138b5441A88950
$$ plain form
17158 563625 182451 292360 569448 323662 148502 197593 465795 267926 630015 328246
17148 328246 223170 442799 579503 537151 417718 397551 530005 142953 274676 102600
17137 220956 722146 -18695 395623 264089 686397 574893 298859 195863 381298 460126
17127 460126 396769 681213 145707 532644 661370 482532 564832 249907 160745 297292
17117 297292 510572 757942 440536 210593 726100 386550 546193 26501 3124 320888
17107 320888 -84257 636687 347007 189191 208779 507060 251428 308514 684164 525497
17097 525497 532853 659448 449780 641564 440010 289608 532883 437126 405019 602280
17087 602280 309417 522857 188449 372533 415011 311292 477630 424604 264063 449650
$$ packed form
17158E63625A82451J09909K77088k45786A48502M9091K68202j97869L62089l01769
17148C28246j05076K19629J36704m2352j19433k0167J32454A42953J31723A02600
17137B20956N01190a8695C95623j31534M22308j11504k76034j02996J85435P8828
17127D60126o3357K84444A45707L86937J28726j78838Q2300B49907q9162J36547
17117B97292K13280K47370l17406B10593N15507l39550J59643B6501C124L17764
17107C20888h4257F36687k89680j57816J9588K98281B51428N7086L75650j58667
17097E25497P356J26595k09668J91784k01554j50402K43275r5757l2107J97261
17087F02280k92863K13440A88449J84084M2478j03719J66338n3026j60541J85587
$$ plain form
17077 449650 478957 758638 369492 616502 649167 763368 766756 482244 599972 498721
17067 498721 458881 519169 465571 618765 393122 721589 272883 733652 517325 461482
17057 461482 675170 468081 657606 601399 311213 656026 390612 803715 858729 714013
17047 714013 406106 601604 845370 978326 680752 690072 368093 479664 565640 560531
17037 560531 578131 568129 685647 543524 735375 394958 634643 776539 670873 692301
17027 692301 656091 338035 832570 1046898 683204 411460 564601 542992 605942 706079
17017 706079 983117 777919 582671 257805 854338 820770 458538 917593 868860 957722
17007 957722 819231 456693 700963 379125 978316 993622 778640 932376 850316 946565
$$ packed form
17077D49650K9307K79681C69492K47010L2665J14201L388k84512J17728j01251
17067D98721l9840O0288n3598J53194k25643L28467B72883M60769k16327n5843
17057D61482K13688k07089J89525n6207k90186L44813k65414M13103N5014j44716
17047G14013l07907J95498K43766J32956k97574R320l21979J11571Q5976n109
17037E60531J7600j0002J17518j42123J91851l40417K39685J41896j05666K1428
17027F92301l6210l18056M94535K14328l63694k71744J53141k1609O2950J00137
17017G06079K77038k05198j95248B57805N96533l3568l62232M59055m8733Q8862
17007I57722j38491l62538K44270l21838N99191J5306k14982J53736q2060R6249
$$ plain form
16997 946565 1097568 754796 1106736 806773 785942 924365 711336 936698 727524 952531
16987 952531 994403 754446 1092228 869849 1131988 995480 944652 865341 831071 1091941
16977 1091941 793384 790467 1206376 981872 1101231 1072693 1327754 901837 889846 1186155
16967 1186155 914335 1089868 1003390 1058806 870992 1273624 930197 1128031 1229605 1084529
16957 1084529 1413483 1102874 1048596 1209541 1473464 1204735 1176382 917440 1417520 1273444
16947 1273444 844894 916274 1065735 1502806 958774 1191475 1017341 1229366 1559881 1040035
16937 1040035 1587803 1546063 1145908 1554955 1376077 1531574 1490509 1578435 1516041 1296154
16927 1296154 1913816 1201072 1281277 1513172 1257411 1616875 1591020 1569038 1254411 1667270
$$ packed form
16997I46565J51003l42772L51940k99963k0831J38423k13029K25362k09174K25007
16987I52531M1872k39957L37782k22379K62139j36508n0828p9311l4270K60870
16977A091941k98557k917M15909k24504J19359k8538K55061m25917j1991K96309
16967A186155k71820J75533q6478N5416j87814M02632l43427J97834J01574j45076
16957A084529L28954l10609n4278J60945K63923k68729k8353k58942N00080j44076
16947A273444m28550P1380J49461M37071n44032K32701j74134K12025L30515n19846
16937A040035N47768m1740m00155M09047j78878J55497m1065Q7926o2394k19887
16927A296154O17662p12744Q0205K31895k55761L59464k5855k1982l14627M12859
$$ plain form
16917 1667270 1370948 1651681 1801280 1847553 1347760 1985763 1936559 1557688 1895413 2287080
16907 2287080 2176380 1850241 1679376 1806089 1834912 1813404 1886519 1468264 2324743 1987539
16897 1987539 2058709 2309569 2115130 2306739 2273782 2496816 2125481 2365148 2256438 2392219
16887 2392219 2348227 2545224 2455170 2461205 2503230 2620708 2608737 2965107 2662466 2450268
16877 2450268 2731652 2609278 3057938 2662669 2829526 2693673 2870521 2613699 3030887
16868 3030887 2915426 3052278 2954457 2982899 3162577 3110757 3532486 3188111 3255971 3007803
16858 3007803 3270398 3652863 3368647 3392757 3481169 3281354 3479511 3485628 3682606 3907991
16848 3907991 3810057 3909988 4004006 4025159 4306116 4024652 4397990 4352981 4478688 4604982
$$ packed form
16917A667270k96322K80733J49599M6273m99793O38003m9204l78871L37725L91667
16907B287080j10700l26139j70865J26713K8823k1508P3115m18255Q56479l37204
16897A987539P1170K50860j94439J91609l2957K23034l71335K39667j08710J35781
16887B392219m3992J96997r0054O035M2025J17478j1971L56370l02641k12198
16877B450268K81384j22374M48660l95269J66857j35853J76848k56822M17188
16868C030887j15461J36852r7821K8442J79678n1820M21729l44375O7860k48168
16858C007803K62595L82465k84216K4110Q8412j99815J98157O117J96978K25385
16848C907991r7934R9931R4018K1153K80957k81464L73338m5009J25707J26294
$$ plain form
16838 4604982 4376829 4872612 4640380 4462355 4834625 4701518 4873313 5028850 5091042 5373160
16828 5373160 5266869 5791046 5398411 5515132 5588106 5655334 6148159 6177057 6108586 6317064
16818 6317064 6294774 6813468 6669474 6631964 7083789 7084459 7094100 7782896 7576897 7429405 7777931
16807 7777931 8061165 8264550 8387011 8017754 8717556 8976960 9434619 9228294 9512523
16798 9512523 9581245 9776780 10463647 10376976 10758085 10776134 11035557 11461532 11831363 11587081
16788 11587081 11956159 12682963 13008987 13432051 13763741 13903332 14587910 15150998 15212837
16779 15212837 15878430 16421153 17011564 17239873 17791584 18793439 19116005 19455185 20014063
16770 20014063 21330607 21545196 22485143 23373984 24005993 24771119 25661509 26450574 27596513
$$ packed form
16838D604982k28153M95783k32232j78025L72270j33107J71795J55537O2192K82118
16828E373160j06291N24177l92635J16721P2974O7228M92825K8898o8471K08478
16818F317064k2290N18694j43994l7510M51825O70R641O88796k05999j47492L48526
16807G777931K83234K03385J22461l69257O99802K59404M57659k06325K84229
16798I512523O8722J95535O86867q6671L81109J8049K59423M25975L69831k44282
16788A1587081L69078P26804L26024M23064L31690J39591O84578N63088O1839
16779A5212837O65593N42723N90411K28309N51711J001855L22566L39180N58878
16770B0014063J316544K14589R39947Q88841O32009P65126Q90390P89065J145939
$$ plain form
16761 27596513 28647543 29896540 31084220 32357782 33583577 34800800 36228263 37885119
16753 37885119 39418631 41396687 43130966 45141766 47188286 49448009 51344640 53938624
16745 53938624 56706055 59516127 62211609 65551478 68518690 72274159 76025009 80003085
16737 80003085 84095442 88589189 93189248 97682709 102977815 108175309 113533308 119566878
16729 119566878 125105231 130850911 136459354 142385181 147904369 153451692 158363838 163428269
16721 163428269 167458928 171195663 173953423 175759762 176741563 176797236 176111998 174888234
16713 174888234 172225018 169558396 165341834 161051124 155847745 150785846 145301296 139241175
16705 139241175 133558108 127669224 122090751 116219762 110407440 104826825 99615032 95023065
$$ packed form
16761B7596513J051030J248997J187680J273562J225795J217223J427463J656856
16753C7885119J533512J978056J734279K010800K046520K259723J896631K593984
16745E3938624K767431K810072K695482L339869K967212L755469L750850L978076
16737H0003085M092357M493747M600059M493461N295106N197494N357999O033570
16729A19566878N538353N745680N608443N925827N519188N547323M912146N064431
16721A63428269M030659L736735K757760J806339R81801N5673o85238j223764
16713A74888234k663216k666622m216562m290710n203379n061899n484550o060121
16705A39241175n683067n888884n578473n870989n812322n580615n211793m591967
$$ plain form
16697 95023065 90000760 85571663 81010228 77148789 73134251 69431785 65989327 62925593
16689 62925593 59527804 56929388 54142209 51849677 49403488 46959392 45071623 43287941
16681 43287941 41115825 38946400 37879537 36326322 34359666 33070557 31738713 30685536
16673 30685536 29654898 28104378 27623446 26519787 25653055 24408829 23736240 22708421
16665 22708421 21778369 21098433 20796244 20075654 19232312 18413534 17833589 17489718 16820700
16656 16820700 16338459 15826988 15569950 14805083 14583495 14012566 13862461 13416499 12996050
16647 12996050 12618474 12293215 11878405 11956379 11551834 11362063 10838160 10648910 10241665
16638 10241665 10164698 9943305 9558547 9450944 9416823 8969098 8565476 8694638 8289166 8260808
$$ packed form
16697I5023065n022305m429097m561435l861439m014538l702466l442458l063734
16689F2925593l397789k598416k787179k292532k446189k444096j887769j783682
16681D3287941k172116k169425j066863j553215j966656j289109j331844j053177
16673C0685536j030638j550520m80932j103659q66732j244226o72589j027819
16665B2708421r30052o79936l02189p20590q43342q18778n79945l43871o69018
16656A6820700m82241n11471k57038p64867k21588n70929j50105m45962m20449
16647A2996050l77576l25259m14810P7974m04545j89771n23903j89250m07245
16638A0241665p6967k21393l84758j07603l4121m47725m03622J29162m05472k8358
$$ plain form
16628 8260808 7978748 7637843 7618478 7384724 7176129 7189672 6782919 6612141 6646053 6261951
16618 6261951 6001761 6113211 5969023 5899008 5743831 5777047 5808994 5088631 5625894 5341386
16608 5341386 5379052 5320682 5008157 4896320 4775820 4831127 4844117 5044215 4645330 4443898
16598 4443898 4692449 4156458 4212536 4097512 3871331 3966878 3891770 3776546 3557325 3902060
16588 3902060 3623117 3760262 3653781 3439925 3612437 3661880 3314588 3412272 3130363 3379880
16578 3379880 3186647 2925041 3195931 3063911 2902262 2780118 2808507 2943795 2893661 2633363
16568 2633363 2673454 2856599 2897736 2302893 2892136 2629489 2788862 2808223 2299545 2549347
16558 2549347 2256766 2732087 2419764 2407352 2601677 2371044 2202120 2488774 2321203 2081464
$$ packed form
16628H260808k82060l40905j9365k33754k08595J3543m06753j70778L3912l84102
16618F261951k60190J11450j44188p0015j55177L3216L1947p20363N37263k84508
16608E341386L7666n8370l12525j11837j20500N5307J2990K00098l98885k01432
16598D443898K48551n35991N6078j15024k26181R5547p5108j15224k19221L44735
16588C902060k78943J37145j06481k13856J72512M9443l47292R7684k81909K49517
16578C379880j93233k61606K70890j32020j61649j22144K8389J35288n0134k60298
16568B633363M0091J83145M1137n94843N89243k62647J59373J9361n08678K49802
16558B549347k92581M75321l12323j2412J94325k30633j68924K86654j67571k39739
$$ plain form
16548 2081464 2300610 2502576 2351283 2178538 2291634 1831629 2012456 1932211 1815638 1905762
16538 1905762 2015152 1696020 1724474 1505836 1521125 1871421 1844625 1877882 1516667 1679406
16528 1679406 1413075 1699711 1637079 1772103 1653212 1573622 1235695 1461615 1614204 1530037
16518 1530037 1326301 1458222 1427773 1457265 1615714 1735747 1533604 1697156 1454587 1478437
16508 1478437 1502419 1068327 1494934 1153146 1530459 1191664 1192577 1255125 1209449 928871
16498 928871 1358317 1080093 1168465 1318621 1276706 1230730 1093121 1305946 1090682 1371289
16488 1371289 954662 1352670 1103507 918659 1386625 900656 1030118 1186457 934019
16479 934019 1039009 879578 945169 981614 1127507 749629 1069036 650304 716483 1033251
$$ packed form
16548B081464K19146K01966j51293j72745J13096m60005J80827q0245j16573R0124
16538A905762J09390l19132K8454k18638J5289L50296k6796L3257l61215J62739
16528A679406k66331K86636o2632J35024j18891p9590l37927K25920J52589q4167
16518A530037k03736J31921l0449K9492J58449J20033k02143J63552k42569K3850
16508A478437K3982m34092M26607l41788L77313l38795R13O2548m5676k80578
16498I28871M29446k78224Q8372J50156m1915m5976j37609K12825k15264K80607
16488A371289m16627L98008k49163j84848M67966m85969J29462J56339k52438
16479I34019J04990j59431O5591L6445J45893l77878L19407m18732O6179L16768
$$ plain form
16469 1033251 992276 846794 1177468 1219858 832364 707626 1052922 1040441 1058492 780648
16459 780648 1028833 774730 1166722 1049152 668354 1018385 750760 976478 910795 1002490
16449 1002490 847980 758103 728018 513163 819465 717377 692111 788786 1041389 1018231
16439 1018231 690848 884203 811113 525584 962183 577582 915977 842613 797179 611363
16429 611363 970035 812903 1016161 877544 819596 637585 581709 647915 203082 694596
16419 694596 1025965 851129 832492 570662 604844 514330 653563 912687 692440 709714
16409 709714 467976 675096 593000 461698 583720 715050 892249 516159 764087 704634
16399 704634 481377 323830 601226 183958 391739 239633 671626 250186 493683 579347
$$ packed form
16469A033251m0975j45482L30674M2390l87494j24738L45296j2481J8051k77844
16459G80648K48185k54103L91992j17570l80798L50031k67625K25718o5683R1695
16449A002490j54510q9877l0085k14855L06302j02088k5266R6675K52603k3158
16439A018231l27383J93355p3090k85529M36599l84601L38395p3364m5434j85816
16429F11363L58672j57132K03258j38617n7948j82011n5876O6206B03082M91514
16419F94596L31369j74836j8637k61830L4182r0514J39233K59124k20247J7274
16409G09714k41738K07120q2096j31302J22022J31330J77199l76090K47928n9453
16399G04634k23257j57547K77396A83958K07781j52106M31993B50186K43497Q5664
$$ plain form
16389 579347 506294 189416 516445 864888 540042 479337 208139 360470 193636 267772
16379 267772 371530 490974 534600 425096 555361 453078 574531 669384 630481 463270
16369 463270 418691 562707 421115 383897 152051 464964 749766 302421 415419 511102
16359 511102 481946 466879 215780 320126 664920 186179 219420 585757 114275 303322
16349 303322 573229 315413 164300 351754 290502 377992 453211 533943 409959 537482
16339 537482 539866 456637 266022 579000 433480 455189 176381 210434 409247 241090
16329 241090 323263 691387 403424 263785 190576 504114 161648 351832 278557 109846
16318 833483 555258 428446 191082 87092 313327 195669 18701 23838 313209 147126
$$ packed form
16389E79347p3053A89416L27029L48443l24846o0705B08139J52331j66834P4136
16379B67772J03758J19444M3626j09504J30265j02283J21453R4853l8903j67211
16369D63270m4579J44016j41592l7218A52051L12913K84802C02421J12998R5683
16359E11102k9156j5067B15780J04346L44794A86179L3241L66337A14275J89047
16349C03322K69907k57816j51113J87454o1252Q7490P5219Q0732j23984J27523
16339E37482K384q3229j90615L12978j45520K1709A76381L4053J98813j68157
16329B41090Q2173L68124k87963j39639p3209L13538A61648J90184p3275A09846
16318H33483k78225j26812A91082H7092K26235j17658A8701N137K89371A47126
$$ plain form
16307 348492 639818 311489 111128 101246 321710 238196 -49427 104309 404637 201036
16296 405485 624565 639092 385162 194597 173846 471631 -37311 -36299 266859 118285
16285 297210 259170 44269 181396 275051 375717 286645 219897 402064 34704 374156 537630
16274 537630 271441 218436 123819 -130243 240438 302070 154289 258403 319636 191747
16264 191747 85790 -383772 293194 292614 161759 123179 101699 329398 192634 535514 346026
16253 346026 -159232 126898 252068 426990 305639 268308 281379 79305 197251 144360
16243 144360 96275 500252 117047 54468 239873 402127 53786 248824 98224 258007
16233 258007 85781 182501 289665 517568 305048 450650 117495 322023 -140624 112443
$$ packed form
16307C48492K91326C11489A11128r882K20464q3514d9427A04309L00328B01036
16296D05485K19080J4527k53930j90565k0751K97785c7311J012B66859A18285
16285B97210l8040D4269J37127R3655J00666q9072o6748J82167C4704L39452J63474
16274E37630k66189n3005r4617a30243B40438O1632j47781J04114O1233j27889
16264A91747H5790c83772B93194n80j30855l8580k1480K27699j36764L42880j89488
16253C46026a59232A26898J25170J74922j21351l7331J3071G9305J17946n2891
16243A44360m8085M03977A17047E4468J85405J62254E3786J95038I8224J59783
16233B58007H5781R6720J07164K27903k12520J45602A17495K04528a40624A12443
$$ plain form
16222 247860 360503 -27628 270033 141349 127632 -44020 -297674 418863 12880 77776
16212 77776 -55227 67969 305944 60134 323914 28567 92150 339367 31211 165364 -62258
16200 31349 185585 347056 245460 162730 384566 -27202 -68748 17150 84212 -184075 3225
16188 382966 323753 286599 118993 -79373 240099 -170172 -74767 303026 26273 378716
16178 378716 -162766 -90780 41682 -3499 193056 308337 482560 253714 337639 -62548 -29115
16166 93233 -58363 7350 -30936 115375 433100 -106345 151454 274677 -995 107050 -243199
16154 82626 130090 -64760 -267488 -12370 333622 -82648 -120126 35591 159184 37901 285411
16143 285411 21594 28855 14927 231347 80244 32737 -33959 113323 -315909 135550 56561
$$ packed form
16222B47860J12643b7628B70033j28684j3717d4020k53654D18863A2880O4896
16212G7776e5227F7969K37975F0134K63780B8567O3583K47217C1211J34153f2258
16200C1349J54236J61471j01596q2730K21836b7202m1546A7150O7062a84075C225
16188C82966n9213l7154A18993g9373B40099a70172g4767C03026B6273L52443
16178C78716a62766P1986D1682c499A93056J15281J74223k28846Q3925f2548b9115
16166I3233e8363G350c0936A15375L17725a06345A51454J23223i95A07050b43199
16154H2626M7464f4760k02728a2370C33622h2648l7478C5591J23593C7901K47510
16143B85411B1594P261j3928K16420H0244C2737c3959A13323c15909A35550E6561
$$ plain form
16131 45710 374429 138526 -136960 277227 -259927 232520 83392 212716 234341 -165587
16120 174473 -149029 -17673 8818 -224621 211345 249038 381939 116580 -131596 130965
16109 76715 133893 241072 32394 291215 248817 62101 263091 -85007 225466 -9063 624595
16097 215629 -84190 215145 -294269 553490 -10143 -32594 372509 207065 257954 -81709
16086 221717 50520 17786 201750 -192726 -1794 100217 244952 111676 423089 -43477
16075 328859 114000 -80411 -183845 73573 -31002 -49216 -107682 257036 146536 -229386
16064 -144509 -98674 357887 -78432 -69676 -64987 118537 54298 118110 7248 -24238 136924
16052 107870 343019 391689 249520 262801 395497 113800 -56411 -104279 -224315 -31578
$$ packed form
16131D5710L28719A38526a36960B77227b59927B32520H3392J29324K1625a65587
16120A74473a49029a7673H818b24621B11345L7693J32901A16580a31596A30965
16109G6715N7178J07179C2394K58821m2398F2101K00990h5007B25466i063F24595
16097B15629h4190B15145b94269E53490a0143k2451C72509j65444N0889h1709
16086B21717E0520A7786J83964a92726a794A00217J44735A11676L11413d3477
16075C28859A14000h0411j03434G3573c1002j8214n8466B57036j10500b29386
16064a44509M5835C57887g8432Q756M689A18537E4298O3812G248b4238A36924
16052A07870K35149M8670j42169J3281J32696A13800e6411m7868j20036c1578
$$ plain form
16041 -177509 -66644 -129581 -137114 83359 -72514 163791 -117546 224815 115711 -84895 -339297
16030 -339297 -41884 7845 -32077 -285233 -93973 23874 370934 154879 80116 37132 276669
16019 276669 -126654 948 149611 50003 -2967 -203229 266020 -55075 -266716 -154525 66332
16007 -9973 -49212 -41567 306005 146941 239501 -28606 44105 82944 -58428 -207747 112573
15995 -97652 -4410 -140690 117399 -162516 42830 -407173 263182 -72259 -22747 -145002 -24485
15983 -213063 351622 160350 280910 234951 333831 213275 61381 -344628 -44677 -598910
15973 -598910 235618 -122927 74249 -390913 -58118 395180 87852 -60533 134791 102279
15963 102279 -151699 320440 162095 -149718 122558 -116200 117677 140378 123942 -60774
$$ packed form
16041a77509f6644o2937p533H3359g2514A63791a17546B24815j09104h4895k54402
16030c39297d1884G845c2077k53156i3973B3874L47060A54879p4763C7132K39537
16019B76669a26654I48J48663E0003b967k00262B66020e5075k11641J12191F6332
16007i973l9239P645C06005A46941R2560b8606D4105L8839e8428j49319A12573
15995i7652d410j36280A17399a62516D2830d07173B63182g2259b2747j22255b4485
15983b13063C51622A60350J20560m5959R8880j20556F1381c44628d4677n54233
15973e98910B35618a22927G4249c90913e8118C95180H7852f0533A34791l2512
15963A02279a51699C20440j58345a49718A22558a16200A17677K2701j6436f0774
$$ plain form
15952 -42870 -120153 78717 65243 117478 -232970 161370 -117440 74401 146011 -51246 -338844
15941 -338844 74942 153751 91696 -98075 -112409 108067 -162565 -32365 154369 63738 19183
15929 -277417 -130213 113099 -140068 67275 213276 -49648 -180690 -277222 -25165 -112811
15919 -112811 23219 -116057 117379 311703 -49707 80438 -116143 143370 12283 100802
15909 100802 65241 -258450 164416 -50107 -57222 204196 120023 336169 -139770 -93619 82743
15897 110468 29572 -185940 -34261 -117404 -278156 -193389 -184865 1446 -177715 -289096 142590
15885 -136152 -82875 49725 171730 65596 455286 277237 -41202 -174278 -176174 -130374 253958
15873 -112514 -220386 -199008 45266 263094 -183872 99830 250150 154232 -29805 18775 -85625
$$ packed form
15952d2870p7283G8717j3474N2235b32970A61370a17440G4401P1610e1246k87598
15941c38844G4942P8809o2055i8075j4334A08067a62565c2365A54369F3738A9183
15929b77417a30213A13099a40068F7275J46001d9648j31042r6532b5165q7646
15919a12811B3219a16057A17379J94324d9707H0438a16143A43370A2283Q8519
15909A00802l5561b58450A64416e0107p115B04196q4173K16146a39770M6151H2743
15897A10468B9572a85940c4261q3143j60752Q4767Q524A446a77715j11381A42590
15885a36152N3277D9725J22005F5596L89690j78049d1202j33076j896M5800B53958
15873a12514j07872K1378D5266K17828a83872I9830J50320r5918b9805A8775h5625
$$ plain form
15861 109492 259437 91366 -214946 -105379 358419 -83677 63473 31254 217508 -102081
15850 -101928 -80177 -169168 -94887 -117906 -86610 -125156 141223 -43470 -5449 265070 39816
15838 -107630 -157262 -3790 -90517 58063 171865 433386 96665 291559 157464 -43666 124463
15826 -14014 74229 104104 170802 -97697 -182132 -562235 77754 -104615 -33898 -305951 -5122
15814 -119395 -60320 177810 -297395 69017 88964 -100390 195098 38301 -85537 81625 33361
15802 -41253 52400 -8926 -202101 168767 -21654 41161 85620 -57199 210814 -227247 -337347
15791 -337347 -152434 41213 -116574 85189 -78184 58018 -14422 -140880 -285888 -37394 -67641
15780 -67641 -98900 -193069 -223925 162652 357793 128888 -128224 -46023 -100541 -67310 4834
$$ packed form
15861A09492J49945I1366b14946a05379C58419h3677F3473C1254J86254a02081
15850a01928K1751q8991P4281k3019L1296l8546A41223d3470e449B65070C9816
15838a07630m9632c790q6727E8063J13802K61521I6665J94894j34095d3666A24463
15826a4014G4229K9875O6698i7697q4435l80103G7754a04615c3898k72053e122
15814a19395N9075A77810b97395F9017J9947a00390A95098C8301h5537H1625C3361
15802d1253E2400h926j93175A68767b1654D1161M4459e7199B10814b27247j10100
15791c37347a52434D1213a16574H5189g8184E8018a4422j26458j45008c7394l0247
15780f7641l1259r4169l0856A62652J95141A28888a28224d6023n4518L3231D834
$$ plain form
15768 267837 -41373 88202 250443 -80914 -384843 -98097 87810 -122369 -18047 -99581 -34080
15756 55650 17453 161246 -125198 -58139 -42163 35052 168130 15290 29509 -4662 25231
15744 28036 157079 298680 250021 330256 -74300 -137060 -2756 -235229 -69440 -190397 20331
15732 -189281 12508 312923 -72099 -136788 288395 114589 -116578 -297968 -123126 -244446
15722 -244446 106362 224961 212449 -78813 18475 12538 306252 -236616 10510 -292666 -202759
15711 -202759 310420 -376364 42668 -93525 -151851 190485 250739 388327 -74422 -212973
15701 -212973 -20896 -112783 -300299 177667 -65228 -92204 -386379 28359 121832 -112631 192098
15689 -318172 -147712 38437 -252333 -86008 -288652 -268806 -301879 112963 -161814 -319395
$$ packed form
15768B67837d1373H8202J62241h0914l03929i8097H7810a22369a8047q1534c4080
15756E5650A7453J43793a25198e8139J5976C5052J33078A5290J4219d662B5231
15744B8036J29043J41601m8659Q0235g4300o2760b756k32473f9440j20957B0331
15732a89281A2508L00415g2099o4689B88395A14589a16578j81390a23126j21320
15722b44446A06362J18599j2512g8813A8475n937K93714b36616A0510b92666Q9907
15711b02759C10420c76364D2668i3525n8326A90485O0254J37588g4422j38551
15701b12973b0896r1887j87516A77667f5228k6976k94175B8359R3473a12631A92098
15689c18172a47712C8437b52333h6008k02644J9846l3073A12963a61814j57581
$$ plain form
15679 -319395 311768 -13163 -325273 89209 88584 -191355 -159411 -309361 -64244 104931 204766
15668 204766 41547 155827 74247 49092 220103 -225701 -270339 -41375 -47539 370051 -144911
15656 -73058 -248803 -45838 -441769 -157206 29244 -66817 63026 -155390 -68878 175041 -68944
15644 -39228 123627 60482 -9772 106518 -135553 -131851 188189 11648 133362 -130893 -57724
15632 41051 -13278 -114779 33291 -140136 -219150 73633 -9787 19520 71121 177365 -318838
15620 -36369 64829 229583 -118768 -237096 -278159 -271913 30431 178670 48254 35307 -136591
15608 -21527 -264860 -172125 59823 29574 -180033 86175 8523 10848 74151 90693 193081
15597 193081 8191 -278189 -116593 -13091 86391 129958 122746 -102001 78851 -74958 -119286
$$ packed form
15679c19395C11768a3163l12110H9209o25a91355L1944j49950f4244A04931R9835
15668B04766D1547J14280G4247k5155J71011b25701m4638d1375o164C70051a44911
15656g3058j75745d5838l95931a57206B9244f6817F3026a55390f8878A75041f8944
15644c9228A23627F0482i772A06518a35553L702A88189A1648J21714a30893e7724
15632D1051a3278j01501C3291a40136p9014G3633i787A9520N1601J06244c18838
15620c6369F4829J64754a18768j18328m1063O246C0431J48239D8254j2947a36591
15608b1527k43333R2735E9823B9574a80033H6175H523K325O3303J6542J02388
15597A93081H191b78189a16593a3091H6391M3567p212a02001G8851g4958m4328
$$ plain form
15586 -119286 267068 267035 -143861 419229 4484 -310733 48647 98885 98409 -254489 -120680
15574 82732 -29418 307923 205277 176008 -252844 -24420 56125 -131187 -138602 -243490 -47672
15562 -94069 216150 137057 -98190 169964 -233369 -293857 174222 -113777 197503 -214748
15551 -151006 -16989 -189922 24985 89374 92453 2867 92370 -236234 98545 -157199 -40005
15539 88705 6266 68565 290649 -104115 -194383 260094 171592 -220408 -25891 -166387 35928
15527 49163 209700 -129727 -43565 58889 673 -70352 -50036 -177156 110185 131941 -81421
15515 145295 203459 96340 -366866 -27566 128119 222931 -65684 304660 -112168 -346958
15505 -346958 -21861 -16189 -65752 56185 43756 64614 -211179 69466 299501 -222029 -6975
$$ packed form
15586a19286B67068l3a43861D19229D484c10733D8647N0238m76b54489a20680
15574H2732b9418C07923j02646k9269b52844b4420E6125a31187p415j04888d7672
15562i4069B16150p9093i8190A69964b33369o0488A74222a13777A97503b14748
15551a51006a6989j72933B4985O4389L079B867Q9503b36234I8545a57199d0005
15539H8705F266O2299K22084a04115r0268B60094q8502b20408b5891j40496C5928
15527D9163J60537a29727d3565E8889F73g0352K0316j27120A10185K1756h1421
15515A45295N8164I6340c66866b7566A28119R4812f5684C04660a12168k34790
15505c46958b1861N672m9563E6185j2429K0858b11179F9466K30035b22029f975
$$ plain form
15493 -132233 71408 -32280 103332 -15401 -154143 -192145 253301 -177278 -289162 64425
15482 -116566 -136910 70754 227784 -39855 -98349 -68060 -113697 93701 76022 86462 132223
15471 132223 133112 41727 -40317 -168552 -273386 -359595 -113776 38586 175563 -53032 27515
15459 295484 -13334 78837 168413 -3319 -76109 -175080 96312 -222268 145964 80038 -90876
15447 121597 -37273 252587 109205 232711 142641 -192370 -99978 48744 3970 -221009 51830
15435 68734 -6386 -83050 -182578 98062 83435 -170192 74569 -43279 -53981 -164607 114345
15423 -121323 77670 -160985 -149601 -340217 156477 -94953 -219546 36247 -683 -115275 -129658
15412 -129658 -83110 -165840 261097 -138564 -40346 -113878 -341493 304834 -6372 516073 -99391
$$ packed form
15493a32233G1408c2280A03332a5401j38742l8002B53301a77278j11884F4425
15482a16566k0344G0754J57030c9855n8494L0289m5637I3701j7679J0440M5761
15471A32223Q89D1727d0317j28235j04834q6209a13776C8586J36977e3032B7515
15459B95484a3334G8837Q9576c319p2790r8971I6312b22268A45964o5926i0876
15447A21597c7273B52587A09205J23506r0070a92370R2392D8744C970b21009E1830
15435F8734f386p6664r9528I8062j4627a70192G4569d3279j0702j10626A14345
15423a21323G7670a60985J1384j90616A56477i4953j24593C6247f83j14592j4383
15412a29658M6548q2730B61097a38564d0346p3532k27615C04834f372E16073i9391
$$ plain form
15400 467206 -153715 -127976 -51748 -145706 110012 26082 -115832 -70717 -106020 6254 -154472
15388 233463 243112 134018 107452 -58393 171522 -189496 -171568 37499 175385 -95897 -23986
15376 -273578 -275480 261492 277562 94204 124274 194740 545485 -99129 -145331 -436940 42930
15364 -44010 250110 -111605 -76099 -89862 210288 -234267 257019 -100396 391375 -63045
15353 60200 82965 244264 -133622 100455 290007 -140095 -21649 176816 172489 -7401 -49311
15342 -49311 264964 -106182 106750 -106054 -102531 100335 155542 -283640 155884 187803
15332 187803 68690 426678 34598 74685 -124788 415622 -2089 -58118 -12973 265176 78486
15320 -16099 131790 53514 -151098 120003 -295526 262355 129630 383932 362684 -30557
$$ packed form
15400D67206a53715K5739e1748r3958A10012B6082a15832M5115l5303F254a54472
15388B33463R649j09094k6566e8393A71522a89496J7928C7499J37886i5897b3986
15376b73578j902B61492J6070I4204L0070P0466L50745i9129m6202k91609D2930
15364d4010B50110a11605L5506j3763B10288b34267B57019a00396C91375f3045
15353F0200K2765J61299a33622A00455J89552a40095b1649A76816m327g401m1910
15342d9311B64964a06182A06750a06054L523A00335N5207b83640A55884L1919
15332A87803F8690L57988C4598M0087a24788D15622b089n6029a2973B65176G8486
15320a6099A31790E3514a51098A20003b95526B62355A29630K54302k1248c0557
$$ plain form
15309 -127318 -124247 -45266 214102 -59300 222468 -46557 136334 -56011 32764 179252 -288962
15297 199735 384646 -257133 -199130 -89917 422353 136167 -119068 233938 -22302 174590
15286 -68431 -98224 93492 241940 322140 157489 181548 -210543 -13281 91844 -184650 85531
15274 167572 -163133 -73687 -4832 39489 96825 90012 70900 366368 -29161 73526 245735
15263 245735 141337 111014 75919 -69734 25281 -204986 -1755 188272 -80657 -79050 248232
15251 -65183 224995 61930 586516 271862 1012885 2237387 2453252 1998418 2116186 1302947
15241 1302947 536172 4854 264987 171945 42739 54459 233923 412847 139985 65375
15230 -171226 69914 24481 94719 -11114 337978 -227184 56460 53681 232822 -28798 76878
$$ packed form
15309a27318L071d5266B14102e9300B22468d6557A36334e6011C2764J46488b88962
15297A99735J84911b57133N8003h9917D22353A36167a19068B33938b2302A74590
15286f8431k9793I3492J48448Q0200A57489K4059b10543a3281I1844a84650H5531
15274A67572a63133g3687d832C9489N7336o813j9112K95468b9161G3526J72209
15263B45735j04398l0323l5095f9734B5281b04986a755A88272h0657J607B48232
15251f5183B24995F1930N24586B71862P41023J224502K15865m54834J17768q13239
15241A302947E36172D854K60133r3042D2739J1720J79464J78924A39985F5375
15230a71226F9914B4481P0238a1114C37978b27184E6460k779J79141b8798G6878
$$ plain form
15218 364706 -148957 298338 -51067 -52749 605948 -109602 -215443 338900 -52798 229274
15207 -125732 267390 304475 277049 195429 215630 153622 65047 265893 298964 92733 -10506
15195 -89323 75736 438685 107322 43696 -117741 171712 124613 249009 188886 -217958
15184 158879 -45605 163911 162469 55833 297820 -213823 85806 -14788 -74853 -258711 -20589
15172 403749 -137188 -234755 204824 282136 71586 148210 532173 -4321 52344 -28227 -22754
15161 -22754 257295 -31381 258419 -114222 303259 229460 128715 328164 83827 72440
15151 72440 -11428 222461 -108128 -17567 157738 188118 -62981 225748 -99259 -2364 32313
15139 -110095 597550 249062 158898 -9381 -153889 119909 -296398 275426 -103638 60960
$$ packed form
15218C64706a48957B98338e1067j682F05948a09602j05841C38900e2798B29274
15207a25732B67390L7085k7426q1620K0201o2008F5047K00846L3071I2733a0506
15195h9323G5736L62949A07322D3696a17741A71712m7099J24396o0123b17958
15184A58879d5605A63911j442E5833K41987b13823H5806a4788o0065j83858b0589
15172D03749a37188r7567B04824P7312G1586P6624L83963d321E2344b8227N473
15161b2754B57295c1381B58419a14222C03259p3799j00745J99449H3827j1387
15151G2440a1428B22461a08128a7567A57738L0380f2981B25748i9259b364C2313
15139a10095E97550B49062r0164i381j44508A19909b96398B75426a03638F0960
$$ plain form
15128 19988 12863 144576 133100 40790 265989 165792 102752 -26175 71860 314699 162542
15117 162542 116427 500120 150917 294279 -111199 243498 148499 157221 106935 66501 447319
15106 447319 361407 257725 45270 50487 410081 185994 -18258 340978 89184 333721 204659
15095 204659 342618 68682 -53439 257597 233736 148661 59525 451862 -13631 295618 300205
15084 300205 356076 359453 106740 140273 207251 246539 552411 133355 -102848 295100 125459
15072 110117 17164 209708 303679 229755 45286 459320 18595 148752 198282 117346 245371
15061 245371 79347 21417 80934 114585 -194274 -47195 466665 -14928 -31649 369401 344923
15050 344923 40405 266441 212775 218255 -80487 382228 94850 148483 48080 4025 81002
$$ packed form
15128A9988p125J31713j1476D0790K25199j00197o3040b6175G1860K42839j52157
15117A62542m6115L83693A50917J43362a11199B43498r4999Q722n0286m0434L80818
15106D47319q5912j03682D5270N217L59594A85994a8258C40978H9184K44537j29062
15095B04659J37959F8682e3439B57597k3861q5075E9525L92337a3631B95618M587
15084C00205N5871L377A06740L3533O6978L9288L05872A33355a02848B95100A25459
15072A10117A7164J92544R3971p3924D5286M14034A8595J30157M9530q0936J28025
15061B45371G9347B1417N9517L3651a94274d7195D66665a4928j6721C69401k4478
15050C44923D0405K26036n3666N480h0487C82228I4850N3633D8080D025P6977
$$ plain form
15039 81002 75705 109388 -6720 260196 493504 158387 193381 126425 297724 292347 27884
15027 541725 22176 172664 28654 300641 207365 -1710 18202 305051 251491 268547 562692
15016 562692 148304 280550 262328 19616 -32074 304309 242243 172977 326503 -6076 113505
15004 497349 295932 -65633 101390 74627 210471 325187 -23167 154041 81019 -141686
14993 381472 76414 209382 488816 221333 197601 73968 428566 -42756 163207 245891
14983 245891 419481 194975 252408 131177 62884 68928 411275 323412 90548 155029 218858
14972 218858 395502 524583 90687 468537 176188 -91553 328721 369892 168636 160674
14962 160674 318921 342829 468163 417490 -93002 217643 231870 245203 146345 493277 654019
$$ packed form
15039H1002n297L3683f720B60196K33308A58387L4994o6956J71299n377B7884
15027E41725B2176J50488B8654K71987r3276a710A8202K86849n3560J7056K94145
15016E62692A48304J32246j8222A9616c2074C04309o2066o9266J53526f076A13505
15004D97349k01417f5633A01390k6763J35844J14716b3167A54041p3022a41686
14993C81472G6414J32968K79434B21333k3732G3968L54598d2756A63207Q2684
14983B45891J73590A94975N7433j21231F2884O044L42347q7863I0548O4481O3829
14972B18858J76644J29081I0687L77850A76188i1553C28721M1171A68636p962
14962A60674J58247K3908J25334n0673i3002B17643J4227J3333r8858L46932J60742
$$ plain form
14951 654019 580325 273291 228372 540807 274868 156268 410202 -330027 447638 331902
14941 331902 375916 65663 435384 140151 301765 367274 226408 348463 270308 368591
14931 368591 388564 243669 124588 81004 479258 524498 652288 535507 268064 407688
14921 407688 -19422 233963 206733 342803 350540 318873 160787 304307 335680 476304 539058
14910 539058 541541 463322 552239 352369 440096 634340 453639 468939 423069 287195 372607
14899 372607 87560 454048 266256 264680 186854 15243 392255 415791 233593 306473 225238
14888 225238 629611 289163 -99285 332840 367577 -144040 480662 333080 661631 112627
14877 644171 356520 466692 405829 537811 554360 580357 646476 163734 449434 247403
$$ packed form
14951F54019p3694B73291m4919L12435k65939j18600K53934c30027D47638j15736
14941C31902M4014F5663L69721A40151J61614O5509j40866J22055p8155R8283
14931C68591J9973j44895j19081m3584L98254M5240J27790j16781k67443J39624
14921D07688a9422B33963k7230J36070P737l1667j58086J43520L1373J40624O2754
14910E39058K483p8219Q8917j99870Q7727J94244j80701J5300m5870j35874Q5412
14899C72607H7560L66488j87792j576p7826A5243L77012K3536j82198P2880q1235
14888B25238M04373B89163i9285C32840L4737a44040D80662j47582L28551A12627
14877F44171k87651J10172o0863J31982J6549K5997O6119A63734K85700k02031
$$ plain form
14867 247403 397255 433325 303343 390373 521046 608398 233418 320244 577696 384814
14857 384814 581700 395706 289424 488607 651820 359079 359233 -51668 440358 233699
14847 233699 233649 254368 578106 264951 202050 322103 426027 467201 192649 422989 342651
14836 342651 710067 714008 382395 380376 521014 -13578 495919 610314 354849 255146 680437
14825 680437 635276 599420 474254 651175 506164 554679 296779 509591 376671 554574
14815 554574 291148 717390 670968 597245 507471 393697 495838 623264 810027 765673
14805 765673 654801 374518 203875 677129 503036 486132 361723 554340 904527 373122
14794 790973 468270 303248 701383 694053 579901 922805 608013 177699 170937 467374
$$ packed form
14867B47403J49852L6070j29982Q7030J30673Q7352B33418Q6826K57452j92882
14857C84814J96886j85994j06282J99183J63213k92741J54e1668D40358k06659
14847B33699n0K0719L23738B64951o2901J20053J03924M1174A92649K30340q0338
14836C42651L67416L941l31613k019J40638a3578D95919J14395k55465r9703M25291
14825F80437m5161l5856j25166J76921j45011M8515k57900K12812j32920J77903
14815E54574k63426M26242m6422p3723q9774j13774J02141J27426J86763m4354
14805G65673j10872k80283j70643M73254j74093j6904j24409J92617L50187C73122
14794G90973l22703j65022L98135p330j14152L42904l14792A77699o762K96437
$$ plain form
14784 467374 637212 787707 1054757 415691 517106 831530 762364 498156 714773 538729
14774 538729 1047619 626303 399906 524784 972831 674487 767475 445141 350575 612197
14764 612197 812676 832848 712089 454293 894471 588424 842204 854696 767247 902246
14754 902246 714890 551329 722171 591553 818584 833309 805561 805002 579757 1025118
14744 1025118 916750 797721 712913 622855 562378 963539 395279 667584 716999 408973
14734 408973 753216 559066 1035757 408252 662578 788734 380003 678940 1026198 545616
14724 545616 580066 555099 631175 483658 816289 1090665 936901 1164322 892900 911055
14714 911055 914689 472325 742853 1259700 766841 975179 890090 841524 1021021 665268
$$ packed form
14784D67374J69838J50495K67050D15691J01415L14424o9166k64208K16617j76044
14774E38729N08890m21316k26397J24878M48047k98344R2988l22334r4566K61622
14764F12197K00479K0172j20759k57796M40178l06047K53780J2492q7449J34999
14754I02246j87356j63561J70842j30618K27031J4725k7748n59k25245M45361
14744A025118j08368j19029q4808r0058o0477M01161C95279K72305M9415l08026
14734D08973L44243j94150M76691D08252K54326J26156C80003K98937L47258m80582
14724E45616L4450k4967P6076j47517L32631K74376j53764K27421k71422J8155
14714I11055L634m42364K70528N16847m92859K08338q5089m8566J79497l55753
$$ plain form
14704 665268 733114 1112684 826442 837095 986734 1002072 1193878 1065033 1136628 883329
14694 883329 920002 1183160 855577 930493 1110158 1030927 1048578 1000699 678293 908094
14684 908094 865453 1061997 1409747 1135731 936124 1189100 1100277 1071131 1285746 1104752
14674 1104752 1222992 1008939 1186394 936084 1149977 1167560 1182418 1166268 1151711 1369467
14664 1369467 1015985 882789 1148939 1652031 1034557 1160086 1084107 1266973 1272840 1015829
14654 1015829 1023527 1344988 887826 1274816 1368174 959371 1241747 1123700 1124549 1277271
14644 1277271 1511160 1034231 1198701 1363969 1454950 1239472 1500500 1077533 1117268 1536939
14634 1536939 1403307 1425970 1478028 1713670 1495143 1646121 1542731 1521809 1645173 1449079
$$ packed form
14704F65268O7846L79570k86242J0653J49639J5338J91806j28845P1595k53299
14694H83329L6673K63158l27583P4916J79665p9231J7651m7879l22406K29801
14684I08094m2641J96544L47750k74016j99607K52976q8823k9146K14615j80994
14674A104752J18240k14053J77455k50310K13893J7583J4858j6150j4557K17756
14664A369467l53482j33196K66150N03092o17474J25529p5979J82866N867k57011
14654A015829P698L21461m57162L86990R3358m08803K82376j18047Q49J52722
14644A277271K33889m76929J64470J65268R0981k15478K61028m22967L9735M19671
14634A536939j33632K2663N2058K35642k18527J50978j03390k0922J23364j96094
$$ plain form
14624 1449079 1463837 1430023 1589635 1688000 1244940 1600721 1390612 1429972 1625643 1456387
14614 1456387 1617957 1513686 1585303 1843557 1751037 1508703 1611084 1597154 1588247 1844257
14604 1844257 1560072 1697908 1826988 1717295 1392738 1577619 1943000 1748036 1784469 1796033
14594 1796033 2047892 1570677 1858280 1748833 1914006 1833327 1860766 1662321 1941507 1746037
14584 1746037 2129856 2099294 2000882 2268511 2236530 2249344 2132240 1762960 2278626 2257944
14574 2257944 2080470 2327202 2552732 1938489 2131293 2370979 2409042 2236103 2339476 2561735
14564 2561735 2571761 2758089 2431585 2587198 2853578 2719230 3297033 2851311 2982028 3554626
14554 3554626 3617469 3827111 4474100 5133671 5633790 7485602 11318875 19567411 39850940
$$ packed form
14624A449079J4758l3814J59612R8365m43060L55781k10109L9360J95671j69256
14614A456387J61570j04271P1617K58254r2520k42334J02381j3930q907K56010
14604A844257k84185J37836J29080j09693l24557J84881L65381j94964L6433J1564
14594A796033K51859m77215K87603j09447J65173q0679K7439j98445K79186j95470
14584A746037L83819l0562r8412K67629l1981J2814j17104l69280N15666k0682
14574B257944j77474K46732K25530o14243J92804K39686L8063j72939J03373K22259
14564B561735J0026J86328l26504J55613K66380j34348N77803m45722J30717N72598
14554C554626O2843K09642O46989O59571N00119J851812L833273Q248536K0283529
$$ plain form
14545 39850940 47925650 24804192 10960918 8256683 6605257 4103521 2772216 2174152
14537 2174152 2602455 1797679 2463103 2365940 2459290 2363006 2460320 2561191 2691543 2338223
14527 2338223 2510787 2355530 2418735 2518458 2381798 2605905 2466802 2648549 2882481 2527686
14517 2527686 3090348 3104594 2800079 2658053 3023833 2793490 2925238 2726342 3333552 3180795
14507 3180795 3228644 3090167 3099098 3122260 2959384 3406861 3210126 3287592 3456068 3237260
14497 3237260 3302088 3333316 3393288 3589459 3669736 3867275 3625121 3958654 3702928 3762097
14487 3762097 4143562 3839818 4022921 4267837 4066424 3895147 4150343 4201342 4228323 4164396
14477 4164396 4174720 4061225 4328311 4164495 4441027 4568138 4281334 4381227 4401244 4522865
$$ packed form
14545C9850940Q074710k3121458A0960918k704235j651426k501736j331305n98064
14537B174152M28303q04776O65424r7163R3350r6284R7314J00871J30352l53320
14527B338223J72564j55257O3205R9723j36660K24107j39103J81747K33932l54795
14517B527686N62662J4246l04515j42026L65780k30343J31748j98896O07210j52757
14507C180795M7849j38477Q931K3162j62876M47477j96735P7466J68476k18808
14497C237260O4828L1228N9972J96171Q0277J97539k42154L33533k55726N9169
14487C762097L81465l03744J83103K44916k01413j71277K55196N0999K6981o3927
14477D164396J0324j13495K67086j63816K76532J27111k86804R9893K0017J21621
$$ plain form
14467 4522865 5113017 4855921 4861431 4662207 4887881 5205732 5287510 4960583 5668085 5214446
14457 5214446 5473069 5533430 5589128 5776108 5486967 5710268 5436068 5927671 5875568 5947098
14447 5947098 5955756 6220662 6055789 6061278 6316441 6120914 6502702 6333091 6596402 6657726
14437 6657726 6784720 6973967 7261073 7181745 7249381 7309434 7475020 7436434 7623150 7636277
14427 7636277 7943578 7705512 7955151 7841975 8388085 8192387 8374498 8592549 8352845
14418 8352845 8471614 8709965 8878466 9175697 8923576 9567362 9511276 9763487 9991944 10006407
14408 10006407 10123117 10294283 10597473 10494493 10494010 10648348 10651194 10897456 11143008 11326839
14398 11326839 11608274 12090629 12032152 12181494 12625324 12632024 12867748 12835252 12960208 13292491
$$ packed form
14467D522865N90152k57096N510j99224K25674L17851Q1778l26927P07502m53639
14457E214446K58623O0361N5698J86980k89141K23301k74200M91603n2103P1530
14447E947098Q658K64906j64873N489K55163j95527L81788j69611K63311O1324
14437F657726J26994J89247K87106p9328O7636O0053J65586l8586J86716J3127
14427G636277L07301k38066K49639j13176N46110j95698J82111K18051k39704
14418H352845J18769K38351J68501K97231k52121O43786n6086K52211K28457J4463
14408A0006407J16710J71166L03190j02980m83J54338K846K46262K45552J83831
14398A1326839K81435M82355n8477J49342M43830O700K35724l2496J24956L32283
$$ plain form
14388 13292491 13515799 13952340 14008478 14634260 14301538 14869376 15370973 15407535 15553476 15885802
14378 15885802 16405401 16313717 17398965 17258551 17562712 17856913 18186827 18825627 19243786
14369 19243786 19467118 19826656 20133671 20875858 20840901 21573139 22150339 22668763 23005589
14360 23005589 23348167 24137595 24578464 25159326 25626221 26063813 27067296 27488120 28154312
14351 28154312 28633647 29576923 29967887 31266349 31624629 32932367 33628621 33989744 35278919
14342 35278919 36030021 36966938 38391055 39192678 40316977 41338271 42537506 43752833
14334 43752833 44952989 46185167 47960454 49229669 50709137 52089497 53852859 56015083
14326 56015083 57269215 59364380 61463685 63605685 65779397 67846355 70625929 73001879
$$ packed form
14388A3292491K23308M36541N6138O25782l32722N67838N01597L6562J45941L32326
14378A5885802N19599r1684J085248j40414L04161K94201L29914O38800M18159
14369A9243786K23332L59538L07015P42187l4957P32238N77200N18424L36826
14360B3005589L42578P89428M40869N80862M66895M37592J003483M20824O66192
14351B8154312M79335R43276L90964J298462L58280J307738O96254L61123J289175
14342C5278919P51102R36917J424117Q01623J124299J021294J199235J215327
14334D3752833J200156J232178J775287J269215J479468J380360J763362K162224
14326E6015083J254132K095165K099305K142000K173712K066958K779574K375950
$$ plain form
14318 73001879 75857343 78543219 81512156 84709201 87684047 91132704 94888085 99416645
14310 99416645 102668986 107300540 111790992 116438284 121424641 127009930 132548117 138528168
14302 138528168 145256258 151786920 159292837 166745454 174955203 183290643 192294008 201716777
14294 201716777 212055003 222572128 234014262 245622840 257972323 270890488 284369285
14287 284369285 298233995 312919616 327409757 342415034 357670793 373090520 388383622
14280 388383622 403317855 417652991 430918160 443410659 454208749 463558458 471077185
14273 471077185 475721489 476490909 475427596 473015160 469263473 465816108 461269472 454283542
14265 454283542 444218603 432787914 420072389 406195490 391353192 376012258 360303824
$$ packed form
14318G3001879K855464K685876K968937L197045K974846L448657L755381M528560
14310I9416645L252341M631554M490452M647292M986357N585289N538187N980051
14302A38528168O728090O530662P505917P452617Q209749Q335440R003365R422769
14294B01716777J0338226J0517125J1442134J1608578J2349483J2918165J3478797
14287B84369285J3864710J4685621J4490141J5005277J5255759J5419727J5293102
14280C88383622J4934233J4335136J3265169J2492499J0798090R349709P518727
14273D71077185M644304P69420j063313k412436l751687l447365m546636o985930
14265D54283542j0064939j1430689j2715525j3876899j4842298j5340934j5708434
$$ plain form
14258 360303824 344291912 328834341 313693657 298512696 284088733 270407152 258732410
14251 258732410 246239657 234083397 222646451 211755385 201714092 191998667 182777915
14244 182777915 174515279 166477434 158796188 151466427 144346197 138082347 132359927 126705773
14236 126705773 121500192 115936281 111033273 106661916 102264150 98686990 94840822 91248312
14228 91248312 87506604 84150695 81010061 78173630 75639424 72862503 69920034 67793195
14220 67793195 65483663 63305380 61625781 59181572 57217317 55786477 54458507 52812625
14212 52812625 51073239 49500642 47614451 46336182 44986617 44240729 43336066 42047757
14204 42047757 40093205 39269860 38455598 37300959 36471594 35509079 34247812 33320317 32729878
$$ packed form
14258C60303824j6011912j5457571j5140684j5180961j4423963j3681581j1674742
14251B58732410j2492753j2156260j1436946j0891066j0041293r715425r220752
14244A82777915q262636q037845p681246p329761p120230o263850n722420n654154
14236A26705773n205581n563911m903008m371357m397766l577160l846168l592510
14228I1248312l741708l355909l140634k836431k534206k776921k942469k126839
14220F7793195k309532k178283j679599k444209j964255j430840j327970j645882
14212E2812625j739386j572597j886191j278269j349565p45888r04663j288309
14204D2047757j954552q23345q14262j154639q29365r62515j261267r27495n90439
$$ plain form
14195 32729878 31589308 31144171 30224007 29668613 28936507 28335262 28019335 27124683 26552989
14186 26552989 25755978 25598941 24822197 24202759 23573460 23161813 22635065 22490318 21495109
14177 21495109 21133086 20947677 20070292 20056286 19651476 19184914 19064515 18711661 18020791
14168 18020791 17873569 17517502 17123901 16716992 16546129 16421231 15743443 15969994 15353073
14159 15353073 14861934 14825740 14640962 14185247 14132675 13684212 13415858 13558358 13313296 13465850
14149 13465850 12619610 12481040 12576427 12106128 11894559 12174689 11706509 11251945 11355278
14140 11355278 10829445 10874313 10837417 10620489 10477742 10375055 10094872 10526010 10019351 9630105
14130 9630105 9503283 9529379 9356114 9305892 8880590 8960655 8629134 8865410 8703813 8190759
$$ packed form
14195C2729878j140570m45137r20164n55394p32106o01245l15927q94652n71694
14186B6552989p97011j57037p76744o19438o29299m11647n26748j44747r95209
14177B1495109l62023j85409q77385j4006m04810m66562j20399l52854o90870
14168A8020791j47222l56067l93601m06909j70863j24898o77788K26551o16921
14159A5353073m91139l6194j84778m55715n2572m48463k68354J42500k45062J52554
14149A3465850q46240j38570R5387m70299k11569K80130m68180m54564J03333
14140A1355278n25833M4868l6896k16928j42747j02687k80183M31138n06659l89246
14130I630105j26822K6096j73265n0222m25302Q0065l31521K36276j61597n13054
$$ plain form
14120 8190759 8485941 8030217 8299008 8322527 7633445 8084696 7720381 7825427 7363410 7346887
14110 7346887 7363712 7019880 7024714 7030383 7029246 6895701 6728593 6571778 6555492 6328906 6486813
14099 6486813 6354269 6516530 6334850 6060245 6248589 5899920 5696050 6062863 5816508
14090 5816508 5858149 5985375 5833649 5810304 5563982 5086235 5096427 5259924 5280507 5453600
14080 5453600 4953594 5156189 5337180 4913884 5034019 5000204 4875259 4688881 4795397 5032823
14070 5032823 4469222 4691718 4688774 4532186 4594164 4291630 4313990 4480434 4199972 4465873
14060 4465873 4265701 4430213 4329435 4350325 4435922 4244584 4032034 3919139 3957848 3877033
14050 3877033 3607044 3745037 3918052 3746950 3953625 3493273 3702320 3438511 3256079
$$ packed form
14120H190759K95182m55724K68791K3519o89082M51251l64315J05046m62017j6523
14110G346887J6825l43832M834N669j137j33545j67108j56815j6286k26586J57907
14099F486813j32544J62261j81680k74605J88344l48669k03870L66813k46355
14090E816508M1641J27226j51726k3345k46322m77747J0192J63497K0583J73093
14080E453600n00006K02595J80991m23296J20135l3815j24945j86378J06516K37426
14070E032823n63601K22496k944j56588O1978l02534K2360J66444k80462K65901
14060D465873k00172J64512j00778K0890Q5597j91338k12550j12895L8709q0815
14050C877033k69989J37993J73015j71102K06675m60352K09047k63809j82432
$$ plain form
14041 3256079 3517910 3314058 3734900 3268434 3611875 3297255 3364341 3207497 3051338 3015001
14031 3015001 3404453 3381635 3398774 3286863 3284031 3449617 3147192 3230381 3021603 2718008
14021 2718008 2732147 3107878 2913357 3087252 2908609 3025999 2409823 2924218 2924549 2699639
14011 2699639 2475336 2718691 3006196 2234273 2593589 2620486 2314014 2408314 2430667 1971758
14001 1971758 2273629 2402010 2505937 2238224 2081022 1857728 1901189 2412479 1903975 2486358
13991 2486358 2748583 2382071 3612420 6092610 12286758 30647545 48298844 32124145
13983 32124145 15900871 9260812 6412666 5186933 4561716 4176321 3950450 3320752
13975 3320752 3601796 2820391 3026993 3201314 3061433 2704896 2856992 2850084 2737523 2764130
$$ packed form
14041C256079K61831k03852M20842m66466L43441l14620O7086j56844j56159l6337
14031C015001L89452k2818J7139j11911k832J65586l02425Q3189k08778l03595
14021B718008J4139L75731j94521J73895j78643J17390o16176N14395L31k24910
14011B699639k24303K43355K87505p71923L59316K6897l06472R4300K2353m58909
14001A971758L01871J28381J03927k67713j57202k23294M3461N11290n08504N82383
13991B486358K62225l66512J230349K480190O194148J8360787J7651299j6174699
13983C2124145A5900871o640059k848146j225733o25217l85395k25871o29698
13975C320752K81044p81405K06602J74321j39881l56537J52096o908j12561K6607
$$ plain form
13965 2764130 2576523 2558993 2749477 2696673 2310332 1713538 2237398 2284753 2221557 1919619
13955 1919619 2014845 2182081 1787729 2063888 2055213 2096668 2236686 2295705 1974840 2102189
13945 2102189 2148513 2073879 2328732 2064403 2042401 2062741 1908237 1866578 2161151 2047690
13935 2047690 1863777 1767024 1881339 2040571 1687550 2045401 1989318 1874497 1405327 1833688
13925 1833688 1704858 1786337 1619032 2128919 1606916 1666160 1744812 1418961 1597214 1662566
13915 1662566 1479069 1713393 1669474 1726568 1535073 1419986 1766375 1638608 1465897 1588379
13905 1588379 1744382 1364232 1501971 1615516 1741784 1335432 1391596 1530748 1399017 1292113
13895 1292113 1447159 1388156 1649135 1411665 1345799 1482075 1612684 1321067 1378764 1402860
$$ packed form
13965B764130j87607j7530J90484n2804l86341n96794N23860M7355o3196l01938
13955A919619R5226J67236l94352K76159q675M1455J40018N9019l20865J27349
13945B102189M6324p4634K54853k64329k2002K0340j54504m1659K94573j13461
13935B047690j83913r6753J14315J59232l53021L57851n6083j14821m69170M28361
13925A833688j28830Q1479j67305N09887n22003N9244P8652l25851J78253O5352
13915A662566j83497K34324m3919N7094j91495j15087L46389j27767j72711J22482
13905A588379J56003l80150J37739J13545J26268m06352N6164J39152j31731j06904
13895A292113J55046n9003K60979k37470o5866J36276J30609k91617N7697K4096
$$ plain form
13885 1402860 1547788 1254694 1356736 1054850 1524613 1277049 1271486 1431431 1351528 1300228
13875 1300228 1399343 1308939 775644 1019015 1055372 1555706 1406904 1537697 1151800 1431192
13865 1431192 1374037 1040642 1097395 1275651 1572479 1084089 1048520 1066494 1078938 991424
13855 991424 1344198 805035 1231262 977563 1132413 1276919 1151267 1194734 1492447 1048798
13845 1048798 970232 1328471 916944 1214042 1193235 783209 1431549 1243807 1234174 735679
13835 735679 981217 1020702 1364372 711643 970660 1077294 1278788 1177840 736506 850123
13825 850123 790421 968189 681962 1017164 986033 974328 1154191 729465 1042454 871471
13815 871471 959684 942858 1062925 597849 672098 1025725 1014055 430424 940998 691959
$$ packed form
13885A402860J44928k93094J02042l01886M69763k47564n563J59945p9903n1300
13875A300228R9115r0404n33295K43371L6357N00334j48802J30793l85897K79392
13865A431192n7155l33395N6753J78256K96828m88390l5569J7974J2444q7514
13855I91424L52774n39163M26227k53699J54850J44506j25652M3467K97713m43649
13845A048798p8566L58239m11527K97098k0807m10026O48340j87742r633m98495
13835G35679K45538L9485L43670o52729K59017J06634K01494j00948m41334J13617
13825H50123n9702J77768k86227L35202l1131j1705J79863m24726L12989j70983
13815H71471Q8213j6826J20067m65076P4249L53627j1670D30424N10574k49039
$$ plain form
13805 691959 1032214 810686 953580 751022 884262 868860 810756 821145 384914 902940
13795 902940 916356 769470 860750 373688 561454 746773 890519 625402 731264 582903
13785 582903 1030575 832630 872250 648207 540430 1057648 855017 581334 961153 1124988
13775 1124988 936875 779028 624784 734345 847549 709783 802964 1014265 760843 641778
13765 641778 782747 864518 722148 894170 728694 587050 1013338 753901 692158 596626
13755 596626 1147563 709145 762762 692879 899108 585334 203221 895664 857724 905139
13745 905139 622974 335471 626838 677250 814582 694083 799888 589544 599923 769371
13735 769371 575614 820536 752536 339943 851148 794514 268685 706808 352008 826995
$$ packed form
13805F91959L40255k21528J42894k02558J33240j5402n8104J0389C84914N18026
13795I02940J3416j46886R1280C73688J87766J85319J43746k65117J05862j48361
13785E82903M47672j97945L9620k24043j07777N17218k02631k73683L79819J63835
13775A124988j88113j57847j54244J09561J13204j37766R3181K11301k53422j19065
13765F41778J40969Q1771j42370J72022j65476j41644M26288k59437o1743r5532
13755E96626N50937m38418N3617o9883K06229l13774B03221O92443l7940M7415
13745I05139k82165k87503K91367N0412J37332j20499J05805k10344J0379J69448
13735G69371j93757K44922o8000C39943N11205n6634B68685M38123C52008M74987
$$ plain form
13725 826995 519763 721464 416885 342490 686668 747521 794419 511953 844131 634316
13715 634316 554864 605231 516847 525711 691890 444348 751758 850585 231480 896432 400676
13703 362249 665889 513388 336860 338621 668097 649431 595901 614755 494809 541084 871019
13692 871019 367478 609999 912111 550717 411939 526017 745807 514667 445296 866908
13682 866908 497116 661761 226988 449745 407711 463704 755680 536673 316694 495790
13672 495790 783626 443184 863187 458721 210778 503401 496633 810112 626190 452102
13662 452102 738310 625275 547969 498668 638315 509402 429726 431942 667134 397981
13652 397981 580676 413965 600392 365938 598745 301248 354665 737240 608160 778503
$$ packed form
13725H26995l07232K01701l04579p4395L44178O0853M6898k82466L32178k09815
13715F34316p9452N0367q8384Q864J66179k47542L07410R8827B31480O64952D00676
13703C62249L03640j52501j76528J761L29476j8666n3530J8854j19946M6275L29935
13692H71019C67478K42521L02112l61394j38778J14078K19790k31140o9371M21612
13682H66908l69792J64645B26988K22757m2034N5993K91976k19007k19979J79096
13672D95790K87836l40442M20003m04466B10778K92623o768L13479j83922j74088
13662D52102K86208j13035p7306m9301J39647j28913p9676K216K35192k69153
13652C97981J82695j66711J86427k34454K32807k97497N3417L82575j29080J70343
$$ plain form
13642 778503 373733 133500 527644 740088 360735 347253 824568 301199 600093 497800
13632 497800 487428 357803 353684 316883 270813 665282 508306 425120 389650 196691 410399
13621 410399 381897 432654 112971 586546 271969 463268 428713 323941 785203 557614
13611 557614 625637 390652 21144 622729 273488 609890 58303 420150 351366 593200
13601 593200 564313 464590 246568 407196 85891 579906 80961 342308 129682 527218
13591 527218 181636 327439 385052 145408 257680 422820 166617 442607 252753 299009
13581 299009 592298 559059 629364 143658 239026 393207 17232 363301 342551 365034 531218
13570 531218 575807 391394 661313 311403 532227 102871 459616 412185 148628 276950
$$ packed form
13642G78503C73733A33500L94144K12444C60735j3482M77315C01199K98894j02293
13632D97800j0372j29625m119l6801m6070L94469j56976q3186l5470j92959K13708
13621D10399k8502N0757A12971M73575B71969J91299l4555j04772M61262k27589
13611E57614O8023k34985B1144O01585B73488L36402E8303L61847o8784K41834
13601E93200k8887r9723k18022J60628H5891M94015H0961K61347A29682L97536
13591E27218A81636J45803N7613A45408J12272J65140A66617K75990j89854M6256
13581B99009K93289l3239P0305A43658R5368J54181A7232L46069k0750K2483J66184
13570E31218M4589j84413K69919C11403K20824A02871L56745m7431A48628J28322
$$ plain form
13560 276950 458134 438175 479591 385758 129207 78757 267670 597011 375880 504282
13550 504282 152665 730070 94743 205819 383813 373055 540161 431024 458312 397888
13540 397888 440060 -25298 246316 209666 659773 160029 123302 179832 206408 185565 298508
13529 298508 551496 572703 52814 403253 140106 491678 362599 326847 250589 465723
13519 465723 168980 356776 639175 280971 185063 648365 191098 47966 395709 344072
13509 344072 79805 585956 323144 400934 378430 507877 102517 404842 15834 106067
13499 106067 273028 210304 485168 166381 246889 128200 133322 70181 327016 497187
13489 497187 404649 201989 450733 325923 364871 151063 -10310 319581 495849 194102
$$ packed form
13560B76950J81184j9959M1416r3833A29207n0450J88913L29341k21131J28402
13550E04282A52665N77405I4743J11076J77994j0758J67106j09137K7288o0424
13540C97888M2172b5298B46316l6650M50107A60029l6727N6530K6576k0843J12943
13529B98508K52988K1207E2814L50439A40106L51572j29079l5752p6258K15134
13519D65723A68980J87796K82399B80971r5908M63302A91098D7966L47743n1637
13509C44072G9805N06151k62812P7790k2504J29447A02517L02325A5834R0233
13499A06067J66961o2724K74864A66381Q0508j18689N122o3141K56835J70171
13489D97187r2538B01989K48744j24810L8948A51063a0310C19581J76268A94102
$$ plain form
13478 140668 442795 -50731 444775 468854 -49260 412206 338655 163998 371736 127293
13467 317141 155783 343910 60861 36280 220342 264976 82257 316307 253103 319126 -158562
13455 245289 391253 397725 293642 398881 -122627 102072 225005 168050 345860 18106
13444 156179 378042 109185 273906 182174 174047 16800 253631 97570 67890 402981 166064
13432 43941 -187575 69689 559625 38765 182255 92222 -171081 223496 485944 430284
13422 430284 192210 211230 271876 111253 6538 165490 304134 255991 323387 406619 147168
13410 48249 447525 355122 21724 229048 409880 156050 187171 243037 -84352 160366 343428
13399 343428 410752 236518 219184 151276 253846 273968 132959 404927 391546 88682 -9382
$$ packed form
13478A40668L02127e0731D44775K4079d9260D12206p3551A63998K07738A27293
13467C17141A55783J88127F0861k4581J84062M4634H2257K34050o3204O6023a58562
13455B45289J45964O472j04083J05239a22627A02072J22933n6955J77810A8106
13444A56179K21863A09185J64721r1732q127A6800K36831I7570k9680L35091A66064
13432D3941a87575F9689M89936C8765J43490r0033a71081B23496K62448n5660
13422D30284A92210J9020O0646A11253F538J58952J38644m8143O7396Q3232A47168
13410D8249L99276r2403B1724K07324J80832A56050L1121N5866h4352A60366J83062
13399C43428O7324j74234j7334o7908J02570K0122A32959K71968j3381H8682i382
$$ plain form
13387 511874 416363 62548 314807 469673 100234 173097 151220 166300 523959 117043
13376 317965 276281 278824 99417 346039 10711 454325 92603 -26511 373536 221320 -94219
13364 335545 379592 237263 159449 352460 273693 481419 349091 408226 286852 151597
13354 151597 -11739 151185 46909 179151 114927 445291 413365 465372 263099 262175 435738
13343 435738 521990 265941 64611 522958 99502 250208 518880 -17426 58225 -133845
13332 206207 424018 532738 349276 225610 159373 406398 95023 -165533 254866 314332
13322 314332 73983 -78027 522162 -36250 179297 441349 293143 240511 19200 252935
13312 252935 88658 -65305 364701 131030 124846 274126 26882 347178 99783 184218 344872
$$ packed form
13387E11874r5511F2548K52259J54866A00234P2863k1877J5080L57659A17043
13376C17965m1684K543I9417K46622A0711M43614I2603b6511C73536j52216i4219
13364C35545M4047j42329p7814J93011p8767K07726j32328N9135j21374j35255
13354A51597a1739A51185D6909J32242o4224L30364l1926N2007k02273r24J73563
13343D35738Q6252k56049F4611M58347I9502J50706K68672a7426E8225a33845
13332B06207K17811J08720j83462j23666o6237K47025I5023a65533B54866N9466
13322C14332G3983g8027E22162c6250A79297K62052j48206n2632A9200K33735
13312B52935H8658f5305C64701A31030o184J49280B6882L20296I9783Q4435J60654
$$ plain form
13301 344872 141344 238312 260643 -15569 37315 257067 269199 -67442 225741 50900 -5480
13289 57413 -3622 160042 -62819 18110 25119 451150 205841 -62300 -29087 194923 357089
13278 357089 291276 143436 91585 257520 56593 -46919 131246 108214 152820 224560 -149408
13266 117590 366054 -3022 459391 21143 200793 31841 525277 -89276 131171 56502 79043
13255 79043 -61872 238719 150121 230638 255681 24344 361348 230685 372448 -197928 -179402
13244 -179402 217399 366379 84259 57515 51935 138411 242219 -63204 213364 -135321 236886
13232 78043 237838 127377 153142 229497 215323 252682 225204 96858 74754 -43108 210528
13220 -63822 -41989 37521 -767 70214 9561 455301 -243024 -26532 700998 -44880 326286
$$ packed form
13301C44872A41344R6968K2331a5569C7315K19752J2132f7442B25741E0900e480
13289E7413c622A60042f2819A8110P009M26031B05841f2300b9087A94923J62166
13278C57089o5813A43436n1851J65935E6593d6919A31246k3032M4606P1740a49408
13266A17590K48464c022D59391B1143J79650C1841M93436h9276A31171E6502K2541
13255G9043f1872B38719q8598Q0517K5043B4344L37004j30663J41763a97928J8526
13244a79402B17399J48980H4259k6744n580Q6476J03808f3204B13364a35321B36886
13232G8043J59795j10461K5765P6355j4174L7359k7478I6858k2104d3108B10528
13220f3822K1833C7521g67G0214I561M45740b43024b6532G00998d4880C26286
$$ plain form
13208 -205327 110708 335509 25988 209787 131579 238126 -46553 82541 245767 332198
13198 332198 130348 20251 -104030 112245 159968 183449 121316 -78290 -71513 82307 -139418
13186 -5472 90863 32588 301924 378271 15451 317148 453239 -22884 -294192 -139171 -165483
13175 -165483 -15370 21201 174211 37410 363938 143619 176182 140465 -186160 59581 -69031
13163 -200677 35932 128335 -96074 195611 -102128 176515 338021 -138823 77918 229072
13153 229072 203262 167189 124660 -60030 55902 297141 27204 319721 -129463 449714 206706
13141 -22475 132007 106275 -6313 307508 -246919 -238637 86709 69828 179097 55691 158381
13130 158381 -71528 19896 621990 288081 143213 -99562 129848 149174 7555 142157 88055
$$ packed form
13208b05327A10708K24801B5988J83799p8208J06547d6553H2541J63226Q6431
13198C32198A30348B0251a04030A12245M7723K3481o2133g8290O777H2307a39418
13186e472I0863C2588K69336P6347A5451L01697J36091b2884k71308a39171k6312
13175a65483a5370B1201J53010C7410L26528A43619L2563l5717a86160E9581f9031
13163b00677C5932R2403i6074A95611a02128A76515J61506a38823G7918J51154
13153B29072k5810l6073m2529f0030E5902K41239B7204K92517a29463D49714B06706
13141b2475A32007k5732f313C07508b46919Q282H6709j6881J09269E5691J02690
13130A58381g1528A9896O02094B88081A43213i9562A29848J9326G555J34602n4102
$$ plain form
13119 88055 469015 218628 302459 -56780 -308005 -53356 136626 95376 -166404 134879
13108 291645 126913 -221099 -102312 -156786 2542 66873 167792 115530 231695 -15768 197639
13096 -169936 56441 322301 470472 23465 -231529 -219504 -40497 84223 31104 89074 -231017
13084 247607 310510 19138 -63765 1578 14758 335219 -84470 338589 55865 54634 31768
13073 31768 -108870 -12337 20060 -35943 236216 -326 -6219 -243173 -51103 16482 125060
13062 125060 416585 161361 66522 181175 40828 -221639 74677 38874 -43456 219092
13051 460336 -243658 122906 -56924 329545 452121 -161548 251192 293603 89074 -57769
13040 -166505 383115 -96529 -8722 112202 572221 -49240 306805 186935 -97111 80882 135096
$$ packed form
13119H8055L80960B18628Q3831e6780k51225e3356A36626m1250a66404A34879
13108B91645A26913b21099a02312n4474B542O4331J00919n2262J16165a5768A97639
13096a69936E6441K65860J48171B3465b31529J2025d0497H4223C1104N7970b31017
13084B47607O2903A9138f3765A578J3180L20461h4470C38589E5865j231k2866
13073C1768a08870a2337B0060c5943B36216c26n893k36954e1103A6482J08578
13062A25060K91525A61361F6522J14653D0828b21639G4677l5803d3456B19092
13051D60336b43658A22906e6924C29545J22576a61548B51192M2411H9074e7769
13040a66505C83115i6529h722A12202M60019d9240C06805j19870i7111H0882N4214
$$ plain form
13029 135096 208230 187019 77609 -99791 119700 -112154 180083 369351 -11466 -31278 206966
13017 201019 219858 362680 51136 -98317 20425 194643 276290 279723 -31134 -6495 285080
13005 252262 175200 205027 349343 52608 74900 -17970 27125 39455 172823 125468 303964
12994 303964 159961 188874 405415 360454 77621 66341 -134058 93724 -208897 -14640 66595
12982 -221476 -281601 43858 125766 -133577 8405 -9854 167252 270716 109079 95694 53679
12971 53679 -142279 -245359 274226 5509 244587 64590 166236 -118927 -19757 -66858 -56025
12960 -56025 -47514 -162361 -8751 -51163 -100755 -120319 454395 294700 -264674 -56470 -23521
12948 57060 128244 321013 -49145 170882 228737 261036 -119475 109005 425243 -46034 77039
$$ packed form
13029A35096P3134k1211G7609i9791A19700a12154A80083J89268a1466j9812B06966
13017B01019J8839J42822E1136i8317B0425J74218Q1647L433c1134f495B85080
13005B52262p7062K9827J44316E2608K2292a7970B7125J2330J33368m7355J78496
12994C03964j44003K8913K16541m4961G7621j1280a34058I3724b08897a4640F6595
12982b21476o0125D3858Q1908a33577H405i854A67252J03464A09079j3385m2015
12971E3679a42279j03080B74226E509K39078F4590J01646a18927a9757m7101J0833
12960e6025Q511j14847h751m2412m9592j9564D54395j59695b64674e6470b3521
12948E7060P1184J92769d9145A70882N7855L2299a19475A09005L16238d6034G7039
$$ plain form
12936 24028 501244 61824 204048 -243710 -155229 -149181 73093 -52350 135064 83631 -19722
12924 34160 -65685 -304887 -56729 -156917 4609 -137784 201646 241368 328952 -122872 -19345
12912 322653 163534 -29027 25935 119737 -284847 267240 -119236 -34623 -136515 34466
12901 208977 -32236 304117 126469 -191722 91310 323652 -76749 -89802 -131129 249241
12890 144940 33301 18995 494480 208110 -15553 73434 -254842 87849 -61644 286057 35470
12878 -10825 -164766 -35788 -82231 115890 259968 28402 -262197 -113630 99289 193207 -19113
12866 307774 -148385 299478 162443 38738 -188981 214193 33040 318435 -215869 183527
12855 59850 102953 48564 60458 -130662 -284737 -94624 -236941 -80188 -67818 206219 -401485
$$ packed form
12936B4028M77216F1824J42224b43710Q8481O048G3093e2350A35064n1433a9722
12924C4160f5685k39202e6729j00188D609a37784B01646L9722Q7584a22872a9345
12912C22653j59119b9027B5935R3802b84847B67240a19236c4623j01892C4466
12901B08977c2236C04117A26469a91722I1310K32342g6749j3053m1327B49241
12890A44940C3301j4306M75485B08110a5553G3434b54842H7849f1644B86057C5470
12878a0825j53941c5788m6443A15890J44078B8402b62197a13630I9289R3918a9113
12866C07774a48385B99478j37035C8738a88981B14193C3040K85395b15869A83527
12855E9850M3103D8564J1894a30662j54075i4624j42317h0188J2370B06219d01485
$$ plain form
12843 157311 -245864 -179290 407043 -234011 102633 118642 -123454 -175317 23496 -252317
12832 -385280 152276 51021 133605 371808 63653 -384539 148577 -250857 272759 168669
12822 168669 416483 -82824 -182030 -176535 -68977 385310 320412 -231149 -36288 -75494 31092
12810 85320 -132638 -86319 121841 -22014 211772 -154041 6427 -212805 -7321 -39890 242370
12798 -236276 -2685 -29746 24285 -10981 252911 96627 439992 -147911 -57987 -19028 -189132
12787 -189132 125685 -8691 -190866 141050 -48637 9643 -186053 220322 6895 143617 142667
12776 142667 -37811 267142 -116902 -9092 80867 -93813 280948 -21112 99593 101247 -416120
12764 141571 39917 -100387 -61178 38567 173417 -303869 -42876 -25111 -156764 -142973 18225
$$ packed form
12843A57311b45864O6574D07043b34011A02633J6009a23454n1863B3496b52317
12832c85280A52276E1021Q2584K38203F3653c84539A48577b50857B72759j04090
12822A68669K47814h2824r9206N495f8977C85310o4898b31149c6288l9206C1092
12810H5320a32638M6319A21841b2014B11772a54041F427b12805g321l2569B42370
12798b36276b685k7061B4285a0981B52911I6627L43365a47911e7987a9028j70104
12787a89132A25685h691j82175A41050d8637I643a86053B20322F895J36722r50
12776A42667c7811B67142a16902i092H0867i3813B80948b1112I9593J654d16120
12764A41571C9917a00387L9209C8567J34850c03869d2876J7765j31653J3791A8225
$$ plain form
12752 -123829 -122966 -89355 -223298 219286 137236 43501 -207223 234290 190465 227335 149945
12741 149945 272518 -227283 96867 -160160 -14700 -53664 -117990 -112124 -121076 -108673 -41580
12729 491194 82316 189565 267690 28500 107692 146291 -381231 135831 -89297 -15242 -70741
12718 -70741 -108589 -175909 -33603 89904 -98757 156594 -79306 -69998 -261963 212660 -261782
12706 247305 62338 42068 -146658 50524 535759 169347 202405 -110015 -265011 -36826
12695 220576 -158747 184777 390019 515932 -67473 317232 -308674 83026 -55203 231662
12684 -345312 332097 164277 39249 -96642 305967 -146979 96404 -22789 -76229 -67037 -87622
12673 -87622 -190016 -58897 341889 -171963 215940 -68672 121332 333447 148856 118703
$$ packed form
12752a23829Q63L3611j33943B19286q2050D3501b07223B34290m3825L6870p7390
12741A49945J22573b27283I6867a60160a4700l8964o4326N866q952J2403d1580
12729D91194H2316J07249P8125B8500P9192L8599c81231A35831h9297a5242n5499
12718g0741l7848o7320c3603H9904i8757A56594g9306R308j91965B12660b61782
12706B47305F2338k0270a46658E0524M85235A69347L3058a10015j54996c6826
12695B20576a58747A84777K05242J25913f7473C17232c08674H3026e5203B31662
12684c45312C32097A64277C9249i6642C05967a46979I6404b2789n3440R192k0585
12673h7622j02394e8897C41889a71963B15940f8672A21332K12115A48856l0153
$$ plain form
12663 118703 -31753 216729 -134299 -190047 375944 51935 180713 7802 286546 -237564
12652 65306 -222799 -26436 521714 -34239 172048 -10555 -41249 363905 -165042 -34367 -240211
12641 -240211 100421 184499 -53168 -155093 52458 106469 203518 -78177 293379 155870 83308
12630 83308 383306 316183 152856 246223 80974 34535 238542 41513 279927 234453 30144
12618 272247 -41808 -31484 106370 255040 56828 149310 -95350 410105 25761 306926 -142471
12606 -121694 -131990 345624 -277268 5816 159733 56232 33937 167903 190876 3097 41473
12595 41473 45977 178716 4824 94461 290758 233664 154030 8288 170212 -142726 -28880
12583 230981 -190387 22523 23424 4708 46536 -222416 -105832 84427 -424767 278365 94936
$$ packed form
12663A18703c1753B16729a34299n5748C75944E1935J28778G802K78744b37564
12652F5306b22799b6436E21714c4239A72048a0555l0694C63905a65042c4367k05844
12641b40211A00421Q4078e3168j01925E2458N4011R7049g8177B93379j37509p2562
12630H3308K99998o7123A52856R3367H0974C4535K04007D1513K38414m5474C0144
12618B72247d1808J0324A06370J48670E6828R2482i5350D10105B5761K81165a42471
12606a21694j0296C45624b77268E816J53917E6232k2295J33966K2973C097L8376
12595D1473M504J32739D824Q9637J96297n7094p9634H288J61924a42726b8880
12583B30981a90387B2523R01D708M1828b22416a05832H4427d24767B78365I4936
$$ plain form
12571 269799 -434055 233566 299963 358113 -175795 -141806 -211738 -223216 91609 -5300 171835
12559 -70569 306489 29793 -341386 -105469 988 123006 370614 -177884 -63891 69277 60743
12548 60743 105830 188930 204741 83246 -104833 92903 82169 171699 43769 291259 -282682
12536 143817 166841 50387 -53678 72722 139483 -60509 46335 -33565 -89741 -186090 -22692
12524 -40380 305295 298686 -35202 -35262 -95142 145213 330980 -335115 -396491 -642 39921 -46540
12511 -74419 301267 -380854 -8207 64531 -248996 175982 -195905 -71951 118711 308634
12501 308634 -205593 -142381 -159796 250347 106485 53996 -168236 -59516 -23156 42726 -87692
12489 -162837 172819 183338 385495 244705 -322352 79820 64788 -84965 97309 -32859 -198199
$$ packed form
12571B69799d34055B33566O6397N8150a75795L3989o9932j1478I1609e300A71835
12559g0569C06489B9793c41386a05469I88J22018K47608a77884f3891F9277q534
12548F0743M5087Q3100J5811H3246a04833I2903j0734Q9530D3769K47490b82682
12536A43817K3024E0387e3678G2722O6761f0509D6335c3565n6176r6349b2692
12524d0380C05295o609c5202o0n9880A45213J85767c35115o1376f42C9921d6540
12511g4419C01267c80854h207F4531b48996A75982a95905g1951A18711J89923
12501C08634b05593O3212j7415B50347A06485n2489a68236e9516b3156D2726h7692
12489a62837A72819J0519K02157j40790c22352G9820j5032h4965I7309c2859j65340
$$ plain form
12478 -198199 111491 -152078 134120 -6329 -222147 -441102 -326145 39576 115563 10868
12467 -91516 376864 56311 -210673 -224971 -11565 -13767 12343 -9071 49509 108676 118046 246844
12455 246844 81711 -82600 -54537 -329298 -147338 153914 140249 -251597 71871 -128917
12444 -99866 170280 110149 99965 133607 -69568 47114 80262 -148150 -206245 125570 63120
12433 63120 33287 -17366 931 -241596 299807 -50973 222237 36788 -365998 -52976 -6653
12421 255435 -132069 186453 165469 293515 87734 127000 -126269 221041 48610 188496
12411 188496 -848 104353 38184 78964 -54252 43182 149628 93212 104785 -32671 287960
12399 86220 64646 -12903 -106865 66011 18290 172032 42582 -248603 269617 -214827 168155
$$ packed form
12478a98199A11491a52078A34120f329k15818k18955J14957C9576P5987A0868
12467i1516C76864E6311b10673j4298a1565k202A2343i071D9509N9167R370J28798
12455B46844H1711h2600K8063k74761a47338A53914j3665b51597G1871a28917
12444i9866A70280o0131j0184L3642f9568D7114L3148a48150n8095A25570o2450
12433F3120k9833a7366I31b41596B99807e0973B22237C6788c65998e2976f653
12421B55435a32069A86453k0984J28046H7734L9266a26269B21041D8610J39886
12411A88496h48A04353C8184M0780e4252D3182J06446n6416J1573c2671B87960
12399H6220k1574a2903r3962F6011A8290J53742D2582b48603B69617b14827A68155
$$ plain form
12387 -211823 118204 -180523 -202346 89743 -167482 154347 -19578 -35613 -111845 -130087 194031
12375 -47239 -145682 -255639 17360 -24467 -107482 342147 -147856 144312 227808 33029 -339114
12363 1944 -133600 77004 -33146 -153568 -84435 97876 -238 73986 -64336 -38872 -121446 -1044
12350 177194 -16555 70754 -10837 -33818 -129395 -242447 223961 39051 -103459 -5736 -400411
12339 -400411 104787 79991 -48417 237058 -30526 -79681 -18947 -72954 -170693 117753 42462
12327 126512 25911 180356 15330 447364 180350 245812 -100242 -210462 111113 -171525
12316 -128635 -182976 99 12466 181800 -73287 82443 -198260 -10292 -16116 -204093 60773 265700
12304 265700 272781 342813 -48969 -199309 -80615 -222137 -70448 -258272 46201 74232 -48446
$$ packed form
12387b11823A18204a80523k1823H9743a67482A54347a9578j6035p6232j8242A94031
12375d7239r8443j09957A7360b4467q3015C42147a47856A44312Q3496C3029c39114
12363A944a33600G7004c3146j20422O9133I7876b38G3986f4336K5464q2574a044
12350A77194a6555G0754a0837k2981r5577j13052B23961C9051a03459e736l94675
12339d00411A04787k4796d8417B37058c0526m9155a8947n4007r7739A17753D2462
12327A26512B5911J54445A5330M32034A80350O5462a00242j10220A11113a71525
12316a28635n4341I9J2367J69334g3287H2443a98260a0292n824j87977F0773K04927
12304B65700P081P0032d8969j50340h0615j41522g0448j87824D6201K8031d8446
$$ plain form
12292 -3354 136715 -109850 20374 71431 241158 204902 145511 -126712 270150 -56641 -120277
12281 -120277 -234898 -141114 249221 123791 262152 396773 126815 181709 2074 279872
12271 279872 398011 33862 250409 395516 -126265 93708 21658 164158 -40709 88746
12260 91087 73526 444962 86308 -183324 148063 28822 197003 -47877 -297841 188498
12249 327282 2182 -37824 233076 -148139 211207 181407 306556 66016 6237 -123270 -186294
12238 -186294 259735 -10546 -197718 216643 -112186 7500 395877 -95891 -197087 -119426
12228 -119426 -106933 49450 -78752 243957 563359 96270 108980 140735 176506 44168 446850
12217 446850 472173 -171981 -139185 129819 120387 -107636 93906 -56618 121210 76915 -77379
$$ packed form
12292c354A36715a09850B0374N1057J69727l6256n9391a26712B70150e6641o3636
12281a20277j14621R3784B49221A23791J38361J34621A26815N4894B074K77798
12271B79872J18139C3862K16547J45107a26265I3708B1658J42500d0709H8746
12260I1087j7561L71436H6308a83324A48063B8822J68181d7877k49964A88498
12249C27282B182c7824B33076a48139B11207k9800J25149F6016F237a23270o3024
12238a86294B59735a0546j87172B16643a12186G500L88377i5891j01196P7661
12228a19426J2493D9450g8752B43957L19402I6270J2710L1755L5771D4168M02682
12217D46850K5323a71981L2796A29819r432a07636I3906e6618A21210m4295g7379
$$ plain form
12205 171329 106166 -222753 168581 -60770 408538 210551 -251844 -135787 257111 68016
12194 -155369 207220 130600 149540 168863 28939 143134 -30040 223442 246936 -263731 -204217
12183 -204217 7419 -79468 258810 194001 264091 1298 -61640 133465 -70825 310630 -34731
12171 -285512 -158792 214203 30416 213645 -101954 -86953 272418 169011 38087 113379
12161 113379 336758 394799 -96667 40431 61664 -67498 232149 288554 -48635 -308893 155736
12149 133317 102578 -70959 229891 199842 105538 152725 -24235 377332 121719 297121 -68980
12137 17408 -464937 37036 39440 -385922 -127653 75483 310269 -188244 142947 -79602 -17001
12125 96273 -41474 -47328 143537 -124811 -49462 -24437 309027 -29707 -10495 159 78733 111668
$$ packed form
12205A71329o5163b22753A68581f0770D08538j97987b51844J16057B57111F8016
12194a55369B07220p6620J8940J9323B8939J14195c0040B23442K3494b63731N9514
12183b04217G419g9468B58810o4809P0090A298f1640A33465g0825C10630c4731
12171b85512J26720B14203C0416J83229a01954J5001B72418j03407C8087P5292
12161A13379K23379N8041i6667D0431K1233f7498B32149N6405d8635k60258A55736
12149A33317l0739g0959B29891l0049r4304M7187b4235C77332A21719J75402f8980
12137A7408d64937C7036K404c85922a27653G5483K34786a88244A42947g9602a7001
12125I6273d1474n854A43537a24811d9462b4437C09027b9707a0495A59P8574L2935
$$ plain form
12113 111668 169732 -290583 -72943 -85580 -118644 -262749 -84035 453324 103626 330015
12103 330015 67924 166931 -136449 -117487 1635 134973 162781 78875 218829 -84364 -22071
12091 -59715 -42954 6197 -163907 44894 -38568 72727 -76116 -266115 -100470 -280756 297915
12079 97609 37032 455152 47010 40523 -67973 -187138 80863 332388 1759240 1248716 759215
12068 759215 -23560 -178495 75355 -228553 125205 -74554 -280788 131397 92081 254091
12058 254091 50215 -88046 -11961 79883 16225 -99988 -33109 -314886 53781 113539 182132
12047 182132 44168 246988 -68744 -97791 -190926 -118612 -297545 218964 30874 -94849 11205
12035 303258 287952 -72591 594 -215893 -53716 31742 -11192 -200712 -10918 -105505 51152
$$ packed form
12113A11668N8064b90583g2943j2637l3064j44105h4035D53324A03626K26389
12103C30015F7924R9007a36449J8962A635J33338K7808G8875J39954h4364b2071
12091e9715J6761F197a63907D4894c8568G2727g6116j89999a00470j80286B97915
12079I7609C7032M18120D7010o487f7973j19165H0863K51525J426852n10524m89501
12068G59215b3560j54935G5355b28553A25205g4554k06234A31397l9316J62010
12058B54091E0215h8046a1961G9883A6225i9988c3109k81777E3781N9758O8593
12047A82132D4168K02820f8744k9047r3135P2314j78933B18964C0874i4849A1205
12035C03258j5306g2591E94b15893e3716C1742a1192j89520a0918r4587E1152
$$ plain form
12023 -127595 -5587 -163514 71500 4210 -406283 -90283 35907 140619 -142188 133483 62169
12011 -84890 -57247 -149117 -243834 76473 32060 -29618 -44641 -175203 -64634 -416197 100759
11999 -88339 -101994 -8492 -171422 163836 -70472 15685 -67769 -217808 50927 136844 -189407
11987 -205134 -24552 -137900 18992 108057 -110199 -171003 -165952 77523 -366761 -33097 -212345
11976 -212345 234216 245857 16834 -86515 104981 72756 23585 234939 204107 -18938 -144969
11965 -144969 270038 105733 -59598 152369 12582 -99748 -362385 64799 -84873 -119247 150084
11953 159108 87527 128247 162421 66578 -271752 145872 -113419 10910 220628 219908 -94475
11941 -34091 -276077 -222174 -11254 28312 166806 77019 49655 -59931 63294 -263296 22337
$$ packed form
12023a27595e587j57927G1500D210d06283i0283C5907J04712a42188A33483F2169
12011h4890K7643r1870r4717G6473C2060b9618j5023j30562f4634l51563A00759
11999h8339j3655h492j62930A63836g0472A5685f7769j50039E0927Q5917a89407
11987b05134b4552j13348A8992Q9065a10199o0804N051G7523c66761c3097j79248
11976b12345B34216J1641A6834h6515A04981l2225B3585K11354l0832a8938j26031
11965a44969B70038A05733e9598A52369A2582i9748k62637F4799h4873l4374A50084
11953A59108p1581M0720L4174F6578b71752A45872a13419A0910K09718p20i4475
11941c4091k41986N3903a1254B8312J38494G7019k7364e9931F3294b63296B2337
$$ plain form
11929 45462 -88498 -98498 -369196 110046 134484 -211468 19706 -278746 -160479 173867
11918 -119686 -252911 131067 -103061 -130544 45555 13600 141666 14008 103712 198546 258006
11907 258006 -196074 -192310 -131034 89452 -133858 216835 -149425 -306662 -12646 142543
11896 -211715 -75787 -216684 227526 -453540 81561 -159604 341792 117148 -35382 -187059
11886 -187059 -284507 -130365 146217 7864 230530 -160042 -71643 -233840 -51704 266717
11875 573153 -59262 -97738 189457 118547 -129827 457670 35515 -214338 -170951 -121718 -100780
11864 -100780 93201 -359490 73768 292092 124006 -6846 140816 -279042 -61392 128506
11853 -156850 72213 -199680 -102885 -25819 126865 -342801 -268625 -47960 -27543 148509 -41143
$$ packed form
11929D5462h8498j0000k70698A10046K4438b11468A9706b78746J18267A73867
11918a19686j33225A31067a03061k7483D5555A3600J28066A4008Q9704R4834N9460
11907B58006a96074L764O1276H9452a33858B16835a49425j57237a2646A42543
11896b11715g5787j40897B27526d53540H1561a59604C41792A17148c5382j51677
11886a87059r7448a30365A46217G864K22666a60042g1643j62197e1704B66717
11875E73153e9262l8476A89457p0910a29827D57670C5515b14338M3387M9233K0938
11864a00780I3201c59490G3768K18324A24006f846A40816b79042f1392A28506
11853a56850G2213a99680R6795b5819A26865c42801P4176d7960K0417A48509d1143
$$ plain form
11841 -3687 -373724 -269071 -79688 -336677 571357 139101 147914 -283665 -37920 174025 -207487
11829 -13765 -184565 169687 -146682 -146816 -7650 129714 106046 128310 -535606 -185426 -122702
11818 -122702 -161443 -117690 66205 -65277 -2572 15794 -107261 166867 -116931 -110593 -181944
11807 -181944 405556 -123414 -284956 -45565 -97251 193665 -55609 99210 71369 70457 120153
11796 120153 61325 -163745 -37210 26749 52687 -254123 -265167 -10577 -21035 40497 -7784
11784 -64345 -180634 38457 105654 38181 129814 127570 174533 -252756 -61827 67641 -97578
11772 -454253 -8308 -260306 124370 -102668 78699 -174123 -31108 -423442 -133458 81480
11761 117005 -198482 -174578 -24648 54969 -97361 168864 -32730 -75263 -15970 251444 18601
$$ packed form
11841c687l70037J04653g9688k56989E71357A39101Q813b83665c7920A74025b07487
11829a3765j70800A69687a46682j34g650A29714k3668K2264e35606a85426O2724
11818a22702l8741M3753F6205f5277b572A5794a07261A66867a16931O338p1351
11807a81944D05556a23414j61542d5565n1686A93665e5609I9210k7841r12M9696
11796A20153n8828a63745c7210B6749K5938b54123j1044a0577j0458D0497g784
11784f4345j16289C8457O7197C8181R1633k244M6963b52756f1827F7641i7578
11772d54253h308k51998A24370a02668G8699a74123c1108l92334a33458H1480
11761A17005a98482K3904b4648E4969i7361A68864c2730m2533a5970B51444A8601
$$ plain form
11749 -12420 32826 -458382 302457 -241317 20665 -178956 -202442 -312256 168005 -71323
11738 -260069 230472 -14911 -41937 130711 65787 18588 -108100 -11301 235223 -6595 -55966
11727 -55966 77601 227357 -165501 -15122 33910 -47374 225260 222506 -159197 -254136 -22196
11715 -440528 111318 -26359 257547 -231165 -43429 59730 244376 -208779 -206588 -86922 361668
11703 171227 -4156 239047 19033 123322 -34102 85041 153552 -329246 22257 31963 -175256
11691 -98805 -1682 -20218 158882 73673 104216 390 65516 41007 -272626 -208650 -157608 -122357
11679 -122357 -6618 -13412 -202221 -230791 113071 130694 -31370 -30671 -217997 -143229 -95041 22069
11666 -130896 -108914 -45287 170058 52094 241294 209648 -73276 1493 123553 -310315 125788
$$ packed form
11749a2420C2826d58382C02457b41317B0665a78956k3486j09814A68005g1323
11738b60069B30472a4911k7026A30711o4924A8588a08100a1301B35223f595m9371
11727e5966G7601J49756a65501a5122C3910d7374B25260k754a59197r4939b2196
11715d40528A11318b6359B57547b31165d3429E9730J84646b08779K191h6922C61668
11703A71227d156B39047A9033J04289c4102H5041O8511c29246B2257R706a75256
11691i8805a682j8536A58882G3673L0543C90O5126k4509b72626O3976N1042L5251
11679a22357f618o794j88809k8570A13071J7623c1370O99j87326P4768M8188B2069
11666a30896K1982d5287A70058E2094J89200l1646g3276A493J22060c10315A25788
$$ plain form
11654 234656 -165527 -385106 -117341 -33226 -229345 37756 249635 -57017 88929 -113372
11643 45050 -255754 1060 165251 -34893 -22362 -97234 43387 -164980 26473 78116 -170476
11631 29570 -158159 209226 39545 117199 65615 -24781 118397 118144 100286 183897 -154520
11619 49016 -31606 42435 45880 -38159 274731 233600 30960 -6629 234222 148381 -433703
11607 202924 -119586 200981 78393 -188659 222082 -179211 275985 112432 -37575 119395
11596 341949 -179422 -37643 344358 -142877 92388 -222230 95411 108042 -15226 43686 6864
11584 211949 -103955 93905 -166374 151756 -540029 164547 48651 -309004 -26909 80648
11573 -234 -97389 -195059 -24607 -82778 -345936 -147358 244762 27150 -40660 24290 242400
$$ packed form
11654B34656a65527k19579a17341c3226j96119C7756K11879e7017H8929a13372
11643D5050b55754A060J64191c4893J2531p4872D3387a64980B6473N1643a70476
11631B9570a58159B09226C9545P7654n1584b4781A18397k53j7858Q3611a54520
11619D9016c1606D2435L445c8159B74731m1131C0960f629B34222q5841d33703
11607B02924a19586B00981G8393a88659B22082a79211B75985A12432c7575A19395
11596C41949a79422c7643C44358a42877I2388b22230I5411J2631a5226D3686F864
11584B11949a03955I3905a66374A51756e40029A64547D8651c09004b6909H0648
11573b34r7155r7670b4607n8171k63158a47358B44762B7150d0660B4290K18110
$$ plain form
11562 242400 -552 -2329 -130011 149954 138412 80106 344159 -276403 -388430 52163 -109647
11550 -53270 -23458 30880 -26921 -197587 119287 -51580 -79395 -223343 -162134 -221217 81812
11538 -319357 115269 -201894 -26237 -15072 -105709 -15157 -168054 -59852 124048 -329268
11527 -184314 209056 359030 438877 147757 205230 -64116 208036 -126848 213195 73555
11516 127615 64575 237600 7058 60715 1668 14820 -28958 92800 48729 328170 -84887
11504 -94417 152608 -108277 123861 120913 -248424 -169671 167149 -43432 197346 -219073
11493 -98825 75519 395527 280074 -185171 126524 -97158 192567 198010 125793 11913 340854
11482 340854 100865 17279 76108 256601 237255 55171 334563 -68642 -113375 40097 226758
$$ packed form
11562B42400e52j777j27682A49954j1542n8306K64053b76403j12027E2163a09647
11550e3270b3458C0880b6921j70666A19287e1580k7815j43948O1209n9083H1812
11538c19357A15269b01894b6237J1165r0637a5157j52897e9852A24048c29268
11527a84314B09056J49974P9847A47757N7473f4116B08036a26848B13195G3555
11516A27615o3040J73025G058N3657A668J3152b8958I2800m4071K79441h4887
11504i4417A52608a08277A23861k948b48424P8753A67149d3432A97346b19073
11493i8825G5519L20008j15453a85171A26524i7158A92567N443p2217A1913L28941
11482C40854A00865A7279N8829J80493j9346E5171K79392f8642m4733D0097J86661
$$ plain form
11471 226758 198293 209204 12200 -104398 206097 319994 75052 168464 48829 208515 -303921
11459 100984 343737 -45403 376085 169001 -170212 99107 157803 -301034 -72878 -24531
11448 121876 176650 87795 -93517 -134117 -151185 83081 104499 89309 61153 194140 95462
11436 68549 60606 10695 43842 -30895 14449 -94034 147721 -41521 157185 -47019 -221727
11425 -221727 190287 -78101 -239695 -105270 -92818 216041 -85311 -25339 1333 151324 45611
11413 -202235 150920 -158206 13125 -251147 -41829 -439438 150098 91279 38161 -198890
11402 266490 -24767 132525 -56055 955 107308 167458 -120848 122940 231541 -176096 -33042
11390 -287888 54334 -100480 -78064 -33069 19949 -20934 -510627 -55298 -206465 -31307 -292373
$$ packed form
11471B26758k8465J0911A2200a04398B06097J13897G5052R3412D8829J59686c03921
11459A00984K42753d5403C76085A69001a70212I9107N8696c01034g2878b4531
11448A21876N4774H7795i3517m0600j7068H3081K1418j5190k8156J32987I5462
11436F8549p943A0695L3147c0895A4449i4034A47721d1521A57185d7019j74708
11425b21727A90287g8101j61594a05270J2452B16041h5311b5339A333J49991D5611
11413b02235A50920a58206A3125b51147d1829l97609A50098n8819C8161a98890
11402B66490b4767A32525e6055I55J06353O0150a20848A22940J08601a76096c3042
11390b87888E4334a00480K2416c3069A9949b0934m89693e5298j51167c1307k61066
$$ plain form
11379 -292373 -212237 -242311 49282 170308 190179 213259 -75113 18759 259804 228793 -166421
11367 48204 318525 -58347 -204753 -36523 -100837 143623 84221 20584 -371 -41555 171858
11355 -54733 228850 -89729 -123465 -276899 -370291 -51435 334925 -29722 19085 -43257 56333
11343 -5010 29994 16703 -20110 140229 316862 -185775 516339 -57429 -42903 -26559 210671
11331 226732 56467 93758 -283147 -101498 128233 -254626 -194668 139365 -167855 161613
11320 -158403 76750 -110832 -161563 68665 -130728 -130081 -84687 -64112 -70488 101617 132486
11309 132486 -43358 -203773 72608 261127 -73758 -320454 -15749 -256314 -21808 12802 -24379
11297 -261611 75676 -146864 -133752 -129435 -43753 -100446 -56833 -41017 -26551 -368539 136191
$$ packed form
11379b92373Q0136l0074D9282J21026J9871K3080g5113A8759K41045l1011a66421
11367D8204K70321e8347j46406c6523o4314A43623n9402B0584c71m1184A71858
11355e4733B28850h9729l3736j53434r3392e1435C34925b9722A9085d3257E6333
11343e010B9994j3291b0110A40229J76633a85775E16339e7429J4526J6344B10671
11331B26732E6467L7291b83147a01498A28233b54626N9958A39365a67855A61613
11320a58403G6750a10832n0731F8665a30728O47M5394K0575o376A01617L0869
11309A32486d3358j60415G2608J88519g3758k46696a5749k40565b1808A2802b4379
11297b61611G5676a46864J3112M317d3753n6693M3613J5816J4466l41988A36191
$$ plain form
11285 36809 -57234 -193005 65266 -197978 367639 68321 -296998 9113 -101600 15925 183158
11274 183158 -129696 232171 173092 -95510 -108961 -37504 -72125 -200468 101908 47878 -21867
11262 -82157 201290 223832 27639 -159270 -39787 -162315 -9076 -280934 13110 -37407 -97842
11251 -97842 -128177 108633 203441 191370 -245352 -143636 11687 54426 -84731 -121828 -335410
11240 -335410 81706 -219703 2994 45468 -199299 149846 -56251 -337156 38284 -67903 -115536
11229 -115536 -101074 100600 -104087 249847 57669 312469 -120104 141947 -240042 320154
11218 -67181 -151140 94821 -34527 -119 -211032 153021 -96451 -111433 -489967 -128177 -16004
11206 -111961 -67080 -142580 113019 -163358 215793 94659 -273241 -22 167220 -249134 110103
$$ packed form
11285C6809e7234j35771F5266a97978C67639F8321b96998I113a01600A5925J67233
11274A83158a29696B32171n9079i5510j3451c7504l4621j28343A01908D7878b1867
11262h2157B01290K2542B7639a59270c9787j22528i076k71858A3110c7407o0435
11251i7842l0335A08633R4808j2071b45352J01716A1687M2739h4731l7097k13582
11240c35410H1706b19703B994M2474a99299A49846e6251k80905C8284f7903m7633
11229a15536J4462A00600a04087B49847E7669K54800a20104A41947b40042C20154
11218f7181q3959I4821c4527a19k10913A53021i6451j4982l78534a28177a6004
11206a11961M4881p5500A13019a63358B15793I4659b73241b2A67220b49134A10103
$$ plain form
11194 10336 141148 -86020 -469619 -99001 -390145 131491 -63442 321412 16392 -84098 -192151
11183 -192151 -83834 -84245 161958 9295 -260283 -89351 -512486 -136012 -6833 -5906 -164600 -11009
11170 314461 -303536 -260288 4099 -219762 -149918 44448 104044 186995 -36459 265583 110284
11158 -88528 -22673 -225328 -133365 -124882 47744 190177 -3327 12695 -62964 40689 -33449 -149912
11146 -149912 -267340 187606 112376 -226751 -102047 22296 -12945 -116527 -26251 35591
11135 -94060 -27496 217832 219977 258006 40376 253567 -29666 414034 151030 88532 125004
11124 125004 -128872 78288 -78507 118824 -7784 -27853 271940 47520 -174957 148687 217590
11113 217590 346970 -236254 -83678 151198 -111579 16892 67326 41911 134881 -8397 60693
$$ packed form
11194A0336J30812h6020l83599i9001k91144A31491f3442C21412A6392h4098j08053
11183a92151h3834m11A61958I295b60283h9351m23135a36012f833R27j58694a1009
11170C14461c03536M3248D099b19762O9844D4448N9596Q2951c6459B65583A10284
11158h8528b2673k02655R1963Q483D7744J42433c327A2695f2964D0689c3449j16463
11146a49912j17428A87606p5230b26751a02047B2296a2945j03582b6251C5591
11135i4060b7496B17832K145L8029D0376K13191b9666D14034A51030o2498L6472
11124A25004a28872G8288g8507A18824g784k0069B71940D7520a74957A48687O8903
11113B17590J29380b36254h3678A51198a11579A6892N0434k5415R2970h397F0693
$$ plain form
11101 -107198 147509 4135 271254 -214473 105381 -284664 -123697 88314 273286 345070
11091 345070 373886 200246 -36668 124550 12269 341147 -96137 -132820 -10750 56310 193148
11080 193148 90016 341278 12098 474025 -24718 98172 227078 28562 506940 64456 353106
11069 353106 224933 179945 91617 381416 285495 241294 286043 229744 317011 251718 223923
11058 223923 635958 551630 353651 379489 831171 399876 91998 378912 374428 557315
11048 557315 259536 283612 627184 280636 646485 477137 482036 429592 647546 665880
11038 665880 366270 309268 924128 669769 747537 399989 717231 553194 531271 251633
11027 743899 132732 383011 330083 536411 208134 756622 488595 306902 480887 690975
$$ packed form
11101a07198A47509D135K67119b14473A05381b84664a23697H8314J84972P1784
11091C45070K8816j73640c6668A24550A2269L28878i6137l6683a0750E6310J36838
11080A93148I0016K51262A2098M61927b4718I8172J28906B8562M78378F4456K88650
11069C53106j28173m4988q8328K89799r5921m4201M4749n6299Q7267o5293k7795
11058B23923M12035q4328j97979K5838M51682C99876I1998K86914m484J82887
11048E57315B59536K4076L43572B80636L65849j69348M899n2444K17954J8334
11038F65880k99610n7002O14860k54359P7768l47548L17242j64037k1923B51633
11027G43899A32732K50279n2928K06328B08134N48488k68027j81693J73985K10088
$$ plain form
11017 690975 539144 400918 658314 433379 487564 722260 266711 350766 551121 386309
11007 386309 390359 418626 217808 139444 390487 289065 652593 594038 723846 295958
10996 653969 404289 385411 614511 307297 543051 485523 130615 578576 675956 713201
10986 713201 429730 413486 694111 872705 320539 730332 507913 968734 940885 1157022
10976 1157022 1408896 1252004 1761510 1686222 1874007 2047123 2233410 1857006 2143563 1964736
10966 1964736 1789196 1515378 1407078 1092992 1017028 767708 1079656 978119 887089 993170
10956 993170 1208104 1127720 936648 850281 948095 710995 483776 388298 218846 286123
10946 286123 477272 93958 88726 342719 83260 -160300 -75526 66100 -28575 334403 372025
$$ packed form
11017F90975j51831j38226K57396k24935N4185K34696B66711Q4055K00355j64812
11007C86309M050K8267k00818p8364K51043j01422L63528n8555J29808B95958
10996F53969k49680j8878K29100l07214K35754n7528A30615M47961R7380L7245
10986G13201k83471j6244K80625J78594C20539M09793k22419M60821k7849K16137
10976A157022K51874j56892N09506p5288J87785J73116J86287l76404K86557j78827
10966A964736j75540k73818j08300l14086p5964k49320L11948j01537r1030J06081
10956I93170K14934q0384j91072q6367R7814k37100k27219r5478j69452O7277
10946B86123J91149I3958n232K53993H3260a60300g5526F6100b8575C34403L7622
$$ plain form
10935 372025 243835 -7063 83356 168044 -312551 290562 -84662 -88343 -7430 -205353 286283
10923 124731 148587 281609 -327187 -82409 -164674 238179 -168715 -85365 46496 13646 143365
10912 143365 -293153 -12726 -224507 -196793 -111560 39369 -119585 2584 -125858 -246886 -187640
10901 -187640 15298 208226 2884 -43583 -147243 113114 22704 -39491 -297781 146796 155187
10890 155187 -1506 258234 -128722 170703 177681 83761 -8732 -386169 -69005 56638 -64398
10878 93235 -166873 -96941 -116936 224225 117540 7366 90557 191375 81481 113328 -134651
10866 25911 -78387 125189 -31250 -121219 -95101 30075 -143823 143722 100506 163467 108141
10855 108141 -368037 -121521 -238917 -82941 -251833 63470 276227 -110612 -182314 363425
$$ packed form
10935C72025j28190g063H3356Q4688c12551B90562h4662l681g430j97923B86283
10923A24731K3856J33022c27187h2409q2265B38179a68715Q3350D6496A3646J29719
10912A43365b93153a2726k11781K7714Q5233C9369a19585B584a25858j21028N9246
10901a87640A5298J92928B884d3583j03660A13114B2704c9491k58290A46796Q391
10890A55187a506B58234a28722A70703O978H3761h732l77437f9005E6638f4398
10878I3235a66873O9932j9995B24225j06685G366Q3191J00818H1481L1847a34651
10866B5911g8387A25189c1250q9969K6118C0075a43823A43722m3216O2961n5326
10855A08141c68037a21521j17396h2941j68892F3470K12757a10612p1702C63425
$$ plain form
10844 -263738 -55325 151774 -503251 -235119 -131261 -18735 4502 186471 -416631 -220745
10834 -220745 41394 19525 273057 -182937 -205754 92202 85281 -234636 69326 221607 -21826
10822 -142191 179789 -377503 -299297 -70169 -153529 -97451 81174 -109692 -105364 -55648 -350455
10811 -350455 -39335 -36942 -196689 210262 123617 -248720 -167048 -54634 -79468 -7801 39177
10799 145787 -198293 -238050 14844 368643 92020 95550 145260 160294 215484 -201216 413134
10787 70938 -173763 81284 -137128 28034 123529 -203962 4192 56659 -62894 122784 -18498
10775 198729 -106612 3472 287969 22792 -53710 -281383 278483 155200 123072 280713
10765 280713 89797 -119406 162008 105849 -149145 149762 -339004 -69612 45005 -100782
$$ packed form
10844b63738e5325A51774e03251b35119J03858a8735D502J81969d16631J95886
10834b20745D1394A9525K53532a82937k2817I2202o921b34636F9326J52281b1826
10822a42191A79789c77503P8206g0169q3360N6078H1174a09692M328M9716k94807
10811c50455c9335K393j59747B10262q6645b48720Q1672e4634k4834g801C9177
10799A45787a98293l9757A4844L53799I2020L530M9710J5034N5190b01216D13134
10787G0938a73763H1284a37128B8034R5495b03962D192N2467f2894A22784a8498
10775A98729a06612C472K84497B2792e3710k27673B78483j23283l2128J57641
10765B80713H9797a19406A62008n6159a49145A49762c39004f9612D5005a00782
$$ plain form
10754 46355 -170315 22562 -26647 7325 304126 -160894 56343 -253698 318205 102831 -25719
10742 -143707 -297496 -142796 154973 -125601 -192243 -48585 -307881 32777 -68312 59976
10731 -74331 -515207 -102536 163310 -345864 -123380 57092 -84939 -46086 -206431 131097
10720 18979 -146538 145190 55797 37978 98614 -157039 26492 92910 -470848 -120988 124883
10708 -159537 -406333 -100611 -400336 -193499 -188834 -208741 131128 49734 -71985 -102434 -108661
10697 -108661 -121646 155474 -289422 -46490 172440 -205644 50980 -98153 242710 -114201
10686 -154910 -150525 31901 139755 348257 235831 -21548 199348 -93134 127395 -18637 354539
10674 -260945 -292256 -107777 72750 -281681 242125 -96297 -337729 95317 76717 81927 -394380
$$ packed form
10754D6355a70315B2562b6647G325K96801a60894E6343b53698C18205A02831b5719
10742a43707j53789a42796A54973a25601o6642d8585k59296C2777f8312E9976
10731g4331m40876a02536A63310c45864a23380E7092h4939L8853j60345A31097
10720A8979a46538A45190E5797j7819O0636a57039B6492O6418d70848a20988A24883
10708a59537k46796a00611k99725a93499M665j9907A31128D9734g1985l0449o227
10697a08661j2985A55474b89422d6490A72440b05644E0980i8153B42710a14201
10686a54910M385C1901J07854K08502j12426b1548A99348i3134A27395a8637C54539
10674b60945l1311a07777G2750b81681B42125i6297k41432I5317j8600N210c94380
$$ plain form
10662 94375 -65237 -188722 -81928 -59025 246420 -253552 64911 64685 -135762 -23178 -208604
10651 -208604 138707 58756 57199 159726 136057 -129810 -117080 710 341842 -90264 -112281
10640 -112281 89116 123360 -64470 -2082 83850 -394773 -299843 -101018 -56033 -7735 158830
10628 -250673 -306642 304928 274956 -44298 123739 -178327 -46634 56058 -84306 200143 -33856
10616 -260991 -182418 -32332 81394 -68906 76732 -21640 354234 -219337 -190880 -160423 -264020
10605 -264020 177499 -202707 -165353 -369092 -177914 -103643 -254311 -452442 190472 -180898
10594 89174 87866 -135002 -159870 -73973 41837 -59114 178470 72311 -177917 30319 -303642
10582 6641 -62532 -33130 -210479 -72353 -248261 83664 117180 21840 -177660 53919 -61539
$$ packed form
10662I4375f5237j23485h1928K2903B46420b53552F4911k26a35762b3178j85426
10651b08604A38707E8756j557J02527k3669a29810J2730G10L41132i0264k2017
10640a12281H9116L4244f4470b082H3850c94773R4930a01018M4985g735A58830
10628b50673n5969C04928k9972d4298A23739a78327d6634E6058h4306B00143c3856
10616b60991P8573c2332H1394f8906G6732b1640C54234b19337K8457L0457j03597
10605b64020A77499b02707L7354k03739a77914P4271j50668j98131A90472a80898
10594H9174j308a35002k4868g3973D1837e9114A78470G2311a77917C0319c03642
10582F641f2532K9402j77349g2353j75908H3664L3516B1840a77660E3919f1539
$$ plain form
10570 50256 -237776 -89928 49048 -244181 -151731 -76852 35542 -182465 -180970 -50782 -75380
10559 -75380 -39669 -52555 -132217 268030 -243622 -96698 -211682 52094 -296552 115917 -98485
10547 -139030 -246743 -33705 93701 -355482 -28403 196917 -9407 40659 -93874 92959 179702
10536 179702 8906 164351 -183364 -314068 -144656 -315431 -136759 -216449 -272251 67139
10525 -119390 -151692 -48995 114553 -605528 -372416 28660 -238540 -110308 -144243 135896
10514 252640 127748 397001 -276053 -187145 -139464 -55462 -54252 -94613 -70828 24054 -38978
10502 74609 246343 -328956 -365566 128252 -284651 -79771 215624 -209655 333002 149811
10491 -322750 -224758 6345 -29714 108083 182562 -266038 4565 161808 -256853 307414 86643
$$ packed form
10570E0256b37776h9928D9048b44181R2450P4879C5542a82465J495e0782k4598
10559g5380L5711j2886p9662B68030b43622i6698j14984E2094b96552A15917i8485
10547a39030j07713c3705I3701c55482b8403A96917i407D0659i3874I2959Q6743
10536A79702H906J55445a83364j30704a44656j70775a36759p9690n5802F7139
10525a19390l2302d8995A14553f05528K33112B8660b38540a10308l3935A35896
10514B52640j24892K69253b76053Q8908M7681e5462J210m0361K3785B4054c8978
10502G4609J71734c28956l6610A28252b84651g9771B15624b09655C33002A49811
10491c22750R7992F345b9714A08083P4479b66038D565J57243b56853C07414H6643
$$ plain form
10479 63157 231708 209273 112701 27911 239702 157763 -30454 29862 -210434 -374235 43185
10467 -224227 197747 92132 -47756 -13457 -111873 -66485 -17096 -52223 21536 2856 47165
10456 47165 -64969 -135206 36289 -143078 295389 -118359 -101240 107447 -167067 189669
10445 -176792 1474 26285 -153278 49638 64355 76610 241880 -150077 -8617 -204267 -71433
10433 218100 173957 120972 47474 51495 -132652 56008 -102811 -93797 -71593 -16167 -137004
10422 -137004 -98315 -75461 107013 144310 154092 -13046 342347 118842 27660 64697 -19881
10410 7983 -327912 -502312 -52811 60236 -24526 -223629 -27980 181525 -274025 -368708 -17665
10398 56242 -59614 -74723 171338 -229193 -150338 36991 -265412 -224503 228169 -33645 294675
$$ packed form
10479F3157J68551k2435r6572B7911K11791q1939c0454B9862b10434j63801D3185
10467b24227A97747I2132d7756a3457r8416M5388a7096l5127B1536B856M4309
10456D7165f4969p0237C6289a43078B95389a18359J7119A07447a67067A89669
10445a76792A474K4811a53278D9638J4717J2255J65270a50077h617j95650g1433
10433B18100m4143n2985D7474M021a32652E6008a02811R014K2204a6167j20837
10422a37004L8689K2854A07013L7297R782a3046C42347A18842B7660L7037a9881
10410G983c27912j74400e2811F0236b4526j99103b7980A81525b74025r4683a7665
10398E6242e9614j5109A71338b29193P8855C6991b65412M0909B28169c3645B94675
$$ plain form
10386 44260 303153 -48729 -190342 203894 -6694 -38632 -70839 -38823 151808 266983 298061
10375 298061 193432 17067 122164 126773 299029 59769 -193294 265221 310395 333262 344472
10364 344472 489775 182968 87683 16666 132353 58585 182321 172531 -24783 85702 207733
10353 207733 327228 397813 335002 200762 205344 328595 216019 541882 294692 -31117
10342 224269 -21177 151811 188637 224270 -69932 -1743 202415 109784 -342277 82551 307332
10331 307332 -49330 36967 350280 82437 -221280 -199103 417740 -118328 -139735 223511
10320 194611 273586 114284 -40614 247957 124324 13469 -66 -176565 -31507 -87637 -169034
10309 -169034 -48673 -20244 -310674 -298617 19497 -98477 -180558 194142 -288737 38639 146168
$$ packed form
10386D4260K58893d8729j41613B03894f694l1938l2207L2016A51808J15175L1078
10375B98061j04629A7067J05097M609J72256E9769a93294B65221M5174K2867J1210
10364C44472J45303A82968H7683A6666J15687E8585J23736r790b4783H5702J22031
10353B07733J19495P0585o2811j34240M582J23251j12576L25863k47190c1117
10342B24269b1177A51811L6826L5633f9932a743B02415r2631c42277H2551K24781
10331C07332d9330C6967L13313H2437b21280K2177D17740a18328k1407B23511
10320A94611P8975A14284d0614B47957j23633A3469f6j76499c1507n6130q1397
10309a69034d8673b0244k90430J2057A9497i8477q2081A94142b88737C8639J07529
$$ plain form
10298 146168 -127386 -90773 5631 -210822 179128 -98825 -55958 -215104 230481 90969 265230
10287 265230 -145286 -38048 194812 -27940 190189 88389 112968 64880 -252333 -157166 -95670
10276 -95670 -275866 -39343 -107015 -216466 -235195 -87426 166692 22981 -311733 -222306 -121516
10265 -121516 4912 261471 144315 101865 -54069 152195 69028 -65052 -14074 167755 445369
10254 445369 18160 -57271 343238 -105936 167146 257075 -122339 -246009 70202 -19852
10243 -31579 -271727 238342 -315311 -57932 -103281 27387 -209677 262931 220264 189354 -259568
10231 -421736 -82387 -141235 236302 66217 118483 93794 -142771 95223 350414 74272 -111427
10219 -445901 -94125 91298 -27105 -12751 137471 -77595 -29414 29180 -181912 97330 186986
$$ packed form
10298A46168a27386L6613E631b10822A79128i8825M2867j59146B30481I0969J74261
10287B65230a45286c8048A94812b7940A90189H8389K4579m8088b52333R5167O1496
10276i5670j80196c9343o7672j09451j8729h7426A66692B2981c11733Q9427J00790
10265a21516D912K56559j17156m2450e4069A52195F9028f5052a4074A67755K77614
10254D45369A8160e7271C43238a05936A67146Q9929a22339j23670G0202a9852
10243c1579k40148B38342c15311e7932m5349B7387b09677B62931m2667l0910b59568
10231d21736h2387n8848B36302F6217N2266k4689a42771I5223K55191G4272a11427
10219d45901i4125I1298b7105a2751A37471g7595b9414B9180a81912I7330Q9656
$$ plain form
10208 186986 62761 -95955 84867 -36714 -307229 91630 267372 -401515 56889 534885 -220969
10196 49373 -114635 -156489 -182333 -441934 -58834 -149545 -198964 4573 202539 37385 -29875
10184 59207 330 149707 223815 86956 -13541 -397028 -314323 30325 -180600 -60152 -247446
10173 -247446 -61972 -17669 155341 158355 -45827 -172668 29675 -243288 190571 -205723 -437495
10162 -437495 -56215 -27688 -359932 -55893 -91655 -132004 7217 202945 -134138 -14695 126711
10150 -49671 -171497 133170 -309140 -162598 -122141 34667 -130017 103759 110975 110787 -258299
10138 171817 -48865 -104085 142759 -331312 -267477 160078 -354248 -7096 110031 -429951
10127 1297 -132683 -5926 18123 -141104 135320 130536 68320 148583 -92151 91269 226209
$$ packed form
10208A86986F2761i5955H4867c6714k70515I1630J75742d01515E6889M77996b20969
10196D9373a14635m1854k5844k59601e8834r0711m9419D573J97966C7385b9875
10184E9207C30J49377P4108H6956a3541l83487Q2705C0325a80600f0152j87294
10173b47446f1972a7669A55341L014d5827j26841B9675b43288A90571b05723k31772
10162d37495e6215b7688l32244e5893l5762m0349G217J95728a34138a4695A26711
10150d9671j21826A33170c09140J46542M0457C4667a30017A03759P216j88b58299
10138A71817d8865n5220A42759c31312O3835A60078c54248g096A10031d29951
10127A297a32683e926A8123a41104A35320m784o2216Q0263i2151I1269J34940
$$ plain form
10116 226209 -7783 -65192 -343605 191606 -249587 -132958 91594 150510 -65522 16257 -89689
10104 -327924 19504 -156231 79999 -27492 -141093 -50649 24194 91616 43693 -177217 -135640
10093 -135640 234240 -324726 -287696 14921 -266434 -110361 -360125 116866 -16827 -144593
10083 -144593 -418064 -257411 157902 -80369 201954 -57875 74945 -188789 19292 -203274
10072 -185299 114337 -143030 177589 -93508 -282757 -57380 27090 30007 -233070 73895 -227236
10060 156487 -159702 -306693 138517 -50208 -174242 -47599 -59276 -430427 -148239 -132362
10050 -132362 -45744 -90351 90107 341461 -2150 -149551 -385142 -122669 -81925 -188806 -459752
10039 -459752 119191 -63547 -201319 -261210 110175 78826 27471 -296921 1512 -214572 -102563
$$ packed form
10116B26209g783n7409k78413A91606b49587J16629I1594N8916f5522A6257h9689
10104c27924A9504a56231G9999b7492j13601e0649B4194O7422D3693a77217M1577
10093a35640B34240c24726L7030A4921b66434a10361k49764A16866a6827j27766
10083a44593k73471J60653A57902h0369B01954e7875G4945a88789A9292b03274
10072a85299A14337a43030A77589i3508j89249e7380B7090K917b33070G3895b27236
10060A56487a59702j46991A38517e0208j24034d7599j1677l71151a48239J5877
10050a32362d5744m4607I0107K51354b150j47401k35591a22669M0744j06881k70946
10039d59752A19191f3547j37772n9891A10175l1349B7471b96921A512b14572a02563
$$ plain form
10027 -355980 -18286 -231369 -413784 -105720 249010 -55960 314307 -241414 83102 165363
10017 165363 -4276 -109247 -179559 195278 54519 26943 -269503 -505712 -224822 -158584 -193564
10006 -193564 129715 -158877 177775 -128998 87676 -210922 -283623 -203601 -38516 152190
9995 -176349 156259 -58001 -127883 80535 -320489 -111277 -225975 -7186 280471 -515 6113
9983 -45591 -64607 -9189 156132 340 -90626 -127591 -134604 -92480 -118814 -115275 65849 -164504
9970 -231478 -100947 -295413 -168658 -79520 -283537 -98592 -404780 410190 -167645 -201505
9960 -201505 -147849 55979 -120788 63927 -180982 -172542 165841 129291 -51893 -121656 -256856
9949 -256856 -227229 -136647 -88608 170193 76629 112560 -22456 -34233 -15669 -529291 -141555
$$ packed form
10027c55980a8286k13083j82415a05720B49010e5960C14307b41414H3102Q2261
10017A65363d276j04971p0312A95278E4519B6943b69503k36209b24822O6238l4980
10006a93564A29715a58877A77775a28998H7676b10922p2701Q0022c8516A52190
9995a76349A56259e8001o9882H0535c20489a11277j14698g186B80471e15F113
9983d5591j9016i189A56132C40i0626l6965p013M2124k6334L539F5849a64504
9970b31478a00947j94466J26755g9520k04017i8592l06188D10190a67645l3860
9960b01505N3656E5979a20788F3927a80982Q440A65841l6550e1893o9763j35200
9949b56856K9627R0582M8039A70193G6629L5931b2456j1777a5669n13622a41555
$$ plain form
9937 66636 -182088 -150638 -22862 -78588 -99325 115088 128258 -3475 -280374 221383 -92285
9925 -250959 -126065 174468 -82905 -234073 -138213 -376882 -169922 -303031 407725 -44226
9914 -208595 200462 131259 -16538 111380 120528 50159 26936 -184716 -107055 238984 176640
9903 176640 -170344 50399 118793 -255958 -49445 -161178 -127866 -112543 -29445 5761 -77320
9891 7244 -236005 -400637 173804 206858 131926 13156 126279 -111281 -107121 -210571 -145531
9880 -145531 -235225 107010 -205899 -150286 -72242 89887 -76713 95973 36852 199969 117348
9869 117348 53000 -28317 81871 29747 -125669 -328005 -263459 -72490 -177534 -340977 18133
9857 -239875 -143821 -58216 -92458 127755 169103 23542 52203 43155 7607 176802 -262393
$$ packed form
9937F6636a82088L1450b2862n5726k0737A15088J3170c475k76899B21383i2285
9925b50959J24894A74468h2905j51168R5860k38669a69922j33109D07725d4226
9914b08595B00462o9203a6538A11380R148E0159k3223a84716P7661B38984o2344
9903A76640a70344E0399O8394b55958d9445j11733L3312J5323b9445E761g7320
9891G244b36005j64632A73804L3054p4932A3156J13123a11281M160j03450O5040
9880a45531q9694A07010b05899N5613g2242H9887g6713I5973C6852J63117q2621
9869A17348E3000b8317H1871B9747a25669k02336O4546g2490j05044j63443A8133
9857b39875R6054e8216l4242A27755M1348B3542K8661r048G607J69195b62393
$$ plain form
9845 -95549 -315257 -249342 256895 -136442 242796 -228281 -361414 90137 186888 -265826
9834 17395 173277 128090 -131747 328235 63823 217785 -16776 45798 12504 -46441 -178858
9823 -178858 -387788 84895 -92514 -27164 1502 -154622 -55399 -411087 -29869 118826 -163490
9811 64972 -80228 -221198 101132 -54538 -127339 -360241 -25098 -71279 -55367 20966 -52625
9799 94132 -250906 -64546 -144575 84236 -29119 -238168 -107474 -139048 -34519 -178352 33222
9787 175014 -165368 -16673 67620 -41469 258501 -222862 -170822 -174943 199273 -64837 135896
9775 -155813 142803 -153120 -287979 175481 182953 398431 -80256 -26534 -252285 -169255 -481103
9764 -481103 41555 -50527 143075 -4828 -302106 -29675 -17021 -67886 188798 -281841 -237275
$$ packed form
9845i5549k19708O5915B56895a36442B42796b28281j33133I0137R6751b65826
9834A7395J55882m5187a31747C28235F3823J53962a6776D5798A2504d6441j32417
9823a78858k08930H4895i2514b7164A502a54622e5399l55688b9869A18826a63490
9811F4972h0228j40970A01132e4538p2801k32902b5098m6181J5912B0966e2625
9799I4132b50906f4546q0029H4236b9119k09049a07474l1574c4519j43833C3222
9787A75014a65368a6673F7620d1469B58501b22862N2040m121A99273f4837A35896
9775a55813A42803a53120j34859A75481P472K15478h0256b6534k25751Q3030l11848
9764d81103D1555e0527A43075d828k97278b9675J2654n0865A88798b81841M4566
$$ plain form
9753 -237275 109042 -130844 20240 -74654 -182223 -106604 95874 -86208 -135822 -278984 -121503
9741 -572942 14861 68730 -17074 -309131 157935 -167374 -295369 86915 -94468 -218152 98039
9729 -51745 -168426 -52231 -33102 -78223 -157269 177665 -18009 -316356 8392 -182419 -125358
9718 -125358 -559276 -66953 -34823 -318173 -62655 -64599 -98342 4557 73144 84285 26552 -66751
9705 218117 -289017 -225655 4834 -106444 203480 -257405 -7974 -269875 -83734 130171 -212733
9693 187251 -129983 120747 -428639 163255 -356226 -357516 16652 85230 -38614 -125835 124432
9681 77049 -174292 -23205 116154 -181434 -148229 74200 164200 -66223 265618 15547 -235539
9669 -454094 -114753 67347 -98890 256588 34889 123878 -56730 -26511 107003 -180733 -4020
$$ packed form
9753b37275A09042a30844B0240g4654j07569P5619I5874h6208m9614j43162a21503
9741e72942A4861N3869a7074k92057A57935a67374j27995H6915i4468j23684I8039
9729e1745j16681e2231J9129m5121p9046A77665a8009k98347H392a82419N7061
9718a25358m33918f6953L2130k83350f2655j944l3743D557O8587J1141B6552f6751
9705B18117b89017O3362D834a06444B03480b57405g974k61901h3734A30171b12733
9693A87251a29983A20747d28639A63255c56226j290A6652O8578c8614q7221A24432
9681G7049a74292b3205A16154a81434L3205G4200R0000f6223B65618A5547b35539
9669d54094a14753F7347i8890B56588C4889Q8989e6730b6511A07003a80733d020
$$ plain form
9657 54180 -143839 136562 -94210 -169282 -54177 -141354 -53464 -47982 -20601 -374398 -79438
9645 -93373 162528 275834 26987 115308 -25917 -81605 41634 165767 73426 -72900 -261767
9634 -261767 -36372 -346928 2049 -15761 -5296 -119782 -203052 -263904 -164563 75084 37363 -83149
9621 -236493 91537 6309 51062 128548 -259421 207672 -212610 171703 -231560 -431591 309746
9609 -132726 -48207 69350 41113 212456 -221652 163218 -101998 -74504 -35617 -153213 -98755
9598 -98755 -272963 -320660 95858 -131215 -23084 195586 54476 238404 -26775 51339 306761
9587 306761 66440 -362360 -171829 -56271 309334 -32209 -136116 -82894 -235221 139063
9576 132247 2714 -190531 -24187 -271869 -424145 327965 -255043 10838 -181676 -208482 -276877
$$ packed form
9657E4180a43839A36562i4210p5072e4177q7177e3464N482b0601l53797g9438
9645i3373A62528J13306B6987Q8321b5917n5688D1634J24133G3426g2900j88867
9634b61767c6372l10556B049a5761e296j14486q3270o0852R9341G5084C7363h3149
9621b36493I1537F309M4753P7486b59421B07672b12610A71703b31560k00031C09746
9609a32726d8207F9350k8237J71343b21652A63218a01998K7494c5617j17596N4458
9598i8755j74208m7697I5858a31215b3084A95586E4476J83928b6775E1339K55422
9587C06761F6440c62360a71829e6271C09334c2209j03907N3222j52327A39063
9576A32247B714a90531b4187k47682j52276C27965b55043A0838a81676k6806o8395
$$ plain form
9565 -276877 -94028 -110142 -208593 -251848 266330 -244879 23225 -96885 69453 -108807 61300
9553 298352 -443964 -24257 -134440 -390202 -483792 -79683 -341789 -55579 389294 -115987
9542 -115171 -137464 30635 -53332 139986 -168276 -137866 362517 -247425 78112 -355029 -11231
9530 -167425 20437 -10249 -130470 -139849 -528463 -189014 -126403 -73949 -145833 833 -303653
9518 -214151 -36080 344547 -4617 73436 -26252 25920 -162557 232263 -108254 -86642 -144409
9507 -144409 126710 -507818 28953 -54900 33556 -56773 -212511 219393 -15652 -265573 -373393
9496 -373393 -62525 -235054 122852 109092 169067 -105613 -76756 201029 -156290 -191711 105604
9484 -93216 -9785 -129997 67219 -524 -89893 11240 -255395 -6527 -10476 260329 -256856 50939
$$ packed form
9565b76877i4028j6114r8451m3255B66330b44879B3225i6885F9453a08807F1300
9553B98352d43964b4257j10183k55762r3590g9683k62106e5579C89294a15987
9542a15171k2293C0635e3332A39986a68276L0410C62517b47425G8112c55029a1231
9530a67425B0437a0249j20221r379l88614a89014O2611N2454p1884H33c03653
9518b14151c6080C44547d617G3436b6252B5920a62557B32263a08254K1612n7767
9507a44409A26710e07818B8953e4900C3556e6773j55738B19393a5652k49921j07820
9496c73393f2525j72529A22852j3760N9975a05613K8857B01029a56290l5421A05604
9484i3216i785j20212F7219e24q9369A1240b55395f527l949B60329b56856E0939
$$ plain form
9471 281079 -201456 -33305 -9236 54108 -379383 160273 -109208 229307 -16799 -306624 197437
9459 29666 -8142 -326952 -127970 -208492 37884 -221073 34754 -89842 219600 -285085 -56031
9447 221977 -12722 91996 -230943 -203485 164908 138091 -51116 -98495 -74827 -19625 279562
9435 60335 -190814 -132778 73819 21897 317572 -35153 -290815 -136269 114403 -467395 -105738
9423 91378 -83226 -115465 78337 -19318 -151590 -242078 -255153 -33775 14109 -114346 135198
9411 306254 42949 -24035 -224052 -132246 -120288 -287015 -76044 492197 -272499 -144079 -55088
9399 240807 -41265 38161 -354899 -303599 -323913 -182007 -62833 78805 -106970 -419712 19427
9387 129819 -105801 -78074 -34091 307137 209576 58921 64808 65692 -221003 -241679 57812 101285
$$ packed form
9471B81079b01456c3305i236E4108c79383A60273a09208B29307a6799k89825A97437
9459B9666h142l18810a27970q0522C7884b21073C4754h9842B19600b85085e6031
9447B21977a2722I1996b30943K7458A64908k6817e1116m7379K3668a9625B79562
9435F0335a90814N8036G3819B1897K95675c5153k55662a36269A14403d67395a05738
9423I1378h3226l2239G8337a9318j32272r0488j3075c3775A4109a14346A35198
9411C06254D2949b4035k00017R1806J1958j66727g6044D92197b72499J28420e5088
9399B40807d1265C8161c54899N1300k0314J41906f2833G8805a06970l12742A9427
9387A29819a05801K7727c4091C07137r7561E8921N887Q84b21003k0676E7812M3473
$$ plain form
9375 101285 83546 -162628 -44695 -62502 -87139 20627 193115 -164000 -153684 145124 2809
9363 -148640 -45100 -448393 107995 -28264 818 3759 -108826 -218976 -420915 53352 -101475
9351 -184849 295844 -118176 90607 24401 40138 66097 -125131 215817 -244197 -228596 141088
9339 32089 -88116 -103448 -365361 -1484 42261 108412 -87536 -72081 184335 -26132 -77910 544
9326 -186523 -129295 150049 -163535 -80785 -126388 242483 -67850 157384 -105847 -103913 107461
9314 -172033 -177807 -79978 -96812 134729 -280371 10265 -142422 -79930 -125690 1697 338712
9303 338712 30187 -144130 -345431 17129 -435088 -112093 -247693 -130522 156369 -25521
9292 -220047 -222040 31127 -110052 -141621 -201831 84408 -177952 -265722 -107623 45345 -318382
$$ packed form
9375A01285j7739a62628d4695j7807k4637B0627J72488a64000J0316A45124B809
9363a48640d5100m03293A07995b8264H18K941a08826j10150k01939E3352a01475
9351a84849B95844a18176I0607B4401J5737K5959a25131B15817b44197J5601A41088
9339C2089h8116j5332k61913a484D2261O6151h7536J5455A84335b6132n1778E44
9326a86523N7228A50049a63535h0785m5603B42483f7850A57384a05847J934A07461
9314a72033n774g9978j6834A34729b80371A0265a42422O2492m5760A697L37015
9303C38712C0187a44130k01301A7129d35088a12093j35600J17171A56369b5521
9292b20047j993C1127a10052l1569o0210H4408a77952q7770a07623D5345c18382
$$ plain form
9280 -217732 -145627 304341 96284 91743 -15775 154695 -368965 -135746 45267 75701 75564
9269 75564 -211227 -207858 185370 -207476 -166725 17008 105485 -417616 -96689 63659 -254087
9257 7343 -78064 -146995 -197473 -105578 161628 238392 108543 80202 -264373 -300371 -151966
9246 -151966 329996 -37686 -92900 -268986 -225438 -66205 -10424 -237372 293130 -13002 -69176
9235 -69176 -51954 -152011 14043 38204 10345 -172572 25648 47349 -284131 23123 51568
9224 51568 -148536 -267132 3025 -24441 233113 -121650 164350 -62106 -231127 -202742 17007
9212 -52450 -232726 186462 183819 -383958 -159380 -97406 137137 65263 -16873 115788 18271
9200 49465 52034 -47024 -16342 49384 55862 67951 737 -181829 -93373 -203899 -175524 96387
$$ packed form
9280b17732P2105C04341I6284m541a5775A54695c68965a35746D5267L0434j37
9269G5564b11227L369A85370b07476M0751A7008Q8477d17616i6689F3659b54087
9257G343g8064o8931n0478R1895A61628P6764A08543k8341b64373l5998J48405
9246a51966C29996c7686n5214j76086M3548f6205a0424k26948B93130a3002n6174
9235f9176J7222j00057A4043K4161A0345a72572B5648K1701b84131B3123K8445
9224E1568a48536j18596C025b4441B33113a21650A64350f2106j69021K8385A7007
9212e2450j80276A86462k643c83958a59380O1974A37137F5263a6873A15788A8271
9200D9465K569d7024a6342D9384O478J2089G37a81829Q8456j10526K8375I6387
$$ plain form
9187 -1 153571 -110706 45292 254355 273920 -228884 15737 -54639 -323138 -168794 -1352 -45667
9175 -45667 -99671 -373447 185966 -101537 -221326 -6943 -12682 297640 -5573 361986 -69024
9163 30416 50268 -25115 -465307 -155727 -70256 -81245 -199831 -395270 387427 28292 11800
9151 -181038 206971 94199 -318441 -82770 -254737 -60286 11737 -306293 12657 -76146 -166648
9140 -166648 -77405 105282 -8058 -383990 147194 -95235 -145339 117323 -313258 -343679 -18144
9128 -193928 -84101 31433 -237392 -27806 -301441 -51128 -99020 -412225 -32009 -708597 -238593
9116 -212953 216335 -479317 -138991 224795 -61593 -89871 88126 -381012 115413 -171210
9105 -84301 -183737 64142 -74580 100717 -137786 71256 -202694 -257047 162789 209567 -23395
$$ packed form
9187aA53571a10706D5292K09063J9565b28884A5737e4639k68499J54344a352m4315
9175d5667n4004k73776A85966a01537j19789f943n739B97640e573C61986f9024
9163C0416J9852b5115m40192a55727g0256j0989j18586j95439C87427B8292A1800
9151a81038B06971I4199c18441h2770j71967f0286A1737c06293A2657g6146r0502
9140a66648g7405A05282h058l75932A47194i5235n0104A17323c13258l0421a8144
9128a93928h4101C1433b37392b7806k73635e1128m7892l13205c2009o76588b38593
9116b12953B16335d79317a38991B24795f1593k8278H8126c81012A15413a71210
9105h4301r9436F4142g4580A00717a37786G1256b02694n4353A62789M6778b3395
$$ plain form
9093 -227758 134935 -99528 -182262 103723 -41653 9534 137933 -280428 231764 15764 -305911
9081 66434 -175355 -102176 -232936 -388014 -70992 -2951 -159209 -180036 164440 62136 -220783
9069 -63872 -285340 24883 -87737 -253024 -319960 -153309 -41871 -75271 -486409 -160071 -45901
9057 -59853 -87188 -110021 -90009 198422 -24208 -126664 -167773 138960 108773 93865 19309
9045 413689 -108195 -90034 65884 -1455 -49970 -289342 106599 -207202 -149177 -397788 -200717
9034 -200717 -353725 -198539 -27595 59553 -333124 -240774 -165497 -171581 -131910 128065 -28877
9022 62367 -123398 -49470 61663 394748 -99262 33344 -114737 -2287 -247601 -210050 -119296
9011 -119296 -255565 -219979 -15972 -180713 126172 67572 213276 137033 24016 -165853 -84127
$$ packed form
9093b27758A34935i9528q2734A03723d1653I534J28399b80428B31764A5764c05911
9081F6434a75355P3179j30760j55078g0992b951j56258k0827A64440F2136b20783
9069f3872k21468B4883h7737j65287o6936a53309d1871l3400m11138a60071d5901
9057e9853k7335k2833K0012A98422b4208j02456m1109A38960l0187j4908A9309
9045D13689a08195J8161F5884a455m8515k39372A06599b07202N8025k48611J97071
9034b00717j53008J55186b7595E9553c33124R2350P5277o084L9671A28065b8877
9022F2367a23398d9470F1663L33085i9262C3344a14737b287k45314L7551R0754
9011a19296j36269L5586a5972j64741A26172n8600J45704p6243B4016a65853Q1726
$$ plain form
9000 -84127 36560 -99666 66293 -50387 -206244 -319473 -341812 97918 -22569 34753 -114638
8988 -57947 6947 11352 -361094 126351 -32784 344566 9568 86614 -402904 151819 -24499
8976 281576 -4183 -37059 -34912 57549 -29402 10686 165768 -128473 -99061 70860 51600 -246201
8963 113383 -200315 -178182 143106 -151976 -180172 -70633 -126861 -134574 -224283 -37843 164377
8951 -113364 51773 105516 -308425 -61754 -177565 181923 -44453 138505 -253253 26186 -127435
8939 -54049 214684 -50448 -265030 474665 -48206 280996 702841 133853 53996 80000 1966
8927 -177155 202119 335984 385992 168459 1256396 4005643 13567359 12587858 4188593
8917 1390010 612070 332062 510572 236438 117989 -226894 362013 8967 225223 274055
$$ packed form
9000h4127C6560i9666F6293e0387j55857j13229k2339I7918b2569C4753a14638
8988e7947F947M405c61094A26351c2784C44566I568P7046d02904A51819b4499
8976B81576d183l2876K147E7549b9402A0686J55082a28473K9412G0860j9260b46201
8963A13383b00315K2133A43106a51976k8196g0633n6228p713q9709c7843A64377
8951a13364E1773N3743c08425f1754j15811A81923d4453A38505b53253B6186a27435
8939e4049B14684e0448k14582D74665d8206B80996M21845A33853E3996K6004A966
8927a77155B02119J33865N0008A68459J087937K749247R561716r79501D188593
8917A390010F12070k80008J78510B36438A17989b26894C62013H967K16256M8832
$$ plain form
8907 274055 223277 174700 104065 206836 194 -169444 -11735 -191030 -104837 -58629 109798
8895 6602 225059 -219533 -134906 -211869 174055 -13588 -112506 -76237 -237057 -106036 -371093
8884 -371093 -203525 25658 -65426 -230513 103636 -416976 33378 -101367 -148840 93586 -336912
8872 -25532 81831 116601 198967 -23684 220539 266162 -402871 290474 90640 -387302 218434
8860 85822 -63843 -51285 -188512 -108164 -57508 -180587 -137915 148082 -153075 -27448 53879
$$ packed form
8907B74055n0778m8577p0635J02771A94a69444a1735j79295Q6193M6208A09798
8895F602K18457b19533Q4627p6963A74055a3588r8918L6269j60820a06036k65057
8884c71093J67568B5658f5426j65087A03636d16976C3378a01367m7473I3586c36912
8872b5532H1831L4770Q2366b3684B20539M5623d02871B90474I0640c87302B18434
8860H5822f3843J2558j37227Q0348N0656j23079M2672A48082a53075b7448E3879
$$ [...]
##END NTUPLES=NMR SPECTRUM
##END=
