
##TITLE=UV1235_M8_1260-1248_5_7240988_xvrprCfSoq
##JCAMPDX= 6.0         $$ Bruker NMR JCAMP-DX V2.0
##DATA TYPE= NMR SPECTRUM
##DATA CLASS= NTUPLES
##ORIGIN= BRUKER
##OWNER= Administrator
$$ 1.72 TOPSPIN		Version 2.1
$$ 2013-01-18 23:01:24.342 -0500  Administrator@X
$$ Compression mode = diff/dup
##.OBSERVE FREQUENCY= 400.02188249412
##.OBSERVE NUCLEUS= ^1H
##.ACQUISITION MODE= SIMULTANEOUS (DQD)
##.ACQUISITION SCHEME= undefined
##.AVERAGES= 64
##.DIGITISER RES= 22
##SPECTROMETER/DATA SYSTEM= spect
##.PULSE SEQUENCE= noesygpps1d.comp
##.SOLVENT NAME= COFFEE_meoh
##.SHIFT REFERENCE= INTERNAL, COFFEE_meoh, 1, 14.96127
##AUDIT TRAIL= $$ (NUMBER, WHEN, WHO, WHERE, PROCESS, VERSION, WHAT)
$$ ##TITLE= Audit trail, TOPSPIN		Version 2.1
$$ ##JCAMPDX= 5.01
$$ ##ORIGIN= Bruker BioSpin GmbH
$$ ##OWNER= Administrator
$$ $$ E:\/data/COFFEE/nmr/UV1235_M8_1260-1248_5_7240988_xvrprCfSoq/22/pdata/1/auditp.txt
$$ ##AUDIT TRAIL=  $$ (NUMBER, WHEN, WHO, WHERE, PROCESS, VERSION, WHAT)
(   1,<2013-01-18 23:01:18.514 -0500>,<Administrator>,<X>,<go>,<TOPSPIN 2.1>,
      <created by zg
	started at 2013-01-18 22:49:47.561 -0500,
	POWCHK enabled, PULCHK disabled,
       configuration hash MD5:
       86 BA 57 50 F2 9D 5C 9B 26 00 A9 28 5F 66 2E 89
       data hash MD5: 64K
       BD 1A 4F 31 B4 13 20 A0 F8 86 73 B2 EC 1D 5D 62>)
(   2,<2013-01-18 23:01:21.545 -0500>,<Administrator>,<X>,<proc1d>,<TOPSPIN 2.1>,
      <Start of raw data processing
       efp LB = 0.3 FT_mod = 6 PKNL = 1 PHC0 = 0 PHC1 = 0 SI = 128K 
       data hash MD5: 128K
       81 C4 B7 26 35 0F B6 9C 7B DB 6E 7D EC 6A 9E 6E>)
(   3,<2013-01-18 23:01:22.577 -0500>,<Administrator>,<X>,<proc1d>,<TOPSPIN 2.1>,
      <pk PHC0 = -81.50208 PHC1 = 0 
       data hash MD5: 128K
       4B 24 75 B1 35 6C 70 C6 B4 FF 84 1F AF 19 AF E6>)
(   4,<2013-01-18 23:01:23.249 -0500>,<Administrator>,<X>,<proc1d>,<TOPSPIN 2.1>,
      <abs ABSG = 1 
       data hash MD5: 128K
       9D A6 A6 2C DF 3B 9C E7 68 FA 63 AE 04 EB 97 97>)
(   5,<2013-01-18 23:01:23.436 -0500>,<Administrator>,<X>,<proc1d>,<TOPSPIN 2.1>,
      <abs ABSG = 2 
       data hash MD5: 128K
       70 18 6E EF E8 6F 0A 0D 6F D1 11 DE 9C 31 0D FC>)
(   6,<2013-01-18 23:01:23.624 -0500>,<Administrator>,<X>,<proc1d>,<TOPSPIN 2.1>,
      <abs ABSG = 3 
       data hash MD5: 128K
       33 6B 06 31 16 3F FC D3 F9 6C B9 B4 8F 37 0E CE>)
(   7,<2013-01-18 23:01:23.811 -0500>,<Administrator>,<X>,<proc1d>,<TOPSPIN 2.1>,
      <abs ABSG = 4 
       data hash MD5: 128K
       62 E5 1C 92 F9 25 CC 77 C8 1E 1C 25 06 5F F2 18>)
(   8,<2013-01-18 23:01:23.999 -0500>,<Administrator>,<X>,<proc1d>,<TOPSPIN 2.1>,
      <abs ABSG = 5 
       data hash MD5: 128K
       C7 C2 A5 01 0D 0A 5B 2A 13 88 61 80 AB F0 DC EA>)
$$ ##END=
$$ 
$$ $$ hash MD5
$$ $$ 05 E6 4B 22 B4 69 8D 5B 51 72 89 F3 D2 C5 6D 20
##$RELAX= 
##$RELAX= 
##$RELAX= 
##$RELAX= 
##$RELAX= 
##$RELAX= 
##$RELAX= 
##$RELAX= 
$$ Bruker specific parameters
$$ --------------------------
##$DU= <E:\>
##$EXPNO= 22
$$ [...]
##$TP07= 0
##$TPNAME0= <>
##$TPNAME1= <>
##$TPNAME2= <>
##$TPNAME3= <>
##$TPNAME4= <>
##$TPNAME5= <>
##$TPNAME6= <>
##$TPNAME7= <>
##$TPOAL= (0..7)
0.5 0.5 0.5 0.5 0.5 0.5 0.5 0.5
##$TPOFFS= (0..7)
0 0 0 0 0 0 0 0
##$TUNHIN= 0
##$TUNHOUT= 0
##$TUNXOUT= 0
##$USERA1= <user>
##$USERA2= <user>
##$USERA3= <user>
##$USERA4= <user>
##$USERA5= <user>
##$V9= 5
##$VALIST= <valist>
##$VCLIST= <CCCCCCCCCCCCCCC>
##$VD= 0
##$VDLIST= <DDDDDDDDDDDDDDD>
##$VPLIST= <PPPPPPPPPPPPPPP>
##$VTLIST= <TTTTTTTTTTTTTTT>
##$WBST= 1024
##$WBSW= 4
##$XGAIN= (0..3)
0 0 0 0
##$XL= 0
##$YL= 0
##$YMAX_a= 6146146
##$YMIN_a= -13940333
##$ZGOPTNS= <>
##$ZL1= 120
##$ZL2= 120
##$ZL3= 120
##$ZL4= 120
##$ABSF1= 14.96127
##$ABSF2= -5.596911
##$ABSG= 5
##$ABSL= 3
##$ALPHA= 0
##$AQORDER= 0
##$ASSFAC= 0
##$ASSFACI= 0
##$ASSFACX= 0
##$ASSWID= 0
##$AUNMP= <proc_prof1d_extract.lims>
##$AXLEFT= 0
##$AXNAME= <>
##$AXNUC= <1H>
##$AXRIGHT= 0
##$AXTYPE= 0
##$AXUNIT= <>
##$AZFE= 0.1
##$AZFW= 0.1
##$BCFW= 0
##$BC_mod= 0
##$BYTORDP= 0
##$COROFFS= 0
##$CY= 15
##$DATMOD= 1
##$DC= 0
##$DFILT= <>
##$DTYPP= 0
##$F1P= 0
##$F2P= 0
##$FCOR= 0.5
##$FTSIZE= 131072
##$FT_mod= 6
##$GAMMA= 0
##$GB= 0
##$INTBC= 1
##$INTSCL= 1
##$ISEN= 128
##$LB= 0.3
##$LEV0= 0
##$LPBIN= 0
##$MAXI= 10000
##$MC2= 0
##$MEAN= 0
##$ME_mod= 0
##$MI= 0
##$NCOEF= 0
##$NC_proc= -2
##$NLEV= 6
##$NOISF1= 0
##$NOISF2= 0
##$NSP= 0
##$NTH_PI= 0
##$NZP= 0
##$OFFSET= 14.96127
##$PC= 1
##$PHC0= -81.50208
##$PHC1= 0
##$PH_mod= 1
##$PKNL= yes
##$PPARMOD= 0
##$PPDIAG= 0
##$PPIPTYP= 0
##$PPMPNUM= 2147483647
##$PPRESOL= 1
##$PSCAL= 4
##$PSIGN= 0
##$PYNMP= <proc.py>
##$REVERSE= no
##$SF= 400.020009528897
##$SI= 131072
##$SIGF1= 0
##$SIGF2= 0
##$SINO= 400
##$SIOLD= 131072
##$SPECTYP= <>
##$SREGLST= <1H.CDCl3>
##$SSB= 0
##$STSI= 131072
##$STSR= 0
##$SW_p= 8223.68421052631
##$SYMM= 0
##$S_DEV= 0
##$TDeff= 65536
##$TDoff= 0
##$TI= <>
##$TILT= no
##$TM1= 0
##$TM2= 0
##$TOPLEV= 0
##$USERP1= <user>
##$USERP2= <user>
##$USERP3= <user>
##$USERP4= <user>
##$USERP5= <user>
##$WDW= 1
##$XDIM= 131072
##$YMAX_p= 458088599
##$YMIN_p= -10801
##$CURPLOT= <Network HP LaserJet P1505>
##$CURPRIN= <$Network HP LaserJet P1505>
##$DFORMAT= <normdp>
##$LAYOUT= <+/1D_H.xwp>
##$LFORMAT= <normlp>
##$PFORMAT= <normpl>
##$SURQMSG= 1
$$ End of Bruker specific parameters
$$ ---------------------------------
##NTUPLES= NMR SPECTRUM
##VAR_NAME=  FREQUENCY,     SPECTRUM/REAL,   SPECTRUM/IMAG
##SYMBOL=    X,             R,               I
##VAR_TYPE=  INDEPENDENT,   DEPENDENT,       DEPENDENT
##VAR_FORM=  AFFN,          ASDF,            ASDF
##VAR_DIM=   131072,        131072,          131072
##UNITS=     HZ,            ARBITRARY UNITS, ARBITRARY UNITS
##FACTOR=    0.0627417313425164, 1,          1
##FIRST=     8223.62146879497, -404,         -67939
##LAST=      0,             1964,            -68925
##MIN=       0,             -10801,          0
##MAX=       8223.62146879497, 458088599,    0
$$ Real data points
##PAGE= N=1
##DATA TABLE= (X++(R..R)), XYDATA
$$ [...]
$$ plain form
63858 1080679 1112768 1143150 1171630 1198479 1223245 1244465 1261012 1273046 1280988 1284269 1281980 1274340
63846 1274340 1262506 1247076 1227678 1203949 1176072 1144367 1109200 1071402 1032079 991940 951391
63835 951391 911188 872123 834078 796252 758591 722269 688571 657944 630277 605275 582314
63824 582314 560613 539944 520621 502632 485503 469245 454662 442250 431446 421397 411922 403279
63812 403279 395566 388854 383434 379354 376056 372962 370129 367823 365720 363057 359511 355588 352024 348952
63798 348952 345712 341554 336618 331983 328452 325565 322340 318698 315415 312760 310153 307344 304994 303642
63784 303642 302794 301574 299711 297448 295006 292604 290542 288815 287015 285027 283413 282743 282902 283413 284003
63769 284003 284481 284488 283857 282918 282096 281435 280769 280025 279108 277890 276549 275507 274811 273988 272741 271339 270100
$$ packed form
63858A080679L2089L0382K8480K6849K4766K1220J6547J2034P942L281k289p640
63846A274340j1834j5430j9398k3729k7877l1705l5167l7798l9323m0139m0549
63835I51391m0203l9065l8045l7826l7661l6322l3698l0627k7667k5002k2961
63824E82314k1701k0669j9323j7989j7129j6258j4583j2412j0804j0049r475q643
63812D03279p713o712n420m080l298l094k833k306k103k663l546l923l564l072
63798C48952l240m158m936m635l531k887l225l642l283k655k607k809k350j352
63784C03642q48j220j863k263k442k402k062j727j800j988j614o70J59N11N90
63769B84003M78Po31r39q22o61o66p44r17j218j341j042o96q23j247j402j239
$$ plain form
63752 270100 269058 268337 268320 269110 270404 272116 274466 277186 279463 281064 282754 285051 287442 289497 291867
63737 291867 295229 298942 301794 303650 305415 307710 310518 313741 317143 320019 321909 323528 326002 329285
63723 329285 332323 334761 337462 341138 345409 349592 353621 357702 361544 364448 365953 366168 365584 364667 363533
63708 363533 362071 360388 358835 357430 355685 353399 351212 349835 349154 348710 348706 349739 351707 353821 355698
63693 355698 357720 360284 363331 366674 370152 373350 375771 377365 378392 378753 378083 376560 374951 373657 372328
63678 372328 370701 369274 368792 369368 370439 371329 371727 371814 372053 372697 373535 374320 375232 376525 377876 378602 378489
63661 378489 377903 377053 375705 373719 371339 368744 365784 362426 359125 356454 354501 352762 350493 347238 343244
63646 343244 339384 336443 334578 333584 333392 333901 334686 335465 336732 339246 342928 346864 350440 353861 357504
$$ packed form
63752B70100j042p21j7P90J294J712K350K720K277J601J690K297K391K055K370
63737B91867L362L713K852J856J765K295K808L223L402K876J890J619K474L283
63723C29285L038K438K701L676M271M183M029M081L842K904J505K15n84r17j134
63708C63533j462j683j553j405j745k286k187j377o81m44mJ033J968K114J877
63693C55698K022K564L047L343L478L198K421J594J027L61o70j523j609j294j329
63678C72328j627j427m82N76J071Q90L98Q7K39O44Q38P85R12J293J351P26j13
63661C78489n86q50j348j986k380k595k960l358l301k671j953j739k269l255l994
63646C43244l860k941j865r94j92N09P85P79J267K514L682L936L576L421L643
$$ plain form
63631 357504 361410 365616 370354 375673 381315 387186 393556 400650 408500 417289 427321 438555 450689
63618 450689 463907 478913 495938 514327 533489 553752 575863 600090 626239 654135 683561
63607 683561 713972 744659 774925 803664 829125 849602 864304 873188 876285 873723 866379 855926
63595 855926 844109 832171 820860 810491 800871 791372 781223 769547 755265 737437 716052 692373
63583 692373 668267 645130 623436 603160 584432 567734 553622 542357 533785 527449 522810 519476
63571 519476 517321 516419 516911 518966 522687 527863 533823 539795 545529 551330 557488 563960 570722 578088 586450
63556 586450 595987 606906 619705 634885 652635 673126 696871 724388 755724 790776 829897 873410
63544 873410 920012 965730 1004685 1031357 1042940 1040417 1027596 1008878 987601 965970 945694 928022
$$ packed form
63631C57504L906M206M738N319N642N871O370P094P850Q789J0032J1234J2134
63618D50689J3218J5006J7025J8389J9162K0263K2111K4227K6149K7896K9426
63607F83561L0411L0687L0266K8739K5461K0477J4702Q884L097k562p344j0453
63595H55926j1817j1938j1311j0369r620r499j0149j1676j4282j7828k1385k3679
63583F92373k4106k3137k1694k0276j8728j6698j4112j1265q572o336m639l334
63571E19476k155r02M92K055L721N176N960N972N734N801O158O472O762P366Q362
63556E86450R537J0919J2799J5180J7750K0491K3745K7517L1336L5052L9121M3513
63544H73410M6602M5718L8955K6672J1583k523j2821j8718k1277k1631k0276j7672
$$ plain form
63532 928022 913375 901402 891390 882365 873089 862383 849401 833371 813494 789574 762486 733527
63520 733527 703543 673157 643478 615841 590816 568083 547173 527868 510078 493953 480030
63509 480030 468608 459059 450339 442045 434374 427236 420302 413796 408372 404090 400414 397304 395380 394730
63495 394730 394448 393733 392733 391921 391321 390759 390292 390029 389996 390396 391459 392935 394429 396268 399081 402416 404904
63478 404904 406270 408027 411436 415791 419616 422608 425288 427490 428471 428132 426965 424941 421578 417115 412667
63463 412667 409010 405910 402747 399285 395791 392889 391221 390801 390830 390676 390817 392243 395137 398901 403422
63448 403422 409424 417367 426639 436169 445436 454667 464447 475355 487741 501660 517198 534890 555730
63435 555730 580873 611357 647486 687646 727772 762811 789306 806636 816116 819591 818951 816246
$$ packed form
63532I28022j4647j1973j0012r025r276j0706j2982j6030j9877k3920k7088k8959
63520G33527k9984l0386k9679k7637k5025k2733k0910j9305j7790j6125j3923
63509D80030j1422r549q720q294p671p138o934o506n424m282l676l110j924o50
63495C94730k82p15j000q12o00n62m67k63l3M00J063J476J494J839K813L335K488
63478D04904J366J757L409M355L825K992K680K202R81l39j167k024l363m463m448
63463D12667l657l100l163l462l494k902j668m20K9j54J41J426K894L764M521
63448D03422O002P943R272R530R267R231R780J0908J2386J3919J5538J7692K0840
63435E55730K5143L0484L6129M0160M0126L5039K6495J7330R480L475o40k705
$$ plain form
63423 816246 813563 812818 815734 823713 837449 856770 881041 909607 941739 976199 1010867 1042741
63411 1042741 1068513 1085649 1093314 1092467 1085167 1073782 1060433 1046641 1033211 1020462 1008481 996979
63399 996979 985063 971453 955052 935210 911569 884016 852962 819528 785322 751899 720321
63388 720321 691071 664368 640512 619739 601765 585825 571459 559063 549363 542468 537726 534427
63376 534427 532344 531630 532535 535283 539943 546308 554070 563166 573871 586481 600996 617129 634561
63363 634561 653225 673419 695637 720219 747140 776127 806924 839505 874054 910457 947435
63352 947435 982261 1011846 1034348 1049554 1057806 1059255 1054403 1044815 1032641 1019607 1006731 994602
63340 994602 983330 972291 960358 946426 929606 909251 885259 858275 829308 799291 769201
$$ packed form
63423H16246k683p45K916P979J3736J9321K4271K8566L2132L4460L4668L1874
63411A042741K5772J7136P665q47p300j1385j3349j3792j3430j2749j1981j1502
63399I96979j1916j3610j6401j9842k3641k7553l1054l3434l4206l3423l1578
63388G20321k9250k6703k3856k0773j7974j5940j4366j2396r700o895m742l299
63376E34427k083p14R05K748M660O365P762R096J0705J2610J4515J6133J7432
63363F34561J8664K0194K2218K4582K6921K8987L0797L2581L4549L6403L6978
63352I47435L4826K9585K2502J5206Q252J449m852r588j2174j3034j2876j2129
63340I94602j1272j1039j1933j3932j6820k0355k3992k6984k8967l0017l0090
$$ plain form
63329 769201 740234 713341 688836 666879 648123 633371 622845 616456 614631 618037 626036 635726
63317 635726 642774 643237 635093 618857 597055 572745 548206 524853 503803 485826 470829 458114
63305 458114 447318 438630 432001 426718 422037 417779 414087 410982 408369 406123 403981 401737 399706 398540
63291 398540 398315 398236 397540 396347 395233 394300 393122 391410 389304 387058 384769 382406 380010 377876 376573
63276 376573 376499 377267 377875 377763 377429 377680 378532 379309 379684 380129 381223 382901 384558 385693 386369 387166 388822
63259 388822 391748 395744 400123 404152 407486 410353 413398 417190 421762 426664 431501 436293 441236 446392
63245 446392 451820 457833 464814 472836 481743 491582 502662 515105 528618 542946 558444 575953 596037
63232 596037 618396 642093 666380 691230 717032 743847 771187 798486 825549 852380 878827
$$ packed form
63329G69201k8967k6893k4505k1957j8756j4752j0526o389j825L406P999R690
63317F35726P048M63q144j6236k1802k4310k4539k3353k1050j7977j4997j2715
63305D58114j0796q688o629n283m681m258l692l105k613k246k142k244k031j166
63291C98540k25p9o96j193j114r33j178j712k106k246k289k363k396k134j303
63276C76573p4P68O08j12l34K51Q52P77L75M45J094J678J657J135O76P97J656
63259C88822K926L996M379M029L334K867L045L792M572M902M837M792M943N156
63245D46392N428O013O981Q022Q907R839J1080J2443J3513J4328J5498J7509K0084
63232E96037K2359K3697K4287K4850K5802K6815K7340K7299K7063K6831K6447
$$ plain form
63221 878827 904609 929512 953273 975489 996114 1016054 1036785 1059186 1082985 1107385 1131684
63210 1131684 1154991 1175778 1192348 1203665 1209365 1209072 1202183 1188411 1168192 1142447 1112210 1078487
63198 1078487 1042261 1004594 966903 930971 898209 868869 842416 818729 798456 782053 769183
63187 769183 759454 753262 751316 753669 759761 769104 781300 795492 810563 825999 842078 859067 876678
63174 876678 894447 912225 930007 947584 964685 981347 997958 1014844 1031789 1047877 1061932
63163 1061932 1073196 1081449 1086434 1087469 1083899 1075594 1062683 1045169 1023299 998018 970392 940761
63151 940761 909191 876677 845089 815711 788487 762932 739167 717802 699277 683565 670061
63140 670061 657642 645392 633551 623249 615160 608924 603995 600263 597548 595279 593242 592035 592229
$$ packed form
63221H78827K5782K4903K3761K2216K0625J9940K0731K2401K3799K4400K4299
63210A131684K3307K0787J6570J1317N700k93o889j3772k0219k5745l0237l3723
63198A078487l6226l7667l7691l5932l2762k9340k6453k3687k0273j6403j2870
63187G69183r729o192j946K353O092R343J2196J4192J5071J5436J6079J6989J7611
63174H76678J7769J7778J7782J7577J7101J6662J6611J6886J6945J6088J4055
63163A061932J1264Q253M985J035l570q305j2911j7514k1870k5281k7626k9631
63151I40761l1570l2514l1588k9378k7224k5555k3765k1365j8525j5712j3504
63140F70061j2419j2250j1841j0302q089o236m929l732k715k269k037j207J94
$$ plain form
63127 592229 593543 595369 597649 600690 604583 609275 614776 620779 626607 632087 637894 644385 650652 655556
63113 655556 659227 662669 666225 669454 672251 675044 677818 679880 680761 680708 680212 679665 679429 679533 679317 678067
63097 678067 676002 673950 672117 670079 667933 666415 665578 664425 662426 660550 660076 661008 662330 663382 664341
63082 664341 665664 667676 670532 674077 677938 682074 686921 692541 697997 702200 705268 708501 713119 719567
63068 719567 727937 738324 750467 763594 777043 790810 805266 820646 837174 855444 876115 899239
63056 899239 924388 951649 982090 1016909 1056405 1100168 1147998 1200048 1256011 1314766 1375116
63045 1375116 1436562 1499064 1562357 1625798 1688760 1750853 1811764 1871004 1927859 1981782 2033139
63034 2033139 2083482 2134526 2186597 2238373 2288260 2335504 2379732 2419919 2454285 2480795 2497354
$$ packed form
63127E92229J314J826K280L041L893M692N501O003N828N480N807O491O267M904
63113F55556L671L442L556L229K797K793K774K062Q81n3m96n47k36J04k16j250
63097F78067k065k052j833k038k146j518q37j153j999j876m74R32J322J052R59
63082F64341J323K012K856L545L861M136M847N620N456M203L068L233M618O448
63068G19567Q370J0387J2143J3127J3449J3767J4456J5380J6528J8270K0671K3124
63056H99239K5149K7261L0441L4819L9496M3763M7830N2050N5963N8755O0350
63045A375116O1446O2502O3293O3441O2962O2093O0911N9240N6855N3923N1357
63034B033139N0343N1044N2071N1776M9887M7244M4228M0187L4366K6510J6559
$$ plain form
63023 2497354 2501937 2493204 2470918 2435496 2387489 2327929 2258796 2182588 2101651 2018364 1935452 1855322
63011 1855322 1779244 1707811 1642038 1583299 1532362 1489211 1453766 1426047 1405648 1391805 1384123
63000 1384123 1382601 1386920 1396400 1410722 1429970 1453672 1480404 1508654 1537670 1567416 1598148 1630066
62988 1630066 1662816 1695290 1726446 1756313 1785523 1813854 1840010 1862857 1881875 1896109 1903731
62977 1903731 1903296 1894738 1878515 1854507 1822458 1782985 1737383 1686785 1632194 1574990 1516682 1458239
62965 1458239 1400269 1343745 1289985 1239822 1193203 1149631 1108823 1070923 1036231 1004597 975073
62954 975073 946507 918652 892355 868391 846450 825623 805475 786218 768115 751214 735521
62943 735521 720920 706966 693224 679956 668137 658590 651168 644859 638682 632537 627140 623073 620033
$$ packed form
63023B497354M583q733k2286l5422m8007n9560o9133p6208q0937q3287q2912q0130
63011A855322p6078p1433o5773n8739n0937m3151l5445k7719k0399j3843p682
63000A384123j522M319R480J4322J9248K3702K6732K8250K9016K9746L0732L1918
62988A630066L2750L2474L1156K9867K9210K8331K6156K2847J9018J4234P622
62977A903731m35q558j6223k4008l2049l9473m5602n0598n4591n7204n8308n8443
62965A458239n7970n6524n3760n0163m6619m3572m0808l7900l4692l1634k9524
62954I75073k8566k7855k6297k3964k1941k0827k0148j9257j8103j6901j5693
62943G35521j4601j3954j3742j3268j1819r547p422o309o177o145n397m067l040
$$ plain form
62930 620033 617230 614417 612041 610314 608630 606210 603050 599950 597751 596672 596128 595048 592628 588984
62916 588984 584925 581091 577626 574613 572255 570367 568261 565527 562584 560108 558275 556903 555933 555331 554783
62901 554783 553996 553144 552622 552541 552817 553531 554744 556084 556932 557020 556500 555538 554143 552381 550443 548564 547061
62884 547061 546382 546803 548112 549768 551343 552620 553419 553607 553238 552444 551201 549383 547089 544735 542782 541373
62868 541373 540215 538826 536989 534951 533083 531442 529926 528753 528374 528917 530070 531596 533516 535599 537187
62853 537187 537882 538115 538676 539846 541218 542168 542339 541905 541575 542056 543278 544344 544441 543595 542427 541480 540959
62836 540959 540770 540518 539781 538621 537579 536945 536357 535386 534153 533056 532199 531514 531207 531728 533392 536201 539835
62819 539835 543663 547142 550465 554451 559514 565048 570136 574449 578202 581691 585328 589675 594805 599908
$$ packed form
62930F20033k803k813k376j727j684k420l160l100k199j079n44j080k420l644
62916E88984m059l834l465l013k358j888k106k734k943k476j833j372r70o02n48
62901E54783p87q52n22q1K76P14J213J340Q48Q8n20r62j395j762j938j879j503
62884E47061o79M21J309J656J575J277P99J88l69p94j243j818k294k354j953j409
62868E41373j158j389j837k038j868j641j516j173l79N43J153J526J920K083J588
62853E37187O95K33N61J170J372R50J71m34l30M81J222J066R7q46j168r47n21
62836E40959j89k52p37j160j042o34n88r71j233j097q57o85l07N21J664K809L634
62819E39835L828L479L323L986N063N534N088M313L753L489L637M347N130N103
$$ plain form
62805 599908 604141 607727 611771 617107 623796 631548 640096 649156 658487 668095 678148 688868 700671
62792 700671 714142 729536 746568 765113 785876 809954 837935 869828 905635 945463 989281
62781 989281 1037153 1089719 1147942 1212289 1282514 1358205 1439247 1525686 1617295 1713147 1811506
62770 1811506 1910348 2008080 2103254 2193380 2274733 2343968 2399488 2440605 2465966 2473787 2463415
62759 2463415 2435716 2392015 2333576 2262196 2180419 2090879 1995984 1898263 1800164 1703241 1608166
62748 1608166 1515846 1427889 1345706 1269711 1199718 1135617 1077340 1024650 977313 935126 897486
62737 897486 863341 831931 803221 777386 754282 733762 716068 701389 689271 678881 669734 661748
62725 661748 654772 648515 642956 638443 635225 633127 631811 631234 631744 633750 637350 642286 648267 655315 663734
$$ packed form
62805E99908M233L586M044N336O689P752Q548R060R331R608J0053J0720J1803
62792G00671J3471J5394J7032J8545K0763K4078K7981L1893L5807L9828M3818
62781I89281M7872N2566N8223O4347P0225P5691Q1042Q6439R1609R5852R8359
62770A811506R8842R7732R5174R0126Q1353O9235N5520M1117K5361P821j0372
62759B463415k7699m3701n8439p1380q1777q9540r4895r7721r8099r6923r5075
62748A608166r2320q7957q2183p5995o9993o4101n8277n2690m7337m2187l7640
62737H97486l4145l1410k8710k5835k3104k0520j7694j4679j2118j0390r147p986
62725F61748o976o257n559m513l218k098j316n77N10K006L600M936N981P048Q419
$$ plain form
62710 663734 673743 685210 697857 711725 727369 745560 766808 791277 819105 850515 885414
62699 885414 923156 963112 1005492 1051275 1101352 1156070 1215493 1279529 1347567 1418395 1490564
62688 1490564 1562398 1631560 1695306 1751557 1799183 1836942 1862811 1875021 1873241 1858236 1830877
62677 1830877 1792133 1743520 1686689 1622925 1553806 1481984 1410258 1340032 1271540 1205403 1142887
62666 1142887 1084608 1030120 979103 932060 889478 851161 816847 786724 760753 738038 717407
62655 717407 698252 680464 663942 648586 634412 621290 608913 597309 587020 578390 570947 563876
62643 563876 556921 550515 545229 541334 538717 536902 535276 533497 531657 530008 528657 527497 526172 524132
62629 524132 521066 517305 513495 509812 505990 502144 499052 497333 496849 497246 498612 501088 504140 506871 509063
$$ packed form
62710F63734J0009J1467J2647J3868J5644J8191K1248K4469K7828L1410L4899
62699H85414L7742L9956M2380M5783N0077N4718N9423O4036O8038P0828P2169
62688A490564P1834O9162O3746N6251M7626L7759K5869J2210j780j5005k7359
62677A830877l8744m8613n6831o3764o9119p1822p1726p0226o8492o6137o2516
62666A142887n8279n4488n1017m7043m2582l8317l4314l0123k5971k2715k0631
62655G17407j9155j7788j6522j5356j4174j3122j2377j1604j0289q630p443p071
62643E63876o955o406n286l895k617j815j626j779j840j649j351j160j325k040
62629E24132l066l761l810l683l822l846l092j719m84L97J366K476L052K731K192
$$ plain form
62614 509063 511450 514754 518738 522451 525360 528021 531491 536178 541560 547174 553516 561568 571570 582756
62600 582756 594480 607240 622423 641138 663385 688274 715099 744308 777263 814870 856650
62589 856650 901373 948253 996981 1046810 1096271 1143828 1188193 1227899 1261150 1286434 1302959
62578 1302959 1310403 1308636 1297898 1278888 1252442 1219422 1181002 1138699 1093936 1047835 1001506 956123
62566 956123 912542 871150 832283 796461 764042 734909 708709 685227 664374 646014 629893
62555 629893 615613 602732 591064 580806 572077 564474 557453 550988 545387 540536 535945 531553 527924
62542 527924 525442 523849 522692 521763 520887 519780 518371 516910 515554 514243 513094 512543 512896 514107 516102
62527 516102 518909 522387 526342 531070 537343 545614 555672 567185 580136 594560 610387 627840 647544
$$ packed form
62614E09063K387L304L984L713K909K661L470M687N382N614O342Q052J0002J1186
62600E82756J1724J2760J5183J8715K2247K4889K6825K9209L2955L7607M1780
62589H56650M4723M6880M8728M9829M9461M7557M4365L9706L3251K5284J6525
62578A302959P444j767j0738j9010k6446l3020l8420m2303m4763m6101m6329m5383
62566I56123m3581m1392l8867l5822l2419k9133k6200k3482k0853j8360j6121
62555F29893j4280j2881j1668j0258q729p603p021o465n601m851m591m392l629
62542E27924k482j593j157r29q76j107j409j461j356j311j149n51L53J211J995
62527E16102K807L478L955M728O273Q271J0058J1513J2951J4424J5827J7453J9704
$$ plain form
62514 647544 670014 695360 723605 754826 788859 825451 864813 907349 952532 998672 1044107
62503 1044107 1087954 1129296 1166357 1197257 1221207 1238484 1249592 1255021 1255565 1252374 1246794 1240342
62491 1240342 1234408 1229653 1226148 1224493 1226257 1232789 1244055 1259265 1278375 1302246 1331257 1363980
62479 1363980 1396988 1425787 1446586 1458073 1461594 1459267 1451789 1437895 1415402 1382623 1339510 1288195
62467 1288195 1232139 1174265 1115905 1057580 1000080 944335 890968 840770 795210 755661 722245
62456 722245 694052 670190 650019 632771 617906 605740 596843 590767 586088 581805 578034 575258 573623
62443 573623 573176 574139 576599 580339 585210 591231 598197 605590 613066 620552 627583 633006 635761 635748 633595
62428 633595 629808 624489 617718 609747 600739 590696 579824 568766 558175 548209 538744 530069 522890
$$ packed form
62514F47544K2470K5346K8245L1221L4033L6592L9362M2536M5183M6140M5435
62503A044107M3847M1342L7061L0900K3950J7277J1108N429N44l191n580o452
62491A240342n934m755l505j655J764O532J1266J5210J9110K3871K9011L2723
62479A363980L3008K8799K0799J1487L521k327p478j3894k2493l2779m3113n1315
62467A288195n6056n7874n8360n8325n7500n5745n3367n0198m5560l9549l3416
62456G22245k8193k3862k0171j7248j4865j2166q897o076m679m283l771k776j635
62443E73623m47R63K460L740M871O021O966P393P476P486P031N423K755j3k153
62428F33595l787n319o771p971r008j0043j0872j1058j0591r966r465q675p179
$$ plain form
62415 522890 517451 513078 509019 505399 502772 500926 498864 495993 492715 489656 486972 484671 483024 482253
62401 482253 482206 482684 483761 485530 487915 490909 494564 498582 502467 506329 510826 515951 520659 524320 527860
62386 527860 532659 538806 545288 551521 557788 564302 570743 576907 583247 590533 599233 609109 619164 628266
62372 628266 636178 643777 651944 660697 669830 679841 691461 704650 718946 734657 752932 774696
62360 774696 800210 829638 863266 901073 942760 988331 1038060 1091632 1147699 1204248 1258980
62349 1258980 1309409 1353269 1389158 1416653 1435913 1447525 1452437 1451490 1444995 1433134 1416581 1396159
62337 1396159 1372104 1344289 1313045 1279209 1243524 1206761 1170284 1135612 1103277 1072858 1044191
62326 1044191 1017736 993582 970990 949324 928647 908878 889089 868273 846434 824298 802287
$$ packed form
62415E22890n439m373m059l620k627j846k062k871l278l059k684k301j647p71
62401D82253m7M78J077J769K385K994L655M018L885L862M497N125M708L661L540
62386E27860M799O147O482O233O267O514O441O164O340P286Q700R876J0055R102
62372F28266P912P599Q167Q753R133J0011J1620J3189J4296J5711J8275K1764
62360G74696K5514K9428L3628L7807M1687M5571M9729N3572N6067N6549N4732
62349A258980N0429M3860L5889K7495J9260J1612M912r47o495j1861j6553k0422
62337A396159k4055k7815l1244l3836l5685l6763l6477l4672l2335l0419k8667
62326A044191k6455k4154k2592k1666k0677j9769j9789k0816k1839k2136k2011
$$ plain form
62315 802287 780360 758734 738192 719638 703612 690183 679094 669950 662476 656603 652356 649719
62303 649719 648686 649333 651829 656342 662799 670709 679462 689017 699977 712735 726681 740604 753633
62290 753633 765479 776008 785111 792860 799313 804159 806971 807715 806660 803909 799467 793617 786772 779131
62276 779131 771015 763401 757314 752618 748047 742717 737279 733460 732774 735651 741393 748936 758002 769525
62262 769525 784723 803984 827037 853882 884881 920227 960050 1004897 1055206 1110261 1168391
62251 1168391 1228126 1288219 1346431 1399374 1444052 1479031 1503988 1519099 1525272 1524087 1516691 1503068
62239 1503068 1482716 1455517 1421668 1381460 1335735 1286102 1234279 1181567 1129258 1078940 1031882
62228 1031882 988535 948998 913487 881917 853674 828397 806586 788742 774233 761609 749880
$$ packed form
62315H02287k1927k1626k0542j8554j6026j3429j1089r144p474n873m247k637
62303F49719j033O47K496M513O457P910Q753R555J0960J2758J3946J3923J3029
62290G53633J1846J0529R103P749O453M846K812P44j055k751m442n850o845p641
62276G79131q116p614o087m696m571n330n438l819o86K877N742P543R066J1523
62262G69525J5198J9261K3053K6845L0999L5346L9823M4847N0309N5055N8130
62251A168391N9735O0093N8212N2943M4678L4979K4957J5111O173j185p396j3623
62239A503068k0352k7199l3849m0208m5725m9633n1823n2712n2309n0318m7058
62228A031882m3347l9537l5511l1570k8243k5277k1811j7844j4509j2624j1729
$$ plain form
62217 749880 738930 728928 719897 711853 704868 698888 693711 689063 684658 680395 676654 674044 672584 671512
62203 671512 670228 669105 669052 670572 673585 677812 682801 687832 692323 696417 700825 706145 712473 719542 726980
62188 726980 734557 742391 750869 760305 770736 781986 793576 804586 814103 821967 828663 834382 838789
62175 838789 841937 844756 848226 852599 857961 865057 875000 888515 906007 927943 954553 985455 1020206
62162 1020206 1058886 1101423 1146473 1191619 1234510 1273149 1305400 1329349 1344540 1352222 1354023 1350798
62150 1350798 1342865 1330626 1314477 1294423 1270331 1242449 1211462 1178184 1143497 1108492 1074416
62139 1074416 1042375 1013098 986901 963826 943829 926876 912795 901072 890930 881680 873006 864881
62127 864881 857261 849919 842621 835439 828764 822991 818350 815203 814231 815939 820029 825680 832460 840621
$$ packed form
62217G49880j0950j0002r031q044o985n980n177m648m405m263l741k610j460j072
62203F71512j284j123n3J520L013M227M989N031M491M094M408N320O328P069P438
62188G26980P577P834Q478R436J0431J1250J1590J1010R517P864O696N719M407
62175H38789L148K819L470M373N362P096R943J3515J7492K1936K6610L0902L4751
62162A020206L8680M2537M5050M5146M2891L8639L2251K3949J5191P682J801l225
62150A350798p933j2239j6149k0054k4092k7882l0987l3278l4687l5005l4076
62139A074416l2041k9277k6197k3075j9997j6953j4081j1723j0142r250q674q125
62127H64881p620p342p298p182o675n773m641l147r72J708M090N651O780Q161
$$ plain form
62113 840621 850342 861102 871930 881887 890053 895423 897256 895446 890481 883275 875208 867881 862370 858696
62099 858696 856082 853439 849583 843642 835845 827710 820968 816427 814055 813715 815234 818028 821395 825208
62085 825208 829741 834798 839617 843881 848335 854086 861582 870575 880827 892493 905918 921315 938676
62072 938676 957740 977983 998778 1019714 1040744 1061994 1083472 1105135 1127205 1150221 1174545
62061 1174545 1199905 1225524 1250547 1274012 1294525 1310389 1320328 1323998 1321825 1314572 1303176 1288699
62049 1288699 1272098 1253853 1233651 1210402 1182904 1150908 1115575 1078631 1041208 1003801 967028
62038 967028 931640 897727 864619 831983 800519 771256 744606 720505 699076 680680 665466
62027 665466 653224 643495 635554 628564 622110 616465 612049 608746 605929 602962 599460 595273 590456 585233
$$ packed form
62113H40621R721J0760J0828R957Q166N370J833j810m965p206q067p327n511l674
62099H58696k614k643l856n941p797q135o742m541k372l40J519K794L367L813
62085H25208M533N057M819M264M454N751P496Q993J0252J1666J3425J5397J7361
62072I38676J9064K0243K0795K0936K1030K1250K1478K1663K2070K3016K4324
62061A174545K5360K5619K5023K3465K0513J5864R939L670k173p253j1396j4477
62049A288699j6601j8245k0202k3249k7498l1996l5333l6944l7423l7407l6773
62038I67028l5388l3913l3108l2636l1464k9263k6650k4101k1429j8396j5214
62027F65466j2242r729p941o990o454n645m416l303k817k967l502m187m817n223
$$ plain form
62013 585233 579898 574866 570687 567601 565109 562501 559951 558533 558872 560374 562184 564348 567516 571893
61999 571893 577002 582186 586841 590451 592936 594782 596396 597522 597635 596585 594426 590934 585868 579468
61985 579468 572192 564197 555612 547028 539020 531314 523092 514159 505233 497110 490096 484275 479736 476395
61971 476395 473996 472367 471290 470172 468375 465962 463620 461761 460158 458613 457464 457150 457592 458323 459039
61956 459039 459823 460965 462629 464630 466555 468302 470438 473735 478353 483793 489693 496406 504688 515039
61942 515039 527453 541668 557514 575092 594570 615714 637685 659433 680315 700282 719628
61931 719628 738609 757186 774973 791516 806615 820170 831704 840475 846134 848884 848889 846145 841210
61918 841210 835300 829048 821819 813076 803994 796787 792655 791314 792417 796340 803430 813406 825809 840280
$$ packed form
62013E85233n335n032m179l086k492k608k550j418L39J502J810K164L168M377
61999E71893N109N184M655L610K485J846J614J126J13j050k159l492n066o400
61985E79468p276p995q585q584q008p706q222q933q926q123p014n821m539l341
61971D76395k399j629j077j118j797k413k342j859j603j545j149l14M42P31P16
61956D59039P84J142J664K001J925J747K136L297M618N440N900O713Q282J0351
61942E15039J2414J4215J5846J7578J9478K1144K1971K1748K0882J9967J9346
61931G19628J8981J8577J7787J6543J5099J3555J1534Q771N659K750Nk744m935
61918H41210n910o252p229q743r082p207m132j341J103L923P090R976J2403J4471
$$ plain form
61904 840280 855995 871537 885716 897992 907743 913794 915221 912242 905848 896847 885666 872728 858537
61891 858537 843488 827880 811993 795976 779957 764444 750337 738211 727809 718393 709284 699875
61879 699875 689604 678436 667083 656266 645959 635891 626560 619105 614089 611032 609303 608895 609978
61866 609978 612144 614685 617373 620533 624443 629223 635337 643581 654230 666574 679753 693881 709980
61853 709980 728914 750797 775342 802257 831119 861279 892168 923518 955093 986359 1016478
61842 1016478 1044442 1069188 1089849 1105935 1117046 1122542 1122070 1116483 1107553 1096537 1083710 1069746
61830 1069746 1056772 1047194 1041893 1040371 1042345 1048188 1057842 1070271 1084213 1098697 1112504 1123875
61818 1123875 1131319 1134325 1132821 1126321 1114109 1096149 1073391 1047152 1018489 988236 957417 927348
$$ packed form
61904H40280J5715J5542J4179J2276R751O051J427k979o394r001j1181j2938j4191
61891H58537j5049j5608j5887j6017j6019j5513j4107j2126j0402r416r109r409
61879F99875j0271j1168j1353j0817j0307j0068r331p455n016l057j729m08J083
61866F09978K166K541K688L160L910M780O114Q244J0649J2344J3179J4128J6099
61853G09980J8934K1883K4545K6915K8862L0160L0889L1350L1575L1266L0119
61842A016478K7964K4746K0661J6086J1111N496m72n587q930j1016j2827j3964
61830A069746j2974r578n301j522J974N843R654J2429J3942J4484J3807J1371
61818A123875P444L006j504o500j2212j7960k2758k6239k8663l0253l0819l0069
$$ plain form
61806 927348 899100 872817 847792 823484 800372 779569 761642 746138 732238 719467 707667
61795 707667 696673 686386 677047 669128 662883 658043 653927 649820 645389 640911 637119 634609 633204 631884
61781 631884 629557 626063 622275 619088 616485 613850 610937 608069 605474 602961 600393 597937 595678 593487
61767 593487 591486 590170 589747 589885 590434 591875 594565 597974 601232 604117 606972 609933 612790 615312 617133
61752 617133 617627 616565 614727 613142 611803 609769 606519 602515 598447 594609 591164 588416 586477 585069
61738 585069 583885 582855 581903 580809 579487 578177 577252 576962 577366 578299 579341 580040 580209 580013 579887 580340 581558
61721 581558 583058 584097 584598 585249 586527 588096 589442 590494 591169 590994 589801 588191 586508 583917 579458
61706 579458 573604 567742 562374 556899 551048 545425 540511 536135 532131 528654 525661 522793 519934 517206
$$ packed form
61806I27348k8248k6283k5025k4308k3112k0803j7927j5504j3900j2771j1800
61795G07667j0994j0287r339p919o245m840m116m107m431m478l792k510j405j320
61781F31884k327l494l788l187k603k635k913k868k595k513k568k456k259k191
61767E93487k001j316m23J38N49J441K690L409L258K885K855K961K857K522J821
61752F17133M94j062j838j585j339k034l250m004m068l838l445k748j939j408
61738E85069j184j030r52j094j322j310r25k90M04R33J042O99J69j96j26M53J218
61721E81558J500J039N01O51J278J569J346J052O75j75j193j610j683k591m459
61706E79458n854n862n368n475n851n623m914m376m004l477k993k868k859k728
$$ plain form
61692 517206 514420 511282 508144 505661 503614 500998 497443 493638 490160 486811 483425 480388 477894 475502
61678 475502 472952 470685 469081 467803 466379 464856 463469 462173 460833 459400 457669 455503 453517 452799
61664 452799 453590 454933 455959 456803 457815 458685 458905 458503 457775 456863 456088 456086 457034 458276 459246 460255 461826
61647 461826 463812 465763 467776 470390 473912 478202 482779 486857 489790 491786 493595 495202 495534 493934
61633 493934 491115 488094 484921 481206 477237 473712 470847 468524 466808 465575 464101 461952 459899 458993
61619 458993 459005 458666 457361 455730 454709 454679 455444 456248 455867 453483 449603 445603 442310 439496 436584 433207
61603 433207 429135 424343 419280 414605 410568 407009 403904 401393 399328 397239 394836 392223 389707 387738
61589 387738 386835 387075 387684 387584 386367 384413 382236 380149 378481 377548 377241 376999 376341 375296 374379 374251 375164
$$ packed form
61692E17206k786l138l138k483k047k616l555l805l478l349l386l037k494k392
61678D75502k550k267j604j278j424j523j387j296j340j433j731k166j986p18
61664D52799P91J343J026Q44J012Q70K20m02p28r12p75kR48J242R70J009J571
61647D61826J986J951K013K614L522M290M577M078K933J996J809J607L32j600
61633D93934k819l021l173l715l969l525k865k323j716j233j474k149k053r06
61619D58993J2l39j305j631j021l0P65Q04l81k384l880m000l293k814k912l377
61603D33207m072m792n063m675m037l559l105k511k065k089k403k613k516j969
61589C87738r03K40O09j00j217j954k177k087j668r33l07k42o58j045r17j28R13
$$ plain form
61572 375164 376487 376982 375932 373914 372210 371626 372035 372796 373302 373413 373631 374660 376588 378808 380859 382840
61556 382840 384744 386158 387065 388206 389867 390999 390541 389163 388608 389551 391220 392933 394781 396638 397750
61541 397750 397846 397793 398579 400269 402393 404749 407288 409682 411647 413483 415819 418847 422036 424494 425465 424744
61525 424744 422879 420886 419526 418789 418045 416640 414392 411696 409198 407313 406109 405590 405797 406473 406942 406629
61509 406629 405561 404151 402760 401706 401311 401444 401245 399859 397411 394849 392930 391751 391146 391050 391453 392369
61493 392369 393842 395691 397399 398620 399650 400994 402574 403859 404628 405127 405573 406029 406719 407856 409081
61478 409081 409679 409518 409337 409897 411255 413015 414832 416441 417578 418189 418526 418853 419230 419734 420616 422004 423554
61461 423554 424644 424933 424668 424414 424499 424768 424940 425066 425352 425611 425320 424410 423596 423597 424302 425044 425478 425870 426699
$$ packed form
61572C75164J323M95j050k018j704n84M09P61N06J11K18J029J928K220K051J981
61556C82840J904J414R07J141J661J132m58j378n55R43J669J713J848J857J112
61541C97750R6n3P86J690K124K356K539K394J965J836K336L028L189K458R71p21
61525D24744j865j993j360p37p44j405k248k696k498j885j204n19K07O76M69l13
61509D06629j068j410j391j054l95J33j99j386k448k562j919j179o05r6M03R16
61493C92369J473J849J708J221J030J344J580J285P69M99M46M56O90J137J225
61478D09081N98j61j81N60J358J760J817J609J137O11L37L27L77N04Q82J388J550
61461D23554J090K89k65k54Q5K69J72J26K86K59k91r10q14JP05P42M34L92Q29
$$ plain form
61442 426699 428230 430296 432293 433624 434369 435202 436491 437958 439502 441686 444862 448307 450971 452719 454188
61427 454188 455718 457201 458725 460524 462370 463763 464733 465812 467217 468697 470162 471798 473461 474610
61413 474610 474920 474476 473385 471759 470066 468876 468158 467376 466326 465266 464168 462512 460022 457144 454605
61398 454605 452857 451975 451609 451064 450006 449117 449445 450987 452515 452961 452466 451916 451973 452764 454052 455440 456688
61381 456688 457902 459159 460136 460572 460943 462021 463865 465935 468147 470991 474505 477984 480990 483898 487097
61366 487097 490345 493310 496143 499087 502030 504835 507703 510875 514390 518361 523031 528350 534028 540234
61352 540234 547641 556427 565891 575499 585710 597160 609448 621314 631697 640120 646359 650397 652652
61339 652652 653778 654169 653826 652575 650284 647055 643378 639826 636453 632708 628115 622755 616938 610829 604621
$$ packed form
61442D26699J531K066J997J331P45Q33J289J467J544K184L176L445K664J748J469
61427D54188J530J483J524J799J846J393R70J079J405J480J465J636J663J149
61413D74610L10m44j091j626j693j190p18p82j050j060j098j656k490k878k539
61398D54605j748q82l66n45j058q89L28J542J528M46m95n50N7P91J288J388J248
61381D56688J214J257R77M36L71J078J844K070K212K844L514L479L006K908L199
61366D87097L248K965K833K944K943K805K868L172L515L971M670N319N678O206
61352E40234P407Q786R464R608J0211J1450J2288J1866J0383Q423O239M038K255
61339F52652J126L91l43j251k291l229l677l552l373l745m593n360n817o109o208
$$ plain form
61324 604621 598736 593609 589540 586907 586078 586855 588382 589958 591636 593777 596450 599660 603804 609377 616356
61309 616356 624359 633392 644111 657324 673329 691687 711442 731652 751708 771007 788313 801800
61297 801800 809953 812410 809991 804160 796401 787617 777876 766908 754930 742786 731286 720749 711179
61284 711179 702500 694530 687085 680197 674015 668547 663899 660622 659256 659566 660813 662832 666135 670854
61270 670854 676311 681910 687700 693706 699397 704347 708899 713706 719148 725671 734098 744949 757766 771668
61256 771668 786195 800954 814701 825507 831936 833760 831672 826730 819969 812112 803546 794596 785627
61243 785627 776748 767818 759010 751072 744668 739711 735676 732282 729479 727043 724641 722207 719940 718094
61229 718094 717097 717659 720338 725020 731060 737857 745056 752385 759626 766691 773508 779993 786305 792929 800178
$$ packed form
61324F04621n885n127m069k633q29P77J527J576J678K141K673L210M144N573O979
61309F16356Q003R033J0719J3213J6005J8358J9755K0210K0056J9299J7306J3487
61297H01800Q153K457k419n831p759q784r741j0968j1978j2144j1500j0537r570
61284G11179q679p970p445o888o182n468m648l277j366L10J247K019L303M719
61270F70854N457N599N790O006N691M950M552M807N442O523Q427J0851J2817J3902
61256G71668J4527J4759J3747J0806O429J824k088m942o761p857q566q950q969
61243G85627q879q930q808p938o404m957m035l394k803k436k402k434k267j846
61229G18094r97N62K679M682O040O797P199P329P241P065O817O485O312O624P249
$$ plain form
61214 800178 807733 814991 821787 828441 835104 841355 846622 850866 854696 858754 863074 867243 871207 875692
61200 875692 881666 889645 899787 912390 927824 946111 967027 990466 1016177 1043131 1069603 1093877
61188 1093877 1114523 1130329 1140747 1146531 1149240 1149956 1148962 1146483 1142871 1137949 1131069 1122058 1111337
61175 1111337 1098906 1084161 1067186 1049280 1031615 1014102 996181 977944 959702 941089 921472
61164 921472 900901 880023 859433 839749 821821 806088 792022 778878 766832 756752 749152 743961
61152 743961 741156 740901 743103 747286 752922 759592 766850 774059 780073 783092 781513 775347 766355 756451
61138 756451 746525 737092 729147 723517 720000 718111 718269 721325 727235 735145 744636 756022 769480 784739
61124 784739 801713 820679 841705 864498 888977 915494 944367 975450 1008098 1041204 1073517
$$ packed form
61214H00178P555P258O796O654O663O251N267M244L830M058M320M169L964M485
61200H75692N974P979J0142J2603J5434J8287K0916K3439K5711K6954K6472K4274
61188A093877K0646J5806J0418N784K709P16r94k479l612m922o880r011j0721
61175A111337j2431j4745j6975j7906j7665j7513j7921j8237j8242j8613j9617
61164I21472k0571k0878k0590j9684j7928j5733j4066j3144j2046j0080p600n191
61152G43961k805k55K202M183N636O670P258P209O014L019j579o166q992r904
61138G56451r926r433p945n630l517j889J58L056N910P910R491J1386J3458J5259
61124G84739J6974J8966K1026K2793K4479K6517K8873L1083L2648L3106L2313
$$ plain form
61113 1073517 1104436 1134400 1164044 1193116 1220720 1246458 1270681 1293607 1314778 1333499 1349374
61102 1349374 1362257 1371969 1378103 1379897 1376366 1366894 1351730 1331830 1308328 1282256 1254493 1225719
61090 1225719 1196552 1167799 1140203 1113864 1088404 1063952 1041435 1021614 1004420 989610 977427
61079 977427 967992 960689 954855 950709 948898 949494 952087 956557 963052 971422 981278 992426 1004737 1017845
61065 1017845 1031499 1045933 1061508 1078362 1096776 1117304 1140012 1164145 1189150 1215415 1243376
61054 1243376 1272603 1302564 1333627 1366413 1400773 1436318 1473276 1511760 1550819 1589387 1627615
61043 1627615 1666028 1703904 1739922 1773980 1806869 1838355 1867158 1892768 1915877 1937013 1956143
61032 1956143 1973584 1989755 2003968 2015095 2023747 2032269 2042227 2053351 2065297 2078852 2094699 2112386
$$ packed form
61113A073517L0919K9964K9644K9072K7604K5738K4223K2926K1171J8721J5875
61102A349374J2883R712O134J794l531r472j5164j9900k3502k6072k7763k8774
61090A225719k9167k8753k7596k6339k5460k4452k2517j9821j7194j4810j2183
61079I77427r435p303n834m146j811N96K593M470O495Q370R856J1148J2311J3108
61065A017845J3654J4434J5575J6854J8414K0528K2708K4133K5005K6265K7961
61054A243376K9227K9961L1063L2786L4360L5545L6958L8484L9059L8568L8228
61043A627615L8413L7876L6018L4058L2889L1486K8803K5610K3109K1136J9130
61032A956143J7441J6171J4213J1127Q652Q522R958J1124J1946J3555J5847J7687
$$ plain form
61020 2112386 2131269 2151327 2172497 2194538 2218315 2246202 2280702 2323827 2378091 2446369 2529821
61009 2529821 2627277 2737680 2862173 3003731 3166975 3359681 3592618 3876322 4219498 4632046
60999 4632046 5128172 5725816 6446560 7319415 8382584 9678103 11245921 13120289 15309466
60990 15309466 17741661 20209797 22390018 23966822 24791654 24951229 24698903 24324883 24067921
60981 24067921 24084513 24418123 24948964 25389695 25389398 24702700 23301633 21354918 19115985
60972 19115985 16816874 14621680 12626288 10872780 9365813 8089713 7021208 6133996
60964 6133996 5400023 4792931 4291371 3877916 3535971 3249692 3006369 2797072 2615059
60955 2615059 2454919 2313083 2187554 2076410 1977215 1888018 1808024 1736852 1673658 1617266
$$ packed form
61020B112386J8883K0058K1170K2041K3777K7887L4500M3125N4264O8278Q3452
61009B529821R7456J10403J24493J41558J63244J92706K32937K83704L43176M12548
60999D632046M96126N97644P20744Q72855J063169J295519J567818J874368K189177
60990A5309466K432195K468136K180221J576804Q24832J59575k52326l74020k56962
60981B4067921J6592L33610N30841M40731k97o86698j401067j946715k238933
60972A9115985k299111k195194j995392j753508j506967j276100j068505q87212
60964F133996p33973o07092n01560m13455l41945k86279k43323k09297j82013
60955B615059j60140j41836j25529j11144r9195q9197p9994p1172o3194n6392
$$ plain form
60945 1617266 1566480 1519701 1474655 1429187 1382494 1335315 1288979 1244410 1201901 1161370 1122628
60934 1122628 1085620 1050672 1018494 989799 964795 943011 923548 905574 888744 873266 859451
60923 859451 847214 836127 825983 817008 809373 802753 796650 790958 785860 781319 777118 773383 770682
60910 770682 769433 769450 770166 771060 771797 772143 771927 771068 769619 767805 765819 763400 759838 754680 748283 741309
60894 741309 733870 725574 716309 706399 696035 685152 674057 663632 654636 647112 640639 634768 629126
60881 629126 623574 618472 614300 610744 606634 601178 594833 588645 583148 578382 574504 571660 569462 567307
60867 567307 565273 564080 564037 564561 564992 565464 566665 569006 572367 576461 581067 585991 591179 596865 603182
60852 603182 609522 614740 618312 620937 623559 626184 628301 630255 633237 637673 642395 645763 646954 645774
$$ packed form
60945A617266n0786m6779m5046m5468m6693m7179m6336m4569m2509m0531l8742
60934A122628l7008l4948l2178k8695k5004k1784j9463j7974j6830j5478j3815
60923H59451j2237j1087j0144q975p635o620o103n692n098m541m201l735k701
60910G70682j249J7P16Q94P37L46k16q59j449j814j986k419l562n158o397o974
60894G41309p439q296r265r910j0364j0883j1095j0425q996p524o473n871n642
60881F29126n552n102m172l556m110n456o345o188n497m766l878k844k198k155
60867E67307k034j193m3N24M31M72J201K341L361M094M606M924N188N686O317
60852F03182O340N218L572K625K622K625K117J954K982M436M722L368J191j180
$$ plain form
60838 645774 642009 635776 628044 619973 611935 603822 595935 588848 582653 577099 572203 567963 563731 558843
60824 558843 553721 549333 545645 541666 537131 532925 529498 525967 521419 516205 511260 506856 502723 498822
60810 498822 495238 491699 487847 483775 479825 476092 472516 469213 466424 464331 463097 462702 462649 462285 461651
60795 461651 461431 461804 461999 461426 460634 460598 461508 462858 464332 465957 467663 469312 471088 473339 476054 478809
60779 478809 481137 482744 483583 484024 484698 485885 487183 488001 488175 487917 487433 486791 485933 484649 482839 480905
60763 480905 479567 479136 479378 480120 481436 483013 484007 483966 483380 482865 482271 481090 479367 477617 476119 474799
60747 474799 473671 472966 472906 473521 474480 474973 474136 471833 468676 465175 461323 457202 453283 449746 446138 442206
60731 442206 438545 435851 433966 432222 430324 428424 426784 425862 426245 427876 429734 430886 431490 432210 433184
$$ packed form
60838F45774l765o233p732q071q038q113p887p087o195n554m896m240m232m888
60824E58843n122m388l688l979m535m206l427l531m548n214m945m404m133l901
60810D98822l584l539l852m072l950l733l576l303k789k093j234l95n3l64o34
60795D61651k20L73J95n73p92l6R10J350J474J625J706J649J776K251K715K755
60779D78809K328J607Q39M41O74J187J298Q18J74k58m84o42q58j284j810j934
60763D80905j338m31K42P42J316J577R94m1n86n15n94j181j723j750j498j320
60747D74799j128p05o0O15R59M93q37k303l157l501l852m121l919l537l608l932
60731D42206l661k694j885j744j898j900j640r22L83J631J858J152O04P20R74
$$ plain form
60716 433184 434260 435732 437890 440168 441740 442828 444492 447109 449936 452304 454428 456753 459203 461413
60702 461413 463232 464628 465470 465752 465857 466312 467281 468364 468921 468641 467787 466803 465784 464634 463625 463236 463390
60685 463390 463487 463393 463719 464764 465928 466730 467686 469466 471727 473676 475346 477371 479774 481931 483680 485530
60669 485530 487664 489448 490079 489250 487102 484046 480642 477251 473829 470379 467335 465045 463174 461228 459487
60654 459487 458695 458988 459831 460976 462703 465062 467589 469925 472187 474534 476820 478795 480237 480827 480335
60639 480335 478933 477007 474719 472136 469631 467616 465979 464379 463036 462603 463220 464256 465070 465465 465364
60624 465364 464646 463520 462600 462321 462566 462964 463280 463486 463743 464296 465099 465646 465527 465010 464736 464946 465436 466051
60606 466051 466754 467365 467768 468220 468911 469388 469073 468195 467564 467499 467643 467803 468179 468828 469705 471273 474199 478234
$$ packed form
60716D33184J076J472K158K278J572J088J664K617K827K368K124K325K450K210
60702D61413J819J396Q42K82J05M55R69J083N57k80q54r84j019j150j009l89J54
60685D63390R7r4L26J045J164Q02R56J780K261J949J670K025K403K157J749J850
60669D85530K134J784O31q29k148l056l404l391l422l450l044k290j871j946j741
60654D59487p92K93Q43J145J727K359K527K336K262K347K286J975J442N90m92
60639D80335j402j926k288k583k505k015j637j600j343m33O17J036Q14L95j01
60624D65364p18j126r20k79K45L98L16K06K57N53Q03N47j19n17k74K10M90O15
60606D66051P03O11M03M52O91M77l15q78o31o5J44J60L76O49Q77J568K926M035
$$ plain form
60588 478234 482208 485476 488567 492050 495446 497803 498790 498797 498417 498285 498952 500414 502078 503505 504874 506443
60572 506443 508062 509715 512121 516228 522270 529828 538654 548966 561028 574961 590987 609258 629125
60559 629125 648907 666822 682051 694539 703784 708446 707590 701996 693697 684281 674315 664356 655636
60546 655636 649227 645130 642736 641719 641944 643003 644648 647489 652626 660684 671731 685866 703258 723796
60532 723796 747308 773919 803464 834707 865787 895258 921982 944277 960237 969074 971391 968043
60520 968043 959608 947086 932198 916416 900266 883900 867819 852708 839065 827364 818148 811605
60508 811605 807299 804536 802828 802039 802517 805128 810750 819685 831901 847742 867854 892582 922133
60495 922133 957350 999511 1049165 1105734 1168289 1235900 1306889 1378456 1447449 1511114 1567105
$$ packed form
60588D78234L974L268L091L483L396K357R87Pl80j32O67J462J664J427J369J569
60572E06443J619J653K406M107O042P558Q826J0312J2062J3933J6026J8271J9867
60559F29125J9782J7915J5229J2488R245M662q56n594q299r416r966r959q720
60546F55636o409m097k394j017K25J059J645K841N137Q058J1047J4135J7392K0538
60532G23796K3512K6611K9545L1243L1080K9471K6724K2295J5960Q837K317l348
60520I68043q435j2522j4888j5782j6150j6366j6081j5111j3643j1701r216o543
60508H11605m306k763j708p89M78K611N622Q935J2216J5841K0112K4728K9551
60495I22133L5217M2161M9654N6569O2555O7611P0989P1567O8993O3665N5991
$$ plain form
60484 1567105 1613641 1650117 1676974 1694500 1702130 1699106 1685204 1660395 1624371 1576998 1519070 1452421
60472 1452421 1379551 1303310 1226482 1151420 1080193 1014817 956663 905572 860314 820106 785104
60461 785104 755321 729896 707762 688242 670682 654256 638641 624270 611514 600219 590377 582409
60449 582409 576264 571003 565904 561291 557578 554179 550256 546022 542406 539731 537604 535838 534630 533905
60435 533905 533273 532658 532295 532056 531307 529574 526960 523939 521068 518881 517670 517341 517609 518166 518513 518023 516626
60418 516626 515208 514868 515898 517808 520125 522654 525135 527217 528900 530565 532440 534295 535763 536810
60404 536810 537779 539048 540650 542249 543579 544817 546320 548050 549612 550861 552058 553309 554359 555141 556096
60389 556096 557631 559691 562121 565020 568388 571866 575263 578957 583231 587561 591171 594107 597162 600832
$$ packed form
60484A567105M6536L6476K6857J7526P630l024j3902k4809l6024m7373n7928o6649
60472A452421p2870p6241p6828p5062p1227o5376n8154n1091m5258m0208l5002
60461G85104k9783k5425k2134j9520j7560j6426j5615j4371j2756j1295r842p968
60449E82409o145n261n099m613l713l399l923m234l616k675k127j766j208p25
60435E33905o32o15l63k39p49j733k614l021k871k187j211l29K68N57L47m90j397
60418E16626j418l40J030J910K317K529K481K082J683J665J875J855J468J047
60404E36810R69J269J602J599J330J238J503J730J562J249J197J251J050P82R55
60389E56096J535K060K430K899L368L478L397L694M274M330L610K936L055L670
$$ plain form
60375 600832 604880 608866 612525 615575 617693 618979 620098 621690 623820 626105 628199 629937 631213 632011
60361 632011 632652 633800 635935 638838 641781 644339 646860 650050 654393 660163 667670 677052 687978 699936
60347 699936 712655 725760 738164 748411 755688 760009 761431 759749 755160 748644 741304 733634 725575
60334 725575 716943 707685 698085 688853 680676 673621 667322 661732 657098 653202 649260 644859 640479 636880
60320 636880 634376 632825 631859 631002 630077 629645 630533 632899 636345 640979 647579 656559 667559 680304 695003
60305 695003 711534 729009 746644 764380 782299 800153 817799 835185 851326 864139 871984 874718
60293 874718 872669 865490 852908 835922 816282 795319 774054 753856 735908 720324 706636 694812
60281 694812 684956 676364 667911 659276 650969 643328 636237 629736 624110 619352 615128 611226 607530 603823
$$ packed form
60375F00832M048L986L659L050K118J286J119J592K130K285K094J738J276P98
60361F32011O41J148K135K903K943K558K521L190M343N770P507R382J0926J1958
60347F99936J2719J3105J2404J0247P277M321J422j682m589o516p340p670q059
60334G25575q632r258r600r232q177p055o299n590m634l896l942m401m380l599
60320F36880k504j551r66q57r25m32Q88K366L446M634O600Q980J1000J2745J4699
60305F95003J6531J7475J7635J7736J7919J7854J7646J7386J6141J2813P845K734
60293H74718k049p179j2582j6986j9640k0963k1265k0198j7948j5584j3688j1824
60281F94812r856q592q453q635q307p641p091o501n626m758m224l902l696l707
$$ plain form
60267 603823 600120 596937 594649 592878 591156 589777 589244 589272 589218 589176 589649 590344 590414 589952 590197 591985 594879
60250 594879 598023 601003 603505 604980 605188 604609 603846 602968 601717 600031 598093 596121 594349 592992 592100
60235 592100 591615 591598 592194 593414 595184 597533 600438 603641 606962 610688 615200 620309 625409 630309 635417
60220 635417 641005 646692 651859 656385 660848 666101 672643 680305 688597 697331 706599 716164 725411 734196
60206 734196 743246 753159 763371 772669 780430 786848 792277 797056 801723 806583 810973 813651 814033 812606
60192 812606 810074 806604 802021 796233 789299 781408 773025 764854 757491 751123 745474 740033 734507 729135
60178 729135 724338 720055 715869 711838 708543 706049 703649 701108 699387 699296 700098 700386 699911 699521 699622 699832
60162 699832 699964 700272 700643 700601 700261 700374 701248 702433 703660 705186 706996 708526 709588 710815 712805 715479
$$ packed form
60267F03823l703l183k288j771j722j379n33K8n4m2M73O95P0m62K45J788K894
60250E94879L144K980K502J475K08n79p63q78j251j686j938j972j772j357q92
60235E92100m85j7N96J220J770K349K905L203L321L726M512N109N100M900N108
60220F35417N588N687N167M526M463N253O542P662Q292Q734R268R565R247Q785
60206G34196R050R913J0212R298P761O418N429M779M667M860M390K678L82j427
60192H12606k532l470m583n788o934p891q383q171p363o368n649n441n526n372
60178G29135m797m283m186m031l295k494k400k541j721r1Q02K88m75l90J01K10
60162F99832J32L08L71m2l40J13Q74J185J227J526J810J530J062J227J990K674
$$ plain form
60146 715479 718710 722838 727998 733492 738454 742825 747153 751757 756574 761609 766995 772739 778901 786036
60132 786036 794935 805710 817311 828219 837549 845289 851468 855508 856791 855742 853852 852438 851788 851603
60118 851603 851742 852188 852743 853282 854013 855009 855750 855618 854622 853168 851286 848585 844871 840320 835073 829036
60102 829036 822036 813943 804843 795375 786607 779226 773087 767905 764024 762042 761962 763182 765095 767330 769725
60087 769725 772474 775938 779851 783172 785282 786831 788789 791152 793301 795068 796528 797101 795911 792885
60073 792885 788584 783117 776112 767650 758323 748461 738133 727838 718261 709366 700608 692064 684435 677881
60059 677881 671821 666064 661267 657952 655776 654049 652433 650992 650071 650180 651566 653974 657275 661922 668104
60044 668104 674858 680986 686507 692152 697716 702193 705487 708575 711767 714070 714660 713806 711954 708949 704661
$$ packed form
60146G15479L231M128N160N494M962M371M328M604M817N035N386N744O162P135
60132G86036Q899J0775J1601J0908R330P740O179M040J283j049j890j414o50j85
60118H51603J39M46N55N39P31R96P41j32r96j454j882k701l714m551n247o037
60102H29036p000q093r100r468q768p381o139n182l881j982q0J220J913K235K395
60087G69725K749L464L913L321K110J549J958K363K149J767J460N73j190l026
60073G92885m301n467p005q462r327r862j0328j0295r577q895q758q544p629o554
60059F77881o060n757m797l315k176j727j616j441r21J09J386K408L301M647O182
60044F68104O754O128N521N645N564M477L294L088L192K303N90q54j852l005m288
$$ plain form
60029 704661 699451 693604 687216 680907 675573 670965 665538 658282 649787 640982 631827 621904 611444 601062
60015 601062 591183 582344 575221 569707 564694 559498 554812 551616 549823 548711 548003 547725 547560 547233 547159 547903
59999 547903 549269 550547 551446 552236 553310 555064 557921 561910 566436 570860 575066 579188 583186 587089 591215
59984 591215 595663 599818 602767 604014 603595 601852 599336 596543 593484 589851 585741 581766 578327 575332
59970 575332 572785 571001 569997 569368 569077 569738 571742 574813 578850 584487 592151 601088 609901 617691 624220
59955 624220 629382 633082 635336 636113 635337 633257 630431 627197 623636 620186 617551 615668 613438 609932 605291
59940 605291 600166 594939 589910 585562 582062 579036 576297 574285 573437 573729 575174 578056 582214 586885 591758
59925 591758 597440 604244 611269 617366 622384 626765 630519 633349 635258 636363 636614 636360 636623 638110 640493
$$ packed form
60029G04661n210n847o388o309n334m608n427p256q495q805r155r923j0460j0382
60015F01062r879q839p123n514n013n196m686l196j793j112p08k78j65l27p4P44
59999E47903J366J278Q99P90J074J754K857L989M526M424M206M122L998L903M126
59984E91215M448M155K949J247m19j743k516k793l059l633m110l975l439k995
59970E75332k547j784j004o29k91O61K004L071M037N637P664Q937Q813P790O529
59955F24220N162L700K254P77p76k080k826l234l561l450k635j883k230l506m641
59940F05291n125n227n029m348l500l026k739k012q48K92J445K882M158M671M873
59925E91758N682O804P025O097N018M381L754K830J909J105K51k54K63J487K383
$$ plain form
59910 640493 643311 646963 651974 657883 663754 669414 675255 681093 686059 689431 691020 691043 690248 689739 690004
59895 690004 690464 690554 690701 691533 692824 694178 696269 700261 706229 713206 720606 728594 737109 745532 753472
59880 753472 761114 768711 776399 784542 793478 802787 811376 818411 823718 827316 829122 829155 827542 824300 819536
59865 819536 813800 807788 801706 795253 788216 780747 773179 765796 758639 751386 743783 736361 730179 725541
59851 725541 721623 717876 715108 714419 715676 718009 721363 726552 733939 743078 753575 765247 777160 787388
59837 787388 794300 797812 799212 800110 801707 804773 809915 817473 826799 835773 841749 843383 841222 836420
59823 836420 829583 821141 811921 802550 792786 782140 770724 758991 747197 735739 725398 716499 708398
59810 708398 700516 693212 686832 680686 674186 668370 664924 663900 663658 662946 661832 660609 659087 657164 655118
$$ packed form
59910F40493K818L652N011N909N871N660N841N838M966L372J589K3p95n09K65
59895F90004M60R0J47Q32J291J354K091L992N968O977P400P988Q515Q423P940
59880G53472P642P597P688Q143Q936R309Q589P035N307L598J806L3j613l242m764
59865H19536n736o012o082o453p037p469p568p383p157p253p603p422o182m638
59851G25541l918l747k768o89J257K333L354N189P387R139J0497J1672J1913J0228
59837G87388O912L512J400Q98J597L066N142P558R326Q974N976J634k161m802
59823H36420o837q442r220r371r764j0646j1416j1733j1794j1458j0341q899q101
59810G08398p882p304o380o146o500n816l446j024k42p12j114j223j522j923k046
$$ plain form
59795 655118 652992 650524 647804 645286 643073 640972 639228 638350 638120 637644 636540 635340 634579 634251 634260 634664
59779 634664 635278 635780 636346 637540 639468 641706 644095 646855 649867 652628 655099 657817 660972 664123 667046
59764 667046 670146 673750 677605 681431 685405 689869 695012 701047 708120 715883 723636 731129 738786 747081
59750 747081 756179 766195 777129 788394 799050 808779 818098 827400 836334 844349 851312 857259 862004
59737 862004 865340 867371 868420 868812 868793 868355 867117 864744 861523 858149 854981 851914 848942 846358 844307
59722 844307 842602 841032 839433 837404 834446 830527 826216 822158 818688 815822 813259 810467 807216 803977
59708 803977 801437 799698 798361 797230 796423 795890 795391 794935 794732 794725 794571 794126 793572 793179 793248 794134 795868 797941
59690 797941 799738 800873 800806 798819 795084 791185 788621 787111 785377 783219 781584 780631 779042 775649 770715
$$ packed form
59795F55118k126k468k720k518k213k101j744q78k30m76j104j200p61l28RM04
59779F34664O14N02N66J194J928K238K389K760L012K761K471K718L155L151K923
59764F67046L100L604L855L826L974M464N143O035P073P763P753P493P657Q295
59750G47081R098J0016J0934J1265J0656R729R319R302Q934Q015O963N947M745
59737H62004L336K031J049L92j9m38j238k373l221l374l168l067k972k584k051
59722H44307j705j570j599k029k958l919m311m058l470k866k563k792l251l239
59708H03977k540j739j337j131q07n33m99m56k03pj54m45n54l93O9Q86J734K073
59690G97941J797J135o7j987l735l899k564j510j734k158j635r53j589l393m934
$$ plain form
59675 770715 765139 759174 752491 744979 736986 729006 721353 714100 707357 701725 698001 696054 694530 692357
59661 692357 690015 688534 687845 687251 687090 688462 691398 694688 697702 701042 705082 709161 712691 715911 718895
59646 718895 720821 720851 718950 715291 709724 702487 694727 687579 681231 675430 670337 666312 663362 661374 660580
59631 660580 661228 662921 664576 664948 663214 659452 654616 649704 644948 640093 635199 630660 626727 623678 622021
59616 622021 621556 620635 617646 613185 609482 607638 606834 606449 607181 609407 612000 613894 615641 618252 621407
59601 621407 624012 625851 627539 629309 630890 632275 633732 635278 636827 638528 640300 641432 641388 640745 640612
59586 640612 641273 642002 642011 641060 639339 637284 635431 634042 632958 631968 631047 630035 628557 626567 624592 623114
59570 623114 622169 621759 622071 622879 623428 623439 623648 624683 625986 626586 626529 626639 627105 627193 626368 625015 623819 623006
$$ packed form
59675G70715n576n965o683p512p993p980p653p253o743n632l724j947j524k173
59661F92357k342j481o89n94j61J372K936L290L014L340M040M079L530L220K984
59646G18895J926L0j901l659n567p237p760p148o348n801n093m025k950j988p94
59631F60580O48J693J655L72j734l762m836m912m756m855m894m539l933l049j657
59616F22021m65r21k989m461l703j844q04l85P32K226K593J894J747K611L155
59601F21407K605J839J688J770J581J385J457J546J549J701J772J132m4o43j33
59586F40612O61P29Rr51j721k055j853j389j084r90r21j012j478j990j975j478
59570F23114r45m10L12Q08N49J1K09J035J303O00n7J10M66Q8q25j353j196q13
$$ plain form
59552 623006 622354 621593 620625 619600 618881 618863 619784 621767 624895 629112 634199 640077 647080 655815 666873 680854
59536 680854 698583 720796 746963 773993 796544 809774 812580 808025 800482 792844 786570 782917 782545
59523 782545 784285 785913 786448 786718 787528 788314 787902 785620 781251 774737 766406 756847 746266 734589 722381
59508 722381 710899 700885 691981 683638 675919 669130 663385 658824 655574 653144 650578 647535 644620 642395
59494 642395 640776 639670 639364 639842 640443 640651 640675 640899 641392 642254 643787 645995 648498 651212 654527 658655
59478 658655 663474 669068 675611 682657 689479 696233 703690 711654 718782 724317 728798 732696 735632 737465
59464 737465 738856 740041 740368 739921 740346 743097 747928 754054 761655 771029 781297 791226 800595 809603 817739
59449 817739 824487 830439 836431 842073 846292 848815 849856 848832 844674 837254 827494 816394 804941 794581
$$ packed form
59552F23006o52p61r68j025p19j8R21J983L128M217N087N878P003Q735J1058J3981
59536F80854J7729K2213K6167K7030K2551J3230K806m555p543p638o274l653l72
59523G82545J740J628N35K70Q10P86m12k282m369o514q331r559j0581j1677j2208
59508G22381j1482j0014q904q343p719o789n745m561l250k430k566l043k915k225
59494F42395j619j106l06M78O01K08K4K24M93Q62J533K208K503K714L315M128
59478F58655M819N594O543P046O822O754P457P964P128N535M481L898K936J833
59464G37465J391J185L27m47M25K751M831O126P601R374J0268R929R369R008Q136
59449H17739O748N952N992N642M219K523J041j024m158p420r760j1100j1453j0360
$$ plain form
59435 794581 786570 780895 776707 773624 771750 770774 770150 770062 771299 774261 778875 785368 794269 805744 819669
59420 819669 836165 855285 876339 898412 921453 946021 971980 998333 1024653 1051993 1081616
59409 1081616 1112457 1139697 1156342 1157419 1143544 1120430 1094827 1071230 1051908 1038428 1032178 1034080
59397 1034080 1044152 1060167 1076169 1083987 1078193 1059558 1033097 1003649 974149 946569 922252 901281
59385 901281 883004 867252 854121 842955 832838 823889 816874 811689 807363 803439 800234 797865 796156
59372 796156 795433 796215 798036 799716 800980 802854 806254 811002 816418 822099 828001 834407 841894 850764 860613
59357 860613 871052 882561 895935 911139 927568 945187 964435 985123 1006418 1027911 1049734
59346 1049734 1071602 1092597 1112049 1129844 1145778 1159339 1170096 1177588 1180841 1178831 1171533 1159841
$$ packed form
59435G94581q011n675m188l083j874r76o24q8J237K962M614O493Q901J1475J3925
59420H19669J6496J9120K1054K2073K3041K4568K5959K6353K6320K7340K9623
59409A081616L0841K7240J6645J077j3875k3114k5603k3597j9322j3480o250J902
59397A034080J0072J6015J6002P818n794j8635k6461k9448k9500k7580k4317k0971
59385I01281j8277j5752j3131j1166j0117q949p015n185m326l924l205k369j709
59372G96156p23P82J821J680J264J874L400M748N416N681N902O406P487Q870R849
59357H60613J0439J1509J3374J5204J6429J7619J9248K0688K1295K1493K1823
59346A049734K1868K0995J9452J7795J5934J3561J0757P492L253k010p298j1692
$$ plain form
59334 1159841 1144441 1125505 1103503 1079487 1054309 1028204 1001360 974434 948348 923935 901766
59323 901766 881930 864047 847772 833155 820264 808894 798997 790862 784267 778009 771068 763839 757447
59310 757447 752245 747796 743932 740892 738654 736979 735947 735704 735983 736638 738356 741934 747146 753189 760082
59295 760082 768787 780187 794705 812418 832305 851363 865523 871840 869671 860388 846783 832212
59283 832212 819101 808199 799738 794712 794024 797055 802415 809870 820290 833887 849744 867033 885541
59270 885541 904967 924757 944599 964116 982201 997675 1010464 1021072 1029119 1033578 1034373 1032513
59258 1032513 1028629 1022530 1014196 1004155 992931 981187 970237 961122 953219 945113 936906 930331 926391
59245 926391 924222 922624 921509 921454 922856 925877 930218 934745 938293 941074 944298 948178 951308 952169 950259
$$ packed form
59334A159841j5400j8936k2002k4016k5178k6105k6844k6926k6086k4413k2169
59323I01766j9836j7883j6275j4617j2891j1370r897q135o595o258o941p229o392
59310G57447n202m449l864l040k238j675j032k43K79O55J718L578N212O043O893
59295G60082Q705J1400J4518J7713J9887J9058J4160O317k169r283j3605j4571
59283H32212j3111j0902q461n026o88L031N360P455J0420J3597J5857J7289J8508
59270H85541J9426J9790J9842J9517J8085J5474J2789J0608Q047M459P95j860
59258A032513l884o099q334j0041j1224j1744j0950r115p903q106q207o575l940
59245I26391k169j598j115n5J402L021M341M527L548K781L224L880L130Q61j910
$$ plain form
59230 950259 945617 938352 928975 918206 906136 892371 877150 861429 845815 830368 815451 801750
59218 801750 789390 778087 768177 760371 754451 749407 744938 741630 739555 738003 736781 736423 736875 737291
59204 737291 737428 737926 738861 739429 739512 740185 742025 744191 745832 747272 749092 751076 752808 754359 755732 756496
59188 756496 756544 756450 756523 756349 755727 755281 755666 756871 758666 760989 763615 766153 768599 771190 773697 775747 777791
59171 777791 780678 784340 788044 791941 796987 803246 809703 815878 822061 827636 830928 831296 829842 827396
59157 827396 823299 816895 808694 799148 787820 774813 761769 750255 740099 730313 720711 711721 703453
59144 703453 695846 688992 682670 676337 670064 664557 659868 655232 650671 647411 646055 645696 645550 646049 647444
59129 647444 648832 649690 651089 654121 658271 662550 667145 672730 679137 686047 694123 704131 715644 727827
$$ packed form
59230I50259m642p265r377j0769j2070j3765j5221j5721j5614j5447j4917j3701
59218H01750j2360j1303r910p806n920n044m469l308k075j552j222l58M52M16
59204G37291J37M98R35N68Q3O73J840K166J641J440J820J984J732J551J373P64
59188G56496M8r4P3j74o22m46L85J205J795K323K626K538K446K591K507K050K044
59171G77791K887L662L704L897N046O259O457O175O183N575L292L68j454k446
59157H27396m097o404q201r546j1328j3007j3044j1514j0156r786r602q990q268
59144G03453p607o854o322o333o273n507m689m636m561l260j356l59j46M99J395
59129F47444J388Q58J399L032M150M279M595N585O407O910Q076J0008J1513J2183
$$ plain form
59115 727827 740835 755253 770823 786731 802521 817755 831568 843615 854701 865359 874564 881073
59103 881073 885329 888730 891485 892458 890814 886732 880709 873192 864760 855977 847244 839216 832881 828697
59089 828697 826226 824983 824783 824855 823819 821343 818696 816615 813764 808482 801098 793175 785332 777283 769380
59074 769380 762509 756700 751138 745451 739946 734772 729821 725252 721272 717661 714229 711297 708976 706494
59060 706494 703164 699560 696832 695233 694118 692982 691673 690021 688117 686595 685944 685890 685964 686103 686153 685586
59044 685586 684373 683316 682792 682105 680921 680235 680770 681465 680969 679814 679611 680734 682353 684298 687310 691694
59028 691694 697230 704398 714207 726658 740560 755078 770492 787213 804868 822413 838437 851347
59016 851347 860014 864389 865102 862572 857007 848967 839346 828968 818645 809316 801666 795889 792144 790753
$$ packed form
59115G27827J3008J4418J5570J5908J5790J5234J3813J2047J1086J0658R205O509
59103H81073M256L401K755R73j644m082o023p517q432q783q733q028o335m184
59089H28697k471j243k00P2j036k476k647k081k851n282p384p923p843q049p903
59074G69380o871n809n562n687n505n174m951m569l980l611l432k932k321k482
59060G06494l330l604k728j599j115j136j309j652j904j522o51n4P4J39N0n67
59044F85586j213j057n24o87j184o86N35O95m96j155k03J123J619J945L012M384
59028F91694N536P168R809J2451J3902J4518J5414J6721J7655J7545J6024J2910
59016H51347Q667M375P13k530n565q040r621j0378j0323r329p650n777l745j391
$$ plain form
59002 790753 791637 794220 798320 804324 811974 819859 826789 832881 838605 843660 847681 851168 854753 858173
58988 858173 860871 862862 864123 863931 861857 858794 856042 854045 852843 852953 854736 857653 861204 865947 872572
58973 872572 880755 889953 900551 913005 926557 940025 953269 966795 980608 994580 1009205 1024776
58961 1024776 1040462 1055278 1069121 1081581 1090710 1094584 1093477 1088935 1081250 1069457 1053439 1034478
58949 1034478 1013913 992509 970832 949019 926568 903563 881655 862686 846867 833591 823292
58938 823292 816895 813925 812755 812450 813003 814147 815388 816832 818652 820147 820684 820950 821763 822209 820630 816952
58922 816952 812357 807174 801040 794756 789903 786601 783518 780177 777411 775458 773466 771235 769799 769928
58908 769928 771452 774337 778987 785295 792738 801619 812921 826821 842644 860219 879806 900634 921085
$$ packed form
59002G90753Q84K583M100O004P650P885O930O092N724N055M021L487L585L420
58988H58173K698J991J261j92k074l063k752j997j202J10J783K917L551M743O625
58973H72572Q183R198J0598J2454J3552J3468J3244J3526J3813J3972J4625J5571
58961A024776J5686J4816J3843J2460R129L874j107m542p685j1793j6018j8961
58949A034478k0565k1404k1677k1813k2451k3005k1908j8969j5819j3276j0299
58938H23292o397k970j170l05N53J144J241J444J820J495N37K66Q13M46j579l678
58922H16952m595n183o134o284m853l302l083l341k766j953j992k231j436J29
58908G69928J524K885M650O308P443Q881J1302J3900J5823J7575J9587K0828K0451
$$ plain form
58895 921085 940556 959750 978995 997761 1016087 1035078 1055626 1077837 1101847 1127813 1154860
58884 1154860 1181224 1205637 1227353 1244889 1256338 1261337 1261416 1258010 1251198 1240598 1226294 1208645
58872 1208645 1188314 1166729 1145517 1125426 1106698 1090203 1076863 1066124 1056469 1047451 1039721 1033003
58860 1033003 1025725 1016987 1007472 997958 988216 977804 966888 955892 945245 935553 927086 919151 910953
58847 910953 902790 895253 887608 878410 867449 855594 843000 829247 815047 801924 790059 778268
58835 778268 766364 755750 747346 740629 735073 730827 727562 724318 721089 719052 718703 719182 719881 721320
58821 721320 723981 727680 732469 738729 745891 752419 757494 761501 764674 766708 767921 769231 770608 771016
58807 771016 770215 769053 767691 765191 761344 757282 753768 750343 746658 743080 739470 734949 729447 723974
$$ packed form
58895I21085J9471J9194J9245J8766J8326J8991K0548K2211K4010K5966K7047
58884A154860K6364K4413K1716J7536J1449M999P9l406o812j0600j4304j7649
58872A208645k0331k1585k1212k0091j8728j6495j3340j0739r655r018p730o718
58860A033003p278q738r515r514r742j0412j0916j0996j0647r692q467p935q198
58847I10953q163p537p645r198j0961j1855j2594j3753j4200j3123j1865j1791
58835G78268j1904j0614q404o717n556m246l265l244l229k037l49M79O99J439
58821G21320K661L699M789O260P162O528N075M007L173K034J213J310J377M08
58807G71016q01j162j362k500l847m062l514l425l685l578l610m521n502n473
$$ plain form
58793 723974 718853 713248 707013 701385 697180 693849 691028 689483 689763 691369 693977 698039 703408 708748
58779 708748 713155 717160 721434 725767 729877 733912 737505 739594 739754 738512 735928 731303 724729 717446
58765 717446 710110 702264 694114 687251 682814 680323 679012 678936 680140 682164 685007 689090 693669 696783 697584
58750 697584 697306 697327 697757 698583 700619 704397 709385 714993 721117 727332 733147 739429 747793 757941 767486
58735 767486 775205 782658 791714 802276 813373 824630 835518 844889 852456 859324 866092 872011 876856
58722 876856 881821 887419 892370 895884 899408 904670 911446 918590 925811 932991 939068 943042 945096 945647
58708 945647 944352 940920 935639 928292 918023 905050 890848 875679 857796 836277 812875 789776
58696 789776 767346 745561 725784 709269 695288 682512 670987 661189 652433 643923 636194 629877
$$ packed form
58793G23974n121n605o235n628m205l331k821j545K80J606K608M062N369N340
58779G08748M407M005M274M333M110M035L593K089J60j242k584m625o574p283
58765G17446p336p846q150o863m437k491j311p6J204K024K843M083M579L114Q01
58750F97584k78K1M30Q26K036L778M988N608O124O215N815O282Q364J0148R545
58735G67486P719P453R056J0562J1097J1257J0888R371P567O868O768N919M845
58722H76856M965N598M951L514L524N262O776P144P221P180O077L974K054N51
58708I45647j295l432n281p347j0269j2973j4202j5169j7883k1519k3402k3099
58696G89776k2430k1785j9777j6515j3981j2776j1525r798q756q510p729o317
$$ plain form
58684 629877 624081 617628 610965 605370 601171 598067 596217 595585 595142 594058 592959 592979 594483 597656 603148
58669 603148 611012 620141 629877 641078 654612 670038 686731 704841 723880 741662 755889 765628
58657 765628 770344 769093 762027 751255 738847 725240 710705 696777 684764 674258 664504 655909
58645 655909 648946 643087 638182 635398 635310 636523 637621 638994 641366 644106 646500 649069 652080 654363 655198
58630 655198 655629 656191 655169 651140 645620 641057 637564 633731 629389 625418 621993 619091 617715 618719 621367
58615 621367 624796 629736 637021 645592 653785 661435 668907 675258 679243 681120 681796 681405 680272 679840 680792
58600 680792 681616 680772 678896 677168 675213 672560 670423 669788 669426 668166 667592 669959 674859 680607 687675
58585 687675 698012 711817 727516 744161 761510 778466 793666 806963 818553 827718 834278 839942
$$ packed form
58684F29877n796o453o663n595m199l104j850o32m43j084j099K0J504L173N492
58669F03148P864R129R736J1201J3534J5426J6693J8110J9039J7782J4227R739
58657G65628M716j251p066j0772j2408j3607j4535j3928j2013j0506r754q595
58645F55909o963n859m905k784q8J213J098J373K372K740K394K569L011K283Q35
58630F55198M31N62j022m029n520m563l493l833m342l971l425k902j376J004K648
58615F21367L429M940P285Q571Q193P650P472O351L985J877O76l91j133m32R52
58600F80792Q24q44j876j728j955k653k137o35l62j260n74K367M900N748P068
58585F87675J0337J3805J5699J6645J7349J6956J5200J3297J1590R165O560N664
$$ plain form
58573 839942 846253 852679 858834 866840 878953 894487 911774 931599 955758 983689 1013701 1046237
58561 1046237 1082539 1120914 1157633 1190927 1220951 1246463 1264768 1274819 1277553 1273557 1263285 1249229
58549 1249229 1234965 1222015 1209978 1199215 1190755 1183904 1176594 1167827 1157357 1143581 1124513 1100635
58537 1100635 1074302 1046766 1018175 989828 963597 939571 916943 896832 881416 870566 861973
58526 861973 854358 847976 842408 836626 831096 827187 824701 822295 819933 818420 817095 814576 811224 808170
58512 808170 804595 798898 792049 786732 783441 780368 776864 774030 772034 769868 767674 766518 765906 764279
58498 764279 761822 760081 759023 757275 755059 754036 754363 754759 755335 757637 761999 767534 774430 783554 794152
58483 794152 804852 816540 831368 849299 868614 889272 912416 936815 959137 977665 992575
$$ packed form
58573H39942O311O426O155Q006J2113J5534J7287J9825K4159K7931L0012L2536
58561A046237L6302L8375L6719L3294L0024K5512J8305J0051K734l996j0272j4056
58549A249229j4264j2950j2037j0763q460o851p310q767j0470j3776j9068k3878
58537A100635k6333k7536k8591k8347k6231k4026k2628k0111j5416j0850q593
58526H61973p615o382n568n782n530l909k486k406k362j513j325k519l352l054
58512H08170l575n697o849n317l291l073l504k834j996k166k194j156o12j627
58498G64279k457j741j058j748k216j023L27L96N76K302M362N535O896R124J0598
58483G94152J0700J1688J4828J7931J9315K0658K3144K4399K2322J8528J4910
$$ plain form
58472 992575 1002731 1005657 1000986 990945 977355 960973 943522 927209 912331 898214 886158 878362
58460 878362 874528 872845 873793 879379 889105 900466 913172 928958 947354 965435 981594 995616 1005255
58447 1005255 1007112 1001334 991473 979451 964659 948128 933087 920620 908904 897572 888906 883861
58435 883861 880742 878614 878313 879401 879909 879882 881590 885693 890784 897004 906153 917797 929285 939980
58421 939980 951274 962034 968600 970022 968852 965981 959352 948807 937558 927421 916896 905233
58409 905233 894092 883853 872633 860411 850002 842567 836236 830322 826626 825369 824251 822894 823813
58396 823813 827643 831828 835338 840090 846279 851064 853484 856004 859464 861287 860529 859978 861287 862658 863331
58381 863331 865603 870154 874045 875662 877223 880294 883343 885869 890316 897568 905097 911801 920065 930788
$$ packed form
58472I92575J0156K926m671j0041j3590j6382j7451j6313j4878j4117j2056p796
58460H78362l834j683R48N586R726J1361J2706J5786J8396J8081J6159J4022R639
58447A005255J857n778r861j2022j4792j6531j5041j2467j1716j1332q666n045
58435H83861l119k128l01J088N08k7J708M103N091O220R149J1644J1488J0695
58421I39980J1294J0760O566J422j170k871o629j0545j1249j0137j0525j1663
58409I05233j1141j0239j1220j2222j0409p435o331n914l696j257j118j357R19
58396H23813L830M185L510M752O189M785K420K520L460J823p58n51J309J371O73
58381H63331K272M551L891J617J561L071L049K526M447P252P529O704Q264J0723
$$ plain form
58367 930788 941102 949498 958549 970155 982717 995423 1010466 1028340 1045705 1060562 1074892 1089596
58355 1089596 1101701 1109351 1114758 1119383 1121125 1119217 1116987 1116679 1116280 1114468 1113828 1116116 1119244 1122176
58341 1122176 1127976 1138646 1151641 1164685 1179395 1197035 1215497 1233465 1252681 1273095 1290940
58330 1290940 1304703 1317706 1331651 1343105 1349638 1353783 1357479 1358459 1355857 1353516 1353775 1353785 1351926 1351878
58316 1351878 1356144 1361592 1365857 1372040 1382403 1393481 1402413 1412191 1425567 1439589 1451364 1463482
58304 1463482 1478516 1493874 1507334 1521926 1540004 1558221 1573724 1589518 1608320 1627063 1643020
58293 1643020 1659377 1679112 1699392 1717646 1736953 1759632 1781934 1801103 1821243 1845950 1871676
58282 1871676 1894796 1918542 1946301 1974743 2000625 2027786 2060311 2095268 2129222 2165224 2206268
$$ packed form
58367I30788J0314Q396R051J1606J2562J2706J5043J7874J7365J4857J4330J4704
58355A089596J2105P650N407M625J742j908k230l08l99j812o40K288L128K932
58341A122176N800J0670J2995J3044J4710J7640J8462J7968J9216K0414J7845
58330A290940J3763J3003J3945J1454O533M145L696R80k602k341K59J0j859m8
58316A351878M266N448M265O183J0363J1078Q932R778J3376J4022J1775J2118
58304A463482J5034J5358J3460J4592J8078J8217J5503J5794J8802J8743J5957
58293A643020J6357J9735K0280J8254J9307K2679K2302J9169K0140K4707K5726
58282A871676K3120K3746K7759K8442K5882K7161L2525L4957L3954L6002M1044
$$ plain form
58271 2206268 2248720 2289602 2333311 2383547 2435843 2485825 2537487 2595229 2655290 2713379 2773068
58260 2773068 2837997 2903556 2965212 3027133 3093414 3158942 3218551 3277056 3340376 3405196 3467562
58249 3467562 3533058 3607681 3687169 3766265 3849764 3943284 4042223 4141530 4247053 4365201 4490930
58238 4490930 4618368 4753346 4902453 5060046 5219650 5387527 5570914 5764155 5961428
58229 5961428 6171468 6403728 6651891 6907833 7179594 7477876 7797519 8131260 8488908
58220 8488908 8883077 9309183 9760269 10247826 10786169 11370883 11996070 12677852 13436226
58211 13436226 14269834 15175173 16174123 17294745 18543579 19928116 21488377 23274661
58203 23274661 25316451 27651054 30363207 33560389 37335773 41798470 47112811 53464583
$$ packed form
58271B206268M2452M0882M3709N0236N2296M9982N1662N7742O0061N8089N9689
58260B773068O4929O5559O1656O1921O6281O5528N9609N8505O3320O4820O2366
58249C467562O5496P4623P9488P9096Q3499R3520R8939R9307J05523J18148J25729
58238D490930J27438J34978J49107J57593J59604J67877J83387J93241J97273
58229E961428K10040K32260K48163K55942K71761K98282L19643L33741L57648
58220H488908L94169M26106M51086M87557N38343N84714O25187O81782P58374
58211A3436226Q33608R05339R98950J120622J248834J384537J560261J786284
58203B3274661K041790K334603K712153L197182L775384M462697N314341O351772
$$ plain form
58195 53464583 61030630 70049845 80904137 94089744 110177191 129882071 154103418
58188 154103418 183764416 219600060 261959019 310148556 361057205 408180429 442893386
58181 442893386 458088599 451646731 426989494 390672572 349372753 308186298 270222989
58174 270222989 236707807 207393459 181377021 157932405 136804788 117993500 101494996
58167 101494996 87237947 75084265 64813331 56158230 48882553 42793263 37697208
58160 37697208 33402442 29762202 26673986 24038906 21761113 19780771 18067291 16580817
58152 16580817 15271547 14110361 13086461 12177898 11353766 10601088 9921036 9302254 8724493
58143 8724493 8184672 7693437 7248862 6837401 6457260 6117015 5813575 5533899 5276257
$$ packed form
58195E3464583P566047R019215J0854292J3185607J6087447J9704880K4221347
58188A54103418K9660998L5835644M2358959M8189537N0908649M7123224L4712957
58181D42893386J5195213o441868k4657237l6316922m1299819m1186455l7963309
58174B70222989l3515182k9314348k6016438k3444616k1127617j8811288j6498504
58167A01494996j4257049j2153682j0270934q655101p275677o089290n096055
58160C7697208m294766l640240l088216k635080k277793j980342j713480j486474
58152A6580817j309270j161186j023900r08563q24132p52678o80052o18782n77761
58143H724493n39821m91235m44575m11461l80141l40245l03440k79676k57642
$$ plain form
58134 5276257 5048210 4845155 4651275 4460670 4278750 4104644 3931071 3760466 3603095
58125 3603095 3459567 3321509 3188239 3066564 2955336 2846324 2739642 2643036 2556643 2473128
58115 2473128 2392107 2319953 2255994 2192960 2130564 2075059 2025820 1975688 1924118 1876919 1833368
58104 1833368 1786549 1736413 1689924 1648104 1605166 1560681 1520648 1486019 1451708 1417449 1388356
58093 1388356 1364186 1339099 1312673 1290372 1272429 1252925 1230751 1211080 1195004 1177945 1159370
58082 1159370 1143987 1131874 1117166 1098165 1079463 1062568 1043566 1021763 1001695 984693 966845
58071 966845 947199 929880 916212 902517 887456 874104 863217 851822 839899 831153 825728 819305
58059 819305 810814 803989 799920 794978 787512 779825 772293 762306 750370 740592 733755 726341 717459 710179
$$ packed form
58134E276257k28047k03055j93880j90605j81920j74106j73573j70605j57371
58125C603095j43528j38058j33270j21675j11228j09012j06682r6606q6393q3515
58115B473128q1021p2154o3959o3034o2396n5505m9239n0132n1570m7199m3551
58104A833368m6819n0136m6489m1820m2938m4485m0033l4629l4311l4259k9093
58093A388356k4170k5087k6426k2301j7943j9504k2174j9671j6076j7059j8575
58082A159370j5383j2113j4708j9001j8702j6895j9002k1803k0068j7002j7848
58071I66845j9646j7319j3668j3695j5061j3352j0887j1395j1923q746n425o423
58059H19305q491o825m069m942p466p687p532r987j1936r778o837p414q882p280
$$ plain form
58045 710179 704919 698270 689705 682810 678413 672976 665279 658233 652588 645239 635522 626924 620779 614267
58031 614267 606380 599875 595507 590145 582480 574951 568381 560417 550961 543388 538561 533313 526650 521760
58017 521760 519884 517876 514044 510936 510031 508913 506116 503721 502803 501255 498429 497168 498853 500958 501704
58002 501704 502632 504505 505293 504423 504473 506393 507471 506339 505629 507403 510201 512937 517432 524503 531346 535279
57986 535279 536622 535974 532411 526370 520537 515849 510150 502479 494863 488289 481055 472949 466874 464173
57972 464173 462444 460109 459041 460336 461625 461235 461138 463021 465031 465194 464705 465099 465342 464418 463767 464586 465524
57955 465524 465356 465086 465215 463949 460384 456526 453912 451199 447359 444161 443149 443065 442762 443835 447830 453511
57939 453511 459338 466165 475066 484940 494644 505184 517531 530509 542894 555289 567846 578398
$$ packed form
58045G10179n260o649q565o895m397n437p697p046n645p349r717q598o145o512
58031F14267p887o505m368n362p665p529o570p964r456p573m827n248o663m890
58017E21760j876k008l832l108r05j118k797k395r18j548k826j261J685K105P46
58002E01704R28J873P88q70N0J920J078j132p10J774K798K736M495P071O843L933
57986E35279J343o48l563o041n833m688n699p671p616o574p234q106o075k701
57972D64173j729k335j068J295J289l90r7J883K010J63m89L94K43r24o51Q19R38
57955D65524j68k70J29j266l565l858k614k713l840l198j012q4l03J073L995N681
57939D53511N827O827Q901R874R704J0540J2347J2978J2385J2395J2557J0552
$$ plain form
57927 578398 584900 587605 587126 582816 574873 565520 556129 545513 532834 519642 507199 494507 481069
57914 481069 468978 460052 453285 447251 442612 440111 438477 436586 435531 436464 438511 440738 443846 447939
57900 447939 450984 451600 451121 450923 450120 448006 446283 446606 448146 449866 452891 458300 464735 470642 476834
57885 476834 484517 492722 499919 506245 511987 515937 517462 518161 519209 519106 516233 511585 506661 500846 493381
57870 493381 485828 479887 474597 468332 461986 457602 455368 454329 454535 456170 458104 459639 462199 467113
57856 467113 473279 479141 485176 492175 498942 504186 509017 514995 521264 526090 529653 532832 534801 534528
57842 534528 533201 532482 531641 529041 525268 522166 519953 517857 516422 516509 517042 516368 515044 514811 515677 516345
57826 516345 516659 517248 517631 516942 515725 514828 513416 510256 505999 502067 498363 494170 490157 487132 483974
$$ packed form
57927E78398O502K705m79m310p943r353r391j0616j2679j3192j2443j2692j3438
57914D81069j2091q926o767o034m639k501j634j891j055R33K047K227L108M093
57900D47939L045O16m79j98q03k114j723L23J540J720L025N409O435N907O192
57885D76834P683Q205P197O326N742L950J525O99J048j03k873m648m924n815p465
57870D93381p553n941n290o265o346m384k234j039K06J635J934J535K560M914
57856D67113O166N862O035O999O767N244M831N978O269M826L563L179J969k73
57842E34528j327p19q41k600l773l102k213k096j435Q7N33o74j324k33Q66O68
57826E16345L14N89L83o89j217q97j412l160m257l932l704m193m013l025l158
$$ plain form
57811 483974 479276 474001 469927 466445 461416 454365 446309 437280 426639 415227 404653 394983 385459
57798 385459 376858 370673 366580 363133 360437 359672 360516 361492 362470 364423 367097 369316 371248 374071 377718
57783 377718 381257 385129 390707 397839 405105 412247 420211 429056 438002 447169 457009 466338 473317 478182
57769 478182 482660 486827 488881 488063 485481 481978 477440 472405 468125 464674 460900 456511 452429 448956
57755 448956 445465 442049 439647 438324 437112 435655 434365 432960 430568 427371 424509 422331 420308 418585
57741 418585 417919 418059 417851 416901 415641 413899 411054 407467 404109 400994 397595 394589 393304 393530 393721 393329
57725 393329 393238 393988 395310 397364 400630 404498 407605 409624 411245 412634 413521 414533 416665 419537 421866
57710 421866 423389 424637 425278 424656 423638 423749 424632 424515 423049 421459 419956 417456 413993 411005 408778
$$ packed form
57811D83974m698n275m074l482n029p051q056r029j0641j1412j0574r670r524
57798C85459q601o185m093l447k696p65Q44R76R78J953K674K219J932K823L647
57783C77718L539L872N578P132P266P142P964Q845Q946R167R840R329O979M865
57769D78182M478M167K054q18k582l503m538n035m280l451l774m389m082l473
57755D48956l491l416k402j323j212j457j290j405k392l197k862k178k023j723
57741D18585o66J40k08r50j260j742k845l587l358l115l399l006j285K26J91l92
57725C93329r1P50J322K054L266L868L107K019J621J389Q87J012K132K872K329
57710D21866J523J248O41o22j018J11Q83j17j466j590j503k500l463k988k227
$$ plain form
57695 408778 405921 401950 398202 395534 393132 390280 387408 384736 381691 378380 375908 374598 373563 372649
57681 372649 373088 375615 379621 384809 392091 402185 414908 430576 450598 476082 507317 545252 592039
57668 592039 649550 718723 800648 895981 1001422 1107045 1197752 1257669 1275233 1247836 1183391
57657 1183391 1096177 999717 903139 812473 732070 663683 606329 558470 519367 487917 462065
57646 462065 440389 422944 409703 399390 390607 382868 375971 369615 364197 360605 358605 356733 354263
57633 354263 351853 349824 347441 344562 342289 341129 340099 338603 337602 337855 338357 337732 335998 333891 331612
57618 331612 329334 327853 327620 327917 327934 327813 327827 327504 326455 325183 324188 323033 321095 318536 315849 313223
57602 313223 310975 309801 310008 311145 312810 314912 316846 317462 316408 314541 312578 310402 308095 306385 305432
$$ packed form
57695D08778k857l971l748k668k402k852k872k672l045l311k472j310j035r14
57681C72649M39K527M006N188P282J0094J2723J5668K0022K5484L1235L7935M6787
57668E92039N7511O9173Q1925R5333J05441J05623R0707N9917J7564k7397o4445
57657A183391q7214r6460r6578r0666q0403o8387n7354m7859l9103l1450k5852
57646D62065k1676j7445j3241j0313q783p739o897o356n418l592k000j872k470
57633C54263k410k029k383k879k273j160j030j496j001K53N02o25j734k107k279
57618C31612k278j481k33K97J7j21J4l23j049j272r95j155j938k559k687k626
57602C13223k248j174K07J137J665K102J934O16j054j867j963k176k307j710r53
$$ plain form
57587 305432 304362 302790 301690 301999 303272 304434 304898 304380 302605 299996 297764 296590 295973 295252 294383 293319
57571 293319 291777 290121 289337 289552 289674 289052 288309 287954 287421 286265 285106 284545 284232 283829 283894 284934 286474
57554 286474 287805 288781 289339 289258 289004 289734 291792 294280 296673 299576 303253 306761 309460 312111 315492 319074
57538 319074 322109 324872 327849 330725 333122 335201 336584 335948 332915 329193 326481 324243 320891 316328
57524 316328 311872 308297 305345 302720 300345 297890 295010 291718 287876 282957 277096 271705 268168 266500
57510 266500 265992 266401 267698 269482 271619 274771 279353 284601 289534 294180 298975 303619 307466 310484 313002
57495 313002 314989 316316 317181 317677 317614 317204 317088 317186 316617 315344 314674 315293 316081 315847 315002 314433 313971 313286
57477 313286 313090 313978 315067 315354 315532 316905 319232 321259 322757 324412 326164 327265 327723 328300 329249 330312
$$ packed form
57587C05432j070j572j100L09J273J162M64n18j775k609k232j174o17p21q69j064
57571B93319j542j656p84K15J22o22p43l55n33j156j159n61l13m03O5J040J540
57554B86474J331R76N58q1k54P30K058K488K393K903L677L508K699K651L381L582
57538C19074L035K763K977K876K397K079J383o36l033l722k712k238l352m563
57524C16328m456l575k952k625k375k455k880l292l842m919n861n391l537j668
57510B66500n08M09J297J784K137L152M582N248M933M646M795M644L847L018K518
57495C13002J987J327Q65M96o3m10j16R8n69j273o70O19P88k34q45n69m62o85
57477C13286j96Q88J089K87J78J373K327K027J498J655J752J101M58N77R49J063
$$ plain form
57461 330312 331606 333323 334913 335816 336615 338199 340192 341551 342404 343852 346144 348395 350097 351642 353347
57446 353347 355126 357174 359907 363122 366075 368435 370470 372489 374827 378048 382329 386923 391060 394917
57432 394917 398894 402485 404992 406935 409522 412913 416176 418828 421345 424236 427556 431193 434753 437371
57418 437371 438545 439012 439921 441465 443200 445294 448344 452223 456273 460489 465407 470866 475922 480048 483491
57403 483491 486472 488925 491031 493231 495660 498162 500686 503129 505169 506935 509315 512836 516755 520234
57389 520234 523820 528630 534520 540308 545560 550924 556869 563290 570251 577901 585599 592214 597375 601566
57375 601566 605136 608150 611189 615258 620754 627180 633738 639603 644108 647577 651571 657260 663919 670101
57361 670101 675772 681921 688409 693896 698060 702408 708407 715905 723821 731480 738920 746580 754924 763885
$$ packed form
57461C30312J294J717J590R03P99J584J993J359Q53J448K292K251J702J545J705
57446C53347J779K048K733L215K953K360K035K019K338L221M281M594M137L857
57432C94917L977L591K507J943K587L391L263K652K517K891L320L637L560K618
57418D37371J174M67R09J544J735K094L050L879M050M216M918N459N056M126L443
57403D83491K981K453K106K200K429K502K524K443K040J766K380L521L919L479
57389E20234L586M810N890N788N252N364N945O421O961P650P698O615N161M191
57375F01566L570L014L039M069N496O426O558N865M505L469L994N689O659O182
57361F70101N671O149O488N487M164M348N999P498P916P659P440P660Q344Q961
$$ plain form
57347 763885 772691 780745 788395 796173 803716 810374 816447 822825 829723 836895 844673 853515 862814 871536
57333 871536 879868 888895 898755 908560 918076 927941 938066 947419 955750 964146 973401 983156 993087 1003649
57319 1003649 1015015 1026425 1037304 1048150 1059696 1071976 1084654 1097497 1110120 1122040 1133416
57308 1133416 1145025 1157243 1169732 1182349 1195508 1209335 1223276 1236876 1250306 1263863 1277662
57297 1277662 1292004 1307263 1323219 1339214 1355201 1371884 1389649 1408068 1426683 1445579 1464991
57286 1464991 1484937 1505316 1525782 1545613 1564453 1583106 1602786 1623691 1645181 1667135 1689924
57275 1689924 1713071 1735216 1755842 1776041 1797194 1819644 1842856 1866081 1888780 1911183 1934461
57264 1934461 1959502 1985545 2010963 2035318 2059610 2084634 2110367 2136955 2164893 2193907 2222915
$$ packed form
57347G63885Q806Q054P650P778P543O658O073O378O898P172P778Q842R299Q722
57333H71536Q332R027R860R805R516R865J0125R353Q331Q396R255R755R931J0562
57319A003649J1366J1410J0879J0846J1546J2280J2678J2843J2623J1920J1376
57308A133416J1609J2218J2489J2617J3159J3827J3941J3600J3430J3557J3799
57297A277662J4342J5259J5956J5995J5987J6683J7765J8419J8615J8896J9412
57286A464991J9946K0379K0466J9831J8840J8653J9680K0905K1490K1954K2789
57275A689924K3147K2145K0626K0199K1153K2450K3212K3225K2699K2403K3278
57264A934461K5041K6043K5418K4355K4292K5024K5733K6588K7938K9014K9008
$$ plain form
57253 2222915 2251518 2280434 2310215 2340695 2371923 2404365 2437750 2470987 2503663 2536520 2570009
57242 2570009 2603645 2637301 2671906 2708184 2745704 2783756 2822165 2860745 2899048 2937219 2976015
57231 2976015 3015446 3054478 3092681 3130998 3170227 3209846 3249144 3288412 3328088 3367685 3406460
57220 3406460 3444441 3482005 3519206 3556298 3594188 3633566 3674176 3715540 3757759 3801153 3845891
57209 3845891 3892438 3941546 3993261 4046802 4101758 4158307 4215797 4272520 4327783 4382896 4438937
57198 4438937 4494600 4547499 4596677 4642565 4685318 4724741 4761475 4796828 4831517 4865566 4899257
57187 4899257 4933192 4967574 5002251 5037298 5072786 5108140 5142497 5175589 5207727 5239174 5270155
57176 5270155 5301132 5332441 5363853 5395093 5426498 5458575 5491155 5523498 5555050 5585627 5615149
$$ packed form
57253B222915K8603K8916K9781L0480L1228L2442L3385L3237L2676L2857L3489
57242B570009L3636L3656L4605L6278L7520L8052L8409L8580L8303L8171L8796
57231B976015L9431L9032L8203L8317L9229L9619L9298L9268L9676L9597L8775
57220C406460L7981L7564L7201L7092L7890L9378M0610M1364M2219M3394M4738
57209C845891M6547M9108N1715N3541N4956N6549N7490N6723N5263N5113N6041
57198D438937N5663N2899M9178M5888M2753L9423L6734L5353L4689L4049L3691
57187D899257L3935L4382L4677L5047L5488L5354L4357L3092L2138L1447L0981
57176E270155L0977L1309L1412L1240L1405L2077L2580L2343L1552L0577K9522
$$ plain form
57165 5615149 5643618 5671150 5697647 5722802 5746775 5770430 5794538 5819174 5844251 5870048 5896738
57154 5896738 5923942 5951380 5979523 6009009 6039755 6071121 6102534 6133394 6162671 6189211 6212350
57143 6212350 6231882 6247697 6259782 6268291 6273329 6274880 6273040 6267967 6259539 6247618 6232827 6216541
57131 6216541 6200033 6184270 6170613 6160787 6155732 6155159 6158594 6166171 6178018 6193655 6212460 6234103
57119 6234103 6258210 6284492 6313887 6348973 6392697 6447244 6514529 6596969 6696862 6815401 6952949
57108 6952949 7110179 7288916 7492747 7727891 8003662 8332027 8727083 9205322 9786446
57099 9786446 10494385 11358868 12417462 13716831 15311971 17263011 19630107 22468268
57091 22468268 25824064 29733713 34219802 39286181 44914290 51062925 57669287 64649141
$$ packed form
57165E615149K8469K7532K6497K5155K3973K3655K4108K4636K5077K5797K6690
57154E896738K7204K7438K8143K9486L0746L1366L1413L0860K9277K6540K3139
57143F212350J9532J5815J2085Q509N038J551j840n073q428j1921j4791j6286
57131F216541j6508j5763j3657r826n055n73L435P577J1847J5637J8805K1643
57119F234103K4107K6282K9395L5086M3724N4547O7285Q2440R9893J18539J37548
57108F952949J57230J78737K03831K35144K75771L28365L95056M78239N81124
57099I786446P07939Q64483J058594J299369J595140J951040K367096K838161
57091B2468268L355796L909649M486089N066379N628109O148635O606362O979854
$$ plain form
57083 64649141 71894486 79262443 86549827 93468325 99656079 104743281 108437644 110571938
57075 110571938 111095301 110043460 107523465 103707179 98810574 93061394 86678414 79870567
57067 79870567 72841508 65786919 58886366 52294648 46132984 40482297 35383802 30846768
57059 30846768 26857043 23383116 20382007 17805600 15604532 13729521 12133160 10772500
57051 10772500 9609840 8612071 7751221 7005455 6357570 5792236 5295737 4857625 4470363
57042 4470363 4127168 3821625 3548991 3305797 3088017 2891338 2713223 2552951 2409479
57033 2409479 2280779 2165166 2061573 1968559 1884798 1810636 1747505 1695860 1655381 1626988 1612647
57022 1612647 1613387 1629793 1663883 1716217 1778559 1831521 1852790 1829063 1761284 1661089 1543829
$$ packed form
57083F4649141P245345P367957P287384O918498O187754N087202L694363K134294
57075A10571938N23363j051841k519995l816286m896605n749180o382980o807847
57067G9870567p029059p054589o900553o591718o161664n650687n098495m537034
57059C0846768l989725l473927l001109k576407k201068j875011j596361j360660
57051A0772500j162660r97769q60850p45766o47885n65334m96499m38112l87262
57042D470363l43195l05543k72634k43194k17780j96679j78115j60272j43472
57033B409479j28700j15613j03593r3014q3761p4162o3131n1645m0479k8393j4341
57022A612647P40J6406L4090N2334O2342N2962K1269k3727o7779j00195j17260
$$ plain form
57011 1543829 1422867 1306817 1199917 1104255 1021120 950528 890763 839340 794224 754094 718164
57000 718164 686073 657500 631792 608361 587236 568535 551711 536134 522075 510155 500134
56989 500134 491414 484495 480693 480479 483364 489432 499683 514519 532630 551096 565633 571328 565063
56976 565063 547720 523138 495028 465911 438240 414264 394368 377291 362481 350821 342775 337511
56964 337511 334517 334574 338430 345846 356624 371387 390609 414011 441486 473133 507121 538219 559622
56951 559622 566356 557203 534518 502922 467486 432243 399966 372573 350874 334209 321416 312163
56939 312163 306556 303977 303716 306590 314529 328545 348389 374155 406735 446480 492329 541578 588552
56926 588552 623937 638433 628709 598968 556648 508145 458439 411718 370365 334519 303796 278524
$$ packed form
57011A543829j20962j16050j06900r5662q3135p0592n9765n1423m5116m0130l5930
57000G18164l2091k8573k5708k3431k1125j8701j6824j5577j4059j1920j0021
56989E00134q720o919l802k14K885O068J0251J4836J8111J8466J4537N695o265
56976E65063j7343k4582k8110k9117k7671k3976j9896j7077j4810j1660q046n264
56964C37511k994N7L856P416J0778J4763J9222K3402K7475L1647L3988L1098K1403
56951E59622O734r153k2685l1596l5436l5243l2277k7393k1699j6665j2793r253
56939C12163n607k579k61K874P939J4016J9844K5766L2580L9745M5849M9249M6974
56926E88552L5385J4496r724k9741m2320m8503m9706m6721m1353l5846l0723k5272
$$ plain form
56914 278524 258675 243035 230328 219963 211061 202190 193004 184788 178496 173463 168861 165021 162355
56901 162355 160273 158228 156670 155993 155654 155365 156081 158877 163846 170948 180790 193705 209281 227837
56887 227837 251165 280688 315807 354810 395827 435475 467910 487358 491630 482492 463554 438867
56875 438867 412526 387739 366100 348305 335084 326842 323311 324492 331257 344240 362989 387199
56863 387199 418015 457192 505805 564834 635952 719729 812172 903152 978336 1023900 1032226 1005427
56851 1005427 953471 888113 818282 750085 688347 636321 594939 563891 543116 532659 532174 541675
56839 541675 562124 594546 639558 698511 773961 868045 981304 1113003 1259392 1408606 1538672
56828 1538672 1624606 1650185 1614336 1528741 1411367 1280603 1150981 1031171 925117 834630
$$ packed form
56914B78524j9849j5640j2707j0365q902q871r186q216o292n033m602l840k666
56901A62355k082k045j558o77l39k89P16K796M969P102R842J2915J5576J8556
56887B27837K3328K9523L5119L9003M1017L9648L2435J9448M272r138j8938k4687
56875D38867k6341k4787k1639j7795j3221q242l531J181O765J2983J8749K4210
56863C87199L0816L9177M8613N9029P1118Q3777R2443R0980P5184M5564Q326k6799
56851A005427n1956o5358o9831o8197o1738n2026m1382l1048k0775j0457m85R501
56839E41675K0449L2422M5012N8953P5450R4084J13259J31699J46389J49214J30066
56828A538672Q5934K5579l5849q5595j17374j30764j29622j19810j06054r0487
$$ plain form
56818 834630 760486 702053 657592 625454 604690 594957 596678 610994 638953 681071 738190 811907
56806 811907 902812 1007605 1117204 1216619 1287415 1313940 1290775 1225211 1132206 1026961 921099
56795 921099 822279 734371 658243 593946 542003 502125 472184 450033 435417 428823 429710 437615
56783 437615 453852 480156 516348 561094 613663 671873 728204 770665 789040 779936 746523 695487
56771 695487 634511 570541 508625 452036 402865 361724 327367 297942 272597 251151 232867
56760 232867 216927 203646 193712 186427 180120 174170 169232 165504 162191 158770 155502 152567 149790 147272
56746 147272 145215 143139 140342 137161 134691 133281 132316 131402 130705 130179 129538 128977 128919 129137 129085 129015 129662 130916
56728 130916 131851 132122 132328 132922 133599 133773 133059 131483 129870 129537 130877 132816 134498 136723 140489 144889
$$ packed form
56818H34630p4144n8433m4461l2138k0764r733J721J4316K7959M2118N7119P3717
56806H11907R0905J04793J09599R9415P0796K6525k3165o5564r3005j05245j05862
56795I21099r8820q7908p6128o4297n1943l9878k9941k2151j4616o594Q87P905
56783D37615J6237K6304L6192M4746N2569N8210N6331M2461J8375r104l3413n1036
56771F95487o0976o3970o1916n6589m9171m1141l4357k9425k5345k1446j8284
56760B32867j5940j3281r934p285o307n950m938l728l313l421l268k935k777k518
56746A47272k057k076k797l181k470j410r65r14o97n26o41n61n8K18n2p0O47J254
56728A30916R35K71K06N94O77J74p14j576j613l33J340J939J682K225L766M400
$$ plain form
56712 144889 147925 148971 148970 148625 147966 147370 147434 147884 148085 148460 149898 151902 152954 152778 152642 153239 153816 153709
56694 153709 153327 153201 153251 153395 153796 154195 154032 153468 153357 154048 155103 156195 157385 158538 159500 160760 162917
56677 162917 165563 167705 169100 170121 170609 170162 169375 169377 170187 170837 171054 171473 172225 172780 173311 174804 177541
56660 177541 180664 183432 185812 187757 189131 190431 192401 194853 196914 198362 199570 200359 200246 199657 199463
56645 199463 199424 198584 197084 195910 194867 192570 188736 184778 181694 178830 175186 170608 165302 159494 153944
56630 153944 149622 146618 144444 143347 143948 145586 146566 146190 145109 143707 141824 140060 139458 139580 138816 137029
56614 137029 135992 136615 137607 137670 137282 137372 137824 138231 138843 139847 140848 141720 142837 144024 144597 144810 145771 147454
56596 147454 148436 148176 147897 148429 148926 148676 148595 149727 151615 153278 154720 156411 158315 160284 162424 164332
$$ packed form
56712A44889L036J046jl45o59n96O4M50K01L75J438K004J052j76j36N97N77j07
56694A53709l82j26N0J44M01L99j63n64j11O91J055J092J190J153R62J260K157
56677A62917K646K142J395J021M88m47p87KQ10O50K17M19P52N55N31J493K737
56660A77541L123K768K380J945J374J300J970K452K061J448J208P89j13n89j94
56645A99463l9q40j500j174j043k297l834l958l084k864l644m578n306n808n550
56630A53944m322l004k174j097O01J638R80l76j081j402j883j764o02J22p64j787
56614A37029j037O23R92O3l88R0M52M07O12J004J001Q72J117J187N73K13R61J683
56596A47454R82k60k79N32M97k50q1J132J888J663J442J691J904J969K140J908
$$ plain form
56580 164332 165063 164570 164084 164344 164643 164301 163836 163908 164303 164722 165456 166504 167206 167562 168779 171703 175784 180261
56562 180261 185234 190882 196845 203125 210420 218748 226890 233842 239691 244460 247483 248711 249344 250260 251023
56547 251023 251149 251058 250951 250117 248248 246177 244462 242539 240122 237992 236463 234506 231550 228714 227049
56532 227049 225859 224080 222120 220897 220124 219016 217868 217526 217865 218056 217837 217548 217287 216797 215734 213636
56516 213636 210366 206838 204334 202764 200795 198056 195727 194439 193170 191045 188698 186927 185399 183612
56502 183612 181738 179697 176917 173900 172357 172648 172865 171720 170643 171424 173427 174957 176079 178069 180998
56487 180998 183706 185574 186788 187408 187541 187921 189148 190861 192555 194437 196636 198470 199402 199780 199839 199101
56471 199101 197643 196685 196914 197435 197388 197270 197555 197441 196279 194945 194478 194522 194367 194300 194710 195166 195596 196952
$$ packed form
56580A64332P31m93m86K60K99l42m65P2L95M19P34J048P02L56J217K924M081M477
56562A80261M973N648N963O280P295Q328Q142O952N849M769L023J228O33R16P63
56547B51023J26r1j07q34j869k071j715j923k417k130j529j957k956k836j665
56532B27049j190j779j960j223p73j108j148l42L39J91k19k89k61m90j063k098
56516B13636l270l528k504j570j969k739k329j288j269k125k347j771j528j787
56502A83612j874k041k780l017j543K91K17j145j077P81K003J530J122J990K929
56487A80998K708J868J214O20J33L80J227J713J694J882K199J834R32L78N9p38
56471A99101j458r58K29N21m7j18K85j14j162j334m67M4j55o7M10M56M30J356
$$ plain form
56453 196952 199341 201046 200910 200295 200987 202578 203668 204360 205626 207238 208226 208609 209070 209752 210780 212890
56437 212890 216002 218302 218420 217520 217625 218887 220119 220957 221773 222374 222473 222622 223183 223363 222685 222225 222846 223427
56419 223427 222545 220776 219590 219137 218783 218686 219029 218903 217776 216885 217428 218589 219171 219750 221194 222538 222613
56402 222613 222465 223705 225605 226335 226094 226604 228302 230402 232875 235990 238751 240161 241246 243480 246059
56387 246059 247211 247350 248380 250536 252453 253688 254592 254340 251861 248295 245962 245238 244883 244825 245929 247501
56371 247501 247909 247481 248073 249845 251170 251627 252423 253822 254815 255502 257161 259695 261471 261971 262347 263103 263476
56354 263476 263385 263778 264820 265758 266730 268677 271339 273360 274396 275174 275654 275227 274626 275375 277313 278779 279219
56337 279219 279538 280078 280462 281330 283938 287959 291822 295173 298923 303057 306644 309791 313323 316738 318838
$$ packed form
56453A96952K389J705j36o15O92J591J090O92J266J612R88L83M61O82J028K110
56437B12890L112K300J18r00J05J262J232Q38Q16O01R9J49N61J80o78m60O21N81
56419B23427q82j769j186m53l54r7L43j26j127q91N43J161N82N79J444J344P5
56402B22613j48J240J900P30k41N10J698K100K473L115K761J410J085K234K579
56387B46059J152J39J030K156J917J235R04k52k479l566k333p24l55n8J104J572
56371B47501M08m28N92J772J325M57P96J399R93O87J659K534J776N00L76P56L73
56354B63476r1L93J042R38R72J947K662K021J036P78M80m27o01P49J938J466M40
56337B79219L19N40L84Q68K608M021L863L351L750M134L587L147L532L415K100
$$ plain form
56322 318838 320217 322676 326316 329586 331967 334119 335598 335226 333692 333109 333902 334765 335675 338095 342020
56307 342020 345588 347996 350225 352646 354558 356385 359657 364446 369359 374207 380054 386517 391883 396244
56293 396244 401630 408587 415442 421381 427387 433629 438899 443385 449186 457193 466034 474851 484498 495207
56279 495207 505641 515123 524494 534159 543621 553349 564605 577031 589020 600787 614323 629983
56267 629983 646117 662591 681547 703976 728534 754595 783493 815932 851149 889532 933108
56256 933108 982547 1036666 1095855 1162924 1239508 1324724 1418458 1522799 1638798 1764848 1899691
56245 1899691 2044115 2198011 2358416 2521979 2686812 2850437 3008333 3155944 3289919
56236 3289919 3406386 3500568 3569299 3611706 3626749 3613017 3571799 3507403 3423313 3320887 3202682
$$ packed form
56322C18838J379K459L640L270K381K152J479l72j534n83P93Q63R10K420L925
56307C42020L568K408K229K421J912J827L272M789M913M848N847O463N366M361
56293C96244N386O957O855N939O006O242N270M486N801Q007Q841Q817R647J0709
56279D95207J0434R482R371R665R462R728J1256J2426J1989J1767J3536J5660
56267F29983J6134J6474J8956K2429K4558K6061K8898L2439L5217L8383M3576
56256I33108M9439N4119N9189O7069P6584Q5216R3734J04341J15999J26050J34843
56245A899691J44424J53896J60405J63563J64833J63625J57896J47611J33975
56236C289919J16467R4182O8731M2407J5043j3732m1218o4396q4090j02426j18205
$$ plain form
56225 3202682 3073721 2938122 2797615 2654664 2513676 2377391 2245186 2116655 1993846
56216 1993846 1878319 1769064 1665342 1568722 1480384 1399043 1323320 1253592 1189895 1130721 1075567
56205 1075567 1025974 982495 943337 907421 875816 848584 823356 798870 776912 758869 743267
56194 743267 728552 715318 703869 692582 680759 670258 662297 655381 648271 642063 637453 632913 627561
56181 627561 622990 620257 617997 615400 613990 614495 615084 614760 615359 618024 620900 622529 624338 627485 630475
56166 630475 632355 635092 640279 646481 652293 658959 667551 676638 685274 695193 707530 720468 732665
56153 732665 745906 761864 779359 797405 817749 841875 868719 897920 931968 972512 1018092
56142 1018092 1068379 1127199 1198443 1282536 1379871 1493810 1626446 1774334 1931402 2092651
$$ packed form
56225C202682j28961j35599j40507j42951j40988j36285j32205j28531j22809
56216A993846j15527j09255j03722r6620q8338q1341p5723o9728o3697n9174n5154
56205A075567m9593m3479l9158l5916l1605k7232k5228k4486k1958j8043j5602
56194G43267j4715j3234j1449j1287j1823j0501p961o916p110o208m610m540n352
56181F27561m571k733k260k597j410N05N89l24N99K665K876J629J809L147K990
56166F30475J880K737N187O202N812O666Q592R087Q636R919J2337J2938J2197
56153G32665J3241J5958J7495J8046K0344K4126K6844K9201L4048M0544M5580
56142A018092N0287N8820P1244Q4093R7335J13939J32636J47888J57068J61249
$$ plain form
56132 2092651 2251720 2398753 2525328 2629679 2714632 2783754 2842321 2897567 2952976 3004197
56122 3004197 3043707 3067036 3072407 3058956 3029598 2992299 2953992 2915007 2871619 2820093 2755158
56111 2755158 2669337 2559016 2428822 2286703 2138072 1987936 1844125 1713339 1596884 1494170
56101 1494170 1406943 1336076 1277953 1228555 1187936 1156724 1131876 1110187 1092345 1079301 1068401
56090 1068401 1057470 1048829 1044728 1042741 1040228 1039248 1042175 1046593 1049628 1053316 1060481 1069300 1077210 1086142
56076 1086142 1098415 1111500 1122414 1133380 1147484 1162764 1176318 1190212 1207406 1225826 1242465
56065 1242465 1259303 1279055 1299096 1315714 1330335 1345494 1359003 1368456 1376999 1388095 1399169 1407209
56053 1407209 1415790 1429320 1445112 1458700 1472219 1489676 1508689 1525206 1541892 1563338 1587212
$$ packed form
56132B092651J59069J47033J26575J04351Q4953O9122N8567N5246N5409N1221
56122C004197L9510K3329N371j3451k9358l7299l8307l8985m3388n1526o4935
56111B755158q5821j10321j30194j42119j48631j50136j43811j30786j16455j02714
56101A494170q7227p0867n8123m9398m0619l1212k4848k1689j7842j3044j0900
56090A068401j0931q641m101j987k513r80K927M418L035L688P165Q819P910Q932
56076A086142J2273J3085J0914J0966J4104J5280J3554J3894J7194J8420J6639
56065A242465J6838J9752K0041J6618J4621J5159J3509R453Q543J1096J1074Q040
56053A407209Q581J3530J5792J3588J3519J7457J9013J6517J6686K1446K3874
$$ plain form
56042 1587212 1608748 1629819 1654919 1682304 1707825 1733343 1762599 1793084 1821005 1849830 1884641
56031 1884641 1922612 1958635 1995580 2038877 2085656 2129797 2173182 2221114 2271032 2317047 2361403
56020 2361403 2410157 2461686 2511038 2561339 2618922 2681360 2742496 2805021 2875574 2951767 3027077
56009 3027077 3104139 3189736 3280986 3370465 3460771 3559664 3665121 3770110 3877912 3997250
55999 3997250 4126284 4257202 4392532 4540503 4698426 4857745 5021566 5199679 5390332
55990 5390332 5585137 5787885 6009528 6248612 6496320 6756643 7041102 7347878 7667843
55981 7667843 8007005 8380418 8788139 9220815 9684648 10195969 10755688 11355556 12005222
55972 12005222 12725388 13519129 14379772 15322598 16377704 17557341 18864800 20330853 22005925
$$ packed form
56042A587212K1536K1071K5100K7385K5521K5518K9256L0485K7921K8825L4811
56031A884641L7971L6023L6945M3297M6779M4141M3385M7932M9918M6015M4356
56020B361403M8754N1529M9352N0301N7583O2438O1136O2525P0553P6193P5310
56009C027077P7062Q5597R1250Q9479R0306R8893J05457J04989J07802J19338
55999C997250J29034J30918J35330J47971J57923J59319J63821J78113J90653
55990E390332J94805K02748K21643K39084K47708K60323K84459L06776L19965
55981G667843L39162L73413M07721M32676M63833N11321N59719N99868O49666
55972A2005222P20166P93741Q60643R42826J055106J179637J307459J466053J675072
$$ plain form
55963 22005925 23923501 26112815 28644024 31620952 35139275 39301105 44263448 50221979
55955 50221979 57364050 65909549 76200663 88699918 103936661 122554839 145392643
55948 145392643 173391155 207392136 247966949 294927368 346056818 395764401 435535910
55941 435535910 457059404 456179520 434599632 398239063 354067255 307842007 263465295
55934 263465295 223191334 187992289 157978491 132827338 112032922 94971678 80976734
55927 80976734 69464446 59977715 52129288 45578439 40070087 35432054 31514774 28171702
55919 28171702 25295966 22824454 20694610 18833751 17193225 15753573 14489071 13359938
55911 13359938 12342892 11436433 10630611 9900559 9233423 8633163 8094487 7598295 7136685
$$ packed form
55963B2005925J917576K189314K531209K976928L518323M161830M962343N958531
55955E0221979P142071Q545499J0291114J2499255J5236743J8618178K2837804
55948A45392643K7998512L4000981M0574813M6960419N1129450M9707583L9771509
55941D35535910K1523494q79884k1579888l6360569m4171808m6225248m4376712
55934B63465295m0273961l5199045l0013798k5151153k0794416j7061244j3994944
55927H0976734j1512288r486731p848427o550849n508352m638033l917280l343072
55919B8171702k875736k471512k129844j860859j640526j439652j264502j129133
55911A3359938j017046r06459q05822p30052o67136o00260n38676m96192m61610
$$ plain form
55902 7136685 6717310 6339100 5987386 5656701 5355522 5084379 4830787 4589767 4368889
55893 4368889 4169106 3980139 3798745 3632888 3483953 3342605 3205938 3081573 2971014
55884 2971014 2865364 2761322 2665805 2581210 2501193 2424483 2358307 2304600 2256397 2210547 2170177
55873 2170177 2131975 2085222 2026972 1965315 1904670 1840741 1772799 1707725 1648161 1588922 1528813
55862 1528813 1474295 1427936 1384399 1341179 1302299 1268339 1233782 1197500 1165260 1138744 1112570
55851 1112570 1085186 1062043 1044577 1026376 1003940 981407 960998 938509 912098 886310 863622
55840 863622 840701 816533 795583 779407 763527 745905 730266 717974 705048 690428 678795
55829 678795 671839 664925 655805 648485 644974 641250 635043 629661 626295 620323 609428 598074 589798 582002
$$ packed form
55902G136685m19375l78210l51714l30685l01179k71143k53592k41020k20878
55893D368889j99783j88967j81394j65857j48935j41348j36667j24365j10559
55884B971014j05650j04042r5517q4595q0017p6710o6176n3707m8203m5850m0370
55873B170177l8202m6753n8250o1657o0645o3929o7942o5074n9564n9239o0109
55862A528813n4518m6359m3537m3220l8880l3960l4557l6282l2240k6516k6174
55851A112570k7384k3143j7466j8201k2436k2533k0409k2489k6411k5788k2688
55840H63622k2921k4168k0950j6176j5880j7622j5639j2292j2926j4620j1633
55829F78795o956o914r120p320l511l724o207n382l366n972j0895j1354q276p796
$$ plain form
55815 582002 572388 563728 558107 552951 546865 543331 544664 548107 551523 557142 566198 575636 583606 592601
55801 592601 603857 614249 621869 628963 636172 639607 636896 630473 621777 608101 588697 568183 550182
55788 550182 532933 514825 498877 487915 480328 474302 471215 471165 470019 464774 457540 450895 443953 436385
55774 436385 431565 432048 436215 442801 454303 472301 493436 513197 529544 539911 539628 527305 507800
55761 507800 486369 463672 439555 417034 398601 382571 367016 353731 344668 338000 331364 325626
55749 325626 321962 318598 313836 309117 305810 302206 296864 291678 288429 285603 281775 278865 278770 279901 280150
55734 280150 280133 280378 278676 273638 267896 264445 262590 260473 258592 257593 255563 250865 245093 240234 235596
55719 235596 230419 226572 225560 225605 224771 224305 225943 228728 231527 235887 243135 251243 257660 262829 267928
$$ packed form
55815E82002r614q660n621n156o086l534J333L443L416N619R056R438P970Q995
55801E92601J1256J0392P620P094P209L435k711o423q696j3676j9404k0514j8001
55788E50182j7249j8108j5948j0962p587o026l087n0j146n245p234o645o942p568
55774D36385m820M83M167O586J1502J7998K1135J9761J6347J0367k83j2323j9505
55761E07800k1431k2697k4117k2521j8433j6030j5555j3285r063o668o636n738
55749C25626l664l364m762m719l307l604n342n186l249k826l828k910r5J131K49
55734B80150j7K45j702n038n742l451j855k117j881r99k030m698n772m859m638
55719B35596n177l847j012M5q34m66J638K785K799M360P248Q108O417N169N099
$$ plain form
55704 267928 271762 272950 272699 272388 270818 266730 261470 256324 249909 241257 232782 226998 222868 218595 215337
55689 215337 214716 215120 214134 212552 212547 213880 215241 217376 221536 226659 231275 236352 243096 249860 254402 257342
55673 257342 260218 262040 261073 258308 255824 253341 249633 245801 243864 243411 242723 241968 242341 243434 244283 245665
55657 245665 248596 252007 254653 257729 262724 268270 272037 274156 275830 276123 273335 268173 262420 255717
55643 255717 246784 236670 227667 219983 212426 205333 199859 195373 190459 185616 182169 179461 175917 171968
55629 171968 169156 167276 165118 163099 162373 162162 160749 158398 156598 155237 153168 150850 149672 149199 147644
55614 147644 144682 141550 138905 136656 135164 134535 133565 131417 129327 128680 128639 127804 126791 126724 126661 125209 123414
55597 123414 123162 123838 123464 122185 121663 121833 121211 119844 119102 118969 118225 116965 116409 116634 116840 117292 118680
$$ packed form
55704B67928L834J188k51l11j570m088n260n146o415q652q475n784m130m273l258
55689B15337o21M04r86j582nJ333J361K135M160N123M616N077O744O764M542K940
55673B57342K876J822r67k765k484k483l708l832j937m53o88p55L73J093Q49J382
55657B45665K931L411K646L076M995N546L767K119J674K93k788n162n753o703
55643B55717q933j0114r003p684p557p093n474m486m914m843l447k708l544l949
55629A71968k812j880k158k019p26k11j413k351j800j361k069k318j178m73j555
55614A47644k962l132k645k249j492o29r70k148k090o47m1q35j013o7o3j452j795
55597A23414k52O76l74j279n22J70o22j367p42j33p44j260n56K25K06M52J388
$$ plain form
55580 118680 120175 120498 120288 121026 122350 122870 122847 123552 124718 125233 125666 127421 129950 131539 132375 134158 137049
55563 137049 139610 141429 143238 144756 144976 144362 144326 144816 144720 144226 144346 144549 143474 141658 140977 141657 142326
55546 142326 142769 143979 145693 146537 146646 147592 149613 151254 151934 152652 154105 156129 158854 162274 164853 164729
55530 164729 162210 159124 156118 152715 149392 147126 145236 142281 138786 136472 135075 132669 129062 126038
55516 126038 124169 122175 119742 118140 117508 116147 113234 109972 107424 105278 103254 101696 100263 98044
55502 98044 95430 93980 94106 94650 94915 95232 95450 94915 94074 94031 94444 93959 92787 92593 93587 94040 93118 92014
55484 92014 91822 92317 93221 94606 95623 94967 93109 92129 92788 93694 93787 93688 94108 94767 95498 96653 97952 98617
55466 98617 98932 99945 101372 101668 100495 99234 98697 98249 97544 97146 96936 95859 93920 92690 93127 94419
$$ packed form
55580A18680J495L23k10P38J324N20k3P05J166N15M33J755K529J589Q36J783K891
55563A37049K561J819J809J518K20o14l6M90r6m94J20K03j075j816o81O80O69
55546A42326M43J210J714Q44J09R46K021J641O80P18J453K024K725L420K579j24
55530A64729k519l086l006l403l323k266j890k955l495k314j397k406l607l024
55516A26038j869j994k433j602o32j361k913l262k548k146k024j558j433k219
55502I8044k614j450J26N44K65L17K18n35q41m3M13m85j172j94R94M53r22j104
55484I2014j92M95R04J385J017o56j858r80O59R06R3r9M20O59P31J155J299O65
55466I8617L15J013J427K96j173j261n37m48p05l98k10j077j939j230M37J292
$$ plain form
55450 94419 95486 96141 96438 96349 96402 97165 97956 97570 96285 95531 95642 95717 95574 95883 96407 96231 95781 96482 98262
55431 98262 99548 99858 100149 100474 99746 98195 97564 98285 98878 98727 99037 100255 101031 100757 100866 102460 104701
55414 104701 106583 108362 110167 111175 111302 111916 113715 115549 116309 116308 115917 114602 112367 110489 109753 109487
55398 109487 109165 109322 109965 109802 108165 106195 105127 104755 104458 104238 103885 102622 100482 98702 98032 97961 98177
55381 98177 99132 100598 101394 101330 101656 102800 103459 102839 101983 101865 101925 101625 101755 102993 104589 105593 106036 105992
55363 105992 104932 102979 101308 100392 99316 97704 96708 97094 97972 98430 98858 99541 99614 98627 97628 97506 97638
55346 97638 97329 97144 97618 98114 98154 98545 99953 101651 102829 103799 104795 105068 104461 104429 105992 107901 108253 106941
55328 106941 105211 103732 102408 101250 100295 99335 98491 98235 98297 97703 96459 95810 96228 96654 96544 96937 98525
$$ packed form
55450I4419J067O55K97q9N3P63P91l86j285p54J11P5j43L09N24j76m50P01J780
55431I8262J286L10K91L25p28j551o31P21N93j51L10J218P76k74J09J594K241
55414A04701J882J779J805J008J27O14J799J834P60jl91j315k235j878p36k66
55398A09487l22J57O43j63j637j970j068l72k97k20l53j263k140j780o70p1K16
55381I8177R55J466P96o4L26J144O59o20q56j18O0l00J30J238J596J004M43m4
55363A05992j060j953j671r16j076j612r96L86Q78M58M28O83P3r87r99j22J32
55346I7638l09j85M74M96M0L91J408J698J178R70R96K73o07l2J563J909L52j312
55328A06941j730j479j324j158r55r60q44k56O2n94j244o49M18M26j10L93J588
$$ plain form
55311 98525 100288 101227 101831 102650 103010 102469 102008 102324 102394 101204 99554 98612 98001 96910 95928 96126 97243 98252
55293 98252 98938 99610 100157 100556 101379 102683 103407 102990 102459 102857 103780 104546 105485 106859 107852 107888 107655 107564 106731
55274 106731 104939 103959 105077 106729 106591 104903 103621 103279 102831 101973 101514 101683 101871 101891 102137 102645 103162
55257 103162 103780 104539 104974 104987 105379 106506 107335 106933 105979 105657 106036 106692 107856 109593 110875 110877 110289 110034
55239 110034 109684 108500 106975 105914 104988 103660 102553 102453 102967 103537 104596 106196 106800 105292 103034 102062
55223 102062 102284 102352 102245 102843 103824 104249 104547 105741 107257 107638 106995 106645 106721 106245 105271 104841 105017 104953 104756
55204 104756 105341 106483 106879 106135 105009 103881 102672 102057 102899 104555 105543 105788 106449 107706 108614 109135 110305
55187 110305 112174 113446 113410 112626 111523 109959 108363 107612 107551 107245 106847 107497 109099 109975 109288 108185 107925
$$ packed form
55311I8525J763R39O04Q19L60n41m61L16P0j190j650r42o11j091r82J98J117J009
55293I8252O86O72N47L99Q23J304P24m17n31L98R23P66R39J374R93L6k33r1q33
55274A06731j792r80J118J652j38j688j282l42m48q58m59J69J88K0K46N08N17
55257A03162O18P59M35J3L92J127Q29m02r54l22L79O56J164J737J282Kn88k55
55239A10034l50j184j525j061r26j328j107j00N14N70J059J600O04j508k258r72
55223A02062K22O8j07N98R81M25K98J194J516L81o43l50P6m76r74m30J76o4j97
55204A04756N85J142L96p44j126j128j209o15Q42J656R88K45O61J257R08N21J170
55187A10305J869J272l6p84j103j564j596p51o1l06l98O50J602Q76o87j103k60
$$ plain form
55170 107925 108289 108494 108463 108495 108655 109012 109664 110243 110224 109859 109972 110787 111870 113087 114592 115968 116534 116436 116333
55151 116333 116131 115248 113929 112972 112241 110904 109163 108253 108526 108953 108870 108898 109721 111039 112155 112705 112607 112121
55133 112121 111993 112675 113463 113360 112612 112361 112987 113885 114637 115197 115236 114647 114437 115603 117309 117760 116782 115822
55115 115822 115397 114379 112183 109901 108710 108587 109197 110670 112861 115037 116772 118207 119178 119234 118737 118633
55099 118633 118912 118668 117942 117980 119177 120252 120164 119472 119102 119012 118878 118928 119234 119192 118545 118119 118725 120070 121396
55080 121396 122496 123474 124200 124608 125033 125730 126513 127116 127453 127412 127002 126758 127246 128082 128242 127407 126186 125006
55062 125006 123760 122626 122158 122308 122346 122022 121840 121950 121765 121075 120598 121040 122289 123858 125373 126469 126919
55045 126919 126977 126957 126545 125372 124025 123469 123616 123605 123341 123421 123649 123159 122173 122024 123063 124033 123999 123462 122990
$$ packed form
55170A07925L64K05l1L2J60L57O52N79j9l65J13Q15J083J217J505J376N66r8j03
55151A16333k02q83j319r57p31j337j741r10K73M27q3K8Q23J318J116N50r8m86
55133A12121j28O82P88j03p48k51O26Q98P52N60L9n89k10J166J706M51r78r60
55115A15822m25j018k196k282j191j23O10J473K191K176J735J435R71N6m97j04
55099A18633K79k44p26L8J197J075q8o92l70r0j34N0L06m2o47m26O06J345J326
55080A21396J100R78P26M08M25O97P83O03L37m1m10k44M88Q36J60q35j221j180
55062A25006j246j134m68J50L8l24j82J10j85o90m77M42J249J569J515J096M50
55045A26919N8k0m12j173j347n56J47j1k64Q0K28m90r86j49J039R70l4n37m72
$$ plain form
55026 122990 122283 121353 121243 122552 124324 125306 125431 125286 125070 124940 125510 127031 128656 129279 128710 127523 126307
55009 126307 125501 125354 125577 125584 125388 125639 126564 127588 128306 128999 129884 130618 130938 131096 131341 131603 131871 132224 132375
54990 132375 132007 131574 131880 132804 133447 133568 133708 133838 133203 131832 130851 130845 131119 131079 131116 131557 131991 132269 133056 134644
54970 134644 136246 137208 137929 138904 139766 140039 139966 139921 139807 139677 140149 141560 143416 145178 146832 148289 149110
54953 149110 149253 149218 149044 148170 146684 145608 145404 145309 144770 144387 144731 145312 145554 145816 146657 147935 149337 150949
54935 150949 152600 153583 153781 154209 155716 157993 160531 163628 167729 172671 178365 185334 193821 203152 212641
54920 212641 222239 231631 239633 245191 248147 248419 245566 239947 233188 226492 219424 211258 202541 194325
54906 194325 186792 179681 173275 167975 163634 160182 158110 157494 157431 157316 157682 158830 159748 159574 159191 160053
$$ packed form
55026A22990p07r30j10J309J772R82J25j45k16j30N70J521J625O23n69j187j216
55009A26307q06j47K23Pj96K51R25J024P18O93Q85P34L20J58K45K62K68L53J51
54990A32375l68m33L06R24O43J21J40J30o35j371r81oK74m0L7M41M34K78P87J588
54970A34644J602R62P21R75Q62K73p3m5j14j30M72J411J856J762J654J457Q21
54953A49110J43l5j74q74j486j076k04r5n39l83L44N81K42K62Q41J278J402J612
54935A50949J651R83J98M28J507K277K538L097M101M942N694O969Q487R331R489
54920B12641R598R392Q002N558K956K72k853n619o759o696p068q166q717q216
54906A94325p533p111o406n300m341l452k072o16o3j15L66J148R18j74l83Q62
$$ plain form
54890 160053 162168 164478 166513 168493 170448 172481 175330 179547 184730 190559 197815 207181 217740 227877
54876 227877 236956 244875 250753 253572 253600 251743 247885 241281 232321 222575 213303 205039 198197 192802 187908
54861 187908 182522 176886 171766 167002 162050 157446 154212 152071 149827 147365 145688 144937 144030 142526 141297
54846 141297 140868 140462 139365 138164 137832 138312 138647 138057 136457 134292 132155 130361 128893 127947 128178 129853
54830 129853 132060 133455 133630 133167 132632 132253 132266 132706 132978 132487 131639 131471 132298 133453 134296 134784 135090 135297
54812 135297 135499 135660 135543 135255 135551 136933 138773 140065 140723 141344 141928 141836 140939 140009 139870 140773 142507 144523
54794 144523 146081 146824 147052 146942 146049 144277 142781 142876 144360 145920 146962 147977 149240 150424 151575 153411
54778 153411 156298 159687 162868 165722 168644 172266 177269 183903 191693 200051 208921 218272 227308 235023
$$ packed form
54890A60053K115K310K035J980J955K033K849M217N183N829P256R366J0559J0137
54876B27877R079P919N878K819K8j857l858o604q960r746r272q264o842n395m894
54861A87908n386n636n120m764m952m604l234k141k244k462j677p51r07j504j229
54846A41297m29m06j097j201l32M80L35n90j600k165k137j794j468r46K31J675
54830A29853K207J395J75m63n35l79J3M40K72m91q48j68Q27J155Q43M88L06K07
54812A35297K02J61j17k88K96J382J840J292O58O21N84r2q97r30j39R03J734K016
54794A44523J558P43K28j10q93j772j496R5J484J560J042J015J263J184J151J836
54778A53411K887L389L181K854K922L622N003O634P790Q358Q870R351R036P715
$$ plain form
54764 235023 241295 246641 250997 253555 253651 251076 245733 237939 228954 220314 212578 205485 199128 194053 190163
54749 190163 186524 182432 177984 173609 169740 166909 165357 164521 163593 162561 161949 161764 161548 161393 161880 163056
54733 163056 164436 166099 168804 172824 177594 182702 188388 194854 201937 209722 218612 228426 238066 246317
54719 246317 252362 255413 254748 250510 243851 235913 227162 217905 208821 200565 193266 186732 180882 175843
54705 175843 171854 169058 167104 165224 163091 161310 160498 160238 159665 158735 158001 157342 155958 153678 151346 149807
54689 149807 149299 149841 151236 152552 152590 151202 149452 148293 147798 147731 147968 148141 147716 146710 145608 144432 142768
54672 142768 140912 139995 140489 141447 141810 141731 142035 142932 143895 144422 144380 143844 142973 141884 140518 138906 137627 137542
54654 137542 138914 141132 143320 144903 145714 146150 147083 148953 150946 151739 151115 150085 149428 148965 148435 148167
$$ packed form
54764B35023O272N346M356K558R6k575n343p794q985q640p736p093o357n075l890
54749A90163l639m092m448m375l869k831j552q36r28j032o12j85k16j55M87J176
54733A63056J380J663K705M020M770N108N686O466P083P785Q890R814R640Q251
54719B46317O045L051o65m238o659p938q751r257r084q256p299o534n850n039
54705A75843l989k796j954j880k133j781q12k60n73r30p34o59j384k280k332j539
54689A49807n08N42J395J316L8j388j750j159m95o7K37J73m25j006j102j176j664
54672A42768j856r17M94R58L63p9L04Q97R63N27m2n36q71j089j366j612j279q5
54654A37542J372K218K188J583Q11M36R33J870J993P93o24j030o57m63n30k68
$$ plain form
54638 148167 148442 148897 149038 148861 148644 148544 148619 148784 148627 147760 146464 145383 144566 143480 142074 141020 140707
54621 140707 140760 140889 141419 142553 143795 144594 145028 145380 145556 145400 145172 145220 145444 145479 145199 144836 144780 145331 146378
54602 146378 147306 147610 147557 147817 148458 148921 148977 149060 149481 149958 150120 149984 149768 149729 150173 151082 151704 151261 150124 149522
54582 149522 149940 150574 150582 150065 149467 148863 148268 147944 147849 147411 146421 145610 145794 146816 147815 148210 148020 147581 147401
54563 147401 148022 149593 151600 153259 154108 154262 154296 154773 155587 155931 155337 154552 154744 156023 157493 158669 159967
54546 159967 161733 163686 165564 167483 169340 170614 171097 171193 171199 170951 170434 169993 169614 168727 167149 165555 164606
54529 164606 164169 163801 163427 163174 163059 163142 163459 163551 162752 161170 159681 158653 157532 156057 154988 154959 155415 155457
54511 155457 155197 155456 156473 157623 158137 157625 156157 154325 152947 152382 152321 152495 153086 154132 155020 155080 154356
$$ packed form
54638A48167K75M55J41j77k17j00P5J65j57q67j296j081q17j086j406j054l13
54621A40707N3J29N30J134J242P99M34L52J76j56k28M8K24L5k80l63n6N51J047
54602A46378R28L04n3K60O41M63N6Q3M21M77J62j36k16l9M44R09O22m43j137o02
54582A49522M18O34Qn17n98o04n95l24r5m38r90q11J84J022R99L95j90m39j80
54563A47401O21J571K007J659Q49J54L4M77Q14L44n94p85J92J279J470J176J298
54546A59967J766J953J878J919J857J274M83R6Ok48n17m41l79q87j578j594r49
54529A64606m37l68l74k53j15Q3L17R2p99j582j489j028j121j475j069k9M56M2
54511A55457k60K59J017J150N14n12j468j832j378n65o1J74N91J046Q88O0p24
$$ plain form
54494 154356 153423 152761 152581 152969 153875 155183 156848 158633 159813 159797 159058 158753 159314 160201 161119 162450 164164
54477 164164 165412 165888 166653 168789 171854 174428 175637 175514 174470 173192 172578 172997 173900 174663 175418 176545
54461 176545 177837 178817 179444 179860 179787 178868 177342 175897 174976 174559 174250 173368 171542 169570 168979 170135 171416
54444 171416 170959 168759 166397 165186 165317 166371 167794 168999 169714 170195 170725 171119 171111 170850 170590 170323 170146
54427 170146 170505 171515 172537 173012 173229 173622 173855 173399 172626 172434 172950 173428 173314 172755 172135 171749 171852 172463
54409 172463 173153 173484 173591 173925 174613 175488 176522 177743 178936 179862 180625 181409 182075 182369 182292 181890 181063 180051
54391 180051 179704 180705 182725 184849 186532 187707 188292 188243 187868 187567 187366 187152 187091 187344 187641 187608 187345 187203
54373 187203 187270 187453 187798 188300 188742 189252 190618 193464 197376 201410 205258 209330 213867 218506 222621 225677
$$ packed form
54494A54356r33o62j80L88R06J308J665J785J180j6p39l05N61Q87R18J331J714
54477A64164J248M76P65K136L065K574J209j23j044j278o14M19R03P63P55J127
54461A76545J292R80O27M16p3r19j526j445r21m17l09q82j826j972n91J156J281
54444A71416m57k200k362j211J31J054J423J205P15M81N30L94qk61k60k67j77
54427A70146L59J010J022M75K17L93K33m56p73j92N16M78j14n59o20l86J03O11
54409A72463O90L31J07L34O88Q75J034J221J193R26P63P84O66K94p7m02q27j012
54391A80051l47J001K020K124J683J175N85m9l75l01k01k14o1K53K97l3k63j42
54373A87203O7J83L45N02M42N10J366K846L912M034L848M072M537M639M115L056
$$ plain form
54357 225677 227373 227790 227247 225803 223279 219955 216681 213881 210999 207441 203541 200065 197303 195284 194201
54342 194201 193862 193247 191582 189475 188102 187591 187104 186222 185263 184382 183389 182449 182027 182047 181950 181632 181579 181943 182248
54323 182248 182216 182168 182408 182782 183109 183520 184088 184540 184583 184293 184019 184040 184334 184527 184207 183457 182903 182944 183173 182890
54303 182890 181965 180786 179578 178183 176471 174689 173435 173316 174299 175404 175546 174848 174465 174912 175436 175475 175759
54286 175759 177122 179019 180259 180672 181009 181591 182095 182396 182655 182756 182596 182713 183693 185093 185900 185972 186057 186487
54268 186487 186811 186786 186781 187049 187417 187877 188708 189914 191241 192852 195233 198208 200790 202280 203005 203713 204735
54251 204735 205837 206501 206202 204871 203115 201659 200593 199519 198312 197261 196557 196068 195531 194649 193206 191463
54235 191463 190121 189483 189048 188391 187880 187903 188004 187643 187301 187800 188904 189721 190203 191133 192689 194157 195109 195793
$$ packed form
54357B25677J696M17n43j444k524l324l274k800k882l558l900l476k762k019j083
54342A94201l39o15j665k107j373n11m87q82r59q81r93r40m22K0r7l18n3L64L05
54323A82248l2m8K40L74L27M11N68M52M3k90k74K1K94J93l20p50n54M1K29k83
54303A82890r25j179j208j395j712j782j254j19R83J105J42o98l83M47N24L9K84
54286A75759J363J897J240M13L37N82N04L01K59J01j60J17R80J400Q07P2Q5M30
54268A86487L24k5nK68L68M60Q31J206J327J611K381K975K582J490P25P08J022
54251B04735J102O64k99j331j756j456j066j074j207j051p04m89n37q82j443j743
54235A91463j342o38m35o57n11K3J01l61l42M99J104Q17M82R30J556J468R52O84
$$ plain form
54217 195793 196320 196450 196332 196473 196809 196704 196012 195270 194727 194083 193354 193022 193079 192796 191818 190709 190088 189905 189820
54198 189820 189674 189372 188966 188969 189919 191432 192377 192144 191163 190061 189056 188330 188212 188741 189553 190331 190923 191129
54180 191129 190967 190973 191483 191861 191351 190470 190431 191272 191796 191418 190813 190519 190208 189742 189655 190015 189924 188831 187413 186528
54160 186528 186231 186396 187325 189015 190581 191199 190987 190357 189268 187780 186647 186542 187166 187708 187759 187318 186495
54143 186495 185763 185907 187088 188415 188982 188897 188852 189177 189834 190839 192196 193692 195060 195963 195756 193963 191324
54126 191324 189554 189642 190974 192518 194042 195707 197310 198640 199981 201586 203170 204508 205938 207715 209421
54111 209421 210624 211570 212663 213870 215262 217545 221340 226357 231993 238318 245881 254824 264689 274554
54097 274554 282902 287986 289098 287123 283367 278382 272493 266729 262268 259301 257230 255730 254914 254760 255036
$$ packed form
54217A95793N27J30j18J41L36j05o92p42n43o44p29l32N7k83r78j109o21j83q5
54198A89820j46l02m06LR50J513R45k33r81j102j005p26j18N29Q12P78N92K06
54180A91129j62ON10L78n10q81l9Q41N24l78o05k94l11m66q7L60r1j093j418q85
54160A86528k97J65R29J690J566O18k12o30j089j488j133j05O24N42N1m41q23
54143A86495p32J44J181J327N67q5m5L25O57J005J357J496J368R03k07j793k639
54126A91324j770Q8J332J544J524J665J603J330J341J605J584J338J430J777J706
54111B09421J203R46J093J207J392K283L795N017N636O325P563Q943R865R865
54097B74554Q348N084J112j975l756m985n889n764m461k967k071j500q16j54K76
$$ plain form
54082 255036 255622 256327 256684 256392 255583 254236 251847 248247 244137 240181 236177 231923 228204 225930 224777
54067 224777 223762 222772 222331 222093 220961 218844 217074 216687 217207 217611 217667 217732 217840 217662 217187 216955 217521 218825
54049 218825 220156 220842 221088 221900 223996 227021 230095 232850 235566 238535 241785 245302 249101 253135 257454
54034 257454 262346 268004 274158 280385 286594 292842 298849 304114 308506 312411 316290 320244 323888 326532
54020 326532 327805 328311 329299 331315 333486 334501 334011 332637 330948 328917 326207 322522 317771 312304 306816
54005 306816 301663 296417 290492 284104 278205 273567 270192 267539 265112 262949 261596 261357 261477 260607 258319
53990 258319 255700 254039 253395 252848 251674 249803 247560 245556 244419 244045 243477 242094 240547 239859 239969 239975
53974 239975 239503 238975 238626 238159 237523 237290 237996 239613 241846 244527 247644 251335 255943 261704 268370 275538
$$ packed form
54082B55036N86P05L57k92q09j347k389l600m110l956m004m254l719k274j153
54067B24777j015r90m41k38j132k117j770l87N20M04N6O5J08j78m75k32N66J304
54049B18825J331O86K46Q12K096L025L074K755K716K969L250L517L799M034M319
54034B57454M892N658O154O227O209O248O007N265M392L905L879L954L644K644
54020C26532J273N06R88K016K171J015m90j374j689k031k710l685m751n467n488
54005C06816n153n246n925o388n899m638l375k653k427k163j353k39J20q70k288
53990B58319k619j661o44n47j174j871k243k004j137l74n68j383j547o88J10O
53974B39975m72n28l49m67o36k33P06J617K233K681L117L691M608N761O666P168
$$ plain form
53958 275538 283402 292923 305144 320379 337733 355031 369396 378498 381439 378544 370727 359487 346995
53945 346995 335380 325724 318126 312538 309002 307159 306190 305509 305180 305533 306679 308505 310867 313623 316553
53930 316553 319324 321531 322891 323456 323554 323533 323775 324843 327170 330501 334141 337907 342326 347753 353838 360190
53914 360190 366949 374250 381762 389269 397172 405791 414609 422785 429982 436079 440610 443268 444625 445528
53900 445528 445949 445161 442890 439605 435826 431814 427778 423727 419175 413625 407297 400839 394502 388152 381919
53885 381919 376097 370454 364285 357226 349546 341712 334163 327375 321593 316540 311836 307530 303753 300120
53871 300120 296126 292000 288520 286011 284051 282057 279669 276723 273407 270322 267875 265832 263896 262308
53857 262308 261185 259735 257057 253522 250433 248455 247270 246586 246435 246448 245941 244996 244489 244724 244882 244213 243076
$$ packed form
53958B75538P864R521J2221J5235J7354J7298J4365R102K941k895p817j1240j2492
53945C46995j1615r656p598n588l536j843r69o81l29L53J146J826K362K756K930
53930C16553K771K207J360N65R8k1K42J068K327L331L640L766M419N427O085O352
53914C60190O759P301P512P507P903Q619Q818Q176P197O097M531K658J357R03
53900D45528M21p88k271l285l779m012m036m051m552n550o328o458o337o350o233
53885C81919n822n643o169p059p680p834p549o788n782n053m704m306l777l633
53871C00120l994m126l480k509j960j994k388k946l316l085k447k043j936j588
53857B62308j123j450k678l535l089j978j185o84j51J3n07r45n07K35J58o69j137
$$ plain form
53840 243076 242365 242435 242936 243277 242997 242118 241254 240981 241090 240968 240673 240942 242062 243412 244365 245006 245758 246797
53822 246797 248038 249241 250022 250216 250242 250659 251404 252070 252760 253893 255240 256079 256444 257304 259179 261446 263402
53805 263402 265277 267765 271214 275677 281084 286877 292066 296217 299990 304259 309141 314251 319464 324829
53791 324829 330033 334450 337698 339950 341817 343901 346197 347874 348049 346772 344864 342831 340552 337983
53777 337983 335406 332740 329326 324765 319438 313909 308370 303005 298290 294485 291270 288283 285591 283271
53763 283271 280986 278397 275625 272941 270358 267875 265740 264039 262336 260190 257844 255973 254858 254013
53749 254013 252644 250359 247566 245164 243665 242722 241790 241038 241032 241681 242204 242268 242418 243195 244491 246052 247900
53732 247900 249843 251221 251704 251912 252727 254258 255884 257030 257556 257680 257776 258030 258167 257894 257768 258969 261854
$$ packed form
53840B43076p11P0N01L41k80q79q64k73J09j22k95K69J120J350R53O41P52J039
53822B46797J241J203P81J94K6M17P45O66O90J133J347Q39L65Q60J875K267J956
53805B63402J875K488L449M463N407N793N189M151L773M269M882N110N213N365
53791C24829N204M417L248K252J867K084K296J677J75j277j908k033k279k569
53777C37983k577k666l414m561n327n529n539n365m715l805l215k987k692k320
53763B83271k285k589k772k684k583k483k135j701j703k146k346j871j115q45
53749B54013j369k285k793k402j499r43r32p52oO49N23O4J50P77J296J561J848
53732B47900J943J378M83K08Q15J531J626J146N26J24R6K54J37k73j26J201K885
$$ plain form
53715 261854 265285 267873 269488 271074 273296 275954 278520 280772 282848 284961 287098 288983 290493 292034
53701 292034 294180 296948 299862 302732 305905 309587 313510 317405 321280 324984 328034 330174 331677 332862
53687 332862 333733 334323 334875 335450 335834 336025 336259 336301 335385 333216 330493 328113 326453 325694 326103 327432 328716
53670 328716 329347 329814 330790 331962 332425 331880 330756 329498 328364 327749 328031 329139 330631 332071 333143 333737
53654 333737 334192 335006 335972 336127 334972 333226 331937 331404 331495 332337 333909 335454 336194 336288 336358 336434 336273 336388
53636 336388 337685 340121 342660 344704 346691 349046 351360 353042 354279 355857 358282 361340 364446 367290
53622 367290 370212 373859 378383 383198 387702 392036 396786 402209 408088 414183 420370 426424 432018 436927
53608 436927 440957 443839 445462 446124 446342 446603 447464 449430 452337 455191 457137 458335 459414 460354 460614 460179
$$ packed form
53715B61854L431K588J615J586K222K658K566K252K076K113K137J885J510J541
53701B92034K146K768K914K870L173L682L923L895L875L704L050K140J503J185
53687C32862Q71N90N52N75L84J91K34M2r16k169k723k380j660p59M09J329J284
53670C28716O31M67R76J172M63n45j124j258j134o15K82J108J492J440J072N94
53654C33737M55Q14R66J55j155j746j289n33R1Q42J572J545P40R4P0P6j61J15
53636C36388J297K436K539K044J987K355K314J682J237J578K425L058L106K844
53622C67290K922L647M524M815M504M334M750N423N879O095O187O054N594M909
53608D36927M030K882J623O62K18K61Q61J966K907K854J946J198J079R40K60m35
$$ plain form
53592 460179 459819 460184 461128 462063 462563 462541 462132 461544 460843 459872 458475 456707 454722 452639 450616 448772 446889
53575 446889 444522 441597 438602 435968 433714 431877 430769 430373 430013 429066 427593 425885 423998 422247 421413
53560 421413 421648 421817 420934 419809 420130 422118 424279 425458 425992 426597 427240 427600 427882 428583 429875 431550 433208
53543 433208 434388 434949 435451 436662 438597 440574 442303 444256 446775 449478 451977 454706 458531 463772 469948
53528 469948 476367 482790 489614 497393 506033 514667 522650 530572 539785 550983 563714 577210 591032
53515 591032 604851 618396 631973 646498 662611 680139 698702 718364 739351 761496 784357
53504 784357 807577 830808 853569 875572 897006 918180 939023 959257 978908 998346 1017848
53493 1017848 1037372 1056763 1076005 1095191 1114308 1133143 1151475 1169384 1187217 1205138 1222863
$$ packed form
53592D60179l60L65R44R35N00k2m09n88p01r71j397j768j985k083k023j844j883
53575D46889k367k925k995k634k254j837j108l96l60r47j473j708j887j751q34
53560D21413K35J69q83j125L21J988K161J179N34O05O43L60K82P01J292J675J658
53543D33208J180N61N02J211J935J977J729J953K519K703K499K729L825N241O176
53528D69948O419O423O824P779Q640Q634P983P922R213J1198J2731J3496J3822
53515E91032J3819J3545J3577J4525J6113J7528J8563J9662K0987K2145K2861
53504G84357K3220K3231K2761K2003K1434K1174K0843K0234J9651J9438J9502
53493A017848J9524J9391J9242J9186J9117J8835J8332J7909J7833J7921J7725
$$ plain form
53482 1222863 1240036 1256671 1273000 1289116 1305155 1321623 1338963 1356708 1373585 1388622 1401857
53471 1401857 1413830 1424790 1434549 1442707 1448725 1452002 1452264 1449810 1445222 1438845 1430666 1420630 1409017
53458 1409017 1396468 1383534 1370192 1356007 1340927 1325655 1310915 1296555 1281691 1265640 1248382
53447 1248382 1230316 1212000 1194042 1176692 1159564 1142137 1124522 1107314 1090829 1075049 1060290
53436 1060290 1047236 1036249 1027233 1020268 1015653 1013019 1011103 1008903 1006631 1005144 1004937 1006110 1008806 1013046
53422 1013046 1018461 1024800 1032466 1041974 1053049 1064896 1077380 1091320 1107420 1125354 1144142 1163112
53410 1163112 1182230 1201691 1221563 1241953 1263321 1286397 1311620 1338779 1367368 1397289 1428991
53399 1428991 1462881 1498900 1536797 1576567 1618340 1662068 1707595 1754952 1804237 1855190 1907152
$$ packed form
53482A222863J7173J6635J6329J6116J6039J6468J7340J7745J6877J5037J3235
53471A401857J1973J0960R759Q158O018L277K62k454m588o377q179j0036j1613
53458A409017j2549j2934j3342j4185j5080j5272j4740j4360j4864j6051j7258
53447A248382j8066j8316j7958j7350j7128j7427j7615j7208j6485j5780j4759
53436A060290j3054j0987r016o965m615k634j916k200k272j487k07J173K696M240
53422A013046N415O339P666R508J1075J1847J2484J3940J6100J7934J8788J8970
53410A163112J9118J9461J9872K0390K1368K3076K5223K7159K8589K9921L1702
53399A428991L3890L6019L7897L9770M1773M3728M5527M7357M9285N0953N1962
$$ plain form
53388 1907152 1959537 2012138 2064892 2117596 2170012 2222077 2273684 2324241 2372764 2418598 2461873
53377 2461873 2503002 2541837 2577682 2610156 2639627 2666557 2690636 2710926 2726742 2738021 2744884
53366 2744884 2747152 2744401 2736252 2722436 2702718 2676941 2645190 2607916 2565968 2520474 2472595 2423371
53354 2423371 2373726 2324425 2275811 2227637 2179446 2131277 2083966 2038717 1996307 1956703 1919285
53343 1919285 1883303 1848009 1812521 1775996 1738258 1700076 1662578 1626551 1592531 1561185 1532884
53332 1532884 1507028 1482635 1459745 1439431 1422149 1406937 1392806 1380127 1369742 1361215 1352837 1343093
53320 1343093 1331399 1317749 1302701 1287597 1273825 1261506 1249582 1237264 1224856 1213086 1202420
53309 1202420 1193202 1185760 1180044 1175677 1172608 1171158 1171217 1172063 1173347 1175667 1179661 1185097 1191441 1198929 1208318
$$ packed form
53388A907152N2385N2601N2754N2704N2416N2065N1607N0557M8523M5834M3275
53377B461873M1129L8835L5845L2474K9471K6930K4079K0290J5816J1279O863
53366B744884K268k751q149j3816j9718k5777l1751l7274m1948m5494m7879m9224
53354B423371m9645m9301m8614m8174m8191m8169m7311m5249m2410l9604l7418
53343A919285l5982l5294l5488l6525l7738l8182l7498l6027l4020l1346k8301
53332A532884k5856k4393k2890k0314j7282j5212j4131j2679j0385q527q378r744
53320A343093j1694j3650j5048j5104j3772j2319j1924j2318j2408j1770j0666
53309A202420r218p442n716m367l069j450N9Q46J284K320L994N436O344P488R389
$$ plain form
53294 1208318 1219758 1232666 1246820 1262885 1281461 1302012 1323264 1344644 1366773 1390274 1414433
53283 1414433 1437608 1458939 1479027 1498681 1517545 1534528 1549229 1562257 1574264 1585208 1594518
53272 1594518 1601366 1604751 1603986 1599416 1592238 1583370 1572721 1559677 1543945 1525804 1505834 1484583 1462219
53259 1462219 1438399 1412750 1385579 1357809 1330185 1302842 1275713 1248935 1222639 1196660 1170767
53248 1170767 1145046 1119894 1095702 1072607 1050433 1028814 1007471 986324 965305 944234 923068
53237 923068 902104 881721 862066 843221 825370 808538 792499 777308 763546 751499 740508
53226 740508 729812 719773 711436 705000 699510 693978 687980 681165 673117 663871 653758 642580 629774
53213 629774 615576 601100 586989 572912 558767 545455 533899 524074 515523 508029 501126 493830
$$ packed form
53294A208318J1440J2908J4154J6065J8576K0551K1252K1380K2129K3501K4159
53283A414433K3175K1331K0088J9654J8864J6983J4701J3028J2007J0944R310
53272A594518O848L385p65m570p178q868j0649j3044j5732j8141j9970k1251k2364
53259A462219k3820k5649k7171k7770k7624k7343k7129k6778k6296k5979k5893
53248A170767k5721k5152k4192k3095k2174k1619k1343k1147k1019k1071k1166
53237I23068k0964k0383j9655j8845j7851j6832j6039j5191j3762j2047j0991
53226G40508j0696j0039q337o436n490n532n998o815q048r246j0113j1178j2806
53213F29774j4198j4476j4111j4077j4145j3312j1556r825q551p494o903p296
$$ plain form
53201 493830 485713 477695 470897 465110 459187 452487 445120 437116 428284 418825 409334 400167 391372 383187
53187 383187 376057 370077 364831 359766 354551 349305 344707 341500 339529 337681 335220 332677 330842 329403
53173 329403 327429 324930 322942 322009 321379 319878 316984 312963 308574 304814 302385 301132 300310 299482 298773
53158 298773 298312 297979 297793 297963 298267 297926 296494 294583 293292 293034 293249 293179 292588 291733 290885 290072 289261 288607
53140 288607 288349 288464 288599 288476 288276 288507 289516 291167 292938 294308 295169 295898 296888 298037 298901 299333 299673
53123 299673 300284 301240 302496 303995 305523 306911 308536 311059 314354 317233 318743 319224 319570 319859 319446 318169
53107 318169 316652 315370 314064 312242 309803 307032 304332 302067 300409 299283 298559 298167 297846 297115 295916
53092 295916 294976 294926 295285 295048 294233 293971 294813 295767 295571 294345 293319 293191 293446 293241 292390 291324 290538 290381
$$ packed form
53201D93830q117q018o798n787n923o700p367q004q832r459r491r167q795q185
53187C83187p130n980n246n065n215n246m598l207j971j848k461k543j835j439
53173C29403j974k499j988r33o30j501k894m021m389l760k429j253q22q28p09
53158B98773m61l33j86J70L04l41j432j911j291k58K15p0n91q55q48q13q11o54
53140B88607k58J15J35j23k00K31J009J651J771J370Q61P29R90J149Q64M32L40
53123B99673O11R56J256J499J528J388J625K523L295K879J510M81L46K89m13j277
53107C18169j517j282j306j822k439k771k700k265j658j126p24l92l21p31j199
53092B95916r40n0L59k37q15k62Q42R54j96j226j026j28K55k05q51j066p86j57
$$ plain form
53074 290381 291114 292706 294517 295497 295004 293341 291346 289542 287896 286287 284805 283440 281867 279817 277503
53059 277503 275453 274051 273363 273226 273330 273467 273901 275232 277612 280292 282292 283339 283857 284269 284729 285426
53043 285426 286530 287761 288420 288114 287209 286406 286066 286084 286270 286630 287277 288171 289103 289977 291019 292498 294252
53026 294252 295709 296476 296683 296685 296701 296842 297192 297655 297978 298110 298299 298600 298626 298031 296998 295986 295299 295084 295366
53007 295366 295785 295777 295424 295657 297021 298743 299700 299906 300153 300468 300060 298876 298101 298665 300102 301389 302256 303037
52989 303037 303753 304082 304032 304053 304505 305387 306569 307973 309544 311229 312963 314607 315981 317019 317773 318223 318298
52972 318298 318155 318153 318464 318964 319666 320912 322876 325166 327203 328808 330087 330995 331484 331941 332938 334378 335299
52955 335299 334833 333108 330991 329089 327250 324978 322062 318785 315716 313349 311786 310721 309820 309131 308937
$$ packed form
53074B90381P33J592J811R80m93j663j995j804j646j609j482j365j573k050k314
53059B77503k050j402o88j37J04J37M34J331K380K680K000J047N18M12M60O97
53043B85426J104J231O59l06r05q03l40J8J86L60O47Q94R32Q74J042J479J754
53026B94252J457P67K07KJ6J41L50M63L23J32J89L01K6n95j033j012o87k15K82
53007B95366M19ql53K33J364J722R57K06K47L15m08j184p75N64J437J287Q67P81
52989C03037P16L29n0K1M52Q82J182J404J571J685J734J644J374J038P54M50P5
52972C18298j43kL11N00P02J246J964K290K037J605J279R08M89M57R97J440R21
52955C35299m66j725k117j902j839k272k916l277l069k367j563j065r01o89j94
$$ plain form
52940 308937 309194 309374 309017 308226 307457 307022 307077 307819 309227 310711 311508 311509 311309 311361 311479 311326 310970 310640 310272
52921 310272 309646 308763 307786 306760 305651 304611 303958 303945 304555 305424 305936 305643 304700 303635 302688 301725 300843 300570
52903 300570 301184 302266 303277 304196 305192 305984 306064 305375 304413 303799 304036 305400 307658 310130 312403 314755 317451
52886 317451 319935 321300 321328 320463 318918 316576 313806 311653 310846 311021 311151 310534 309236 307911 307331 307877
52870 307877 309387 311556 314361 317845 321667 325266 328413 331248 333803 335874 337316 338015 337605 335710 332586
52855 332586 329100 325918 323022 320119 317136 314175 311333 308711 306357 304065 301518 298748 296131 293820
52841 293820 291509 288954 286435 284479 283306 282727 282351 281703 280436 278775 277635 277916 279581 281669 283329
52826 283329 284620 286058 287499 287947 286705 284417 282543 281916 282235 282925 283891 285224 286715 288104 289512
$$ packed form
52940C08937K57J80l57p91p69m35N5P42J408J484P97Jk00N2J18j53l56l30l68
52921C10272o26q83r77j026j109j040o53j3O10Q69N12k93r43j065r47r63q82k73
52903C00570O14J082J011R19R96P92Q0o89r62o14K37J364K258K472K273K352K696
52886C17451K484J365K8q65j545k342k770k153q07J75J30o17j298j325n80N46
52870C07877J510K169K805L484L822L599L147K835K555K071J442O99m10j895l124
52855C32586l486l182k896k903k983k961k842k622k354k292k547k770k617k311
52841B93820k311k555k519j956j173n79l76o48j267j661j140K81J665K088J660
52826B83329J291J438J441M48j242k288j874o27L19O90R66J333J491J389J408
$$ plain form
52811 289512 291290 293683 296832 300726 304793 307837 308844 307697 304925 301117 296886 292939 289688 287074
52797 287074 285107 284107 283959 283708 282592 281028 279829 278900 277670 276457 276219 276971 277570 277272 276592 276309
52781 276309 276515 277005 277834 279051 280480 282095 284052 286039 287183 286979 285823 284387 283011 281931 281459
52766 281459 281476 281316 280609 279823 279551 279671 279659 279334 278881 278466 278334 278980 280705 283135 285505 287298 288386 288816
52748 288816 288843 289025 289855 291314 293055 294946 297142 299585 301715 302907 303231 303563 304697 306437 307931 308929
52732 308929 310124 311949 313699 314541 314902 315904 317628 318891 318775 317516 315795 314041 312605 311797 311361
52717 311361 310613 309374 308120 307028 305687 304086 303014 303004 303596 304169 304777 305610 306313 306497 306430 306607 307115
52700 307115 307939 309315 311149 312653 313205 313165 313199 313243 312845 312095 311475 311116 310895 310925 311242 311293 310536 309343 308598
$$ packed form
52811B89512J778K393L149L894M067L044J007j147k772l808m231l947l251k614
52797B87074j967j000j48k51j116j564j199r29j230j213k38P52N99k98o80k83
52781B76309K06M90Q29J217J429J615J957J987J144k04j156j436j376j080m72
52766B81459J7j60p07p86k72J20j2l25m53m15j32O46J725K430K370J793J088M30
52748B88816K7J82Q30J459J741J891K196K443K130J192L24L32J134J740J494R98
52732C08929J195J825J750Q42L61J002J724J263j16j259j721j754j436q08m36
52717C11361p48j239j254j092j341j601j072j0N92N73O08Q33P03J84o7J77N08
52700C07115Q24J376J834J504N52m0L4M4l98p50o20l59k21L0L17N1p57j193p45
$$ plain form
52681 308598 308556 308784 308974 309092 308878 308098 307217 307077 307819 308788 309502 309993 310166 309645 308568 307828 308153 309309
52663 309309 310485 311085 310954 310290 309625 309609 310524 312120 313956 315731 317323 318904 320955 323703 326459 327987
52647 327987 327776 326565 325389 324478 323414 322078 320997 320809 321678 323215 324704 325427 325070 324115 323757 325070
52631 325070 328036 331514 334483 337318 341460 347617 354534 359783 361632 360001 355924 350621 345081 339953
52617 339953 335412 331203 327100 323400 320768 319477 318953 318299 317283 316497 316427 316769 316912 316748 316539 316256 315651
52600 315651 314892 314514 314693 315115 315614 316365 317381 318457 319722 321516 323491 324595 324389 323760 323841 324745 325795
52583 325795 326428 326373 325511 324200 323318 323401 324134 325130 326587 328449 329568 328725 326263 323748 322145 321167 320356
52566 320356 319783 319477 318994 317993 316758 315796 315271 315035 314982 315167 315743 316819 318255 319735 321116 322516 323848
$$ packed form
52681C08598m2K28J90J18k14p80q81j40P42R69P14M91J73n21j077p40L25J156
52663C09309J176O00j31o64o65j6R15J596J836J775J592J581K051K748K756J528
52647C27987k11j211j176r11j064j336j081j88Q69J537J489P23l57r55l58J313
52631C25070K966L478K969K835M142O157O917N249J849j631m077n303n540n128
52617C39953m541m209m103l700k632j291n24o54j016p86p0L42J43j64k09k83o05
52600C15651p59l78J79M22M99P51J016J076J265J794J975J104k06o29Q1R04J050
52583C25795O33n5q62j311q82Q3P33R96J457J862J119q43k462k515j603r78q11
52566C20356n73l06m83j001j235r62n25k36n3J85N76J076J436J480J381J400J332
$$ plain form
52549 323848 324616 324472 323688 322725 321737 320851 320444 320554 320487 319708 318723 318298 318107 317178 315505 314190 313923 314290
52531 314290 314765 315455 316522 317699 318781 319980 321349 322501 323280 324149 325456 326793 327599 328035 328785 330271
52515 330271 332451 335188 338349 341633 344624 347061 349012 350837 352965 355438 357637 358710 358393 357129
52501 357129 355324 352825 349282 344781 339915 335401 331681 328713 326119 323696 321731 320596 320132 319799 319405
52486 319405 319249 319482 319825 320062 320416 321172 322256 323366 324288 324899 325110 325038 325072 325595 326697 328173 329682 330890
52468 330890 331724 332539 333929 336367 340067 344959 350487 355600 359340 361416 362036 361369 359529 356799 353354
52453 353354 348943 343520 338019 333760 330959 328593 325957 323671 322683 322831 322909 321908 319840 317554 316010
52438 316010 315540 315586 315356 314764 314407 314608 314998 315238 315581 316309 317008 316954 316065 315105 314977 316035 317948 319945
$$ packed form
52549C23848P68j44p84r63r88q86m07J10o7p79r85m25j91r29j673j315k67L67
52531C14290M75O90J067J177J082J199J369J152P79Q69J307J337Q06M36P50J486
52515C30271K180K737L161L284K991K437J951J825K128K473K199J073l17j264
52501C57129j805k499l543m501m866m514l720k968k594k423j965j135m64l33l94
52486C19405j56K33L43K37L54P56J084J110R22O11K11p2L4N23J102J476J509J208
52468C30890Q34Q15J390K438L700M892N528N113L740K076O20o67j840k730l445
52453C53354m411n423n501m259k801k366k636k286r88J48P8j001k068k286j544
52438C16010m70M6k30n92l57K01L90K40L43P28O99n4q89r60j28J058J913J997
$$ plain form
52420 319945 321317 321933 322262 322829 323746 324829 325958 327178 328535 330006 331614 333616 336590 341143 347401
52405 347401 354955 363591 373806 386164 400174 414201 426410 435366 439935 439402 434090 425474 415365
52392 415365 405096 395380 386483 378381 371155 365324 361415 359158 357632 356258 355173 354527 354115 353949 354547
52377 354547 356213 358512 360878 363291 365980 368920 372088 375793 380175 384623 388162 390250 390870 390149 388343
52362 388343 385989 383640 381539 379835 378854 378806 379414 380246 381200 382349 383600 384917 386664 389170 391986 394156
52346 394156 395248 395776 396474 397572 398921 400500 402502 404963 407593 410174 413103 417260 423137 430210 437455
52331 437455 444363 451069 457680 464065 470468 477687 486295 496118 506784 518327 530845 543869 556523
52318 556523 568155 578565 588005 597344 607831 620216 634214 649172 664969 681898 700005 719015
$$ packed form
52420C19945J372O16L29N67R17J083J129J220J357J471J608K002K974M553O258
52405C47401P554Q636J0215J2358J4010J4027J2209Q956M569n33n312q616j0109
52392D15365j0269r716q897q102p226n831l909k257j526j374j085o46m12j66N98
52377C54547J666K299K366K413K689K940L168L705M382M448L539K088O20p21j806
52362C88343k354k349k101j704r81m8O08Q32R54J149J251J317J747K506K816K170
52346C94156J092N28O98J098J349J579K002K461K630K581K929M157N877P073P245
52331D37455O908O706O611O385O403P219Q608R823J0666J1543J2518J3024J2654
52318E56523J1632J0410R440R339J0487J2385J3998J4958J5797J6929J8107J9010
$$ plain form
52306 719015 738685 758780 779010 799542 821296 844965 869794 894048 916732 938233 959108
52295 959108 978917 996608 1011633 1024269 1035113 1044585 1052782 1059465 1064221 1066751 1067024 1065191 1061555
52282 1061555 1056707 1051450 1046344 1041366 1036170 1030672 1025234 1020222 1015566 1010967 1006516 1002836 1000498 999567
52268 999567 999923 1001662 1004681 1008049 1010524 1011922 1013460 1016542 1021703 1028934 1038349 1049925 1063066 1077186
52254 1077186 1092550 1109828 1128808 1148142 1166480 1183394 1198998 1213154 1225383 1235427 1243575
52243 1243575 1250430 1256376 1261278 1264721 1266517 1266856 1265907 1263526 1259541 1254160 1247855 1240932 1233330 1224752
52229 1224752 1214887 1203724 1191844 1180197 1169318 1158895 1148269 1137113 1125409 1113135 1100526
52218 1100526 1088446 1077898 1069047 1061168 1053738 1047190 1042359 1039473 1037958 1037174 1037048 1037889 1039619 1041411
$$ packed form
52306G19015J9670K0095K0230K0532K1754K3669K4829K4254K2684K1501K0875
52295I59108J9809J7691J5025J2636J0844R472Q197O683M756K530K73j833l636
52282A061555m848n257n106m978n196n498n438n012m656m599m451l680k338r31
52268I99567L56J739L019L368K475J398J538L082N161P231R415J1576J3141J4120
52254A077186J5364J7278J8980J9334J8338J6914J5604J4156J2229J0044Q148
52243A243575O855N946M902L443J796L39r49k381l985n381o305o923p602q578
52229A224752r865j1163j1880j1647j0879j0423j0626j1156j1704j2274j2609
52218A100526j2080j0548q851p879p430o548m831k886j515p84j26Q41J730J792
$$ plain form
52204 1041411 1042383 1042639 1043290 1045237 1048253 1051553 1055034 1059419 1065249 1072283 1080058 1088579 1097998 1107763 1116502
52189 1116502 1122955 1126878 1128866 1129391 1128264 1125211 1120664 1115586 1110491 1105028 1098622 1091248 1083399 1075590
52175 1075590 1068148 1061296 1055111 1049460 1044174 1039299 1035108 1031902 1029788 1028523 1027691 1027272 1027930 1030302 1034041
52160 1034041 1038025 1041549 1044658 1047200 1048385 1047839 1046456 1045445 1044939 1044320 1043654 1043941 1045878 1049053 1052554
52145 1052554 1055926 1059326 1063037 1066938 1070378 1072631 1073660 1074200 1074855 1075411 1075381 1074877 1074449 1074427 1075040 1076981
$$ packed form
52204A041411R72K56O51J947L016L300L481M385N830P034P775Q521R419R765Q739
52189A116502O453L923J988N25j127l053m547n078n095n463o406p374p849p809
52175A075590p442o852o185n651n286m875m191l206k114j265q32m19O58K372L739
52160A034041L984L524L109K542J185n46j383j011n06o19o66K87J937L175L501
52145A052554L372L400L711L901L440K253J029N40O55N56l0n04m28k2O13J941
$$ [...]
##END NTUPLES=NMR SPECTRUM
##END=
