
##TITLE=UV1236_M8_1260-1248_10_7240944_icNYXirJSE
##JCAMPDX= 6.0         $$ Bruker NMR JCAMP-DX V2.0
##DATA TYPE= NMR SPECTRUM
##DATA CLASS= NTUPLES
##ORIGIN= BRUKER
##OWNER= Administrator
$$ 1.72 TOPSPIN		Version 2.1
$$ 2013-01-19 00:36:55.346 -0500  Administrator@X
$$ Compression mode = diff/dup
##.OBSERVE FREQUENCY= 400.02188249412
##.OBSERVE NUCLEUS= ^1H
##.ACQUISITION MODE= SIMULTANEOUS (DQD)
##.ACQUISITION SCHEME= undefined
##.AVERAGES= 8
##.DIGITISER RES= 22
##SPECTROMETER/DATA SYSTEM= spect
##.PULSE SEQUENCE= zg30
##.SOLVENT NAME= COFFEE_meoh
##.SHIFT REFERENCE= INTERNAL, COFFEE_meoh, 1, 14.98509
##AUDIT TRAIL= $$ (NUMBER, WHEN, WHO, WHERE, PROCESS, VERSION, WHAT)
$$ ##TITLE= Audit trail, TOPSPIN		Version 2.1
$$ ##JCAMPDX= 5.01
$$ ##ORIGIN= Bruker BioSpin GmbH
$$ ##OWNER= Administrator
$$ $$ E:\/data/COFFEE/nmr/UV1236_M8_1260-1248_10_7240944_icNYXirJSE/20/pdata/1/auditp.txt
$$ ##AUDIT TRAIL=  $$ (NUMBER, WHEN, WHO, WHERE, PROCESS, VERSION, WHAT)
(   1,<2013-01-19 00:36:47.393 -0500>,<Administrator>,<X>,<go>,<TOPSPIN 2.1>,
      <created by zg
	started at 2013-01-19 00:35:41.346 -0500,
	POWCHK enabled, PULCHK disabled,
       configuration hash MD5:
       86 BA 57 50 F2 9D 5C 9B 26 00 A9 28 5F 66 2E 89
       data hash MD5: 64K
       BA 41 0A 08 D0 8D 1D A0 0A FA 81 C6 DC 15 21 A3>)
(   2,<2013-01-19 00:36:50.424 -0500>,<Administrator>,<X>,<proc1d>,<TOPSPIN 2.1>,
      <Start of raw data processing
       efp LB = 0 FT_mod = 6 PKNL = 1 PHC0 = 0 PHC1 = 0 SI = 32K 
       data hash MD5: 32K
       90 16 9E 1F 7D 82 D1 3D 16 5C 74 5A 58 C4 CF 5F>)
(   3,<2013-01-19 00:36:50.893 -0500>,<Administrator>,<X>,<proc1d>,<TOPSPIN 2.1>,
      <pk PHC0 = 94.6637 PHC1 = 0 
       data hash MD5: 32K
       FF B3 63 B6 40 EB BD 4B B6 F1 71 2E FD F4 7D 60>)
(   4,<2013-01-19 00:36:51.127 -0500>,<Administrator>,<X>,<proc1d>,<TOPSPIN 2.1>,
      <abs ABSG = 1 
       data hash MD5: 32K
       74 4D AD 29 A8 45 A0 DE 91 CB FE 3D 20 7E 0A B1>)
(   5,<2013-01-19 00:36:51.268 -0500>,<Administrator>,<X>,<proc1d>,<TOPSPIN 2.1>,
      <abs ABSG = 2 
       data hash MD5: 32K
       85 4A ED 9D F6 BF D4 87 C3 41 E9 A0 08 CA 5B 8B>)
(   6,<2013-01-19 00:36:51.408 -0500>,<Administrator>,<X>,<proc1d>,<TOPSPIN 2.1>,
      <abs ABSG = 3 
       data hash MD5: 32K
       A0 B8 C1 6F 6E CB DD D9 20 3A E9 91 0A A7 E2 DD>)
(   7,<2013-01-19 00:36:51.565 -0500>,<Administrator>,<X>,<proc1d>,<TOPSPIN 2.1>,
      <abs ABSG = 4 
       data hash MD5: 32K
       9F 20 11 24 3D BC 50 EB D2 37 3C 33 C2 70 CE 58>)
(   8,<2013-01-19 00:36:51.721 -0500>,<Administrator>,<X>,<proc1d>,<TOPSPIN 2.1>,
      <abs ABSG = 5 
       data hash MD5: 32K
       F7 F6 64 A9 8B ED C8 99 F7 08 E0 E2 D4 BE C4 7B>)
$$ ##END=
$$ 
$$ $$ hash MD5
$$ $$ E4 45 3F 48 45 BD 44 00 0E 28 9B 70 C8 3C F3 24
##$RELAX= 
##$RELAX= 
##$RELAX= 
##$RELAX= 
##$RELAX= 
##$RELAX= 
##$RELAX= 
$$ Bruker specific parameters
$$ --------------------------
##$DU= <E:\>
##$EXPNO= 20
$$ [...]
150 150 150 150 150 150 150 150
##$TP07= 0
##$TPNAME0= <>
##$TPNAME1= <>
##$TPNAME2= <>
##$TPNAME3= <>
##$TPNAME4= <>
##$TPNAME5= <>
##$TPNAME6= <>
##$TPNAME7= <>
##$TPOAL= (0..7)
0.5 0.5 0.5 0.5 0.5 0.5 0.5 0.5
##$TPOFFS= (0..7)
0 0 0 0 0 0 0 0
##$TUNHIN= 0
##$TUNHOUT= 0
##$TUNXOUT= 0
##$USERA1= <user>
##$USERA2= <user>
##$USERA3= <user>
##$USERA4= <user>
##$USERA5= <user>
##$V9= 5
##$VALIST= <valist>
##$VCLIST= <CCCCCCCCCCCCCCC>
##$VD= 0
##$VDLIST= <DDDDDDDDDDDDDDD>
##$VPLIST= <PPPPPPPPPPPPPPP>
##$VTLIST= <TTTTTTTTTTTTTTT>
##$WBST= 1024
##$WBSW= 4
##$XGAIN= (0..3)
0 0 0 0
##$XL= 0
##$YL= 0
##$YMAX_a= 608231
##$YMIN_a= -516794
##$ZGOPTNS= <>
##$ZL1= 120
##$ZL2= 120
##$ZL3= 120
##$ZL4= 120
##$ABSF1= 14.98509
##$ABSF2= -5.573092
##$ABSG= 5
##$ABSL= 3
##$ALPHA= 0
##$AQORDER= 0
##$ASSFAC= 0
##$ASSFACI= 0
##$ASSFACX= 0
##$ASSWID= 0
##$AUNMP= <proc_prof1d_extract_pilot.lims>
##$AXLEFT= 0
##$AXNAME= <>
##$AXNUC= <1H>
##$AXRIGHT= 0
##$AXTYPE= 0
##$AXUNIT= <>
##$AZFE= 0.1
##$AZFW= 0.1
##$BCFW= 0
##$BC_mod= 0
##$BYTORDP= 0
##$COROFFS= 0
##$CY= 15
##$DATMOD= 1
##$DC= 0
##$DFILT= <>
##$DTYPP= 0
##$F1P= 0
##$F2P= 0
##$FCOR= 0.5
##$FTSIZE= 32768
##$FT_mod= 6
##$GAMMA= 0
##$GB= 0
##$INTBC= 1
##$INTSCL= 1
##$ISEN= 128
##$LB= 0
##$LEV0= 0
##$LPBIN= 0
##$MAXI= 10000
##$MC2= 0
##$MEAN= 0
##$ME_mod= 0
##$MI= 0
##$NCOEF= 0
##$NC_proc= -8
##$NLEV= 6
##$NOISF1= 0
##$NOISF2= 0
##$NSP= 0
##$NTH_PI= 0
##$NZP= 0
##$OFFSET= 14.98509
##$PC= 1
##$PHC0= 94.6637
##$PHC1= 0
##$PH_mod= 1
##$PKNL= yes
##$PPARMOD= 0
##$PPDIAG= 0
##$PPIPTYP= 0
##$PPMPNUM= 2147483647
##$PPRESOL= 1
##$PSCAL= 4
##$PSIGN= 0
##$PYNMP= <proc.py>
##$REVERSE= no
##$SF= 400.02
##$SI= 32768
##$SIGF1= 0
##$SIGF2= 0
##$SINO= 400
##$SIOLD= 32768
##$SPECTYP= <>
##$SREGLST= <1H.CDCl3>
##$SSB= 0
##$STSI= 32768
##$STSR= 0
##$SW_p= 8223.68421052631
##$SYMM= 0
##$S_DEV= 0
##$TDeff= 65536
##$TDoff= 0
##$TI= <>
##$TILT= no
##$TM1= 0
##$TM2= 0
##$TOPLEV= 0
##$USERP1= <user>
##$USERP2= <user>
##$USERP3= <user>
##$USERP4= <user>
##$USERP5= <user>
##$WDW= 1
##$XDIM= 32768
##$YMAX_p= 460819210
##$YMIN_p= -671099
##$CURPLOT= <Network HP LaserJet P1505>
##$CURPRIN= <$Network HP LaserJet P1505>
##$DFORMAT= <normdp>
##$LAYOUT= <+/1D_H.xwp>
##$LFORMAT= <normlp>
##$PFORMAT= <normpl>
##$SURQMSG= 1
$$ End of Bruker specific parameters
$$ ---------------------------------
##NTUPLES= NMR SPECTRUM
##VAR_NAME=  FREQUENCY,     SPECTRUM/REAL,   SPECTRUM/IMAG
##SYMBOL=    X,             R,               I
##VAR_TYPE=  INDEPENDENT,   DEPENDENT,       DEPENDENT
##VAR_FORM=  AFFN,          ASDF,            ASDF
##VAR_DIM=   32768,         32768,           32768
##UNITS=     HZ,            ARBITRARY UNITS, ARBITRARY UNITS
##FACTOR=    0.250966925370066, 1,           1
##FIRST=     8223.43324360094, 77861,        -110281
##LAST=      0,             -15930,          -144486
##MIN=       0,             -671099,         0
##MAX=       8223.43324360094, 460819210,    0
$$ Real data points
##PAGE= N=1
##DATA TABLE= (X++(R..R)), XYDATA
$$ [...]
$$ plain form
19542 -95132 -193566 -134207 -233189 -62754 -260209 10139 115854 58044 461346 -31240 309971
19530 -37599 110182 46618 21649 -127115 -121243 -103950 130919 106719 -100909 67638 31721
19518 -88154 29429 -26994 -412432 55640 -222020 -19067 -99831 252226 -273500 20824 -109149
19506 134766 -93666 174576 57995 -177588 -283187 236343 -149848 -186762 -103270 -217811
19496 -217811 -53309 -277417 -71919 87914 135151 -92400 -237729 70480 -345656 -90411 -458661
19485 -458661 -344061 -130510 -114814 -213022 38330 6229 -31392 -117529 33362 19093 -77187
19473 118417 -55931 17451 -128352 -108644 128731 -203223 97712 -190966 128215 12965
19462 -59864 -573877 23115 -57207 145020 -55084 38320 -145828 -228290 65924 -361390 -297407
$$ packed form
19542i5132r8434N9359r8982f2754j97455A0139J05715n7810M03302c1240C09971
19530c7599A10182D6618B1649a27115N872J7293A30919k4200a00909F7638C1721
19518h8154B9429b6994l85438E5640b22020a9067q0764B52226b73500B0824a09149
19506A34766i3666A74576E7995a77588j05599B36343a49848l6914Q3492j14541
19496b17811e3309k24108g1919H7914M7237i2400j45329G0480c45656i0411l68250
19485d58661J14600a30510J5696r8208C8330F229c1392q6137C3362j4269g7187
19473A18417e5931A7451a28352J9708A28731b03223I7712a90966A28215A2965
19462e9864n14013B3115e7207A45020e5084C8320a45828q2462F5924c61390O3983
$$ plain form
19451 -297407 199189 -18730 -111671 -129955 -181770 198509 -160066 -54441 -41537 64152 87963
19440 87963 72600 -214242 -226275 359557 -225701 -110644 -143048 -86766 -87087 -13104 -444127
19429 -444127 2036 -333483 -179202 -405897 -179160 -324058 -128924 -108598 6641 -51874 -415937
19418 -415937 170459 337549 141353 319511 170387 -76559 -42576 -273649 -37695 -195830
19408 -195830 -249350 -26665 -175597 -245054 -29068 -210962 -100513 248812 14219 99048 88892
19397 88892 35653 222477 -176702 211358 42877 102670 -20950 51770 188595 -167102 -202143
19386 -202143 -126294 178996 111850 -236869 199721 -128903 6526 19848 -79346 96301 -36338
19374 -57624 30859 119078 171500 56348 -274108 113854 189761 35723 -18044 97078 -95746
$$ packed form
19451b97407A99189a8730r2941j8284n1815A98509a60066e4441J2904F4152K3811
19440H7963j5363b14242j2033C59557b25701a10644l2404N6282l21a3104m31023
19429d44127B036c33483J54281k26695a79160j44898a28924K0326F641e1874l64063
19418d15937A70459J67090A41353J78158j49124g6559L3983k31073c7695j58135
19408a95830n3520b6665j48932o9457b9068j81894a00513B48812A4219Q4829j0156
19397H8892C5653J86824a76702B11358D2877N9793b0950E1770J36825a67102l5041
19386b02143P5849A78996o7146b36869A99721a28903F526J3322g9346I6301c6338
19374e7624C0859Q8219N2422E6348b74108A13854P5907C5723a8044I7078i5746
$$ plain form
19362 -204708 138913 91928 -164217 -52971 278128 -361423 -127828 -68493 -41639 135253
19351 -30506 -117401 -45795 -38322 1471 -639 -12098 77255 -355924 -56287 -25411 109233 -102490
19338 15290 -21430 120395 -287880 -89359 -187314 -162145 219986 50100 -70635 40191 -25438
19326 190511 -16806 -172650 -350674 -73297 -71458 -214881 -211112 189898 98708 -43652 -224776
19315 -224776 -378360 -54574 -190748 -125960 -11820 -94967 59956 19585 -13703 -177520 222922
19303 -213516 311230 -198989 -6872 -249498 -235716 119992 29691 -220477 -117222 -126720 -220163
19292 -220163 121155 -83808 -91094 -297750 -339761 -65663 18798 290578 157734 20241 93065
19281 93065 -44588 -174221 -383452 -165197 -224944 -57291 -94668 -159456 32140 -68269 -165289
$$ packed form
19362b04708A38913m6985a64217e2971B78128c61423a27828N9335K6854A35253
19351c0506q6895d5795P473A471f39j1459G7255c55924e6287b5411A09233a02490
19338A5290b1430A20395b87880h9359r7955K5169B19986E0100g0635D0191b5438
19326A90511a6806j55844j78024g3297J839j43423L769A89898r1190d3652j81124
19315b24776j53584e4574j36174O4788a1820q3147E9956A9585a3703j63817B22922
19303b13516C11230a98989f872k42626J3782A19992B9691b20477J03255r498r3443
19292b20163A21155h3808p286k06656m2011f5663A8798K71780j32844B0241P2824
19281I3065d4588j29633k09231a65197n9747e7291l7377o4788C2140f8269r7020
$$ plain form
19270 -165289 -15888 -17 181826 16774 -365639 89657 -548802 228415 -152258 -200375 174000
19258 -252780 -139104 -186356 -240943 -104815 -66108 -207138 -26150 -252428 -214025 132865
19247 -174919 -16434 -283796 -124171 24745 -40230 -216066 -61888 43652 95754 117009 -28940
19235 11295 -14945 105331 238858 120253 14010 142216 184971 -147250 198546 -78457
19224 -84070 -370860 -185174 116429 235133 -118887 -387934 -79085 -89646 19385 -118715
19213 63065 -278082 -261465 70149 -139446 -388155 -30920 -286470 201646 -96882 -346407
19203 -346407 -214220 62157 -326448 38169 -52352 116524 218394 -256245 -334411 108635
19192 -78182 88752 14956 -172596 -107348 -39719 -86027 -48181 -216581 -305907 -198096 79138
$$ packed form
19270a65289a5888a7A81826A6774c65639H9657e48802B28415a52258m8117A74000
19258b52780J13676m7252n4587a04815L8707j41030b6150k26278L8403A32865
19247a74919a6434k67362a24171B4745d0230j75836f1888D3652N2102K1255b8940
19235A1295a4945A05331J33527j18605A4010J28206M2755a47250A98546g8457
19224h4070k86790a85174A16429J18704a18887k69047g9085j0561A9385a18715
19213F3065b78082J6617G0149a39446k48709c0920k55550B01646i6882k49525
19203c46407J32187F2157c26448C8169e2352A16524J01870b56245p8166A08635
19192g8182H8752A4956a72596O5248c9719m6308L7846j68400q9326J07811G9138
$$ plain form
19180 49234 277866 -447829 114320 -439869 -224495 217845 -77960 59455 -179774 53979
19169 282176 -93816 151514 -10543 -90651 59563 -185038 37816 -100445 119098 -336830
19158 -16788 286902 -25215 110649 -113992 -251517 -56417 126192 -31940 -26223 -267568 -125905
19146 -110465 -349304 123820 -362581 -242225 78747 -236072 -75040 180394 -52210 -131411
19136 -131411 -25884 -177174 -38533 10637 -165846 100820 -156937 171279 535183 54913
19125 -184686 122701 -52073 233992 39539 -284619 -94351 -373480 -484537 169594 -207074
19114 -214192 346998 -126416 274516 10342 236244 -85995 -201915 -137194 358170 196119
19104 196119 -172231 270859 -199494 66963 -170635 -137989 -122815 86023 179106 -17756 -283992
$$ packed form
19180D9234K28632d47829A14320d39869K15374B17845g7960E9455a79774E3979
19169B82176i3816A51514a0543q0108E9563a85038C7816a00445A19098c36830
19158a6788B86902b5215A10649a13992j37525e6417A26192c1940N717k41345a25905
19146a10465k38839A23820c62581J20356G8747b36072g5040A80394e2210p9201
19136a31411b5884j51290c8533A0637a65846A00820a56937A71279L63904E4913
19125a84686A22701e2073B33992C9539b84619i4351k79129j11057A69594b07074
19114b14192C46998a26416B74516A0342K25902h5995j15920O4721C58170j62051
19104A96119a72231B70859a99494F6963a70635L2646J5174H6023R3083a7756k66236
$$ plain form
19093 -283992 203015 -62641 -59190 -254304 -9209 155889 -300575 -175813 140662 101245 -104416
19081 39871 -42650 166007 151938 67913 13128 182902 46423 -62840 125364 -196284 -155880
19070 -155880 201219 -194735 -28945 -96821 -383933 61657 200426 58999 -340030 -297453
19060 -297453 -179353 -221619 -156247 192764 -285453 -49975 170844 50539 22564 -135430
19049 -207556 -8111 -101161 62742 -192746 202527 -46473 271198 153132 -31981 23298 -149072
19037 8194 -222700 -36380 -104447 53050 64003 -105121 -22386 299776 97930 66722 163556
19026 163556 187799 -182660 -135257 -182692 -13595 108374 134861 91472 -11644 -271872 -1708
19014 -140460 -121126 -24043 98554 15071 213426 23463 -193586 -181937 -267786 -169581 -251657
$$ packed form
19093b83992B03015f2641L451j95114i209A55889c00575J24762A40662l9417a04416
19081C9871d2650A66007j4069F7913A3128J69774D6423f2840A25364a96284M0404
19070a55880B01219a94735b8945o7876k87112F1657J38769E8999c40030M2577
19060b97453J18100m2266O5372A92764b85453d9975A70844E0539B2564a35430
19049b07556h111r3050F2742a92746B02527d6473B71198j18066c1981B3298a49072
19037H194b22700c6380o8067E3050J0953a05121b2386B99776I7930l1208R6834
19026A63556K4243a82660M7403m7435a3595A08374K6487m3389a1644k60228a708
19014a40460J9334b4043I8554A5071J98355B3463a93586J1649q5849R8205q2076
$$ plain form
19003 -251657 -115046 -592 -81320 20937 118282 -108730 -181819 155819 47295 -99657 259230
18991 -107129 -114964 -161254 244541 -46135 -118029 28047 -272662 299615 -214732 37177 -364763
18979 229095 -158618 -31581 -88052 -53267 141506 193753 -123266 -352484 -37425 -6526 -87680
18968 -87680 -4303 251882 -23469 187698 192423 214430 215460 -144072 -73465 -191149 -27819
18956 -152772 244379 -9313 67461 13049 -160630 44109 49798 211545 40960 -53665 93495
18944 -18190 104228 90298 -302050 -95776 131390 140402 -225620 -103737 5869 139358 -283456
18932 268714 -127367 79898 -200825 -363390 -116193 -279859 -319432 109595 51458 276176
18922 276176 -168557 -228106 -51045 168562 17848 -202914 -76213 -305347 -62578 -231413
$$ packed form
19003b51657a15046e92q0728B0937R7345a08730p3089A55819D7295i9657B59230
18991a07129p835m6290B44541d6135p1894B8047b72662B99615b14732C7177c64763
18979B29095a58618c1581n6471L4785A41506N2247a23266k29218c7425f526q1154
18968h7680d303B51882b3469A87698M725K2007J030a44072P0607j17684b7819
18956a52772B44379i313F7461A3049a60630D4109N689J61747D0960e3665I3495
18944a8190A04228j3930c02050i5776A31390R012b25620a03737E869J33489b83456
18932B68714a27367G9898b00825j62565a16193j63666l9573A09595E1458K24718
18922B76176a68557n9549e1045A68562A7848b02914g6213k29134f2578j68835
$$ plain form
18912 -231413 -275613 137519 -234415 28883 -269203 -182348 -86054 127382 -143288 48968
18901 -172367 26694 -350439 109558 -134260 -15304 34825 -60485 71267 84183 333123 482148
18890 482148 -275632 188215 -18597 -265031 -12569 -466455 -115339 257438 -35738 148567
18879 187517 -123108 89018 -145937 116330 -163561 -478698 -152361 -53862 180133 12457
18868 -101150 -126143 -243480 46960 39167 145646 8975 -36296 -25392 -6928 -407979 9641 18998
18856 18998 203512 -140094 -106680 51606 -218283 48462 -122875 246077 98417 213886
18846 213886 -161408 -55126 -148014 -260139 43085 3661 -68898 81705 -55864 32968 -117105
18834 108080 -66329 -138378 -171697 -219939 -331879 -76222 48966 57301 -58941 -351855 -57264
$$ packed form
18912b31413m4200A37519b34415B8883b69203Q6855h6054A27382a43288D8968
18901a72367B6694c50439A09558a34260a5304C4825f0485G1267J2916K48940J49025
18890D82148b75632A88215a8597k46434a2569m53886a15339B57438c5738A48567
18879A87517a23108H9018a45937A16330a63561l15137a52361e3862A80133A2457
18868a01150k4993j17337D6960p793J06479H975c6296J0904f928m01051I641R357
18856A8998J84514a40094L3414E1606b18283D8462a22875B46077I8417J15469
18846B13886a61408e5126r2888j12125D3085C661f8898H1705e5864C2968a17105
18834A08080f6329p2049l3319m8242j11940g6222D8966Q335e8941k92914e7264
$$ plain form
18822 -108952 -82541 -114574 162402 27772 12159 -237085 127751 42695 -23734 208797 322414
18811 322414 244245 -97973 223076 -2194 -107644 124088 24073 -319266 -73100 167896 161548
18800 161548 -134469 -270184 -606 8295 -16121 172344 210162 -169653 -17543 -63971 88754
18788 62004 51045 -146007 -56872 -134735 -168009 -123680 320235 112839 -94163 -191913 -360353
18777 -360353 215514 -237602 -88880 123133 249175 -106506 -182973 -144647 -214018 68326
18766 -177039 -236006 36105 27903 -51221 -219876 114734 59826 102103 -433626 61778 -24535
18754 -169671 -81041 60687 -381222 -31397 -332678 190781 131740 25645 -150834 -253232
18744 -253232 139930 -49767 -98769 4137 -103188 -110691 -24301 -128597 -349078 -7882 -366180
$$ packed form
18822a08952K6411l2033A62402B7772A2159b37085A27751D2695b3734B08797J13617
18811C22414p8169i7973B23076b194j05450A24088B4073c19266g3100A67896o348
18800A61548a34469j35715f06H295a6121A72344L7818a69653a7543m6428H8754
18788F2004j0959a46007e6872p7863l3274M4329C20235A12839i4163r7750j68440
18777c60353B15514b37602h8880A23133J26042a06506p6467L8326o9371F8326
18766a77039n8967C6105q202e1221j68655A14734n4908M2277d33626F1778b4535
18754a69671h1041F0687c81222c1397l01281A90781n9041B5645a50834j02398
18744b53232A39930d9767m9002D137a03188p503b4301j04296k20481g882l58298
$$ plain form
18733 -366180 26745 -191868 -71457 -176545 19301 -38996 -106087 -32124 -47172 -104692 111467
18721 -161418 23835 111884 246050 -277652 -92479 29182 -27555 -212790 -1655 24826 -75342
18709 -319447 114982 160645 -152272 -138689 337082 42595 -293810 -275728 -132436 182353
18698 -148102 -27209 73257 -103777 -121827 -96045 -29031 234148 695944 -185320 34869 156927
18687 156927 142895 -119518 -210963 -158081 -402946 -176798 316021 -214949 115973 -135611
18676 -197905 -21304 95664 327364 -134519 -462938 -218214 -50138 -309238 -82228 -192464
18666 -192464 -218539 -33040 -274279 77411 -44905 18299 -250070 -1412 -14289 -320965 -221648
18655 -221648 146916 59853 -21424 -192375 -351291 -178486 -40174 -163397 -161817 67410 -287763
$$ packed form
18733c66180B6745a91868g1457j05088A9301c8996o7091c2124j5048n7520A11467
18721a61418B3835Q8049J34166b77652i2479B9182b7555j85235a655B4826g5342
18709c19447A14982M5663a52272J3583C37082D2595b93810J8082a32436A82353
18698a48102b7209G3257a03777j8050K5782b9031B34148M61796a85320C4869J22058
18687A56927j4032a19518r1445N2882k44865a76798C16021b14949A15973a35611
18676a97905b1304I5664K31700a34519l28419b18214e0138k59100h2228j10236
18666a92464k6075c3040k41239G7411d4905A8299b50070a412j2877l06676R9317
18655b21648A46916E9853b1424j70951j58916J72805d0174j23223J580F7410b87763
$$ plain form
18643 -232277 -280581 -20314 -44603 432019 -37561 145209 -18631 -67394 104690 47443 -126342
18631 134282 -47778 25531 44747 -235992 -179140 -145572 -209530 -103841 -223479 -134274 164384
18619 -210306 -229361 29420 -175779 -180183 184641 -46828 8902 -117365 281087 -304247 -248103
18608 -248103 128251 -135739 207376 137545 23401 -90215 -144867 79973 -196307 87332 -140456
18596 -159485 -189532 114953 2690 -34241 -234980 224929 -239280 61759 -153982 203095
18585 -43894 163891 2554 124287 -250113 -391468 -118436 -212701 39538 -256194 -49586 289529
18573 97144 -87972 -185950 -55061 -128186 99887 99483 346591 64493 -234616 -97527 148110
18561 -56483 -59834 74556 148577 -87244 -198563 -105826 -195972 -60896 -297663 48170 10564
$$ packed form
18643b32277m8304b0314k4289D32019c7561A45209a8631m8763A04690D7443a26342
18631A34282d7778B5531J9216b35992N6852L3568o3958a03841j19638Q9205A64384
18619b10306j9055B9420a75779m404A84641d6828H902a17365B81087c04247N6144
18608b48103A28251a35739B07376o9831B3401i0215n4652G9973a96307H7332a40456
18596a59485l0047A14953B690c4241k00739B24929b39280F1759a53982B03095
18585d3894A63891B554J21733b50113j41355a18436r4265C9538b56194d9586B89529
18573I7144h7972r7978e5061p3125I9887m04K47108F4493b34616i7527A48110
18561e6483l351G4556P4021h7244j11319R2737r0146f0896k36767D8170A0564
$$ plain form
18549 -111939 -679 -96466 115717 2928 35609 -121427 -158554 -230827 -99881 -157162 -173550 -258743
18537 -258743 -69663 -267558 -91510 -73150 57575 -214635 161794 -101153 155967 -98481
18526 -333540 93281 -73696 -124473 -188564 -308716 -82516 -228382 70418 -170864 90473 -52955
18514 54867 313 -96164 -204612 -46260 -214245 -356836 208382 168972 143678 24225 -89085
18502 42671 -91587 78420 31668 2037 644512 -175229 -21181 1689 158651 -1174 282346
18490 426105 -13198 -140456 98554 106621 195335 48842 212634 291558 156892 180137 241061
18479 241061 17055 -90732 -28405 -91511 -55767 228190 119039 -506403 55928 -83872 -306048
18468 -306048 161963 -162529 -398281 -88082 97554 -56850 -403370 -285750 10767 -184689
$$ packed form
18549a11939f79r5787A15717B928L2681a21427l7127p2273i9881n7281j6388q5193
18537b58743f9663j97895i1510J8360E7575b14635A61794a01153A55967i8481
18526c33540I3281g3696n0777o4091j20152h2516j45866G0418a70864I0473e2955
18514E4867C13i6164j08448d6260j67985j42591B08382l9410k5294B4225h9085
18502D2671i1587G8420C1668B037O42475a75229b1181A689J56962a174B82346
18490D26105a3198j27258I8554Q067Q8714D8842J63792P8924j34666K3245O0924
18479B41061A7055i0732b8405o3106L5744B28190j09151e06403E5928h3872k22176
18468c06048A61963a62529k35752h8082I7554e6850l46520J17620A0767a84689
$$ plain form
18457 286119 -15466 182186 31128 38143 -41132 -80370 234798 -74231 -99849 183590 -30903
18445 -194145 -166971 182524 152469 -89256 23226 -104733 -106620 -107190 28416 -621398 12938
18433 -27538 -135772 -10195 -234920 478744 -226541 81906 24724 -267740 -132854 -85353
18423 -85353 55625 93381 -199969 -122692 -406786 -11071 -436838 -107581 66542 -370291 -220844
18412 -220844 154446 -200793 -288804 -68803 -2187 88950 84960 28354 -2312 75771 281251
18401 281251 -91942 89891 -77565 132229 -49123 -69205 -44899 -60255 -187889 -467355 -468395
18390 -468395 -345514 204770 186695 -95240 -324620 40672 -9940 99154 2776 107585 -137926
18378 -40366 -20272 -89080 46929 202498 -170505 -250783 42412 -19907 268316 77105 -113787
$$ packed form
18457B86119a5466A82186C1128P015d1132l9238B34798g4231k5618A83590c0903
18445a94145K7174A82524l0055h9256B3226a04733j887n70B8416f21398A2938
18433b7538j08234a0195k24725D78744b26541H1906B4724b67740a32854M7501
18423h5353E5625L7756a99969P7277k84094a1071m25767a07581F6542c70291J49447
18412b20844A54446b00793q8011f8803b187H8950l990B8354b312G5771K05480
18401B81251i1942H9891g7565A32229d9123k0082K4306j5356j27634k79466j040
18390d68395J22881B04770j8075i5240k29380D0672i940I9154B776J04809a37926
18378d0366K0094o8808D6929J55569a70505q0278D2412a9907B68316G7105a13787
$$ plain form
18366 112226 32337 -68718 -305786 38864 11984 360864 -41836 36571 -338289 -295227 -9011
18354 81785 75654 -190687 114578 -110485 -51822 -60547 -232448 317857 -22817 -52374 -99651
18343 -99651 -201560 108906 9639 -327638 340673 -155335 -45611 -89314 -94362 -69176 -36158
18332 -36158 138862 -92782 8195 282899 -114041 147227 -139784 31509 -171029 -144473 -126446
18321 -126446 -21741 287272 -87516 154158 -187595 -190081 246077 -223247 67584 -269086
18310 -149812 154064 38859 89289 -96337 -97259 -113622 -9298 27197 89469 -48846 12388 -343388
18297 -29262 -41119 -406953 -86401 -67791 -74009 -113105 -247022 40355 -26155 -133109 -486485
18286 -486485 198060 237916 -36857 -36994 -90085 -75523 -268579 -140972 160602 207152 20084
$$ packed form
18366A12226C2337f8718k37068C8864A1984L48880d1836C6571c38289M3062i011
18354H1785o131a90687A14578a10485e1822q725j71901C17857b2817k9557m7277
18343i9651j01909A08906I639c27638C40673a55335d5611m3703n048K5186L3018
18332c6158A38862i2782H195K74704a14041A47227a39784C1509a71029K6556J8027
18321a26446b1741B87272h7516A54158a87595k486B46077b23247F7584b69086
18310a49812A54064C8859N0430i6337r22j6363i298B7197O2272d8846A2388c43388
18297b9262j1857l65834h6401J8610o218l9096j33917D0355b6155j06954l53376
18286d86485A98060L9856c6857j37n3091J4562j93056J27607A60602M6550B0084
$$ plain form
18274 -479383 -18368 -151223 332340 62294 47470 -14615 293350 -235179 -105576 15211
18263 139769 -85931 110625 340953 -23403 203240 -27968 -109 -65298 -19297 150093 -302424
18251 89724 246400 -95096 327501 -168608 150640 -172889 171293 -218652 4797 -37239
18240 -98726 84973 162159 -107902 272133 62918 -30333 38028 225742 -148123 -100941 171603
18228 -174594 4954 -115940 56488 -32070 -93249 -219359 173104 -4733 -338800 194419 -37075
18216 -317891 -16724 42055 94439 191150 -508849 148182 -189162 33044 206479 266971 -252889
18204 -166599 216889 -175911 58573 194938 298870 -407805 26837 177073 -225 -334215
18194 -334215 -267557 13655 -24680 35319 111293 -164176 -274554 -72454 -43029 32539 13760
$$ packed form
18274d79383a8368j32855C32340F2294j4824a4615B93350b35179a05576A5211
18263A39769h5931A10625K30328b3403B03240b7968a09o5189a9297A50093c02424
18251H9724J56676i5096C27501a68608A50640a72889A71293b18652D797c7239
18240i8726H4973P7186a07902B72133F2918c0333C8028J87714a48123M7182A71603
18228a74594D954a15940E6488c2070o1179j26110A73104d733l34067A94419c7075
18216c17891a6724D2055N2384R6711e08849A48182a89162C3044J73435O0492b52889
18204a66599B16889a75911E8573J36365J03932d07805B6837J50236b25l33990
18194c34215O6658A3655b4680C5319P5974a64176j10378g2454K9425C2539A3760
$$ plain form
18182 -322867 209504 -79267 -43463 -313078 17653 103789 -119798 34131 -112801 -238999
18172 -238999 243553 -53854 13846 -240197 61258 96489 -233756 -4183 159227 -311610 228646
18160 -260904 -120526 -129541 -119059 29179 -9671 -19329 -106544 359887 68015 -162284 -49012
18148 -275731 102478 -38105 -131646 -173751 -212837 -472297 106050 -173690 -139158 263 -539627
18136 -477603 181562 63328 -57476 105414 376992 58751 -40253 51988 -169119 -145076 -268385
18125 -268385 36977 -152015 2139 56250 51712 -173865 99623 -183614 214850 30685 -254923
18113 -240899 39410 -363298 27909 9264 101901 -81026 182219 94740 -253959 73478 108038
18102 108038 67487 -24583 305832 -53719 157551 63411 -22501 141450 -275591 -139086
$$ packed form
18182c22867B09504g9267L5804k69615A7653Q6136a19798C4131a12801j26198
18172b38999B43553e3854A3846b40197F1258L5231b33756d183A59227c11610B28646
18160b60904a20526r015J0482B9179i671r658q7215C59887F8015a62284d9012
18148b75731A02478c8105r3541m2105l9086k59460A06050a73690L4532B63e39627
18136d77603A81562F3328e7476A05414K71578E8751d0253E1988a69119K4043j23309
18125b68385C6977a52015B139N4111m538a73865I9623a83614B14850C0685b54923
18113b40899C9410c63298B7909I264R2637h1026A82219q7479b53959G3478L4560
18102A08038m0551b4583C05832e3719A57551F3411b2501A41450b75591J36505
$$ plain form
18092 -139086 6487 -25297 -142005 -37099 96885 -143462 -165737 185337 -69318 116886 104590
18081 104590 -221614 90906 -42157 -72498 -158585 27008 -64782 -132754 26020 -44830 226783
18069 -119633 37147 -142664 -278843 109363 -67280 166703 -113167 68854 -87966 179934
18058 363426 190477 56141 24876 353884 72689 36063 7394 299563 -138696 -209166 -170
18046 -20996 -156780 95346 134145 -58664 -522429 124968 -260588 -152442 -94950 -103805 -161883
18035 -161883 146611 219352 -235065 -68903 33987 -49829 -142519 166676 364062 -103015
18024 -452463 328562 86503 230696 -184860 -114334 34726 -31909 389922 -104207 57857
18013 154644 77763 -116510 -131925 84815 -74275 34309 -75721 235724 59379 -3955 -66103
$$ packed form
18092a39086F487b5297j16708c7099I6885a43462k2275A85337f9318A16886j2296
18081A04590b21614I0906d2157l0341q6087B7008f4782o7972B6020d4830B26783
18069a19633C7147a42664j36179A09363f7280A66703a13167F8854h7966A79934
18058C63426j72949E6141B4876L29008G2689C6063G394K92169a38696p0470a70
18046b0996j35784I5346L8799e8664m63765A24968b60588J08146N7492q855n8078
18035a61883A46611P2741b35065f8903C3987d9829r2690A66676J97386a03015
18024d52463C28562H6503J44193a84860P0526C4726c1909C89922a04207E7857
18013A54644p6881a16510j5415H4815g4275C4309g5721B35724E9379c955o2148
$$ plain form
18002 -66103 150853 -188428 -61628 -67159 130278 200911 54991 -180898 -248775 -196639 -131153
17991 -131153 203051 30175 158917 60127 -208051 -107817 -6540 -200957 139155 100249
17981 100249 -178048 102790 142969 80255 -56520 -15638 -153156 91096 365161 -382604
17970 47398 32141 211156 18268 11902 11868 88727 -122375 192727 86207 -66647 -18351 70955
17957 -104215 -192415 195006 67354 239229 62045 -91350 -51642 -37867 60613 -72947 -27477
17945 69661 -208707 -305295 169296 44117 102628 -239164 -285987 -334950 -53645 -12425 -33350
17934 -33350 290856 100670 134507 58102 -98984 -92157 -76843 -45684 -204531 243708 147865
17923 147865 -115783 -142742 -26405 -72018 -226740 -17075 -338043 174274 30738 -222341
$$ packed form
18002f6103A50853a88428f1628n531A30278P0633E4991a80898o7877N2136O5486
17991a31153B03051C0175J28742F0127b08051J00234f540j94417A39155l8906
17981A00249a78048A02790M0179o2714e6520a5638j37518I1096K74065c82604
17970D7398j5257J79015A8268o366l4P6859a22375A92727H6207f6647a8351G0955
17957a04215q8200A95006F7354J71875F2045i1350L9708J3775F0613g2947b7477
17945F9661b08707r6588A69296D4117N8511b39164m6823m8963e3645a2425k0925
17934c3350B90856A00670L3837E8102i8984O827J5314L1159j58847B43708r5843
17923A47865a15783k6959b6405m5613j54722a7075l20968A74274C0738b22341
$$ plain form
17912 -107769 6873 102828 -142304 -41906 -50358 -62580 299806 -212808 13057 -134567 -68261
17901 -68261 48305 -222684 -226033 102801 166004 207135 -481337 358354 -19760 -291109 -91831
17889 -49342 -20584 -414476 -79725 7340 -21770 -250232 49469 58879 196095 198597 81131 147524
17877 147524 -189627 -83985 -86086 7298 -84883 157681 -165789 188972 74778 -47105 -514225
17866 -514225 -100340 -32956 91234 -140199 -305961 -126656 -80567 -68933 -397559 95624
17855 -162084 -189083 -119010 57341 -209131 360386 230388 -123770 9414 172457 -201228
17844 -327562 54333 -61877 123146 -87817 142193 172270 -162343 407376 -198124 -212272
17834 -212272 339335 -125256 -277221 80713 -14926 -186702 -79021 163027 -119889 -20811
$$ packed form
17912a07769F873R5955a42304d1906q452j2222B99806b12808A3057a34567O6306
17901f8261D8305b22684l349A02801O3203M1131d81337C58354a9760k71349i1831
17889d9342b0584l93892g9725G340b1770k28462D9469R410J37216K502H1131O6393
17877A47524a89627h3985k101G298h4883A57681a65789A88972G4778d7105m67120
17866e14225a00340c2956I1234a40199j65762a26656M6089J1634l28626I5624
17855a62084k6999P0073E7341b09131C60386j29998a23770I414J63043b01228
17844c27562E4333f1877A23146h7817A42193L0077a62343D07376a98124j4148
17834b12272C39335a25256j51965H0713a4926j71776g9021A63027a19889b0811
$$ plain form
17823 127997 61576 35101 285648 -255120 -216930 102193 -4125 -146970 -100177 -61757 33566
17811 40104 -339643 74116 229019 -33528 -52338 -105593 -4709 38490 344889 -52339 163758
17799 142082 -7595 293761 246176 -122210 -121838 382254 -172441 154948 -14490 383881 -176974
17787 -24030 154966 230664 251464 -39948 -151392 26312 -234000 310489 66788 15231 -467966
17775 -237471 368280 385404 173985 176437 -205577 -19628 90327 306993 35876 1168 -58415
17763 21381 -314841 -14436 147076 40743 -37835 -109994 -82935 44279 -21051 32983 169838
17752 169838 173330 156015 -39954 -10354 45052 -1740 -114774 25052 -221990 109110 63298
17741 63298 17389 -212887 98370 -432875 81021 27060 -52373 335599 -134551 -38744 56963
$$ packed form
17823A27997F1576k6475K50547b55120L8190A02193d125j42845M6793L8420C3566
17811D0104c39643G4116J54903c3528j8810n3255d709C8490L06399e2339A63758
17799A42082g595B93761m7585a22210L72C82254a72441A54948a4490C83881a76974
17787b4030A54966P5698K0800c9948j11444B6312b34000C10489F6788A5231d67966
17775b37471C68280J7124A73985K452b05577a9628I0327K16666C5876A168e8415
17763B1381c14841a4436A47076D0743c7835p2159K7059D4279b1051C2983J36855
17752A69838L492j7315c9954a0354D5052a740j13034B5052b21990A09110m5812
17741F3298A7389b12887I8370d32875H1021B7060e2373C35599a34551c8744E6963
$$ plain form
17729 -153569 -236987 -56534 -32088 -98005 -309189 -150318 -9012 -417046 -41624 340820 -223945
17717 -214713 60677 187611 -17117 -26893 14256 -28031 175874 62116 -181491 -202923 138525
17705 26592 -146775 210896 -17374 396105 -64953 -279910 73155 52918 -3162 243772 13158
17693 56367 35513 -359200 -289173 -43990 67922 -93351 3811 63897 346119 -76735 -293701
17682 -293701 316788 131815 15046 -187023 152893 319882 83851 125955 -160583 152153
17671 23224 236994 56397 -198340 -173384 165683 -148462 94836 -9626 295026 -146105 -131547
17660 -131547 -66791 -139996 18503 -150508 -141432 -100083 77900 24895 232869 23905 -28510
17648 -305114 288473 57419 163903 -141456 -82466 62598 -185509 -193210 -12121 -86912 -137139
$$ packed form
17729a53569q3418e6534K4446o5917k11184a50318i012m08034d1624C40820b23945
17717b14713F0677J26934a7117r776A4256b8031A75874F2116a81491k1432A38525
17705B6592a46775B10896a7374C96105f4953k14957G3155k0237c162B43772A3158
17693E6367k0854c59200P0027d3990F7922i3351C811O0086K82222g6735k16966
17682b93701C16788A31815A5046a87023A52893J66989H3851M2104a60583A52153
17671B3224K13770E6397a98340K4956A65683a48462I4836i626B95026a46105J4558
17660a31547O4756p3205A8503a50508R076M1349G7900B4895K07974B3905b8510
17648c05114B88473E7419J06484a41456N8990F2598a85509p701a2121p4791n0227
$$ plain form
17637 -137139 -126299 -110667 161146 -19301 123225 156275 -68132 -50648 -25515 -114411 187583
17625 -159446 -42041 176498 64502 -245299 -178122 -251002 -64417 -93427 -299949 -63446 347831
17613 131579 67583 73836 81056 436718 40468 -146721 -212576 -195199 125169 22640 218131
17602 218131 171214 153326 142051 239036 36398 374424 192194 152515 -32261 -25974 109730
17590 38363 27197 -126859 133451 15405 -539585 -118381 14207 163422 309776 -145646
17579 147688 -10901 245316 92399 162820 253704 167064 24815 -147830 99141 97655 -131298
17567 -173035 166309 -69315 124797 391227 135438 25174 -233998 -110555 -176467 113387
17556 209854 272095 -19662 145634 -88167 312073 -213736 85895 -240074 26359 248365
$$ packed form
17637a37139J0840J5632A61146a9301A23225L3050f8132J7484K5133q8896A87583
17625a59446d2041A76498F4502b45299O7177p2880f4417k9010k06522f3446C47831
17613A31579o3996O253P220L55662D0468a46721o5855J7377A25169B2640J95491
17602B18131m6917j7888j1275R6985C6398L38026j82230l9679c2261O287A09730
17590C8363j1166a26859A33451A5405e39585a18381A4207J49215J46354a45646
17579A47688a0901B45316I2399P0421R0884q6640B4815a47830I9141j486a31298
17567a73035A66309f9315A24797K66430A35438B5174b33998a10555o5912A13387
17556B09854O2241a9662A45634h8167C12073b13736H5895b40074B6359K22006
$$ plain form
17546 248365 -19972 -2874 -95239 84517 -296200 171768 26463 54048 126889 7882 84010
17535 84010 86540 154515 72151 313977 134258 44049 14186 313955 -16983 105669 8221
17523 345914 112439 121956 137729 153187 -352939 -249781 -303493 225623 39893 273858 -175128
17511 246190 -61214 -37327 145319 85553 110132 164885 144878 -347703 144131 171811 137048
17500 137048 295372 271508 203114 -317842 -10431 -48711 187695 224300 136966 -30456 21875
17488 225559 379727 -7540 -248739 168446 -110916 188270 46680 31060 -69216 249658
17477 37248 -9954 158427 -131742 -131344 101096 157152 216233 103938 5084 226619 -237298
17465 -43437 -25694 119201 154930 -119324 141335 -121551 -65396 472365 -127371 122375
$$ packed form
17546B48365a9972b874r2365H4517b96200A71768B6463K7585P2841G882P6128
17535H4010K530O7975G2151K41826A34258D4049A4186K99769a6983A05669H221
17523C45914A12439R517J5773J5458c52939J03158n3712B25623C9893K33965a75128
17511B46190f1214K3887A45319n9766K4579N4753k0007c47703A44131K7680l4763
17500A37048J58324k3864o8394c17842a0431l8280A87695L6605q7334c0456B1875
17488B25559J54168g540k41199A68446a10916A88270D6680j5620f9216B49658
17477C7248i954A58427a31742L98A01096N6056N9081A03938E084K21535b37298
17465d3437J7743A19201L5729a19324A41335a21551N6155D72365a27371A22375
$$ plain form
17454 -40550 -72377 -57543 166867 339659 123763 117116 305613 420288 261568 517194
17444 517194 355199 -105562 415840 305961 181550 57360 212810 -38739 142001 -207789
17433 181583 367348 230956 320202 170219 197932 366148 111665 331746 -54989 454265
17422 302509 -48040 297325 59594 41646 97019 9129 287791 243905 409234 383040 196303
17411 196303 85773 -28175 180532 280861 385947 231596 405090 224511 -103945 373643
17400 2949 -61118 358575 -258505 298845 33539 242824 -92778 119531 -13747 284715 123550
17388 74058 201769 356136 322032 -99852 61865 99822 354485 -60187 -215706 -289655 199476
17376 338025 321167 -18869 172748 182212 -62482 147215 78004 297127 -1887 225690 289397
$$ packed form
17454d0550l1827J4834A66867J72792A23763o647J88497J14675j58720K55626
17444E17194j61995a05562D15840j09879j24411E7360J55450c8739A42001b07789
17433A81583J85765j36392Q9246j49983K7713J68216A11665K20081e4989D54265
17422C02509d8040B97325E9594j7948N5373I129K78662m3886J65329k6194j86737
17411A96303H5773b8175A80532J00329J05086j54351J73494j80579a03945C73643
17400B949f1118C58575b58505B98845C3539K09285i2778A19531a3747B84715A23550
17388G4058J27711J54367l4104i9852F1865L7957K54663f0187j55519p3949A99476
17376C38025j6858a8869A72748R464f2482A47215o9211K19123a887B25690O3707
$$ plain form
17365 289397 375855 85942 225361 304616 -64458 98560 16651 263126 283407 -248196 -333868
17354 -333868 130489 340820 -27684 28511 -82488 434029 94431 176732 176364 150402 146703
17343 146703 -8821 287417 33972 493040 197634 199121 199589 -28061 297690 178904 257762
17332 257762 -92140 50485 301482 13793 178050 -46454 131618 -81657 104928 101131 112926
17321 112926 275840 346838 45150 228700 267297 646581 114434 7406 47644 21128 371857
17310 371857 64861 100134 406432 90874 -66746 18572 38533 104827 236681 -72316 139868
17298 152466 16510 396910 346735 162132 -241425 145989 327581 96070 320007 337752
17288 337752 264621 124197 283401 -17376 71639 279147 224195 -97 24354 317460 190380
$$ packed form
17365B89397Q6458H5942J39419P9255f4458I8560A6651K46475K0281b48196q5672
17354c33868A30489K10331b7684B8511h2488D34029I4431Q2301l68k5962l699
17343A46703h821B87417C3972M59068A97634J487M68b8061B97690j18786P8858
17332B57762i2140E0485K50997A3793J64257d6454A31618h1657A04928l797J1795
17321A12926J62914P0998D5150J83550L8597L79284A14434G406M0238B1128L50729
17310C71857F4861L5273L06298I0874f6746A8572J9961O6294J31854g2316A39868
17298A52466A6510L80400n0175A62132b41425A45989J81592I6070K23937J7745
17288C37752p3131A24197J59204a7376G1639K07508n4952i7B4354K93106j27080
$$ plain form
17277 190380 -102374 273663 360973 -38780 28013 278730 375885 287365 70071 -321268 275446
17265 373292 198542 177411 103188 252848 276849 90158 225859 -60220 94115 229932 -26627
17253 235208 35103 422388 323640 420320 233858 257503 163589 514111 493125 12121 302761
17242 302761 350769 362977 340224 137368 216707 -56461 -68702 245003 187036 82488 94400
17231 94400 -161306 329957 474740 53592 -30702 102427 168587 -84132 132634 329533
17221 329533 15980 310141 -125293 571131 -7687 214231 246160 242926 72735 153901 264659
17210 264659 26111 355870 276178 428340 114280 291985 381224 402513 211964 277828
17200 277828 255782 468608 207081 329291 194722 118655 545616 264837 250501 286833
$$ packed form
17277A90380a02374B73663Q7310c8780B8013K50717R7155q8520G0071c21268B75446
17265C73292j74750k1131p4223J49660K4001I0158J35701f0220I4115J35817b6627
17253B35208C5103L87285r8748R6680j86462K3645r3914L50522k0986A2121K90640
17242C02761M8008J2208k2753A37368P9339e6461j2241B45003n7967H2488J1912
17231I4400a61306C29957J44783E3592c0702A02427O6160h4132A32634J96899
17221C29533A5980K94161a25293E71131g687B14231L1929l234G2735Q1166J10758
17210B64659B6111L29759p9692J52162A14280J77705Q9239K1289j90549O5864
17200B77828k2046K12826B07081J22210j34569p6067M26961B64837j4336L6332
$$ plain form
17190 286833 196376 267884 329052 -233645 242700 312204 253820 261121 158569 358888 125510
17178 287165 331291 -10372 687555 490089 272399 405770 602935 146375 609893 272800
17167 208506 284412 548898 241610 345168 56295 226251 51363 349069 394015 205452
17157 205452 227413 292289 368226 295754 273130 335242 77352 308343 227341 79526 442795
17146 442795 525837 443844 208322 224813 342403 308647 176542 219714 265922 462824 137776
17134 242931 178097 558563 76924 688325 227062 168036 267144 209608 313134 508544
17124 508544 646254 317134 384078 156798 19772 422369 -136484 82225 222642 157673
17114 157673 129765 490313 327008 561612 530165 7813 362310 208752 211268 155632 609805
$$ packed form
17190B86833r0457P1508O1168b33645B42700O9504n8384P301j02552K00319A25510
17178B87165M4126a0372F87555j97466k17690J33371J97165A46375M63518B72800
17167B08506P5906K64486B41610J03558E6295J69956E1363K97706M4946j88563
17157B05452K1961O4876P5937p2472k2624O2112G7352K30991q1002G9526L63269
17146D42795Q3042q1993B08322J6491J17590l3756j32105M3172M6208J96902A37776
17134B42931o4834L80466G6924O11401B27062n9026R9108n7536J03526J95410
17124E08544J37710C17134O6944A56798A9772M02597a36484H2225J40417o4969
17114A57673k7908L60548j63305K34604l1447G813L54497j53558K516n5636M54173
$$ plain form
17103 609805 344576 383955 392797 557913 418885 241999 151539 367015 264498 109767
17092 337796 94645 102017 509524 491566 348816 428675 651896 117284 636856 193770
17081 293653 129088 489740 170875 161554 638767 605066 344084 484161 120407 204465
17071 204465 288074 393592 450486 391595 429732 605768 358325 412290 627183 508904
17061 508904 369913 331084 546190 770380 754340 335860 604531 558018 471443 345700
17051 345700 670175 198194 391587 394003 571583 282949 457188 324346 500838 428101
17041 428101 555705 502446 779162 862142 663998 766788 429258 477346 499805 458292
17031 458292 762620 607061 165110 508272 856504 582005 393677 535092 841017 383350
$$ packed form
17103F09805k65229L9379Q842J65116j39028j76886r0460K15476j02517A09767
17092C37796I4645P372M07507j7958j42750P9859K23221A17284N19572A93770
17081B93653A29088L60652A70875r321M77213l3701k60982J40077A20407Q4058
17071B04465Q3609J05518N6894n8891L8137J76036k47443N3965K14893j18279
17061E08904j38991l8829K15106K24190j6040C35860K68671m6513q6575j25743
17051C45700L24475A98194J93393K416J77580B82949J74239j32842J76492p2737
17041D28101J27604n3259K76716Q2980j98144J02790l37530M8088K2459m1513
17031D58292L04328j55559A65110L43162L48232k74499j88328J41415L05925C83350
$$ plain form
17020 718670 718068 631193 775846 824297 297074 410107 661683 690048 555587 637346 753116
17009 753116 635121 717787 608035 673715 578411 491797 594320 546311 807884 716335 715261
16998 715261 793197 936715 679382 631084 562797 841965 899838 924778 732264 935980
16988 935980 748217 807758 945649 852858 936634 689640 1008757 813315 960563 757380
16978 757380 923787 976337 606169 764196 1204569 707281 1179781 868530 1100778 1156844
16968 1156844 1061387 1138666 739695 757645 846020 812857 966438 914396 1152498 493144
16957 1013624 983856 989383 1370973 855274 1218458 701309 1090751 1132922 1071466 1217745
16947 1217745 1219569 1083326 1015431 857676 882443 927630 1310016 1188906 1257270 1266567 1047138
$$ packed form
17020G18670o02q6875J44653M8451B97074J13033K51576K8365j34461Q1759J15770
17009G53116j17995Q2666j09752O5680r5304q6614J02523m8009K61573r1549j074
16998G15261P7936J43518k57333m8298o8287K79168N7873K4940j92514K03716
16988I35980j87763N9541J37891r2791Q3776k46994L19117j95442J47248k03183
16978G57380J66407N2550l70168J58027M40373m97288M72500l11251K32248N6066
16968A156844r5457P7279l98971J7950Q8375l3163J53581n2042K38102D93144
16957A013624k9768N527L81590n15699L63184n17149L89442M2171o1456J46279
16947A217745J824j36243o7895j57755K4767M5187L82386j21110O8364R297k19429
$$ plain form
16936 1047138 1357627 962096 1404122 1496018 1233515 1207697 1315636 1538298 1407714 1148656
16926 1148656 1173353 1137425 1226856 1486111 1740022 1357762 1227886 1163471 1478066 1680912
16916 1680912 1702736 1446927 1834209 1524891 1316125 1440918 1353324 1747853 1419266 1478372
16906 1478372 1517945 1669315 1686431 1515257 1831336 1782082 1696223 1819842 1673490 2023191
16896 2023191 1932671 1548602 1725454 1834181 2105379 1893385 2046869 1680089 2024001 2125830
16886 2125830 1630927 2142637 1948282 1917796 2013863 2196441 2008063 2143300 2129138 2174451
16876 2174451 2369366 2548049 2493669 2454288 2241602 2452067 2619232 2469619 2515446 2702927
16866 2702927 2139365 2020281 2642259 2830838 2589336 2564943 2694330 2948169 2890968 2970925
$$ packed form
16936A047138L10489l95531M42026R1896k62503k5818J07939K22662j30584k59058
16926A148656K4697l5928Q9431K59255K53911l82260j29876o4415L14595K02846
16916A680912K1824k55809L87282l09318k08766J24793q7594L94529l28587N9106
16906A478372L9573J51370J7116j71174L16079m9254q5859J23619j46352L49701
16896B023191r0520l84069J76852J08727K71198k11994J53484l66780L43912J01829
16886B125830m94903N11710j94355l0486R6067J82578j88378J35237j4162M5313
16876B174451J94915J78683n4380l9381k12686K10465J67165j49613M5827J87481
16866B702927n63562j19084O21978J88579k41502k4393J29387K53839n7201P9957
$$ plain form
16856 2970925 2924842 3077829 3011356 2952051 2844317 3030532 3246128 3325760 3125424 3179583
16846 3179583 3460796 3652704 3785128 3615474 3895560 3594026 3505649 3833575 3626677 3863127
16836 3863127 3964571 3817738 4275258 4389512 4213168 4423887 4568278 4652179 4236106 4589238
16826 4589238 4744309 4883613 4993389 5178678 5115152 4955417 5140155 5154119 5625733 5648917
16816 5648917 5751759 5871628 6031120 6086267 6159837 6099207 6248952 6761880 6782968 6521858
16806 6521858 6912769 7113347 7497833 7477890 7801789 7850929 7914223 7966651 8179438 8537348
16796 8537348 8639686 8767229 9156989 9132699 9606064 9725527 9838705 10480725 10750844 11043169
16786 11043169 11187965 11602276 11964744 11922994 12613884 12631957 13101224 13571867 13674227 14192854
$$ packed form
16856B970925m6083J52987o6473n9305j07734J86215K15596P9632k00336N4159
16846C179583K81213J91908J32424j69654K80086l01534q8377L27926k06898K36450
16836C863127J01444j46833M57520J14254j76344K10719J44391Q3901m16073L53132
16826D589238J55071J39304J09776J85289o3526j59735J84738J3964M71614K3184
16816E648917J02842J19869J59492N5147P3570o0630J49745N12928K1088k61110
16806F521858L90911K00578L84486j9943L23899M9140O3294N2428K12787L57910
16796H537348J02338J27543L89760k4290M73365J19463J13178O42020K70119K92325
16786A1043169J44796M14311L62468m1750O90890J8073M69267M70643J02360N18627
$$ plain form
16776 14192854 14754355 15488219 15878386 16127849 16973930 17313202 17955760 18414947 19042529
16767 19042529 19859510 20681651 21218288 22171202 22849022 23743627 24908274 25636690 26704105
16758 26704105 27940613 28809868 30370867 31381223 32858391 34635386 35709340 37516735
16750 37516735 39712837 41665044 43218424 45414591 47604622 50080073 52745568 55372871
16742 55372871 58487719 61902365 65100896 69107439 72778254 76879571 80971388 85685878
16734 85685878 90467624 95656938 101579737 106571771 112743194 119066741 125291913 131592167
16726 131592167 138117561 144641587 150498092 156068405 161436974 166521825 170217782 173361917
16718 173361917 175433186 176322749 176083326 175345331 172988938 169860385 166291829 161059159
$$ packed form
16776A4192854N61501P33864L90167K49463Q46081L39272O42558M59187O27582
16767A9042529Q16981Q22141N36637R52914O77820Q94605J164647P28416J067415
16758B6704105J236508Q69255J560999J010356J477168J776995J073954J807395
16750C7516735K196102J952207J553380K196167K190031K475451K665495K627303
16742E5372871L114848L414646L198531M006543L670815M101317M091817M714490
16734H5685878M781746N189314N922799M992034O171423O323547O225172O300254
16726A31592167O525394O524026N856505N570313N368569N084851L695957L144135
16718A73361917K071269Q89563k39423p37995k356393l128553l568556n232670
$$ plain form
16710 161059159 155498707 149832065 143579117 137220634 130458256 123808477 117459445 111190633
16702 111190633 105021604 99477733 93555319 88669376 83464140 78558154 74368877 70635477
16694 70635477 66522227 62723153 59614293 56120001 53178962 50334255 47813274 45274214
16686 45274214 43409746 41101997 39336278 37182065 35513304 34198187 32771534 31139035
16678 31139035 30022700 28592943 27334817 26115700 25412227 24189901 22819278 22148973
16670 22148973 21549554 20749527 20099958 19246760 18601046 17743551 17344575 16663980 16173544
16661 16173544 15649602 14898608 14346193 13984100 13492867 13360622 12994231 12296886 11850605
16652 11850605 11935805 11234413 10653710 10587076 10346945 9939470 9574841 9526985 9778425 8999566
$$ packed form
16710A61059159n560452n666642o252948o358483o762378o649779o349032o268812
16702A11190633o169029n543871n922414m885943n205236m905986m189277l733400
16694G0635477m113250l799074l108860l494292k941039k844707k520981k539060
16686D5274214j864468k307749j765719k154213j668761j315117j426653j632499
16678C1139035j116335j429757j258126j219117p03473j222326j370623o70305
16670B2148973n99419q00027o49569q53198o45714q57495l98976o80595m90436
16661A6173544n23942p50994n52415l62093m91233j32245l66391o97345m46281
16652A1850605Q5200p01392n80703o6634k40131m07475l64629m7856K51440p78859
$$ plain form
16642 8999566 8924871 8640167 8326921 8177406 7886633 7394870 7378270 7312649 7179611 6853752
16632 6853752 7018839 6864622 6326277 6514811 6310322 6247336 5693184 5739221 5837977 5432511
16622 5432511 5290941 5361276 5147596 5180618 5231609 4692413 4709327 4549794 4632920 4374616
16612 4374616 4171245 4264582 4214072 4213494 3802360 3934832 3940247 3944988 3451501 3879614 3649300
16601 3649300 3822206 3455084 3332220 3414885 3377927 3310340 3104599 3199698 2978975 2844825
16591 2844825 2809398 2900505 3061076 2808285 3107976 3086249 2512167 2678651 2684352 2668466
16581 2668466 2665167 2461188 2092543 2338791 2277044 2431781 2512790 2104133 2192836 2062955
16571 2062955 2046312 1978394 2145809 1991935 2224066 1916663 2181147 1921228 1892471 1895570
$$ packed form
16642H999566p4695k84704l13246j49515k90773m91763j6600o5621j33038l25859
16632F853752J65087j54217n38345J88534k04489o2986n54152M6037R8756m05466
16622E432511j41570P0335k13680L3022N0991n39196J6914j59533Q3126k58304
16612D374616k03371R3337n0510n78m11134J32472N415M741m93487M28113k30314
16601C649300J72906l67122j22864Q2665l6958o7587k05741R5099k20723j34150
16591B844825l5427R1107J60571k52791K99691k1727n74082J66484N701j5886
16581B668466l299k03979l68645K46248o1747J54737Q1009m08657Q8703j29881
16571B062955j6643o7918J67415j53874K32131l07403K64484k59919k8757L099
$$ plain form
16561 1895570 1841319 1836311 1857960 1916418 1963874 1577864 1689951 1888546 1858917 1581827 1657869
16550 1657869 1955327 1460621 1597798 1243818 1561769 1713837 1480132 1274740 1621441
16541 1621441 1720887 1263643 1527812 1142328 1240559 1324848 1445215 1229457 1226313 1399796
16531 1399796 1565505 1301557 1192700 1467351 1151884 1200386 1314671 841261 1125506 953386
16521 953386 1099845 1116867 1137351 1208681 1051966 1023840 1280627 883350 1034572 1163552
16511 1163552 828768 945264 791810 616474 857958 940684 1102039 1004606 1288661 1044765
16501 1044765 888951 939519 1135645 959064 854568 1046614 670398 1071999 863074 928157
16491 928157 692200 990112 877680 901739 953314 600982 225524 881810 1062563 818313
$$ packed form
16561A895570n4251n008K1649N8458M7456l86010J12087J98595k9629k77090P6042
16550A657869K97458m94706J37177l53980L17951J52068k33705k05392L46701
16541A621441R9446m57244K64169l85484R8231Q4289J20367k15758l144J73483
16531A399796J65709k63948j08857K74651l15467M8502J14285m73410K84245j72120
16521I53386J46459J7022K0484P1330j56715k8126K56787l97277J51222J28980
16511A163552l34784J16496j53454j75336K41484Q2726J61355r7433K84055k43896
16501A044765j55814N0568J96126j76581j04496J92046l76216M01601k08925O5083
16491I28157k35957K97912j12432K4059N1575l52332B25524O56286J80753k44250
$$ plain form
16481 818313 650540 580135 925785 684265 729266 747260 1062633 541299 805881 718148
16471 718148 602811 504321 630481 527425 540980 925776 486879 513154 771349 896457
16461 896457 460153 707228 728471 436346 639927 724658 332354 695382 1077786 560075
16451 560075 743873 701167 660269 656047 185000 643612 398187 290647 341480 648747
16441 648747 772671 416322 712602 409605 815552 496204 821808 681884 105096 556094
16431 556094 532868 260155 362898 341502 476780 242015 484812 756031 580518 454146
16421 454146 504559 220930 484853 449596 503283 144797 566320 296010 277660 675930
16411 675930 700736 630698 432957 459669 -225356 488065 322017 396844 189081 259543
$$ packed form
16481H18313j67773p0405L45650k41520M5001J7994L15373n21334K64582q7733
16471G18148j15337r8490J26160j03056J3555L84796m38897K6275K58195J25108
16461H96457m36304K47075K1243k92125K03581Q4731C32354L63028L82404n17711
16451E60075J83798m2706m0898m222A85000M58612k45425j07540N0833L07267
16441F48747J23924l56349K96280l02997M05947l19348L25604j39924A05096M50998
16431E56094k3226B60155J02743k1396J35278k34765K42797K71219j75513j26372
16421D54146N0413B20930K63923l5257N3687A44797M21523k70310j8350L98270
16411F75930K4806p0038j97741K6712b25356D88065j66048P4827A89081P0462
$$ plain form
16401 259543 273082 431409 331538 237517 261680 245548 134883 -16737 404510 5561 249807
16390 249807 469146 486696 56905 222974 298772 166451 82615 492946 263983 427829
16380 427829 207623 232577 293989 50834 312852 353695 240738 268050 134265 99935 373979
16369 373979 501044 303874 156564 366223 254462 278156 250231 446733 59171 396083
16359 396083 74678 220890 207652 585324 483127 312004 302519 120194 494029 14246
16348 354858 513890 407915 146997 131312 265673 297877 151161 428349 204473 435608
16338 435608 370728 -154038 155166 222652 137329 300720 -42006 417746 310538 293538
16328 293538 -16846 -109985 99630 443286 -106396 269397 17060 393117 145404 79748
$$ packed form
16401B59543J3539J58327r9871r4021K4163j6132j10665a6737D04510E561K44246
16390B49807K19339J7550E6905J66069P5798j32321H2615M10331k28963J63846
16380D27829B07623K4954O1412E0834K62018M0843j12957K7312j33785l4330K74044
16369C73979J27065j97170j47310K09659j11761K3694k7925J96502E9171L36912
16359C96083G4678J46212j3238L77672j02197j71123r485A20194L73835A4246
16348C54858J59032j05975A46997j5685J34361L2204j46716K77188B04473K31135
16338D35608o4880a54038A55166O7486q5323J63391d2006D17746j07208j7000
16328B93538a6846r3139I9630L43656a06396B69397A7060L76057A45404o5656
$$ plain form
16318 79748 213318 52033 -9084 98051 -62922 192310 271384 242805 202553 120604 113540 106960
16306 106960 26855 -10331 342082 54040 260438 -5670 308481 225694 51194 336734 180604
16295 180604 161818 134807 -33549 78888 133116 23346 -26737 -252653 178299 -72721 437214
16283 6 370474 137471 31904 309250 -8801 -175233 161730 161648 300996 -170223 27582 81742
16271 81742 97723 256489 58747 384316 -180448 -207595 -153837 75280 -23442 224271 127244
16260 127244 128213 293114 -63830 -177 69107 20470 261290 -96861 177400 -133650 -88217
16249 -88217 106533 65370 347327 -138827 -98145 -65371 -15730 -74316 -243593 171034 388052
16238 388052 -12497 205972 144106 8211 287526 -160820 -56746 405433 27896 318204 241493
$$ packed form
16318G9748J33570E2033i084I8051f2922A92310P9074k8579m0252q1949p064o580
16306A06960B6855a0331C42082E4040K06398e670C08481q2787E1194K85540j56130
16295A80604j8786k7011c3549G8888N4228B3346b6737k25916A78299g2721D37214
16283FL70468A37471C1904K77346h801j66432A61730q2J39348a70223B7582N4160
16271H1742J5981J58766E8747L25569a80448k7147N3758G5280b3442B24271r7027
16260A27244R69J64901f3830a77F9107B0470K40820i6861A77400a33650M5433
16249h8217A06533m1163K81957a38827M0682L2774a5730n8586j69277A71034K17018
16238C88052a2497B05972o1866H211K79315a60820e6746D05433B7896K90308p6711
$$ plain form
16227 241493 252103 -87193 29753 219775 -7948 72999 -63678 -122763 627217 164680 7089
16215 316862 22706 244035 234297 68552 -310491 -194436 -59567 202933 72832 -48753 3838
16203 266354 229925 -301580 -97873 -265007 246328 165203 342828 282328 -33948 134509
16192 141644 184447 -151236 181111 45746 -97757 23577 345160 15363 140641 -67124 277110
16180 -212865 -84416 15916 -92414 124108 308419 -88129 -103598 -23034 65164 -11884 -150981
16169 -150981 289469 -75061 63676 5726 188593 -1450 -18995 -277017 200185 409606 391269
16158 391269 -61851 21310 48902 21237 -82217 -82921 -149747 -195082 103713 42438 -42033 185500
16145 362049 27817 -53947 -2990 199332 359014 2969 516382 223617 -45823 108454 99441
$$ packed form
16227B41493J0610h7193B9753J90022g948G2999f3678n9085F27217A64680G089
16215C16862B2706K21329r738F8552c10491J16055e9567B02933G2832d8753C838
16203B66354l6429c01580i7873j67134B46328q1125J77625o0500c3948A34509
16192A41644M2803a51236A81111D5746i7757B3577L21583A5363J25278f7124B77110
16180b12865h4416A5916i2414A24108J84311h8129j5469b3034F5164a1884j39097
16169a50981B89469g5061F3676E726J82867a450j7545k58022B00185K09421j8337
16158C91269f1851B1310K7592B1237h2217p04o6826m5335A03713D2438d2033A85500
16145C62049B7817e3947b990A99332J59682B969N13413B23617d5823A08454r013
$$ plain form
16134 99441 203181 93596 -152047 -172781 -28226 -221871 9191 -147050 217664 124471 -253184
16122 76528 -226334 -32901 307144 -405857 -275628 -30476 -45322 -4486 337458 -85105 -27193
16110 15766 26459 130926 41387 -10728 60852 -231826 -106713 7625 -25206 -156028 -106811
16099 -106811 12374 261224 -5086 132829 -183610 60446 50121 63781 154240 48733 -8781
16087 201110 235900 208414 295230 112969 -3633 -69193 -58976 86 102771 181159 -104410 24413
16074 45061 161435 -108806 4911 92990 -90185 -283650 147632 -49289 86811 -266234 12083
16062 -206879 98951 -37406 -81167 -253093 -368176 -132510 -41965 -74431 63398 299889 -150441
16050 109525 5622 -52999 -232484 175170 -167996 155854 29049 -18372 -147580 -162994 -400663
$$ packed form
16134I9441J03740I3596a52047k0734b8226j93645I191a47050B17664r3193b53184
16122G6528b26334c2901C07144d05857J30229c0476j4846d486C37458h5105b7193
16110A5766J0693J04467D1387a0728F0852b31826a06713G625b5206j30822M9217
16099a06811A2374K48850e086A32829a83610F0446j0325J3660R0459D8733h781
16087B01110L4790k7486Q6816A12969c633o5560J0217H6J02685P8388a04410B4413
16074D5061J16374a08806D911Q8079i0185j93465A47632d9289H6811b66234A2083
16062b06879I8951c7406m3761j71926j15083a32510d1965l2466F3398K36491a50441
16050A09525E622e2999j79485A75170a67996A55854B9049a8372j29208j5414k37669
$$ plain form
16039 -400663 7755 226614 -172273 -219206 159683 -231168 -115188 219347 -23278 103468
16028 203080 99040 -235267 28787 -5062 -39619 -124271 197219 99673 -87209 -131713 -260464
16017 -260464 -99228 -240502 -106522 -192053 -84084 -64374 246940 49663 -108662 -55788 53065
16005 347519 5489 10005 129135 -112350 -114562 5042 55644 -6922 106455 -134893 -8643 -320761
15993 -320761 -182525 168242 238441 -293008 -74247 -255848 50952 138010 112625 -7015 -220967
15982 -220967 673931 384773 445947 445879 89610 127418 182249 -254908 -190213 -76897 3138 406869
15970 406869 -212298 92442 112094 -204084 151592 -106822 -79644 417970 -182487 -96928
15960 -96928 26683 109223 125424 -361472 -340975 -4773 -65665 -17072 131805 -109546 -203009
$$ packed form
16039d00663G755K18859a72273m6933A59683b31168a15188B19347b3278A03468
16028B03080I9040b35267B8787e062l4557q4652A97219r7546h7209m4504j28751
16017b60464i9228j41274a06522q5531h4084J9710B46940D9663a08662N2874E3065
16005C47519E489M516J19130a12350k212E042N0602f922A06455a34893h643l12118
15993c20761J38236A68242P0199b93008g4247j81601E0952Q7058k5385g015k13952
15982b20967F73931k89158O1174o8H9610L7808N4831b54908O4695g6897C138M03731
15970D06869b12298I2442J9652b04084A51592a06822K7178D17970a82487Q5559
15960i6928B6683Q2540J6201c61472K0497d773o0892a7072A31805a09546r3463
$$ plain form
15949 -203009 -100313 123429 -67179 16349 -318695 197787 -13329 42981 -194966 91865
15938 -275069 -308716 -259010 -298187 -62212 -10528 -103736 -409738 -243109 -263392 -34141 -116329
15927 -116329 -129465 -145606 -69029 53195 -76580 316439 118676 197082 -186393 29459 338985
15916 338985 -295584 51441 -29614 126404 -351325 82339 -139479 134422 66977 -22997
15905 132958 13083 199093 20845 56054 -32213 -103728 -115757 -177294 54450 -29936 -68402
15894 -68402 214319 -268880 142190 -416464 -63543 377703 -178105 -202787 -275012 175517
15883 104002 -122528 -147687 -18005 -173717 119243 149891 113894 -65225 -50829 -77445 209872
15871 51737 -105153 -321823 -130606 -36786 100317 188290 35352 146622 296230 -53170
$$ packed form
15949b03009a00313A23429f7179A6349c18695A97787a3329D2981a94966I1865
15938b75069l3647M9706l9177f2212a0528r3208l06002J66629k0283c4141q2188
15927a16329j3136j6141f9029E3195g6580C16439A18676P8406a86393B9459L09526
15916C38985b95584E1441b9614A26404c51325H2339a39479A34422F6977b2997
15905A32958A3083J86010B0845L5209c2213p1515j2029o1537E4450b9936l8466
15894f8402B14319b68880A42190d16464f3543C77703a78105k4682p2225A75517
15883A04002a22528k5159a8005j55712A19243L0648l5997f5225J4396k6616B09872
15871E1737a05153k16670a30606c6786A00317Q7973C5352J11270J49608e3170
$$ plain form
15860 -24337 -69983 -86788 29993 -214749 -346574 -321966 470470 98824 -201491 143336 395325
15849 395325 15485 -316062 45963 19689 34449 -103194 -16774 5274 -113806 -7531 -96175
15838 -96175 -45547 -141364 -221897 -103270 -112208 -104254 17865 96988 172405 -131659 221838
15826 -85026 -201490 83357 -150282 14181 -161172 -47212 -83710 -195329 -271491 -40982 46804
15814 -55640 -42517 29479 178814 -250757 90533 -72158 196291 -62803 87911 -68416 -103985
15803 -103985 -209534 183426 13272 -339089 200563 333429 167272 224459 -340186 13298
15792 24804 -92315 -325974 142731 85612 -126737 -78844 -9431 101470 107209 204459 -50528
15780 132968 -105772 -285682 97840 -150844 -50738 -158311 231869 247409 -124520 14664
$$ packed form
15860b4337m5646j6805B9993b14749j31825K4608D70470I8824b01491A43336K51989
15849C95325A5485c16062D5963A9689J4760a03194a6774E274a13806g531q8644
15838i6175d5547r5817q0533a03270q938P954A7865P9123P5417a31659B21838
15826h5026j16464H3357a50282A4181a61172d7212l6498j11619p6162d0982D6804
15814e5640J3123B9479J49335b50757I0533g2158A96291f2803H7911f8416l5569
15803a03985j05549A83426A3272c39089B00563J32866j66157N7187c40186A3298
15792B4804i2315k33659A42731n7119a26737M7893i431A01470N739R7250e0528
15780A32968a05772j79910I7840a50844e0738j07573B31869J5540a24520A4664
$$ plain form
15769 -246911 110992 -63687 -87245 -7915 -246868 21542 -28482 -94124 11346 -9169 96494
15757 385132 -79321 73860 66072 29081 -342866 317755 -22373 178559 -17714 -75381 -36963
15745 270328 -191623 -75136 -279422 19872 -81316 159193 88874 157653 -186482 -292066
15735 -292066 185858 42000 27817 -25189 -359336 -397094 15129 -255666 136096 88634 -352551
15723 -92841 -140431 -164120 13203 -91635 -224786 -131048 -96417 -117246 -47036 -261292 -80795
15711 314291 66509 138876 104046 -273800 248070 -88076 192765 -97087 120576 -14796 -317250
15700 -317250 147910 95303 -175803 235325 58556 21367 11370 114023 -117872 -163904 -59827
15688 -31355 141530 158211 273630 50029 -105780 -80724 -112042 41382 -233714 -4502 53282
$$ packed form
15769b46911A10992f3687k3558g915k38953B1542b8482o5642A1346i169I6494
15757C85132g9321G3860p788B9081c42866C17755b2373A78559a7714n7667c6963
15745B70328a91623g5136k04286A9872h1316A59193p0319O8779a86482j05584
15735b92066A85858D2000j4183b5189l34147l7758A5129b55666A36096m7462c52551
15723i2841m7590k3689A3203i1635j33151R3738L4631k0829d7036k14256h0795
15711C14291F6509P2367l4830b73800B48070h8076A92765i7087A20576a4796l02454
15700c17250A47910n2607a75803B35325E8556B1367r997J02653a17872m6032e9827
15688c1355A41530J6681J15419E0029a05780K5056l1318D1382b33714d502E3282
$$ plain form
15676 -426437 -93861 108922 -49472 27137 193854 -153811 -51767 214348 94862 -270194
15665 116412 -98046 -102522 -56410 230192 236006 38160 95022 199874 142303 -353685 259120
15653 50432 -147372 -228622 -192061 75169 -76034 -173699 -350228 507756 -296509 -151312 -60188
15641 167110 24325 -203941 -177915 56760 -69584 -358051 25967 -256835 -4671 -150 183061
15629 21949 138230 -206946 190643 211597 -84445 -129 -112362 1122 83580 159224 103111
15618 103111 106348 188768 -199974 -66815 95178 -195761 -166175 -3610 -15925 -26578 197844
15606 -107570 181155 -75595 -46179 -337959 26995 -5020 282301 145646 -546835 -43368 122096
15594 177374 54520 -104630 176630 -18707 344724 -291237 -105253 -75627 -49491 127554
$$ packed form
15676d26437i3861A08922d9472B7137J66717a53811e1767B14348I4862b70194
15665A16412i8046m476M6112B30192N814C8160N6862J04852n7571c53685B59120
15653E0432a47372q1250L6561G5169g6034r7665j76529E07756b96509J45197f0188
15641A67110B4325b03941K6026E6760f9584k88467B5967b56835d671a50A83061
15629B1949J16281b06946A90643K0954h4445a29j12233A122Q2458P5644n6113
15618A03111L237Q2420a99974f6815I5178a95761K9586c610j2315j0653A97844
15606a07570A81155g5595K9416k91780B6995e020B82301j36655e46835d3368A22096
15594A77374E4520a04630A76630a8707C44724b91237a05253K9626K6136A27554
$$ plain form
15583 192023 -214616 -716 95374 -92582 81190 -111282 -346680 -59206 50948 -43651 -26581
15572 -26581 169863 93316 -92289 96251 95210 95557 -78710 -36313 228499 -177570 -183186 19854
15559 -111912 -83264 15112 237 -100781 261533 -409592 -85082 226162 1528 113367 -194293
15547 128440 10311 -30032 -133550 -400309 341544 -363171 132291 -111272 -44719 -219331
15537 -219331 201703 -68781 -109229 -347664 129052 49943 29040 8856 228088 177471 133419
15526 133419 -259778 -136441 62005 59079 -149389 -85497 106951 -15254 365959 25666 55601
15515 55601 225064 240254 -144745 166858 -218859 111820 -391624 225239 173562 133816
15505 133816 41712 407159 -340705 -488765 58333 220102 53627 42990 243649 -238778
$$ packed form
15583A92023b14616g16I5374i2582H1190a11282k35398e9206E0948d3651J7070
15572b6581A69863p6547i2289I6251j041L47g8710c6313B28499a77570n616A9854
15559a11912K8648A5112B37a00781B61533d09592h5082B26162A528J11839a94293
15547A28440A0311c0032j03518k66759C41544c63171A32291a11272d4719j74612
15537b19331B01703f8781m0448k38435A29052D9943k0903H856K19232n0617m4052
15526A33419b59778J23337F2005k926a49389O3892A06951a5254C65959B5666K9935
15515E5601J69463J5190a44745A66858b18859A11820c91624B25239n1677l9746
15505A33816D1712L65447c40705j48060E8333J61769E3627j0637K00659b38778
$$ plain form
15494 81395 129288 -125981 -132177 221443 -112961 -112738 -219341 -43234 -346313 11942 -115257
15482 234771 -59094 14177 149961 -102890 74524 -110914 -388354 -94580 140957 -313180
15471 164370 139648 212811 111640 118141 -243094 90454 -44993 -112179 18758 -171750 -62876
15459 32793 230337 174945 -37583 -119393 187810 349371 123376 58131 -249964 -273427 -372177
15448 -372177 150843 22326 120002 -56858 -48424 156172 30183 -73486 -64304 -17734 -295 -97251
15436 -97251 274982 173202 -294558 170024 163745 -4065 -153515 211500 15779 -6827 42223
15424 -234254 26773 6508 -322408 -36768 63719 116644 -178546 123992 124491 124275 -114236 -231503
15412 -231503 -121957 -68743 309389 61582 -375792 1132 107728 272219 209490 -54386 385808
$$ packed form
15494H1395M7893a25981o196B21443a12961K23j06603d3234l03079A1942a15257
15482B34771e9094A4177J35784a02890G4524a10914k77440i4580A40957c13180
15471A64370k4722P3163j01171O501b43094I0454d4993o7186A8758a71750f2876
15459C2793J97544n5392c7583q1810A87810J61561A23376E8131b49964k3463r8750
15448c72177A50843B2326R7676e6858Q434A56172C0183g3486R182a7734b95r6956
15436i7251B74982j01780b94558A70024o279d065j49450B11500A5779f827D2223
15424b34254B6773F508c22408c6768F3719N2925a78546A23992M99k16a14236j17267
15412b31503J09546N3214C09389F1582c75792A132J06596J64491o2729e4386C85808
$$ plain form
15400 -99329 -28305 -139932 -25170 -24404 17838 -126212 -140546 -81903 99734 -160929 50090
15388 78560 -50347 -202480 194604 -126953 498835 -14478 -206883 117975 85237 73502
15378 73502 -66404 -68126 107848 280727 -38353 -239124 -194013 68654 -265451 -126720 74682
15366 240 294898 -108729 81947 138749 119670 -161117 107819 184566 212741 -87121 -7547
15354 142127 6401 -36037 -66595 137159 -299174 -276387 -29807 2845 202222 -22241 104969
15342 -260702 -134482 -128131 14863 224562 2596 -419052 -66879 253784 19055 68662 185588
15331 185588 -89712 -190822 130089 103912 3561 11127 141159 -371356 277824 249276 -23721
15319 -154847 175517 28489 -3112 258849 76708 -32736 -60329 -228130 -80975 299816 50321
$$ packed form
15400i9329b8305j11627b5170P66A7838a26212j4334N8643I9734a60929E0090
15388G8560e0347j52133A94604a26953D98835a4478j92405A17975l2738j1735
15378G3502f6404j722A07848J72879c8353k00771M5111F8654b65451a26720G4682
15366B40K94658a08729H1947N6802j9079a61117A07819P6747K8175h7121g547
15354A42127F401c6037l0558A37159b99174K2787b9807B845J99377b2241A04969
15342b60702J26220O351A4863K09699B596d19052f6879B53784A9055M9607J16926
15331A85588h9712j01110A30089k6177C561P566J30032c71356B77824k8548b3721
15319a54847A75517B8489c112B58849G6708c2736k7593j67801h0975B99816E0321
$$ plain form
15307 -22865 152909 112721 58186 170264 -187076 -105960 1854 47953 -112601 94934 -116928
15295 155440 -122133 247288 17366 122754 -3836 189013 86701 82299 -322818 -67631 278404
15283 125057 -238235 -42155 -231955 -73642 104857 118052 194568 -230479 -229216 131770 114231
15272 114231 -261968 144912 172567 -75839 232708 51094 175697 -37688 152845 184649
15262 184649 110303 93989 114141 301275 -144364 548705 221560 -214979 244849 162888
15252 162888 -97516 299227 415113 480410 558770 1109688 1515903 1342038 1117558 740920
15242 740920 219739 140413 134253 -64451 -269653 422363 -224922 173528 -1302 -22387 198117
15230 32784 251797 -22249 52636 290456 -75506 -31243 74864 4137 152214 16157 1746
$$ packed form
15307b2865A52909m0188n4535J12078a87076Q1116A854M6099a12601I4934a16928
15295A55440a22133B47288A7366J05388c836A89013H6701m402c22818f7631B78404
15283A25057b38235d2155j89800g3642A04857J3195P6516b30479J263A31770j7539
15272A14231b61968A44912K7655g5839B32708E1094J24603c7688A52845L1804
15262A84649p4346j6314K0152J87134a44364E48705B21560b14979B44849q1961
15252A62888i7516B99227J15886O5297P8360N50918M06215j73865k24480l76638
15242G40920B19739p9326o160f4451k05202D22363b24922A73528a302k1085A98117
15230C2784K19013b2249E2636K37820g5506c1243G4864D137J48077A6157A746
$$ plain form
15218 54686 -47094 372229 -154732 -129435 -77987 102908 185742 -42566 -153709 158977 68896
15206 110962 -151493 138746 238833 15125 -309165 275295 -35331 -10634 290302 257675
15196 257675 298556 -214282 28414 -84319 -35592 305162 339357 -106659 177008 -76398 125666
15184 -33659 -153550 -268126 173709 6162 176902 -86674 164586 154298 -28282 30964 166390
15173 166390 74241 -146106 113596 53277 -334647 62352 1099 -23658 315724 -52552 32556
15161 -62526 102406 262474 113305 -361251 107008 -2270 219843 49916 -99310 -1068 -132409
15150 -132409 208256 122044 -205197 -97958 -77969 163620 421495 142628 328829 185150
15140 185150 40988 195998 8175 338848 364840 214043 236564 -197494 147844 492259
$$ packed form
15218E4686d7094C72229a54732K5297N1448A02908Q2834d2566j11143A58977F8896
15206A10962a51493A38746J00087A5125c09165B75295c5331a0634B90302l2627
15196B57675M0881b14282B8414h4319c5592C05162L4195a06659A77008g6398A25666
15184c3659j19891j14576A73709F162J70740h6674A64586j0288b8282C0964J35426
15173A66390G4241a46106A13596E3277c34647F2352A099b3658C15724e2552C2556
15161f2526A02406J60068A13305c61251A07008b270B19843D9916i9310a068j31341
15150a32409B08256q6212b05197i7958J9989A63620K57875A42628J86201j43679
15140A85150D0988J55010H175L30673K5992j50797K2521a97494A47844L44415
$$ plain form
15130 492259 227783 215498 3285 -132857 -84251 335771 93343 6224 202931 -43127 -86229
15119 -86229 178411 222701 334536 -288992 269223 430904 -108800 31503 -182236 -52866
15108 170226 322110 7437 251419 -61945 450 -95644 481342 278649 286835 -52156 47463
15096 2310 -22753 106468 348246 228927 309225 480506 176600 185264 67743 -173040 162019
15084 -46716 167493 445488 -23865 34523 162014 -11966 -88423 43744 472060 260713 168037
15073 168037 -24527 94548 -234978 -223901 91430 108189 -9353 -100297 132919 227553 28582
15061 -8450 204815 -60713 124313 52734 96322 237925 297681 345949 119479 74378 2598
15049 18895 267488 -28610 240266 226903 -10053 40234 191977 -116444 322297 -46762 171552
$$ packed form
15130D92259B27783j2285C285a32857M8606C35771I3343F224J96707d3127m3102
15119h6229A78411M4290J11835b88992B69223J61681a08800C1503a82236e2866
15108A70226J51884G437K43982f1945D50i5644D81342k02693Q186e2156D7463
15096B310b2753A06468K41778j19319Q0298J71281A76600Q664F7743a73040A62019
15084d6716A67493K77995b3865C4523J27491a1966p6457D3744M28316k11347r2676
15073A68037b4527I4548b34978J1077I1430J6759i353r0944A32919R4634B8582
15061h450B04815f0713A24313E2734M3588J41603N9756M8268A19479m5101B598
15049A8895K48593b8610B40266j3363a0053D0234J51743a16444C22297d6762A71552
$$ plain form
15037 179509 311896 11410 89732 513819 427982 -19157 90112 339682 147904 218172 296037
15026 296037 366567 133529 -113606 -1363 278186 297812 -29544 228339 244624 7199 127330
15015 127330 319407 -50842 -16758 270046 377497 581641 167735 124059 116022 129724 13103
15003 376752 95948 -941 -56012 -314025 -9640 397235 418486 124028 -6673 393368 -29857
14991 180288 -124219 -54706 337989 598781 -236999 236558 326127 132104 443493 227046
14981 227046 -197060 239049 138532 31769 181639 200196 17567 31967 105746 599672
14971 599672 326479 108194 230264 -136871 228246 -8890 103778 738598 288072 345288
14961 345288 271353 256471 389858 343104 467367 358268 -25167 156783 365073 406804
$$ packed form
15037A79509J32387A1410P8322M24087q5837a9157I0112K49570A47904P0268P7865
15026B96037P0530A33529a13606a363B78186J9626b9544B28339J6285G199J20131
15015A27330J92077e0842a6758B70046J07451K04144A67735m3676q037J3702A3103
15003C76752I5948i41n5071k58013i640C97235K1251A24028f673C93368b9857
14991A80288a24219e4706C37989K60792b36999B36558Q9569A32104L11389k16447
14981B27046a97060B39049j00517C1769J49870J8557A7567J4400P3779M93926
14971E99672k73193A08194J22070a36871B28246h890A03778O34820B88072N7216
14961C45288p3935j4882J33387m6754J24263j09099b5167A56783K08290M1731
$$ plain form
14951 406804 -15811 357810 444038 237298 289342 311257 219390 528599 289950 -446481
14940 340151 377365 435402 -27371 188900 359145 488916 174317 252583 200567 211905 170227
14929 170227 138342 147272 363989 314863 158005 115712 316924 298686 507311 236260 70382
14917 631829 445190 178704 196860 466874 263084 80666 665006 417877 269755 10724
14906 102278 417846 404809 313872 259362 598834 418097 88777 608154 210903 443335
14896 443335 330680 154437 107537 270844 572565 305463 39495 177582 164534 381664
14886 381664 342207 452839 216538 211829 199463 236146 395164 55355 420849 363831 365266
14875 365266 306209 308968 288189 582266 451352 345094 5646 -155178 715033 169616 668115
$$ packed form
14951D06804a5811C57810Q6228k06740N2044K1915r1867L09209k38649d46481
14940C40151L7214N8037b7371A88900J70245J29771A74317P8266n2016J1338m1678
14929A70227l1885Q930K16717m9126j56858m2293K01212j8238K08625B36260G0382
14917F31829j86639A78704J8156K70014k03790H0666N84340k47129j48122A0724
14906A02278L15568j3037r0937n4510L39472j80737H8777N19377B10903K32432
14896D43335j12655A54437m6900J63307L01721k67102C9495J38087j3048K17130
14886C81664l9457J10632B16538m709j2366L6683J59018E5355L65494n7018J435
14875C65266n9057K759k0779K94077j30914j06258E646a55178G15033A69616M98499
$$ plain form
14864 668115 415036 424794 196850 285657 376779 133702 43916 569445 428896 298417
14854 298417 357723 43129 421513 444047 316490 246902 6951 981561 527400 318146 502789
14843 502789 145259 807702 462065 241513 165492 603278 311561 613745 131761 265592
14833 265592 52924 202125 127815 507532 349465 329658 221295 472160 420379 292794
14823 292794 369686 474313 526069 417834 500614 425316 414742 601170 349933 421557 565518
14812 565518 354903 276816 661930 370222 551589 602098 317989 622441 639677 209939
14801 728811 56079 545231 307338 584651 293153 391381 419968 526250 291675 276044
14791 276044 587985 676984 439974 460249 387017 502218 622993 455573 474984 667636
$$ packed form
14864F68115k53079R758A96850Q8807R1122A33702D3916N25529j40549j30479
14854B98417N9306D3129L78384K2534j27557o9588F951R74610m54161k09254J84643
14843E02789A45259O62443l45637k20552p6021M37786k91717L02184A31761J33831
14833B65592E2924J49201p4310L79717j58067j9807j08363K50865n1781j27585
14823B92794P6892J04627N1756j08235Q2780p5298j0574J86428k51237P1624J43961
14812E65518k10615p8087L85114k91708J81367N0509k84109L04452J7236B09939
14801G28811E6079M89152k37893K77313k91498R8228K8587J06282k34575j5631
14791B76044L11941Q8999k37010K0275p3232J15201J20775j67420J9411J92652
$$ plain form
14781 667636 358855 342386 551278 541664 612351 399576 439457 189116 575647 398930
14771 398930 306898 497064 548382 454672 486460 391061 696725 247928 875240 645548
14761 645548 759612 503420 610787 903382 481933 639753 658926 468885 971333 771731
14751 771731 704777 778037 958141 756697 353234 494894 842014 990170 444114 311725
14741 311725 580263 453960 668428 665047 583046 431711 700413 675700 469621 575273
14731 575273 552140 534175 97598 744839 624091 704868 592506 394906 400083 825837 761736
14720 761736 1115256 725470 486803 754286 786883 560936 856917 581896 915980 939541
14710 939541 635511 570948 752017 403835 673658 736405 720386 573208 554247 725259
$$ packed form
14781F67636l08781j6469K08892r614P0687k12775L9881A89116L86531j76717
14771C98930r2032J90166N1318r3710L1788r5399L05664B47928O27312k29692
14761F45548J14064k56192J07367K92595m21449J57820J9173j90041N02448j99602
14751G71731o6954P3260J80104k01444C53234J41660L47120J48156D44114j32389
14741C11725K68538j26303K14468l381q2001j51335K68702k4713k06079J05652
14731E75273k3133j7965I7598O47241j20748Q0777j12362j97600N177M25754o4101
14720G61736L53520l89786k38667K67483L2597k25947K95981k75021L34084K3561
14710I39541l04030o4563J81069l48182K69823O2747j6019j47178j8961J71012
$$ plain form
14700 725259 767098 827609 656544 825803 939646 598655 905807 926895 455202 765751
14690 765751 998182 779413 1000637 831804 769203 719209 884759 787709 769577 924903
14680 924903 958438 987959 954903 864795 757458 862091 990368 657520 1155842 938188
14670 938188 893621 620592 838257 939551 966151 1043547 1055782 772174 711793 937763
14660 937763 1129590 939660 631896 1372555 1164584 923882 1098082 846642 1031433 864315
14650 864315 978457 965475 856979 934678 1278823 965608 813524 963392 1078455 952746
14640 952746 820408 1191990 1106360 1236662 1308516 1239318 1327914 1466144 1084137 950604
14630 950604 853001 1673574 960240 1018531 1051376 1280108 1292348 1407954 1327285 949797
$$ packed form
14700G25259M1839O0511j71065J69259J13843l40991L07152K1088D55202L10549
14690G65751K32431k18769K21224j68833o2601m9994J65550r7050j8132J55326
14680I24903L3535K9521l3056r0108j07337J04633J28277l32848M98322k17654
14670I38188m4567k73029K17665J01294K6600P7396J2235k83608o0381K25970
14660I37763J91827j89930l07764P40659k07971k40702J74200k51440J84791j67118
14650H64315J14142j2982j08496P7699L44145l13215j52084J49868J15063j25709
14640I52746j32338L71582q5630J30302P1854o9198Q8596J38230l82007j33533
14630I50604r7603Q20573p13334N8291L2845K28732J2240J15606q0669l77488
$$ plain form
14620 949797 1209298 1152142 1063204 1257128 1610173 1426067 1466677 1085747 1303372 1272424
14610 1272424 1274575 1650290 1263668 1230522 990066 1391620 1228120 1469699 1494511 1446702
14600 1446702 1520578 1238761 1336577 1610373 1529146 1851685 1503846 1268662 1516158 1510436
14590 1510436 1374430 1572449 1441377 1288464 1492666 1559421 1873961 1466304 1733423 1484556
14580 1484556 1424130 1897946 1398731 1741802 1594756 1776330 1746083 1829068 1979278 2306450
14570 2306450 1822668 1682907 1790392 2090820 1986457 2186201 2147994 2542759 2184400 2571023
14560 2571023 2264640 2754862 2304444 2600135 2871326 3052999 3225493 3480736 3815599
14551 3815599 3987834 5145254 6678814 9957552 18619461 32055741 43149894 25553514
$$ packed form
14620I49797K59501n7156q8938J93924L53045j84106M0610l80930K17625l0948
14610A272424K151L75715l86622l3146k40456M01554j63500K41579K4812m7809
14600A446702P3876k81817R7816K73796q1227L22539l47839k35184K47496n722
14590A510436j36006J98019j31072j52913K04202O6755L14540m07657K67119k48867
14580A484556o0426M73816m99215L43071j47046J81574l0247Q2985J50210L27172
14570B306450m83782j39761J07485L00428j04363J99744l8207L94765l58359L86623
14560B571023l06383M90222m50418K95691K71191J81673J72494K55243L34863
14551C815599J72235J157420J533560L278738Q661909J3436280J1094153j7596380
$$ plain form
14543 25553514 12348913 5875445 3019232 2291394 2022251 1754964 1823950 2037591 1866479
14534 1866479 1898899 1342126 1787438 1666994 1757221 1592248 1989106 1769444 1899304 1922578
14524 1922578 1980968 2130905 2116481 2082382 2178488 1834146 2167188 2240564 2033877 2433306
14514 2433306 2216704 2436590 2471375 2555538 2927122 2581648 2479128 2289528 2674234 2662155
14504 2662155 2406859 2628683 2618543 2445163 2921083 2985867 2524165 2785296 2957764 3258781
14494 3258781 3022505 2744715 3071046 3041637 3168953 2773629 3481516 3190899 3297724 3637808
14484 3637808 3204282 3330915 3135434 3445540 3356450 3649380 3894045 3568676 3277167 3475223
14474 3475223 3587230 3968514 3648338 3649435 3745496 3774762 3923072 4033784 4011138 4079372
$$ packed form
14543B5553514A2348913E875445k856213p27838k69143k67287O8986K13641j71112
14534A866479L2420n56773M45312j20444R0227j64973L96858k19662J29860K3274
14524A922578N8390J49937j4424l4099R6106l44342L33042P3376k06687L99429
14514B433306k16602K19886L4785Q4163L71584l45474j02520j89600L84706j2079
14504B662155k55296K21824j0140j73380M75920O4784m61702K61131J72468L01017
14494C258781k36276k77790L26331k9409J27316l95324P07887k90617J06825L40084
14484C637808m33526J26633j95481L10106q9090K92930K44665l25369k91509J98056
14474C475223J12007L81284l20176J097R6061K9266J48310J10712k2646O8234
$$ plain form
14464 4079372 4086301 4092603 4344869 4221820 4470873 3551800 4405831 4279829 4594453 4566676
14454 4566676 4452600 4735939 4329976 4898994 4758566 4962649 4944732 4819613 5078557 5032929
14444 5032929 4928447 5010049 5300517 5149390 5415249 5652991 5359556 5917668 5790728 5768384
14434 5768384 5967360 5641547 5876946 5902186 6294074 6386251 5933544 6396920 6558053 6376903
14424 6376903 6709102 6696817 6686204 6861832 6725433 7146117 7180912 7263162 7599764 7318625
14414 7318625 7774845 7530836 8102697 7969513 8012718 8212657 8216406 8322305 8555999 8954036
14404 8954036 8952932 8931195 8979496 9517173 9441885 9575720 9595116 9957215 9749419 10281692
14394 10281692 10110595 10812765 11020826 11063300 11116469 11467512 11257361 11988783 12172356 12052514
$$ packed form
14464D079372O929O302K52266j23049K49053r19073Q54031j26002L14624k7777
14454D566676j14076K83339m05963N69018j40428K04083j7917j25119K58944m5628
14444E032929j04482Q1602K90468j51127K65859K37742k93435N58112j26940k2344
14434E768384J98976l25813K35399K5240L91888R2177m52707M63376J61133j81150
14424F376903L32199j2285j0613J75628j36399M20684L4795Q2250L36602k81139
14414G318625M56220k44009N71861j33184M3205J99939L749J05899K33694L98037
14404H954036j104k1737M8301N37677p5288J33835J9396L62099k07796N32273
14394A0281692j71097P02170K08061M2474N3169L51043k10151P31422J83573j19842
$$ plain form
14384 12052514 12272149 12335507 12632696 12762920 13014801 13532646 13239479 14041481 14240413
14375 14240413 14340576 14896687 15172546 15258666 15799693 15900071 16289279 16848493 16897507 17352705
14365 17352705 17366072 18285626 18651202 18844414 19340088 19748688 20252916 20335115 20865890 21280579
14355 21280579 21815957 22537744 23232138 23928545 24303864 24725936 25748990 26196218 26527410
14346 26527410 27337978 28114158 28937783 29509985 30205915 31221920 32194995 32793729 33914457
14337 33914457 34872102 35571714 36837773 38341814 39492320 40078771 41652663 42502196 44114722
14328 44114722 45346723 46916478 48262268 50088270 51907071 53535230 55804023 57581937
14320 57581937 59521445 61830444 64114633 66297750 69305147 71644378 74538079 77579559
$$ packed form
14384A2052514K19635O3358K97189J30224K51881N17845k93167Q02002J98932
14375A4240413J00163N56111K75859Q6120N41027J00378L89208N59214M9014M55198
14365A7352705J3367R19554L65576J93212M95674M08600N04228Q2199N30775M14689
14355B1280579N35378P21787O94394O96407L75319M22072J023054M47228L31192
14346B6527410Q10568P76180Q23625N72202O95930J016005R73075N98734J120728
14337C3914457R57645O99612J266059J504041J150506N86451J573892Q49533J612526
14328D4114722J232001J569755J345790J826002J818801J628159K268793J777914
14320E7581937J939508K308999K284189K183117L007397K339231K893701L041480
$$ plain form
14312 77579559 80915632 84576553 87776726 91765464 95588685 99613700 104630368 109329739
14304 109329739 114382201 119751543 125274994 131553368 138212432 145309589 152420261 160673520
14296 160673520 168672162 177774242 187159561 197342827 207827561 219585116 231067501
14289 231067501 243829357 257053752 270837274 285533432 300480927 315905247 331822690
14282 331822690 347688699 363857569 380396352 395420287 410563820 424102836 436541661
14275 436541661 447234596 455444530 460428651 460819210 457777236 455070912 453151379 450623227
14267 450623227 447817565 439490350 429411375 416715623 402529788 387539810 371763876
14260 371763876 355544363 338695026 322275831 306136014 290716227 275618418 261867855
$$ packed form
14312G7579559L336073L660921L200173L988738L823221M025015N016668M699371
14304A09329739N052462N369342N523451O278374O659064P097157P110672Q253259
14296A60673520P998642R102080R385319J0183266J0484734J1757555J1482385
14289B31067501J2761856J3224395J3783522J4696158J4947495J5424320J5917443
14282C31822690J5866009J6168870J6538783J5023935J5143533J3539016J2438825
14275D36541661J0692935Q209934M984121L90559l041974k706324j919533k528152
14267D50623227k805662q327215j0078975j2695752j4185835j4989978j5775934
14260C71763876j6219513j6849337j6419195j6139817j5419787j5097809j3750563
$$ plain form
14253 261867855 248202090 235217624 222933877 211275316 200197072 189573331 180129543
14246 180129543 170963234 162247034 154601405 146994315 139739496 133204095 126845596 120922898
14238 120922898 116050804 110748604 105902073 101348460 96901550 92676773 88844741 85593597
14230 85593597 82133325 78551100 75522641 73065404 70151789 67559356 65036560 62864205
14222 62864205 60516325 58262861 56717485 54814074 52760138 51043831 49064293 47736064
14214 47736064 46523970 45385516 43732481 42281228 40571971 39483282 38744912 37644070
14206 37644070 37106071 35933131 34566080 33157248 32525021 31696530 31465254 30259199 29369435
14197 29369435 28586984 27974639 27295381 26566801 26444899 25417730 24474651 23737084 23857544
$$ packed form
14253B61867855j3665765j2984466j2283747j1658561j1078244j0623741r443788
14246A80129543r166309q716200p645629p607090p254819o535401o358499n922698
14238A20922898m872094n302200m846531m553613m446910m224777l832032l251144
14230H5593597l460272l582225l028459k457237k913615k592433k522796k172355
14222F2864205k347880k253464j545376j903411k053936j716307j979538j328229
14214D7736064j212094j138454j653035j451253j709257j088689p38370j100842
14206C7644070n37999j172940j367051j408832o32227q28491k31276j206055q89764
14197B9369435p82451o12345o79258p28580j21902j027169r43079p37567J20460
$$ plain form
14188 23857544 22807221 22114080 21747464 21315548 20559560 20382933 20370933 19372338 19137348
14179 19137348 18660213 18388525 17987974 17331909 17171060 16847241 16775498 16068193 15966659
14170 15966659 15379568 15331630 15113766 14880527 14359911 14208326 13692389 13506876 13461926 12907757
14160 12907757 13021777 12596050 12123349 12230520 12259759 11651701 11620494 11220298 11291927 11080378
14150 11080378 10875269 10512334 10326097 10253003 10137284 9725862 10044389 9791277 9595108
14141 9595108 9500737 9352955 9100492 8745391 8983908 8791464 8521082 8818307 8255476 8121283
14131 8121283 8308327 7990526 7827583 7984165 7908498 7593897 7531938 7210576 7483908 7395593
14121 7395593 7330459 6846856 6920605 6669793 6811690 6941577 6731453 6320150 6476600 6514233
$$ packed form
14188B3857544j050323o93141l66616m31916p55988j76627j2000r98595k34990
14179A9137348m77135k71688m00551o56065j60849l23819p1743p07305j01534
14170A5966659n87091m7938k17864k33239n20616j51585n15937j85513m4950n54169
14160A2907757J14020m25727m72701J07171K9239o08058l1207m00196P1629k11549
14150A1080378k05109l62935j86237p3094j15719m11422L18527k53112j96169
14141I595108r4371j47782k52463l55101K38517j92444k70382K97225n62831j34193
14131H121283J87044l17801j62943J56582p5667l14601o1959l21362K73332q8315
14121G395593o5134m83603P3749k50812J41897J29887k10124m11303J56450L7633
$$ plain form
14111 6514233 6543010 6135034 6207831 5965142 5964102 6116667 6079780 5635855 5753833 5732384
14101 5732384 5697909 5656420 5683564 5498966 5203819 5125293 5072388 4912934 5181446 5046548
14091 5046548 4917476 4891340 4638066 4509443 4929360 4780850 5110281 4704600 4706731 4700589
14081 4700589 4552251 4219236 4356081 4093118 4235216 4456402 4252558 4228134 3806752 4200812
14071 4200812 4110825 4045640 3907426 3926896 3936191 3702225 3737517 3851186 3533866 3868766
14061 3868766 3789855 3737706 3898029 3640024 3746347 3716325 3399665 3611370 3105699 3613982
14051 3613982 3326024 3267151 3375722 3469577 3073641 3443868 3272986 2995478 2935784 3085781
14041 3085781 2946277 2790240 2867493 2904826 3051008 2882280 2870664 2769009 2784053 2937258
$$ packed form
14111F514233K8777m07976P2797k42689j040J52565l6887m43925J17978k1449
14101E732384l4475m1489K7144j84598k95147p8526n2905j59454K68512j34898
14091E046548j29072k6136k53274j28623M19917j48510L29431m05681K131o142
14081D700589j48338l33015J36845k62963J42098K21186k03844k4424m21382L94060
14071D200812q9987o5185j38214J9470R295k33966L5292J13669l17320L34900
14061C868766p8911n2149J60323k58005J06323l0022l16660K11705n05671N08283
14051C613982k87958n8873J08571R3855l95936L70227j70882k77508n9694J49997
14041C085781j39504j56037P7253L7333J46182j68728j1616j01655J5044J53205
$$ plain form
14031 2937258 2867375 3117741 2959277 2569644 2923618 2574214 2639270 2422742 2554098 2468206
14021 2468206 2406007 2638005 2230775 2432674 2564865 2559567 2508310 2362080 2392551 2310637
14011 2310637 2461971 2375511 2364311 2327111 2267660 2299657 2179442 2111651 2084469 2206526 1810235
14000 1810235 1855150 1926243 1741884 2260767 2137773 1877547 1912135 2017356 1951970 2398415
13990 2398415 2620917 3226369 5686943 12295916 25098701 42023950 30102969 15422307
13982 15422307 8134332 5374887 4543750 3391917 3330838 3229499 2940702 2657848 2549601
13973 2549601 2184002 2223644 2245744 2221462 2214319 2388881 2009098 2335203 2164749 2071339
13963 2071339 2321259 1751717 1826462 1845515 1684608 1840823 1822353 1790153 1822315 1727145
$$ packed form
14031B937258o9883K50366j58464l89633L53974l49404O5056k16528J31356q5892
14021B468206o2199K31998m07230K01899J32191n298n1257j46230L0471q1914
14011B310637J51334q6460j1200l7200n9451L1997j20215o7791k7182J22057l96291
14000A810235M4915P1093j84359N18883j22994k60226L4588J05221o5386M46445
13990B398415K22502O05452K460574O608973J2802785J6925249j1920981j4680662
13982A5422307p287975k759445q31137j151833o1079j01339k88797k82854j08247
13973B549601l65599L9642K2100k4282p143J74562l79783L26105j70454r3410
13963B071339K49920n69542P4745J9053j60907J56215j8470l2200L2162r5170
$$ plain form
13953 1727145 1666539 1927292 2006300 1501734 1445299 1463379 1827108 1892102 1648265 1635004
13943 1635004 1634981 1402396 1842545 1510949 1330915 1490204 1593572 1450342 1386167 1525534
13933 1525534 1704294 1735083 1642539 1556961 1670469 1558861 1568823 1430795 1596577 1351746
13923 1351746 1555730 1633151 1272256 1684334 1556415 1451152 1563976 1207557 1625223 1469987
13913 1469987 1634199 1151725 1595432 1278959 1340195 1262505 1296167 1584464 1459792 1230089
13903 1230089 1118642 1285768 1394752 1381950 1362601 1367006 1054511 1107596 1096522 1380815
13893 1380815 1079709 906092 1146529 1385528 1378874 1380998 1166910 1043417 1288513 1346411
13883 1346411 1322088 920624 1091967 1118265 1206777 690055 1423890 1472439 1070710 1144711
$$ packed form
13953A727145o0606K60753P9008n04566n6435J8080L63729O4994k43837j3261
13943A635004k3k32585M40149l31596j80034J59289J03368j43230o4175J39367
13933A525534J78760L0789r2544q5578J13508j11608R962j38028J65782k44831
13923A351746K03984P7421l60895M12078j27919j05263J12824l56419M17666j55236
13913A469987J64212m82474M43707l16473O1236p7690L3662K88297j24672k29703
13903A230089j11447J67126J08984j2802j9349M405l12495N3085j1074K84293
13893A380815l01106j73617K40437K38999o654K124k14088j23493K45096N7898
13883A346411k4323m01464J71343K6298Q8512n16722P33835M8549m01729P4001
$$ plain form
13873 1144711 1108849 818295 1020723 989039 1018199 1178396 809940 733384 849854 1325622
13863 1325622 945114 1113756 1109074 1021222 878296 1061978 898943 1063469 763675 775925
13853 775925 1168209 1125257 1032885 967266 1059661 986567 921064 632837 1057508 982558 964201
13842 964201 716237 867074 812953 599857 781401 1121633 1052695 1231912 864733 846550
13832 846550 1030062 723837 747108 733968 956170 1014878 1038295 935215 644343 968649
13822 968649 872578 832298 625869 687927 603456 762674 930251 601371 611791 900298
13812 900298 1015987 669994 883675 708319 804866 731428 896936 683772 662353 400783
13802 400783 656393 646588 726132 765588 674739 485893 413903 777072 641282 772352 1039029
$$ packed form
13873A144711l5862k90554K02428l1684K9160J60197l68456p6556J16470M75768
13863A325622l80508J68642m682q7852j42926J83682j63035J64526k99794J2250
13853G75925L92284m2952r2372o5619R2395p3094o5503k88227M24671p4950j8357
13842I64201k47964J50837n4121k13096J81544L40232o8938J79217l67179j8183
13832H46550J83512l06225K3271j3140K22202N8708K3417j03080k90872L24306
13822I68649r6071m0280k06429O2058q4471J59218J67577l28880J0420K88507
13812I00298J15689l45993K13681j75356R6547p3438J65508k13164k1419k61570
13802D00783K55610r805P9544L9456r0849j88846p1990L63169j35790J31070K66677
$$ plain form
13791 1039029 656590 804742 918139 869261 610768 706511 752832 672200 770529 478947
13781 478947 703452 428057 534184 747834 879576 707495 848289 745329 371599 898606
13771 898606 667795 549689 787143 680299 549185 408798 713494 531834 779057 777180
13761 777180 777267 525277 856332 694428 498558 1007189 815955 624119 191620 598876
13751 598876 745498 719375 678970 367122 395327 491404 438975 538568 779642 630218 772647
13740 772647 531352 837620 511500 466526 438683 295133 675283 501459 538236 549507
13730 549507 1013962 467922 599359 414327 734704 631370 336810 435168 684916 608415
13720 608415 346691 252385 429524 533979 336138 923235 182764 356649 534112 107756
$$ packed form
13791A039029l82439J48152J13397m8878k58493R5743M6321q0632R8329k91582
13781D78947K24505k75395J06127K13650J31742j72081J40794j02960C71599N27007
13771H98606k30811j18106K37454j06844j31114j40387L04696j81660K47223j877
13761G77180Q7k51990L31055j61904j95870N08631j91234j91836A91620M07256
13751E98876J46622k6123m0405l11848K8205R6077n2429R9593K41074j49424J42429
13740G72647k41295L06268l26120m4974k7843j43550L80150j73824L6777J1271
13730E49507M64455D67922J31437j85032L20377j03334k94560R8358K49748p6501
13720F08415k61724r4306J77139J04455j97841N87097A82764J73885J77463A07756
$$ plain form
13709 370616 637001 337753 589740 513624 495026 543098 494630 646724 221790 601219
13699 601219 6527 516517 485628 344451 292607 322513 628670 1001856 324999 210646
13689 210646 303595 781629 393646 420022 440896 627731 473667 396756 285335 394017
13679 394017 116627 717855 -33138 777392 587215 480233 400150 305564 65503 437172
13669 437172 369921 460325 800713 282395 308968 582034 485601 565731 363914 285044 363881
13658 363881 282372 162313 367233 601212 279298 566450 503685 226451 415268 274106
13648 274106 418083 310285 335861 630389 645991 459853 349354 200173 458246 463563
13638 463563 343401 363852 299385 414377 647761 -9905 348054 81522 440474 512067 443127
$$ packed form
13709C70616K66385k99248K51987p6116j8598M8072m8468J52094B21790L79429
13699F01219F527N09990l0889j41177n1844K9906L06157L73186C24999j14353
13689B10646R2949M78034l87983K6376K0874J86835j54064p6911j11421J08682
13679C94017A16627O01228c3138G77392j90177j06982q0083r4586F5503L71669
13669D37172o7251R0404L40388B82395K6573K73066r6433Q0130k01817p8870P8837
13658C63881q1509j20059K04920K33979B79298K87152o2765B26451J88817j41162
13648B74106J43977j07798K5576K94528J5602j86138j10499j49181K58073N317
13638D63563j20162K0451o4467J14992K33384i905C48054H1522L58952P1593o8940
$$ plain form
13627 443127 249778 201585 447528 560557 561863 245146 464102 138126 403062 549651
13617 549651 336133 112988 267448 371754 487238 316618 325795 296235 267634 390083
13607 390083 350245 446605 127057 396505 407438 243169 337557 493690 417697 551840
13597 551840 206966 200455 70075 161693 378232 292161 280820 515342 253380 542866 356884
13586 356884 95573 441539 267557 286508 511378 578997 168599 161132 408624 516404
13576 516404 367019 372601 498505 404905 232742 481429 350073 599172 477413 64818
13565 166169 339534 247445 324004 205633 668388 133552 266852 278565 376857 163267
13554 137604 24334 293485 298440 -100924 684249 88538 356233 458106 233107 461449
$$ packed form
13627D43127j93349m8193K45943J13029J306B45146K18956A38126K64936J46589
13617E49651k13518A12988J54460J04306J15484j70620R177k9560k8601J22449
13607C90083l9838R6360A27057K69448J0933j64269R4388J56133p5993J34143
13597E51840B06966o511G0075R1618K16539q6071j1341K34522B53380K89486j85982
13586C56884I5573L45966j73982J8951K24870O7619A68599p467K47492J07780
13576E16404j49385N582J25904r3600j72163K48687j31356K49099j21759F4818
13565A66169J73365r2089P6559j18371M62755A33552J33300J1713R8292A63267
13554A37604B4334K69151M955a00924F84249H8538K67695J01873k24999K28342
$$ plain form
13544 461449 27339 490749 304370 193559 450822 266499 173535 177516 195429 503872
13534 503872 -10458 730741 337021 178315 209890 409821 594350 216164 573825 335510
13524 335510 369995 212436 17444 -109005 294732 192098 411241 195737 265037 474348
13514 474348 261294 152083 534200 13576 221181 35242 31482 439927 399992 285042
13504 285042 512843 299087 154724 654101 61920 40654 378567 398228 536376 19048
13493 78253 -51274 168736 458427 183824 141556 290380 213820 -39268 312098 293307 172160
13482 172160 -33569 460078 359295 207716 157463 317910 428534 158169 381217 258727
13472 258727 355876 283371 353660 407773 362464 301186 94988 146204 57677 207723 284298
$$ packed form
13544D61449B7339M63410j86379j10811K57263j84323r2964L981J7913L08443
13534E03872a0458G30741C37021j58706L1575J99931J84529B16164L57661k38315
13524C35510L4485j57559A7444a09005B94732j02634K19143A95737O9300K09311
13514D74348k13054j09211L82117A3576K07605C5242l760M08445l9935j14950
13504B85042K27801k13756j44363M99377F1920k1266L37913J9661J38148A9048
13493G8253e1274A68736K89691A83824m2268J48824p6560c9268C12098j8791j21147
13482A72160c3569D60078j00783j51579n0253J60447J10624A58169K23048j22490
13472B58727R7149p2505P0289N4113m5309o1278I4988N1216E7677J50046P6575
$$ plain form
13461 284298 297062 163742 431569 191572 119129 65689 461852 327820 98517 508744
13451 508744 85950 188286 184624 511123 61617 80313 131577 17897 225279 114947 264246
13440 264246 359642 279252 94466 106942 -51886 172078 124632 209138 581507 538061 36796
13428 215081 128617 -203945 409846 84336 113881 82206 370203 372977 -317400 341441 -99796
13416 295798 61699 222498 230486 -205385 94410 130247 129960 63047 -139444 -57937 -174272
13405 -174272 342764 77231 301675 477851 355161 17811 278693 370737 163446 -140713
13394 404730 -2596 218675 193161 -29152 -142099 76199 218181 326920 -198907 320222
13383 256102 -152685 325100 166392 39717 71178 438823 416604 55324 240203 89345
$$ packed form
13461B84298J2764j33320K67827A91572p2443n3440L96163j34032I8517M10227
13451E08744H5950J02336l662L26499F1617J8696N1264A7897K07382j10332J49299
13440B64246R5396q0390I4466J2476e1886A72078m7446Q4506L72369m3446C6796
13428B15081q6464b03945D09846H4336K9545l1675K87997K774c17400C41441i9796
13416B95798F1699J60799P988b05385I4410L5837k87F3047a39444e7937j16335
13405a74272C42764G7231K24444J76176j22690A7811K60882R2044A63446a40713
13394D04730b596B18675k5514b9152j12947G6199J41982J08739a98907C20222
13383B56102a52685C25100j58708C9717L1461L67645k2219E5324J84879H9345
$$ plain form
13372 240307 380140 -165113 427598 -9734 129224 161442 115299 396415 157909 39717
13361 64326 481017 379115 125243 446765 119254 207781 -101822 -851 355838 347691 534029
13350 534029 -204418 317446 -238402 441863 454887 311002 258671 -110 281237 190088 297479
13339 297479 103712 446236 132679 331561 71169 411195 440404 200279 333132 -50733
13328 110584 259690 192375 357198 356970 40074 353104 86294 318885 -29594 616104 173520
13316 156052 549525 116403 79016 331495 469409 203109 230792 165730 115452 364301
13306 364301 149975 -48450 -133691 365478 192276 110429 487087 161827 -83637 42045
13295 123677 71505 224372 247885 -74453 244035 305429 294238 196394 466344 338895 274830
$$ packed form
13372B40307J39833a65113D27598i734A29224L2218m6143K81116A57909C9717
13361F4326M16691j01902A25243L21522A19254Q8527a01822h51C55838q147J86338
13350E34029b04418C17446b38402D41863J3024j43885n2331a10B81237r1149J07391
13339B97479A03712L42524A32679J98882G1169L40026K9209B00279J32853e0733
13328A10584J49106o7315J64823k28D0074L13030H6294K32591b9594F16104A73520
13316A56052L93473A16403l7387K52479J37914B03109K7683o5062n0278K48849
13306C64301A49975d8450q5241C65478j73202q1847L76658A61827h3637D2045
13295A23677n2172J52867K3513g4453B44035O1394j1191r7844K69950j27449o4065
$$ plain form
13284 274830 -17688 34094 424835 89347 536968 476842 238907 252961 118847 39927 15441
13272 44510 249829 247207 173890 299082 326610 111513 282071 145001 127685 267597 90776
13260 -98733 152319 -22090 -262512 -94481 -365281 180216 -90666 123556 197188 470137
13250 470137 129248 430828 139561 124235 15145 104410 309714 425238 146015 224529
13240 224529 2594 64912 134809 -135595 -74871 241433 -165423 225295 -46656 -196759 -169149
13229 -169149 60350 -82550 -117830 146901 21793 -79712 179432 237757 202898 298227 -341559
13217 265974 328025 112109 115174 -75896 -18171 110740 66120 -71137 101364 28332 -120055
13205 -129382 115738 -51900 -133704 71786 113870 -54137 -203965 -50697 53827 -397245 175084
$$ packed form
13284B74830a7688C4094L90741H9347M47621o0126k37935J4054A18847C9927A5441
13272D4510K05319k622p3317J25192K7528A11513J70558j37070j7316J39912I0776
13260i8733A52319b2090k40422i4481k70800A80216i0666A23556P3632K72949
13250D70137A29248L01580A39561j5326A5145Q9265K05304J15524A46015P8514
13240B24529B594O2318O9897a35595O0724B41433a65423B25295d6656j50103K7610
13229a69149F0350h2550l5280A46901B1793g9712A79432N8325l4859R5329c41559
13217B65974O2051A12109L065g5896a8171A10740m4620g1137A01364B8332a20055
13205a29382A15738e1900q1804G1786M2084e4137j49828e0697E3827c97245A75084
$$ plain form
13193 182326 111263 -88453 17915 4738 1519 393468 -57723 -3338 269701 -111195 -15484
13181 141172 -188934 206532 25078 91935 242264 160437 216810 237229 511685 118816
13170 102755 325357 311968 -79233 109009 189161 241110 419582 93350 -60944 147684 23280
13158 433891 -26495 225743 145242 -72636 206870 -72315 350310 43201 277288 10000 -330188
13146 364453 -89233 63617 43109 -231545 284242 115556 321768 -37096 94152 42392 8204
13134 -20562 -72150 277472 197008 228681 -59984 -51523 349205 153781 334680 40237 -141822
13122 -3084 185395 -32837 67783 108289 168868 308395 -18566 -220653 148067 62059 -21013
13110 -50728 21937 72099 -25029 -150650 61854 -130739 79073 135576 86391 -124902 245861
$$ packed form
13193A82326p1063h8453A7915D738A519L91949e7723c338B69701a11195a5484
13181A41172a88934B06532B5078O6857J50329q1827N6373K0419K74456A18816
13170A02755K22602j3389g9233A09009Q0152N1949J78472I3350f0944A47684B3280
13158D33891b6495B25743q0501g2636B06870g2315C50310D3201K34087A0000c30188
13146C64453h9233F3617k0508b31545B84242A15556K06212c7096I4152D2392H204
13134b0562n1588B77472q0464L1673e9984Q461C49205A53781J80899D0237a41822
13122c084A85395c2837F7783M0506O0579J39527a8566k02087A48067F2059b1013
13110e0728B1937N0162b5029j25621F1854a30739G9073N6503m9185a24902B45861
$$ plain form
13098 62497 169437 273001 -147232 112823 86025 216802 62036 -213740 28950 115312
13088 115312 109574 -84570 167686 -73862 -56100 199190 -159961 16730 205067 115806 -152094
13076 98240 142383 136617 21882 301789 127576 141202 271014 186055 280884 -109577 -29198
13064 125613 80833 4602 280721 -125904 171697 50829 9015 321164 157381 257491 77978
13052 -168146 100353 379643 123827 -933 -118541 151042 355277 192605 -208436 193036
13041 -208899 -70247 172214 22086 269286 -33827 120182 92066 523343 388144 309110
13031 309110 -194435 215320 195785 333088 74306 108790 84523 -108427 -115510 180505 390746
13020 390746 6804 371490 241014 97756 129562 -290093 115055 -183718 270922 -10286
$$ packed form
13098F2497J06940J03564a47232A12823k6798J30777F2036b13740B8950Q6362
13088A15312n738h4570A67686g3862J7762A99190a59961A6730J88337q9261a52094
13076I8240M4143n766B1882K79907A27576J3626J29812q4959R4829a09577b9198
13064A25613m4780D602K76119a25904A71697E0829I015L12149A57381J00110G7978
13052a68146A00353K79290A23827i33j17608A51042K04235j62672b08436A93036
13041b08899g0247A72214B2086K47200c3827A20182k8116M31277j35199p9034
13031C09110a94435B15320j9535J37303G4306L4484k4267a08427p083A80505K10241
13020C90746F804L64686j30476I7756L1806b90093A15055a83718B70922a0286
$$ plain form
13009 398733 94613 308722 125593 286843 -32582 467469 204823 -385751 206047 -105461
12998 19217 42452 -68842 326727 -309604 -236840 -71166 -9999 28887 56257 -190179 182678
12986 78418 -252519 31443 -136849 -263310 -94563 230161 -1795 -221917 -106768 -58518 62480
12974 -138537 -31805 348135 -43777 -1698 -160818 -150557 -47665 254566 2503 -20060 205420
12962 -133282 15931 -84827 60680 483985 71884 -44134 306116 130411 12235 136888 -87602
12950 -11936 373676 5404 -84155 -88222 -77148 375886 -47129 32858 -50385 147840 314444
12939 314444 34450 40706 -378470 -150473 485731 -112452 1726 168626 289141 -184353
12928 143244 82366 -315475 -100430 107356 -10825 -172837 60460 -404543 223729 -92446
$$ packed form
13009C98733I4613K14109A25593J61250c2582D67469B04823c85751B06047a05461
12998A9217K3235f8842C26727c09604P2764g1166i999B8887K7370a90179A82678
12986G8418b52519C1443a36849j26461i4563B30161a795k20122a06768M8250F2480
12974a38537c1805C48135d3777a698j59120J0261d7665B54566B503b0060B05420
12962a33282A5931h4827F0680M23305G1884d4134C06116A30411A2235J24653h7602
12950a1936C73676E404h4155m067J1074C75886d7129C2858e0385A47840J66604
12939C14444C4450O256c78470a50473D85731a12452A726J66900J20515a84353
12928A43244o0878c15475a00430A07356a0825j62012F0460d04543B23729i2446
$$ plain form
12917 10793 361026 -121824 315589 194363 372285 234558 18113 175837 212971 -140099
12906 242923 336463 -40314 94073 86443 53217 294612 -351967 24823 231397 90053 310233
12895 310233 -119764 -35520 127519 -97562 345734 111735 -236497 -97588 -174365 -47309
12884 -7579 265590 62466 60077 12747 -107199 -105934 -13561 -74532 -51741 200391 272870 -68897
12871 -228214 -64187 -91995 161759 226500 -119373 -82604 -137682 -210299 -76369 -92455 -135173
12860 -135173 -59483 255170 1930 19930 87144 -373865 229113 -211836 347626 872 47232
12849 47232 252143 370521 89966 83213 62262 60440 107871 280229 -31201 94390 -128628
12837 162689 97510 -329310 -89303 -74753 90782 442478 -213561 -124266 -91880 79536 317521
$$ packed form
12917A0793L50233a21824C15589j21226J77922j37727A8113J57724L7134a40099
12906B42923R3540d0314I4073p630l3226K41395c51967B4823K06574I0053K20180
12895C10233a19764c5520A27519i7562C45734A11735b36497i7588p6777d7309
12884g579B65590F2466k389A2747a07199J265a3561o0971K2791B00391P2479f8897
12871b28214f4187k7808A61759O4741a19373L6769n5078p2617g6369j6086m2718
12860a35173e9483B55170A930J8000O7214c73865B29113b11836C47626H72M6360
12849D7232K04911J18378H9966o753k0951j822M7431J72358c1201I4390a28628
12837A62689o5179c29310h9303J4550I0782L51696b13561Q9295L2386G9536K37985
$$ plain form
12826 317521 109510 106430 73707 82635 -98400 -76326 244446 56249 -166469 42205 136515
12815 136515 -139970 227266 51925 232659 -200534 42748 -163987 -159145 233255 -433131
12804 -95499 212951 236961 136798 133107 78785 294820 -333 125375 -117333 192413 42273
12792 100504 197051 -46336 168073 670 141815 -89667 -418523 -178830 196180 -248462 -11254
12780 -58454 367583 -39972 118511 157987 -50862 -174371 288562 199156 126884 -182551 -7284
12768 18020 -7615 131411 27676 -110574 -65064 41323 -171634 69219 -221312 -127048 109139
12756 353286 210249 278943 374722 146242 -30866 30100 -15545 -58288 46650 49773 95780
12745 95780 26351 8620 -81674 82340 -51639 -31449 305547 342760 238931 219521 25090
$$ packed form
12826C17521A09510l080l2723Q928i8400K2074B44446E6249a66469D2205R4310
12815A36515a39970B27266E1925J80734b00534D2748a63987M842B33255d33131
12804i5499B12951K4010j00163l691n4322K16035c33A25375a17333A92413D2273
12792A00504R6547d6336A68073F70J41145h9667l28856a78830A96180b48462a1254
12780e8454C67583c9972A18511L9476e0862j23509B88562q9406p2272a82551g284
12768A8020g615A31411B7676a10574M5510D1323a71634F9219b21312R4264A09139
12756C53286j43037O8694R5779A46242c0866C0100a5545m2743D6650L123M6007
12745I5780B6351H620h1674H2340e1639K0190C05547L7213j03829j9410B5090
$$ plain form
12733 222039 -100631 217419 80927 211316 -21171 -173020 135088 -121452 -108077 -8533
12722 -235078 -169495 -69007 49571 -21555 72467 66649 -49982 235529 -367346 18936 247104
12711 247104 7238 151781 402728 -113249 -48641 218495 125194 149195 32140 275387 232289
12700 232289 257349 100719 187685 -37716 146907 68016 -101599 -155882 164608 31466 51891
12689 51891 166185 -331599 -15697 64891 162940 -129259 468957 74296 80743 -55383 -322188
12678 -322188 91474 268749 -15711 325502 104771 164184 166543 32041 -280758 16550 -140992
12666 10589 -44413 -6495 206243 277064 354274 -172102 121338 119151 -49525 220787 162358
12655 162358 178238 -111221 -86146 131026 198952 465164 262440 -67255 179820 27630
$$ packed form
12733B22039a00631B17419H0927J30389b1171j51849A35088a21452J3375h533
12722b35078O5583f9007D9571b1555G2467n818d9982B35529c67346A8936K28168
12711B47104G238J44543K50947a13249d8641B18495r3301K4001C2140K43247m3098
12700B32289K5060A00719Q6966c7716A46907F8016a01599n4283A64608C1466K0425
12689E1891J14294c31599a5697F4891R8049a29259D68957G4296O447e5383k66805
12678c22188I1474J77275a5711C25502A04771N9413K359C2041b80758A6550a40992
12666A0589d4413f495B06243P0821P7210a72102A21338k187d9525B20787n8429
12655A62358J5880a11221K5075A31026O7926K66212k02724f7255A79820B7630
$$ plain form
12644 80176 -100222 91433 119133 -92310 -310052 -102997 -252479 144338 -123814 -108717
12634 -108717 216484 -11381 25694 236483 -276894 -40879 352834 271393 -126955 -47061
12623 13649 -204322 -67495 271471 253397 4159 98774 -236370 -15212 -111110 -180676 38264
12611 -122023 -71813 -41289 37244 317691 200242 -4775 188927 369172 -278898 33345 397190
12600 397190 117899 -44778 -27683 272682 71443 -190854 -155356 248908 90181 48518 154280
12589 154280 -11449 4088 -135519 195952 89134 6673 -96250 -210169 -88370 -84550 -261831
12578 -261831 -205926 -84788 127225 -233906 -103582 61192 48403 808 77425 -198794 203455
12566 332192 210325 -58371 270306 100407 203876 -84270 -41670 -381406 10056 51637
$$ packed form
12644H0176a00222I1433K7700i2310k17742a02997j49482A44338a23814J5097
12634a08717B16484a1381B5694K10789b76894d0879C52834q1441a26955d7061
12623A3649b04322f7495B71471j8074D159R4615b36370a5212r5898o9566C8264
12611a22023N0210L0524C7244K80447j17449d775A88927J80245b78898C3345L63845
12600C97190A17899d4778J7095B72682G1443a90854L5498B48908I0181m1663J05762
12589A54280a1449D088a35519A95952H9134F673i6250j13919h8370L820j77281
12578b61831N5905h4788A27225b33906a03582F1192j2789H08P6617a98794B03455
12566C32192j21867e8371B70306A00407J03469h4270d1670l39736A0056M1581
$$ plain form
12556 51637 -142862 306709 173179 270398 135652 199374 28594 312477 -12054 78565 237371
12545 237371 113174 35151 -145248 229315 31013 76465 -103937 -30947 -206517 330187
12534 243949 -213527 -384050 -91203 157481 17959 -107284 197813 341975 128779 131897
12524 131897 -12431 -241031 -196215 -97859 -100651 190973 -124463 207513 -162262 -15018 -303299
12513 -303299 75444 -221823 80578 -181557 -82312 193099 28116 198944 -225472 -90638
12502 283719 55373 15535 -25938 -46200 -33807 8225 -74013 18714 -206827 -91326 43677
12490 31424 -87648 -74783 239781 -146293 -213485 103072 -145833 61524 -134467 -150089 80140
12478 -8335 -80214 76796 -388658 125007 25528 -242856 98093 -207415 -196131 301313 -129254
$$ packed form
12556E1637a42862C06709j33530R7219j34746O3722B8594K83883a2054G8565J58806
12545B37371A13174C5151a45248B29315C1013M5452a03937c0947j75570C30187
12534B43949b13527j70523i1203A57481A7959a07284A97813J44162A28779L118
12524A31897a2431k28600M4816i7859k792A90973a24463B07513a62262a5018k88281
12513c03299G5444b21823H0578a81557h2312A93099B8116J70828b25472i0638
12502B83719E5373A5535b5938k0262J2393H225g4013A8714b06827i1326D3677
12490C1424h7648J2865B39781a46293o7192A03072a45833F1524a34467j5622H0140
12478h335p1879G6796c88658A25007B5528b42856I8093b07415J1284C01313a29254
$$ plain form
12466 -130765 -58018 120692 144530 -184100 -167332 212672 219217 34265 294090 273726 22261
12454 149888 205440 67427 -55485 -120430 64371 -33043 1294 61088 -223748 152283 -104411
12442 6185 -45338 63151 115393 -66557 -121443 344196 -278907 293517 -224279 222012 -248244
12430 122578 170975 131150 -89918 49111 113013 21283 -12401 -9788 -114988 246362 -127216
12418 -113702 -75269 31193 -211624 29533 -87436 -50443 126793 -12126 51741 -21721 38332
12406 185587 119111 26334 -175669 -91318 388096 -110093 244616 150685 182027 70851 -2619
12394 71177 54177 132876 257224 -294482 115491 -121804 -308268 -200195 -151286 123258
12383 -107156 23805 293571 -32583 120957 -13087 200403 -25184 336578 73121 -255682
$$ packed form
12466a30765e8018A20692K3838a84100J6768B12672O545C4265K59825k0364B2261
12454A49888N5552F7427e5485o4945F4371c3043A294N9794b23748A52283a04411
12442F185d5338F3151N2242f6557n4886C44196b78907B93517b24279B22012b48244
12430A22578M8397l9825h9918D9111O3902B1283a2401K613j05200B46362a27216
12418a13702L8433C1193b11624B9533h7436L6993A26793a2126E1741b1721C8332
12406A85587o6476B6334a75669Q4351C88096a10093B44616r3931L1342G0851b619
12394G1177j7000P8699J24348b94482A15491a21804j86464J08073M8909A23258
12383a07156B3805K69766c2583A20957a3087B00403b5184C36578G3121b55682
$$ plain form
12372 29700 139243 106059 -15077 -145929 59292 -27396 355363 415900 73744 -75267 146145
12360 -207037 161698 43187 -157514 4162 107810 85441 92590 27985 -145439 -82103 193536
12348 92807 194857 186861 -238623 152068 -287149 326442 -29467 274317 14721 -6856 22831
12336 208475 -219258 196062 24930 168490 -30690 -3524 306608 42541 -164516 -84494 205200
12324 323202 265725 -73257 93977 318611 155201 180093 -60005 -151334 1750 -215842 -31156
12312 -334556 3913 20167 -60816 137773 309724 -325838 218198 -148411 31079 213102
12302 213102 -52622 -419546 -150579 234651 33445 131919 -33727 -85732 -68182 149998 -10263
12290 54580 -328091 -66340 -14256 -13215 -104426 41029 141938 -89370 181754 -68639 -50683
$$ packed form
12372B9700J09543l3184a5077j30852E9292b7396C55363O0537G3744g5267A46145
12360b07037A61698D3187a57514D162J03648k2369P149B7985a45439O3336A93536
12348I2807J02050p996b38623A52068b87149C26442b9467B74317A4721f856B2831
12336B08475b19258A96062B4930J43560c0690c524C06608D2541a64516Q0022B05200
12324C23202n7477g3257I3977K24634A55201K4892f0005r1329A750b15842c1156
12312c34556C913J6254f0816A37773J71951c25838B18198a48411C1079J82023
12302B13102e2622l66924a50579B34651C3445R8474c3727n2005J7550A49998a0263
12290E4580c28091f6340a4256J041r1211D1029J00909h9370A81754f8639J7956
$$ plain form
12279 -50683 -107385 -104870 -34767 176107 -34089 10900 435533 37235 157637 -221668 4028
12267 304727 88144 -35423 -153076 24636 -13260 140167 -39603 142944 149587 193849 34170
12255 134689 -32502 1742 114756 -28905 -253171 -51727 287521 301436 142223 -78833 233370
12243 -261000 144952 358369 -348676 144301 249059 161473 -112708 -270385 -118463 346655
12232 124135 69640 229006 51254 -76192 67458 25363 151336 38948 332197 297962 1528
12220 41710 62956 273120 224917 487383 124387 286371 130354 48998 188815 -45487
12209 172026 385961 85672 161204 529745 -76382 192699 221287 -24188 -95857 -38891 96445
12197 92543 36079 -141137 271789 163388 41014 127969 66215 149158 -24131 204880 140578
$$ packed form
12279e0683n6702K515c4767A76107c4089A0900M24633C7235J20402b21668D028
12267C04727H8144c5423j17653B4636a3260A40167c9603A42944O643M4262C4170
12255A34689c2502A742J13014b8905k24266e1727B87521J3915A42223g8833B33370
12243b61000A44952K13417c48676A44301J04758q7586a12708j57677a18463C46655
12232A24135n4495J59366E1254g6192F7458B5363J25973C8948K93249l4235A528
12220D1710K1246K10164m8203K62466A24387J61984A30354D8998J39817d5487
12209A72026K13935H5672P5532L68541g6382A92699K8588b4188p1669c8891I6445
12197I2543C6079a41137B71789j08401D1014Q6955o1754Q2943b4131B04880o4302
$$ plain form
12186 140578 164900 17889 343521 439969 16003 26333 199707 112194 -187230 49430 374775
12175 374775 114013 62498 166723 342046 253964 162224 -11687 395395 222882 138586
12165 138586 25705 -132519 181234 -47436 -114649 64249 116707 338715 345237 180741 190036
12154 190036 58128 -132062 -5161 -121180 136511 -19159 -61938 322086 211059 -91477 -171750
12143 -171750 -61511 86405 11751 207926 102524 -3240 -86665 53108 16353 -82935 234140
12131 239679 194570 -170693 302786 -70903 215228 -123111 180038 161311 102234 45144
12120 50116 168424 78479 43052 106748 36566 -7751 -12052 -71058 248280 -38528 167854
12108 208246 -36304 -38707 -145908 377010 -62048 8080 35343 -63215 -208335 -127810 299794
$$ packed form
12186A40578K4322A7889L25632R6448A6003J0330J73374q7513a87230D9430L25345
12175C74775A14013n1515J04225J75323q8082r1740a1687C95395j72513q4296
12165A38586B5705a32519A81234d7436o7213F4249N2458K22008O522j64496R295
12154A90036E8128a32062e161j16019A36511a9159m2779C22086j11027i1477q0273
12143a71750f1511H6405A1751J96175A02524c240q3425E3108A6353h2935B34140
12131B39679m5109a70693C02786g0903B15228a23111A80038j8727n9077D5144
12120E0116J18308G8479l5427O3696C6566g751m301n9006B48280c8528A67854
12108B08246c6304k403j07201C77010f2048H080K7263f3215j45120Q0525B99794
$$ plain form
12096 5357 -40828 -158409 165814 -190572 -193580 79953 304105 22075 70697 -166904 -209850
12085 -209850 -133204 386997 -254030 -178168 92464 -176926 -84531 223435 764221 1457054
12075 1457054 1944892 933730 401357 -6799 89006 -165084 -77496 125995 53279 -207558
12064 -92584 78047 3771 214578 158404 277815 -88498 62039 245130 -133543 303044 290395
12053 290395 -71829 199855 -246566 -73528 -66586 -80049 103525 -31860 -206970 -212353 -270902
12042 -270902 99841 -187075 -93596 -179463 -15594 -64186 -15875 -2548 -237724 -14782 97048
12030 23531 350608 78762 368188 22332 -87843 -172631 177695 47971 63224 -99085 -182117
12019 -182117 -15399 -64744 65428 -236064 166046 51220 150223 70032 -116606 -6163 -229124
$$ packed form
12096E357d0828j17581A65814a90572l008G9953K24152B2075M8622a66904m2946
12085b09850P6646C86997b54030P5862I2464a76926h4531B23435N40786O92833
12075A457054M87838I33730D01357f799H9006a65084g7496A25995E3279b07558
12064i2584G8047C771K10807n6174J19411h8498F2039J83091a33543C03044j2649
12053B90395g1829A99855b46566g3528O942j3463A03525c1860j75110n383n8549
12042b70902I9841a87075R3479q5867a5594m8592a5875b548k35176a4782I7048
12030B3531L27077G8762K89426B2332h7843q4788A77695D7971J5253i9085q3032
12019a82117a5399m9345F5428b36064A66046E1220R9003G0032a16606f163k22961
$$ plain form
12008 -229124 160567 -51839 -253608 31204 60645 -269270 -229206 -17746 32771 -124535 -140281
11997 -140281 -141130 -289 11337 -47674 -19195 150613 -81774 -59699 -378240 34903 53942 -166895
11984 -124451 -98614 -290581 239797 76309 240008 185152 -131073 -111204 184803 -516263
11973 -130822 -83575 125651 -16557 68595 -231233 59463 89250 -283028 -34387 -116114 -103027
11962 -103027 -6356 231354 21992 179723 -10738 -35811 -304037 -235095 -289873 296473 210285
11951 210285 60633 -76679 -142288 -72336 -166403 -148529 169975 -124252 61516 440090 -65268
11939 -361379 -206555 -11636 -21102 -309426 1720 158782 10613 69688 154143 -283013 42007
11927 -315929 -150249 -248267 -108730 170841 -84860 3063 261339 300291 -36270 -107052 -260923
$$ packed form
12008b29124A60567e1839k01769C1204K9441b69270M0064a7746C2771a24535j5746
11997a40281q49b89A1337d7674a9195A50613h1774K2075l18541C4903J9039a66895
11984a24451K5837j91967B39797G6309J63699n4856a31073J9869A84803e16263
11973a30822M7247A25651a6557F8595b31233E9463K9787b83028c4387q1727J3087
11962a03027f356B31354B1992J57731a0738k5073k68226O8942n4778B96473q6188
11951B10285F0633g6679o5609O9952r4067J7874A69975a24252F1516L78574f5268
11939c61379J54824a1636r466k88324A720J57062A0613N9075Q4455b83013D2007
11927c15929a50249r8018a08730A70841h4860C063K58276L8952c6270p0782j53871
$$ plain form
11916 -260923 164720 159915 124679 -145202 -152495 -6319 306483 -11460 -118989 84843 335684
11905 335684 104345 249212 -144287 255113 145415 6161 -326489 80477 109534 -110460
11894 92069 34161 -74934 -3946 -123300 227640 -67337 -111851 227025 -34919 79620 30540
11882 -213759 -341653 167881 -288062 -36714 87469 122056 -258086 82888 -147656 -46553
11871 3426 -88496 146237 -227925 -261520 -61076 -114911 -96797 -39872 43405 -61798 188693
11859 -319722 15441 -133158 -155757 -124481 -24116 -332800 10885 47848 -8831 -291523 -94996
11847 -141975 73868 -381982 -56460 158603 141031 212074 -343772 -175260 181523 134219
11837 134219 10092 -19926 -600061 198505 -211343 68312 -235866 104520 220086 158433
$$ packed form
11916b60923A64720m805l5236a45202p293f319C06483a1460j07529H4843K50841
11905C35684A04345J44867a44287B55113j09698F161c26489H0477K9057a10460
11894I2069C4161g4934c946j19354B27640f7337m4514B27025c4919G9620C0540
11882b13759j27894A67881b88062c6714H7469L4587b58086H2888a47656d6553
11871C426h8496A46237b27925l3595f1076n3835J8114c9872D3405f1798A88693
11859c19722A5441a33158k2599L1276b4116l08684A0885L6963h831k82692i4996
11847a41975G3868c81982e6460A58603j7572P1043c43772J68512A81523m7304
11837A34219A0092a9926n80135A98505b11343F8312b35866A04520J15566o1653
$$ plain form
11827 158433 48505 71314 -35048 264309 -46232 110724 18823 129307 137397 -104930 -263189
11816 -263189 -4467 234600 -153890 143961 271658 -95383 -382657 -40331 -25048 -175401
11806 -175401 -88324 109108 -41762 -51015 -77950 -51261 221365 -45886 33048 149169 -111814
11794 -72108 118319 347445 186944 126382 -382897 -178665 -39510 -254020 169456 -332998
11783 -137857 4672 57698 117420 -30519 191970 90418 9675 -34520 33264 -157826 -121064
11772 -121064 142694 118347 -226830 41345 -349316 -161385 -13108 -137332 -211013 -8445 -24299
11761 -24299 -142552 -105703 76836 -212377 248014 -161337 -124381 98155 -183058 -125277 -62314
11749 23465 134719 179617 211796 272361 127229 1538 114004 -151435 -235775 -235469 109189
$$ packed form
11827A58433D8505K2809c5048B64309d6232A10724A8823J10484Q090a04930j58259
11816b63189d467B34600a53890A43961J27697i5383k87274d0331J5283j50353
11806a75401Q7077A09108d1762r253k6935K6689B21365d5886C3048J16121a11814
11794g2108A18319K29126j60501o0562c82897a78665c9510k14510A69456c32998
11783a37857D672N3026N9722c0519A91970I0418I675c4520C3264a57826L6762
11772a21064A42694k4347b26830D1345c49316a61385a3108j24224p3681h445j5854
11761b4299j18253L6849G6836b12377B48014a61337L6956I8155a83058N7781f2314
11749B3465J11254M4898L2179O0565A27229A538J12466a51435q4340L06A09189
$$ plain form
11737 120183 -69703 37270 239290 -79784 -66327 57971 -169689 301551 -1183 63436 -309253
11725 65901 -116791 -42078 -232619 -57952 -29409 101653 138864 -71918 338635 -120197 -20893
11713 161354 -305870 -116719 -115621 -38978 65331 -264671 -90035 114526 136105 75291 161892
11702 161892 -41477 232645 -3681 -6597 180291 -32599 104501 232154 -272659 -76459 -12101
11690 -52133 148137 -182573 -18039 246417 -248481 369373 -8573 -95342 303413 -117704
11679 123906 178241 -87376 113378 -108214 -74921 -37070 179565 -77334 28061 291921 -20827
11667 -11192 126924 -41766 -24187 107537 211272 -80808 89012 -119807 116484 7250 28984
11656 28984 25486 229221 -234445 -41230 -160745 201876 120879 -114712 12510 106620 -68812
$$ packed form
11737A20183f9703C7270K02020g9784J3457E7971a69689C01551a183F3436c09253
11725F5901a16791d2078j90541e7952K8543A01653L7211g1918C38635a20197b0893
11713A61354c05870a16719J098c8978F5331b64671i0035A14526K1579o0814Q6601
11702A61892d1477B32645c681k916A80291c2599A04501J27653b72659g6459a2101
11690e2133A48137a82573a8039B46417b48481C69373h573q6769C03413a17704
11679A23906N4335h7376A13378a08214L3293c7070A79565g7334B8061K63860b0827
11667a1192A26924d1766J7579A07537J03735h0808H9012a19807A16484G250K1734
11656B8984l498K03735b34445d1230j19515B01876q0997a14712A2510R4110f8812
$$ plain form
11644 339783 -76132 94865 -58870 -81137 195963 -157600 9724 -34730 55604 76902 73790
11633 73790 -55462 -157632 -51060 -138653 186883 184174 -132603 -352161 -1012 128691 65746
11622 65746 50861 -171 -150022 18387 -288797 166941 116721 -20378 105575 -327216 -24778
11610 201182 -138050 40781 290581 -90000 -67232 -40367 -265365 -115306 95417 -21777 292089
11598 -213090 -237098 -132489 -75824 223295 -11332 198833 117761 39088 -26659 -2293 244735
11586 -8273 36721 -81736 238124 -89111 139616 133507 236981 145398 32872 -81920 -103387
11575 -103387 -279597 -155787 89021 325686 58886 -135776 167764 215836 85877 -24487
11564 -237371 188011 234453 -123632 -7730 189284 144907 358085 54126 39639 -32320 77802
$$ packed form
11644C39783g6132I4865e8870k2267A95963a57600I724c4730E5604K1298l112
11633G3790e5462j02170e1060q7593A86883k709a32603k19558a012A28691o2945
11622F5746j4885a71j49851A8387b88797A66941n0220b0378A05575c27216b4778
11610B01182a38050D0781K49800i0000K2768K6865k24998a15306I5417b1777B92089
11598b13090k4008J04609N6665B23295a1332A98833q1072C9088b6659b293B44735
11586h273C6721h1736B38124h9111A39616o109J03474r1583C2872h1920k1467
11575a03387j76210J23810H9021K36665E8886a35776A67764M8072H5877b4487
11564b37371A88011M6442a23632g730A89284m4377K13178E4126j4487c2320G7802
$$ plain form
11552 154670 113570 -267832 -80770 -80142 -259902 88552 64337 186107 -201106 -178401 232840
11540 -100466 -183133 -89095 -85614 126267 348328 -8454 152351 219522 6325 -50627 271124
11528 384574 111927 45658 -43690 149823 167223 308540 -85299 97875 -49420 257998 119419
11516 22107 -120500 186241 -227491 134842 -297958 15858 366579 128201 361588 3886
11505 -83133 2750 546 102722 -56845 174610 567251 -7985 -54054 86050 32588 -93401 190769
11492 315705 -248658 65793 86812 104479 91364 194355 -334937 399859 207684 131689
11482 131689 403567 357735 237337 323096 21063 95434 -5931 206160 16161 160601 283017
11471 283017 20109 328510 157381 37246 -87458 108449 77501 320255 179555 109786
$$ packed form
11552A54670m1100b67832h0770O28j79760H8552k4215J21770b01106K2705B32840
11540a00466q2667h9095L481A26267K22061h454A52351O7171F325e0627B71124
11528C84574A11927D5658d3690A49823J7400J41317h5299I7875d9420B57998A19419
11516B2107a20500A86241b27491A34842b97958A5858L50721A28201K33387C886
11505h3133B750E46J02176e6845A74610L92641g985m6069H6050C2588i3401A90769
11492C15705b48658F5793K1019J7667j3115J02991c34937C99859j92175p5995
11482A31689K71878m5832j20398Q5759B1063P4371e931B06160A6161J44440J22416
11471B83017B0109L08401A57381C7246h7458A08449l0948K42754j40700o9769
$$ plain form
11461 109786 -110771 103284 321099 -60500 210954 120249 -181505 -162905 287617 48513
11450 105247 116448 -15657 72732 -162292 -122335 126728 109042 168314 40958 80270 97740
11439 97740 83728 -90354 220959 71623 180827 -127036 -2691 -52425 79387 260391 -11669
11427 -38911 154785 -237038 114925 25632 -141184 300296 -245159 -99572 -128536 -2994 36285
11415 32684 156498 -56642 148056 123834 -107342 23151 -436628 50953 -45493 -8441 114306
11403 63131 278910 -94058 -105050 20158 -76393 -140274 -72829 -321100 55495 -55771 380461
11391 66066 207653 262133 -72638 150371 -30645 88591 -135511 -276317 59934 162742 124372
11380 124372 -111002 176267 -22806 -37092 441 88277 -74725 18389 217565 282100 -82498
$$ packed form
11461A09786a10771A03284K17815f0500B10954r0705a81505J8600B87617D8513
11450A05247J1201a5657G2732a62292L9957A26728j7686N9272D0958L9312J7470
11439I7740j4012i0354B20959G1623J09204a27036b691m9734G9387J81004a1669
11427c8911A54785b37038A14925B5632a41184C00296b45159i9572k8964b994C6285
11415C2684J23814e6642A48056k4222a07342B3151d36628E0953d5493h441A14306
11403F3131K15779i4058j0992B0158g6393o3881O7445k48271E5495e5771C80461
11391F6066J41587N4480g2638A50371c0645H8591a35511j40806E9934J02808l8370
11380A24372a11002A76267b2806j4286D41Q7836g4725A8389J99176O4535h2498
$$ plain form
11368 241000 37069 -142873 342093 -44332 156219 206603 36607 91166 215208 -16002 10029
11356 -201216 -379848 167586 99625 -138545 -134741 27006 -23187 -266765 -148260 84346 -70121
11344 95665 -36074 296117 98348 -221665 -180480 66905 -100300 -197952 209572 66354 -345133
11332 402376 101437 -75396 -43884 28564 54541 266400 282628 -251106 -118248 -161540 -29069
11320 133728 56936 55442 -165619 -54848 -2450 -15004 71373 -43117 153641 271190 -114482
11308 29868 103634 -200809 -248454 218852 93638 -90204 97678 6953 106898 238424 -12688
11296 40621 326314 64863 4838 -165374 327623 99069 4899 226620 989 -206860 -151319
11285 -151319 245179 93814 170690 -4250 -94126 181258 -111597 218439 -2402 -111155 -42828
$$ packed form
11368B41000C7069a42873C42093d4332A56219N0384C6607N4559J24042a6002A0029
11356b01216j78632A67586o7961a38545L804B7006b3187k43578J18505H4346g0121
11344I5665c6074B96117I8348b21665M1185F6905a00300r7652B09572F6354c45133
11332D02376A01437g5396L1512B8564K5977K11859J6228b51106a18248m3292b9069
11320A33728E6936j494a65619e4848b450j2554G1373d3117A53641J17549a14482
11308B9868P3766b00809m7645B18852I3638i0204I7678F953R9945J31526a2688
11296D0621K85693F4863D838a65374C27623I9069D899K21721I89b06860N5541
11285a51319B45179I3814P6876d250q9876A81258a11597B18439b402j08753d2828
$$ plain form
11273 220587 -51421 -128414 -198224 -358738 7966 27136 -253164 158683 -416538 16953 -345410
11261 77422 -75837 123883 41782 -217656 -281412 29964 -11422 181538 45095 -83817 -266380
11250 -266380 -183692 210972 12001 -49283 -111426 -18660 194909 -4436 -5454 -42312 -26103
11239 -26103 -502655 -114595 -267127 -363492 212057 -198345 -35252 -53510 70433 155504 119618
11228 119618 -210707 258184 -205774 -287189 75290 -144768 122166 -284154 -278229 -159714
11218 -159714 -346242 -205854 -93740 92457 -127075 365215 109263 172851 -279640 -166409
11208 -166409 39346 97441 -168639 8305 -254172 -41146 141010 -226075 12202 -293358 -76373
11196 405843 203291 43381 -20086 -47008 -43304 -86222 -188874 -126593 -5021 -93857 151790
$$ packed form
11273B20587e1421p6993o9810j60514G966J9170b53164A58683d16538A6953c45410
11261G7422g5837A23883D1782b17656o3756B9964a1422A81538D5095h3817j82563
11250b66380Q2688B10972A2001d9283o2143a8660A94909d436j018l6858J6209
11239b6103m76552a14595j52532r6365B12057a98345c5252j8258G0433Q5071l5886
11228A19618b10707B58184b05774q1415G5290a44768A22166b84154N925J18515
11218a59714j86528J40388i3740I2457a27075C65215A09263O3588b79640J13231
11208a66409C9346N8095a68639H305b54172d1146A41010b26075A2202b93358g6373
11196D05843k02552D3381b0086k6922L704m2918j02652O2281e021q8836A51790
$$ plain form
11184 -275372 -231354 -208803 154764 -135253 -25859 -71883 -109429 9348 -99544 -22483 -66037
11173 -66037 101636 -113953 -6358 111111 -238123 -316794 -12354 -359443 -84985 173059 88427
11162 88427 -217188 94065 186890 -62306 -18952 -30114 88807 -104898 -181170 117267 -87741
11150 7489 -118354 -117637 91823 77825 -42997 -35729 -9534 -218710 -41321 -222925 105437 164070
11138 164070 1076 193245 -146628 -167357 -34596 206502 113347 203839 240291 182240 -38046
11126 -155350 43807 192655 248299 -236396 238386 5044 168630 -16747 398116 99346 108730
11115 108730 216583 211453 57107 -140107 167160 249136 106998 -178115 192833 -61353
11104 135182 48896 226486 124402 194143 276726 258209 51508 211592 371376 230629
$$ packed form
11184b75372M4018K2551A54764a35253b5859m6024l7546I348i9544b2483m3554
11173f6037A01636a13953f358A11111b38123p8671a2354l47089h4985A73059q4632
11162H8427b17188I4065R2825f2306a8952j1162H8807a04898p6272A17267h7741
11150G489a18354P17I1823j3998d2997P268i534k09176d1321j81604A05437N8633
11138A64070A076J92169a46628k0729c4596B06502r3155R0492L6452n8051c8046
11126a55350D3807J48848N5644b36396B38386E044J63586a6747C98116I9346R384
11115A08730J07853n130E7107a40107A67160Q1976A06998a78115A92833f1353
11104A35182D8896J77590j02084O9741Q2583j8517E1508J60084J59784j40747
$$ plain form
11094 230629 229295 -155939 198386 173031 223795 -117144 -115777 520510 132919 303667 -22341
11082 368218 296181 -7513 294081 457740 84926 240424 247893 90681 -114458 432468 298126
11071 298126 221425 463463 253170 111232 359541 202627 337810 583647 387565 136819
11060 605789 -148942 649696 734685 530622 578438 698209 404660 500891 403855 895990
11050 895990 607675 681934 628435 859888 878845 534727 522788 642966 822932 734083
11040 734083 664722 384884 450054 466958 861914 640528 391972 619083 623506 671224 732581
11029 732581 332157 494059 840562 682625 803077 649431 564656 685833 601570 550338
11019 550338 384797 655280 445344 752089 280233 731217 426958 675021 495231 586798
$$ packed form
11094B30629j334a55939A98386k5355N0764a17144J367E20510A32919J70748b2341
11082C68218p2037g513B94081J63659H4926J55498P469I0681a14458D32468j34342
11071B98126p6701K42038k10293A11232K48309j56914J35183K45837j96082A36819
11060F05789a48942F49696Q4989k04063M7816J19771k93549R6231r7036M92135
11050H95990k88315P4259n3499K31453J8957l44118j1939J20178J79966q8849
11040G34083o9361k79838O5170J6904L94956k21386k48556K27111M423M7718O1357
11029G32581C32157J61902L46503j57937J20452j53646q4775J21177q4263n1232
11019E50338j65541K70483k09936L06745B80233M50984l04259K48063j79790R1567
$$ plain form
11009 586798 690854 844051 827123 750544 700430 752101 600809 609136 461949 270046 384933
10998 384933 705214 885497 427451 214317 629458 861573 658248 527600 588851 384265
10988 384265 922263 792888 604995 653521 726898 1065369 826269 1052269 883717 885660
10978 885660 1226554 1341876 1340749 1793492 1726502 1704282 2601875 2593886 2370979 2476105 2122787
10967 2122787 2281600 1750240 1863849 1426537 1643083 1575488 1296419 1621360 1476960 1475048
10957 1475048 1594559 1286164 1638287 1246545 1356336 1051030 907334 836243 599563 849238
10947 849238 490933 576563 57567 485501 182313 228879 218272 139234 -57979 150624 340197
10936 340197 -232482 230938 21186 238249 -118690 -196411 -8073 -247764 106169 229149
$$ packed form
11009E86798J04056J53197j6928p6579n0114N1671j51292Q327j47187j91903J14887
10998C84933L20281J80283D27451k13134M15141K32115k03325j30648O1251k04586
10988C84265N37998j29375j87893M8526P3377L38471k39100K26000j68552J943
10978H85660L40894J15322j127M52743o6990k2220Q97593p989k22907J05126l53318
10967B122787J58813n31360J13609m37312K16546o7595k79069L24941j44400j912
10957A475048J19511l08395L52123l91742J09791l05306j43696p1091k36680K49675
10947H49238l58305Q5630E7567M27934A82313M6566j0607p9038e7979A50624J89573
10936C40197b32482B30938B1186K17063a18690p7721h073k39691A06169J22980
$$ plain form
10926 229149 -12389 104863 245507 147637 359530 216689 99842 -207175 -239083 267752
10915 -89211 -215719 143394 139999 -42016 315875 -115760 -19511 -63350 -34823 107162 51199
10903 -173756 -371095 297545 155744 205394 56522 172812 -438863 -143179 86447 -26411
10892 -186 274717 -121617 199821 156962 39883 170693 184406 -60978 235609 -42198 -231073
10881 -231073 -27809 -279257 294297 -6882 -84317 294114 -37297 37812 -196061 -151630 97814
10869 -576306 92258 -31212 144335 12257 -190155 -12764 263172 17893 -156731 -45020 147879
10857 12574 97642 -46098 -128508 18231 -80794 -106099 86912 90210 -48888 -310049 -256730 711628
10844 -14793 128296 -69120 7448 229650 118008 99188 -119523 14166 -455126 -272996 14908
$$ packed form
10926B29149a2389A04863J40644r7870K11893j42841I9842b07175l1908B67752
10915h9211j26508A43394l395d2016C15875a15760a9511m3839K8527A07162E1199
10903a73756j97339B97545j41801M9650E6522J16290d38863a43179H6447b6411
10892a86B74717a21617A99821m2859C9883J30810J3713f0978B35609d2198j88875
10881b31073b7809k51448B94297f882p7435B94114c7297C7812a96061M4431I7814
10869e76306I2258c1212A44335A2257a90155a2764B63172A7893a56731d5020A47879
10857A2574Q5068d6098q2410A8231h0794k5305H6912L298d8888k61161N3319G11628
10844a4793A28296f9120G448K22202j11642j8820a19523A4166d55126J82130A4908
$$ plain form
10832 -116552 -22568 -248526 -57123 149549 -1762 -12565 175532 -185614 -14489 42757 -5609
10820 196129 -20906 75116 215476 -29231 15759 -322678 -20082 -172728 -221509 -181888 47906
10808 168024 -66510 -316638 62504 -246754 -22210 161579 -117100 -31857 -43372 106603
10797 104040 -472761 62197 130866 -189671 -210418 -70981 169321 -312802 -271029 280287
10786 -135299 -127554 153575 4324 -131404 -152671 24361 50315 172904 -233538 36301 -96319
10774 -139107 218563 -234755 110349 -144730 -50279 -141356 -33704 56900 103761 82785 -438363
10762 123449 162062 -73378 -120997 -151728 248458 -159065 -172470 -184731 -115115 111972 326992
10751 326992 -123607 -104454 -89041 521947 29529 -166469 155833 94894 -33514 15638 -135144
$$ packed form
10832a16552b2568k25958e7123A49549a762j0803A75532a85614a4489D2757e609
10820A96129b0906G5116J40360b9231A5759c22678b0082j52646m8781L9621D7906
10808A68024f6510k50128F2504b46754b2210A61579a17100c1857j1515A06603
10797A04040d72761F2197O8669a89671k0747g0981A69321c12802M1773B80287
10786a35299P745A53575D324a31404k1267B4361K5954J22589b33538C6301i6319
10774a39107B18563b34755A10349a44730e0279r1077c3704E6900M6861k0976d38363
10762A23449L8613g3378m7619l0731B48458a59065j3405j2261O9616A11972K15020
10751C26992a23607J9153J5413E21947B9529a66469A55833o0939c3514A5638a35144
$$ plain form
10739 4178 -54288 -279506 92706 -73079 14436 -53942 -160103 -146556 162650 204341 43290
10727 63137 -170834 -140866 -139898 227325 206966 -116012 107240 -254681 -177178 51715 33936
10716 33936 -287558 -332302 37311 172132 -48446 -220763 69966 57151 100038 -66085 107552
10704 297695 -409341 -461038 -165970 -128410 131414 -178808 -238386 -1801 -20896 109248 159540
10693 159540 94451 -10181 176208 -171894 148830 -180328 -54451 359018 -115782 148061
10682 193463 188856 -130163 -60563 -181157 17538 33677 245762 15289 126314 194533 -252032
10670 -189241 -131733 -195114 310721 7264 -111586 -162179 -217157 -168822 -20162 107148 81073
10659 81073 -88421 -143182 -17863 -337939 -153560 -366678 -263137 -256815 -339162 157555 20762
$$ packed form
10739D178e4288k25218I2706g3079A4436e3942j06161J3547A62650M1691D3290
10727F3137a70834K9968R68B27325k0359a16012A07240b54681P7503E1715j7779
10716C3936b87558m4744C7311J34821d8446j72317F9966j2815M2887f6085A07552
10704B97695d09341n1697a65970L7560A31414a78808n9578a801j9095A09248N0292
10693A59540o5089a0181A76208a71894A48830a80328e4451C59018a15782A48061
10682A93463m607a30163f0563j20594A7538J6139K12085A5289J11025O8219b52032
10670a89241N7508o3381C10721G264a11586n0593n4978M8335b0162A07148k6075
10659H1073h8421n4761a7863l20076a53560k13118J03541O322q2347A57555B0762
$$ plain form
10647 -336210 -113693 -87231 -269748 107731 -93867 -109353 212585 -161585 -364123 -104670
10636 -136581 -182580 -217772 -175157 -125760 -400267 -140984 20781 -15969 -146440 26146 -41015
10624 -298182 -85291 -75333 -170634 -54008 1217 77965 165844 85086 -103661 -228782 -272131
10613 -272131 -245560 -278424 -308721 61377 64155 -140275 183326 -7101 -224245 -183204 7215
10601 28037 -3922 -348446 50586 -64788 -163006 -66538 42347 -27873 -81409 -69477 -287887
10590 -287887 -245672 165515 -51447 -136061 128823 -185443 -53755 -98612 -93507 -51854 -77380
10579 -77380 6177 -303341 240382 -219848 -23425 -128121 32235 100853 208957 -22153 -10647
10567 30568 235409 -174653 -107511 -136985 -191864 -126396 -98021 -159233 -21346 138731 96710
$$ packed form
10647c36210a13693K6462j82517A07731i3867j5486B12585a61585k02538a04670
10636a36581m5999l5192M2615M9397k74507a40984B0781a5969j30471B6146d1015
10624b98182h5291R958r5301e4008A217P6748Q7879q0758a03661j25121m3349
10613b72131K6571l2864l0297F1377K778a40275A83326g101k17144M1041G215
10601B8037c922l44524E0586f4788r8218f6538D2347b7873n3536J1932k18410
10590b87887M2215A65515e1447q4614A28823a85443e3755m4857N105M1653k5526
10579g7380F177c03341B40382b19848b3425j04696C2235O8618J08104b2153a0647
10567C0568K04841a74653O7142k9474n4879O5468K8375o1212b1346A38731m2021
$$ plain form
10556 96710 -270222 373124 -243250 386655 8668 -132710 160095 -338639 -41311 -123835
10546 -123835 -117405 13060 -99102 -226508 -54826 -65825 242943 39088 -350123 -49573 183902
10534 -87675 222194 40227 -76273 123071 27572 -39762 120009 -179275 407637 38373 104571
10523 104571 87148 250898 34702 149659 -213934 3233 212294 70665 -108239 303428
10512 -163206 -191794 -63478 6828 -43398 -78503 64362 145529 -383603 136675 -34596 107032
10500 186585 251206 -25643 -10389 -67394 -262918 9358 -87545 -22955 209055 -245718 -181942
10489 -181942 180010 -366423 266 -223726 103307 -156155 -69958 434890 36665 122991 386788
10478 386788 310545 384288 169889 283226 411689 81823 131561 226710 -406523 -57330 58833
$$ packed form
10556I6710b70222C73124b43250C86655H668a32710A60095c38639d1311q2524
10546a23835O430A3060i9102j27406e4826j0999B42943C9088c50123d9573A83902
10534h7675B22194D0227g6273A23071B7572c9762A20009a79275D07637C8373O6198
10523A04571j7423J63750C4702J14957b13934C233K09061G0665a08239C03428
10512a63206k8588f3478F828d3398l5105F4362Q1167c83603A36675c4596A07032
10500A86585O4621b5643a0389n7005j95524I358h7545b2955B09055b45718O3776
10489a81942A80010c66423B66b23726A03307a56155f9958D34890C6665Q6326K63797
10478C86788p6243P3743A69889J13337J28463H1823M9738R5149d06523e7330E8833
$$ plain form
10466 -104209 -132661 -115973 -79107 -317500 -4819 157057 -1137 326242 -193436 -54902 -258364
10455 -258364 -14130 58785 44920 -136490 172353 158886 -228468 -96692 15299 79923 -87685
10443 -162154 -101138 -32207 34364 -124878 -144151 -24942 -109816 -130744 -27317 -225375 -93493
10431 219158 -2582 -92690 -71185 247762 125279 -116602 275117 -151163 155665 113302
10421 113302 -173218 -130196 -202609 -11718 -65779 -267157 87777 -118434 -135444 48645 31578
10410 31578 -121321 145080 -11673 121216 255159 -86118 -124431 80132 223927 15266 139362
10399 139362 422886 -250900 222504 133771 -81418 148820 82100 229835 211720 151619
10389 151619 23331 18215 16237 18654 -375319 -13407 88302 -186746 64863 263873 160077
$$ packed form
10466a04209k8452J6688L6866k38393d819A57057a137C26242a93436e4902k03462
10455b58364a4130E8785j3865a36490A72353j3467b28468i6692A5299O4624h7685
10443a62154O1016c2207C4364a24878j9273b4942q4874k0928b7317j98058i3493
10431B19158b582r0108K1505B47762j22483a16602B75117a51163A55665m2363
10421A13302a73218M3022p2413a1718n4061k01378H7777a18434j7010D8645j7067
10410C1578a21321A45080a1673A21216J33943h6118l8313H0132J43795A5266J24096
10399A39362K83524b50900B22504q8733h1418A48820o6720J47735j8115o0101
10389A51619B3331n116j978K417c75319a3407H8302a86746F4863J99010j03796
$$ plain form
10378 160077 179682 -1774 31882 405888 97060 97785 272952 164393 254775 -121716 760939
10366 684759 365865 271529 271314 622370 95424 -84010 151363 698469 126674 277299 -23785
10354 -96578 281388 194256 325038 494561 222622 628984 307425 478185 312953 176790
10344 176790 289651 186375 148400 294337 411439 277937 89559 135365 -32159 439978
10333 718743 494686 157672 -166947 -18175 -173291 -28666 160795 89488 52339 183298
10323 183298 -89166 160785 49664 545147 226907 59919 -119986 -35542 513521 -98774
10312 74633 -204188 -19160 110229 -260779 -83980 -235651 -279406 -38042 6543 172621 126066
10301 126066 29639 80598 -267371 -13011 -3673 -23291 19363 -98585 127605 34967 216267
$$ packed form
10378A60077J9605a774C1882L74006I7060P25J75167j08559R0382a21716G60939
10366F84759l18894r4336k15L51056I5424h4010A51363N47106A26674J50625b3785
10354i6578B81388q7132J30782J69523B22622M06362C07425J70760j65232j36163
10344A76790J12861j03276l7975J45937J17102j33502H9559M5806c2159D39978
10333G18743k24057A57672a66947a8175j55116b8666A60795p1307l7149J30959
10323A83298h9166A60785D9664M95483B26907E9919a19986c5542E13521i8774
10312G4633b04188a9160A10229b60779h3980j51671m3755c8042F543J66078m6555
10301A26066B9639N0959b67371a3011c673j9618A9363i8585A27605C4967J81300
$$ plain form
10290 216267 -203757 149136 -296629 45027 -78874 -98640 -173869 52689 -242212 -134783
10280 -134783 -39975 -78246 6097 -269326 47254 48646 111833 -110140 291100 -192281 -170534
10269 -170534 134719 -161801 -88079 52041 -141634 3389 -146240 -105710 316013 160933
10259 160933 237019 479054 223540 360563 388624 106487 134626 -136715 -27776 -82525
10249 -82525 272908 -5630 -108930 -347849 -155904 -292635 134161 105681 -222075 -655439
10239 -655439 -182479 69482 -59656 -60603 -13255 273372 155086 -151201 -102306 -33530 -150683
10228 -150683 -33324 -250716 43977 -178304 137101 -186188 10095 43684 24653 -41714 -448241
10217 -448241 -293607 -12807 -239203 110237 -13743 14973 -75914 -79710 -276239 -139302 -252886
$$ packed form
10290B16267b03757A49136b96629D5027g8874j9766p5229E2689b42212J07429
10280a34783c9975l8271F097b69326D7254J392O3187a10140B91100a92281K1747
10269a70534A34719a61801P3722E2041a41634C389a46240M0530C16013j55080
10259A60933P6086K42035B23540J37023K8061A06487K8139a36715b7776n4749
10249h2525B72908e630j03300k38919a55904j36731A34161k8480b22075m33364
10239f55439a82479F9482e9656r47a3255B73372j18286a51201M8895c3530j17153
10228a50683c3324k17392D3977a78304A37101a86188A0095L3589j9031d1714m06527
10217d48241J54634a2807k26396A10237a3743A4973g5914l796j96529J36937j13584
$$ plain form
10206 -252886 -76143 -174871 -28771 333695 350194 -442092 -163595 -62942 -28583 -111200 -69061
10195 -69061 63642 -63215 -184927 -278321 45605 165929 -268790 -10569 -121653 -51887 113440
10183 -163501 -313148 144375 188363 -49406 -144382 8156 -65167 -131134 314329 -45504 -126281
10172 -126281 -34887 227570 382939 14993 -326239 137790 -208737 -448027 -227882 100743
10161 21625 -260532 -124479 -24006 -5530 -127869 186373 88461 -11539 -244117 -226319 184469
10149 42010 188425 134811 175362 -11899 -59979 -221654 -507918 230548 177588 -312976 -81322
10137 -62561 33929 -109217 -99081 -226828 -19767 -307787 157209 -351074 176904 -106245
10126 252082 -157601 -195739 23237 21704 -100784 -253937 50196 198820 21925 211462 -155794
$$ packed form
10206b52886g6143r8728b8771C33695J6499d42092a63595f2942b8583q2617M2139
10195f9061F3642f3215j21712r3394D5605J20324b68790a0569j11084e1887A13440
10183a63501j49647A44375M3988d9406r4976H156f5167o5967C14329d5504q0777
10172a26281c4887B27570J55369A4993c26239A37790b08737k39290K20145A00743
10161B1625b60532a24479b4006e530j22339A86373H8461a1539k32578J7798A84469
10149D2010J46415n3614M0551a1899m8080j61675k86264B30548n2960c12976h1322
10137f2561C3929a09217J0136j27747a9767k88020A57209c51074A76904a06245
10126B52082a57601l8138B3237j533a00784j53153E0196J48624B1925J89537a55794
$$ plain form
10114 -156361 470 -3203 -57761 -5113 44233 -266124 117680 91037 -304386 -303569 -162040 -363273
10102 -363273 70107 -20858 93440 -319177 -226966 -149051 -325833 -348299 -217515 89469 -10940
10090 -238935 -186790 -137794 -84898 -409275 78910 186261 196048 421062 -151920 -138749 -45584
10078 27579 -5793 153269 320289 48083 -37686 -106717 140219 82129 34744 -258237 -215250
10067 -215250 -40991 -304649 -2696 56816 -40132 -137290 -118111 175987 -353421 40668 -193115
10055 192658 -71736 56409 17119 -450416 404117 132718 -91317 -64994 255286 30289 -26796
10043 -154544 134741 -72838 299066 94545 -371756 -249025 172147 -95326 -165331 -378305
10033 -378305 -49460 -72282 -247260 -85881 60867 -122562 -211293 150333 82966 -123773 58670
$$ packed form
10114a56361D70c203n4558e113D4233b66124A17680k6643c04386Q17J41529k01233
10102c63273G0107b0858I3440c19177R2211P7915j76782k2466J30784H9469a0940
10090b38935N2145M8996N2896l24377G8910J07351R787K25014a51920J3171d5584
10078B7579e793A53269J67020D8083c7686o9031A40219n8090C4744b58237M2987
10067b15250d0991k63658b696E6816d0132r7158J9179A75987c53421D0668a93115
10055A92658g1736E6409A7119d50416D04117A32718i1317K6323B55286C0289b6796
10043a54544A34741g2838B99066I4545c71756J22731A72147i5326p0005k12974
10033c78305d9460k2822j74978h5881F0867a22562q8731A50333o7367a23773E8670
$$ plain form
10021 69073 -145637 -133288 -272804 -57178 -97487 -186892 81624 -304981 -57042 32022 -345081
10009 -228812 -107196 -64698 117790 43441 25337 -286526 1751 551754 -19325 427309 175708
9997 -204609 -249681 -220266 -25094 -113964 -383130 -594309 22344 -258701 196759 -152000 -415611
9986 -415611 -274795 -42673 -207344 -271241 65649 -47102 -312880 -428613 112036 72604 -434160
9974 -146392 -374499 360594 -47776 -12481 -61149 68834 -146169 94823 54320 4 56682 159914
9962 159914 -184161 140956 113190 222432 166295 -96959 30768 -190226 -86122 42174 72781
9951 72781 -166340 90510 -146983 -249553 -15839 219188 -116882 -305346 131584 246434
9941 246434 -112131 -244319 91149 -449421 -175263 5276 -206330 223183 -124874 19457
$$ packed form
10021F9073a45637J2349j39516e7178m0309q9405H1624c04981e7042C2022c45081
10009b28812a07196M2498A17790D3441j8104b86526A751N50003a9325D27309A75708
9997b04609m5072K9415b5094q8870k69166k11179B2344b58701A96759a52000k63611
9986d15611J40816d2673j64671o3897F5649d7102k65778j15733A12036l9432d34160
9974a46392k28107C60594d7776a2481m8668F8834a46169I4823m0503DN6678J03232
9962A59914a84161A40956k7766J09242n6137i6959C0768a90226h6122D2174L0607
9951G2781a66340I0510a46983j02570a5839B19188a16882j88464A31584J14850
9941B46434a12131j32188I1149d49421a75263E276b06330B23183a24874A9457
$$ plain form
9930 -4426 -101833 -143914 64422 54378 -132614 -165069 -83904 201313 104063 -145202 -140415 242015
9917 273794 -440823 -137135 -82699 -63125 -235894 242254 15167 -251595 -205225 -221428 28101
9905 242093 -337114 -144813 44244 15762 61581 -314325 -295189 132623 74046 -115312 -74134
9894 -74134 -39248 -186813 -93703 107095 159593 -255698 -9220 82025 -112035 5323 -161254
9882 -137082 -365661 -2601 -524226 35472 118104 -578360 -219086 -280943 -52147 -99703 -193415
9871 -193415 256422 51126 8364 45487 -71138 35778 -524292 311625 -266574 -53554 137752
9859 -351647 -78129 -178130 -333132 -574260 -212349 -1615 -103909 -84674 -164180 -30504 200444
9847 -182009 97782 -104390 -174112 -248975 41804 -81576 -454543 205853 -6036 -71942 -139882
$$ packed form
9930d426r7407m2081F4422j0044a32614l2455Q1165B01313r7250a45202M787B42015
9917B73794d40823a37135N4436J9574j72769B42254A5167b51595M6370j6203B8101
9905B42093c37114a44813D4244A5762M5819c14325J9136A32623n8577a15312M1178
9894g4134L4886j47565R3110A07095N2498b55698i220H2025a12035E323a61254
9882a37082k28579b601n21625C5472Q2632e78360b19086o1857e2147m7556r3712
9871a93415B56422E1126H364L7123g1138C5778e24292C11625b66574e3554A37752
9859c51647g8129j00001j55002k41128b12349a615j02294J9235p9506c0504B00444
9847a82009I7782a04390o9722p4863D1804h1576l72967B05853f036o5906o7940
$$ plain form
9836 -139882 98903 -51503 -44623 135572 -189493 -216364 162070 -140856 145281 -169309 -269570
9825 -269570 -45043 173888 53581 20529 -76993 -19371 -23740 -29021 105933 -57219 -266145
9814 -266145 54375 64697 -491807 10111 53224 146940 141593 -160722 -13154 76544 -75188
9802 -61372 301927 48875 -323508 114249 91310 -11629 -249805 -163850 -153246 164162 155276
9791 155276 -270004 -117786 56325 -199921 -92398 -240396 -135964 -329970 33103 -342533
9780 251452 85388 -275959 4609 226930 -22635 -211885 141721 -320636 -227712 -98817 85896
9768 -178612 61768 -177628 -108927 -67672 9742 56439 -453472 -89298 -87310 -189511 -83140
9756 90482 -76483 -225502 -102215 -64567 238565 -12253 203113 10739 -712 -182031 213101
$$ packed form
9836a39882I8903e1503O880A35572a89493k6871A62070a40856A45281a69309j00261
9825b69570d5043A73888E3581B0529g6993a9371m369n281A05933e7219k08926
9814b66145E4375J0322d91807A0111M3113R3716n347a60722a3154G6544g5188
9802f1372C01927D8875c23508A14249k2939a1629k38176Q5955J0604A64162q886
9791A55276b70004a17786E6325a99921i2398j47998J04432j94006C3103c42533
9780B51452H5388b75959D609K22321b2635j89250A41721c20636R2924i8817H5896
9768a78612F1768a77628O8701M1255I742M6697d53472h9298J988j02201h3140
9756I0482g6483j49019a02215L7648B38565a2253B03113A0739g12j81319B13101
$$ plain form
9744 -353280 -234442 -218386 1154 119857 -5366 -73314 6618 -96127 -300580 -120066 -158675
9733 -158675 -113974 86889 75079 -179745 15 -132853 190240 160257 -422816 -34909 -119893
9722 -119893 8743 -165368 -76150 23955 -133900 -4969 -76928 -235711 -359803 -170677 -115539
9711 -115539 -9478 -362264 51442 -93351 307000 4402 -28880 -170975 -36550 -82288 -179769
9700 -179769 143517 -22266 206353 -157087 55037 66559 -311351 -39860 -471307 73106 -195887
9688 -189230 121893 26814 48724 -281914 -218521 -358947 -367651 180287 -116806 -64024 118024
9676 72778 120172 198076 241514 -77516 40594 -86826 -19541 94103 -72286 -79248 -129359 -101294
9664 -101294 -192428 -166670 -36245 -211521 194624 -169951 -158256 -216303 -167896 -212838 46416
$$ packed form
9744c53280J18838J6056A154J18703e366o7948F618i6127k04453a20066l8609
9733a58675M4701H6889j1810a79745A5a32853A90240k9983d22816c4909q4984
9722a19893H743a65368g6150B3955a33900d969p1959j58783j24092a70677N5138
9711a15539i478l52786E1442i3351C07000D402b8880j42095c6550m5738r7481
9700a79769A43517b2266B06353a57087E5037J1522c11351c9860m31447G3106a95887
9688a89230A21893B6814K1910b81914O3393j40426q704A80287a16806N2782A18024
9676G2778M7394P7904M3438g7516D0594h6826a9541I4103g2286o962n0111K8065
9664a01294r1134K5758c6245j75276A94624a69951J1695n8047M8407m4942D6416
$$ plain form
9652 -166692 14334 -83294 -92535 -453709 -158329 73415 37821 21979 -162178 -186000 -66335
9640 63328 -258072 58261 -312495 -5989 -158295 102345 71616 -168512 -125427 -93508 -212843
9629 -212843 -151899 93802 -155048 203208 310692 -220350 28980 -241383 25598 -35166 -181661
9618 -181661 12774 114627 -56996 -136292 -239016 -84716 -104371 -104952 -447445 -111913 -127753
9607 -127753 156081 234359 -110905 165943 -231578 -262541 -26209 -20252 13712 -226473 -279533
9596 -279533 -112966 -99231 -47961 -95074 1319 -219349 -59554 -90529 181357 -105909 20742
9584 107877 35904 32285 -135735 -215175 -66484 91406 129559 -108966 17768 -97901 -93101 -85559
9572 -85559 -375472 -141317 175229 -87736 -168375 -301374 -301306 -26023 -53158 -166539 -304846
$$ packed form
9652a66692A4334h3294r241l61174a58329G3415l5594j5842a62178k3822f6335
9640F3328b58072E8261c12495e989j52306A02345l0729a68512M3085L1919j19335
9629b12843O0944I3802a55048B03208J07484b20350B8980b41383B5598c5166j46495
9618a81661A2774J01853e6996p9296j02724h4716j9655n81l42493a11913j5840
9607a27753A56081P8278a10905A65943b31578l0963b6209N957A3712b26473n3060
9596b79533a12966J3735d7961m7113A319b19349e9554l0975A81357a05909B0742
9584A07877C5904l619a35735p9440f6484I1406L8153a08966A7768i7901M800P542
9572h5559k89913a41317A75229h7736q0639j32999O8b6023k7135j13381j38307
$$ plain form
9561 -304846 120962 -50268 -121411 -182841 144753 -254065 51241 -19207 -90847 140159 83930
9550 83930 186776 4011 -45080 185462 194869 -183484 -98520 -453246 -225520 93881 11193
9538 110528 -16877 64872 -476157 -266281 -396041 -158456 150131 48643 -15759 -284258
9528 -284258 -37778 -6036 -112144 -100169 144164 -171534 -305454 -270264 -44362 72754 75819
9517 75819 262191 -58327 2696 -381313 -58925 -334972 -230144 -1636 -97050 -115853 51895
9505 156776 47977 -117698 -102997 141554 -232354 -234342 -35257 -182154 -38136 -49793 48110
9493 48015 325857 80059 -136102 -217519 -73853 -207628 -106902 -49640 12700 -167608 129493
9481 30069 45465 20886 333930 292089 108964 -524539 7931 101051 175705 4684 -159575
$$ packed form
9561c04846A20962e0268p1143o1430A44753b54065E1241a9207p1640A40159n6229
9550H3930J02846D011d5080A85462R407a83484Q4964l54726b25520I3881A1193
9538A10528a6877F4872d76157K09876j29760a58456A50131D8643a5759k68499
9528b84258c7778f036j06108J1975A44164a71534j33920L5190d4362G2754L065
9517G5819J86372e8327B696c81313e8925k76047J04828a636r5414j8803E1895
9505A56776D7977a17698J4701A41554b32354j988c5257j46897c8136j1657D8110
9493D8015K77842H0059a36102q1417g3853j33775J00726d9640A2700a67608A29493
9481C0069J5396B0886L13044m1841A08964e24539G931R3120P4654D684a59575
$$ plain form
9469 -197281 17698 -122054 -75438 -259361 336762 88971 114554 -529180 -234916 136660
9458 264156 -118705 -350150 -15033 -18567 -37547 -270137 -88894 -99208 26745 -83352 -116640
9447 -116640 -193338 41635 -463753 -10133 -31499 96746 -220540 -194029 62166 -88150 -306957
9436 -306957 -111407 -90662 41657 -112136 -63783 10313 -185552 10556 -317794 -60847 149680
9424 -78975 -195219 -204067 -82717 -278984 185686 -413953 119300 138642 275534 -95301 -30252
9412 264975 53410 -96923 -3049 -229223 -206650 -48164 43923 -338369 -153801 -113455 -56869
9401 -56869 -206423 -278374 102918 245553 337290 184990 -10373 253107 -148105 -239288 -212435
9390 -212435 -120038 -323201 112164 73120 169239 -232405 13892 206086 -284769 -373455 75251
$$ packed form
9469a97281A7698a22054M6616j83923C36762H8971K5583e29180b34916A36660
9458B64156a18705k31445a5033l534j8980k32590h8894j0314B6745h3352l3288
9447a16640p6698D1635d63753a0133k1366I6746b20540K6511F2166h8150k18807
9436c06957a11407K0745D1657a12136M8353A0313a85552A0556c17794f0847A49680
9424g8975j16244q848h2717j96267A85686d13953A19300J9342J36892i5301c0252
9412B64975E3410i6923c049k26174K2573d8164D3923c38369a53801M0346N6586
9401e6869j49554p1951A02918J42635R1737j52300a0373B53107a48105r1183K6853
9390b12435R2397k03163A12164l9044R6119b32405A3892J92194b84769q8686G5251
$$ plain form
9378 -261 44680 -168088 -17391 -272697 -161091 -48605 50645 36771 -215702 -234695 65095
9366 63464 49655 -210876 13342 -69821 -104421 -288992 110130 -413660 -138914 174501 205033
9355 205033 2085 38800 27755 -12671 -199078 105694 -240055 63750 -84130 -182974 -369821
9344 -369821 37302 -287385 114773 36137 -166480 47099 -114646 -135589 84129 307110 125311
9332 -48338 -229907 -37815 -169691 -265341 204000 -473202 -24808 -16424 25759 -18687 13469
9320 -61825 -231859 17225 -16696 -20311 228618 -274356 -77314 -131253 -23752 -367778 39029
9308 40399 -230060 -103749 -506898 -325435 -105709 -138314 -264736 -234085 -36152 171542
9297 13964 -95747 -133476 19477 28214 34194 18744 -327687 -169434 84970 -38050 -144488 -15611
$$ packed form
9378b61D4680a68088a7391k55306J11606d8605E0645j3874b15702j8993F5095
9366F3464j3809b10876A3342f9821l4600j84571A10130d13660a38914A74501L0532
9355B05033B085L6715j1045a2671j86407A05694b40055F3750h4130r8844j86847
9344c69821C7302b87385A14773C6137a66480D7099a14646k0943H4129K22981A25311
9332d8338j81569c7815j31876r5650B04000d73202b4808Q384B5759a8687A3469
9320f1825j70034A7225a6696l615B28618b74356g7314n3939b3752l44026C9029
9308D0399b30060a03749m03149J81463a05709l2605j26422L0651c6152A71542
9297A3964i5747l7729A9477Q737N980j5450c27687J58253H4970c8050j06438a5611
$$ plain form
9284 -73375 77102 -48741 -351557 166245 -299480 131501 -49601 42301 -18442 -39199 137687
9272 -258996 -56088 26920 -400141 43021 204477 -120562 -215828 -108692 -56722 45740 48078
9261 48078 299005 -210505 160059 180722 -545484 125253 -301315 -252154 -2423 -306777 50596
9249 -10116 -80901 137168 196086 130689 -190031 -320281 96814 193572 -185432 -109640 -86089
9238 -86089 -208268 115903 173574 -175446 112031 -251487 11279 73393 -105767 46242 -59530
9226 -39019 -181585 -42316 -40308 -359498 -34444 54600 -129078 -91046 166479 70673 -52939
9214 -325225 83792 49618 -235211 -151380 -296338 -155665 -146392 -331636 -297590 -67310 -256400
9203 -256400 -48144 -215845 -112679 94124 -420397 -35047 5107 103410 275333 -258935 40983
$$ packed form
9284g3375G7102d8741l02816A66245b99480A31501d9601D2301a8442k0757A37687
9272b58996e6088B6920d00141D3021J61456a20562r5266J07136N1970D5740K338
9261D8078K50927b10505A60059K0663e45484A25253c01315M9161b423l04354E0596
9249a0116p0785A37168N8918o5397a90031j30250I6814R6758a85432P5792K3551
9238h6089j22179A15903N7671a75446A12031b51487A1279O2114a05767D6242e9530
9226c9019j42566d2316K008l19190c4444E4600a29078L8032A66479G0673e2939
9214c25225H3792l4174b35211Q3831j44958J40673R273j85244L4046f7310j89090
9203b56400d8144j67701J03166I4124d20397c5047E107R8303J71923b58935D0983
$$ plain form
9191 -64976 -319649 148165 -379927 -30223 -194299 -237494 10986 -145737 -243153 10533 -212095
9179 -109492 45051 -82882 -396916 -147014 -137160 -22396 21224 103317 47590 -90487 74197
9167 -219587 38695 -294801 -277253 -254111 -438521 462434 -51198 59052 -80128 -404100 -41458
9155 47831 -262640 -45065 -215699 67070 79671 154492 845 82570 460643 -78668 -260104
9144 -260104 57079 287142 -114437 -112876 135898 -192974 -206486 -53618 -350712 31363 348697
9133 348697 27490 20152 80519 -160673 -98197 -2599 -282556 222767 445 38535 182874 -193979
9120 -29011 -234477 -116681 -147271 -374281 196987 -52030 -155099 -237182 217614 -232868
9109 69630 -49605 -153631 -214550 -14735 -56041 -104265 33559 12203 -396351 110202 57500
$$ packed form
9191f4976k54673A48165c79927c0223j64076m3195A0986a45737r7416A0533b12095
9179a09492D5051h2882l14034a47014R854b2396B1224Q2093D7590i0487G4197
9167b19587C8695b94801J7548K3142j84410D62434e1198E9052h0128l23972d1458
9155D7831b62640d5065j70634F7070J2601P4821H45Q1725L78073g8668j81436
9144b60104E7079K30063a14437J561A35898a92974j3512e3618k97094C1363L17334
9133C48697B7490p338O0367a60673O2476b599k79957B22767D45L8090J44339a93979
9120b9011k05466a16681l0590k27010A96987e2030j03069q2083B17614b32868
9109F9630d9605j04026o0919a4735m1306m8224C3559A2203c96351A10202n2702
$$ plain form
9098 57500 -364591 -23599 -291446 159694 150705 -218546 -149599 67943 -297149 101566 -247939
9086 174503 -156329 -411297 -140284 82830 -250406 -110005 -262885 132479 137928 -89874
9075 15334 254858 -235716 155051 -59221 -183907 -52488 -204038 -13234 -191516 333241
9064 -225817 58045 1968 51749 -119611 -131920 343781 -80342 -186644 17870 -105241 -63187
9053 -63187 -217995 -210616 26989 -194428 -26734 -156556 173732 92199 -188219 198866 311713
9042 311713 -177537 133564 -253688 94175 -20968 -196952 -272365 -211661 -226404 -15295 -169123
9031 -169123 -151732 239652 -16067 -151113 -171558 140321 117890 -177955 74087 -93933 333218
9019 -116101 11096 -172688 -26920 -3953 -274594 65693 176705 68148 -208491 -63314 181606
$$ packed form
9098E7500c64591b3599k67847A59694q989b18546O8947F7943b97149A01566b47939
9086A74503a56329k54968a40284H2830b50406a10005j52880A32479N449h9874
9075A5334K39524b35716A55051e9221j24686e2488j51550a3234j78282C33241
9064b25817E8045A968M9781a19611j2309C43781h0342j06302A7870a05241M2054
9053f3187j54808P379B6989a94428b6734j29822A73732q1533a88219A98866J12847
9042C11713a77537A33564b53688I4175b0968j75984p5413O0704j4743a5295j53828
9031a69123J7391B39652a6067j35046k0445A40321k2431a77955G4087i3933C33218
9019a16101A1096a72688b6920c953k70641F5693J11012F8148b08491f3314A81606
$$ plain form
9007 -204049 82366 -172416 -120457 45837 31375 -30506 -253392 -46024 -137539 -249828 351659
8995 14617 -554694 123492 136828 -142353 -226702 -253743 233507 4502 12116 -190057 76248
8983 -178818 -95010 -140557 -303314 -172738 -247662 128175 116627 -370558 34517 120592 -84358
8971 -131849 -186081 -71473 -261232 -218791 -80368 112275 -122956 -174144 -92182 29387 -12031
8959 -246160 -271557 -228695 -328465 67545 101963 -45461 -18655 190552 -165760 -185471 -243035
8948 -243035 -220084 86679 8850 -147558 -82425 -403645 63433 -156436 -49397 94431 119346
8937 119346 -35087 -164766 107412 397877 173318 153166 201030 -249652 136286 174752
8927 174752 225211 446127 270194 1597250 3610254 8597794 18482866 9820613 3191700
$$ packed form
9007b04049H2366a72416N1959D5837j4462c0506k22886d6024r1515j12289C51659
8995A4617e54694A23492J3336a42353q4349k7041B33507D502P614a90057G6248
8983a78818Q3808m5547j62757J30576p4924A28175j1548c70558C4517Q6075h4358
8971a31849n4232g1473j89759M2441h0368A12275a22956n1188Q1962B9387a2031
8959b46160k5397M2862r9770F7545L4418d5461a8655A90552a65760j9711n7564
8948b43035K2951H6679H850a47558O5133l21220F3433a56436d9397I4431K4915
8937A19346c5087j29679A07412K90465A73318k0152M7864b49652A36286L8466
8927A74752N0459K20916j75933J327056K013004M987540R885072q662253C191700
$$ plain form
8917 953310 916888 307453 358416 44839 18106 149710 423085 206 43328 449128 467022
8906 467022 309226 -45715 -138869 -110021 157745 78294 -55703 -72150 -356023 -59621 -190892
8895 -190892 -225660 -4232 -126264 -86588 -144393 -85245 143255 -136068 304821 90636 -330352
8883 -346275 -196607 -281717 333213 -202764 12661 -285846 202427 54190 123870 146476 -47410
8871 60760 -89529 -132649 114637 82470 -2404 272605 -69458 120837 -71690 -55385 -219324
$$ packed form
8917I53310l6422C07453N0963D4839A8106J31604K73375B06M3122M05800J7894
8906D67022j57796d5715r3154K8848A57745G8294e5703j6447k83873e9621j31271
8895a90892l4768d232j22032L9676n7805N9148A43255a36068C04821I0636c30352
8883c46275J49668q5110C33213b02764A2661b85846B02427E4190O9680K2606d7410
8871F0760h9529m3120A14637l2167b404B72605f9458A20837g1690J6305j63939
$$ [...]
##END NTUPLES=NMR SPECTRUM
##END=
