
##TITLE=UV1237_M8_1260-1248_20_7241032_W9OkGKhHRg
##JCAMPDX= 6.0         $$ Bruker NMR JCAMP-DX V2.0
##DATA TYPE= NMR SPECTRUM
##DATA CLASS= NTUPLES
##ORIGIN= BRUKER
##OWNER= Administrator
$$ 1.72 TOPSPIN		Version 2.1
$$ 2013-01-19 01:26:07.301 -0500  Administrator@X
$$ Compression mode = diff/dup
##.OBSERVE FREQUENCY= 400.02188249412
##.OBSERVE NUCLEUS= ^1H
##.ACQUISITION MODE= SIMULTANEOUS (DQD)
##.ACQUISITION SCHEME= undefined
##.AVERAGES= 64
##.DIGITISER RES= 22
##SPECTROMETER/DATA SYSTEM= spect
##.PULSE SEQUENCE= noesygpps1d.comp
##.SOLVENT NAME= COFFEE_meoh
##.SHIFT REFERENCE= INTERNAL, COFFEE_meoh, 1, 14.96112
##AUDIT TRAIL= $$ (NUMBER, WHEN, WHO, WHERE, PROCESS, VERSION, WHAT)
$$ ##TITLE= Audit trail, TOPSPIN		Version 2.1
$$ ##JCAMPDX= 5.01
$$ ##ORIGIN= Bruker BioSpin GmbH
$$ ##OWNER= Administrator
$$ $$ E:\/data/COFFEE/nmr/UV1237_M8_1260-1248_20_7241032_W9OkGKhHRg/22/pdata/1/auditp.txt
$$ ##AUDIT TRAIL=  $$ (NUMBER, WHEN, WHO, WHERE, PROCESS, VERSION, WHAT)
(   1,<2013-01-19 01:26:01.332 -0500>,<Administrator>,<X>,<go>,<TOPSPIN 2.1>,
      <created by zg
	started at 2013-01-19 01:14:31.363 -0500,
	POWCHK enabled, PULCHK disabled,
       configuration hash MD5:
       86 BA 57 50 F2 9D 5C 9B 26 00 A9 28 5F 66 2E 89
       data hash MD5: 64K
       A1 88 05 A7 CF 66 1A F2 E2 6A 9E AF 8C BC FC 90>)
(   2,<2013-01-19 01:26:04.473 -0500>,<Administrator>,<X>,<proc1d>,<TOPSPIN 2.1>,
      <Start of raw data processing
       efp LB = 0.3 FT_mod = 6 PKNL = 1 PHC0 = 0 PHC1 = 0 SI = 128K 
       data hash MD5: 128K
       87 AE F8 3F 97 BD 4F 2C 87 2F 26 85 BC 36 89 01>)
(   3,<2013-01-19 01:26:05.535 -0500>,<Administrator>,<X>,<proc1d>,<TOPSPIN 2.1>,
      <pk PHC0 = -83.56201 PHC1 = 0 
       data hash MD5: 128K
       2F FF F4 C7 E8 F7 4E 50 CB 0D 7A C6 2B 5B C4 A2>)
(   4,<2013-01-19 01:26:06.223 -0500>,<Administrator>,<X>,<proc1d>,<TOPSPIN 2.1>,
      <abs ABSG = 1 
       data hash MD5: 128K
       4A 21 F1 B1 64 EF 7A 4F 91 AC 1F AC 66 83 FF E5>)
(   5,<2013-01-19 01:26:06.394 -0500>,<Administrator>,<X>,<proc1d>,<TOPSPIN 2.1>,
      <abs ABSG = 2 
       data hash MD5: 128K
       A9 1A 11 03 1E 20 C1 9F AD D6 5D 6D A7 17 01 87>)
(   6,<2013-01-19 01:26:06.613 -0500>,<Administrator>,<X>,<proc1d>,<TOPSPIN 2.1>,
      <abs ABSG = 3 
       data hash MD5: 128K
       EF 7E 55 47 16 52 13 CD 47 67 F0 90 41 3C C7 1E>)
(   7,<2013-01-19 01:26:06.785 -0500>,<Administrator>,<X>,<proc1d>,<TOPSPIN 2.1>,
      <abs ABSG = 4 
       data hash MD5: 128K
       C2 88 E6 51 8E ED A7 B2 FC C1 7B 8E F0 0A AB BE>)
(   8,<2013-01-19 01:26:06.957 -0500>,<Administrator>,<X>,<proc1d>,<TOPSPIN 2.1>,
      <abs ABSG = 5 
       data hash MD5: 128K
       E7 97 36 FB DE 06 1F 80 F4 04 FE 05 A6 01 45 C4>)
$$ ##END=
$$ 
$$ $$ hash MD5
$$ $$ 37 4B 19 06 02 F1 1C 53 61 65 BC D9 31 0D 3A F1
##$RELAX= 
##$RELAX= 
##$RELAX= 
##$RELAX= 
##$RELAX= 
##$RELAX= 
##$RELAX= 
##$RELAX= 
$$ Bruker specific parameters
$$ --------------------------
##$DU= <E:\>
##$EXPNO= 22
$$ [...]
##$TP07= 0
##$TPNAME0= <>
##$TPNAME1= <>
##$TPNAME2= <>
##$TPNAME3= <>
##$TPNAME4= <>
##$TPNAME5= <>
##$TPNAME6= <>
##$TPNAME7= <>
##$TPOAL= (0..7)
0.5 0.5 0.5 0.5 0.5 0.5 0.5 0.5
##$TPOFFS= (0..7)
0 0 0 0 0 0 0 0
##$TUNHIN= 0
##$TUNHOUT= 0
##$TUNXOUT= 0
##$USERA1= <user>
##$USERA2= <user>
##$USERA3= <user>
##$USERA4= <user>
##$USERA5= <user>
##$V9= 5
##$VALIST= <valist>
##$VCLIST= <CCCCCCCCCCCCCCC>
##$VD= 0
##$VDLIST= <DDDDDDDDDDDDDDD>
##$VPLIST= <PPPPPPPPPPPPPPP>
##$VTLIST= <TTTTTTTTTTTTTTT>
##$WBST= 1024
##$WBSW= 4
##$XGAIN= (0..3)
0 0 0 0
##$XL= 0
##$YL= 0
##$YMAX_a= 6134699
##$YMIN_a= -13386626
##$ZGOPTNS= <>
##$ZL1= 120
##$ZL2= 120
##$ZL3= 120
##$ZL4= 120
##$ABSF1= 14.96112
##$ABSF2= -5.597062
##$ABSG= 5
##$ABSL= 3
##$ALPHA= 0
##$AQORDER= 0
##$ASSFAC= 0
##$ASSFACI= 0
##$ASSFACX= 0
##$ASSWID= 0
##$AUNMP= <proc_prof1d_extract.lims>
##$AXLEFT= 0
##$AXNAME= <>
##$AXNUC= <1H>
##$AXRIGHT= 0
##$AXTYPE= 0
##$AXUNIT= <>
##$AZFE= 0.1
##$AZFW= 0.1
##$BCFW= 0
##$BC_mod= 0
##$BYTORDP= 0
##$COROFFS= 0
##$CY= 15
##$DATMOD= 1
##$DC= 0
##$DFILT= <>
##$DTYPP= 0
##$F1P= 0
##$F2P= 0
##$FCOR= 0.5
##$FTSIZE= 131072
##$FT_mod= 6
##$GAMMA= 0
##$GB= 0
##$INTBC= 1
##$INTSCL= 1
##$ISEN= 128
##$LB= 0.3
##$LEV0= 0
##$LPBIN= 0
##$MAXI= 10000
##$MC2= 0
##$MEAN= 0
##$ME_mod= 0
##$MI= 0
##$NCOEF= 0
##$NC_proc= -2
##$NLEV= 6
##$NOISF1= 0
##$NOISF2= 0
##$NSP= 0
##$NTH_PI= 0
##$NZP= 0
##$OFFSET= 14.96112
##$PC= 1
##$PHC0= -83.56201
##$PHC1= 0
##$PH_mod= 1
##$PKNL= yes
##$PPARMOD= 0
##$PPDIAG= 0
##$PPIPTYP= 0
##$PPMPNUM= 2147483647
##$PPRESOL= 1
##$PSCAL= 4
##$PSIGN= 0
##$PYNMP= <proc.py>
##$REVERSE= no
##$SF= 400.020009589678
##$SI= 131072
##$SIGF1= 0
##$SIGF2= 0
##$SINO= 400
##$SIOLD= 131072
##$SPECTYP= <>
##$SREGLST= <1H.CDCl3>
##$SSB= 0
##$STSI= 131072
##$STSR= 0
##$SW_p= 8223.68421052631
##$SYMM= 0
##$S_DEV= 0
##$TDeff= 65536
##$TDoff= 0
##$TI= <>
##$TILT= no
##$TM1= 0
##$TM2= 0
##$TOPLEV= 0
##$USERP1= <user>
##$USERP2= <user>
##$USERP3= <user>
##$USERP4= <user>
##$USERP5= <user>
##$WDW= 1
##$XDIM= 131072
##$YMAX_p= 405159660
##$YMIN_p= -12337
##$CURPLOT= <Network HP LaserJet P1505>
##$CURPRIN= <$Network HP LaserJet P1505>
##$DFORMAT= <normdp>
##$LAYOUT= <+/1D_H.xwp>
##$LFORMAT= <normlp>
##$PFORMAT= <normpl>
##$SURQMSG= 1
$$ End of Bruker specific parameters
$$ ---------------------------------
##NTUPLES= NMR SPECTRUM
##VAR_NAME=  FREQUENCY,     SPECTRUM/REAL,   SPECTRUM/IMAG
##SYMBOL=    X,             R,               I
##VAR_TYPE=  INDEPENDENT,   DEPENDENT,       DEPENDENT
##VAR_FORM=  AFFN,          ASDF,            ASDF
##VAR_DIM=   131072,        131072,          131072
##UNITS=     HZ,            ARBITRARY UNITS, ARBITRARY UNITS
##FACTOR=    0.0627417313425164, 1,          1
##FIRST=     8223.62146879497, 272,          -65702
##LAST=      0,             1823,            -66326
##MIN=       0,             -12337,          0
##MAX=       8223.62146879497, 405159660,    0
$$ Real data points
##PAGE= N=1
##DATA TABLE= (X++(R..R)), XYDATA
$$ [...]
63912C267669k39645k29226k15968k01018j85541j69938j54062j38085j22791
63903A611395j08927r6544q5188p4602o4956n6542m9533m3982l9690l6082l2596
63892I22753k9290k6684k4946k3571k2103k0696j9698j8937j7882j6303j4439
63881F88204j2586j0824r099p222m874j923J242L972O046P794R579J1436J3385
63868F95130J5667J8373K1050K3120K4618K6110K7835K9323L0133L0456L0631
63857I72446L0370K9008K6439K3239J9835J6173J2350Q855N797K465j768o525
63845A138684j0966j4878j8559k1992k4934k7649l0604l3439l5194l5659l5663
63834H49147l5709l5307l4083l2602l1431l0145k8133k5819k4098k2964k1662
$$ y = [3267669, 3028024, 2798798, 2582830, 2381812, 2196271, 2026333, 1872271, 1734186, 1611395, 1502468, 1405924, 1320736, 1246134, 1181178, 1124636, 1075103, 1031121, 991431, 955349, 922753, 893463, 866779, 841833, 818262, 796159, 775463, 755765, 736828, 718946, 702643, 688204, 675618, 664794, 655695, 648473, 643599, 641676, 642918, 646890, 652936, 660730, 670309, 681745, 695130, 710797, 729170, 750220, 773340, 797958, 824068, 851903, 881226, 911359, 941815, 972446, 1002816, 1031824, 1058263, 1081502, 1101337, 1117510, 1129860, 1138715, 1144512, 1146977, 1145209, 1138684, 1127718, 1112840, 1094281, 1072289, 1047355, 1019706, 989102, 955663, 920469, 884810, 849147, 813438, 778131, 744048, 711446, 680015, 649870, 621737, 595918, 571820, 548856, 527194]
63823E27194j9990j8525j7499j6400j4835j3120j1694j0553r546q749q212p674
63811C70397o889n941n079m399l872l506l353l472l886m391m520m026l334l146
63797C10583l488l650l116k250j789k039k753l532l993l801k903j707p51k20N2
63782B74643J67l5o26j310j565j214o41l78m78n37l22q2q3j05J92O75Q43N06m4
63763B69606n07q71j253j670k041k167j762q34P2L88K36J94M12M86K11j13k45
63746B60142k93k13L43J322K014J980J764K068K649K685K017J310J076J117J099
63731B81080J032J077J205J410J855K608L373L747L696L648M052M861N455N202
63717C24301M112K834J987J576J226P23J52l52p27r46j073j320j805k298k399
$$ y = [527194, 507204, 488679, 471180, 454780, 439945, 426825, 415131, 404578, 395032, 386283, 378071, 370397, 363508, 357567, 352488, 348089, 344217, 340711, 337358, 333886, 330000, 325609, 321089, 317063, 313729, 310583, 307095, 303445, 300329, 298079, 296290, 294251, 291498, 287966, 283973, 280172, 277269, 275562, 274811, 274591, 274643, 274810, 274775, 274149, 272839, 271274, 270060, 269419, 269041, 268563, 268026, 267704, 267622, 267539, 267434, 267626, 268301, 269144, 269650, 269606, 269099, 268228, 266975, 265305, 263264, 261097, 259335, 258501, 258573, 258961, 259197, 259391, 259803, 260289, 260500, 260387, 260142, 259849, 259636, 259979, 261301, 263315, 265295, 267059, 269127, 271776, 274461, 276478, 277788, 278864, 279981, 281080, 282112, 283189, 284394, 285804, 287659, 290267, 293640, 297387, 301083, 304731, 308783, 313644, 319099, 324301, 328413, 331247, 333234, 334810, 336036, 336759, 336911, 336559, 335832, 334886, 333813, 332493, 330688, 328390, 325991]
63702C25991j978j307p02k04L54J039J628J857J827K025K710L452L607L165K679
63687C46143K332J738Q40L25O35J193J230R34R53J142P67j43o35k56L10M21M42
63670C58371R75J746J947J347M56k66p30r28q74q29j136j770k361k695k897l085
63654C47271l189l190l224l390l612l782l755l247k092o99J68K54J56M83J054
63639C19206J339J463K058L222M184M306L837L416L273L327L695M555N679O599
63625C70159P170P625Q130Q717R538J0706J1972J3048J4217J6022J8288K0127
63613E15719K1091K1720K2682K3946K5176K6344K7368K7693K6779K4726K1831
63602G85075J7956J2902P196J842k492n592p275p598p321p468q364r637j1063
$$ y = [325991, 324013, 322706, 322004, 321800, 322154, 323193, 324821, 326678, 328505, 330530, 333240, 336692, 340299, 343464, 346143, 348475, 350213, 351053, 351378, 352013, 353206, 354436, 355370, 356323, 357465, 358232, 358089, 357454, 357198, 357508, 357929, 358371, 359346, 361092, 363039, 364386, 364842, 364576, 363846, 362918, 362044, 361215, 360079, 358309, 355948, 353253, 350356, 347271, 344082, 340892, 337668, 334278, 330666, 326884, 323129, 319882, 317790, 317091, 317259, 317513, 317669, 318152, 319206, 320545, 322008, 324066, 327288, 331472, 335778, 339615, 343031, 346304, 349631, 353326, 357881, 363560, 370159, 377329, 384954, 393084, 401801, 411339, 422045, 434017, 447065, 461282, 477304, 495592, 515719, 536810, 558530, 581212, 605158, 630334, 656678, 684046, 711739, 738518, 763244, 785075, 803031, 815933, 823129, 824971, 822479, 816887, 809612, 802014, 794693, 787225, 778861, 769224, 758161]
63589G58161j2708j4384j5698j6743j7992j9365k0133j9917j9055j7810j5943
63578E68413j3521j1344j0030r128p797n868l748j683K27J629K246K516L238M600
63564E19750O070P216Q143R024R705R972R943R927J0197J1001J2593J5009J7922
63551F56472K0862K3635K6439K9548L2889L5869L7553L6994L3481K6817J7645
63540I78204P522j659q556j2815j4776j4999j4061j2552j1038r971r693j0389
63528H65217j2028j4371j7078j9787k2204k4213k5763k6620k6501k5613k4660
63517F26379k3987k3101k1463j9430j7736j6334j4637j2756j1449j0785r870q332
63505D36499o983o455o128n245m211l770l616k973k117k023k681l000k500j895
$$ y = [758161, 745453, 731069, 715371, 698628, 680636, 661271, 641138, 621221, 602166, 584356, 568413, 554892, 543548, 533518, 524390, 516593, 510725, 506977, 505294, 505521, 507150, 509396, 511912, 515150, 519750, 525820, 533036, 541179, 550203, 559908, 569880, 579823, 589750, 599947, 610948, 623541, 638550, 656472, 677334, 700969, 727408, 756956, 789845, 825714, 863267, 900261, 933742, 960559, 978204, 985726, 984067, 975511, 962696, 947920, 932921, 918860, 906308, 895270, 885299, 875606, 865217, 853189, 838818, 821740, 801953, 779749, 755536, 729773, 703153, 676652, 651039, 626379, 602392, 579291, 557828, 538398, 520662, 504328, 489691, 476935, 465486, 454701, 444831, 436499, 429516, 423061, 416933, 411688, 407477, 403707, 400091, 397118, 395001, 392978, 390297, 387297, 384797, 382902]
63491C82902j668j254k20P15O59q2m45o8M86P98J109J728K494L090L429L540L342
63474D00555K802K171J794J663J404O56n74k000l304m234m627m483m016l434k769
63459C81604k035j471j294j273q77J04J330K425L291L883M087M101M522N718P370
63444D11485Q932J0253J1439J2417J3187J4219J6075J8683K1522K4404K7447L0212
63432F20275L1447L0042K6010K0438J4725R971O732N029M607N268O986R741J3328
63419H04599J7280K0939K3836K6055K7875K8886K7886K4155J8492J2459O892J782
63407A041136k650n793p665r154j0826j2173j2600j2616j3394j5437j8254k1171
63395H99403k3854k6055k7435k7894k7785k7555k7256k6598k5396k3757k1764
$$ y = [382902, 381234, 379980, 379760, 380475, 381134, 381052, 380607, 380539, 381025, 381823, 382932, 384660, 387154, 390244, 393673, 397213, 400555, 403357, 405528, 407322, 408985, 410389, 411045, 410471, 408471, 405167, 400933, 396306, 391823, 387807, 384373, 381604, 379569, 378098, 376804, 375531, 374654, 374758, 376088, 378513, 381804, 385687, 389774, 393875, 398397, 404115, 411485, 420417, 430670, 442109, 454526, 467713, 481932, 498007, 516690, 538212, 562616, 590063, 620275, 651722, 681764, 707774, 728212, 742937, 752908, 759640, 764669, 769276, 774544, 781530, 791271, 804599, 821879, 842818, 866654, 892709, 920584, 949470, 977356, 1001511, 1020003, 1032462, 1039354, 1041136, 1038486, 1032693, 1025028, 1015874, 1005048, 992875, 980275, 967659, 954265, 938828, 920574, 899403, 875549, 849494, 822059, 794165, 766380, 738825, 711569, 684971, 659575, 635818, 614054]
63384F14054j9256j6109j2689r639p251n308l694k625k081j408j0J904L765N551
63370E45204P611R800J1540J2745J3885J5095J5998J6657J7941K0435K3575K6372
63358G36858K8555L0469L2181L3234L3085L1404K8082K3368J7842J2055O341J128
63346A014602l009n864p831r283j0099j0309j0728j2285j4822j7312j9175k0804
63334H73081k2659k4552k5998k6778k6783k5800k3857k1519j9306j6989j3848
63323F24992r763n574k280j40J028R56j101n308j0470j4719j6921j7311j6871
63310E26518j6392j6026j5452j4296j2548j0557q685p075n874n314n288n124m364
63297C99523l476l244l492l241k203j352j626k684l458l417k847k207j779j644
$$ y = [614054, 594798, 578689, 566000, 556361, 549110, 543802, 540108, 537483, 535402, 533994, 533984, 535888, 539653, 545204, 552815, 562615, 574155, 586900, 600785, 615880, 631878, 648535, 666476, 686911, 710486, 736858, 765413, 795882, 828063, 861297, 894382, 925786, 953868, 977236, 995078, 1007133, 1013474, 1014602, 1011593, 1005729, 997898, 988615, 978516, 968207, 957479, 945194, 930372, 913060, 893885, 873081, 850422, 825870, 799872, 773094, 746311, 720511, 696654, 675135, 655829, 638840, 624992, 615229, 609655, 607375, 607235, 608263, 609219, 608118, 602810, 592340, 577621, 560700, 543389, 526518, 510126, 494100, 478648, 464352, 451804, 441247, 432562, 425487, 419613, 414299, 409011, 403887, 399523, 396047, 392803, 389311, 386070, 383867, 382515, 380889, 378205, 374747, 371330, 368483, 366276, 364497, 362853]
63283C62853j606j318p77m49o30j056j391j657j761j210J42J468J808J267P35
63268C56418O49P88J003J300J350Q04J81N07J801K831K766K289K442L066L193
63253C81388K620K219K686L637M195M077L780L953M806O104P408Q248Q339P932
63239D51392P871Q886J0737J2452J3547J4588J6178J7976J9226J9941K0721K1609
63227F35124K1949K1500K0858K0577K0494K0247J9877J9528J9150J8776J8694
63216H56774J8907J8907J8401J7756J7270J6451J4606J1818Q649N140Q40m223
63204A001296r330j3841j7611k0547k2436k3476k4350k5391k5968k5174k2869
63193G70303j9777j6713j4065j1808r650p129l997o01K295M266N652P080Q700
$$ y = [362853, 361247, 359929, 359152, 358703, 358073, 357017, 355626, 353969, 352208, 350998, 351140, 352608, 354416, 355683, 356418, 357067, 357855, 358858, 360158, 361508, 362312, 362493, 363000, 364801, 367632, 370398, 372687, 375129, 378195, 381388, 384008, 386227, 388913, 392550, 396745, 400822, 404602, 408555, 413361, 419465, 426873, 435121, 443460, 451392, 459263, 468149, 478886, 491338, 504885, 519473, 535651, 553627, 572853, 592794, 613515, 635124, 657073, 678573, 699431, 720008, 740502, 760749, 780626, 800154, 819304, 838080, 856774, 875681, 894588, 912989, 930745, 948015, 964466, 979072, 990890, 999539, 1004679, 1005519, 1001296, 991966, 978125, 960514, 939967, 917531, 894055, 869705, 844314, 818346, 793172, 770303, 750526, 733813, 719748, 707940, 698290, 691161, 687164, 686563, 688858, 693124, 698776, 705856, 714556]
63180G14556J0167J1276J2290J3439J4429J4871J4989J5385J6069J6297J5649
63169H69417J4732J4330J4208J3426J1655R400O934L832j33m262p735j0631j3624
63156I21549j6870j9854k2188k3957k5216k5757k5475k4560k3161k1260j9059
63145F74192j7056j5493j4121j2727j1522j0694r952q976p918p060o174m872l437
63132E44190k614k575k646k154j088K42J606K742L322L413L530L990M466M566
63118E60990M400M287M294M470N074O029O548N989M856M228M235L975K964J864
63104F24203J474J683J940K113K234J914P84n96j053k26Q89J105L53n32r43r74
63088F34368q24l49N33J392J672J431J237J293J228R02Q89J632K530K611J963
$$ y = [714556, 724723, 735999, 748289, 761728, 776157, 791028, 806017, 821402, 837471, 853768, 869417, 884149, 898479, 912687, 926113, 937768, 947168, 954102, 957934, 957801, 953539, 945804, 935173, 921549, 904679, 884825, 862637, 838680, 813464, 787707, 762232, 737672, 714511, 693251, 674192, 657136, 641643, 627522, 614795, 603273, 592579, 582627, 573651, 565733, 558673, 552499, 547627, 544190, 541576, 539001, 536355, 534201, 533113, 533355, 534961, 537703, 541025, 544438, 547968, 551958, 556424, 560990, 565390, 569677, 573971, 578441, 583515, 589544, 596092, 602081, 606937, 611165, 615400, 619375, 622339, 624203, 625677, 627360, 629300, 631413, 633647, 635561, 636345, 635749, 634696, 634470, 635359, 636464, 636817, 636285, 635342, 634368, 633544, 633195, 633728, 635120, 636792, 638223, 639460, 640753, 641981, 642883, 643772, 645404, 647934, 650545, 652508]
63073F52508J740K575L791M513M913N667O691P296P469Q102R728J1749J3376J4778
63059G54896J6673J9086K1303K3050K5050K8023L1610L4792L7173L9304M1756
63048A072716M4366M6598M8213M9285M9836M9853M9582M9333M9046M8349M7125
63037A604302M5761M4665M3833M3026M2198M1505M0920L9979L7953L4229K8648
63026B047019K1488J3133L817o227j6425k6012l4557m2130m8862n4464n8467o0696
63014A737617o1326o0559n8500n5331n1342m6713m1396l5339k8774k2258j6388
63003A259691j1373o817k058L074P971J1927J5021J7949K0991K3544K4981K5545
62991A390446K6002K6557K6643K5852K4615K3710K3348K2964K1763J9259J5433
$$ y = [652508, 654248, 656823, 660614, 665127, 670040, 675707, 682398, 689694, 697163, 705265, 714993, 726742, 740118, 754896, 771569, 790655, 811958, 835008, 860058, 888081, 919691, 954483, 991656, 1030960, 1072716, 1117082, 1163680, 1211893, 1261178, 1311014, 1360867, 1410449, 1459782, 1508828, 1557177, 1604302, 1650063, 1694728, 1738561, 1781587, 1823785, 1865290, 1906210, 1946189, 1984142, 2018371, 2047019, 2068507, 2081640, 2085457, 2079230, 2062805, 2036793, 2002236, 1960106, 1911244, 1856780, 1798313, 1737617, 1676291, 1615732, 1557232, 1501901, 1450559, 1403846, 1362450, 1327111, 1298337, 1276079, 1259691, 1248318, 1241501, 1239443, 1242517, 1250488, 1262415, 1277436, 1295385, 1316376, 1339920, 1364901, 1390446, 1416448, 1443005, 1469648, 1495500, 1520115, 1543825, 1567173, 1590137, 1611900, 1631159, 1646592]
62980A646592J0597N133p88p130j3697k0032k5771l0910l5528l9472m2572m4917
62968A401505m6594m7326m6787m5212m3256m1281l9213l7114l5252l3508l1350
62957I54612k8706k6280k4630k3379k1898k0298j9097j8260j7307j6250j5659
62946G22848j5665j5626j4990j3964j3025j2225j1325j0298r332q513p808p165
62934E82912o499n692m811m159l843l523k852k043j716k114k718k803k184j350
62920E36605r07j026j440j834k116k331k467k483k405k329k344k461k525k238
62906E07699j464n69k07n99j215j428j200q88n53O9J020J952K538K684K340J492
62890E11671M26l76p30q53q19l32P46J889K272J599M10m14m01J31M05l7r00j574
$$ y = [1646592, 1657189, 1662322, 1661534, 1654404, 1640707, 1620675, 1594904, 1563994, 1528466, 1488994, 1446422, 1401505, 1354911, 1307585, 1260798, 1215586, 1172330, 1131049, 1091836, 1054722, 1019470, 985962, 954612, 925906, 899626, 874996, 851617, 829719, 809421, 790324, 772064, 754757, 738507, 722848, 707183, 691557, 676567, 662603, 649578, 637353, 626028, 615730, 606398, 597885, 590077, 582912, 576413, 570721, 565910, 561751, 557908, 554385, 551533, 549490, 547774, 545660, 542942, 540139, 537955, 536605, 535698, 534672, 533232, 531398, 529282, 526951, 524484, 522001, 519596, 517267, 514923, 512462, 509937, 507699, 506235, 505666, 505459, 504860, 503645, 502217, 501017, 500129, 499576, 499645, 500665, 502617, 505155, 507839, 510179, 511671, 512097, 511721, 510991, 510138, 509319, 508987, 509733, 511622, 513894, 515493, 515903, 515489, 515088, 515219, 515624, 515587, 514687, 513113]
62872E13113j829j837j715j480j395j842k712l422l661l668l589l136k192j244
62858D79391p59n18r8L93N69N62Q84J588K154K216J889J332N03m77j171j260r46
62841D86252o85p02q33p41k26M95Q81O29Q3j62l5J7k32m72m20j95Q2O31J561K383
62821D88311K468J884J315J237J552J979K358K516K368K290K938M307N373N178
62807E26074M022L158L316M138M993N759O506P001O993O775O930P597Q406R133
62793F10801J0045J1476J3403J5546J7694J9812K2007K4474K7389L0739L4386
62782H37772L8292M2593M7397N2605N7883O2740O6729O9764P2266P4694P6920
62771A499655P8128P7425P4374O9060O1906N3434M3984L3449K1493Q193n605j8702
$$ y = [513113, 511284, 509447, 507732, 506252, 504857, 503015, 500303, 496881, 493220, 489552, 485963, 482827, 480635, 479391, 478632, 478114, 478016, 478409, 478978, 479540, 480424, 482012, 484166, 486382, 488271, 489603, 490106, 489629, 488458, 487198, 486252, 485567, 484865, 484032, 483291, 483065, 483560, 484441, 485070, 485153, 484991, 484956, 484973, 484741, 484269, 483849, 483654, 483736, 484367, 485928, 488311, 490779, 492663, 493978, 495215, 496767, 498746, 501104, 503620, 505988, 508278, 511216, 515523, 520896, 526074, 530096, 533254, 536570, 540708, 545701, 551460, 557966, 564967, 571960, 578735, 585665, 593262, 601668, 610801, 620846, 632322, 645725, 661271, 678965, 698777, 720784, 745258, 772647, 803386, 837772, 876064, 918657, 966054, 1018659, 1076542, 1139282, 1206011, 1275775, 1348041, 1422735, 1499655, 1577783, 1655208, 1729582, 1798642, 1860548, 1913982, 1957966, 1991415, 2012908, 2021101, 2015496, 1996794]
62759A996794l0289m0324m9211n7157o3810o8589p1392p2815p3467p3243p1550
62748A324947o8189o3785n9331n5499n2278m9044m5076m0419l6098l3112l1177
62737G90939k8975k5729k2069j9117j7154j5572j3831j2043j0640r721q851p503
62725E99734n733m252l626l548l189k165p68O42J953L008L589L890M524N841P640
62710F07540R658J1817J3833J5250J6193J7566K0028K3199K6312K9169L2021L4892
62698H57478L7626M0320M3250M6428M9674N2826N5576N7411N8076N7760N6464
62687A412889N3540M8383M1146L2385K2379J1437M50r672j8894k7722l6098m3338
62675A486885m9038n3327n6277n7741n7811n6818n4820n1750m8025m4484m1576
$$ y = [1996794, 1966505, 1926181, 1876970, 1819813, 1756003, 1687414, 1616022, 1543207, 1469740, 1396497, 1324947, 1256758, 1192973, 1133642, 1078143, 1025865, 976821, 931745, 891326, 855228, 822116, 790939, 761964, 736235, 714166, 695049, 677895, 662323, 648492, 636449, 625809, 616088, 607237, 599734, 594001, 589749, 586123, 582575, 579386, 577221, 576453, 577095, 579048, 582056, 585645, 589535, 594059, 599900, 607540, 617198, 629015, 642848, 658098, 674291, 691857, 711885, 735084, 761396, 790565, 822586, 857478, 895104, 935424, 978674, 1025102, 1074776, 1127602, 1183178, 1240589, 1298665, 1356425, 1412889, 1466429, 1514812, 1555958, 1588343, 1610722, 1622159, 1622609, 1612937, 1594043, 1566321, 1530223, 1486885, 1437847, 1384520, 1328243, 1270502, 1212691, 1155873, 1101053, 1049303, 1001278, 956794, 915218]
62664I15218l9133l6892l4685l2174k9130k5983k3409k1321j9010j6432j4477
62653F22572j3597j3058j2032j0781j0075r947r687q885p814o885o149n363m283
62640E04016k917j633q91p86j021j385j944k643l064k905k418k127k200k347k171
62625D73564j554p44j62K2R2M00Q64J157J321J714K366K838K884K761K746K811
62609D93080K937L332M026M687N091N472O120P019Q206J0041J2694J5639J8140
62596E96484K0046K1814K3864K6261K8862L1472L3871L5912L7471L8232L7768
62585I32057L5982L3202K9628K5064J9424J3158O817M85n979j2357j8130k2999
62573A036352k6972l0101l2378l3834l4468l4249l3387l2342l1275k9775k7484
$$ y = [915218, 876085, 839193, 804508, 772334, 743204, 717221, 693812, 672491, 653481, 637049, 622572, 608975, 595917, 583885, 573104, 563029, 553082, 543395, 534510, 526696, 519811, 513662, 508299, 504016, 501099, 499466, 498575, 497789, 496768, 495383, 493439, 490796, 487732, 484827, 482409, 480282, 478082, 475735, 473564, 472010, 471266, 471104, 471126, 471218, 471618, 472482, 473639, 474960, 476674, 479040, 481878, 484762, 487523, 490269, 493080, 496017, 499349, 503375, 508062, 513153, 518625, 524745, 531764, 539970, 550011, 562705, 578344, 596484, 616530, 638344, 662208, 688469, 717331, 748803, 782674, 818586, 856057, 894289, 932057, 968039, 1001241, 1030869, 1055933, 1075357, 1088515, 1095332, 1095817, 1089838, 1077481, 1059351, 1036352, 1009380, 979279, 946901, 913067, 878599, 844350, 810963, 778621, 747346, 717571, 690087]
62562F90087k4747k2218k0016j7776j5360j3078j1223r890r177r133r433r505
62550E18531q985p852o195m285k697j950j867j762j267o66l51l77o35j024j313
62535D77305j249r67r26j173j106l08Q02J565K080K988M384N582O122O525P637
62520E09261R586J1837J4043J6261J8384J9946K0912K2115K4396K7510L0415L2487
62508G57153L3894L4837L5135L4747L4012L2937L0829K7156K2365J7332J2275
62497A072672O902J445l158o195p722q126p597o225m150j482J663M916P901J0841
62483A061685J4419J8764K2877K5439K5870K4325K1063J6396J1060N921J099m181
62471A244737j0631j8001k5360l1930l7349m1378m3890m5110m5501m5208m3900
$$ y = [690087, 665340, 643122, 623106, 605330, 589970, 576892, 565669, 555779, 546602, 537469, 528036, 518531, 509546, 501694, 495499, 491214, 488517, 486567, 484700, 482938, 481671, 481005, 480654, 480277, 479642, 478618, 477305, 476056, 475089, 474163, 472990, 471884, 471576, 472378, 473943, 476023, 479011, 483395, 488977, 495099, 501624, 509261, 518847, 530684, 544727, 560988, 579372, 599318, 620230, 642345, 666741, 694251, 724666, 757153, 791047, 825884, 861019, 895766, 929778, 962715, 993544, 1020700, 1043065, 1060397, 1072672, 1079574, 1081019, 1077861, 1071666, 1063944, 1055818, 1048221, 1041996, 1037846, 1036364, 1038027, 1042943, 1050844, 1061685, 1076104, 1094868, 1117745, 1143184, 1169054, 1193379, 1214442, 1230838, 1241898, 1247819, 1248918, 1244737, 1234106, 1216105, 1190745, 1158815, 1121466, 1080088, 1036198, 991088, 945587, 900379, 856479]
62460H56479m1418l8278l5215l2355k9239k5584k1740j8251j5321j2820j0644
62449E75614q825p421o371n429m198k484o19Q05J593K097K673L236L578L792M101
62434E62142M380M155L009R28j597l748m978n650o677q251r337q976p655o763
62420E10982o812p026o750o327o237o143n463m434l884l998m007l175j672k94
62406D44760L38J02p19j555j743r66L77J484J927K003K264K812L248L247K965
62391D60544K797K927L210L469L689L940M224M490M796N311O082O875P415P792
62377E27561Q403R331J0040R947R222Q678Q866R605J0449J1238J2042J2905J3873
62364F62160J5137J6907J9246K2240K6031L0546L5286L9649M3373M6496M9033
$$ y = [856479, 815061, 776783, 741568, 709213, 679974, 654390, 632650, 614399, 599078, 586258, 575614, 566789, 559368, 552997, 547568, 543370, 540886, 540267, 541072, 542665, 544762, 547435, 550671, 554249, 558041, 562142, 566522, 570677, 573686, 574614, 573017, 569269, 564291, 558641, 551964, 543713, 534376, 525400, 517745, 510982, 504170, 497144, 490394, 484067, 477830, 471687, 466224, 461790, 457906, 453908, 449901, 446726, 445054, 444760, 445098, 445200, 444481, 442926, 441183, 440217, 440594, 442078, 444005, 446008, 448272, 451084, 454332, 457579, 460544, 463341, 466268, 469478, 472947, 476636, 480576, 484800, 489290, 494086, 499397, 505479, 512354, 519769, 527561, 535964, 545295, 555335, 565282, 574504, 583182, 592048, 601653, 612102, 623340, 635382, 648287, 662160, 677297, 694204, 713450, 735690, 761721, 792267, 827553, 867202, 910575, 957071, 1006104]
62353A006104N0854N1754N1340M9016M4378L7723L0049K2513J5806R878M111k026
62341A371500q380j4229j9044k2906k6065k8514l0215l1401l2280l2649l2184
62330A093633l0916k9084k6793k4230k1985k0640k0127j9965j9992k0348k0801
62319H38752k0800k0310j9903j9872j9772j9144j8179j7288j6462j5476j4381
62308F37165j3343j2205j0667q834p254o345o054n951n493m350k704j188l22p
62294E52448L08J018K065L087L690L683L356L389M168N175N383M448L225K897
62280E98340L707M799N289N211N291N979O995P886Q683R776J1265J2804J4150
62267G00175J5596J7623K0270K3121K5826K8341L0745L3119L5762L9081M3039
$$ y = [1006104, 1056958, 1108712, 1160052, 1209068, 1253446, 1291169, 1321218, 1343731, 1359537, 1369415, 1373526, 1371500, 1363120, 1348891, 1329847, 1306941, 1280876, 1252362, 1222147, 1190746, 1158466, 1125817, 1093633, 1062717, 1033633, 1006840, 982610, 960625, 939985, 919858, 899893, 879901, 859553, 838752, 817952, 797642, 777739, 757867, 738095, 718951, 700772, 683484, 667022, 651546, 637165, 623822, 611617, 600950, 592116, 584862, 578517, 572463, 566512, 561019, 556669, 553965, 552777, 552455, 552448, 552756, 553774, 555839, 558926, 562616, 566299, 569655, 573044, 577212, 582387, 587770, 592218, 595443, 598340, 602047, 606846, 612135, 617346, 622637, 628616, 635611, 643497, 652180, 661956, 673221, 686025, 700175, 715771, 733394, 753664, 776785, 802611, 830952, 861697, 894816, 930578, 969659, 1012698]
62256A012698M6867M9754N1590N2699N2957N1681M8507M3760L7763L0358K1633
62245A500267J2588M405k753r562j6317k2660k8447l4068l9605m4430m7893m9896
62233A221629n0517m9824m8352m6944m5551m2946l8444l3318k9504k7290k5290
62222G83649k2507j9328j6479j4110j2210j1040j0586j0272r625q798q048p168
62210F33478n897m510l523l021k626k045j312n99K9O57J395K171K761L212L984
62195F24154N256O308O223N259M845N938P956R609J0269J0146R636R044Q650Q531
62181G31824Q450Q216P951P728P307O566N960O048O835P986R451J1396J3659J5893
62167H55270J8268K1474K5826L0663L4817L7460L8471L8105L6474L3304K8322
$$ y = [1012698, 1059565, 1109319, 1160909, 1213608, 1266565, 1318246, 1366753, 1410513, 1448276, 1478634, 1500267, 1512855, 1517260, 1514507, 1504945, 1488628, 1465968, 1437521, 1403453, 1363848, 1319418, 1271525, 1221629, 1171112, 1121288, 1072936, 1025992, 980441, 937495, 899051, 865733, 836229, 808939, 783649, 761142, 741814, 725335, 711225, 699015, 687975, 677389, 667117, 657492, 648694, 640646, 633478, 627581, 623071, 619548, 616527, 613901, 611856, 610544, 609945, 609974, 610631, 612026, 614197, 616958, 620170, 624154, 629410, 635718, 641941, 647200, 652045, 657983, 665939, 675548, 685817, 695963, 705599, 714643, 723293, 731824, 740274, 748490, 756441, 764169, 771476, 778042, 784002, 790050, 796885, 804871, 814322, 825718, 839377, 855270, 873538, 895012, 920838, 951501, 986318, 1023778, 1062249, 1100354, 1136828, 1170132, 1198454]
62156A198454K1931J5290R435M487j14m742r303j3623j7636k1208k4126k6365
62144A132480k8074k9252k9727k9456k8565k7046k4753k1854j8949j6482j4257
62133H64065j1773q981o494n074m924n434n594m827l452k232j440n99P78K540
62119H06559M198N627P072Q517R497R691R375R003Q449P006M238O54k599m721
62105H82566n811o430o795o659n989n465n942p436q957r507q994p963o671m900
62091G85047k690p67R7j6j17P47K624M662N914O168O044O253O934P822Q868J0281
62075H47871J1968J3425J4485J5688J7554J9724K1322K2050K2482K3211K4221
62064A054001K5195K6043K6801K7202K6701K4940K2032J8271J3751Q488K971j786
$$ y = [1198454, 1220385, 1235675, 1245110, 1249597, 1249483, 1244741, 1235438, 1221815, 1204179, 1182971, 1158845, 1132480, 1104406, 1075154, 1045427, 1015971, 987406, 960360, 935607, 913753, 894804, 878322, 864065, 852292, 843311, 836817, 831743, 826819, 821385, 815791, 810964, 807512, 805280, 803840, 803241, 804019, 806559, 810757, 816384, 823456, 831973, 841470, 851161, 860536, 869539, 877988, 884994, 889232, 889886, 887287, 882566, 876755, 870325, 863530, 856871, 850882, 845417, 839475, 832039, 823082, 813575, 804581, 796618, 789947, 785047, 782357, 781590, 781687, 781671, 781554, 782301, 784925, 789587, 795501, 801669, 807713, 813966, 820900, 828722, 837590, 847871, 859839, 873264, 887749, 903437, 920991, 940715, 962037, 984087, 1006569, 1029780, 1054001, 1079196, 1105239, 1132040, 1159242, 1185943, 1210883, 1232915, 1251186, 1264937, 1273425, 1276396, 1274610]
62052A274610n064p328r803j3160j6943k0371k3187k5484k7251k8555k9742l0930
62040A036792l1581l1185l0122k9234k8689k7854k6301k4293k2317k0586j9071
62029G45559j7616j5941j4027j2354j1357j0769j0083r477r483r857r728r011
62017F05856q709r429j0429j0634r928q829p526n916m211k848j930j189k58J164
62003E25184L014M539M784L826K902K867L099K515J141o3n42m53k8N59P42j53
61987E53933j966l688m507m513m319m395m816n293n351m835m191l934l947l623
61973D94555k748j839j570k035k639k647j895j047q48j185j255p73l33l74m29
61958D72938mN62Q14J102J830K441K232J889K726M493N460N040M856O446R149
$$ y = [1274610, 1269546, 1262218, 1252415, 1239255, 1222312, 1201941, 1178754, 1153270, 1126019, 1097464, 1067722, 1036792, 1005211, 974026, 943904, 914670, 885981, 858127, 831826, 807533, 785216, 764630, 745559, 727943, 712002, 697975, 685621, 674264, 663495, 653412, 643935, 634452, 624595, 614867, 605856, 597147, 587718, 577289, 566655, 556727, 547898, 540372, 534456, 530245, 527397, 525467, 524278, 524020, 525184, 528198, 532737, 537521, 541347, 544249, 547116, 550215, 552730, 553871, 553808, 553266, 552813, 552785, 553344, 554086, 553933, 551967, 548279, 543772, 539259, 534940, 530545, 525729, 520436, 515085, 510250, 506059, 502125, 498178, 494555, 491807, 489968, 488398, 486363, 483724, 481077, 479182, 478135, 477287, 476102, 474847, 474074, 473741, 473367, 472938, 472934, 473496, 474310, 475412, 477242, 479683, 481915, 483804, 486530, 491023, 496483, 501523, 506379, 512825, 521974]
61943E21974J1266J2434J3577J5070J6310J7038J7895J9276K0518K0750K0029
61932G06137J9085J8227J7124J5574J3961J2625J1171Q895N882L146J426K81j296
61919H32238l566n848p386p920p455o068m105k043K6K478N484Q644J1458J3788
61905H29725J5588J6497J6189J4798J2707R985O486K428j510m759p327r519j1448
61892H89840j2932j3864j4469j5089j5741j6042j5669j4761j3785j3033j2450
61881G32005j1929j1599j1674j2087j2403j2137j1181r873q616p516o412n233
61869F11345l988k547p43J126K339K615K677L509N206O950Q127R053J0479J2681
61855F68829J5205J7445J9303K1285K3886K6968K9860L2007L3231L3456L2600
$$ y = [521974, 533240, 545674, 559251, 574321, 590631, 607669, 625564, 644840, 665358, 686108, 706137, 725222, 743449, 760573, 776147, 790108, 802733, 813904, 822799, 828681, 831827, 833253, 833534, 832238, 828672, 822824, 815438, 807518, 800063, 793995, 789890, 787847, 787873, 790351, 795835, 804479, 815937, 829725, 845313, 861810, 877999, 892797, 905504, 915489, 921975, 924403, 922893, 918134, 910807, 901288, 889840, 876908, 863044, 848575, 833486, 817745, 801703, 786034, 771273, 757488, 744455, 732005, 720076, 708477, 696803, 684716, 672313, 660176, 648995, 639122, 630506, 622990, 616578, 611345, 607357, 604810, 604067, 605193, 607532, 610147, 612824, 616333, 621539, 628489, 636616, 645669, 656148, 668829, 684034, 701479, 720782, 742067, 765953, 792921, 822781, 854788, 888019, 921475, 954075]
61844I54075L0903K8852K6479K3211J8846J4170J0023O171J808l028p278j0021
61832A094211j1128j0824r318o979m235j165K318N846Q740J0744J1977J2182J0822
61819A113191Q062M799J364k938q562j4670k0018k4234k7525k9673l0221k9453
61807I40122k8351k7526k6783k5712k4250k2566k0787j8997j7198j5287j3301
61796F99364j1592j0484r763q851p527o246n579n525n530n115m369l754l531l537
61782F07961l548l654l979m236l990l338k890k920k937k394j444p29n80q02j045
61767E69475j119r35m50K70J012J508J661J702J971K429K554J993J117O08O30
61752E84426Q24R57R87N55p48k492l503l219k334j762j612j634j929k524k856
$$ y = [954075, 984978, 1013830, 1040309, 1063520, 1082366, 1096536, 1106559, 1112730, 1114538, 1111510, 1104232, 1094211, 1083083, 1072259, 1062941, 1055962, 1051727, 1050562, 1052880, 1058726, 1067466, 1078210, 1090187, 1102369, 1113191, 1121253, 1126052, 1127416, 1124478, 1115916, 1101246, 1081228, 1056994, 1029469, 999796, 969575, 940122, 911771, 884245, 857462, 831750, 807500, 784934, 764147, 745150, 727952, 712665, 699364, 687772, 677288, 667525, 658674, 651147, 644901, 639322, 633797, 628267, 623152, 618783, 615029, 611498, 607961, 604413, 600759, 596780, 592544, 588554, 585216, 582326, 579406, 576469, 574075, 572631, 571902, 571322, 570520, 569475, 568356, 567421, 566971, 567241, 568253, 569761, 571422, 573124, 575095, 577524, 580078, 582071, 583188, 583796, 584426, 585250, 586207, 587194, 587749, 587001, 584509, 581006, 577787, 575453, 573691, 572079, 570445, 568516, 565992, 563136]
61737E63136k460j808j647j779j354k24Q18J188J143J146J332J719K362K993L070
61722E69635K467J752J506J727K054K202K003J408P32M87P03P11o9j364k413k889
61706E80652l147l622m337m890m801l934k841k494l361m759n456m989m088l775
61692E24158m227m738m592l812l052k908l366l879l964l649l256k899k474k027
61678D75315j815j872j865j605j292j082p16p3K87k01j076j308p69m40q89j426
61662D59173j254o49l14j61L22R07Q23M7m68j9J081K039K368K025J391J142J626
61645D70079K304K368J935J903K558L074K694J716R04M76J50k63p75j429k216
61630D85478k982l619m138m418m297l935l629l192k179q48j97o28j329j384r21
$$ y = [563136, 560676, 558868, 557221, 555442, 554088, 553864, 554682, 555870, 557013, 558159, 559491, 561210, 563572, 566565, 569635, 572102, 573854, 575360, 577087, 579141, 581343, 583346, 584754, 585486, 585973, 586676, 587387, 587318, 585954, 583541, 580652, 577505, 573883, 569546, 564656, 559855, 555921, 553080, 550586, 547225, 542466, 537010, 532021, 527933, 524158, 519931, 515193, 510601, 506789, 503737, 500829, 497463, 493584, 489620, 485971, 482715, 479816, 477342, 475315, 473500, 471628, 469763, 468158, 466866, 465784, 465068, 464995, 465282, 465081, 464005, 462697, 461928, 461488, 460599, 459173, 457919, 457270, 456956, 456795, 457117, 458024, 458847, 458894, 458426, 458407, 459488, 461527, 463895, 465920, 467311, 468453, 470079, 472383, 474751, 476686, 478589, 481147, 484221, 486915, 488631, 489535, 490011, 490161, 489898, 489123, 487694, 485478, 482496, 478877, 474739, 470321, 466024, 462089, 458460, 455268, 453089, 452241, 452044, 451416, 450087, 448703, 447782]
61615D47782n56m07l04m90j280k383l224l734m218m699m969n060n045m675l749
61600D02989k676k066k005k223k655l207l361k782k084k126k768l089k799k394
61586C66754k037j282j82L15l21j292j446o78J53L20j99r33j281q96o0N11M47
61569C57893J11K7K32M62P20J189J713J797J198L16k06j43J86M60P57J198J439
61552C69349R67m4o64l53L41O00M88O63J211J474J131P63J061J900K531K502K128
61535C86048K055K468K856K716K363K528L040K639O55j770k916k599k085k126
61521C95872k149j582q52o30p94p62l40K14O04O09J20o10j063j066r64r80q29
61504C84798k27N92J185J385J125K69j008j983k011j230k81M87J083J409J219
$$ y = [447782, 447226, 446819, 446515, 446025, 444745, 442362, 439138, 435404, 431186, 426487, 421518, 416458, 411413, 406738, 402989, 400313, 398247, 396242, 394019, 391364, 388157, 384796, 382014, 379930, 377804, 375036, 371947, 369148, 366754, 364717, 363435, 363253, 363568, 363247, 361955, 360509, 359831, 359984, 360304, 360105, 359172, 357891, 356995, 356935, 357446, 357893, 358004, 358031, 358263, 358725, 359445, 360634, 362347, 364144, 365342, 365658, 365452, 365309, 365495, 365955, 366712, 367910, 369349, 370316, 370272, 369608, 369255, 369596, 370196, 370684, 371347, 372558, 374032, 375163, 375926, 376987, 378887, 381418, 383920, 386048, 388103, 390571, 393427, 396143, 398506, 401034, 404074, 406713, 407368, 405598, 402682, 400083, 397998, 395872, 393723, 392141, 391289, 390659, 389865, 389103, 388763, 388977, 389581, 390190, 390310, 389700, 388637, 387571, 386607, 385627, 384798, 384571, 385163, 386348, 387733, 388858, 389127, 388119, 386136, 384125, 382895, 382614, 383101, 384184, 385593, 386812]
61489C86812N52j62m94l53L8L07J76k31l40L82J793L047L306K480J323P56R74
61472D00366J267Q55j22p54m82K08L78l02j232j491o62P33J616J368N32J88O43
61455D03109J069O85j46l74L80J444K033K105K098K101J741R10K23L94J277J969
61439D21018J965J775K106K845L332L328L154L007K740K359K096J910J502R59
61425D54096Q05J168J477J299R61R71J244J433J577J885K112J720N72r09k215
61410D68196k958k844j955j072j092j986k711k486j730j476k033k700k743k236
61396D38174j685j201n09K96N66m4r48j207o18J94O27O77O67P82J003J166J024
61379D38964M78j43k44M93J852L277M220M382L931L372L011K652K059J480J323
$$ y = [386812, 387364, 387202, 386708, 386355, 386393, 386700, 386876, 386645, 386305, 386687, 388480, 391527, 394833, 397313, 398636, 399392, 400366, 401633, 402488, 402366, 401612, 401130, 401338, 401716, 401414, 400182, 398691, 398029, 398762, 400378, 401746, 402278, 402466, 403109, 404178, 404863, 404717, 404343, 404723, 406167, 408200, 410305, 412403, 414504, 416245, 417155, 417378, 417772, 419049, 421018, 422983, 424758, 426864, 429709, 433041, 436369, 439523, 442530, 445270, 447629, 449725, 451635, 453137, 454096, 454901, 456069, 457546, 458845, 459806, 460777, 462021, 463454, 465031, 466916, 469028, 470748, 471320, 470411, 468196, 465238, 462394, 460439, 459367, 458275, 456289, 453578, 451092, 449362, 447886, 445853, 443153, 440410, 438174, 436489, 435288, 434779, 435075, 435641, 435597, 434649, 433442, 432824, 433018, 433645, 434322, 434989, 435771, 436774, 437940, 438964, 439442, 439299, 439055, 439548, 441400, 444677, 448897, 453279, 457210, 460582, 463593, 466245, 468304, 469784, 471107]
61364D71107J520J641J515J247Q84O25J095K588M201M737M439M822O520Q480R713
61349E25134J0654J1953J2986J2704J1274R703Q238O408M424L297L368L753L635
61336F27531L193K905K514J368n62k524l746m147m272m675n302n490m747l479
61322E98567k635k630k883k552j461j17J028J969K791L243L016K424K401L551
61308F06712N473P354R001J0774J2664J4107J4800J5019J4797J3442J0418O321
61296G40882K403o71l172n530p696r249r864r670r212q994q985q822q453q122
61282F44845p643o285l858j373p3k2j82K95J330K347L026L593M519N884P026P206
61266F60635O649O377O810P213O953O655P370R094J0875J2069J2668J2594J1528
$$ y = [471107, 472627, 474268, 475783, 477030, 477914, 478539, 479634, 482222, 486423, 491160, 495599, 500421, 506941, 515421, 525134, 535788, 547741, 560727, 573431, 584705, 594408, 602646, 609054, 613478, 616775, 620143, 623896, 627531, 630724, 633629, 636143, 637511, 636949, 634425, 630679, 626532, 622260, 617585, 612283, 606793, 602046, 598567, 595932, 593302, 590419, 587867, 586406, 586289, 587317, 589286, 592077, 595320, 598336, 600760, 603161, 606712, 612185, 619539, 628540, 639314, 651978, 666085, 680885, 695904, 710701, 724143, 734561, 740882, 743285, 742614, 739442, 733912, 726216, 716967, 707103, 697433, 688221, 679227, 670242, 661420, 652967, 644845, 637202, 630917, 627059, 625686, 625613, 625591, 625409, 625704, 627034, 629381, 632407, 636000, 640519, 646403, 653429, 660635, 667284, 673661, 680471, 687684, 694637, 701292, 708662, 717756, 728631, 740700, 753368, 765962, 777490]
61253G77490R462O844M102J499o92k360l777n121o080o412o601p225p947p948
61239G45234p236o569o176n444m030k463j377q66p75r44r57k98R79K267L191L873
61223G18409M294M209L750L397L223K932K787L446M620M992M108L249L597M400
61209G71413M146K846J855J780J870J564J372J872K768L575M644O720R747J2728
61195H28900J4891J6546J8538K0984K2914K3264K1986J9867J7473J4707J1448
61184A031518Q057N047K610P31n99j560k596m037n783p558r191j0456j1030j0962
61170I84191j0901j1473j2572j3659j4506j5296j6143j6855j7157j6853j5933
61159H22843j4711j3697j3055j2351j1104r406p716o264m927l501j756N00K980
$$ y = [777490, 786952, 793796, 797898, 799397, 798705, 796345, 792568, 787447, 781367, 774955, 768354, 761129, 753182, 745234, 737998, 731429, 725253, 719809, 715779, 713316, 711939, 711073, 710298, 709354, 708397, 708099, 709078, 711345, 714536, 718409, 722703, 726912, 730662, 734059, 737282, 740214, 743001, 746447, 751067, 756059, 760167, 763416, 767013, 771413, 775559, 778405, 780260, 782040, 783910, 785474, 786846, 788718, 791486, 795061, 799705, 806425, 816172, 828900, 843791, 860337, 878875, 899859, 922773, 946037, 968023, 987890, 1005363, 1020070, 1031518, 1039575, 1044622, 1047232, 1047963, 1047364, 1045804, 1043208, 1039171, 1033388, 1025830, 1016639, 1006183, 995153, 984191, 973290, 961817, 949245, 935586, 921080, 905784, 889641, 872786, 855629, 838776, 822843, 808132, 794435, 781380, 769029, 757925, 748519, 740803, 734539, 729612, 726111, 724355, 724855, 727835]
61146G27835M789N164M153K235m15l639o588q149q176p598p163o716n877m692
61132F85163l307j536P46L169N215O778Q098R460J1202J3579J6282J8498J9842
61119G93189K0921K2478K4297K5536K5947K6115K6484K6804K6692K6226K5672
61108A070361K4965K3757K1800J9141J6121J3317J1216R678P787M531k93n880
61096A216501j1061j5170j8334k1017k3420k5370k6738k7599k7893k7318k5910
61085I66671k4441k3662k3284k2267k0172j7595j5219j3113j1205r765q850p891
61073G69207o434m907l993l501k641j205K14J168J846K552L320M172N257O462
61059G71517P356P739P894Q227Q942J0153J1886J3879J5782J7562J9409K1236
$$ y = [727835, 732624, 737788, 741941, 744176, 743761, 740122, 733534, 725385, 717209, 709611, 702448, 695732, 689855, 685163, 681856, 680320, 681066, 684235, 689450, 696228, 704326, 713786, 724988, 738567, 754849, 773347, 793189, 814110, 836588, 860885, 886421, 912368, 938483, 964967, 991771, 1018463, 1044689, 1070361, 1095326, 1119083, 1140883, 1160024, 1176145, 1189462, 1200678, 1210356, 1218143, 1222674, 1222381, 1216501, 1205440, 1190270, 1171936, 1150919, 1127499, 1102129, 1075391, 1047792, 1019899, 992581, 966671, 942230, 918568, 895284, 873017, 852845, 835250, 820031, 806918, 795713, 785948, 777098, 769207, 762773, 757866, 753873, 750372, 747731, 746526, 746740, 747908, 749754, 752306, 755626, 759798, 765055, 771517, 778873, 786612, 794506, 802733, 811675, 821828, 833714, 847593, 863375, 880937, 900346, 921582]
61047I21582K2779K4147K5667K7116K7853K7911K8254K9526L1217L2458L3069
61036A231579L3303L3145L2549L2004L2171L3112L4334L5443L6389L7336L8649
61025A610014M0707M3313M5609M6951M7620M8307M9422N1295N4602N9919O7187
61014B164946P6121Q6684R8591J10978J23434J37197J54460J76806K05162K40999
61004C575378K86431L42945M10997M91268N86267P00961Q42522J018707J234213
60995I489689J485175J752133J992344K138111K113528J873154J441640R19760
60987B3205534M43370J21616l164M3543J89409L35843L77465K32901j16963o10431
60977B4219123j129329j555760j822441j925350j901201j796303j648172j481848
$$ y = [921582, 944361, 968508, 994175, 1021291, 1049144, 1077055, 1105309, 1134835, 1166052, 1198510, 1231579, 1264882, 1298027, 1330576, 1362580, 1394751, 1427863, 1462197, 1497640, 1534029, 1571365, 1610014, 1650721, 1694034, 1739643, 1786594, 1834214, 1882521, 1931943, 1983238, 2037840, 2097759, 2164946, 2241067, 2327751, 2426342, 2537320, 2660754, 2797951, 2952411, 3129217, 3334379, 3575378, 3861809, 4204754, 4615751, 5107019, 5693286, 6394247, 7236769, 8255476, 9489689, 10974864, 12726997, 14719341, 16857452, 18970980, 20844134, 22285774, 23205534, 23648904, 23770520, 23767356, 23810899, 24000308, 24336151, 24713616, 24946517, 24829554, 24219123, 23089794, 21534034, 19711593, 17786243, 15885042, 14088739, 12440567, 10958719]
60969A0958719j312430j148222r93620q51275p22958o09751n12271m30592l63751
60960D013849l09783k66520k31992k04078j80628j60388j43125j28507j15529
60951B273299j03485r2668q3508p5772o9210o4251o1289n9805n8953n8428n7995
60940A487935n6859n4489n1608m9252m7232m4622m1498l8925l7225l5451l2896
60929I97878l0048k7733k6063k4636k3011k0789j7879j5022j3258j2530j1538
60918G75371r494p310o348o524o401n005k796q87J12L83M65P37J174J458J358
60903G36293R52M96J90Q8N7k58j233k786m288n139n374n516n891o314o480o452
60887F88345o582o940p034o285m849l782m124n829p763q817q859q501q200p906
$$ y = [10958719, 9646289, 8498067, 7504447, 6653172, 5930214, 5320463, 4808192, 4377600, 4013849, 3704066, 3437546, 3205554, 3001476, 2820848, 2660460, 2517335, 2388828, 2273299, 2169814, 2077146, 1993638, 1917866, 1848656, 1784405, 1723116, 1663311, 1604358, 1545930, 1487935, 1431076, 1376587, 1324979, 1275727, 1228495, 1183873, 1142375, 1103450, 1066225, 1030774, 997878, 967830, 940097, 914034, 889398, 866387, 845598, 827719, 812697, 799439, 786909, 775371, 765877, 758567, 752219, 745695, 739294, 734289, 731493, 730606, 730718, 731101, 731566, 732303, 733477, 734935, 736293, 737245, 737741, 737931, 738019, 738076, 737818, 736585, 733799, 729511, 724372, 718998, 713482, 707591, 701277, 694797, 688345, 681763, 674823, 667789, 661504, 656655, 652873, 648749, 642920, 635157, 626340, 617481, 608980, 600780, 592874]
60873E92874p476p062o779o338n382m205l659m051m557m138k818j558r79p46k84
60858E32842M81J317K114K759K956K578K000J683J668J730J849K115K345K258
60844E60695J977J920K160K213J656O62k42p99j311k223l483m336m011k634j237
60829E51007p58j197j918k433k567k193j290k97Q8m40j552k628l163k899j985
60814E25775j040p70j304k136k743l057l272l491l801m398n274n867n479m223
60800D78920l164l196l971m304l639k592j939j677j457j414j864k502k625k109
60786D42467j423p65M3P39O00l81j142q72n1M12M58N72P19N17J31K14R27J741
60768D44906K255K641L194L845M263M188L695L186K997K827K056P84L0L58R02
$$ y = [592874, 585398, 578336, 571557, 565219, 559837, 555632, 551973, 547922, 543365, 539227, 536409, 534851, 533872, 533126, 532842, 533323, 534640, 536754, 539513, 542469, 545047, 547047, 548730, 550398, 552128, 553977, 556092, 558437, 560695, 562672, 564592, 566752, 568965, 570621, 571283, 571041, 570242, 568931, 566708, 563225, 558889, 554878, 552244, 551007, 550249, 549052, 547134, 544701, 542134, 539941, 538651, 538354, 538442, 538002, 536450, 533822, 530659, 527760, 525775, 524735, 523965, 522661, 520525, 517782, 514725, 511453, 507962, 504161, 499763, 494489, 488622, 483143, 478920, 475756, 472560, 468589, 464285, 460646, 458054, 456115, 454438, 452981, 451567, 449703, 447201, 444576, 442467, 441044, 440279, 440322, 441061, 441661, 441280, 440138, 439266, 439215, 439627, 440085, 440657, 441376, 441893, 442024, 442238, 443165, 444906, 447161, 449802, 452996, 456841, 461104, 465292, 468987, 472173, 475170, 477997, 480053, 480837, 480867, 481225, 482127]
60753D82127M97p08j603j796j897k261k434k099j635j448j398j256j134j219j571
60738D60165k361l730n196n842n413m667m338m260l868l120k420k001j790j636
60724D09523j392r66n25l64m24k60K25M85J08n09o84l73j42l35o86o88j18Q12
60706D03687J577J751J401J051J177J853K835L720M010L508K713K481K992L523
60692D38279L520L336L530L874L721L074K590K625K872L039L158L108K471J311
60678D80508N77J138K572L493L107J981J098O16n1j169k312l057l551m113m593
60663D76244m592m152l832l975m259m081l283k352j904j991k002j348j66Q55J425
60648D40587J934K666L165K798J677M37n49j244j485j202r77j535k568k894k072
$$ y = [482127, 482624, 481916, 480313, 478517, 476620, 474359, 471925, 469826, 468191, 466743, 465345, 464089, 462955, 461736, 460165, 457804, 454074, 448878, 443036, 437623, 432956, 428618, 424358, 420490, 417370, 414950, 412949, 411159, 409523, 408131, 407165, 406640, 406276, 405852, 405592, 405817, 406302, 406410, 405901, 405217, 404844, 404702, 404367, 403681, 402993, 402875, 403687, 405264, 407015, 408416, 409467, 410644, 412497, 415332, 419052, 423062, 426570, 429283, 431764, 434756, 438279, 441799, 445135, 448665, 452539, 456260, 459334, 461924, 464549, 467421, 470460, 473618, 476726, 479197, 480508, 481085, 482223, 484795, 488288, 491395, 493376, 494474, 495090, 495039, 493870, 491558, 488501, 484950, 480837, 476244, 471652, 467500, 463668, 459693, 455434, 451353, 448070, 445718, 443814, 441823, 439821, 438473, 438307, 439162, 440587, 442521, 445187, 448352, 451150, 452827, 453264, 452715, 451471, 449986, 448784, 447807, 446272, 443704, 440810, 438738]
60633D38738j100j008j476j458o93J04L33J38%K04P29J301J590J513J324J223
60617D41462J122R14P06N09R9m98p74m16P9J07j2N20J621K223J677N65k22n02
60599D49180n46l31K57Q83J040P68N93P78J135J525K012K463K542K319K352K806
60583D69776K990K270J098M54M58L12l08n70L95K306M185N610O824P873Q307P989
60567E19969P696Q489J0638J3326J5400J6284J6199J5584J4474J2564R790O544
60555F66957L273J33k785n213o886p758p805o907n177l181j456J0J574L373N322
60540F33474P357R346J1036J2553J4681J8042K2127K5719K8152K9515K9676K7997
60528H69675K4247J9126J3529P784J998l338p551j0342j1892j2540j2664j2531
$$ y = [438738, 437638, 436630, 435154, 433696, 433003, 433107, 433440, 433578, 433578, 433782, 434511, 435812, 437402, 438915, 440239, 441462, 442584, 443498, 444204, 444713, 444812, 444314, 443540, 443124, 443203, 443310, 443298, 443818, 445439, 447662, 449339, 449904, 449682, 449180, 448634, 448303, 448560, 449443, 450483, 451251, 451844, 452622, 453757, 455282, 457294, 459757, 462299, 464618, 466970, 469776, 472766, 475036, 476134, 476588, 477046, 477358, 477050, 476480, 476875, 479181, 483366, 488976, 495800, 503673, 511980, 519969, 527665, 536154, 546792, 560118, 575518, 591802, 608001, 623585, 638059, 650623, 660413, 666957, 670230, 670363, 667578, 662365, 655479, 647721, 639916, 633009, 627832, 624651, 623195, 623205, 624779, 628152, 633474, 640831, 650177, 661213, 673766, 688447, 706489, 728616, 754335, 782487, 812002, 841678, 869675, 893922, 913048, 926577, 934361, 936359, 933021, 925470, 915128, 903236, 890696, 878032, 865501]
60516H65501j2155j1392j0330r322q512p615o306m592k673o82J275L144N088P411
60502H08840J0266J3612J7485K1979K6955L2218L7947M4424N1234N7305O1955
60491A184220O5314O7412O7504O4866N9844N3462M6137L7413K6917J5148L205
60480A691442q123j8917k9840m1148n1998o0990o7372p1338p3107p2321o8776
60469A127512o3334n7504n2281m7716m3425l9101l4640l0239k6425k3613k1585
60458F87649j9619j7240j4700j2567j0987r558p992o713o412p002p423o853n681
60445E54902m830m487m189l842l733l625k828j461o35r43j576j555j127j152j688
60430E17231k000j706j177r07j003j253j289q83l24k19o22p88k04O13Q85P14P25
$$ y = [865501, 853346, 841954, 831624, 822302, 813790, 806175, 799869, 795277, 792604, 791922, 793197, 796341, 801429, 808840, 819106, 832718, 850203, 872182, 899137, 931355, 969302, 1013726, 1064960, 1122265, 1184220, 1249534, 1316946, 1384450, 1449316, 1509160, 1562622, 1608759, 1646172, 1673089, 1688237, 1691442, 1683319, 1664402, 1634562, 1593414, 1541416, 1480426, 1413054, 1341716, 1268609, 1196288, 1127512, 1064178, 1006674, 954393, 906677, 863252, 824151, 789511, 759272, 732847, 709234, 687649, 668030, 650790, 636090, 623523, 612536, 602978, 594986, 588273, 581861, 574859, 567436, 560583, 554902, 550072, 545585, 541396, 537554, 533821, 530196, 527368, 525907, 525272, 524329, 522753, 521198, 520071, 518919, 517231, 515231, 513525, 512348, 511441, 510438, 509185, 507896, 507013, 506689, 506470, 505848, 505060, 504856, 505469, 506354, 507068, 507793]
60413E07793R47Q20K29k31r2M79J053J341J181N69j82o09m98L9P85J427J603J260
60395E17914Q55Q56J241J713K188K679L011L057K997K938K623K005J714K301L263
60380E51355L548K968K288K066K105K140K243K391K326K119K240K743K985K500
60366E86017J737J473J777K012J702J044N88O68J166J735K198K683L378M326N483
60351F17987O806Q071Q861R042Q974Q958Q674P626N915M096K276qk859n493o915
60336F82011o942o248n649n444n428n364n346n610o016o014n214l860k572j788
60322F10516j615j860k093j908j372r11o54k31N94J610K781M515O880R118J0675
60307F36045J2085J4090J6362J8016J9067K0289K1711K2314K1284J8717J4986
$$ y = [507793, 508740, 509560, 509789, 509558, 509466, 509945, 510998, 512339, 513520, 514089, 513907, 513298, 512800, 512839, 513624, 515051, 516654, 517914, 518769, 519625, 520866, 522579, 524767, 527446, 530457, 533514, 536511, 539449, 542072, 544077, 545791, 548092, 551355, 554903, 557871, 560159, 562225, 564330, 566470, 568713, 571104, 573430, 575549, 577789, 580532, 583517, 586017, 587754, 589227, 591004, 593016, 594718, 595762, 596350, 597018, 598184, 599919, 602117, 604800, 608178, 612504, 617987, 624793, 632864, 641725, 650767, 659741, 668699, 677373, 684999, 690914, 695010, 697286, 697278, 694419, 688926, 682011, 675069, 668821, 663172, 657728, 652300, 646936, 641590, 635980, 629964, 623950, 618736, 614876, 612304, 610516, 608901, 607041, 604948, 603040, 601668, 600757, 600103, 599872, 600466, 602076, 604857, 609372, 616252, 625370, 636045, 648130, 662220, 678582, 696598, 715665, 735954, 757665, 779979, 801263, 819980, 834966]
60296H34966J0319N185K15m561r613j4787j8960k1230k1776k1187j9596j7010
60284G01965j3989j1401r687q714q197p965p935p967p740o941n743m847m626m544
60270E91669l923l017k593k669k596k273k242k467k167j177m28n22p66l00O39
60255E65168J264J425J433J301R30O34P44R65P81J95m66j117j678j677q92p9j61
60238E68770q10p31N34J895K117J320O53Q43J548J995J840J375J101J309K038
60223E85797L184M445N324N471N100M799M848M976M777M225L759M057N583P910
60209F54255R619R485P844O271N765N875N768N430N293N305N048M453L778L042
60195G37231K040Q03l34j108j501j744k228l210m344m947m903m893n349n760n500
$$ y = [834966, 845285, 850470, 850685, 846124, 836511, 821724, 802764, 781534, 759758, 738571, 718975, 701965, 687976, 676575, 666888, 658174, 649977, 642012, 634077, 626110, 618370, 611429, 605686, 600839, 596213, 591669, 587746, 584729, 582136, 579467, 576871, 574598, 572356, 569889, 567722, 566545, 566117, 565595, 564829, 564529, 565168, 566432, 567857, 569290, 570591, 571521, 572155, 572899, 573864, 574645, 574840, 574374, 573257, 571579, 569902, 569010, 568931, 568770, 567960, 567229, 567763, 569658, 571775, 573095, 573748, 574591, 576139, 578134, 579974, 581349, 582450, 583759, 585797, 588981, 593426, 598750, 604221, 609321, 614120, 618968, 623944, 628721, 632946, 636705, 640762, 646345, 654255, 663874, 673359, 681203, 687474, 693239, 699114, 704882, 710312, 715605, 720910, 725958, 730411, 734189, 737231, 739271, 740074, 739740, 738632, 737131, 735387, 733159, 729949, 725605, 720658, 715755, 710862, 705513, 699753, 694253]
60180F94253m860m521m393l849k970k637l205l848l623k611j625j102p34r6P07
60165F54886J134Q29M2o35q59p16l29L18J071J432J060L32K5N10J427K141K363
60148F65031K309K395K762L119L172L120L395L974M381M473M720N391O096O498
60134G20836P005Q066R145R200Q079O751O018N621M795L266J450J5n64k40N69
60119G90012J282J626J732J838K063K452K922L068K325O14j328k530k757k669
60105H00650k949l515l856m004m619n954p189p298o317n228m684m400l800k678
60091G34159j135N69J957K607K757L070L638L801L261K690K742L011K709J858
60077G67694J066L61q97k953n160o748p556p960q395r083r852j0216r873r129
$$ y = [694253, 689393, 684872, 680479, 676630, 673660, 671023, 667818, 663970, 660347, 657736, 656111, 655009, 654275, 654179, 654886, 656020, 656849, 656891, 656256, 655397, 654681, 654352, 654670, 655741, 657173, 658233, 658565, 658590, 659100, 660527, 662668, 665031, 667340, 669735, 672497, 675616, 678788, 681908, 685303, 689277, 693658, 698131, 702851, 708242, 714338, 720836, 727841, 735907, 745052, 754252, 762331, 769082, 775100, 780721, 785516, 788782, 790232, 790247, 789683, 789443, 790012, 791294, 792920, 794652, 796490, 798553, 801005, 803927, 806995, 809320, 809934, 808606, 806076, 803319, 800650, 797701, 794186, 790330, 786326, 781707, 775753, 768564, 761266, 754949, 749721, 745037, 740637, 736837, 734159, 733024, 733593, 735550, 738157, 740914, 743984, 747622, 751423, 754684, 757374, 760116, 763127, 765836, 767694, 768760, 769121, 768224, 765271, 760111, 753363, 745807, 737847, 729452, 720369, 710517, 700301, 690428, 681299]
60063F81299q515q091p462o513n673n371n469n413m781l617k325j243l09P50J917
60048F19184K760K952K718K582K875L624M602N323N278M501L647L256L134K768
60034F69204J972Q46o22k354l844m565m689m914n580o320o584o154n220m279l913
60019F12984m330n176o004o757p463p759p284o436o053o241o148n119l577k470
60005E32167k119j993j502o68M7L75N22Q09J141J196J041J213J950K762L080L031
59989E43052L126L408L461L190L055L352L645L206J910M82k42k80n15j555k802
59974E66493l149k494j856j901k129j932j609j632j569o94P72J975K824L964N447
59959E62510O402O268N499M780M202L544K760J823N92q28j959k496k565k344j798
$$ y = [681299, 672784, 664693, 657231, 650718, 645045, 639674, 634205, 628792, 624011, 620394, 618069, 616826, 616517, 617267, 619184, 621944, 624896, 627614, 630196, 633071, 636695, 641297, 646620, 651898, 656399, 660046, 663302, 666436, 669204, 671176, 672022, 671400, 669046, 665202, 660637, 655948, 651034, 645454, 639134, 632550, 626396, 621176, 616897, 612984, 608654, 603478, 597474, 590717, 583254, 575495, 568211, 561775, 555722, 549481, 543333, 538214, 534637, 532167, 530048, 528055, 526553, 525885, 525932, 526307, 526829, 527638, 528779, 529975, 531016, 532229, 534179, 536941, 540021, 543052, 546178, 549586, 553047, 556237, 559292, 562644, 566289, 569495, 571405, 571887, 571645, 571365, 570850, 569295, 566493, 563344, 560850, 558994, 557093, 554964, 553032, 551423, 549791, 548222, 547528, 548300, 550275, 553099, 557063, 562510, 568912, 575180, 580679, 585459, 589661, 593205, 595965, 597788, 598380, 597552, 595593, 593097, 590532, 588188, 586390]
59944E86390j112q52j380k380l281l840m074l885l154k095j192q02r13j186j176
59929E55068o85P5P79J486K548L971N187N658N568N653O427P634Q451Q170O791
59914F22781N005L619L000L039L448L955M387M717N004N199N134M783M325L779
59900F82175K865J433j17j135j275o49L70J263J629J545J512J817K243K513K669
59885F98858K712K457K031K036K725L528L933M260M969N721N929N775N671N168
59871G55773L489J049p44j340j642k484l477l763l260k612k401k719l195l349
59857G29325l098k860k831k532j595o17l54l62M90K255L797M596N415O884Q427
59842G46940R101Q602O996M417J527n40j284j272j061m58O69J640J667O74j074
$$ y = [586390, 585278, 584426, 583046, 580666, 577385, 573545, 569471, 565586, 562432, 560337, 559145, 558343, 557430, 556244, 555068, 554383, 554458, 555237, 556723, 559271, 563242, 568429, 574087, 579655, 585308, 591735, 599369, 607820, 615990, 622781, 627786, 631405, 634405, 637444, 640892, 644847, 649234, 653951, 658955, 664154, 669288, 674071, 678396, 682175, 685040, 686473, 686356, 685221, 683946, 683297, 683667, 684930, 686559, 688104, 689616, 691433, 693676, 696189, 698858, 701570, 704027, 706058, 708094, 710819, 714347, 718280, 722540, 727509, 733230, 739159, 744934, 750605, 755773, 759262, 760311, 759567, 758227, 756585, 754101, 750624, 746861, 743601, 740989, 738588, 735869, 732674, 729325, 726227, 723367, 720536, 718004, 716409, 715792, 715438, 715076, 715566, 717821, 721618, 726214, 731629, 738513, 746940, 756041, 764643, 771639, 776056, 777583, 777043, 775759, 774487, 773426, 772968, 773637, 775277, 776944, 777618, 776544]
59827G76544l390n720p104p329p396q133q951q788p682o520n764n225m811m598
59813F85133m439m184m066m229m222l611k753k314k285k212k031j919j660j005
59799F44203l90m57r20q95k63J58q5n33p32r59j553k225k467k300k161k275k444
59782F23702k376k052j789j926k398k693k423j781j200p84l51J17M66P46J203
59767F06461J820K215K104J741J795K781M545O291P244P371P236P182P090P011
59753F72887P363Q264R116R390R358R573R978J0094R841R482Q909P693N834L941
59739G91723K594J862J457R52q5j738l474m512m572m047l559l502l833m003l399
59724G61864k225j594k245l472l903l206k307k002k175k483k973l622l874l230
$$ y = [776544, 773154, 767434, 760330, 753001, 745605, 737472, 728521, 719733, 712051, 705531, 699767, 694542, 689731, 685133, 680694, 676510, 672444, 668215, 663993, 660382, 657629, 655315, 653030, 650818, 648787, 646868, 645208, 644203, 643813, 643356, 642436, 641541, 641278, 641436, 641351, 640818, 640086, 639127, 637574, 635349, 632882, 630582, 628421, 626146, 623702, 621326, 619274, 617485, 615559, 613161, 610468, 608045, 606264, 605064, 604280, 603929, 604046, 604512, 605258, 606461, 608281, 610496, 612600, 614341, 616136, 618917, 623462, 629753, 636997, 644368, 651604, 658786, 665876, 672887, 680250, 688514, 697630, 707020, 716378, 725951, 735929, 746023, 755864, 765346, 774255, 781948, 787782, 791723, 794317, 796179, 797636, 798588, 798503, 796765, 793291, 788779, 784207, 780160, 776601, 773099, 769266, 765263, 761864, 759639, 758045, 755800, 752328, 748425, 745219, 742912, 740910, 738735, 736252, 733279, 729657, 725783, 722553]
59710G22553k060j315j483k044k037r95O24J872K200J896J636J717J890J859J713
59695G28026J822K417L249L667L144J843N13k65n60q07j260j851k326k421k114
59680G33077j844k117k814l246l161l194m016n408o574p028o796o102n271m648
59666F70858m202l494k439j638j524j658j416r26o20k70O44J885K652K697K492
59651F63041K366K280K332K620K632J716J90q91j264j768k923m154m789n001n190
59636F51197n181m632l674k646j610o50j88m79j140j620j860k145k612l303m236
59621F15221n030m867l446j673q48j294k202k714k708k517k417k381k130j356
59607E79638j36R84J552J768K194K918L337K887J789R09Q12J165J208Q18P40J512
$$ y = [722553, 720493, 719178, 717695, 715651, 713614, 712619, 713243, 715115, 717315, 719211, 720847, 722564, 724454, 726313, 728026, 729848, 732265, 735514, 739181, 742325, 744168, 744681, 744416, 743856, 743049, 741789, 739938, 737612, 735191, 733077, 731233, 729116, 726302, 723056, 719895, 716701, 712685, 707277, 700703, 693675, 686879, 680777, 675506, 670858, 666656, 663162, 660723, 659085, 657561, 655903, 654487, 653561, 652941, 652671, 653315, 655200, 657852, 660549, 663041, 665407, 667687, 670019, 672639, 675271, 676987, 677177, 676286, 675022, 673254, 670331, 666177, 661388, 656387, 651197, 646016, 641384, 637710, 635064, 633454, 632804, 632616, 632137, 630997, 629377, 627517, 625372, 622760, 619457, 615221, 610191, 605324, 601878, 600205, 599357, 598063, 595861, 593147, 590439, 587922, 585505, 583124, 580994, 579638, 579502, 580486, 582038, 583806, 586000, 588918, 592255, 595142, 596931, 597840, 598652, 599817, 601025, 601843, 602583, 604095]
59591F04095K514K627J727P84M40K13n33j523k068k110k136k289k272k022j802
59576E95645j646j285p65n69q70j142q23p1M65M83K84K91N45P63O91L70Q2M6J80
59557E92674K28J28J24M04P51P18J30p33j429j649j205k3J645L231M350N269O575
59540F11188Q450J0563J2767J5386J8413K0684K0415J6769J0715M281r13m313
59528G44405n984o004m505k060M02K225L327L769L301J765k31j637k113k443l558
59513G30659n394p031p782p875q082q818r624r621q559p167o225n564m614l629
59499F30674l476m098m220l087j560p96o61l16K86O24Q38J483K216K041J022N01
59483F21471J192K191K412K165K541L837N383O519P057P042O703O502O640O622
$$ y = [604095, 606609, 609236, 610963, 611747, 612187, 612400, 611867, 610344, 608276, 606166, 604030, 601741, 599469, 597447, 595645, 593999, 592714, 591949, 591380, 590510, 589368, 588545, 588474, 588939, 589422, 589706, 589997, 590542, 591305, 591996, 592366, 592448, 592494, 592674, 592902, 593030, 593154, 593558, 594309, 595027, 595157, 594424, 592995, 591346, 590141, 590118, 591763, 594994, 599344, 604613, 611188, 619638, 630201, 642968, 658354, 676767, 697451, 717866, 734635, 745350, 749631, 748718, 744405, 738421, 732417, 727912, 725852, 726254, 728479, 731806, 735575, 738876, 740641, 740410, 738773, 736660, 734217, 730659, 725265, 718234, 710452, 702577, 694495, 685677, 676053, 666432, 657873, 650706, 644481, 638917, 634303, 630674, 627198, 623100, 618880, 615793, 614233, 613437, 612776, 612460, 612746, 613370, 614208, 615691, 617907, 619948, 620970, 621471, 622663, 624854, 627266, 629431, 631972, 635809, 641192, 647711, 654768, 661810, 668513, 675015, 681655, 688277]
59469F88277N814M352L036K316J853J192M29k8k6K97R24K020L600N327O827Q050
59453G34260R146J0139J0894J1348J1495J1140J0028Q255O239M132J616j457m584
59440H22651p108q867j0004j0431r971q852p591o436n385m649m484m527l874k101
59426G28371J82K042L283M547O518R244J2198J4842J7043J8975K0745K2380K4047
59413H84417K5988K7948K8903K7486K2701J4495M203n612j2528j5878j6613j5486
59401I70024j2197o689k77N219Q694R309N987j204r681j6041j9119k0182k0360
59388H93483j9450j7362j5006j3032j0981q475o233n054m617m097l273k359j398
59375G82146n36k90q51j515j489q33r6M43O90M54nK56J778L735M877N106N325
$$ y = [688277, 694091, 698443, 701479, 703795, 705648, 706840, 707269, 707241, 707215, 707512, 708436, 710456, 714056, 719383, 726210, 734260, 743406, 753545, 764439, 775787, 787282, 798422, 808450, 816705, 822944, 827076, 828692, 827235, 822651, 815543, 806676, 796672, 786241, 776270, 767418, 759827, 753391, 748006, 743357, 738873, 734346, 730472, 728371, 728553, 730595, 733878, 738425, 744943, 754187, 766385, 781227, 798270, 817245, 837990, 860370, 884417, 910405, 938353, 967256, 994742, 1017443, 1031938, 1036141, 1030529, 1018001, 1002123, 985510, 970024, 957827, 951138, 950861, 956080, 964774, 974083, 980070, 978866, 969185, 953144, 934025, 913843, 893483, 874033, 856671, 841665, 828633, 817652, 809177, 802944, 797890, 793273, 789176, 785903, 783544, 782146, 781610, 781320, 780469, 778954, 777465, 776632, 776536, 776979, 777669, 778123, 778118, 778374, 780152, 783887, 788764, 793870, 799195]
59358G99195O008O838P612Q626R971J1271J2300J3353J4676J6067J7220J8154
59346I41291J8971J9523J9541J8987J8012J6648J4732J2150R050N705K226j402
59334A095434m965p981j0270j2322j4738j7436j9702k0994k1247k0566j9218j7875
59322I08120j7185j6895j6007j4130j2084j0835j0315r752q780p766p223p335
59310G69813p804p963p287n952m684l820k912j470K78J742K764L702M939O664
59296G48010Q850J1140J2758J2887J1142P725L304j337n699r577j2516j3656j2670
59283G60361j0568q708p158m955j973O90K467M203O645R175J0960J2413J4379
59270G87931J6550J7763J7570J6471J4978J3347J1962J0936R530O964L751J207
$$ y = [799195, 805203, 812041, 819653, 828279, 838250, 849521, 861821, 875174, 889850, 905917, 923137, 941291, 960262, 979785, 999326, 1018313, 1036325, 1052973, 1067705, 1079855, 1088905, 1094610, 1096836, 1095434, 1090469, 1082488, 1072218, 1059896, 1045158, 1027722, 1008020, 987026, 965779, 945213, 925995, 908120, 890935, 874040, 858033, 843903, 831819, 820984, 810669, 800917, 792137, 784371, 777148, 769813, 762009, 754046, 746759, 740807, 736123, 732303, 729391, 727921, 728199, 729941, 732705, 736407, 741346, 748010, 756860, 768000, 780758, 793645, 804787, 812512, 815816, 814479, 808780, 799203, 786687, 773031, 760361, 749793, 741085, 733927, 728972, 726999, 727689, 730156, 734359, 741004, 750179, 761139, 773552, 787931, 804481, 822244, 839814, 856285, 871263, 884610, 896572, 907508, 917038, 924002, 927753, 928960]
59258I28960l37j871m095o424p969q709r181r566r601r088q083o740n206l626
59244H38464k083o44N62J542K639M284O371Q057Q402P307N747M891M819M369K590
59229H97317O7j785k675l733n690p743q884r509j0716j2556j3948j4210j3673
59216G92262j2781j1522r903q356p300o699o251n710m909l846k861k432k605k817
59202G04270k385j214O0O91O19N63J058J694J785J565J975L158M098M091L694
59187G25722L642L702L334K833K883L481M177M905N666N768M509K489J252J570
59173G75933K834M047M629M337L409K814L441M852N628N213M521M354M103K640
59159H32755J5k555m132m966n923p429r193j0801j2174j3228j3428j2246j0159
$$ y = [928960, 928623, 926752, 922657, 916233, 908264, 899555, 890374, 880808, 871207, 862119, 854036, 847296, 842090, 838464, 836381, 835737, 836299, 837841, 840480, 844764, 851135, 859192, 867594, 874901, 880648, 885539, 890358, 894727, 897317, 897384, 895599, 892924, 889191, 883501, 875758, 866874, 857365, 846649, 834093, 820145, 805935, 792262, 779481, 767959, 758056, 749700, 742400, 735701, 729450, 723740, 718831, 714985, 712124, 709692, 707087, 704270, 701885, 700671, 700731, 701422, 702041, 702604, 703662, 705356, 707141, 708706, 710681, 713839, 717937, 722028, 725722, 729364, 733066, 736400, 739233, 742116, 745597, 749774, 754679, 760345, 766113, 770622, 773111, 774363, 775933, 778767, 782814, 787443, 791780, 795189, 798003, 801444, 806296, 811924, 817137, 821658, 826012, 830115, 832755, 832770, 830215, 826083, 821117, 815194, 807765, 798572, 787771, 775597, 762369, 748941, 736695, 726536]
59146G26536q479p889p751p221o456o093o139o124n904n562m908l858k958k737
59132F44457k796k317j252j36R30K137L131L430L536M454O076P250P612Q095R299
59117F93906J0544J1085J1266J1765J2507J2978J3033J2770J2143J1216J0386
59106H23599R888R412Q515P095N241L123J159k68j440k977m737n753n648n262
59092H41947n385n599n064l800k502j561r98r94j741k862l712m152m590n305o180
59077G87502o955p341p021o049n142n077n785o436o477o109n678n115m311l592
59063G06414l319l217k651j729j424k259l367l481k596j827j732j679j117m60
59049F75556k64k70mK64L4m85p25p53j081j651j866j512r74n94m08l53j50P76
$$ y = [726536, 718057, 710168, 702417, 695196, 688740, 682647, 676508, 670384, 664480, 658918, 654010, 650152, 647194, 644457, 641661, 639344, 638092, 637956, 638886, 641023, 644154, 647584, 651120, 655574, 661650, 668900, 676512, 684607, 693906, 704450, 715535, 726801, 738566, 751073, 764051, 777084, 789854, 801997, 813213, 823599, 833487, 842899, 851414, 858509, 863750, 866873, 868032, 867764, 866324, 863347, 858610, 852857, 847209, 841947, 836562, 830963, 825899, 822099, 819597, 818036, 817038, 816044, 814303, 811441, 807729, 803577, 798987, 793682, 787502, 780547, 773206, 766185, 760136, 754994, 749917, 744132, 737696, 731219, 725110, 719432, 714317, 710006, 706414, 703095, 699878, 697227, 695498, 694074, 691815, 688448, 684967, 682371, 680544, 678812, 677133, 676016, 675556, 675292, 675022, 675018, 675282, 675316, 674831, 674106, 673353, 672272, 670621, 668755, 667243, 666269, 665675, 665267, 664914, 664764, 665540]
59031F65540K560M345N172N300N862P386R342J1019J2101J2593J2885J3662J4851
59018G82618J5095J3165R620O049L074L12k114l593m432n579o804o792n360l882
59004G91377l058j974r1J571K224K770M200N847O534O352O031N487M419L521L623
58989H38833M065L387J377q05k285l173l719l816l447k803j927q00M31J782L590
58974H30690N740P288P603P417P877Q961R782J0110J0549J1350J2079J2472J2733
58961I54651J2911J2718J2008J0721Q482N045J128k090m445o958j0260j3559j5572
58948I64780j5996j5711j5783j6547j7406j7409j6129j4050j1931j0017q158o461
58936G99182n288m593l778k452r72n7N1j59q0K16m8j352l000l758l393k962l307
$$ y = [665540, 668100, 672445, 677617, 682917, 688779, 696165, 705507, 716526, 728627, 741220, 754105, 767767, 782618, 797713, 810878, 820498, 826547, 829621, 829933, 827819, 824226, 819794, 814215, 807411, 800619, 795259, 791377, 788319, 786345, 786254, 787825, 790049, 792819, 797019, 802866, 809400, 815752, 821783, 827270, 831689, 835210, 838833, 842898, 846285, 847662, 846857, 844572, 841399, 837680, 833864, 830417, 827614, 825687, 824887, 825318, 827100, 830690, 836430, 843718, 851321, 858738, 866615, 875576, 885358, 895468, 906017, 917367, 929446, 941918, 954651, 967562, 980280, 992288, 1003009, 1011491, 1016536, 1017664, 1015574, 1011129, 1004171, 993911, 980352, 964780, 948784, 933073, 917290, 900743, 883337, 865928, 849799, 835749, 823818, 813801, 805643, 799182, 793894, 789301, 785523, 783071, 782099, 782042, 782093, 781934, 781854, 782070, 782022, 780670, 777670, 773912, 770519, 767557, 764250]
58919G64250l881l598k396j251q40q82p78l91L7L49O87J350K509M031N665P323
58903G72184Q983J0476J1644J2749J4135J5496J6038J5587J4924J4690J4694J4681
58891I36281J5151J6684J8914K0945K2457K3704K4554K4324K2634J9861J6592
58880A162101J3016R063M878R06k479n383q300j1474j4442j6487j7434j7655j7329
58867A078981j6231j4363j2275j0666r966j0234j0958j1050r849q173p638q752
58855I48826j0433j1494j1697j1159r870q256p210o928o593n827n493o369p900
58842H39597r115r944j0778j1500j1883j2217j2595j2304j0803q741p036n657
58830G17024m298l450l584l909l269j876p47O2J228K491K827K319K303L346M403
$$ y = [764250, 760369, 756771, 754375, 753124, 752284, 751402, 750624, 750233, 750270, 750619, 751306, 752656, 755165, 759196, 764861, 772184, 781167, 791643, 803287, 816036, 830171, 845667, 861705, 877292, 892216, 906906, 921600, 936281, 951432, 968116, 987030, 1007975, 1030432, 1054136, 1078690, 1103014, 1125648, 1145509, 1162101, 1175117, 1184180, 1189058, 1189964, 1187485, 1182102, 1173802, 1162328, 1147886, 1131399, 1113965, 1096310, 1078981, 1062750, 1048387, 1036112, 1025446, 1015480, 1005246, 994288, 983238, 973389, 965216, 957578, 948826, 938393, 926899, 915202, 904043, 894173, 885917, 878707, 871779, 865186, 859359, 853866, 847497, 839597, 830482, 820538, 809760, 798260, 786377, 774160, 761565, 749261, 738458, 729717, 722681, 717024, 712726, 709276, 705692, 701783, 698514, 696638, 695891, 695953, 697181, 699672, 702499, 704818, 707121, 710467, 714870]
58815G14870M432L723L120K853K676K441K069J444O40r9p59j487k244k953l807
58800G26919m785n124m141k478j635k251l620m844n569n529m502k976j948j653
58786F75864j241n6J475K643L425M180M905N340N431N293M893M171L293K530J935
58771G24081J234M8j714l620m986n561n722n844n780n248m374l513k785k089j265
58756F72862n2J678L348L928L169K008J330J006O83O71J257J972K428L193M793
58741G04274O515P398P792Q577R351Q932P527O758P438Q672R393R531R340Q754
58727H20252P895P277P089O893O302N388M419L848M317N854P281P474O949P066
58713I08304P832P871O542M651K825O59k048m516o190p625r512j1689j3738j5746
$$ y = [714870, 719302, 723025, 726145, 728998, 731674, 734115, 736184, 737628, 738268, 738169, 737410, 735923, 733679, 730726, 726919, 722134, 717010, 712869, 710391, 708756, 706505, 702885, 698041, 692472, 686943, 682441, 679465, 677517, 675864, 674623, 674567, 676042, 678685, 682110, 686290, 691195, 696535, 701966, 707259, 712152, 716323, 719616, 722146, 724081, 725315, 725363, 723649, 720029, 715043, 709482, 703760, 697916, 692136, 686888, 682514, 679001, 676216, 674127, 672862, 672810, 674488, 677836, 681764, 684933, 686941, 688271, 689277, 689960, 690631, 691888, 693860, 696288, 699481, 704274, 710789, 718187, 725979, 734556, 743907, 752839, 760366, 767124, 774562, 783234, 792627, 802158, 811498, 820252, 828147, 835424, 842513, 849406, 855708, 861096, 865515, 869363, 873680, 879534, 886815, 894289, 901238, 908304, 916136, 924007, 930549, 935200, 938025, 938684, 936636, 932120, 925930, 918305, 908793, 897104, 883366, 867620]
58699H67620j7823j9595k0661k1046k0879k0178j9184j8181j6853j4654j1932
58688F66634r761q407p064n412m317m419n059n244m838m169l240k106j289j081
58674F00228r46k13J053K366L541M669N848P256R077J1051J2625J3705J4689J5541
58660G00490J5448J3689J0269N615L84m279p191q293q677r185r639r704r589r446
58646F69892q893p658o049m424k796j326m93k89P9J171K571L499L668L197K246
58631F54395J101Q2q23j776k489k494k014j736j690j254m29Lj37P1J296L087M772
58614F49965O258P427P752P113O256N759N328M523L475K342R14o94j719j705j146
58599G01848p60p62j105j649j839j147j07J51k54J88K159M492O033P233Q884J0495
$$ y = [867620, 849797, 830202, 809541, 788495, 767616, 747438, 728254, 710073, 693220, 678566, 666634, 656873, 648466, 641402, 635990, 631673, 627254, 622195, 616951, 612113, 607944, 604704, 602598, 601309, 600228, 599282, 599069, 600122, 602488, 606029, 610698, 616546, 623802, 632879, 643930, 656555, 670260, 684949, 700490, 715938, 729627, 739896, 745511, 745895, 741616, 734425, 726132, 717455, 708270, 698631, 688927, 679338, 669892, 660999, 653341, 647292, 642868, 640072, 638746, 638253, 637964, 638043, 639214, 641785, 645284, 648952, 652149, 654395, 655496, 655578, 654755, 652979, 650490, 647996, 645982, 644246, 642556, 641302, 640873, 640876, 640739, 640810, 642106, 645193, 649965, 656223, 663650, 671402, 678515, 684771, 690530, 695858, 700381, 703856, 706198, 707112, 706418, 704699, 702994, 701848, 701088, 700326, 699221, 697572, 695733, 694586, 694479, 694630, 694376, 694564, 696723, 701215, 707248, 714481, 723365, 733860]
58583G33860J1197J1277J1568J1941J1675J0796R924R121P980O641N777N624N769
58570H53150N927O375P678J0192J3700J7405K0671K3757K7230L0672L2801L3016
58558A082574L1884K9886K6672K1978J6326J0373M477p54m493o695q162r269r618
58545A185179r307r220r683j0154j0741j2533j5684j8702k0505k1735k3035k3578
58533A000302k2573k0802j9249j7456j4745j1879r960q604o844m953l767l000
58521H56470j895q32o69r97p82k65n64j669k451k553k698l179l479l487l764m327
58505H22859m395l609k579j937j680j682k129l120m182m472l462j597k06j99p89
58490G86821l31J437L035L490L673M723O343P713Q968J0685J2717J4644J6618
$$ y = [733860, 745057, 756334, 767902, 779843, 791518, 802314, 812238, 821359, 829339, 835980, 841757, 847381, 853150, 859077, 865452, 873130, 883322, 897022, 914427, 935098, 958855, 986085, 1016757, 1049558, 1082574, 1114458, 1144344, 1171016, 1192994, 1209320, 1219693, 1224170, 1223416, 1218923, 1212228, 1204066, 1194797, 1185179, 1175872, 1166652, 1156969, 1146815, 1136074, 1123541, 1107857, 1089155, 1068650, 1046915, 1023880, 1000302, 977729, 956927, 937678, 920222, 905477, 893598, 883638, 875034, 868190, 863237, 859470, 856470, 854575, 853743, 853074, 852077, 851295, 851030, 850466, 848797, 846346, 843793, 841095, 837916, 834437, 830950, 827186, 822859, 818464, 814855, 812276, 810339, 808659, 806977, 804848, 801728, 797546, 793074, 789612, 788015, 787809, 787610, 786821, 786490, 787927, 790962, 794452, 798125, 802848, 809191, 816904, 825872, 836557, 849274, 863918, 880536]
58477H80536J8655J9869J9441J7710J5327J2049P479K286k396o204r259j1285
58465I64208j1973j1587j0448q533o249m548l405j477J733M764O392P602R776
58452I36255J2189J3073J2149J0284P575L713m72l702o049q302j0057j0196q899
58439I47561p494o526n470m097k695j205N44K057K811L243M044N024N833O998
58425I50628Q902J0531J0653R563Q350P195N759M260K739K54l506o913q382q668
58411I91365r356j0188j0030r388r576j0144r520p699o063n002l910k985k791
58398H94713k501r13J249K341K655L789N558O108N007L743L141K645K201K519
58384I32255L314L507L232L551M234M037L161L118M084M742M772N229O226O593
$$ y = [880536, 899191, 919060, 938501, 956211, 971538, 983587, 991066, 993352, 990956, 984752, 975493, 964208, 952235, 940648, 930200, 921667, 915418, 910870, 907465, 905988, 907721, 912485, 918877, 926479, 936255, 948444, 961517, 973666, 983950, 991525, 995238, 994766, 991064, 985015, 976713, 966656, 956460, 947561, 940067, 933541, 928071, 923974, 921279, 920074, 920618, 922675, 925486, 928729, 932773, 937797, 943630, 950628, 959530, 970061, 980714, 990277, 998627, 1005822, 1011581, 1015841, 1018580, 1018834, 1015328, 1008415, 1000033, 991365, 982009, 971821, 961791, 952403, 942827, 932683, 923163, 915464, 909401, 904399, 900489, 897504, 894713, 892212, 891299, 892548, 894889, 897544, 901333, 906891, 912999, 918006, 921749, 924890, 927535, 929736, 932255, 935569, 939076, 942308, 945859, 950093, 954130, 957291, 960409, 964493, 969235, 974007, 979236, 985462, 992055]
58370I92055O066N741O149O852P955R869J1697J2034J1409J1659J2986J3913J3953
58357A122338J3864J3316J1045P479M660L296K320J381J220J511J098N18J550
58344A185596M033N890O547P480R110J0148J0456J1519J3549J5059J5829J7242
58332A312458J9077J9206J7263J5488J4934J3952J1504Q915P095N070K540J098
58320A448600J470K215K422L083M625N718N835O331P799Q878Q934R339J0887J2413
58306A538549J3120J3805J4821J5328J5471J6563J8340J8823J7796J7416J8448
58295A718480J9049J8317J7916J8926K0177K0873K1820K2949K2908K2099K2809
58284A946323K5150K6448K5859K5802K7487K8901K8911K9498L1950L4516L5904
$$ y = [992055, 998121, 1003862, 1010011, 1016863, 1024818, 1034687, 1046384, 1058418, 1069827, 1081486, 1094472, 1108385, 1122338, 1136202, 1149518, 1160563, 1168042, 1172702, 1175998, 1178318, 1179699, 1180919, 1182430, 1183528, 1184046, 1185596, 1189629, 1195519, 1202066, 1209546, 1218656, 1228804, 1239260, 1250779, 1264328, 1279387, 1295216, 1312458, 1331535, 1350741, 1368004, 1383492, 1398426, 1412378, 1423882, 1432797, 1439892, 1444962, 1447502, 1448600, 1450070, 1452285, 1454707, 1457790, 1462415, 1468133, 1473968, 1480299, 1488098, 1496976, 1505910, 1515249, 1526136, 1538549, 1551669, 1565474, 1580295, 1595623, 1611094, 1627657, 1645997, 1664820, 1682616, 1700032, 1718480, 1737529, 1755846, 1773762, 1792688, 1812865, 1833738, 1855558, 1878507, 1901415, 1923514, 1946323, 1971473, 1997921, 2023780, 2049582, 2077069, 2105970, 2134881, 2164379, 2196329, 2230845, 2266749]
58273B266749L7492M0105M2093M2624M3506M5825M8122M9633N1830N5045N7295
58262B780319N8069N9486O2170O3947O4126O4703O5830O4917O2026O1050O3407
58251C470050O5686O5904O6798P0351P4454P7782Q2581Q9606R5757R9802J04966
58240D363737J12760J20016J25215J31670J41015J49867J56645J65141J77284
58231E643350J89179J98617K09541K24452K39597K52733K68169K88784L10600
58222G825022L30973L54311L83615M14538M44385M78587N21358N68538O17087
58213A1938414O72624P39731Q14341Q94234R87255J100293J230786J378752J555989
58204B1312419J773225K030981K334915K707009L169447L733106M416408N257547
$$ y = [2266749, 2304241, 2344346, 2386439, 2429063, 2472569, 2518394, 2566516, 2616149, 2667979, 2723024, 2780319, 2838388, 2897874, 2960044, 3023991, 3088117, 3152820, 3218650, 3283567, 3345593, 3406643, 3470050, 3535736, 3601640, 3668438, 3738789, 3813243, 3891025, 3973606, 4063212, 4158969, 4258771, 4363737, 4476497, 4596513, 4721728, 4853398, 4994413, 5144280, 5300925, 5466066, 5643350, 5832529, 6031146, 6240687, 6465139, 6704736, 6957469, 7225638, 7514422, 7825022, 8155995, 8510306, 8893921, 9308459, 9752844, 10231431, 10752789, 11321327, 11938414, 12611038, 13350769, 14165110, 15059344, 16046599, 17146892, 18377678, 19756430, 21312419, 23085644, 25116625, 27451540, 30158549, 33327996, 37061102, 41477510, 46735057]
58196D6735057O290272P528166Q998124J0774732J2961785J5663278J8991008
58189A27942422K3037039K7726244L2626287L6871574L9235479L8326519L3009015
58182C58774579K3093503R903590l939994j5655746k3594430k7718850k9071235
58175B91791417k8870713k7938381k6617435k4963101k2966901k0695665j8302164
58168A21437057j5947878j3741220j1742195r985821q479091p197503o108783
58161D8234566n193456m434572l804203l274693k832058k466715k161825j901905
58153B2165139j682982j503535j353933j224104j113150j021926r43674q70607
58145A2451228q02703p41902o84515o27152n73544n27711m86263m44650m05289
$$ y = [46735057, 53025329, 60553495, 69551619, 80326351, 93288136, 108951414, 127942422, 150979461, 178705705, 211331992, 248203566, 287439045, 325765564, 358774579, 381868082, 391771672, 387831678, 372175932, 348581502, 320862652, 291791417, 262920704, 234982323, 208364888, 183401787, 160434886, 139739221, 121437057, 105489179, 91747959, 80005764, 70019943, 61540852, 54343349, 48234566, 43041110, 38606538, 34802335, 31527642, 28695584, 26228869, 24067044, 22165139, 20482157, 18978622, 17624689, 16400585, 15287435, 14265509, 13321835, 12451228, 11648525, 10906623, 10222108, 9594956, 9021412, 8493701, 8007438, 7562788, 7157499]
58136G157499l72495l44967l20030k99870k86524k75639k62007k46930k33957
58127D515080k21717k07323j92631j80782j70184j57876j45436j35782j27519
58118B975830j17940j08528j01940r6533q9246q1241p5503p1384o6520o1758n9224
58107B046013n7763n4958n1707n0286m9872m8305m6301m5701m5404m3183l9818
58096A512715l7497l5785l3001k9946k8412k7514k5208k2079k0143j9224j7761
58085A216145j5927j4798j3902j2525j2011j3730j6256j7444j7726j8562j9402
58074A043862j9077j8498j8955j9329j8017j6049j5353j5432j4693j3470j2793
58063H62196j1764r217o531n736o164n925n325n830o958p289p342q398r671r583
$$ y = [7157499, 6785004, 6440037, 6120007, 5820137, 5533613, 5257974, 4995967, 4749037, 4515080, 4293363, 4086040, 3893409, 3712627, 3542443, 3384567, 3239131, 3103349, 2975830, 2857890, 2749362, 2647422, 2550889, 2461643, 2380402, 2304899, 2233515, 2166995, 2105237, 2046013, 1988250, 1933292, 1881585, 1831299, 1781427, 1733122, 1686821, 1641120, 1595716, 1552533, 1512715, 1475218, 1439433, 1406432, 1376486, 1348074, 1320560, 1295352, 1273273, 1253130, 1233906, 1216145, 1200218, 1185420, 1171518, 1158993, 1146982, 1133252, 1116996, 1099552, 1081826, 1063264, 1043862, 1024785, 1006287, 987332, 968003, 949986, 933937, 918584, 903152, 888459, 874989, 862196, 850432, 841215, 834684, 828948, 822784, 816859, 811534, 805704, 798746, 791457, 784115, 775717, 766046, 756463]
58049G56463q732q625q662p333n402m770n181n062m724n609p120p326o297n807
58035F65813o167o087n338m894m824m476m283n095o283o749p049q142r068q315
58021E79043o669n971n978n195m009m051m956m844l579k728k523j760n40k65q33
58006E25142o03O87J535J317R59Q44M08p1M41J703K404K373K581L039K879K395
57990E48033K694L420L085J652M64k72j578l240l754k985k499k950l386l453l947
57975E31284m760m564l157k006j870j870j449j280j610j566p41J87Q91J750K449
57960E11688K037Q46M68J288J812J001l80j382k194l127l789l880l574k783j310
57945D96721J23M58J46P30K502M189N210O390Q011R157R540J0205J1646J2876
$$ y = [756463, 747731, 739106, 730444, 723111, 717709, 712939, 707758, 702696, 697972, 692363, 685243, 677917, 671620, 665813, 659646, 653559, 648221, 643327, 638503, 634027, 629744, 624649, 618366, 611617, 604568, 596426, 587358, 579043, 572374, 566403, 560425, 555230, 551221, 547170, 542214, 537370, 533791, 531063, 528540, 526780, 526240, 525975, 525142, 524539, 525226, 526761, 528078, 529037, 529881, 530289, 530218, 530659, 532362, 534766, 537139, 539720, 542759, 545638, 548033, 550727, 554147, 557232, 558884, 559348, 559076, 557498, 554258, 550504, 547519, 545020, 542070, 538684, 535231, 531284, 526524, 521960, 518803, 516797, 514927, 513057, 511608, 510328, 508718, 507152, 506411, 506598, 507489, 509239, 511688, 513725, 514571, 515039, 516327, 518139, 519140, 518760, 517378, 515184, 512057, 508268, 504388, 500814, 498031, 496721, 496844, 497302, 497448, 498178, 500680, 504869, 510079, 516469, 524480, 533637, 543177, 553382, 565028, 577904]
57931E77904J3106J2835J2516J1628R746P226M230M95l422o191p561q702j0121
57918F13689j0868j0491j0029j0163r955q581o845n767m832k998m71J673L018
57905E37380L868M395M524M322L863L181K569K395K371J848R36N13Q63J328J510
57890E75866J783K304K595K426K114J659O60o83j553j811k194k923l344l248l328
57875E70323l941m570m910n283n650n448m718m140l560j989M71K227K433K200
57861E33445K768L841M658N433O697Q183R342J0117J0472J0098R194Q537Q163
57848F30948P071M974L130K555K583K060Q47p37k812n166o613o382n386n022n405
57833F16645n758n841n833n460m328k794j635j131j096j352j558j215l94J51J11
$$ y = [577904, 591010, 603845, 616361, 627989, 637735, 644961, 649191, 649686, 646264, 640073, 632512, 623810, 613689, 602821, 592330, 582301, 572138, 562183, 553602, 546757, 540990, 536158, 533160, 532689, 534362, 537380, 541248, 545643, 550167, 554489, 558352, 561533, 564102, 566497, 568868, 570716, 571652, 572165, 573028, 574356, 575866, 577649, 579953, 582548, 584974, 587088, 588747, 589407, 588724, 587171, 585360, 583166, 580243, 576899, 573651, 570323, 566382, 561812, 556902, 551619, 545969, 540521, 535803, 531663, 528103, 526114, 526585, 528812, 531245, 533445, 536213, 540054, 544712, 550145, 556842, 565025, 574367, 584484, 594956, 605054, 614248, 622785, 630948, 638019, 642993, 646123, 648678, 651261, 653321, 654168, 653431, 650619, 645453, 638840, 632458, 627072, 622050, 616645, 610887, 605046, 599213, 593753, 589425, 586631, 584996, 583865, 582769, 581417, 579859, 578644, 578250, 578401, 578512]
57818E78512J43O41R63N06k64p24j082j609j760j239j122k675n420p558q019p208
57802E42085o002n005m527m423m022k916j630r44q09n47R6P54J126J349J750K568
57786E18903L751M876N550N970O601P285P384P013P182Q348R707J0400J0628J0957
57772F24555J1282J1151J0398Q900O454L497J186Q6n52j612k940m011m895n828
57758F57671o507o668o675o749o341n109l852l449l493k937j698n97q8M8k7l70
57742F03159q64j292j600j624j036o1L60k05q70n96L98J215J733K510L557M149
57726F08933L859L058K464K585L398M199M167L436L033L402L639K723Q94q46j892
57711F47052k156j777j409j993l487m476l975k798k340k693l007l004k928k602
$$ y = [578512, 578655, 579296, 580259, 580765, 580501, 579777, 578695, 577086, 575326, 574087, 572965, 570290, 564870, 557312, 549293, 542085, 536083, 531078, 526551, 522128, 518106, 515190, 513560, 512616, 511807, 511260, 511356, 512110, 513236, 514585, 516335, 518903, 522654, 527530, 533080, 539050, 545651, 552936, 560320, 567333, 574515, 582863, 592570, 602970, 613598, 624555, 635837, 646988, 657386, 666286, 672740, 676237, 677423, 677509, 676957, 675345, 672405, 668394, 663499, 657671, 651164, 644496, 637821, 631072, 624731, 619622, 615770, 612321, 608828, 605891, 604193, 603596, 603508, 603556, 603529, 603159, 602295, 601003, 599403, 597779, 596743, 596682, 597042, 596837, 595967, 595371, 595769, 596984, 598717, 601227, 604784, 608933, 612792, 615850, 618314, 620899, 624297, 628496, 632663, 636099, 639132, 642534, 646173, 648896, 649790, 648944, 647052, 644896, 643119, 641710, 639717, 636230, 631754, 627779, 624981, 622641, 619948, 616941, 613937, 611009, 608407]
57697F08407j785j035j017j313j036l00O8J0J94O61P29K70RM60J418K612M070
57680F12422N747P511R453J1624J3698J5571J7992K1869K7154L3226M0054M8104
57668H64425N7368O7141P6284Q2563Q2202P1763N1157K4214l748k8425m7194n8956
57656A238794o4082o4029o0535n5187m9309m3593l7948l2261k7044k2772j9057
57645G62977j5224j1409q260n894m035k870k747l164l119k342j387n49K65Q12
57631G03054O30j6k96QL51M22M48M57J62k86l25J55O41Q66J102J546J987K107
57613G13013J590K32j408j926o13J280J899J145M53M96N41K18L20J360K570L001
57597G24171K709K223J749J411J504J912J985J454R04Q77J086J008P43P88J283
$$ y = [608407, 606622, 605587, 604570, 603257, 602221, 601921, 601989, 601999, 602193, 602854, 603583, 603853, 603862, 604322, 605740, 608352, 612422, 618169, 625680, 635133, 646757, 660455, 676026, 694018, 715887, 743041, 776267, 816321, 864425, 921793, 988934, 1065218, 1147781, 1229983, 1301746, 1352903, 1377117, 1373369, 1344944, 1297750, 1238794, 1174712, 1110683, 1050148, 994961, 945652, 902059, 864111, 831850, 804806, 782034, 762977, 747753, 736344, 728084, 722190, 718155, 715285, 712538, 709374, 706255, 703913, 702526, 701977, 702242, 703054, 703684, 703668, 703372, 703380, 703731, 704153, 704601, 705058, 705220, 704934, 704609, 704764, 705405, 706271, 707373, 708919, 710906, 713013, 714603, 714835, 713427, 711501, 710888, 712168, 714067, 715212, 715665, 716161, 716702, 716920, 717240, 718600, 721170, 724171, 726880, 729103, 730852, 732263, 733767, 735679, 737664, 739118, 740022, 740899, 741985, 742993, 743736, 744524, 745807]
57582G45807J867K063J677J041P74J057J335J172J020J428J953J777J164J146
57568G65281J850K287J946J439J327J410J512J874K353K267J610J437K427L871
57554G92891M705M874M968N150N082M621M002L572L630M205M922N427N940O821
57540H60810P677P722P068O736P088P230O378N013M113L890L908L877L818L807
57526I39135L934M204M334M094L880M346N356N974N650M666L480K440K251L493
57512I97237N391O222N509M670M862N335M859L793L462M112M736M669M250L910
57498A063017L563L079K721K815L319L805L921L834M136N049N883N814N073M707
57484A120736N076N440N236M894M964N184N048M608M233M033M025M419N241O092
$$ y = [745807, 747674, 749737, 751414, 752455, 753229, 754286, 755621, 756793, 757813, 759241, 761194, 762971, 764135, 765281, 767131, 769418, 771364, 772803, 774130, 775540, 777052, 778926, 781279, 783546, 785156, 786593, 789020, 792891, 797596, 802470, 807438, 812588, 817670, 822291, 826293, 829865, 833495, 837700, 842622, 848049, 853989, 860810, 868487, 876209, 883277, 890013, 897101, 904331, 910709, 915722, 919835, 923725, 927633, 931510, 935328, 939135, 943069, 947273, 951607, 955701, 959581, 963927, 969283, 975257, 980907, 985573, 989053, 991493, 993744, 997237, 1002628, 1008850, 1014359, 1019029, 1023891, 1029226, 1034085, 1037878, 1041340, 1045452, 1050188, 1054857, 1059107, 1063017, 1066580, 1069659, 1072380, 1075195, 1078514, 1082319, 1086240, 1090074, 1094210, 1099259, 1105142, 1110956, 1116029, 1120736, 1125812, 1131252, 1136488, 1141382, 1146346, 1151530, 1156578, 1161186, 1165419, 1169452, 1173477, 1177896, 1183137, 1189229]
57470A189229O669P050P200O738N668M753M687N308O020O533O824O853O762O885
57456A277179P221P343P126P031P359P837Q238Q751R318R360Q652P855P642P927
57442A388839Q346Q820R157Q848P903P225P435P974Q026P736P764Q167Q477Q509
57428A503226Q380Q131P935Q204Q903R257Q770P990P665P715P793Q105Q787R071
57414A619932Q243P045O952Q184R451R748R461R500J0100J0677J0487R337P907
57401A737024P294P902R005R761J0161J0605J1002J1024J0841J0844J0927J0737
57389A857127J0476J0698J1431J2136J2460J2446J2122J1488J0847J0641J0973
57378A982845J1621J2346J2789J2483J1503J0770J1076J2008J2505J2264J1906
$$ y = [1189229, 1195898, 1202948, 1210148, 1216886, 1222554, 1227307, 1231994, 1237302, 1243322, 1249855, 1256679, 1263532, 1270294, 1277179, 1284400, 1291743, 1298869, 1305900, 1313259, 1321096, 1329334, 1338085, 1347403, 1356763, 1365415, 1373270, 1380912, 1388839, 1397185, 1406005, 1415162, 1424010, 1431913, 1439138, 1446573, 1454547, 1462573, 1470309, 1478073, 1486240, 1494717, 1503226, 1511606, 1519737, 1527672, 1535876, 1544779, 1554036, 1562806, 1570796, 1578461, 1586176, 1593969, 1602074, 1610861, 1619932, 1628175, 1635220, 1642172, 1650356, 1659807, 1669555, 1679016, 1688516, 1698616, 1709293, 1719780, 1729117, 1737024, 1744318, 1752220, 1761225, 1770986, 1781147, 1791752, 1802754, 1813778, 1824619, 1835463, 1846390, 1857127, 1867603, 1878301, 1889732, 1901868, 1914328, 1926774, 1938896, 1950384, 1961231, 1971872, 1982845, 1994466, 2006812, 2019601, 2032084, 2043587, 2054357, 2065433, 2077441, 2089946, 2102210, 2114116]
57367B114116J1876J1896J1584J1050J0760J1051J1887J2796J3210J3095J3015
57356B246336J3372J3909J4201J4218J4051J3606J3067J3122J4119J5331J5700
57345B401032J5129J4465J4371J4703J4862J4423J3661J3480J4468J5835J6070
57334B562499J4908J3831J4101J5241J6141J6679J7259J7580J7105J6251J5963
57323B737558J6392J6990J7509J7963J8023J7552J7262J7721J8099J7199J5461
57312B927729J4516J4839J5290J5101J4920J5397J6049J6130J5739J5457J5479
57301C096646J5653J5870J6044J6111J6186J6444J6777J6977J7148J7430J7565
57290C278851J7262J6838J6854J7252J7459J7231J6713J6001J5308J5190J5785
$$ y = [2114116, 2125992, 2137888, 2149472, 2160522, 2171282, 2182333, 2194220, 2207016, 2220226, 2233321, 2246336, 2259708, 2273617, 2287818, 2302036, 2316087, 2329693, 2342760, 2355882, 2370001, 2385332, 2401032, 2416161, 2430626, 2444997, 2459700, 2474562, 2488985, 2502646, 2516126, 2530594, 2546429, 2562499, 2577407, 2591238, 2605339, 2620580, 2636721, 2653400, 2670659, 2688239, 2705344, 2721595, 2737558, 2753950, 2770940, 2788449, 2806412, 2824435, 2841987, 2859249, 2876970, 2895069, 2912268, 2927729, 2942245, 2957084, 2972374, 2987475, 3002395, 3017792, 3033841, 3049971, 3065710, 3081167, 3096646, 3112299, 3128169, 3144213, 3160324, 3176510, 3192954, 3209731, 3226708, 3243856, 3261286, 3278851, 3296113, 3312951, 3329805, 3347057, 3364516, 3381747, 3398460, 3414461, 3429769, 3444959, 3460744]
57279C460744J6138J5347J4040J3571J3919J3707J2378J1020J0712J1186J1619
57268C604381J1821J2127J2861J4205J5967J7372J7764J7667J8198J9442K0386
57257C782191K0627K0955K1868K2636K2539K2075K2164K2872K3611K4006K3973
57246D029517K3395K2447K1841K2113K2832K3010K2164K0717J9461J8825J8639
57235D264961J8501J8436J8920K0063K1172K1604K1543K1394K0893J9687J8405
57224D485579J7976J8142J7830J6982J6662J7262J7912J8022J8118J8614J8956
57213D682055J8712J8558J9305K0705K1877K2382K2307K1775K0954K0046J8953
57202D907629J7496J6145J5768J6331J6734J6392J6086J6681J7827J8626J8915
$$ y = [3460744, 3476882, 3492229, 3506269, 3519840, 3533759, 3547466, 3559844, 3570864, 3581576, 3592762, 3604381, 3616202, 3628329, 3641190, 3655395, 3671362, 3688734, 3706498, 3724165, 3742363, 3761805, 3782191, 3802818, 3823773, 3845641, 3868277, 3890816, 3912891, 3935055, 3957927, 3981538, 4005544, 4029517, 4052912, 4075359, 4097200, 4119313, 4142145, 4165155, 4187319, 4208036, 4227497, 4246322, 4264961, 4283462, 4301898, 4320818, 4340881, 4362053, 4383657, 4405200, 4426594, 4447487, 4467174, 4485579, 4503555, 4521697, 4539527, 4556509, 4573171, 4590433, 4608345, 4626367, 4644485, 4663099, 4682055, 4700767, 4719325, 4738630, 4759335, 4781212, 4803594, 4825901, 4847676, 4868630, 4888676, 4907629, 4925125, 4941270, 4957038, 4973369, 4990103, 5006495, 5022581, 5039262, 5057089, 5075715, 5094630]
57191E094630J9014J8782J7802J6201J4559J3246J2265J1615J1228J0892J0586
57180E250820J0642J1250J2051J2641J3125J3850J4760J5337J5087J3961J2483
57169E396007J1428J1078J0914J0465J0212J1031J2799J4497J5709J7157J9383
57158E540680K1690K2899K2609K1304J9707J8279J7002J5467J3519J1788J1063
57147E736007J1183J1268J0922J0434R736Q175N608K984J435J414K776N057P528
57134E824527R664J1741J4408J7698K1037K3971K6173K7089K6689K6332K7691
57123F057020L0897L4860L9190M4558N1342N9428O9256Q1503R5699J10695J26518
57112F800966J44214J63959J85227K08744K36239K68247L04336L45911L96375
$$ y = [5094630, 5113644, 5132426, 5150228, 5166429, 5180988, 5194234, 5206499, 5218114, 5229342, 5240234, 5250820, 5261462, 5272712, 5284763, 5297404, 5310529, 5324379, 5339139, 5354476, 5369563, 5383524, 5396007, 5407435, 5418513, 5429427, 5439892, 5450104, 5461135, 5473934, 5488431, 5504140, 5521297, 5540680, 5562370, 5585269, 5607878, 5629182, 5648889, 5667168, 5684170, 5699637, 5713156, 5724944, 5736007, 5747190, 5758458, 5769380, 5779814, 5789550, 5797725, 5803333, 5806317, 5807752, 5809166, 5811942, 5816999, 5824527, 5834191, 5845932, 5860340, 5878038, 5899075, 5923046, 5949219, 5976308, 6002997, 6029329, 6057020, 6087917, 6122777, 6161967, 6206525, 6257867, 6317295, 6386551, 6468054, 6563753, 6674448, 6800966, 6945180, 7109139, 7294366, 7503110, 7739349, 8007596, 8311932, 8657843, 9054218]
57103I054218M58292N32882O23004P34104Q71761J041196J249811J506758J818089
57094A7890115K184674K605164L076955L592355M137843M699303N264307N817332
57086D9268048O337668O804104P193601P468311P570658P442980P052524O391470
57078A05529364N459165M262855K844314J295700k63546j728778l033751m147759
57070A10217564n064585n793844o350766o744662o974796p036523o930356o667752
57062E8654280o273104n781825n233859m665859m107105l579264l096513k665459
57054B3251292k286935j959041j678663j441471j242447j076772r39550q25473
57046A1800940p30092o51067n86985n35206m92117m55199m23553l96469l72718
$$ y = [9054218, 9512510, 10045392, 10668396, 11402500, 12274261, 13315457, 14565268, 16072026, 17890115, 20074789, 22679953, 25756908, 29349263, 33487106, 38186409, 43450716, 49268048, 55605716, 62409820, 69603421, 77071732, 84642390, 92085370, 99137894, 105529364, 110988529, 115251384, 118095698, 119391398, 119127852, 117399074, 114365323, 110217564, 105152979, 99359135, 93008369, 86263707, 79288911, 72252388, 65322032, 58654280, 52381176, 46599351, 41365492, 36699633, 32592528, 29013264, 25916751, 23251292, 20964357, 19005316, 17326653, 15885182, 14642735, 13565963, 12626413, 11800940, 11070848, 10419781, 9832796, 9297590, 8805473, 8350274, 7926721, 7530252, 7157534]
57037G157534l51281l31652l13195k95069k76951k59235k42375k26567k11912
57028D649297j98156j84397j69594j53321j35514j16071r5975p9039p1330p7574
57018C368326r7580j25746j53897j75273j87057j90116j86728j78674j67132j53506
57008A752617j39389j25816j13040j01017q9800p9508p0335o2588n6373n1175
56998H63576m6133m0848l5795l1773k9055k7120k5157k2746j9981j6984j3630
56987E54354r826n763j690K347O210R346J1074J0941Q492L220m485j2681j9053
56974E52486k2747k4349k4395k2971k0727j8846j7480j5307j1418o803l134p33
56962C63576J443M274P833J1973J6656K1528K5634K7635K6268K0913J2153J650
$$ y = [7157534, 6806253, 6474601, 6161406, 5866337, 5589386, 5330151, 5087776, 4861209, 4649297, 4451141, 4266744, 4097150, 3943829, 3808315, 3692244, 3596269, 3517230, 3445900, 3368326, 3270746, 3145000, 2991103, 2815830, 2628773, 2438657, 2251929, 2073255, 1906123, 1752617, 1613228, 1487412, 1374372, 1273355, 1183555, 1104047, 1033712, 971124, 914751, 863576, 817443, 776595, 740800, 709027, 679972, 652852, 627695, 604949, 584968, 567984, 554354, 544528, 538765, 537075, 539422, 545632, 554978, 566052, 576993, 585485, 588705, 584220, 571539, 552486, 529739, 505390, 480995, 458024, 437297, 418451, 400971, 385664, 374246, 367443, 364309, 363576, 365019, 369293, 377126, 389099, 405755, 427283, 452917, 480552, 506820, 527733, 539886, 541536]
56950E41536q718j7513k3694k6679k6882k5642k4046k2019j9008j5201j1417p993
56938C12724m392n6M882R889J4763J9756K5116L0669L5790L9449M0067L5707K5271
56925E89635J0045o399k0366l0166l5996l8460l8021l5544l2269k8952k5602k2188
56913B85717j9017j6336j4127j2394j1126r961q474o794n334m010k440q64N2M09
56899A75301J053K167K930K951L062M107N804P482R245J1633J4715J8207K1994
56886B80651K5945K9520L1980L2573L0224K3839J3676J982q423j5967k0492k2311
56874D03197k1887j9950j7090j3367q808l954O47N232J0458J6494K3126L0555
56862D04653L9406M9804O0878P1021P8261Q0307P4889O0669L8349J1304j5147
$$ y = [541536, 532818, 515305, 491611, 464932, 438050, 412408, 388362, 366343, 347335, 332134, 320717, 312724, 308332, 308276, 313158, 323047, 337810, 357566, 382682, 413351, 449141, 488590, 528657, 564364, 589635, 599680, 593281, 572915, 542749, 506753, 468293, 430272, 394728, 362459, 333507, 307905, 285717, 266700, 250364, 236237, 223843, 212717, 202756, 194282, 187488, 182154, 178144, 175704, 174840, 174892, 175301, 176354, 178521, 181451, 184402, 187464, 191571, 197375, 204857, 214102, 225735, 240450, 258657, 280651, 306596, 336116, 368096, 400669, 430893, 454732, 468408, 470390, 461967, 446000, 425508, 403197, 381310, 361360, 344270, 330903, 322095, 318141, 318788, 324020, 334478, 350972, 374098, 404653, 444059, 493863, 554741, 625762, 704023, 784330, 859219, 919888, 958237, 969541, 954394]
56851I54394l5942m8648n3913n3809n0151m4203l7034k9334k1205j2489l124P024
56839E71566J8278L0762M4324N9051P5383R3157J10634J24540J30694J24644J03185
56828A486218O6779K0946k5417o3857q9600j02405j05170j01587r4337q4864p4029
56817H32677o2379m9979l6843k3666j1421l7J1769K5077L9809N5262P0548Q3799
56805I34616R1591R0005P6471N1080J7213j8758m9740p1263q2883q6556q4494
56794H67282p8671p0946o2460n3386m3848l4474k5636j7002q488p09O304J3807
56782D91773K2747L2150M0008M4892M5582M0203K7598R533r839k6837l9799m8270
56770F29741n2154n1973m8998m4682m0226l6402l3136k9593k5376k1279j8157
$$ y = [954394, 918452, 869804, 815891, 762082, 711931, 667728, 630694, 601360, 580155, 567666, 564542, 571566, 589844, 620606, 664930, 723981, 799364, 892521, 1003155, 1127695, 1258389, 1383033, 1486218, 1552997, 1573943, 1548526, 1484669, 1395069, 1292664, 1187494, 1085907, 991570, 906706, 832677, 770298, 720319, 683476, 659810, 648389, 648352, 660121, 685198, 725007, 780269, 850817, 934616, 1026207, 1116212, 1192683, 1243763, 1260976, 1242218, 1192478, 1121215, 1038332, 951776, 867282, 788611, 717665, 655205, 601819, 557971, 523497, 497861, 480859, 472371, 471662, 477966, 491773, 514520, 546670, 586678, 631570, 677152, 717355, 744953, 754486, 744647, 717810, 678011, 629741, 577587, 525614, 476616, 431934, 391708, 355306, 322170, 292577, 267201, 245922, 227765]
56759B27765j5627j2917j0379q912q252p271n876n147n412n608m996m218m069
56746A29081m214l916l261k887k984l168l084k675k066j475j135j100j237j375
56732I4504j309q40r3M56O22Q89J669K503K628K070J522J293J137J008J147J439
56716A10645J429J108R81J238J477J405J217J088Q30K47n74j398j990k079j659
56701A13965j203j191j477j584j429j262j018l74N62J228J346J135Q71P15Q67
56686A11151J369J800J780J607J873K482K815K724K635K650K325J461N14l1r5
56671A37060K80J090K068K747K974L003K963K636J821O65l70o15L76K113L301
56656A62112L252K775K975L663L809L251K777K685K424J748J113O93N7q82j501
$$ y = [227765, 212138, 199221, 188842, 179930, 171678, 164407, 158531, 153384, 147972, 142364, 137368, 133150, 129081, 124867, 120951, 117690, 114803, 111819, 108651, 105567, 102892, 100826, 99351, 98216, 97116, 95879, 94504, 93195, 92355, 92262, 92718, 93340, 94229, 95898, 98401, 101029, 103099, 104621, 105914, 107051, 108059, 109206, 110645, 112074, 113182, 114163, 115401, 116878, 118283, 119500, 120588, 121418, 121665, 121091, 119693, 117703, 115624, 113965, 112762, 111571, 110094, 108510, 107081, 105819, 104801, 104427, 104989, 106217, 107563, 108698, 109569, 110284, 111151, 112520, 114320, 116100, 117707, 119580, 122062, 124877, 127601, 130236, 132886, 135211, 136672, 137186, 137155, 137060, 137340, 138430, 140498, 143245, 146219, 149222, 152185, 154821, 156642, 157307, 156937, 156322, 156698, 158811, 162112, 165364, 168139, 171114, 174777, 178586, 181837, 184614, 187299, 189723, 191471, 192584, 193277, 193334, 192452, 190951]
56641A90951j484j305j355j381j234j366k078k923l348l421l407l263k991k953
56627A58442l332l663l466k990k844l123l371l251k835k327j774j139n12j39j50
56612A23526k70n8N25J042J277J506J797J632P61q8j39K32J55k97k84L39Q49R28
56594A33433J016J249J084L12m33n61j92L77J108J797J918J298M78M2kO5J22K17
56576A43328M69J028J746K057J676J182J246J578J498J279J806K997L800L914
56562A69604M244N276O239O450O382O674O944O488N451M502L807L024K037J101
56548B38223M60J77J59J25j58n31p42r75j558k217k293j731j068n12J08M21k79
56531B27609j691k451j984j297j420j994k165j973j976k159k139j982k108k558
$$ y = [190951, 189467, 188162, 186807, 185426, 184192, 182826, 180748, 177825, 174477, 171056, 167649, 164386, 161395, 158442, 155110, 151447, 147981, 144991, 142147, 139024, 135653, 132402, 129567, 127240, 125466, 124327, 123815, 123676, 123526, 123256, 123198, 123723, 124765, 126042, 127548, 129345, 130977, 131738, 131650, 131511, 131743, 131898, 131601, 131317, 131656, 132505, 133433, 134449, 135698, 136782, 137094, 136661, 136100, 135908, 136285, 137393, 139190, 141108, 142406, 142884, 142926, 142924, 142989, 143111, 143328, 143797, 144825, 146571, 148628, 150304, 151486, 152732, 154310, 155808, 157087, 158893, 161890, 165690, 169604, 173848, 179124, 185363, 191813, 198195, 204869, 211813, 218301, 223752, 228254, 232061, 235085, 237122, 238223, 238683, 238860, 239019, 239144, 238986, 238455, 237713, 236738, 235180, 232963, 230670, 228939, 227871, 227359, 227467, 227888, 227609, 225918, 223467, 221483, 220186, 218766, 216772, 214607, 212634, 210658, 208499, 206360, 204378, 202270, 199712]
56517A99712l053l477l826l945l739l432l287l299l320l153k471j104M05J108
56503A63119O77k77r96j206r46m54k70p46j408j484j027p00n55m6O65P72L19L59
56485A55796J166J631J085M08N13Q96P39M21P66J482J597R63L28J56K44L27L48
56468A68866K43l7l48m87k76M33J420J843J079j72n94r2J86j70j43Q93J973J988
56450A76605J173L52k67p03n89J49Q06R44J116J745K232J983J467J345J388J170
56434A90916R13P87L21n60r19k34N26L83j39j49Ol42o43p0Q25R85O58P10P59j01
56414A94632j198q58R52K398K342J503Q72N20L06M53Q75J062R79J108J457J497
56398B08900J270J409J875J727O07o31j161j207j351j623j738j606j172l43O15
$$ y = [199712, 196659, 193182, 189356, 185411, 181672, 178240, 174953, 171654, 168334, 165181, 162710, 161606, 162011, 163119, 163796, 163519, 162523, 161317, 160371, 159917, 159647, 158901, 157493, 156009, 154982, 154282, 153727, 153681, 154346, 155118, 155437, 155796, 156962, 158593, 159678, 160086, 160599, 161495, 162234, 162655, 163421, 164903, 166500, 167463, 167791, 167947, 168191, 168518, 168866, 169109, 169072, 168724, 168237, 167961, 168394, 169814, 171657, 172736, 172564, 171970, 171878, 172064, 171894, 171751, 172644, 174617, 176605, 177778, 178130, 177863, 177160, 176571, 176720, 177526, 178470, 179586, 181331, 183563, 185546, 187013, 188358, 189746, 190916, 191829, 192616, 192937, 192377, 191458, 191224, 191750, 192133, 191994, 191845, 191851, 191509, 190866, 190796, 191621, 192606, 193264, 193974, 194733, 194632, 193434, 192576, 193528, 195926, 198268, 199771, 200643, 201163, 201469, 201922, 202797, 203859, 204838, 205946, 207403, 208900, 210170, 211579, 213454, 215181, 215788, 215157, 213996, 212789, 211438, 209815, 208077, 206471, 205299, 204956, 205571]
56383B05571J122J023P85P07M87q8n52l21M59J127J388J597K101K668K754K259
56367B23087J610J093M96j90k43Q89K458L058K378J403Q48N01K38N12J328J862
56351B41328J689J407J446J286N80J3J97O24O25M38M86M64J27P0Q15J849K524
56334B55968K933L080K287O10l38O29K336K827K023J347J388J671K098K951L741
56319B85551L622K814K220J908J328O87P07J216J423J363J707K331K448K062J963
56304C13350K335K643K791L173L714M030M342N025N484M818L435K672K962L552
56290C64326L952M352M722M807M917N561O425O837O942P253P407O802O094O512
56276D46909P940R168R885J0798J1939J2525J2512J2692J3175J3402J3711J5237
$$ y = [205571, 206693, 207716, 208501, 209208, 209695, 209607, 209055, 208734, 209193, 210320, 211708, 213305, 215406, 218074, 220828, 223087, 224697, 225790, 226286, 226096, 225853, 226742, 229200, 232258, 234636, 236039, 236887, 237388, 237626, 238138, 239466, 241328, 243017, 244424, 245870, 247156, 247736, 247749, 247946, 248570, 249195, 249633, 250119, 250583, 250710, 250780, 251595, 253444, 255968, 258901, 261981, 264268, 264878, 264540, 265169, 267505, 270332, 272355, 273702, 275090, 276761, 278859, 281810, 285551, 289173, 291987, 294207, 296115, 297443, 298130, 298837, 300053, 301476, 302839, 304546, 306877, 309325, 311387, 313350, 315685, 318328, 321119, 324292, 328006, 332036, 336378, 341403, 346887, 351705, 355140, 357812, 360774, 364326, 368278, 372630, 377352, 382159, 387076, 392637, 399062, 405899, 412841, 420094, 427501, 434303, 440397, 446909, 454849, 464017, 473902, 484700, 496639, 509164, 521676, 534368, 547543, 560945, 574656, 589893]
56264E89893J7966K0474K2014K3390K5427K7958L0759L4191L8452M3302M8748
56253I22574N5101O2157O9347P6627Q4242R1864R9118J06565J14724J22380J27516
56242A932215J29755J30244J29209J25413J18135J07858R4823P8658N9828L9812
56232B945950J9422j522k2504m1820n8202p1632q2394r0657r7114j02516j06481
56221B290530j08119j07756j06394j03733r8817r2528q7102q2941p8251p2355
56211A352534o6918o3056n9580n5329n1063m7733m4656m0854l6721l3050k9765
56200H23809k6660k4155k2309k0317j7891j5838j4444j2732j0264q207p512p348
56188F36132o463m997l801l038k510k401k735k877k454j973j912k051k182k482
$$ y = [589893, 607859, 628333, 650347, 673737, 699164, 727122, 757881, 792072, 830524, 873826, 922574, 977675, 1039832, 1109179, 1185806, 1270048, 1361912, 1461030, 1567595, 1682319, 1804699, 1932215, 2061970, 2192214, 2321423, 2446836, 2564971, 2672829, 2767652, 2846310, 2906138, 2945950, 2965372, 2963850, 2941346, 2899526, 2841324, 2769692, 2687298, 2596641, 2499527, 2397011, 2290530, 2182411, 2074655, 1968261, 1864528, 1765711, 1673183, 1586081, 1503140, 1424889, 1352534, 1285616, 1222560, 1162980, 1107651, 1056588, 1008855, 964199, 923345, 886624, 853574, 823809, 797149, 772994, 750685, 730368, 712477, 696639, 682195, 669463, 659199, 650992, 643480, 636132, 629669, 624672, 620871, 617833, 615323, 612922, 610187, 607310, 604856, 602883, 600971, 598920, 596738, 594256]
56174E94256k723k149o67Q22J740K438L175L635L832M290N023N495N823O738Q168
56159F39896R188R530R767R961R807J0062J1958J4984J7252J8348J9776K2259
56147H02788K4831K7221L0803L6326M2815M9730N8119O8650Q0478R2988J06676
56136A421425J21060J33655J42042J45333J42847J33658J18851J02322Q7835P6612
56126B625640O8472O3081N8807N2428M1826K7845J2644k103j4690k3411k8666
56115B881873l3420m0311m9865o2156p7769r5630j12082j23827j30295j31992
56105B024526j28655j20568j09790r8315q6514p4590o3708n4402m5670l7030k9679
56094A175605k4336j9915j5597j2191j0110q053n167k537j111j48R93J619J568
$$ y = [594256, 591533, 589384, 588717, 589539, 591279, 593717, 596892, 600527, 604359, 608649, 613672, 619167, 624990, 631728, 639896, 649084, 658614, 668381, 678342, 688149, 698211, 710169, 725153, 742405, 760753, 780529, 802788, 827619, 854840, 885643, 921969, 964784, 1014514, 1072633, 1141283, 1221761, 1314749, 1421425, 1542485, 1676140, 1818182, 1963515, 2106362, 2240020, 2358871, 2461193, 2549028, 2625640, 2694112, 2757193, 2816000, 2868428, 2910254, 2938099, 2950743, 2948640, 2933950, 2910539, 2881873, 2848453, 2808142, 2758277, 2696121, 2618352, 2522722, 2410640, 2286813, 2156518, 2024526, 1895871, 1775303, 1665513, 1567198, 1480684, 1406094, 1342386, 1287984, 1242314, 1205284, 1175605, 1151269, 1131354, 1115757, 1103566, 1093456, 1085403, 1080236, 1077699, 1076588, 1076440, 1077433, 1079052, 1080620]
56081A080620K158L888N401O014O980Q840J0100R962R877J0857J1793J2046J2921
56068A191457J4909J6202J5791J5342J6133J6941J6772J6804J7583J7401J5476
56057A370811J3806J3671J3420J1979J1196J2305J3347J2864J2789J4823J7180
56046A518191J7969J8567K0606K2691K3322K3876K5594K6766K6219K6244K8695
56035A778740L1454L2269L2766L4991L7389L8039L8504M0586M2599M2866M3341
56024B193544M5726M7631M6917M6182M8328N1389N2582N3655N7144O0983O2269
56013B766350O2933O6145P0454P3015P5240P9602Q4265Q6729Q9324R5106J01728
56002C650891J05593J08644J14691J22425J28549J34302J42353J50813J57125
$$ y = [1080620, 1082778, 1086666, 1092067, 1098081, 1105061, 1113901, 1124001, 1133963, 1143840, 1154697, 1166490, 1178536, 1191457, 1206366, 1222568, 1238359, 1253701, 1269834, 1286775, 1303547, 1320351, 1337934, 1355335, 1370811, 1384617, 1398288, 1411708, 1423687, 1434883, 1447188, 1460535, 1473399, 1486188, 1501011, 1518191, 1536160, 1554727, 1575333, 1598024, 1621346, 1645222, 1670816, 1697582, 1723801, 1750045, 1778740, 1810194, 1842463, 1875229, 1910220, 1947609, 1985648, 2024152, 2064738, 2107337, 2150203, 2193544, 2239270, 2286901, 2333818, 2380000, 2428328, 2479717, 2532299, 2585954, 2643098, 2704081, 2766350, 2829283, 2895428, 2965882, 3038897, 3114137, 3193739, 3278004, 3364733, 3454057, 3549163, 3650891, 3756484, 3865128, 3979819, 4102244, 4230793, 4365095, 4507448, 4658261, 4815386]
55993D815386J64098J75152J87446J96965K06209K19383K34383K47576K61863
55984F708461K81479L03486L23378L44274L71208M01460M30596M62669N03666
55975A0130677N50377N97312O48949P12819P86420Q64357R52474J060636J188006
55966A7492027J330955J499061J706714J956403K249228K604971L051984L606000
55958C5497343M282222N118476O158040P418307Q911270J0693136J2863864J5528267
55950A06470925J8794902K2781548K7507338L2678456L7530100M0829791M1040670
55943C27633730L6721634K7249616J3554680j839644j5820737k6115911l2067700
55936C29315668l4331984l4047148l2225501k9581211k6571391k3465752k0424087
$$ y = [4815386, 4979484, 5154636, 5342082, 5539047, 5745256, 5964639, 6199022, 6446598, 6708461, 6989940, 7293426, 7616804, 7961078, 8332286, 8733746, 9164342, 9627011, 10130677, 10681054, 11278366, 11927315, 12640134, 13426554, 14290911, 15243385, 16304021, 17492027, 18822982, 20322043, 22028757, 23985160, 26234388, 28839359, 31891343, 35497343, 39779565, 44898041, 51056081, 58474388, 67385658, 78078794, 90942658, 106470925, 125265827, 148047375, 175554713, 208233169, 245763269, 286593060, 327633730, 364355364, 391604980, 405159660, 403320016, 387499279, 361383368, 329315668, 294983684, 260936536, 228711035, 199129824, 172558433, 149092681, 128668594]
55929A28668594j7562332j4963825j2662819j0659271q950096p526738o355111
55922D9988402n386432m585771l931808l396909k949526k572579k260645k001917
55914B2902815j779244j585529j422198j284739j163656j056926r67824q92591
55906A2750108q22596p56512o98582o47161n96394n47117n04900m68959m33551
55897G274336l98785l69714l45933l22048k97567k76891k60152k43073k25356
55888D534817k10609j98262j83895j67417j52998j40979j27426j11821r7949q6925
55878C056536p6361o6625o1273o0753o1902o3936o8921p5965q0910q2483q3254
55867B274153q4132q3152q0137p7378p5099p1106o5431o0769n7889n4926n1395
$$ y = [128668594, 111106262, 96142437, 83479618, 72820347, 63870251, 56343513, 49988402, 44601970, 40016199, 36084391, 32687482, 29737956, 27165377, 24904732, 22902815, 21123571, 19538042, 18115844, 16831105, 15667449, 14610523, 13642699, 12750108, 11927512, 11171000, 10472418, 9825257, 9228863, 8681746, 8176846, 7707887, 7274336, 6875551, 6505837, 6159904, 5837856, 5540289, 5263398, 5003246, 4760173, 4534817, 4324208, 4125946, 3942051, 3774634, 3621636, 3480657, 3353231, 3241410, 3143461, 3056536, 2980175, 2913550, 2852277, 2791524, 2729622, 2665686, 2596765, 2520800, 2439890, 2357407, 2274153, 2190021, 2106869, 2026732, 1949354, 1874255, 1803149, 1737718, 1676949, 1619060, 1564134, 1512739]
55856A512739m8715m6609m3224l8952l6060l4509l2093k8720k6521k5836k5011
55845A126489k4045k4476k5740k5568k3927k2802k2254k0584j8249j7596j8611
55834H82637j8766j7316j6021j5581j4842j3702j3233j2890j1065q381p066p154
55822G26620o818o175p092r214j0091r425r444j0745j1371j0429r153q047o238
55809F12378m074k941k263QL578N905O339O822Q089Q742Q470Q598Q857P082L008
55794F78598j040l963p086j0735j3088j3481j3531j3871j2975j0469q423q030
55782E61906p920p167p020q133q866p965o448n221l231M75N034R490J4008J7901
55768E46843J8689J4831P731k76q042j4689j8717j9754j9552j9727j9816j8696
$$ y = [1512739, 1464024, 1417415, 1374191, 1335239, 1299179, 1264670, 1232577, 1203857, 1177336, 1151500, 1126489, 1102444, 1077968, 1052228, 1026660, 1002733, 979931, 957677, 937093, 918844, 901248, 882637, 863871, 846555, 830534, 814953, 800111, 786409, 773176, 760286, 749221, 740840, 733774, 726620, 719802, 713627, 706535, 697321, 687230, 677805, 668361, 657616, 646245, 635816, 626663, 618616, 612378, 608304, 605363, 603100, 603108, 606686, 612591, 618930, 625752, 633841, 642583, 651053, 659651, 668508, 675590, 678598, 677558, 673595, 666509, 655774, 642686, 629205, 615674, 601803, 588828, 578359, 569936, 561906, 553986, 546819, 539799, 531666, 522800, 514835, 508387, 503166, 499935, 500410, 505444, 514934, 528942, 546843, 565532, 580363, 588094, 587818, 579776, 565087, 546370, 526616, 507064, 487337, 467521, 448825]
55756D48825j6502j3986j1422r096p666p059o345n342n066n920o933p312p339
55743C38837p150o256m790l668l044k113q70l82r54j720k396l554m774m616k992
55728B89558j595j418j784k338l688n420n760m336l059l173l481k682j451p80
55714B48593j16J355L122M378N325O235O544N839M586L047R51j165j991j579j678
55699B83446l064m416m832n353o755p817p355o229n655n147l818k347j862j963
55685B16833j493l74P84J959L252M092M168M266N030N749N518M575L491K018l6
55670B59832j848k702l166l979m658m342l185j873n01J034K392L353M205M861
55656B49423M606L531K961L571M282L987L081K262J157n63k094k832l601n149
$$ y = [448825, 432323, 418337, 406915, 397819, 390153, 383094, 376749, 371407, 366341, 360421, 353488, 346176, 338837, 331687, 325431, 320641, 316973, 313929, 311816, 310946, 310564, 309610, 307890, 305494, 301940, 297166, 292550, 289558, 287963, 286545, 284761, 282423, 278735, 273315, 267555, 263219, 260160, 256987, 253506, 250824, 249373, 248593, 248477, 249832, 252954, 257332, 262657, 268892, 275436, 281275, 285861, 288908, 289859, 288694, 286703, 285124, 283446, 280382, 275966, 271134, 265781, 259026, 251209, 243854, 237625, 231970, 226823, 223005, 220658, 218796, 216833, 215340, 214966, 215750, 217709, 220961, 225053, 229221, 233487, 238517, 244266, 249784, 254359, 257850, 259868, 259832, 257984, 255282, 252116, 248137, 243479, 239137, 235952, 234079, 233578, 234612, 237004, 240357, 244562, 249423, 254029, 257560, 260521, 264092, 268374, 272361, 275442, 277704, 278861, 278298, 276204, 273372, 269771, 264622]
55642B64622o557o731o359o763p689p972p627p533p603o949n564m405l911l682
55628A75277l410l106k616j881j293j099q88m53l63r36j417j202r42j445k233
55613A51993k436k211k143j959j177l91m99j232j655j636j657j665j352j010r78
55598A29992q08j73J18o84j712j639p44k94l68k8O87P20l8n10k90k12o87r55m25
55579A21950L29N05R4l85m56J84J387K364K447K086K271L038L435K987K244J769
55563A46249J456J134R79J007P37k06j580k771l312l160k702k426k328j907r87
55548A30183j21K34L87P29R50O70L42O91J504J951J801J493J206P44K98L44P57
55531A44163Q37L46j84l60m85j020j883k537k532j948j379j319j548j448r63p05
$$ y = [264622, 258065, 251334, 244975, 238212, 230523, 222551, 214924, 207391, 199788, 192839, 187275, 182870, 178959, 175277, 171867, 168761, 166145, 164264, 162971, 161872, 160984, 160531, 160168, 159232, 157815, 156613, 155671, 154226, 151993, 149557, 147346, 145203, 143244, 142067, 141676, 141177, 139945, 138290, 136654, 134997, 133332, 131980, 130970, 129992, 129184, 129011, 129129, 128445, 126733, 125094, 124350, 124056, 123688, 123660, 124347, 125067, 125029, 124519, 124229, 124017, 123330, 122375, 121950, 122279, 122784, 122878, 122493, 122037, 122221, 123608, 125972, 128419, 130505, 132776, 135814, 139249, 142236, 144480, 146249, 147705, 148839, 149818, 150825, 151562, 151356, 149776, 147005, 143693, 140533, 137831, 135405, 133077, 131170, 130183, 130062, 130296, 130683, 131412, 132362, 133032, 133374, 134065, 135569, 137520, 139321, 140814, 142020, 142764, 143062, 143406, 144163, 145000, 145346, 145162, 144802, 144317, 143297, 141414, 138877, 136345, 134397, 133018, 131699, 130151, 128703, 127740, 127035]
55515A27035q80r92q49j053j846k372j939j172j055j451j602j483j585j846j900
55500A05010j880j972j658o08J82m72j942k456j605p25o35n57K15R69O62n01j392
55483I0635j322n31K99O21M09J26J37K56J91J02J75L3o18j081l79J161K152J938
55465I4304J201O46J85l01m23q8R7k68p20o80k81P0L34N42M09j50n53k40M07N39
55445I5030Nn06m44n6J20p5l74m54j49M84J026Q59j33j046o76R56K303K033O71
55426I9574j65J50P78R14P33O05M13R6L4L62O29O21Q22J451J849J479Q47O47O71
55407A12510L67o7q0K33L26J3o70j799k991l150j836l31j28q28p98K70R28J80
55389A02149j169j722j152j77L94K28m28r53r20m29K68J159K052K356J797R54
$$ y = [127035, 126155, 125163, 124314, 123261, 121415, 119043, 117104, 115932, 114877, 113426, 111824, 110341, 108756, 106910, 105010, 103130, 101158, 99500, 98892, 99074, 98602, 96660, 94204, 92599, 91874, 91239, 90682, 90897, 91866, 92528, 92027, 90635, 89313, 88782, 89081, 89702, 90111, 90237, 90374, 90630, 90821, 90923, 91098, 91131, 90513, 89432, 89053, 90214, 92366, 94304, 95505, 96151, 96336, 96035, 95612, 95524, 95621, 95353, 94633, 93953, 93672, 93742, 94076, 94618, 95027, 94877, 94324, 94084, 94491, 95030, 95035, 94529, 94085, 94029, 94149, 94074, 93700, 93246, 93097, 93581, 94607, 95466, 95333, 94287, 93611, 94567, 96870, 98903, 99574, 99409, 99559, 100337, 101251, 101984, 102589, 103002, 103098, 103132, 103494, 104123, 104744, 105566, 107017, 108866, 110345, 111192, 111839, 112510, 112877, 112810, 112730, 112963, 113289, 113302, 112632, 110833, 107842, 104692, 102856, 102525, 102397, 101569, 100771, 101041, 101969, 102149, 100980, 99258, 98106, 97929, 98323, 98551, 98123, 97170, 96250, 95821, 96089, 97248, 99300, 101656, 103453, 104407]
55373A04407M22L0m70o44k57k03j264k515k448j326q57j589k186j580l51M30N35
55356I0134K56j50l10P0N18K56m43m27N47J287R47K20J20N38O93L36k15p04j039
55337I2634j143j058q66l94N09J366J464Q94M45L62J50k38j41N28P88N8q25p44
55319I3789K17J086J195N66l85r66o48J65L54m41j232j071l27J18K81Q29J759
55302I5289K194J489m0j445j907j290k55L02J20k69k87J33Q13J590K112J878Q42
55285A01269l44j011j098r41p73o34m67j43K67K81m61j441j637p78L47R75J156
55268I4567J254J303J147P44Q7p44j327j279r09q35r07l49Q23J533J216P07R29
55251I7960J520J507P56l7l82l44j64j21m57j029j282r32l71j5K21N10O30L68
$$ y = [104407, 104829, 104859, 104389, 103745, 103488, 103285, 102021, 99506, 97058, 95732, 94875, 93286, 91100, 89520, 89169, 89599, 90134, 90390, 90240, 89930, 90000, 90518, 90774, 90331, 89904, 90451, 91738, 92685, 92905, 93025, 93563, 94256, 94592, 94377, 93673, 92634, 91491, 90433, 89567, 89173, 89682, 91048, 92512, 93406, 93851, 94213, 94363, 94125, 93984, 94512, 95300, 95358, 94533, 93789, 94006, 95092, 96287, 96853, 96468, 95502, 94854, 95019, 95373, 94932, 93700, 92629, 92302, 92420, 92701, 93530, 95289, 97483, 98972, 98932, 97487, 95580, 94290, 94035, 94337, 94457, 94188, 93901, 94034, 94847, 96437, 98549, 100427, 101269, 100925, 99914, 98816, 97875, 97102, 96468, 96001, 95858, 96125, 96406, 95945, 94504, 92867, 92089, 92436, 93411, 94567, 95821, 97124, 98271, 99015, 99102, 98358, 97031, 95752, 94843, 94008, 93101, 92752, 93575, 95108, 96324, 97031, 97960, 99480, 100987, 101743, 101706, 101324, 100980, 100816, 100695, 100238, 99209, 97927, 96995, 96624, 96609, 96830, 97340, 97970, 98338]
55233I8338j0j78j98k29j59M0P7j81l74k26J5R2K19O01R21Q46N66M07K51p6k81
55212A00461j7M74P01N99M14J73j97m93m62k71k71m98p22q47q67p01l73j73k79
55193I6651m34k77J42M69M67J59j86j58M39J191J398R03J45n79j314j869j806
55176I5341j234q69r54q88l07K46L03L03P79J409J631J631J874K129J838J130
55160A04362O47N43M21Q7k71n29p25q24q01p42n34K03J405K219J966J033K93k3
55142A08730k70n29n41k73jR6J3j53j25L65R56Q48L0l95K33J033Q93J58m1L17
55122A11344K11o56j398j304o51m2L10M02L26L40N44N66J82l6N42J452J656J074
55104A14862O23P32R04P92O93O83L46l07n84k29Q6j23l64j08K96L05J90N13J028
$$ y = [98338, 98328, 98150, 97952, 97723, 97564, 97604, 97681, 97500, 97126, 96900, 96915, 97007, 97226, 97827, 98748, 99594, 100160, 100567, 100818, 100742, 100461, 100444, 100918, 101619, 102218, 102632, 102805, 102608, 102115, 101653, 101382, 101111, 100613, 99891, 99044, 98177, 97476, 97103, 96930, 96651, 96217, 95940, 96082, 96551, 97018, 97177, 96991, 96833, 97272, 98463, 99861, 100764, 100909, 100330, 99016, 97147, 95341, 94107, 93238, 92284, 91396, 91089, 91335, 91638, 91941, 92720, 94129, 95760, 97391, 99265, 101394, 103232, 104362, 105009, 105552, 105973, 106060, 105789, 105260, 104535, 103711, 102910, 102168, 101634, 101837, 103242, 105461, 107427, 108460, 108753, 108730, 108460, 107931, 107390, 107117, 107116, 107212, 107225, 107072, 106947, 107312, 108268, 109116, 109146, 108751, 108984, 110017, 110910, 111068, 111027, 111344, 111555, 110899, 109501, 108197, 107546, 107504, 107814, 108216, 108542, 108882, 109426, 109992, 110174, 110138, 110680, 112132, 113788, 114862, 115485, 116217, 117121, 117913, 118606, 119289, 119635, 119328, 118744, 118515, 118601, 118478, 118114, 118006, 118302, 118607, 118797, 119310, 120338]
55085A20338R20J0r20j050k66R15J800J933J340M88k29p67j133j083n17O2j3o42
55067A21186r94o43j52j78l58J61J177J317j00j834k118r02K55L15k05m81n39
55050A15907o84p22m24j71l62o73n87k21j8M3K28L87K47J13M74J121J364R83L70
55031A17375j86o62q34l93M77J138J187P27K5o21q85p09m93n22m67j5M20K66j47
55012A15681J7Q49J580J683J314P15l5o22o41k04K02M39O95Q33N39P5N5M54O27
54993A24256M23L43N63O66N36N98Q66P30L0n29m33p5J03L35Q35J138Q12K74J69
54974A31640L57J51o71j663k258k091j100L26J422J613R70J1o61n26M74J619J902
54957A31515J167K57q0M9K06K70K33p7o24r84r25o79l74K88J323K035J813Q90
$$ y = [120338, 121258, 121268, 120348, 119298, 119032, 119947, 121747, 123680, 125020, 125508, 125279, 124512, 123379, 122296, 121779, 121841, 121828, 121186, 120192, 119549, 119397, 119219, 118861, 119022, 120199, 121516, 121416, 119582, 117464, 116562, 116817, 117132, 116927, 116446, 115907, 115223, 114501, 114077, 113906, 113544, 112871, 112284, 112063, 112045, 112088, 112316, 112703, 112950, 113063, 113537, 114658, 116022, 117005, 117375, 117189, 116527, 115693, 115300, 115777, 116915, 118102, 118829, 118854, 118233, 117348, 116639, 116146, 115624, 115157, 115142, 115562, 115828, 115681, 115698, 116547, 118127, 119810, 121124, 121839, 121804, 121182, 120541, 120337, 120539, 120978, 121673, 122506, 123045, 123120, 123175, 123629, 124256, 124679, 125022, 125585, 126251, 126787, 127385, 128251, 128981, 129011, 128482, 128049, 127974, 128077, 128412, 129247, 130385, 131197, 131471, 131640, 131997, 132148, 131477, 129814, 127556, 125465, 124365, 124691, 126113, 127726, 128696, 128707, 128046, 127520, 127994, 129613, 131515, 132682, 132939, 132859, 132908, 133114, 133384, 133617, 133540, 132916, 131932, 131007, 130328, 129954, 130242, 131565, 133600, 135413, 136303]
54939A36303j39j019j597j388j79J331K216K391K388K382K182J969K248L050L900
54924A56038M702N936P750R398R984R421Q304O990N176K498o42l145m258m440
54910B13712m769n634o364o301n720n312n220n061m647m183l795l357k806k292
54896A48251j909j561j071l34O65J760K520K513J709O76K28Q28K187L552M472
54881A64486N210O218P362Q080Q172Q024P851P238N678L232M73k005l818m869
54867B21332n445o017o736p251p199o679o081n689n512n292m658l536k448k043
54853A46746k219k231j720j164j088j380j696k001k258k075j225l02j93j013j958
54838A24223k178j504m10M18N23l4p54j087p48K27J382J961J551O67K17L66M81
$$ y = [136303, 136164, 135145, 133548, 132160, 131981, 133312, 135528, 137919, 140307, 142689, 144871, 146840, 149088, 152138, 156038, 160740, 166676, 174426, 183824, 193808, 203229, 211533, 218523, 223699, 226197, 225555, 222410, 218152, 213712, 208943, 203309, 196945, 190644, 184924, 179612, 174392, 169331, 164684, 160501, 156706, 153349, 150543, 148251, 146342, 144781, 143710, 143376, 144041, 145801, 148321, 150834, 152543, 153219, 153447, 154275, 156462, 160014, 164486, 169696, 175914, 183276, 191356, 199528, 207552, 215403, 222641, 228319, 231551, 232024, 230019, 226201, 221332, 215887, 209870, 203134, 195883, 188684, 182005, 175924, 170235, 164723, 159431, 154773, 151237, 148789, 146746, 144527, 142296, 140576, 139412, 138324, 136944, 135248, 133247, 130989, 128914, 127689, 127387, 127194, 126181, 124223, 122045, 120541, 120131, 120549, 121072, 121038, 120284, 119197, 118449, 118676, 120058, 122019, 123570, 124237, 124454, 124820, 125301]
54821A25301K77K20N46O61N6q44j314j280j039n78K04R94J460J723J866J486M61
54804A30200m08l14L85Q03Q70J076J271Q63J05r4L31M59j13p26q65q12o34K43
54786A32640J854L035K815J744J042J009J115J151J395J811J991J865J860K335
54772A57662L287M577O042P369Q266Q697Q755Q380P512O343N051L470J381r44
54758B35848k917m328n491o679p727q227p926o921n672m802m552m480l890k653
54744A59583j376p19p37r31q01l35rk06o24m48O35J924K519K399K260K429K668
54727A68231L013M020N794P460Q089P794P351P012O311M820K573k46l357o094
54713B22771p659p913p539p151o667n809m848m361m401m383l794k754j800j330
$$ y = [125301, 125578, 125798, 126344, 127005, 127061, 126217, 124903, 123623, 122584, 122006, 122210, 123204, 124664, 126387, 128253, 129739, 130200, 129792, 129478, 129863, 130666, 131536, 132612, 133883, 134746, 134851, 134757, 135088, 135547, 135434, 134708, 133843, 133031, 132397, 132640, 134494, 137529, 140344, 142088, 143130, 144139, 145254, 146405, 147800, 149611, 151602, 153467, 155327, 157662, 160949, 165526, 171568, 178937, 187203, 195900, 204655, 213035, 220547, 226890, 231941, 235411, 236792, 235848, 232931, 228603, 223112, 216433, 208706, 200479, 192553, 185632, 179960, 175158, 170606, 166126, 162236, 159583, 158207, 157488, 156751, 155820, 155019, 154684, 154675, 154469, 153845, 153397, 154032, 155956, 158475, 160874, 163134, 165563, 168231, 171244, 175264, 181058, 188518, 196607, 204401, 211752, 218764, 225075, 229895, 232468, 232222, 228865, 222771, 215112, 207199, 199660, 192509, 185842, 180033, 175185, 170824, 166423, 162040, 158246, 155492, 153692, 152362]
54699A52362j320j475j486j205o62r8M3n88j781k708k626j625m15M44P87M85m84
54682A37648j537j704p49M34R14P35M30R4m05p55n16rk6p19j358j300o03L32J140
54663A32046J427R79J72l32m29o09j005j121o60p8J32J52L94P94J021J007Q39
54646A34729M64n6k71J32P49Q92M94J17Q3J25r9m88o76m50M0L77J98l74p13l36
54626A34937M93J018Q72L69l2l22p59j296j500j083k84M11Q28J101J215Q84J15
54609A36967n20n40j91rO7M93J139J266O86J63K95N63J57o90r55l07M19L42l66
54590A38979q66p41l33r6j6J42L74M60M12M53N33K49n16j259j479j277r25j94
54572A33900J126K360K432J238j40p97q19n74k1P93J230P86n4k66N02J622K243
$$ y = [152362, 151042, 149567, 148081, 146876, 146214, 146116, 146159, 145571, 143790, 141082, 138456, 136831, 136416, 136860, 137647, 138132, 137648, 136111, 134407, 133658, 134092, 135006, 135741, 136171, 136265, 135860, 135105, 134589, 134580, 134554, 133835, 132477, 131177, 130574, 130906, 132046, 133473, 134452, 134624, 134292, 133863, 133254, 132249, 131128, 130468, 130390, 130522, 130674, 131068, 131862, 132883, 133890, 134729, 135193, 135137, 134866, 134998, 135747, 136639, 137133, 137250, 137333, 137458, 137359, 136871, 136195, 135745, 135785, 136162, 136360, 135986, 135273, 134937, 135430, 136448, 137320, 137689, 137657, 137335, 136576, 135280, 133780, 132697, 132413, 132824, 133652, 134753, 135968, 136852, 136967, 136447, 135907, 135716, 135707, 135774, 136267, 137406, 138672, 139358, 139521, 139816, 140379, 140536, 139846, 138891, 138584, 139003, 139345, 138979, 138113, 137372, 137039, 136943, 136927, 137069, 137443, 137903, 138315, 138768, 139301, 139550, 139034, 137775, 136296, 135019, 134094, 133900, 135026, 137386, 139818, 141056, 140916, 140119, 139300, 138726, 138705, 139498, 140728, 141514, 141460, 141194, 141696, 143318, 145561]
54555A45561K037J238L07m12p83p11q9Q77J559J539J215J184J173L72j115k049
54539A51903j570k40Q46J266J237J012Q55R84J136O61m62j371j449j119r71q79
54523A51839n49k62l11l43k9K03r6m15JR30J526J537J261O90l18j288j595j466
54505A51315j624j971j673m86P94J329R79J47m69j70R29J591Q08p68j583j161
54489A47987l04L88R45J104L22r79j480p16K87N60M02M70O70O54O42R46J269J154
54471A54321P26L88J73l5k0M78J201J594J488J247J240J387J197K99r11j427p33
54454A62613M24R16N71R7j30l22m61j49N67J089J153J024O78l03j733k684k661
54437A60689k115j476o18L21O47K75J82R49J736J572Q77O97R84Q12j4o02k85N47
$$ y = [145561, 147598, 148836, 149143, 148731, 147948, 147237, 147148, 148025, 149584, 151123, 152338, 153522, 154695, 155067, 153952, 151903, 150333, 150093, 150939, 152205, 153442, 154454, 155309, 156293, 157429, 158090, 157628, 156257, 154808, 153689, 152718, 151839, 151290, 151028, 150717, 150374, 150345, 150548, 150452, 150037, 150038, 150968, 152494, 154031, 155292, 155982, 155664, 154376, 152781, 151315, 149691, 147720, 146047, 145561, 146355, 147684, 148663, 148810, 148341, 148171, 149100, 150691, 151499, 150731, 149148, 147987, 147683, 148071, 149016, 150120, 150442, 149463, 147983, 147267, 147554, 148114, 148516, 148986, 149656, 150310, 150952, 151898, 153167, 154321, 155047, 155435, 155608, 155573, 155553, 156031, 157232, 158826, 160314, 161561, 162801, 164188, 165385, 165684, 164773, 163346, 162613, 163037, 163953, 164524, 164621, 164491, 164169, 163708, 163559, 164126, 165215, 166368, 167392, 168070, 167767, 166034, 163350, 160689, 158574, 157098, 156480, 156801, 157448, 157723, 157905, 158854, 160590, 162162, 163039, 163736, 164720, 165532, 165518, 164916, 164631, 165178]
54419A65178J019P09o2o01n40k90m74q69n33P61J923J922J098M33J65l7r4L87
54401A70095J203J624J362P87K67j13k62q6K01L16K80K77K55J56K25N86P70K90
54383A78233n48r50o33MM87N41Lr11j472j168m13J06M48J084J794J930J618J689
54365A81842K268K503K011J603J945K436K155J436J447K446L313K953J515n3j195
54350B08625k018k655k886k662k430k581k773k396j636j408j980k436j927q76
54336A77961k90k92k21J28K44r3m02l64l95r84j923k570k524j802o55M29Q82N58
54318A67687k0k13K5J89o9m76m71P5O25N28k55j063j243p22J09Q43J209J010K75
54299A68043o29j241j414j303j051o51j18L60N47L64J8j31Q3M33N77M47J74k00
$$ y = [165178, 166197, 166906, 166844, 166243, 165703, 165413, 164939, 164070, 163537, 164298, 166221, 168143, 169241, 169674, 169839, 169802, 169708, 170095, 171298, 172922, 174284, 175071, 175338, 175225, 174963, 174877, 175078, 175394, 175674, 175951, 176206, 176362, 176587, 177173, 177943, 178233, 177685, 176735, 176102, 176106, 176593, 177134, 177137, 176226, 174754, 173586, 173173, 173279, 173727, 174811, 176605, 178535, 180153, 181842, 184110, 186613, 188624, 190227, 192172, 194608, 196763, 198199, 199646, 202092, 205405, 208358, 209873, 209820, 208625, 206607, 203952, 201066, 198404, 195974, 193393, 190620, 188224, 186588, 185180, 183200, 180764, 178837, 177961, 177671, 177379, 177158, 177286, 177530, 177437, 177035, 176671, 176276, 175292, 173369, 170799, 168275, 166473, 165818, 166247, 167129, 167687, 167667, 167454, 167479, 167668, 167599, 167123, 166652, 166727, 167352, 167880, 167625, 166562, 165319, 164597, 164706, 165549, 166758, 167768, 168043, 167414, 166173, 164759, 163456, 162405, 161754, 161636, 161996, 162543, 162907, 162925, 162794, 162877, 163310, 163887, 164334, 164508, 164308]
54281A64308n58m02O21J924K368J647O58K39K47K56L30N71N87J83l0M28R25N78
54263A74880k76n49o5K95R0j55k6K09L66P62J499K029J902J327O42j88j138j719
54245A79885j495p17q7j7l62o45m40K36P57M33p01j867k334j971j055PP33Q06
54227A71166L81l3r9K42R21J616J670P59l74n98J78R17Q83L81n5l93o59n22P0
54208A76451N11L15j90m05l11k01n3K98O57P02M70K07n9l39m10j71n0n05j234
54189A75683j449q85j18K42J86R3J40J39j29n45o92l12L21O97O86N54M57K96J74
54170A75538M06R51J254R43K96k87p51j080r67k70N83J109J347J490J365Q30L09
54153A83066K65L53j67j231j970j887j463j329j424j225n32L02P33N27L4n3N18
$$ y = [164308, 163750, 163348, 163969, 165893, 168261, 169908, 170566, 170805, 171052, 171308, 171638, 172209, 172796, 172979, 172949, 173377, 174302, 174880, 174604, 174055, 173990, 174285, 174375, 174220, 174194, 174403, 174769, 175531, 177030, 179059, 180961, 182288, 182930, 182742, 181604, 179885, 178390, 177673, 177586, 177569, 177207, 176562, 176122, 176358, 177115, 177548, 176847, 174980, 172646, 170675, 169620, 169627, 170360, 171166, 171547, 171514, 171415, 171657, 172578, 174194, 175864, 176623, 176249, 175651, 175829, 176746, 177629, 178010, 177955, 177562, 176903, 176381, 176451, 176962, 177277, 177087, 176682, 176371, 176170, 176117, 176415, 177072, 177774, 178244, 178451, 178392, 178053, 177643, 177472, 177422, 176917, 175683, 174234, 173349, 173231, 173473, 173659, 173752, 173892, 174031, 173902, 173357, 172665, 172353, 172674, 173371, 174057, 174611, 175068, 175364, 175538, 175944, 176895, 178149, 179092, 179388, 179101, 178350, 177270, 176303, 176033, 176616, 177725, 179072, 180562, 181927, 182757, 183066, 183331, 183684, 183517, 182286, 180316, 178429, 176966, 175637, 174213, 172988, 172456, 172758, 173491, 174018, 174052, 173999, 174517]
54136A74517J136J040L30j38O8M17K74j55j70L76Q24N73j58o48n29r4K74O62J280
54117A79879J873J901J332P37M53K16j41j84M36J272J629J459J132O86N5k89J85
54100A92631J044J364J274J885L409M533M314L729M329O077P566P979P637O832
54086B54603N307L018N08j832m095o110p169o906n874m780l727k691k102k289
54072B15861k705k502j643q28m41k61r6J2J82O47J174J274J080J334K266L152
54056B18506L369L224L252L357L210K983K939K668J575l2j077r93k81K66L34N7
54040B43357k45k00M13J426K476L390M107M454M403M354M596M649L876K630K013
54025B85699K425L117L378L325L168K619J624R22J069J425R14m75j797k494k869
$$ y = [174517, 175653, 176693, 177023, 176885, 176953, 177370, 177644, 177489, 177319, 177695, 178519, 179092, 178934, 178286, 177757, 177663, 177937, 178599, 179879, 181752, 183653, 184985, 185722, 186175, 186391, 186250, 186066, 186502, 187774, 189403, 190862, 191994, 192680, 192735, 192446, 192631, 193675, 195039, 196313, 198198, 201607, 206140, 210454, 214183, 218512, 224589, 232155, 240134, 247771, 254603, 259910, 262928, 263436, 261604, 257509, 251399, 244230, 237324, 231450, 226670, 222943, 220252, 218150, 215861, 213156, 210654, 209011, 208183, 207742, 207481, 207385, 207397, 207579, 208226, 209400, 210674, 211754, 213088, 215354, 218506, 221875, 225099, 228351, 231708, 234918, 237901, 240840, 243508, 245083, 245051, 243974, 242981, 242700, 242966, 243300, 243357, 243112, 242912, 243325, 244751, 247227, 250617, 254724, 259178, 263581, 267935, 272531, 277180, 281056, 283686, 285699, 288124, 291241, 294619, 297944, 301112, 303731, 305355, 306277, 307346, 308771, 309685, 309210, 307413, 304919, 302050]
54010C02050l271l553l601l742m289n020n374m995m020l002k570k916l560l784
53996B48353l356k664k169j949j810j557j114n32p9p5n33j036j151q91o49o95
53980B28093q53p63l77o5k21p90j235r97j8J035J219K13j212j921j681j249j128
53963B18050q11K50J524K029J783J673K016K193J896J716K107K617K797L152M465
53948B47457O597Q711J0411J1937J3442J4724J5647J6177J5943J4161J0302M810
53936C90319q61n036o972p361p492p810p704o713n326m209l332k315j223m28K4
53921C23561M17R94J913L187M304M445L682L368M566O523P532P037N957N217M874
53906C87577M656M389L747K430P62m94j066j318j522j658j888k472l141l358l300
$$ y = [302050, 298779, 295226, 291625, 287883, 283594, 278574, 273200, 268205, 264185, 261183, 258613, 255697, 252137, 248353, 244997, 242333, 240164, 238215, 236405, 234848, 233734, 233202, 233123, 233048, 232515, 231479, 230328, 229437, 228788, 228093, 227240, 226477, 226100, 226035, 225814, 225024, 223789, 222792, 222774, 223809, 225028, 225241, 224029, 222108, 220427, 219178, 218050, 217239, 217489, 219013, 221042, 222825, 224498, 226514, 228707, 230603, 232319, 234426, 237043, 239840, 242992, 247457, 254054, 262765, 273176, 285113, 298555, 313279, 328926, 345103, 361046, 375207, 385509, 390319, 389458, 384422, 377450, 370089, 362597, 354787, 347083, 340370, 335044, 330835, 327503, 325188, 323965, 323537, 323561, 323978, 324972, 326885, 330072, 334376, 338821, 342503, 345871, 350437, 356960, 364492, 371529, 377486, 382703, 387577, 392233, 396622, 400369, 402799, 403561, 403067, 402001, 400683, 399161, 397503, 395615, 393143, 390002, 386644, 383344]
53891C83344l715m648n248n143n092n786o822p453p624p624p316o472n447m796
53877C00158m448l861k916k143k069k663l342l462k884k209k116k553k927l124
53863B59441l603m396m678l854k408j274q32r44j419j893j813j118m53k70j78
53848B30308J82L17k87j085j235j012j354k199k450j638n48O4K96M30L62J52K84
53831B20587P73Q57J99k56N17K044K840K279J133L13j40n89j028j174q74j37R68
53814B28312K134K772K592K075J990K471K955L028K930L023L198L162L026L141
53800B66809L506L753L739L715L827L916L888L903M052M161M107L980L747L152
53786C20255K182J274P33K85m69j439k230k655k775k703k749l327m359n077m959
$$ y = [383344, 379629, 374981, 369733, 364590, 359498, 353712, 346890, 339437, 331813, 324189, 316873, 310401, 304954, 300158, 295710, 291849, 288933, 286790, 284721, 282058, 278716, 275254, 272370, 270161, 268045, 265492, 262565, 259441, 255838, 251442, 246764, 242910, 240502, 239228, 238396, 237452, 236033, 234140, 232327, 231209, 230756, 230486, 230308, 230490, 230807, 230520, 229435, 228200, 227188, 225834, 223635, 221185, 219547, 218999, 219063, 219359, 219789, 220151, 220303, 220587, 221360, 222217, 222416, 222160, 222677, 224721, 227561, 229840, 230973, 231286, 231146, 230557, 229529, 228355, 227481, 227344, 228312, 230446, 233218, 235810, 237885, 239875, 242346, 245301, 248329, 251259, 254282, 257480, 260642, 263668, 266809, 270315, 274068, 277807, 281522, 285349, 289265, 293153, 297056, 301108, 305269, 309376, 313356, 317103, 320255, 322437, 323711, 324444, 324729, 324260, 322821, 320591, 317936, 315161, 312458, 309709, 306382, 302023, 296946, 291987]
53771B91987m509m490m728m459l625l015l041l235l085k678k248j749j168p74
53757B49183p54j110j911l080l822l140j334r9m57j365j248k91j2q48j410m69
53741B27833J353K421K038Q85j11p26j193j494j232j99J124J896J755J153P20
53726B36223N09J89k83n44l67R5O57J295J862K042J791J548J712K114K291K128
53710B53262J928J921J997J949J722J406J202J371K012K781L122K900K615K707
53696B82895K922K690K047J747K312L327L912L599K587J352L81N5L46O79M98m2
53680C11307l01j50k03q45j586j712j304r99r56o43K39J151J311O13l28r32j112
53663C03550j063q48m20R6L66K17j11k79l20n49r41r75k93P00J171P48j74q77
$$ y = [291987, 287478, 282988, 278260, 273801, 270176, 267161, 264120, 260885, 257800, 255122, 252874, 251125, 249957, 249183, 248429, 247319, 245408, 242328, 238506, 235366, 234032, 233933, 233476, 232111, 230863, 230572, 230560, 229712, 228302, 227833, 229186, 231607, 233645, 234530, 234419, 233693, 232500, 231006, 229774, 229575, 230699, 232595, 234350, 235503, 236223, 236732, 236921, 236638, 236094, 235727, 235822, 236479, 237774, 239636, 241678, 243469, 245017, 246729, 248843, 251134, 253262, 255190, 257111, 259108, 261057, 262779, 264185, 265387, 266758, 268770, 271551, 274673, 277573, 280188, 282895, 285817, 288507, 290554, 292301, 294613, 297940, 301852, 305451, 308038, 309390, 309771, 309826, 310172, 310851, 311349, 311307, 311006, 310856, 310653, 309808, 308222, 306510, 305206, 304207, 303251, 302608, 302847, 303998, 305309, 305922, 305594, 304662, 303550, 302487, 301639, 301219, 301315, 301681, 301898, 301787, 301508, 301188, 300639, 299698, 298723, 298430, 299130, 300301, 301049, 300875, 299998]
53645B99998q58j04Q51J229P71J59L42J317K098J966J350J103J332J468J306J328
53629C15656J852K400K283J606J216J642K427K718K346K017K399L309M005M116
53615C49992L972M068M501N064N600O104O587P066P557P820P293N625L344J639
53601D26232J236J661J866J369N39j75p96j462j871j552o14J77J98m25j173j711
53585D23499j927j632p74J83M84j51j277k257k758k661j961j002m89p45j198j022
53569D04312k71J48l43j256j703j409p54p8N36R30P97J86l23k56J05P7m70q68
53551C99360m92N13J441J803J589J041M60J70L27P70J266J808K446K904K868K597
53535D20871K711L338L877L897L755M034M783N654O444P076P435P656Q262R521
$$ y = [299998, 299140, 299036, 299887, 301116, 301887, 302046, 302388, 303705, 305803, 307769, 309119, 310222, 311554, 313022, 314328, 315656, 317508, 319908, 322191, 323797, 325013, 326655, 329082, 331800, 334146, 336163, 338562, 341871, 345876, 349992, 353964, 358032, 362533, 367597, 373197, 379301, 385888, 392954, 400511, 408331, 415624, 421249, 424593, 426232, 427468, 429129, 430995, 432364, 432903, 432728, 431932, 430470, 428599, 427047, 426433, 426610, 426808, 426383, 425210, 423499, 421572, 419940, 419166, 419349, 419833, 419682, 418405, 416148, 413390, 410729, 408768, 407766, 407277, 406532, 405334, 404312, 404041, 404189, 403846, 402590, 400887, 399478, 398724, 398646, 399182, 400112, 400909, 401095, 400772, 400516, 400621, 400698, 400228, 399360, 398868, 399381, 400822, 402625, 404214, 405255, 405715, 405885, 406212, 406982, 408248, 410056, 412502, 415406, 418274, 420871, 423582, 426920, 430797, 434694, 438449, 442483, 447266, 452920, 459364, 466440, 473875, 481531, 489793, 499314]
53521D99314J0940J1892J2463J3091J3669J3765J3620J4065J5333J6748J7808
53510F52708J8789J9961K0871K0975K0504K0161K0289K0720K1232K1638K1706
53499H79554K1338K0755K0245J9822J9379J8890J8342J7704J7143J6953J7085
53488A087210J7126J6973J7072J7630J8100J7912J7301J6851J6582J6125J5532
53477A274414J5175J5030J4702J4117J3445J2473J0780Q573O539M748K526l02
53465A392220k862m459n664p496r907j1819j2566j2601j2732j3210j3772j4294
53453A270838j4963j5910j6924j7687j8195j8666j9060j8982j8255j7346j6892
53442A077958j6933j6971j6553j5531j3868j1724r608p973o617n046l361k191
$$ y = [499314, 510254, 522146, 534609, 547700, 561369, 575134, 588754, 602819, 618152, 634900, 652708, 671497, 691458, 712329, 733304, 753808, 773969, 794258, 814978, 836210, 857848, 879554, 900892, 921647, 941892, 961714, 981093, 999983, 1018325, 1036029, 1053172, 1070125, 1087210, 1104336, 1121309, 1138381, 1156011, 1174111, 1192023, 1209324, 1226175, 1242757, 1258882, 1274414, 1289589, 1304619, 1319321, 1333438, 1346883, 1359356, 1370136, 1378709, 1385248, 1389996, 1392522, 1392220, 1389358, 1384899, 1379235, 1371739, 1361832, 1350013, 1337447, 1324846, 1312114, 1298904, 1285132, 1270838, 1255875, 1239965, 1223041, 1205354, 1187159, 1168493, 1149433, 1130451, 1112196, 1094850, 1077958, 1061025, 1044054, 1027501, 1011970, 998102, 986378, 976770, 968797, 962180, 957134, 953773, 951582]
53430I51582j693j229l17P28J438J965K778M066N767P810R913J1520J2416J3038
53416A019782J3858J4799J5648J6587J7800J8995J9931K0994K2640K4557K6140
53405A231731K7506K9199L1016L2125L2404L2864L4353L6628L8995M1203M3285
53394A611309M5065M6372M7452M8632M9891N0989N1853N2447N2489N1663N0013
53383B158175M7924M5816M3991M2542M1220L9591L7487L5121L2573K9506K5660
53372B579606K1394J7323J3563R667N230K60n008j0366j5693k0988k6367l1826
53360B536795l7009m1306m4248m5770m6249m6396m6807m7436m7606m6843m5569
53349B041556m4619m4205m3732m2672m1217l9900l8961l8313l7876l7580l7099
$$ y = [951582, 949889, 948660, 948343, 949071, 950509, 952474, 955252, 959318, 965085, 972895, 982808, 994328, 1006744, 1019782, 1033640, 1048439, 1064087, 1080674, 1098474, 1117469, 1137400, 1158394, 1181034, 1205591, 1231731, 1259237, 1288436, 1319452, 1351577, 1383981, 1416845, 1451198, 1487826, 1526821, 1568024, 1611309, 1656374, 1702746, 1750198, 1798830, 1848721, 1899710, 1951563, 2004010, 2056499, 2108162, 2158175, 2206099, 2251915, 2295906, 2338448, 2379668, 2419259, 2456746, 2491867, 2524440, 2553946, 2579606, 2601000, 2618323, 2631886, 2641553, 2646783, 2647043, 2642035, 2631669, 2615976, 2594988, 2568621, 2536795, 2499786, 2458480, 2414232, 2368462, 2322213, 2275817, 2229010, 2181574, 2133968, 2087125, 2041556, 1996937, 1952732, 1909000, 1866328, 1825111, 1785211, 1746250, 1707937, 1670061, 1632481, 1595382]
53338A595382l5971l4152l2191l0640k9310k7408k4587k1571j9381j8037j6554
53327A305580j4389j2353j1561j1856j1953j1214j0458j0756j1927j2784j2567
53316A173762j1568j0433r394q370p392o603n907m972l582j935m59N71J272K028
53302A107018L156M684O377P921R178J0282J1527J3076J4830J6622J8396K0095
53290A243162K1503K2473K3190K3909K4343K3751K1914J9648J8035J7324J6970
53279A476222J6551J5969J4901J2774R585O186L297O82k215n190p540r159j0676
53266A521387j2497j4371j6133j8152k0642k3067k4746k5715k6440k7035k7280
53255A285309k7256k7303k7382k7114k6460k5861k5530k5227k4844k4610k4454
$$ y = [1595382, 1559411, 1525259, 1493068, 1462428, 1433118, 1405710, 1381123, 1359552, 1340171, 1322134, 1305580, 1291191, 1278838, 1267277, 1255421, 1243468, 1232254, 1221796, 1211040, 1199113, 1186329, 1173762, 1162194, 1151761, 1142367, 1133997, 1126605, 1120002, 1114095, 1109123, 1105541, 1103606, 1103147, 1103718, 1104990, 1107018, 1110174, 1114858, 1121235, 1129156, 1138334, 1148616, 1160143, 1173219, 1188049, 1204671, 1223067, 1243162, 1264665, 1287138, 1310328, 1334237, 1358580, 1382331, 1404245, 1423893, 1441928, 1459252, 1476222, 1492773, 1508742, 1523643, 1536417, 1546002, 1552188, 1555485, 1556167, 1553952, 1548762, 1541222, 1532063, 1521387, 1508890, 1494519, 1478386, 1460234, 1439592, 1416525, 1391779, 1366064, 1339624, 1312589, 1285309, 1258053, 1230750, 1203368, 1176254, 1149794, 1123933, 1098403, 1073176, 1048332, 1023722, 999268]
53244I99268k3847k2656k1576k1175k1070k0689k0367k0734k1342k0918j9050
53233G65844j6718j4962j3872j3124j2638j2250j1485j0258r247q904q639p694
53221F26053o430n954o672p948r098j0019j0844j1593j2247j2631j2274j0989
53209E09354r465q641q434p930o899o249o624p392p615p326p119p055o776o406
53195D05423o427o770o811o380o036o163o365o075n313m511l908l439l102l056
53181C31067l385l938m388m450m052l408k876k654k642k569k320k067k066k279
53167B87973k291j748q14J2N10P89P93J44j245k731l435l081k031q07J60N28K70
53150B72996j99n02p98j361j868j667p62P7L01J58L7j73o89j211j269r07n44k57
$$ y = [999268, 975421, 952765, 931189, 910014, 888944, 868255, 847888, 827154, 805812, 784894, 765844, 749126, 734164, 720292, 707168, 694530, 682280, 670795, 660537, 651290, 642386, 633747, 626053, 619623, 613669, 606997, 599049, 589951, 579932, 569088, 557495, 545248, 532617, 520343, 509354, 499889, 491248, 482814, 474884, 467985, 461736, 455112, 447720, 440105, 432779, 425660, 418605, 411829, 405423, 398996, 392226, 385415, 379035, 372999, 366836, 360471, 354396, 349083, 344572, 340664, 337225, 334123, 331067, 327682, 323744, 319356, 314906, 310854, 307446, 304570, 301916, 299274, 296705, 294385, 292318, 290252, 287973, 285682, 283934, 283120, 283132, 283642, 284431, 285224, 285368, 284123, 281392, 277957, 274876, 272845, 272038, 272198, 272726, 272996, 272797, 272295, 271497, 270136, 268268, 266601, 265839, 265916, 266217, 266375, 266412, 266239, 265550, 264339, 263070, 262163, 261619, 261362]
53132B61362K48R35J326J257J304J992K845K850J841Q51P70J128Q77P5o2J050
53116B80649K328K305R49m55r17n57L7M86N43N9o76j016p51m67q06j622k203k210
53098B75676j992j955j928j365j83Q70R12k4r82j228r96q39p21k88K70L52p7l27
53080B65175N7O95R07M15n20j248j028K19J439J428L92k92n6R1p45j837j899r68
53062B62225j87j26l35m41o17q96q60l62J01Nn76j200j476j176k98P32J287J163
53044B56963P88O34P07P36O55O27P51Q66P40L22j44l57k71j02QJ20K14O9l70p48
53024B62208o89k80J18L76N65P03Q41J240J926K215J320l96j438p80Q51J782J340
53007B71902M89N13J390J931J307L1q10q83o54m13JM76L98m13j188j163n87j99
$$ y = [261362, 261610, 262545, 263871, 265128, 266432, 268424, 271269, 274119, 275960, 276811, 277581, 278709, 279586, 279661, 279599, 280649, 282977, 285282, 286231, 285776, 284859, 284302, 284339, 284825, 285368, 285427, 284751, 283735, 282984, 282517, 281711, 280089, 277886, 275676, 273684, 271729, 269801, 268436, 268253, 269123, 270035, 270011, 269029, 267801, 266805, 265966, 265245, 264957, 265227, 265579, 265502, 265175, 265232, 265927, 266834, 267249, 266729, 265481, 264453, 264672, 266111, 267539, 267931, 267639, 267583, 267674, 266929, 265092, 263193, 262225, 262038, 261912, 261577, 261136, 260519, 259623, 258763, 258401, 258502, 258507, 257931, 256731, 255255, 254079, 253781, 254513, 255800, 256963, 257751, 258385, 259092, 259828, 260483, 261110, 261861, 262727, 263467, 263789, 263645, 263288, 263017, 262915, 262923, 263043, 263257, 263326, 262956, 262208, 261519, 261239, 261357, 261733, 262298, 263001, 263842, 265082, 267008, 269223, 270543, 270147, 268709, 267929, 268780, 270562, 271902, 272391, 272904, 274294, 276225, 277532, 277563, 276753, 275870, 275216, 274803, 274804, 275280, 275678, 275265, 274077, 272914, 272327, 272128]
52989B72128q9J73O00P53N69M72O76R31J126J470J946K166J932J583J536J836
52973B89808K246K386J842N72p00j008k16Q54J423J441J156N81k32q20o77J27
52957B98783R13R38Kj313k098k054j824k086k584k612k171j861j724j164j00P12
52941B79757Q48P52P20L10o19j220q39j46k01r00j305j098p34m51j28M6k36o57
52923B73899o15k89l83p99o63J40N81R4m68k18L53K59l45m92l6K08m9j08M12P03
52903B72184p7j425k033j433m16J27R5j60l98l86J74J170J905J862J425J276J358
52886B75248J080M49J49M00M59k49j203j530j194p99n55j31N52J093J236J189
52870B76194J192J197J169J268J556J805J846J892K238K749K871K192Q77n03j545
$$ y = [272128, 272039, 272212, 272812, 273565, 274134, 274606, 275282, 276213, 277339, 278809, 280755, 282921, 284853, 286436, 287972, 289808, 292054, 294440, 296282, 296854, 296154, 295146, 294930, 295784, 297207, 298648, 299804, 300385, 300153, 299333, 298656, 298783, 299696, 300634, 300636, 299323, 297225, 295171, 293347, 291261, 288677, 286065, 283894, 282033, 280309, 279145, 279045, 279757, 280605, 281357, 282077, 282387, 281768, 280548, 279709, 279563, 279362, 278462, 277157, 276059, 275325, 274874, 274746, 274792, 274556, 273899, 273284, 272995, 272612, 271813, 271150, 271290, 271871, 271965, 271497, 271279, 271632, 271891, 271546, 271054, 271018, 271226, 271177, 271069, 271481, 272184, 272107, 270682, 268649, 267216, 266800, 266927, 267022, 266862, 266464, 266078, 266252, 267422, 269327, 271189, 272614, 273890, 275248, 276328, 276777, 276926, 277326, 277785, 277536, 276333, 274803, 273609, 272810, 272255, 272124, 272676, 273769, 275005, 276194, 277386, 278583, 279752, 281020, 282576, 284381, 286227, 288119, 290357, 293106, 295977, 298169, 299046, 298543, 296998]
52855B96998k321l067l660l666k967k098j696j817k054k174k292k436k359j920
52841B62471j375j121j236j446j492j443j550j850j978j557o58K51R08J486K108
52826B51518K445K096J173K11l76m99k09K68M67J11m00l31M46J267J549J455J495
52809B62686J797K053J913J275K91n89q30l22L42L73m10j456k108k211k036j867
52793B58901j737j553j293j062r60r55r42q60p13n10k55K3L08O26R90J320J527
52776B52855J625J681J629J261M83m63j064r22j05Q10J182Q66K84j42m56r04j366
52759B57254j361p36L5M33N34P52J081J021L39m71p23l11L40R30J516K097K410
52742B65140K306K033J851J551P29n24j507j556o85N02J406J922K328K725K699
$$ y = [296998, 294677, 291610, 287950, 284284, 281317, 279219, 277523, 275706, 273652, 271478, 269186, 266750, 264391, 262471, 261096, 259975, 258739, 257293, 255801, 254358, 252808, 250958, 248980, 247423, 246765, 247016, 247924, 249410, 251518, 253963, 256059, 257232, 257443, 257067, 256568, 256359, 256627, 257094, 257205, 256805, 256474, 256920, 258187, 259736, 261191, 262686, 264483, 266536, 268449, 269724, 270015, 269426, 268596, 268274, 268616, 268989, 268579, 267123, 265015, 262804, 260768, 258901, 257164, 255611, 254318, 253256, 252296, 251341, 250399, 249539, 248826, 248316, 248061, 248084, 248392, 249018, 250008, 251328, 252855, 254480, 256161, 257790, 259051, 259534, 259071, 258007, 257085, 256980, 257790, 258972, 259838, 260122, 259980, 259524, 258620, 257254, 255893, 255157, 255192, 255625, 256159, 256911, 257992, 259013, 259352, 258881, 258158, 257847, 258187, 259117, 260633, 262730, 265140, 267446, 269479, 271330, 272881, 273610, 273086, 271579, 270023, 269338, 269840, 271246, 273168, 275496, 278221, 280920]
52727B80920J755J26j303j929j951j708j074K1R34R62L67k6j07m32r59r33k91
52710B74372n9p80j531j292m91k19n09m96N8N06M80L48L87M16M48R16J873K549
52692B76976K144P37q29j738j717j056l06J73L85L52j30j064j817j675p44J89
52676B69880O73Q61Q83N58n5n25o56p19q33o92j70L26N00O58J142J667J733J408
52658B76639J194J287J452J545J702J986K126J815J116M89L57N83N07k64j226
52643B91308j483r31m39o90j248j199l55N50Q06M77J97M86J306K272L159M078
52627B98294M990N278M258K125q5j614k624l552m376m758m554l764k442j015k72
52612B85889n36j124j184p52m51m34l25K4L78O97J115J344Q98K6l21J79P59P93
$$ y = [280920, 282675, 282801, 281498, 279569, 277618, 275910, 274836, 274857, 275791, 276753, 277120, 277094, 276987, 276555, 275596, 274663, 274372, 274313, 273533, 272002, 270710, 270219, 270000, 269491, 268995, 269053, 269559, 270039, 270387, 270774, 271190, 271638, 272554, 274427, 276976, 279120, 279857, 279028, 277290, 275573, 274517, 274211, 274384, 274769, 275121, 274991, 273927, 272110, 270435, 269691, 269880, 270553, 271414, 272297, 272855, 272800, 272275, 271619, 270900, 270067, 269375, 269205, 269531, 270031, 270689, 271831, 273498, 275231, 276639, 277833, 279120, 280572, 282117, 283819, 285805, 287931, 289746, 290862, 291351, 291708, 292291, 292798, 292534, 291308, 289825, 288894, 288455, 287765, 286517, 285318, 284963, 285513, 286319, 286796, 286993, 287479, 288785, 291057, 294216, 298294, 303284, 308562, 312820, 314945, 314860, 313246, 310622, 307070, 302694, 297936, 293382, 289618, 287176, 286161, 285889, 285353, 284229, 283045, 282293, 281842, 281408, 281083, 281107, 281485, 282182, 283297, 284641, 285539, 285565, 285244, 285423, 286182, 286975]
52594B86975P32J156J550R90k83r86o01k7k34r00r71p8J114J734J479O77j8j19
52576B92190K49M90K95O9K44N15K41n19j029r34o24m25j34L04L16m66j374j402
52558B88006n77O1j53p94j097q90n80n02n89n48k11K29M29L46K85L32J28n07j004
52539B82364o94J57O24L88P6K23N02L72m8j69L00J069J617J592J040M04J50L35
52521B90302O89J056J453J708J530J040P80J022J486J915K462L196L691L520K828
52506C18678K020J149J0j333k489l161l341l134k656k049j465j041r18j114j402
52491B97754j514j444j316j009l33M77R08Q38N58J22o50j425j366k78R30J425
52475B93677J362J238J030O41N85J349K471L051K874K345J659Q74N06J084K216
$$ y = [286975, 287707, 288863, 290413, 291403, 291120, 290134, 289533, 289506, 289272, 288372, 287401, 287323, 288437, 290171, 291650, 292327, 292309, 292190, 292439, 292929, 293224, 293293, 293537, 294052, 294293, 293774, 292745, 291811, 291187, 290762, 290628, 290932, 291248, 290782, 289408, 288006, 287429, 287490, 287337, 286543, 285446, 284556, 283976, 283474, 282885, 282337, 282126, 282355, 282784, 283130, 283415, 283747, 283875, 283368, 282364, 281670, 281827, 282451, 282839, 282915, 283138, 283640, 284012, 283964, 283795, 284095, 285164, 286781, 288373, 289413, 289817, 289967, 290302, 290991, 292047, 293500, 295208, 296738, 297778, 298558, 299580, 301066, 302981, 305443, 308639, 312330, 315850, 318678, 320698, 321847, 321857, 320524, 318035, 314874, 311533, 308399, 305743, 303694, 302229, 301188, 300270, 299156, 297754, 296240, 294796, 293480, 292471, 292138, 292615, 293523, 294361, 294919, 295041, 294391, 292966, 291600, 291322, 292252, 293677, 295039, 296277, 297307, 297948, 298533, 299882, 302353, 305404, 308278, 310623, 312282, 313156, 313662, 314746, 316962]
52460C16962K861K572J756Q04k34j180j739k100k778l694m148l781k936j974r83
52445B99408l06m61j216j505p90J62L23l00r47j251j435j651j726j487j005m75
52429B85338k5L47P48J123J140O01o4j82K96Q10J123J582K211K344J591N94K56
52412B99833O65J398K406L822N199N857O010O713Q457J0447J1507J1114R283O054
52398C88765J796k321m972n915o086o340o575o378n931n674n342m179k215n91
52384C28042j57m09k94L51Q43P96N02L16M16J052K364L779M321L766K903K456
52368C51047K357K301K359K573K556K005J256Q26O78L86j86q02j221j305r70l90
52352C63470m2j71m25l90k37m02q22q99k18J047K317L006K939K668L056M108M665
$$ y = [316962, 319823, 322395, 324151, 324955, 324721, 323541, 321802, 319702, 316924, 313230, 309082, 305301, 302365, 300391, 299408, 299102, 298641, 297425, 295920, 295130, 295292, 295615, 295315, 294368, 293117, 291682, 290031, 288305, 286818, 285813, 285338, 285313, 285660, 286408, 287531, 288671, 289272, 289208, 289026, 289322, 290132, 291255, 292837, 295048, 297392, 298983, 299577, 299833, 300498, 301896, 304302, 308124, 313323, 319180, 325190, 331903, 340360, 350807, 362314, 373428, 382711, 388765, 390561, 388240, 383268, 377353, 371267, 364927, 358352, 351974, 346043, 340369, 335027, 330848, 328633, 328042, 327885, 327476, 327182, 327533, 328376, 329172, 329674, 329990, 330406, 331458, 333822, 337601, 341922, 345688, 348591, 351047, 353404, 355705, 358064, 360637, 363193, 365198, 366454, 367280, 367958, 368344, 368158, 367356, 366135, 364830, 363860, 363470, 363428, 363257, 362832, 362442, 362205, 361803, 360981, 360082, 359864, 360911, 363228, 366234, 369173, 371841, 374897, 379005, 383670]
52335C83670L851K519K414L957N753O507O576P130Q485R956J0963J1555J1920
52322D75256J1988J1742J1429J1284J1246J1128J0945J0861J0954J1176J1552
52311E99561J2219J3213J4368J5423J6207J6616J6638J6514J6716J7503J8486
52300G73464J8884J8342J7256J6258J5533J4731J3390J1349Q869O453M441K781
52288I21751J281%q72j499k302l267l761l373k638k524l281m157m229l330k082
52273H85717j246j005q42j39J138K417L213L578L857M261M839N629O643P855R193
52258I35108J0438J1171J1262J1388J2435J4194J5305J4856J3454J2212J1294
52247A073117J0159Q751P443O117M316K279R12M41o0j428l349m873n488n389n106
$$ y = [383670, 387521, 390040, 392454, 396411, 402164, 408671, 415247, 422377, 430862, 440818, 451781, 463336, 475256, 487244, 498986, 510415, 521699, 532945, 544073, 555018, 565879, 576833, 588009, 599561, 611780, 624993, 639361, 654784, 670991, 687607, 704245, 720759, 737475, 754978, 773464, 792348, 810690, 827946, 844204, 859737, 874468, 887858, 899207, 908076, 914529, 918970, 921751, 923032, 923032, 922160, 920661, 918359, 915092, 911331, 907958, 905320, 902796, 899515, 895358, 891129, 887799, 885717, 884471, 883466, 882624, 882485, 883623, 886040, 889253, 892831, 896688, 900949, 905788, 911417, 918060, 925915, 935108, 945546, 956717, 967979, 979367, 991802, 1005996, 1021301, 1036157, 1049611, 1061823, 1073117, 1083276, 1092027, 1099470, 1105587, 1109903, 1112182, 1113094, 1113535, 1113475, 1112047, 1108698, 1103825, 1098337, 1092948, 1087842]
52232A087842n204o003p286q458r176r516r568r338r079r210r592r492q598p541
52218I69781p010o768o076m750l300k188j475r85m30N28J877L060L499L261K816
52203I51840K304J546P78P57J904L613M821N076M906N135O000O932P186O581N542
52188A014921M464L283J839L17q97j805k873m467o328p683p887p039n998n672
52174I74175o188o827o790n916m602l334k376j692r60R4J220J801J639J247J069
$$ y = [1087842, 1082638, 1076635, 1069349, 1060891, 1051715, 1042199, 1032631, 1023293, 1014214, 1005004, 995412, 985920, 977322, 969781, 962771, 956003, 949927, 945177, 941877, 939689, 938214, 937229, 936799, 937327, 939204, 942264, 945763, 949024, 951840, 954144, 955690, 956468, 957225, 959129, 962742, 967563, 972639, 977545, 982680, 988680, 995612, 1002798, 1009379, 1014921, 1019385, 1022668, 1024507, 1024824, 1023927, 1022122, 1019249, 1014782, 1008454, 1000771, 992884, 985845, 979847, 974175, 967987, 961160, 954370, 948454, 943852, 940518, 938142, 936450, 935490, 935584, 936804, 938605, 940244, 941491, 942560]
$$ [...]
##END NTUPLES=NMR SPECTRUM
##END=
