
##TITLE=UV1238_M8_1260-1248_30_7240900_m97PJ6L8Xe
##JCAMPDX= 6.0         $$ Bruker NMR JCAMP-DX V2.0
##DATA TYPE= NMR SPECTRUM
##DATA CLASS= NTUPLES
##ORIGIN= BRUKER
##OWNER= Administrator
$$ 1.72 TOPSPIN		Version 2.1
$$ 2013-01-18 22:12:31.683 -0500  Administrator@X
$$ Compression mode = diff/dup
##.OBSERVE FREQUENCY= 400.02188249412
##.OBSERVE NUCLEUS= ^1H
##.ACQUISITION MODE= SIMULTANEOUS (DQD)
##.ACQUISITION SCHEME= undefined
##.AVERAGES= 8
##.DIGITISER RES= 22
##SPECTROMETER/DATA SYSTEM= spect
##.PULSE SEQUENCE= zg30
##.SOLVENT NAME= COFFEE_meoh
##.SHIFT REFERENCE= INTERNAL, COFFEE_meoh, 1, 14.98509
##AUDIT TRAIL= $$ (NUMBER, WHEN, WHO, WHERE, PROCESS, VERSION, WHAT)
$$ ##TITLE= Audit trail, TOPSPIN		Version 2.1
$$ ##JCAMPDX= 5.01
$$ ##ORIGIN= Bruker BioSpin GmbH
$$ ##OWNER= Administrator
$$ $$ E:\/data/COFFEE/nmr/UV1238_M8_1260-1248_30_7240900_m97PJ6L8Xe/20/pdata/1/auditp.txt
$$ ##AUDIT TRAIL=  $$ (NUMBER, WHEN, WHO, WHERE, PROCESS, VERSION, WHAT)
(   1,<2013-01-18 22:12:23.495 -0500>,<Administrator>,<X>,<go>,<TOPSPIN 2.1>,
      <created by zg
	started at 2013-01-18 22:11:17.479 -0500,
	POWCHK enabled, PULCHK disabled,
       configuration hash MD5:
       86 BA 57 50 F2 9D 5C 9B 26 00 A9 28 5F 66 2E 89
       data hash MD5: 64K
       EC 03 9B 84 24 15 1F 12 81 7A B5 06 E0 B4 99 B1>)
(   2,<2013-01-18 22:12:26.620 -0500>,<Administrator>,<X>,<proc1d>,<TOPSPIN 2.1>,
      <Start of raw data processing
       efp LB = 0 FT_mod = 6 PKNL = 1 PHC0 = 0 PHC1 = 0 SI = 32K 
       data hash MD5: 32K
       EE 4D F9 54 32 6D 9B CE 49 03 B7 6F 77 96 1B 67>)
(   3,<2013-01-18 22:12:27.073 -0500>,<Administrator>,<X>,<proc1d>,<TOPSPIN 2.1>,
      <pk PHC0 = 93.89465 PHC1 = 0 
       data hash MD5: 32K
       72 23 F5 9E 0B 7B 6B 88 9B 15 A6 0B 20 AF CA 1E>)
(   4,<2013-01-18 22:12:27.308 -0500>,<Administrator>,<X>,<proc1d>,<TOPSPIN 2.1>,
      <abs ABSG = 1 
       data hash MD5: 32K
       CF 21 09 7F 38 5A AC 30 3A B0 AE 1F 8A 51 80 2F>)
(   5,<2013-01-18 22:12:27.448 -0500>,<Administrator>,<X>,<proc1d>,<TOPSPIN 2.1>,
      <abs ABSG = 2 
       data hash MD5: 32K
       E2 28 CC A7 9F D7 05 51 E5 B5 26 9E 6C 8D B3 D5>)
(   6,<2013-01-18 22:12:27.589 -0500>,<Administrator>,<X>,<proc1d>,<TOPSPIN 2.1>,
      <abs ABSG = 3 
       data hash MD5: 32K
       9D B0 CC 9F C4 47 40 AD 49 44 C4 58 87 26 01 30>)
(   7,<2013-01-18 22:12:27.729 -0500>,<Administrator>,<X>,<proc1d>,<TOPSPIN 2.1>,
      <abs ABSG = 4 
       data hash MD5: 32K
       6C 7C 06 0A 41 D9 06 C6 68 6A 8D CA 52 15 E3 70>)
(   8,<2013-01-18 22:12:27.886 -0500>,<Administrator>,<X>,<proc1d>,<TOPSPIN 2.1>,
      <abs ABSG = 5 
       data hash MD5: 32K
       DB 0E 16 FD 26 AE 77 6C 91 07 B8 85 8F 9E 06 EB>)
$$ ##END=
$$ 
$$ $$ hash MD5
$$ $$ 1D FE F7 7F 7F CB 1F 0B 5E B3 B4 A9 EA 0B A9 9B
##$RELAX= 
##$RELAX= 
##$RELAX= 
##$RELAX= 
##$RELAX= 
##$RELAX= 
##$RELAX= 
$$ Bruker specific parameters
$$ --------------------------
##$DU= <E:\>
##$EXPNO= 20
$$ [...]
##$TP= (0..7)
150 150 150 150 150 150 150 150
##$TP07= 0
##$TPNAME0= <>
##$TPNAME1= <>
##$TPNAME2= <>
##$TPNAME3= <>
##$TPNAME4= <>
##$TPNAME5= <>
##$TPNAME6= <>
##$TPNAME7= <>
##$TPOAL= (0..7)
0.5 0.5 0.5 0.5 0.5 0.5 0.5 0.5
##$TPOFFS= (0..7)
0 0 0 0 0 0 0 0
##$TUNHIN= 0
##$TUNHOUT= 0
##$TUNXOUT= 0
##$USERA1= <user>
##$USERA2= <user>
##$USERA3= <user>
##$USERA4= <user>
##$USERA5= <user>
##$V9= 5
##$VALIST= <valist>
##$VCLIST= <CCCCCCCCCCCCCCC>
##$VD= 0
##$VDLIST= <DDDDDDDDDDDDDDD>
##$VPLIST= <PPPPPPPPPPPPPPP>
##$VTLIST= <TTTTTTTTTTTTTTT>
##$WBST= 1024
##$WBSW= 4
##$XGAIN= (0..3)
0 0 0 0
##$XL= 0
##$YL= 0
##$YMAX_a= 614519
##$YMIN_a= -521869
##$ZGOPTNS= <>
##$ZL1= 120
##$ZL2= 120
##$ZL3= 120
##$ZL4= 120
##$ABSF1= 14.98509
##$ABSF2= -5.573092
##$ABSG= 5
##$ABSL= 3
##$ALPHA= 0
##$AQORDER= 0
##$ASSFAC= 0
##$ASSFACI= 0
##$ASSFACX= 0
##$ASSWID= 0
##$AUNMP= <proc_prof1d_extract_pilot.lims>
##$AXLEFT= 0
##$AXNAME= <>
##$AXNUC= <1H>
##$AXRIGHT= 0
##$AXTYPE= 0
##$AXUNIT= <>
##$AZFE= 0.1
##$AZFW= 0.1
##$BCFW= 0
##$BC_mod= 0
##$BYTORDP= 0
##$COROFFS= 0
##$CY= 15
##$DATMOD= 1
##$DC= 0
##$DFILT= <>
##$DTYPP= 0
##$F1P= 0
##$F2P= 0
##$FCOR= 0.5
##$FTSIZE= 32768
##$FT_mod= 6
##$GAMMA= 0
##$GB= 0
##$INTBC= 1
##$INTSCL= 1
##$ISEN= 128
##$LB= 0
##$LEV0= 0
##$LPBIN= 0
##$MAXI= 10000
##$MC2= 0
##$MEAN= 0
##$ME_mod= 0
##$MI= 0
##$NCOEF= 0
##$NC_proc= -8
##$NLEV= 6
##$NOISF1= 0
##$NOISF2= 0
##$NSP= 0
##$NTH_PI= 0
##$NZP= 0
##$OFFSET= 14.98509
##$PC= 1
##$PHC0= 93.89465
##$PHC1= 0
##$PH_mod= 1
##$PKNL= yes
##$PPARMOD= 0
##$PPDIAG= 0
##$PPIPTYP= 0
##$PPMPNUM= 2147483647
##$PPRESOL= 1
##$PSCAL= 4
##$PSIGN= 0
##$PYNMP= <proc.py>
##$REVERSE= no
##$SF= 400.02
##$SI= 32768
##$SIGF1= 0
##$SIGF2= 0
##$SINO= 400
##$SIOLD= 32768
##$SPECTYP= <>
##$SREGLST= <1H.CDCl3>
##$SSB= 0
##$STSI= 32768
##$STSR= 0
##$SW_p= 8223.68421052631
##$SYMM= 0
##$S_DEV= 0
##$TDeff= 65536
##$TDoff= 0
##$TI= <>
##$TILT= no
##$TM1= 0
##$TM2= 0
##$TOPLEV= 0
##$USERP1= <user>
##$USERP2= <user>
##$USERP3= <user>
##$USERP4= <user>
##$USERP5= <user>
##$WDW= 1
##$XDIM= 32768
##$YMAX_p= 462927658
##$YMIN_p= -717016
##$CURPLOT= <Network HP LaserJet P1505>
##$CURPRIN= <$Network HP LaserJet P1505>
##$DFORMAT= <normdp>
##$LAYOUT= <+/1D_H.xwp>
##$LFORMAT= <normlp>
##$PFORMAT= <normpl>
##$SURQMSG= 1
$$ End of Bruker specific parameters
$$ ---------------------------------
##NTUPLES= NMR SPECTRUM
##VAR_NAME=  FREQUENCY,     SPECTRUM/REAL,   SPECTRUM/IMAG
##SYMBOL=    X,             R,               I
##VAR_TYPE=  INDEPENDENT,   DEPENDENT,       DEPENDENT
##VAR_FORM=  AFFN,          ASDF,            ASDF
##VAR_DIM=   32768,         32768,           32768
##UNITS=     HZ,            ARBITRARY UNITS, ARBITRARY UNITS
##FACTOR=    0.250966925370066, 1,           1
##FIRST=     8223.43324360094, -193603,      -38582
##LAST=      0,             -45989,          -69375
##MIN=       0,             -717016,         0
##MAX=       8223.43324360094, 462927658,    0
$$ Real data points
##PAGE= N=1
##DATA TABLE= (X++(R..R)), XYDATA
$$ [...]
19568c03133J46610l00324J66260J19033A53394b4267A4694b69984G2246e7623
$$ -303133 -156523 -456847 -290587 -171554 153394 -24267 14694 -269984 72246 -57623
19557b39429C18549b03444g7157k03470a20146A49991P5129n8879b69848B03385
$$ -239429 318549 -203444 -77157 -280627 -120146 149991 225120 166241 -269848 203385
19546a2062k54377A58863R1128A05274a74540k60914B6311J4423g0661E429c14813
$$ -12062 -266439 158863 249991 105274 -174540 -435454 26311 40734 -70661 5429 -314813
19534b74560E4425b2747G6123g5579j5457K9577A46063c0732j51411e0971j04122
$$ -274560 54425 -22747 76123 -75579 -91036 -61459 146063 -30732 -182143 -50971 -155093
19523a55093e5549A85669b44113h3886j26936A02807A2725a43529d7348j51826
$$ -155093 -55549 185669 -244113 -83886 -210822 102807 12725 -143529 -47348 -199174
19513a99174r8571J30801C76387a19594D8000K3783a97805j3567g2399q9926A35335
$$ -199174 -297745 -166944 376387 -119594 48000 71783 -197805 -211372 -72399 -162325 135335
19501F7843a71423M4866d904l11047b5886A48437a96667G4752c25689c6499B6351
$$ 67843 -171423 -126557 -4904 -315951 -25886 148437 -196667 74752 -325689 -36499 26351
19489f7695j804A1900a94623l3136E770J22612j4036b09431G8798J17211p3505
$$ -67695 -69499 11900 -194623 -227759 5770 128382 114346 -209431 78798 196009 122504
19478A22504b00329B71831b14330F2609O3599K55451A71426R149M3030b26135
$$ 122504 -200329 271831 -214330 62609 126208 381659 171426 180575 223605 -226135
19467A42900q947m272e8640A66956b02420k2438J1238G6646l1120h6523b8069
$$ 142900 133953 129681 -58640 166956 -202420 -224858 -213620 76646 45526 -86523 -28069
19455A8277b28991a05587j12557O6544k0397f108E2194K74937r9187A00954h2543
$$ 18277 -228991 -105587 -218144 -151600 -171997 -6108 52194 327131 227944 100954 -82543
19443B5370J79053J21382a35001G4438J18738b87155E0130k499f3137k3306L8304
$$ 25370 204423 325805 -135001 74438 193176 -287155 50130 47631 -63137 -86443 -48139
19432d8139E3900R8161b5918o0268m8245L7614q8292A65184a06059l8040k39713
$$ -48139 53900 152061 -25918 -86186 -134431 -96817 -185109 165184 -106059 -144099 -383812
19421c83812Q4685g9450A38255b55858b2584j03513b4861l78373A01176P6219
$$ -383812 -299127 -79450 138255 -255858 -22584 -126097 -24861 -403234 101176 177395
19411A77395a25434k7649g2499G3704a29657j2886j95546A02964c14601J28477
$$ 177395 -125434 -153083 -72499 73704 -129657 -142543 -338089 102964 -314601 -186124
19401a86124d127A61823a08231H3774l8408R1480b7649j23197L5533e254k51874
$$ -186124 -4127 161823 -108231 83774 45366 136846 -27649 -150846 -115313 -5254 -257128
19390b57128j16745j40449i1087j0914K2150n972A29580A6186i2831C8407c9561
$$ -257128 -373873 -514322 -91087 -102001 -79851 -85823 129580 16186 -92831 38407 -39561
19378d113H4673j2031a69184B35536D4228G256g7217C20040d50491i993G269Q7818
$$ -4113 84673 72642 -169184 235536 44228 7256 -77217 320040 -450491 -9993 7269 95087
19366I5087a73791E2021N2163b89230A44942d4971I7342a37850k0102M6587i447
$$ 95087 -173791 52021 104184 -289230 144942 -44971 97342 -137850 -157952 -111365 -9447
19354a36815n9550i1371A72329b98323c0233j76484e4112G7348a50696A24916
$$ -136815 -196365 -91371 172329 -298323 -30233 -206717 -54112 77348 -150696 124916
19343F525c66946J66438G9466k1101J8156I164K5566b26134A47261d16764a89804
$$ 6525 -366946 -200508 79466 58365 76521 9164 34730 -226134 147261 -416764 -189804
19331A10535c04757C215K0717J14017a02166q1284B16828b67213A70139a17291
$$ 110535 -304757 3215 23932 137949 -102166 -183450 216828 -267213 170139 -117291
19320A83131i7551A17516c74677c2970j11620A27646J67596b06512g9983C4984
$$ 183131 -97551 117516 -374677 -32970 -144590 127646 295242 -206512 -79983 34984
19309a24433D211c21528A40631b59219A29739d590q9099k45440J62592E9240k3388
$$ -124433 4211 -321528 140631 -259219 129739 -4590 -93689 -339129 -176537 59240 35852
19298C5852a16693C86054a72495Q1845m2473D3652K5228a3658B57149b21560B87343
$$ 35852 -116693 386054 -172495 -90650 -133123 43652 68880 -13658 257149 -221560 287343
19286H6997f436B4920a60954D6483c19601A18107j2253L2630c03033p8136A510
$$ 86997 -6436 24920 -160954 46483 -319601 118107 105854 138484 -303033 -381169 1510
19274C1517a5060A91209i4687C8354c28110Q5445B89935a59501A71863a10870
$$ 31517 -15060 191209 -94687 38354 -328110 -242665 289935 -159501 171863 -110870
19263g4343b055B5951J34691G1709J23144m8080d2342a0567j63841A1971c09828
$$ -74343 -2055 25951 160642 71709 194853 146773 -42342 -10567 -174408 11971 -309828
19251B18818a62313N9501r965q0982h2770B70092c0265k74039h2868b4528k8491
$$ 218818 -162313 -102812 -112777 -193759 -82770 270092 -30265 -304304 -82868 -24528 -53019
19240e3019a2998o1426a4541j56527c4263B0329a40213B55367q7428f5239k2233
$$ -53019 -12998 -74424 -14541 -171068 -34263 20329 -140213 255367 167939 -65239 -87472
19229h7472j76686f557B93134b9703D8011R7249a97139Q5104I9127a61654i449
$$ -87472 -264158 -6557 293134 -29703 48011 145260 -197139 -112035 99127 -161654 -9449
19217h989A2160a7723j3362D6415b9917H4680L8067F0502c0500B06103i7976A174
$$ -8989 12160 -17723 -31085 46415 -29917 84680 122747 60502 -30500 206103 -97976 1174
19204d36963e3755A0213e3106F0413f3886J7387A09326d94553Q2868m7579A06785
$$ -436963 -53755 10213 -53106 60413 -63886 -46499 109326 -494553 -411685 -459264 106785
19192h1319j77315O0795N7671M7471G2015b57971f4751A85436e7470B10775e8849
$$ -81319 -258634 -197839 -140168 -92697 72015 -257971 -64751 185436 -57470 210775 -58849
19180a99971G6651d11186A38411C0155J36501b9035j92991r489B76113b66053
$$ -199971 76651 -411186 138411 30155 166656 -29035 -222026 -231515 276113 -266053
19169a09712G5635N3215b26812p61o7557B5455H221a29885L3775A1903e8747q0988
$$ -109712 75635 128850 -226812 -227573 -295130 25455 8221 -129885 -96110 11903 -58747 -139735
19157a39735q8351F9814L09478a33464A23971e1457k5884C3664b98581c4680F2710
$$ -139735 -228086 69814 379292 -133464 123971 -51457 -77341 33664 -298581 -34680 62710
19145C06171b37001a17288j72725h3047k46488d4102j0443B58561d4440p1748
$$ 306171 -237001 -117288 -290013 -83047 -329535 -44102 -54545 258561 -44440 -116188
19135a16188N6505p324p7812P1067j63961r5495J11027j92296d4451A47336C1942
$$ -116188 -59683 -67007 -144819 -73752 -237713 -333208 -222181 -414477 -44451 147336 31942
19123b39980A26626m5634c89549e3682J2206l0553K9908A66663J74c16325a09796
$$ -239980 126626 80992 -389549 -53682 -41476 -72029 -42121 166663 166837 -316325 -109796
19111C1691b00964i7837j91394J39474G9060C0992K2794a25384o4116A28825b01932
$$ 31691 -200964 -97837 -289231 -149757 79060 30992 53786 -125384 -189500 128825 -201932
19099d9003C9131N0442O250J04594d15351d8122l08536a21411j07857g4761H8213
$$ -49003 39131 89573 95823 200417 -415351 -48122 -356658 -121411 -229268 -74761 88213
19087A73741h0789A9227a31744j3046f8934J4288H3590a84813A61339a98165A12417
$$ 173741 -80789 19227 -131744 -144790 -68934 -54646 83590 -184813 161339 -198165 112417
19075f51F740J44576p1016L2056b28725c2546j28363E3275c47449A82660a4692
$$ -651 6740 151316 80300 112356 -228725 -32546 -160909 53275 -347449 182660 -14692
19063A2909a22751k58213D91764E838J46130a85075D7710B2669a91336h1398k11758
$$ 12909 -122751 -380964 491764 5838 151968 -185075 47710 22669 -191336 -81398 -293156
19052b93156p6697A76003b05136A68754c984C4406O8508L8540a33502J0698A55512
$$ -293156 -369853 176003 -205136 168754 -3984 34406 102914 141454 -133502 -122804 155512
19040A06281b61565g9069C4600P0387a32090c2927B00629J13724h8425A42525
$$ 106281 -261565 -79069 34600 104987 -132090 -32927 200629 314353 -88425 142525
19029A22538J79597B9243a43981C46004E8854h5962A12937a04375G0956l4079
$$ 122538 302135 29243 -143981 346004 58854 -85962 112937 -104375 70956 36877
19019C6877A0291h5456m2521m4296D05146c47869Q4149A72757h6468A54590L12651
$$ 36877 10291 -85456 -127977 -172273 405146 -347869 -263720 172757 -86468 154590 467241
19008D67241k13941A10417D0287c8690j34521k35760A2373a4914j06593G2586
$$ 467241 253300 110417 40287 -38690 -173211 -408971 12373 -14914 -121507 72586
18997a7543A00314b21349I8975c10914b625A15639A5805b91800o5337a5387m1143
$$ -17543 100314 -221349 98975 -310914 -2625 115639 15805 -291800 -357137 -15387 -56530
18986e6530J9935C01589G4020a97897L2020C3508b07316f1779A46594e606E6748
$$ -56530 -36595 301589 74020 -197897 -165877 33508 -207316 -61779 146594 -5606 56748
18974E1682E441b80374Q8751B3908Q8475d6901j40445A93857b21569G4514c10639
$$ 51682 5441 -280374 -191623 23908 112383 -46901 -187346 193857 -221569 74514 -310639
18962c02222h8094a548m327C31118b41827F0493h1871l917J4201L4983B73744
$$ -302222 -88094 -1548 -5875 331118 -241827 60493 -81871 -85788 -71587 -36604 273744
18950b07165e5143C18655a52168k80515a62667j54297b7895j85908a01573b4825
$$ -207165 -55143 318655 -152168 -432683 -162667 -316964 -27895 -213803 -101573 -24825
18939b41821a03862d9494B05285C852J00853i5415j16441A95545F9517K4919J50160
$$ -241821 -103862 -49494 205285 3852 104705 -95415 -211856 195545 69517 94436 244596
18928B44596k5572D1148e630l16648a60D8856J84094M2836d6010A37458M5563
$$ 244596 219024 41148 -5630 -322278 -160 48856 232950 275786 -46010 137458 183021
18917A83021g9764J1167A09672N5387d8063A3300a02599M4726J3j62702P354G7532
$$ 183021 -79764 -68597 109672 165059 -48063 13300 -102599 -57873 -57860 -220562 -213208 77532
18904I3698c63049A30215J00761a6176J749B7065a9020o7656l9684A37535b60702
$$ 93698 -363049 130215 230976 -16176 -14427 27065 -19020 -86676 -126360 137535 -260702
18892a61932A20055D1438b69103E7304b19344R5098A57212b32492F8742C4123
$$ -161932 120055 41438 -269103 57304 -219344 -124246 157212 -232492 68742 34123
18881G4932b82634B47539o7291C7307c58824b2692c136p1202A11124m5907L0025
$$ 74932 -282634 247539 180248 37307 -358824 -22692 -3136 -74338 111124 65217 95242
18870I5242d3430A36041f1258l0701G7390a48813A10240b0114k07484g3350j82810
$$ 95242 -43430 136041 -61258 -91959 77390 -148813 110240 -20114 -227598 -73350 -256160
18859b56160J04349j63097a48880f0867A65421a39233b221A02408a3924j35481
$$ -256160 -151811 -314908 -148880 -60867 165421 -139233 -2221 102408 -13924 -149405
18849a49405P0697J1926j13545A34173K75222E4151g1208j55893N6772D2222b49649
$$ -149405 -78708 -66782 -180327 134173 409395 54151 -71208 -227101 -170329 42222 -249649
18837b21978M2576A15596b55781e5955k39973c1139A82898a89437m3204b2622
$$ -221978 -179402 115596 -255781 -55955 -295928 -31139 182898 -189437 -232641 -22622
18826C6975a35886j15340A66238G6113c18183J43393P1489A55437b35476C0453
$$ 36975 -135886 -251226 166238 76113 -318183 -174790 -103301 155437 -235476 30453
18815a97106A91744F1696j5983a52254G5637L58505B09408A7449R5357P260m4928
$$ -197106 191744 61696 45713 -152254 75637 434142 209408 17449 112806 120066 75138
18804G5138J55833a33307K1002M8827B98869a00545D6288b28004B6163d4838j04707
$$ 75138 230971 -133307 -112305 -63478 298869 -100545 46288 -228004 26163 -44838 -149545
18793a49545A00975j46a43060O5524E8473a74353B45529B179J91143c72555a55770
$$ -149545 100975 100829 -143060 -77536 58473 -174353 245529 2179 193322 -372555 -155770
18781B74481f5269k16229J09138B84251e6488A99550i8992K5972H9305a25676
$$ 274481 -65269 -281498 -172360 284251 -56488 199550 -98992 -73020 89305 -125676
18770F2188k3028c52786N5134K6600h88k48147C4637R4223i0255c7101p8937M8074
$$ 62188 39160 -352786 -297652 -271052 -888 -249035 34637 128860 -90255 -37101 -116038 -67964
18758f7964q6434j68910C4125b138j59659A42312l0103b16025B74447H2289c9484
$$ -67964 -154398 -323308 34125 -2138 -161797 142312 112209 -216025 274447 82289 -39484
18746A9711c86772a58751B9121Q0190I137a20931m934O2844l48985I1984J89255
$$ 19711 -386772 -158751 29121 109311 9137 -120931 -125865 -63021 -412006 91984 281239
18735B81239f0041j24755B13641R7985A30302E7775k4327b73031h531o8791I8388
$$ 281239 -60041 -184796 213641 311626 130302 57775 33448 -273031 -8531 -77322 98388
18723H3019J79956B2955a44816q2269R9895g052A27390h4751b5222D1434i9741
$$ 83019 262975 22955 -144816 -227085 -127190 -7052 127390 -84751 -25222 41434 -99741
18711b01741b1847A12762a46842K2885D5682a8002j65024p9570A49690B0294a98412
$$ -201741 -21847 112762 -146842 -123957 45682 -18002 -183026 -262596 149690 20294 -198412
18699f2890o1859C4865b72002A19641K0642O4712a9961A20592E3795J43228f9314
$$ -62890 -124749 34865 -272002 119641 140283 204995 -19961 120592 53795 197023 -69314
18687B05076a64637E0946M4217d1534C8924e8574j13906A15686g4333A45984g4050
$$ 205076 -164637 50946 95163 -41534 38924 -58574 -172480 115686 -74333 145984 -74050
18675b54042a083k93106h1935a1605j8030E8094a21375B6055a95070e7881q0556
$$ -254042 -1083 -294189 -81935 -11605 -29635 58094 -121375 26055 -195070 -57881 -138437
18664a38437j92287O3872I4877c26328k1192A22938J48072g869B20219C6285J394
$$ -138437 -330724 -266852 94877 -326328 -347520 122938 271010 -7869 220219 36285 37679
18653C7679K09310b15680c1782j01707j083j39312l1171D41215h7588k3953p9389
$$ 37679 246989 -215680 -31782 -133489 -134572 -273884 -305055 441215 -87588 -111541 -190930
18642a90930A4589P6997h561A53356l9383g6745J9838j92668D0809c65147c5699
$$ -190930 14589 91586 -8561 153356 113973 -76745 -56907 -249575 40809 -365147 -35699
18630d5383l31433A7526b6829B876a10574A74016D3028a49805B81258a43356B72562
$$ -45383 -376816 17526 -26829 2876 -110574 174016 43028 -149805 281258 -143356 272562
18618D1236b52524d5584n8364k56909i8182r5874A05627e9685A47049a0147k7188
$$ 41236 -252524 -45584 -103948 -360857 -98182 -194056 105627 -59685 147049 -10147 -37335
18607c7335B59057D4533N1802O3652i588G8986b18230N7415f7315k27565J5118
$$ -37335 259057 44533 96335 159987 -9588 78986 -218230 -160815 -67315 -294880 -279762
18596b79762e4118b4649r8133r2395a8276j51893K5692C3855a60154k51542i2143
$$ -279762 -54118 -24649 -122782 -215177 -18276 -170169 -144477 33855 -160154 -411696 -92143
18584a6486A47908e66990A89876a0437j07339E1515J73772e5291o3696j13559
$$ -16486 147908 -566990 189876 -10437 -117776 51515 225287 -55291 -118987 -232546
18574b32546A96571F9875a25120C1644a86192I5076A7958a76722j79551E7505
$$ -232546 196571 69875 -125120 31644 -186192 95076 17958 -176722 -356273 57505
18563b36775J9588B33169E6252R6338n7149a33805j51563d5834G5454e7491D3573
$$ -236775 -217187 233169 56252 152590 95441 -133805 -285368 -45834 75454 -57491 43573
18551a58628j2809L221L1790I2150i339A48066a36868m0630j18876C02107a80657
$$ -158628 -171437 -168216 -136426 92150 -9339 148066 -136868 -177498 -296374 302107 -180657
18539c97436a58998g2923l48228g6284o014L1731C9944a93498A16895l7063c10919
$$ -397436 -158998 -72923 -421151 -76284 -82298 -50567 39944 -193498 116895 79832 -310919
18527b17553Q964h8708C63856A11816a77379N8457j64845a00397B88101j4802
$$ -217553 -208589 -88708 363856 111816 -177379 -118922 -283767 -100397 288101 273299
18517B73299b13962N421G8328J2921c04315a46498D07221a40476A4384a19215
$$ 273299 -213962 -208541 78328 91249 -304315 -146498 407221 -140476 14384 -119215
18506A01558i9738f742p9246A73639h8020H3784c1645j37554f4815j09981B49503
$$ 101558 -99738 -6742 -85988 173639 -88020 83784 -31645 -169199 -64815 -174796 249503
18494I691b64988D3842b41262D5470a0348j96693j3593l1537E5951c7189k12495
$$ 9691 -264988 43842 -241262 45470 -10348 -207041 -220634 -252171 55951 -37189 -249684
18483b49684i3145A87825g4222A86108a47232B30068a76957B2613b07344e7442
$$ -249684 -93145 187825 -74222 186108 -147232 230068 -176957 22613 -207344 -57442
18472a24697m4831b8988j09602A647J65635a39067A39371D5998a16763B8398c23856
$$ -124697 -169528 -28988 -138590 1647 167282 -139067 139371 45998 -116763 28398 -323856
18460a13043o7607A2949Q0401q098a19044C37146a27040b2220a0453j15840H0178
$$ -113043 -180650 12949 93350 85252 -119044 337146 -127040 -22220 -10453 -126293 80178
18448B39935e0965j52601B77876a14277C4697a30158F2085a08087C9312d35788
$$ 239935 -50965 -203566 277876 -114277 34697 -130158 62085 -108087 39312 -435788
18437d4184D4886p012d863j21499D2440g0169l11071A55887D3974g7068A14077
$$ -44184 44886 37874 -4863 -126362 42440 -70169 -381240 155887 43974 -77068 114077
18425d35567a65629K3224B6609J04841a42621R322d6044b1274j02521K2473I8719
$$ -435567 -165629 -142405 26609 131450 -142621 -133299 -46044 -21274 -123795 -101322 98719
18413A07214B1784b43822k0590L3521K6490E4882f7216j6980m4479A31621j2663
$$ 107214 21784 -243822 -264412 -230891 -204401 54882 -67216 -84196 -128675 131621 118958
18402A18958J59202K9436a08176A9803c4139j6406n9908j42621A04340a21439
$$ 118958 278160 307596 -108176 19803 -34139 -50545 -110453 -253074 104340 -121439
18391A15844B8612c20608A86806G5994c2025l30215k8075E7300B0682e1978G8871
$$ 115844 28612 -320608 186806 75994 -32025 -362240 -390315 57300 20682 -51978 78871
18379A13103e334k47649A25653h6261p2189A23819e8588F4932b16518E7088D859
$$ 113103 -5334 -252983 125653 -86261 -158450 123819 -58588 64932 -216518 57088 4859
18367b8243k75228I6013i1865A26182n1420J31788i5810M0768k89001i2670c9355
$$ -28243 -303471 96013 -91865 126182 74762 206550 -95810 -55042 -344043 -92670 -39355
18355b78655f4615o7569d9689j7143B27187r9657R7816H7572g9181l15401a20602
$$ -278655 -64615 -132184 -49689 -66832 227187 127530 225346 87572 -79181 -394582 -120602
18343a07688l249j50434J00693E2901b95523A07924b94605a12212A10783M1839
$$ -107688 -110937 -261371 -160678 52901 -295523 107924 -294605 -112212 110783 152622
18333A52622l7791J9412h7145F1733f1037M342A79937E9855a06573A60926D467
$$ 152622 114831 134243 -87145 61733 -61037 -56695 179937 59855 -106573 160926 4467
18321a9451E376a04700H7283b568m47893c0045r0877A17111b3533k28055e8770
$$ -19451 5376 -104700 87283 -2568 -450461 -30045 -120922 117111 -23533 -251588 -58770
18309D1073d6429k57712A96074h7558K9728k18571L5122A28696A7403h044A44930
$$ 41073 -46429 -304141 196074 -87558 -57830 -276401 -241279 128696 17403 -8044 144930
18297a42160I4672O1776f4866b7294k93668A70731a60525B7689P0036b55825B05956
$$ -142160 94672 156448 -64866 -27294 -320962 170731 -160525 27689 97725 -255825 205956
18285b71209f2556F1083a07241K8993B6825M5184d0370i706E6477O9084b41002
$$ -271209 -62556 61083 -107241 -78248 26825 72009 -40370 -9706 56477 125561 -241002
18273b11791l1437L9494c4663j55831H24f4254C2722R7921b5B7528P9877a62354
$$ -211791 -243228 -203734 -34663 -190494 824 -64254 32722 130643 -25 27528 107405 -162354
18260a02795a2341j03744a2430O031B0466L54221a49653A72962a02195a3143C19039
$$ -102795 -12341 -116085 -12430 -6399 20466 374687 -149653 172962 -102195 -13143 319039
18248a86129D22316d6751J5814r110C95466a24338p6856A68450F0460M4152C3365
$$ -186129 422316 -46751 -30937 -40047 395466 -124338 -201194 168450 60460 104612 33365
18236c2048j23684o1966d5007A76215c9822E6265J3441a60197A22440a27198J0468
$$ -32048 -155732 -217698 -45007 176215 -39822 56265 69706 -160197 122440 -127198 -116730
18225a16730D4369a95113B24206r7213e3580A03188b58213q745a4910B26778b89225
$$ -116730 44369 -195113 224206 126993 -53580 103188 -258213 -266958 -14910 226778 -289225
18213a87754r5454O3243B69160c46020j04026G1790c7037C7710b95936C9868R5074
$$ -187754 -283208 -219965 269160 -346020 -450046 71790 -37037 37710 -295936 39868 134942
18202A34942c1283j56245H1549a4303A46860q08a47166o3746b7023B0920b27993
$$ 134942 -31283 -187528 81549 -14303 146860 146052 -147166 -210912 -27023 20920 -227993
18190g9432B53010b41524H9090a17637k00164H0112o201K8633a73255b9084D3193
$$ -79432 253010 -241524 89090 -117637 -317801 80112 73911 102544 -173255 -29084 43193
18178A41908a79074D233a80986A46115a7552o6927A00441b05270A1554a25721
$$ 141908 -179074 4233 -180986 146115 -17552 -84479 100441 -205270 11554 -125721
18167H0705b72189B36082I042a85207I8030i4261A36876b18826b4794m14166J05754
$$ 80705 -272189 236082 9042 -185207 98030 -94261 136876 -218826 -24794 -438960 -333206
18156c33206B5030g0284A01207b56756j63892A1327h0690A05826K73451a21145
$$ -333206 25030 -70284 101207 -256756 -420648 11327 -80690 105826 379277 -121145
18145g9451A26327m6315A4301f5253B01168i406j9005B25421b81462a12822b045
$$ -79451 126327 80012 14301 -65253 201168 -9406 -28411 225421 -281462 -112822 -2045
18133e5035j00712j9616O9560h30o5189j87402J25983g800A51531a62032k13873
$$ -55035 -155747 -175363 -105803 -830 -66019 -253421 -127438 -7800 151531 -162032 -375905
18122c75905a83413A94352I0445e2116j80381Q1450P4466h406A4729g6376A97682
$$ -375905 -183413 194352 90445 -52116 -232497 -151047 -76581 -8406 14729 -76376 197682
18110b50051o6457a18742A76582P1977c12375F5501b89374c7336j68471K5360
$$ -250051 -316508 -118742 176582 248559 -312375 65501 -289374 -37336 -205807 -180447
18100a80447B6742O3628J79537a50923f9485I4958e1715C12697a31722H0687b03091
$$ -180447 26742 90370 269907 -150923 -69485 94958 -51715 312697 -131722 80687 -203091
18088F4592d3276o2998k7187b5775A2774k846i5685D3091b54583d2224b644j60154
$$ 64592 -43276 -106274 -133461 -25775 12774 9928 -95685 43091 -254583 -42224 -2644 -162798
18076a62798j06574i1103k41209B74270m9119b25394R3068j39970j14650G2374
$$ -162798 -269372 -91103 -332312 274270 225151 -225394 -132326 -272296 -386946 72374
18065c20064a3203A00543k3855d08231i768k93176A86300B2055P0742j5272O7093
$$ -320064 -13203 100543 76688 -408231 -9768 -302944 186300 22055 92797 77525 144618
18054A44618a37727G5417J1281L6584n7210K02752J06821a33001q1534E5715R9222
$$ 144618 -137727 75417 86698 123282 66072 268824 375645 -133001 -214535 55715 154937
18043A54937E6874a54130A8920R2605L8975b60805A05771b70661a09859B24271
$$ 154937 56874 -154130 18920 111525 150500 -260805 105771 -270661 -109859 224271
18032a49870a2138k22122J03943G2063a33149A12315g7191a5443E1130N5559a93631
$$ -149870 -12138 -234260 -130317 72063 -133149 112315 -77191 -15443 51130 106689 -193631
18020B18494H8882a22873d436A80890E6825a30010L8172j13854e761o843A73815
$$ 218494 88882 -122873 -4436 180890 56825 -130010 -91838 -205692 -5761 -12604 173815
18008d8121j42927B4911K6159c8452B46926b41617B72079f3373C28849c36499
$$ -48121 -191048 24911 51070 -38452 246926 -241617 272079 -63373 328849 -336499
17997A36524O9932e9231j52083A14303d8697B40162D7512a22533m0023E7485I297
$$ 136524 206456 -59231 -211314 114303 -48697 240162 47512 -122533 -162556 57485 9297
17985G2574A7984b8807M351F4193J7733e6679j36186g9813G5401c7699A35391
$$ 72574 17984 -28807 -24456 64193 81926 -56679 -192865 -79813 75401 -37699 135391
17973c90490A54048b60779c8984D45738c36572e7788r8790a736j20746A59178
$$ -390490 154048 -260779 -38984 445738 -336572 -57788 -156578 -1736 -122482 159178
17962b05355A96344A3852R1188c2101C68524c60522A62565e7308F2664A1586a95613
$$ -205355 196344 13852 105040 -32101 368524 -360522 162565 -57308 62664 11586 -195613
17950A28297b95647P8706j51739c7817F2033J16333D5772a72431K8100A29803
$$ 128297 -295647 -216941 -368680 -37817 62033 178366 45772 -172431 -144331 129803
17939b50344Q4381k8377A45673b17289q9955a25178L2443j4174A47447b36800
$$ -250344 -165963 -194340 145673 -217289 -307244 -125178 -92735 -106909 147447 -236800
17928A22653B0893K1237K10700a66081I3954b6055j41457L5497B34858a5459B08306
$$ 122653 20893 42130 252830 -166081 93954 -26055 -167512 -132015 234858 -15459 208306
17916a69818A71417c1046A18979b77388B7596K64865C1545J01370B2209L257O9956
$$ -169818 171417 -31046 118979 -277388 27596 292461 31545 132915 22209 25466 95422
17905I5422J33916d0295F9706a96689J8414B56795e51179g9584D5778M2363R1692
$$ 95422 229338 -40295 69706 -196689 -178275 256795 -551179 -79584 45778 88141 179833
17894A79833p1327e114j7126J0958j21028I7592P4414B8960b9889j17483J5626
$$ 179833 108506 -5114 -22240 -11282 -132310 97592 172006 28960 -29889 -147372 -131746
17883a31746C08753c82887G7850a34315A29214l7394O3803a6258a183k94412L2604
$$ -131746 308753 -382887 77850 -134315 129214 91820 155623 -16258 -1183 -295595 -262991
17872b62991K8500R8141k8730C4070a4449k00583A50891a02212G9859K9605i5680
$$ -262991 -234491 -136350 -165080 34070 -14449 -215032 150891 -102212 79859 109464 -95680
17860a28540r8599f2165r9405A76671h551k2553B577i3803B13457p4841A5653
$$ -128540 -227139 -62165 -161570 176671 -8551 -31104 2577 -93803 213457 138616 15653
17848c35160a04890b4336p9961j39594I1193R9499d9913l9035b6407C01992b66918
$$ -335160 -104890 -24336 -104297 -243891 91193 190692 -49913 -88948 -26407 301992 -266918
17836G4162d9247k16544j6041c7458A4587a62713E8967a09403L8281A0890a27971
$$ 74162 -49247 -265791 -281832 -37458 14587 -162713 58967 -109403 -71122 10890 -127971
17824F8696a51969j42335C5816R7900h4696A29708b09792F8381J3843Q237a66047
$$ 68696 -151969 -294304 35816 133716 -84696 129708 -209792 68381 82224 90461 -166047
17812E1690K99330I6473i9531A12774L1157A4996K65780c06136a21715c4775A6741
$$ 51690 351020 96473 -99531 112774 143931 14996 280776 -306136 -121715 -34775 16741
17800E8206c7300j89566B7879a87944A69909D7778B0525Q007Q8562K63052q2607
$$ 58206 -37300 -226866 27879 -187944 169909 47778 20525 28532 117094 380146 297539
17789B97539c02926G8584J03374l7973c41508B7717R7915B2275K84467f2900l79459
$$ 297539 -302926 78584 181958 143985 -341508 27717 125632 22275 306742 -62900 -442359
17778d42359A33389J9561k0868A0680a40512j79108P3231E0353O3218p566A4913
$$ -442359 133389 152950 132082 10680 -140512 -319620 -246389 50353 113571 106005 14913
17766A15600i7418B16149I0436a61293c9385l1703m2549k37463C7079a62619A73588
$$ 115600 -97418 216149 90436 -161293 -39385 -71088 -113637 -351100 37079 -162619 173588
17754a05236J0229L9548b7438j96010A44307a85837c2511m1312j4546B38065b21551
$$ -105236 -95007 -55459 -27438 -223448 144307 -185837 -32511 -73823 -88369 238065 -221551
17742a48647d8873q4407f5770B24440C8288M320K41900n3983c5844A7438i0544
$$ -148647 -48873 -133280 -65770 224440 38288 42608 284508 230525 -35844 17438 -90544
17730c76226a4164B6344e9822A58542a7709j27926C38320A33066a13583A59213
$$ -376226 -14164 26344 -59822 158542 -17709 -145635 338320 133066 -113583 159213
17719a57288L6527C8207J46201C0752b23367d89l41524i6757A21649K8248b90950
$$ -157288 -120761 38207 184408 30752 -223367 -489 -342013 -96757 121649 149897 -290950
17707C81128A80557a36465A95071a97908e2921k81105H0329R6860o0900a67305
$$ 381128 180557 -136465 195071 -197908 -52921 -334026 80329 177189 116289 -167305
17696C7699J00488N5337d9857j0891C6684a01136j14256C0398J2840R2347J9921
$$ 37699 138187 193524 -49857 -60748 36684 -101136 -215392 30398 43238 135585 155506
17685A55506B2120Q2641d1126B64404D8838f5851A89669I3539K850i0267A52117
$$ 155506 22120 104761 -41126 264404 48838 -65851 189669 93539 96389 -90267 152117
17673a78232A92524c2673k1472a3911p2093A12216c7705J788B32230H4772b6732
$$ -178232 192524 -32673 -54145 -13911 -86004 112216 -37705 -35917 232230 84772 -26732
17661A77206p7171D4105a60826A51994n5100J45287j01826a6376A94503b70851
$$ 177206 100035 44105 -160826 151994 96894 242181 140355 -16376 194503 -270851
17650b6168j55356B04005l5417a48414b9106D52107A84475f3273D196J05574b59695
$$ -26168 -181524 204005 168588 -148414 -29106 452107 184475 -63273 4196 109770 -259695
17638a1584A89070q149l7720O1782a26325A75250a51492A99040L696h6212A3666
$$ -11584 189070 180921 143201 204983 -126325 175250 -151492 199040 202736 -86212 13666
17626E7545a48413E4591J2323L805k2215d1476r4036B14595a95935B29182o6501
$$ 57545 -148413 54591 66914 70719 48504 -41476 -135512 214595 -195935 229182 162681
17615A62681p7874i9783H5625J70058F1086k6117h0853K839C2624a52112A51977
$$ 162681 84807 -99783 85625 255683 61086 34969 -80853 -78014 32624 -152112 151977
17603b5627l0505p311D95062D8976J04353b25954d2007A05798b1273G695d0614
$$ -25627 -56132 -63443 495062 48976 153329 -225954 -42007 105798 -21273 7695 -40614
17591D1467d7358q5280C18852a10965j78211b1196j90230b6133A90721l7172j2133
$$ 41467 -47358 -132638 318852 -110965 -289176 -21196 -211426 -26133 190721 153549 141416
17580A41416F5693K23094b35035C6340b55944E5651a66866A63039J5954H5573
$$ 141416 65693 288787 -235035 36340 -255944 55651 -166866 163039 178993 85573
17569e0647A66892a47322P3487C1607E034a5450A02808J06132a44358A35671a35047
$$ -50647 166892 -147322 -73835 31607 5034 -15450 102808 208940 -144358 135671 -135047
17557G4364b06178B1050J83144b38682J08119B1448a66945O1397A43107C5222
$$ 74364 -206178 21050 204194 -238682 -130563 21448 -166945 -105548 143107 35222
17546A32590B3626M5787f9468A33763l4750a45225n5261j54111A47587a35457
$$ 132590 23626 69413 -69468 133763 99013 -145225 -200486 -354597 147587 -135457
17535A22370l8629J2092a98968d5629j24476A78767D6586J34577a8610A90809
$$ 122370 83741 95833 -198968 -45629 -170105 178767 46586 181163 -18610 190809
17524H316O72067B22454c05594A07851J04933n8310h5384j21020B38926N3126
$$ 8316 680383 222454 -305594 107851 212784 154474 -85384 -206404 238926 292052
17514B92052A27975m1803Q7241K7165F8277i7525C96559A78074a65269B3797J81282
$$ 292052 127975 86172 173413 200578 68277 -97525 396559 178074 -165269 23797 205079
17503B05079H8077J82437E8481i4337B77233J15921a09773a5139G2519L1823L9741
$$ 205079 88077 270514 58481 -94337 277233 393154 -109773 -15139 72519 104342 144083
17492A44083P063E103R8630O6101J79823d1909E6410B2285J60127h5283a8503
$$ 144083 151146 5103 103733 169834 349657 -41909 56410 22285 182412 -85283 -18503
17480F6891a9024D31797E5483c1670A5234O8608b4457E0607b05798C31053F6924
$$ 66891 -19024 431797 55483 -31670 15234 83842 -24457 50607 -205798 331053 66924
17468A52965g6477A76725O5318J47390c0246F1039L12196A50588R7216K08188
$$ 152965 -76477 176725 242043 389433 -30246 61039 373235 150588 247804 455992
17458D55992A17448h3442k05168D56090I8970N6946a24396H4770L40427H4917
$$ 455992 117448 -83442 -288610 456090 98970 155916 -124396 84770 425197 84917
17447B18488r8847l3666O2835R4232J71084r7627j9827R6620C6918K21694i2673
$$ 218488 119641 85975 148810 243042 414126 316499 296672 393292 36918 258612 -92673
17435B96741a0431A38188j1238J25752C200b4126C31180A17315K12712A28743
$$ 296741 -10431 138188 126950 252702 3200 -24126 331180 117315 330027 128743
17424C54303A12955N6389H0978M721m675M34644j84096N5185j54170P7404M2654
$$ 354303 112955 169344 80978 85699 81024 515668 331572 386757 232587 309991 352645
17413C52645J0628b42259B02403J17300a7352A92321F7060K36116j25930R2401
$$ 352645 363273 -242259 202403 319703 -17352 192321 67060 303176 177246 269647
17403B69647I5443a89061H4017a3040A55259C2260J61682C4979L93243a08634
$$ 269647 95443 -189061 84017 -13040 155259 32260 193942 34979 428222 -108634
17392D24018j83596K94819e2648j46088D21749j51779H1284a61802b6123B19290
$$ 424018 240422 535241 -52648 -198736 421749 269970 81284 -161802 -26123 219290
17381D26721C2230M3237J2082M4215h2397D7009Q9314m0004a70559M0660D4930
$$ 426721 32230 75467 87549 131764 -82397 47009 136323 96319 -170559 -129899 44930
17369A24012a59694m6140H5507J73095d0401D62122D8786R4991a08586E435a5435
$$ 124012 -159694 -205834 85507 258602 -40401 462122 48786 143777 -108586 5435 -15435
17357C26345j27549C6373a00844A25024J53825K30567C6380e2073B67268f039
$$ 326345 198796 36373 -100844 125024 278849 509416 36380 -52073 267268 -6039
17346a68358A15162J76655j37718b28773A39708m2946K97505j30813r6226B3734
$$ -168358 115162 291817 154099 -228773 139708 96762 394267 263454 167228 23734
17335B12950j04126a15788C32604f6940b4131l2351B18418J06046D3237J05154
$$ 212950 108824 -115788 332604 -66940 -24131 -56482 218418 324464 43237 148391
17325A48391h8997A94526E0565b1508k66353G548K76520n3839G2736R8982G6770
$$ 148391 -88997 194526 50565 -21508 -287861 7548 284068 230229 72736 171718 76770
17313d868A85387j2153p9638R0835J45554g8328I8175J7462J56595J74138a74948
$$ -4868 185387 173234 93596 184431 329985 -78328 98175 115637 272232 446370 -174948
17301A66676K6488J10811G8200e166B84496K76519A81368Q4079j06954J42715
$$ 166676 193164 303975 78200 -5166 284496 561015 181368 265447 158493 301208
17291C01208A45416c83139a67944H5674a97369B02803p8787J5J43889r2550F6557
$$ 301208 145416 -383139 -167944 85674 -197369 202803 124016 124031 267920 175370 66557
17279C49742A18313k9739c056C17223e811D02213A90765C075K92929H2250J23470
$$ 349742 118313 88574 -3056 317223 -5811 402213 190765 3075 296004 82250 205720
17268B05720J35658k4199j21104L5044d7456B32159N198l0548J48936a05539A32829
$$ 205720 341378 317179 196075 231119 -47456 232159 237357 206809 355745 -105539 132829
17256A38297K81188j64870j08247J24017c4455A77631g8029A73334H4972P5359
$$ 138297 419485 254615 146368 270385 -34455 177631 -78029 173334 84972 160331
17246A60331H891J77599B0467f9552C89862g8751E12943i5821A97519l7477K22697
$$ 160331 8891 186490 20467 -69552 389862 -78751 512943 -95821 197519 160042 382739
17235C82739o6222A49372J49506j19387K3023K55458G5032j7152b2026B40763
$$ 382739 316517 149372 298878 179491 202514 457972 75032 57880 -22026 240763
17224B35497h0128a2206C84709G6043K47026k2561A24500J32566m8971K00132
$$ 235497 -80128 -12206 384709 76043 323069 300508 124500 257066 208095 408227
17214D08227m4063b2293B66843G6973L29341n3885G5901K06246p9595d016B88530
$$ 408227 364164 -22293 266843 76973 406314 352429 75901 282147 202552 -4016 288530
17202D84186q2124A89646c32146E74843A8192J60164K48550A3929J1886J58899
$$ 484186 402062 189646 -332146 574843 18192 178356 426906 13929 25815 184714
17192A84714p6255L32784A31438b15714B26315R4755n5940H2239J0482J79451
$$ 184714 108459 441243 131438 -215714 226315 321070 265130 82239 92721 272172
17182B72172J8068K94924k54772j49939j3970j6707Q0706J07749L03258B44327
$$ 272172 290240 585164 330392 180453 166483 149776 230482 338231 641489 244327
17171F14875j64506k16306N4418D3447K50750a28100A29646K65796A83458k8956
$$ 614875 450369 234063 288481 43447 294197 -128100 129646 395442 183458 154502
17161A54502J12515P6253A63658M03120A59352K19316K9202j7611j14468J62941
$$ 154502 267017 343270 163658 566778 159352 378668 407870 390259 275791 438732
17151D38732j90415L46306j91916n8613j4660L06862B53435j6956O9479L01819
$$ 438732 248317 594623 402707 344094 329434 636296 253435 236479 305958 607777
17141F07777C7765Q3835L89956j71888j43413H8431M55456A93789k5074J77084
$$ 607777 37765 121600 511556 339668 196255 88431 543887 193789 168715 345799
17131C45799O8468A79325Q9211P4536J33971A92869L63956n8934k9148j48589
$$ 345799 414267 179325 268536 343072 477043 192869 556825 497891 468743 320154
17121C20154F7314N93031p1903B88323j26415L29503l8281A92133J69191j00581
$$ 320154 67314 660345 588442 288323 161908 491411 453130 192133 361324 260743
17111B60743k9975I3446K93803p8548J94185j36563P5160B03364N4164K34639
$$ 260743 230768 93446 387249 308701 502886 366323 441483 203364 257528 492167
17101D92167j70334K01455E9299L48242m4483k8656N8064j46346j20877N56062
$$ 492167 321833 523288 59299 407541 363058 334402 392466 246120 125243 681305
17091F81305l04435E743O27731B83333Q5555n7864K13666J2125k18143j53447
$$ 681305 376870 5743 633474 283333 368888 311024 524690 536815 318672 165225
17081A65225J72301J06083B08293K87995k17868A32243L2327K16774j41043K75938
$$ 165225 337526 443609 208293 496288 278420 132243 164570 381344 240301 516239
17071E16239j44911K71667C05222M02834C50620j7839j6087J57302j4288j13442
$$ 516239 371328 642995 305222 708056 350620 332781 316694 473996 459708 346266
17061C46266j7784K43411j65142m6364K44684n4048J82737k52655J35381k52877
$$ 346266 328482 571893 406751 360387 605071 551023 733760 481105 616486 363609
17051C63609J18334L32925l87135K72776j87752Q1860J8339R826k34869n7739
$$ 363609 481943 814868 427733 700509 512757 594617 612956 622782 387913 330174
17041C30174l3464L51783k96564L4701J79242l7814J29915O3455k94199K55086
$$ 330174 296710 648493 351929 386630 565872 528058 657973 721428 427229 682315
17031F82315l37515L4748L1987A66386N51892K48844D81799r9137J98313J86041
$$ 682315 344800 379548 411535 166386 718278 967122 481799 382662 580975 767016
17021G67016j79446Q4259L4474l3957K80666j36414k43153k2363p5077L59450
$$ 767016 587570 671829 706303 672346 953012 816598 573445 551082 476005 835455
17011H35455r2183K8355L28729j49742l65351K12828J73821l63929P7524j35711
$$ 835455 743272 771627 1100356 950614 585263 798091 971912 607983 685507 549796
17001E49796L50383k78889J78384k72874M04464l70213K48231l7626k03699K49627
$$ 549796 900179 621290 799674 526800 931264 561051 809282 771656 567957 817584
16991H17584j53558L86741k15785k36876K45856l15649J56942N5784J72644l7289
$$ 817584 664026 1050767 834982 598106 843962 528313 685255 741039 913683 876394
16981H76394P0250j62374j8948k32022K39989J4164n8765J96440Q7286l3966j15071
$$ 876394 946644 784270 765322 533300 773289 787453 728688 925128 1012414 978448 863377
16970H63377J36347j99489Q1017K7205p987P9396j2805k38338O6577J32183k04241
$$ 863377 999724 800235 881252 908457 900470 979866 967061 728723 795300 927483 723242
16959G23242L73080Q3944k61512J48987J29650p1174k06022J19945L5953L9961
$$ 723242 1096322 1180266 918754 1067741 1197391 1126217 920195 1040140 1076093 1116054
16949A116054l81455M90045j49880K8338j2412Q0988o4605m80028M06076J09760
$$ 1116054 734599 1224644 1074764 1103102 1090690 1171678 1107073 627045 1033121 1142881
16939A142881K74790m34696L80821O9489k39615n9454K81590J39782j90644L270
$$ 1142881 1417671 982975 1363796 1433285 1193670 1134216 1415806 1555588 1364944 1368214
16929A368214l73135M46228k82679L58992m09449L74940L5435m3523m193j35172
$$ 1368214 995079 1441307 1158628 1517620 1108171 1483111 1518546 1475023 1470830 1335658
16919A335658K4236p8208K56197k50435M04467r2872L7446j74010J91160n74005
$$ 1335658 1359894 1281686 1537883 1287448 1691915 1599043 1636489 1462479 1653639 1079634
16909A079634O33220j39112M27110k92253J09382l94147M51009R9780l68419K51189
$$ 1079634 1712854 1573742 2000852 1708599 1817981 1423834 1874843 1974623 1606204 1857393
16899A857393j43206J71013j31821k60325J10186J96023J92870j1771k97005M03624
$$ 1857393 1714187 1885200 1753379 1493054 1603240 1799263 1992133 1980362 1683357 2086981
16889B086981n0176j39567J68086k41263K01848J47145o722j48026J35287K33232
$$ 2086981 2036805 1897238 2065324 1824061 2025909 2173054 2166332 2018306 2153593 2386825
16879B386825k55720o9725O2561M48881l11103J91293j6984J40703k52179L28064
$$ 2386825 2131105 2061380 2123941 2572822 2261719 2453012 2436028 2576731 2324552 2652616
16869B652616m39297K69248L596K77410n09249K52261J73568j0939J86834J47045
$$ 2652616 2213319 2482567 2486163 2763573 2254324 2506585 2680153 2669214 2856048 3003093
16859C003093q7297k35908J40261L19100m2372J09979j13704n6167J42678J71671
$$ 3003093 2915796 2679888 2820149 3139249 3096877 3206856 3093152 3036985 3179663 3351334
16849C351334j30784J54374m3291J03115j87303M60436l5506K31566j27628j21356
$$ 3351334 3220550 3374924 3331633 3434748 3247445 3707881 3672375 3903941 3776313 3654957
16839C654957M3992o6891M23278J18927K8063J15449R0402J02269k30912m9049
$$ 3654957 3698949 3632058 4055336 4174263 4202326 4317775 4408177 4510446 4279534 4230485
16829D230485M65408J05789J29201m56506N29143N6584J48808K94885k6064l09777
$$ 4230485 4695893 4801682 4930883 4474377 5003520 5060104 5208912 5503797 5477733 5167956
16819E167956K06094j01355M55878j52085N57997l56022r6244L49324K74164K60928
$$ 5167956 5374050 5272695 5728573 5576488 6134485 5778463 5682219 6031543 6305707 6566635
16809F566635K3077j16498N95753k2549J4347N52802Q1436P6360J14602L43959
$$ 6566635 6589712 6473214 7068967 7046418 7060765 7613567 7695003 7771363 7885965 8229924
16799H229924o5514K91645K25647o8894M95189K24605J85467M44406l5785M38562
$$ 8229924 8164410 8456055 8681702 8612808 9107997 9332602 9518069 9962475 9926690 10365252
16789A0365252k4095N67219L58610J05597J89697O62397J38737N54528m8076Q26754
$$ 10365252 10341157 10908376 11266986 11372583 11562280 12224677 12363414 12917942 12869866 13696620
16779A3696620M03446L22037K35157O41268M75755N53712K94019N24293R08602
$$ 13696620 14100066 14422103 14657260 15298528 15774283 16327995 16622014 17146307 18054909
16770A8054909O36025N90669N80755P34051P80337O95213P96082J072287M56586
$$ 18054909 18690934 19281603 19862358 20596409 21376746 22071959 22868041 23940328 24396914
16761B4396914J381424R75188P28352J521608R12790J456258J810022J415063
$$ 24396914 25778338 26753526 27481878 29003486 29916276 31372534 33182556 34597619
16753C4597619J262850J565554J785960J875289K171037K364912J960326K357660
$$ 34597619 35860469 37426023 39211983 41087272 43258309 45623221 47583547 49941207
16745D9941207K397464K936220K907485L161454L364365L308899M136600M125508
$$ 49941207 52338671 55274891 58182376 61343830 64708195 68017094 72153694 76279202
16737G6279202M572719M447855M741117N213693N401356N759333N863415N993162
$$ 76279202 80851921 85299776 90040893 95254586 100655942 106415275 112278690 118271852
16729A18271852O056852O782382O179689O659669N981935O237185N241701M985504
$$ 118271852 124328704 131111086 137290775 143950444 149932379 156169564 161411265 166396769
16721A66396769M680029L463844K103930J100604N58626o08820k028295k861134
$$ 166396769 171076798 174540642 176644572 177745176 178303802 177694982 175666687 172805553
16713A72805553l344000m836109n530319n870845n859697o582920o666612o575703
$$ 172805553 169461553 164625444 159095125 153224280 147364583 140781663 134115051 127539348
16705A27539348o539479o290261o156306n770474n863240n420096n319921m478488
$$ 127539348 120999869 114709608 108553302 102782828 96919588 91499492 86179571 81701083
16697H1701083m632984m354014m089206l419223l705948l359366l172289l166873
$$ 81701083 77068099 72714085 68624879 65205656 61499708 58140342 54968053 51801180
16689E1801180k244645k558830k435486k048346k100530j902013j781338j423622
$$ 51801180 49556535 46997705 44562219 42513873 40413343 38511330 36729992 35306370
16681C5306370j780874j587229j204991j376344j157206j388852j049903r02131
$$ 35306370 33525496 31938267 30733276 29356932 28199726 26810874 25760971 24858840
16673B4858840j323876j030984m98529q69117o66161p75041o16041q28815n09869
$$ 24858840 23534964 22503980 22005451 21136334 20470173 19695132 19079091 18250276 17740407
16664A7740407o91711r30664l14399k26769q28366l78776o44150J12524p86850
$$ 17740407 17048696 16118032 15803633 15576864 14748498 14369722 13725572 13838096 13051246
16655A3051246m33329j66261n52016m93737k87440l17936k07669m47139J49919
$$ 13051246 12617917 12451656 11899640 11405903 11118463 10800527 10592858 10145719 10295638
16646A0295638o33863k65736m17745n3874n2145k50829m63616j25966M4058l86272
$$ 10295638 9661775 9396039 8978294 8924420 8872275 8621446 8157830 8031864 8075922 7689650
16636G689650r8130n73930n8816J10129o16971J57578k4657l38399k1773j24033
$$ 7689650 7591520 7017590 6958774 7068903 6451932 6609510 6584853 6246454 6224681 6100648
16626F100648j83752j90084R0230j68786l88149J29900j92747l02995R7228j53861
$$ 6100648 5916896 5726812 5817042 5648256 5260107 5390007 5197260 4894265 4991493 4837632
16616D837632j07452M22036m79418k06565M7205j51527n9629P5035m26060R1760
$$ 4837632 4730180 5152216 4672798 4466233 4513438 4361911 4302282 4377317 3951257 4043017
16606D043017j5769k36878j04553q4586j4586O0158k0809K20898o04963o1858
$$ 4043017 4027248 3790370 3685817 3601231 3586645 3646803 3625994 3846892 3241929 3180071
16596C180071L55445l73139J31523J48373m69032j94504j85995K69823K04241
$$ 3180071 3535516 3162377 3293900 3442273 2973241 2778737 2592742 2862565 3066806
16587C066806n85557M27317k64606J11999R1516j76068p7959j63780l8318L44378
$$ 3066806 2481249 2908566 2643960 2755959 2847475 2671407 2593448 2429668 2391350 2735728
16577B735728P5385j28818j1444m63721K94714l46262K85796k64798j59426J71981
$$ 2735728 2811113 2682295 2670851 2207130 2501844 2155582 2441378 2176580 2017154 2189135
16567B189135j22750J5246n72267M94499K1916P9129k82903l9810r2737M06482
$$ 2189135 2066385 2081631 1509364 2003863 2025779 2104908 1822005 1782195 1689458 2095940
16557B095940q62533M63829N6048m8414J27541k96114Q3100L9029L37197l49956
$$ 2095940 1233407 1697236 1753284 1704870 1832411 1536297 1619397 1658426 1995623 1645667
16547A645667j7505p6097K94178k84442M39422m38962j62324k41268J45361j03861
$$ 1645667 1628162 1552065 1846243 1561801 2001223 1562261 1399937 1158669 1304030 1200169
16537A200169J68028L28533n01783J21609P8107k03871J81626m35018P7082K72006
$$ 1200169 1368197 1696730 1194947 1316556 1394663 1190792 1372418 937400 1014482 1286488
16527A286488J55673n6824j32716r6721K45P2416P7074J70139j31640K4144k27547
$$ 1286488 1442161 1385337 1252621 1155900 1156145 1228561 1305635 1475774 1344134 1368278 1140731
16516A140731l1369j97936L5845J16393m9094j37077L74072m74476M49868j14119
$$ 1140731 1109362 911426 947271 1063664 1014570 877493 1251565 777089 1226957 1112838
16506A112838n17824L33102j18964K04215j19630O6170l4583k78633M37956l28923
$$ 1112838 595014 928116 809152 1013367 893737 959907 925324 646691 1084647 755724
16496G55724K32637k87075k6499J25415K75774l84371J71241R6443p0007M6135
$$ 755724 988361 701286 674787 800202 1075976 691605 862846 959289 889282 935417
16486I35417J10070l04072J74431k41699m4980j66471L51737k82823P7274L14911
$$ 935417 1045487 741415 915846 674147 629167 462696 814433 531610 608884 923795
16476I23795p6295k18142K06247K25872l37963o2410J28530j92781K25310m0851
$$ 923795 847500 629358 835605 1061477 723514 661104 789634 596853 822163 781312
16466G81312J50044k39184L1473J29603k73225L43891k13958k97127r6447K72649
$$ 781312 931356 692172 723645 853248 580023 923914 709956 412829 316382 589031
16456E89031q0481j27453J48262n698M39886C63605K24081K68389B09224M04877
$$ 589031 508550 381097 529359 523661 963547 363605 587686 856075 209224 614101
16446F14101k99909J88408J97383N2526B54986L38640G4598K77864P2197r0629
$$ 614101 314192 502600 699983 752509 254986 593626 74598 352462 424659 334030
16436C34030L32486p8095j04550M06114k60680j2907k00564J86967r3877B42670
$$ 334030 666516 588421 483871 889985 629305 616398 415834 602801 508924 242670
16425C20043k9314K71243R6262k23735K08221k34443K15134j57366J6495A35026
$$ 320043 290729 561972 658234 434499 642720 408277 623411 466045 482540 135026
16414B38058K1533L58644k74619L78375l20748J98770k46301J89890A22791L32337
$$ 238058 259591 618235 343616 721991 401243 600013 353712 543602 122791 455128
16404D55128K00192K527B10475K42547J16623k01069A64177L71542q4128A47619
$$ 455128 655320 657847 210475 453022 569645 368576 164177 535719 451591 147619
16393C36289N2721H3365L4980M23974j64699A19132K93375J22540I1677J19464
$$ 336289 389010 83365 118345 542319 377620 119132 412507 535047 91677 211141
16383B11141P2291k2984J0903k2529l6778n2403M2158Q6713A24506K68605a0208
$$ 211141 283432 260448 271351 248822 212044 159641 201799 288512 124506 393111 -10208
16371A11183K00959j7851C2429O07206k15685A62830k1330j9817M98781A08130
$$ 111183 312142 294291 32429 639635 423950 162830 141500 121683 620464 108130
16360B65998d5631C93286J69308Q272j08640k12816J06899A04366a53341F0182
$$ 265998 -45631 393286 562594 570866 462226 249410 356309 104366 -153341 60182
16349A90974J07758J72149A51114J44640a04653A25407K10488I5527J67588E3186
$$ 190974 298732 470881 151114 295754 -104653 125407 335895 95527 263115 53186
16338D04542j99991C4444K37716n3611P1717O7156C5249K56131L4977O0971J8330
$$ 404542 204551 34444 272160 218549 290266 357422 35249 291380 326357 387328 405658
16327D05658j40446m4559J73287C4983J87096G5690L24546j56243e9724H5584
$$ 405658 265212 220653 393940 34983 222079 75690 400236 243993 -59724 85584
16316A79756d6389C55607K05452j56387j24275H5138J53119A06226b18048E32454
$$ 179756 -46389 355607 561059 404672 280397 85138 238257 106226 -218048 532454
16305B96633a60383E18672A56841R5723E5656k3612K8012J5420J72552F4551O717
$$ 296633 -160383 518672 156841 252564 55656 32044 60056 75476 248028 64551 71268
16294G1268J40931q0610J01204B9929N0775a39680D59614A58822n511l585E0726
$$ 71268 212199 131589 232793 29929 80704 -139680 459614 158822 153311 149726 50726
16282B20544n529O6121c9189C39059a7136B58824G0640K29794K26744j90673o4684
$$ 220544 215015 281136 -39189 339059 -17136 258824 70640 300434 527178 336505 271821
16271B71821K865K84401B38450P7397g5349A44525a1603D73900k09580m2782h9550
$$ 271821 274686 559087 238450 315847 -75349 144525 -11603 473900 264320 221538 -89550
16259a789C91061b15218a05842B54127H2619j6018J43615C348L14279b01484a6567
$$ -1789 391061 -215218 -105842 254127 82619 66601 210216 3348 317627 -201484 -16567
16247B03759K60159a45934k7618A94569a55478A21693g4022A53787a83075L9543
$$ 203759 463918 -145934 -173552 194569 -155478 121693 -74022 153787 -183075 -143532
16237a43532a7951q8385B2582K57965O5834A27680a19743j00611C41041b26336
$$ -143532 -17951 -106336 22582 280547 346381 127680 -119743 -220354 341041 -226336
16226A98357n3917o401J9997n5109K51527q8158a65511P8057C1329N5672A0334
$$ 198357 144440 138039 158036 102927 354454 266296 -165511 -87454 31329 87001 10334
16214D46521R733A16271M3322O8566I5701a13047A14544D8735a11310A83495i3955
$$ 446521 456254 116271 159593 228159 95701 -113047 114544 48735 -111310 183495 -93955
16202B73282b9567D23994a6287A83427P978p2311L2252m4266b8021B03587r5740
$$ 273282 -29567 423994 -16287 183427 191405 119094 151346 107080 -28021 203587 107847
16191A07847d5397k97831g3748A64966M5463b34102A90849J16287i4479K4702
$$ 107847 -45397 -343228 -73748 164966 210429 -234102 190849 307136 -94479 -69777
16181f9777L0113B24172I7557a6257A16699a68149A67455n6268B1777J13278J10499
$$ -69777 -39664 224172 97557 -16257 116699 -168149 167455 111187 21777 135055 245554
16170B45554A22035g1904C5703a01618L4184a5195A72669a5741A92494c10628
$$ 245554 122035 -71904 35703 -101618 -67434 -15195 172669 -15741 192494 -310628
16159B07657f5181B46964a45429M3679j38037O763Q4559A93208b08227c5848o7863
$$ 207657 -65181 246964 -145429 -101750 -239787 -233024 -148465 193208 -208227 -35848 -103711
16148a03711C1751P930K62501a98162H9622f2673A08665B1166J89996j04314K02124
$$ -103711 31751 39681 302182 -198162 89622 -62673 108665 21166 211162 106848 308972
16137C08972a1057A30639a28847G6069J3453a07204D7120J00605m6355J65324
$$ 308972 -11057 130639 -128847 76069 89522 -107204 47120 147725 101370 266694
16127B66694a98527h9807p9656M9070b5526C25048A0839L50351r4651j21157F219
$$ 266694 -198527 -89807 -169463 -120393 -25526 325048 10839 361190 266539 145382 6219
16115a36901N2452L8989B48878a20762J800J369D1534i1074A8581b02204A13057
$$ -136901 -84449 -45460 248878 -120762 -118962 -117593 41534 -91074 18581 -202204 113057
16103F7934J39817O7006F6016L67717D2895a23998B77440a76769A17661E4695
$$ 67934 207751 274757 66016 433733 42895 -123998 277440 -176769 117661 54695
16092A41125a16892j5504m4951A83738F1949a61872k0770A11947J0814J90982
$$ 141125 -116892 -132396 -177347 183738 61949 -161872 -182642 111947 122761 313743
16082C13743g4889J6179r4155C7736a29134k6055c0472A96409a5943l9243A809
$$ 313743 -74889 -58710 -152865 37736 -129134 -155189 -30472 196409 -15943 -55186 1809
16070b77636a29428H4850O3343d42063I012J38477b47112B52799J32329a21361
$$ -277636 -129428 84850 148193 -442063 9012 147489 -247112 252799 385128 -121361
16059A10781n4797g3555c0859B01919n4983f483A28776a19031j485c0680j4258
$$ 110781 55984 -73555 -30859 201919 146936 -6483 128776 -119031 -120516 -30680 -44938
16048d4938k6452C0741a09051A29471b1083k7145j25805c4772A46609a54850l2493
$$ -44938 -71390 30741 -109051 129471 -21083 -48228 -174033 -34772 146609 -154850 -187343
16037a87343h8159A360b9432G7262a52969A01981J16679b27862E0984a45654f5766
$$ -187343 -88159 1360 -29432 77262 -152969 101981 218660 -227862 50984 -145654 -65766
16025H8406K21609i7334o7108B02186r8756B667a70716g0741j42376E0154e6026
$$ 88406 310015 -97334 -164442 202186 103430 2667 -170716 -70741 -213117 50154 -56026
16013C16273b26561i6411I1866a84078d4159J4139p6438m3438B15362b9953B80633
$$ 316273 -226561 -96411 91866 -184078 -44159 -30020 -106458 -149896 215362 -29953 280633
16001i8227C3286a12130B09670b90052N5710K6290r958j2863a08805B18051a52852
$$ -98227 33286 -112130 209670 -290052 -234342 -208052 -218010 -230873 -108805 218051 -152852
15989b2177l29353B07049P0003a01288B10762r5899M6447o4497K90078q7589i65
$$ -22177 -351530 207049 277052 -101288 210762 114863 161310 96813 386891 299302 -965
15977A73985e064k19766A11417a5323q4385e917o1954J508A55441d0417d646o6396
$$ 173985 -5064 -224830 111417 -15323 -99708 -5917 -67871 -66363 155441 -40417 -4646 -71042
15965g1042I3447c14548E60624c50096C2797b01823h7765n7324F2886b00006O7561
$$ -71042 93447 -314548 560624 -350096 32797 -201823 -87765 -145089 62886 -200006 -132445
15954a32445m2053A47522a195j77595F7337B0545a78963I395K22318J87565b79560
$$ -132445 -174498 147522 -1195 -178790 67337 20545 -178963 9395 231713 419278 -279560
15942G401b32532d725r614I4399c7206P546B10559b06352C14526H995f9277A0886
$$ 7401 -232532 -4725 -14339 94399 -37206 -29660 210559 -206352 314526 8995 -69277 10886
15929A25348a5182j96835o1500b0691p7095H6265c56959b1551G9718a51663B30820
$$ 125348 -15182 -212017 -273517 -20691 -97786 86265 -356959 -21551 79718 -151663 230820
15917c06984a11837q5421Q317n3344A67451g9957r3306p5980C3674K2229c21749
$$ -306984 -111837 -197258 -188941 -242285 167451 -79957 -173263 -249243 33674 55903 -321749
15905A35323c1764l073k23679i1315G0240M3044Q4511h1389A74406D810K20395
$$ 135323 -31764 -34837 -258516 -91315 70240 113284 197795 -81389 174406 4810 225205
15894B25205G0254g6358j98127c1242F8080b11125P8937L0494b8066r8679C5273
$$ 225205 70254 -76358 -274485 -31242 68080 -211125 -132188 -101694 -28066 -126745 35273
15882B06700b16636A09311i956l9885o0556B83245c9571l07929A55307B2330a07288
$$ 206700 -216636 109311 -9956 -49841 -110397 283245 -39571 -347500 155307 22330 -107288
15870A37514i2694m8766A88269c03831M0531C9434c32984A5608a1651A13594a91708
$$ 137514 -92694 -141460 188269 -303831 -263300 39434 -332984 15608 -11651 113594 -191708
15858c01884A98409q4383a64942C3407J03075A2519a19234m35022b09382a4755
$$ -301884 198409 114026 -164942 33407 136482 12519 -119234 -554256 -209382 -14755
15847a00308A80783a73567m6171L0125B68711n2710a05743q3519q0848A13330
$$ -100308 180783 -173567 -219738 -189613 268711 216001 -105743 -189262 -270110 113330
15836F2541C324J98054d0770p2582A22106K28855a43805B54930b61218q1759h7578
$$ 62541 3324 201378 -40770 -113352 122106 350961 -143805 254930 -261218 -342977 -87578
15824A25987b12486C1691e05998D0568c5089A38431c38044A76174m2795c7032
$$ 125987 -212486 31691 -505998 40568 -35089 138431 -338044 176174 133379 -37032
15813c86059D9098P3905d7658B24173p3532L8420d23399P1778b9158A91825b37307
$$ -386059 49098 123003 -47658 224173 150641 189061 -423399 -351621 -29158 191825 -237307
15801d69551a80115B00890d09929C0503c11635F7217A120a05019o0542N9787M4753
$$ -469551 -180115 200890 -409929 30503 -311635 67217 1120 -105019 -165561 -105774 -61021
15790f1021A91026a92960B31501B5588J69707a90640N0083B5650J7309Q3213c3460
$$ -61021 191026 -192960 231501 25588 195295 -190640 -140557 25650 42959 126172 -33460
15778A49324a14773d0488o155a766k1636k572p799J1619A25060k6565R6360c10558
$$ 149324 -114773 -40488 -46643 -1766 -23402 -25974 -33773 -22154 125060 98495 194855 -310558
15765D5562a73874d67k90855B17661a45256l4108m5468J02974C58080F2323J47087
$$ 45562 -173874 -467 -291322 217661 -145256 -179364 -224832 -121858 358080 62323 209410
15754B09410f4204A5033c6862R451l77310J49576p6610d3362D1803J53658k846
$$ 209410 -64204 15033 -36862 -27411 -404721 -255145 -331755 -43362 41803 195461 192615
15743A92615j3726o5728l7663a13645C62005A8733f587A82051b42399d532A97924
$$ 192615 178889 113161 75498 -113645 362005 18733 -6587 182051 -242399 -4532 197924
15731b4124H1043i910A06310M5956n7920a06262A324b82307h0015E2807c15983
$$ -24124 81043 -9910 106310 152266 94346 -106262 1324 -282307 -80015 52807 -315983
15719a12093d1250A00750e8126k88884a07749n6076d5950B788a42563A06420e7129
$$ -112093 -41250 100750 -58126 -347010 -107749 -163825 -45950 2788 -142563 106420 -57129
15707A59148a55778R921N5002D969c06015M5711J08881J2371j74949R8396d5845
$$ 159148 -155778 -145857 -90855 4969 -306015 -260304 -151423 -139052 -314001 -215605 -45845
15695A5970d8897B07763b60640G6278a77934A17651d6932k09307B22508G2371
$$ 15970 -48897 207763 -260640 76278 -177934 117651 -46932 -256239 222508 72371
15684a30492o5293C3348J26464o5464f715G109M29472d04294d2797F507a7622
$$ -130492 -195785 33348 159812 94348 -6715 7109 436581 -404294 -42797 6507 -17622
15672A64948f2926B25429J06953A2010K13787b42929f733l90414I8752J65113
$$ 164948 -62926 225429 332382 12010 225797 -242929 -6733 -397147 98752 263865
15662B63865b6400B6616c464j20692a5921C27a77792N5142l14076J51937h6717
$$ 263865 -26400 26616 -3464 -124156 -15921 327 -177792 -122650 -436726 -284789 -86717
15650d800m2665k68566h4537G3801A0856a46875I1232b59692A87649h0688m6684
$$ -4800 -47465 -316031 -84537 73801 10856 -146875 91232 -259692 187649 -80688 -127372
15639a27372N0641A61709a06738b9563j8097H5796J08496e3662A61535D8330a55301
$$ -127372 -76731 161709 -106738 -29563 -47660 85796 194292 -53662 161535 48330 -155301
15627B09886c4190A50476J07734H5763A2735g24r6320j56311Q0938A29648b2880
$$ 209886 -34190 150476 258210 85763 12735 -724 -97044 -253355 -172417 129648 -22880
15615B31955b74628O0189L2096g6080D55780e8257m2227B69054H214b4075B2452
$$ 231955 -274628 -214439 -182343 -76080 455780 -58257 -100484 269054 8214 -24075 22452
15603b52013A0760a52038L5147j65922a22329K4885H0346D309i5630C0502h985
$$ -252013 10760 -152038 -116891 -282813 -122329 -97444 80346 4309 -95630 30502 -8985
15591E8149J9157b10129A9666J41001F4669k1315J60656h441j29988B00158H1550
$$ 58149 77306 -210129 19666 160667 64669 43354 204010 -8441 -138429 200158 81550
15579A75759d52956d5161B35484d2453k50530J26099p0808A25031D6859J11986
$$ 175759 -452956 -45161 235484 -42453 -292983 -166884 -237692 125031 46859 158845
15569A58845j4978R8905b89511A62343a05111r7414F5826B0286J11029b27415
$$ 158845 143867 242772 -289511 162343 -105111 -202525 65826 20286 131315 -227415
15558h4836B08649a44037j58252D6342e7293r5698M7913b0565N613m1345o1133
$$ -84836 208649 -144037 -302289 46342 -57293 -152991 -105078 -20565 -14952 -56297 -117430
15547a17430l04113D054J85677r803d9933C9775a05534o1545A30530R8078E6509
$$ -117430 -421543 4054 189731 179928 -49933 39775 -105534 -167079 130530 228608 56509
15535b13710F8783b26108H7560a7150N458d625F6850a83651b5448l850k66161
$$ -213710 68783 -226108 87560 -17150 -11692 -4625 66850 -183651 -25448 -29298 -295459
15524b95459P1107A48810A3646h1991b4620j66071B23249e5625A20784d4583k13192
$$ -295459 -224352 148810 13646 -81991 -24620 -190691 223249 -55625 120784 -44583 -257775
15513b57775I2801i0908A42089f3254B64364a33786L5229m2770k39843B27685
$$ -257775 92801 -90908 142089 -63254 264364 -133786 -98557 -141327 -381170 227685
15502C0093J38965q3811f9009A08153k0645J23500b74159h097l2570A41138b61025
$$ 30093 169058 85247 -69009 108153 87508 211008 -274159 -8097 -40667 141138 -261025
15490B67902b0817j86157C4872b07886a9230C31815a12274D4363i696k18853j36181
$$ 267902 -20817 -206974 34872 -207886 -19230 331815 -112274 44363 -9696 -228549 -364730
15479c64730b3789p9592e500A59645K53571a93096C3316K4623K18999c7490A96421
$$ -364730 -23789 -103381 -5500 159645 413216 -193096 33316 57939 276938 -37490 196421
15467b32992d1523j6701A19065r739b0360C3898e9234p8695j82030d5840a6481
$$ -232992 -41523 -58224 119065 109326 -20360 33898 -59234 -137929 -319959 -45840 -16481
15455d3695l3815J7107A44235d6085B61617C880a2230B24115a31966a8117m5758
$$ -43695 -77510 -60403 144235 -46085 261617 3880 -12230 224115 -131966 -18117 -63875
15444f3875J2329B19029J18855F9400J11393b45106a00161A0654a15966A21329
$$ -63875 -51546 219029 337884 69400 180793 -245106 -100161 10654 -115966 121329
15433b66423J26984q2435A4369a77925J6846C04687A22115E5218j1954e6761B72667
$$ -266423 -139439 -221874 14369 -177925 -161079 304687 122115 55218 43264 -56761 272667
15421a84738A80852J2948i5513j60421a21565C09414a41307f236o4481A17232
$$ -184738 180852 193800 -95513 -255934 -121565 309414 -141307 -6236 -70717 117232
15410b47599l0285A12025P3938p2570b43760H1207c9301C5831b25919M3845H7662
$$ -247599 -277884 112025 185963 113393 -243760 81207 -39301 35831 -225919 -182074 87662
15398h7553A40232E6892M27765A70686d07719E0074A9268e6824B22607n5133a75621
$$ -87553 140232 56892 484657 170686 -407719 50074 19268 -56824 222607 167474 -175621
15386a4208j04842r038l46409A32714B1174b1527j83215f3574q6167k4517A4632
$$ -14208 -119050 -128088 -474497 132714 21174 -21527 -204742 -63574 -149741 -174258 14632
15374A18268e2142m7795B69987b21193C80256G2874J4029O0450G2092a88797A44663
$$ 118268 -52142 -99937 269987 -221193 380256 72874 86903 147353 72092 -188797 144663
15362c67480A59445J48691J0812F2668g1504G1018b402l4239j86475I3946J10658
$$ -367480 159445 308136 318948 62668 -71504 71018 -2402 -36641 -223116 93946 204604
15351B04604G2598L2909P8248o0376a33712A53541D1304c05599B92795g6169J3151
$$ 204604 72598 105507 183755 123379 -133712 153541 41304 -305599 292795 -76169 -63018
15340f3018H2833b8711A70628q3113g4699b8135B69789G25L21658a89432O244
$$ -63018 82833 -28711 170628 87515 -74699 -28135 269789 725 322383 -189432 -183188
15329a83188A41083K4499a73280B60611F6937J86357A497a44902A43408a2828
$$ -183188 141083 165582 -173280 260611 66937 253294 1497 -144902 143408 -12828
15318a6282k809k13692b1746B494a99996a1893A21061O6081R4035a61887F9993
$$ -16282 -19091 -232783 -21746 2494 -199996 -11893 121061 187142 281177 -161887 69993
15306C8479a12447p6018P2608B44548O6444d5009A94561J65516k2532F0276f35242
$$ 38479 -112447 -188465 -115857 244548 310992 -45009 194561 360077 337545 60276 -635242
15294A56817f9912j09259A06672O3062r546L4552b16462A92584o6931A613J35051
$$ 156817 -69912 -179171 106672 169734 160188 194740 -216462 192584 125653 1613 136664
15283A36664c18678J51871E3871j1511J52259a45200C03331a05967E09366H0505
$$ 136664 -318678 -166807 53871 42360 194619 -145200 303331 -105967 509366 80505
15272a45347A25131L57028d4395B88723a39305k660C4657J74741c5883F1444C0083
$$ -145347 125131 482159 -44395 288723 -139305 -141965 34657 209398 -35883 61444 30083
15260C9479j5571a98818B93755A2034n419J73268j0404N3885f6927A12397K33172
$$ 39479 23908 -198818 293755 12034 6615 179883 169479 223364 -66927 112397 345569
15249C45569K06652k37832J266587L24957p45691M42288o97185c467H5785J20896
$$ 345569 552221 314389 1580976 1905933 1160242 1602530 905345 -3467 85785 206681
15239B06681r7459m9008J86008p4162m2602M7784J66679e8792A79407K30236A16015
$$ 206681 109222 60214 246222 172060 129458 177242 343921 -58792 179407 409643 116015
15227a338E9395J17120k9822k026a74377F8275g0683A24545k2572m0790J72959
$$ -1338 59395 176515 146693 144667 -174377 68275 -70683 124545 101973 61183 234142
15216B34142b57084A36352E8652b47761M258B3497N876c2373j9217p8005B66407
$$ 234142 -257084 136352 58652 -247761 -243503 23497 29373 -32373 -51590 -129595 266407
15204a93048n2821E6730a5296n6421J147D60009A95893A0029J00170c33242J27564
$$ -193048 -245869 56730 -15296 -71717 -70570 460009 195893 10029 110199 -333242 -205678
15193b05678A32646b51915A25017a20110H6793J86107d9218A23513O3394E6222
$$ -205678 132646 -251915 125017 -120110 86793 272900 -49218 123513 186907 56222
15182A49103a37071B15239L5339q2264A0275N3861J16620d2273A3340e2976A5505
$$ 149103 -137071 215239 250578 168314 10275 64136 180756 -42273 13340 -52976 15505
15170A3996a93404E4729L8753i6185B8772O2820K59076a12896k35495F5703K6711
$$ 13996 -193404 54729 93482 -96185 28772 91592 350668 -112896 -348391 65703 92414
15159I2414J73008a02240L4039A65712P8805B9261b3634C52450h6736c7147q0609
$$ 92414 265422 -102240 -68201 165712 244517 29261 -23634 352450 -86736 -37147 -117756
15148a17756H9737J6730b6258m1376q6681A13130K13081h7162A50373L7111l676
$$ -117756 89737 106467 -26258 -67634 -154315 113130 326211 -87162 150373 187484 183808
15137A83808K27501B00095m2845k8294K7826G1150P1405J71329k8199b0951B27478
$$ 183808 411309 200095 157250 128956 156782 71150 142555 313884 285685 -20951 227478
15125a0194A5534M38544G676L74162q5658j38317b1090A20534A1186K05823l9983
$$ -10194 15534 454078 7676 381838 296180 157863 -21090 120534 11186 217009 177026
15114A77026E6458K05448E3274f2275B45339a79318A27154h4657A05208J26015
$$ 177026 56458 261906 53274 -62275 245339 -179318 127154 -84657 105208 231223
15104B31223k6309q2634R5376A7149J39579a18421B81219l1582g105C82120A07447
$$ 231223 204914 122280 217656 17149 156728 -118421 281219 249637 -7105 382120 107447
15092c5038A64396j6601C9556J24379f3723C34745j48816O771H7M35719f5808
$$ -35038 164396 147795 39556 163935 -63723 334745 185929 192700 87 435806 -65808
15080B13723O1023E1240a62597A0569g2359m4090I1057a48101A31208K91209A49475
$$ 213723 274746 51240 -162597 10569 -72359 -116449 91057 -148101 131208 422417 149475
15068A41451E1972M12253H0301J59669F9215N9799a11299B4589J79975K1321I4818
$$ 141451 51972 464225 80301 239970 69215 129014 -111299 24589 204564 225885 94818
15056A80054m412l5796F2467a38737A63280M2720L8549N68J63163n9472A24539
$$ 180054 175642 139846 62467 -138737 163280 206000 244549 245117 408280 348808 124539
15044B39092A15676J99045L989j00611J21455j42186J88433A0894k720K56366
$$ 239092 115676 314721 318710 218099 339554 197368 385801 10894 8174 264540
15034B64540f6061k2844C46385q6842n4550E2711l822O5873C637J61695g4430
$$ 264540 -66061 -88905 346385 259543 204993 52711 48889 114762 3637 165332 -74430
15022I8038L22708A04109L5259K7672J67782M0952j25448g1333A2402J24108K59307
$$ 98038 420746 104109 139368 167040 334822 375774 250326 -71333 12402 136510 395817
15011C95817j61578e3981J1308C72961J03661J40696j19092B8617J58362q4118
$$ 395817 234239 -53981 -42673 372961 476622 617318 498226 28617 186979 102861
15001A02861j9174B261K30922K28751i6549A94469a75289A40315P7036o6333R7606
$$ 102861 83687 2261 233183 461934 -96549 194469 -175289 140315 217351 151018 248624
14990B48624K0358B7298J45757P7721q0936R8650J36283A78527J38150d2025B06652
$$ 248624 268982 27298 173055 250776 169840 268490 404773 178527 316677 -42025 206652
14978B90791a34918B15552q6296m4800K52246a15718C63981P4637j98892J41484
$$ 290791 -134918 215552 129256 84456 336702 -115718 363981 438618 239726 381210
14968C81210c4060A64616A9237J89734j8203n9441l9060O2854A3362M5732L16065
$$ 381210 -34060 164616 19237 208971 190768 131327 92267 155121 13362 59094 375159
14957C75159A81304K037K52991F5405L78999j10242D9712L38301l3264j26723
$$ 375159 181304 183341 436332 65405 444404 334162 49712 388013 354749 228026
14947B28026I6592J09817K34944E8455L47023j07832J61587e856C10216L3276
$$ 228026 96592 206409 441353 58455 405478 297646 459233 -5856 310216 343492
14937C43492B0060L08983H1492P9477J18189M393l0597k8517q4899L60822A03237
$$ 343492 20060 329043 81492 160969 279158 283551 252954 224437 139538 500360 103237
14925B64398p8888q6550J86683j9216j2449L78386F7463O6500c6682A23420a54296
$$ 264398 185510 98960 285643 266427 253978 632364 67463 133963 -36682 123420 -154296
14913f2495I705J45283Q1490k3127E7500P9865J08942l1768J40407N1594A55259
$$ -62495 9705 154988 236478 213351 57500 137365 246307 214539 354946 406540 155259
14901A49724M57990k18639G3744O9334K05547j49183D1768M14205j59699K3110
$$ 149724 607714 389075 73744 143078 348625 199442 41768 455973 296274 319384
14891C19384L05780B33536J35839J86639n331B57357R9212J79903B44700N8426
$$ 319384 625164 233536 369375 556014 550683 257357 356569 536472 244700 303126
14881C03126K24620B57208A27429j4850j7717L24962l6605K63269B20339P5232
$$ 303126 527746 257208 127429 112579 94862 419824 383219 646488 220339 295571
14871B95571j7463J261j8813K15887p1785j53485b428C7618K71146J70448J2096
$$ 295571 278108 279369 260556 476443 404658 251173 -2428 37618 308764 479212 491308
14860D91308A82870J49141k4952I5719M06481B48430J34553p3852A00440M53943
$$ 491308 182870 332011 307059 95719 502200 248430 382983 309131 100440 554383
14850E54383o5596k12140J51951j33204L7982M5772A21388J77969L3535P1670
$$ 554383 488787 276647 428598 295394 333376 379148 121388 299357 332892 404562
14840D04562j31794J93285J0754j24475J67898j15113J09039A35884M79297L0983
$$ 404562 272768 466053 476807 352332 520230 405117 514156 135884 615181 646164
14830F46164B77943M61260B43108M5964p2382O2654J47607J16814a0811D73359
$$ 646164 277943 739203 243108 289072 216690 279344 426951 543765 -10811 473359
14819G34900C07944R9108j0222K73042O4109j71957A80930L41066R6234j16063
$$ 734900 307944 407052 396830 669872 733981 562024 180930 521996 618230 502167
14809E02167L8266B63913m173o6705J20498K11982J48181Q6186k70457K15349
$$ 502167 540433 263913 259740 193035 313533 525515 673696 759882 489425 704774
14799G04774k73445j1975A93194K46551k07085L61193M7264B19512J28429L68946
$$ 704774 431329 419354 193194 439745 232660 593853 641117 219512 347941 716887
14789G16887k81264L14864l47648K24663B84648L79228M2587k74352L2503O7045
$$ 716887 435623 750487 402839 627502 284648 663876 706463 432111 464614 531659
14779E31659o5770j50143N26253l03435L68993l08191m0340j41830K21709J19360
$$ 531659 465889 315746 841999 538564 907557 599366 559026 417196 638905 758265
14769G58265k56702J23982J53J63432B42897k5859L69678j13295K17295L7399
$$ 758265 501563 625545 625698 789130 242897 217038 586716 473421 690716 728115
14759G28115k02067J16224j33971Q7667J81904k45834J72371o6753k76831L73425
$$ 728115 526048 642272 508301 595968 777872 532038 704409 637656 360825 734250
14749G34250J8546k97798M25901Q6334j88529k87349L6336m3041L59259l12545
$$ 734250 752796 454998 880899 967233 778704 491355 527691 484650 843909 531364
14739E31364L06526j50935j00334R3524R807j24363L01566k11926q5665Q6561
$$ 531364 837890 686955 586621 680145 689952 565589 867155 655229 569564 656125
14729F56125L09013k32549l18949L04869L8344j02295q1162j48689N46185C79765
$$ 656125 965138 732589 413640 718509 756853 654558 573396 424707 970892 379765
14718G77201l27741L5660J32923j4522n0949K74741j28033l3043K21692j28280
$$ 777201 449460 485120 618043 603521 552572 827313 699280 666237 887929 759649
14708G59649k86551O2699K5621o907J10513N3729M8654M35364m41789J05579p9162
$$ 759649 473098 535797 561418 554511 665024 718753 767407 1202771 760982 866561 787399
14697G87399J63101k27291J6241J81144M1427k40675O3071Q2451k02214l27343
$$ 787399 950500 723209 739450 920594 962021 721346 784417 866868 664654 337311
14687C37311L97770J03263l50001M49514J61683O0344k95235o4337n7494J42963
$$ 337311 735081 838344 488343 937857 1099540 1159884 864649 800312 742818 885781
14677H85781j3980M6233J44900k14022L3260J81722j71879m4317j26571K02755
$$ 885781 871801 918034 1062934 848912 882172 1063894 892015 847698 721127 923882
14667I23882j45208o2110K1139M09377o6338n1086p0912L29063k04021k35076
$$ 923882 778674 716564 737703 1147080 1080742 1029656 958744 1287807 1083786 848710
14657H48710J08283n391K3225j5109J40732k67168K68427j35081m5288J43469
$$ 848710 956993 951602 974827 959718 1100450 833282 1101709 966628 921340 1064809
14647A064809k91837M11617r5040k36142n3295K89309J49786j2196n2808L5266
$$ 1064809 772972 1184589 1089549 853407 800112 1089421 1239207 1227011 1174203 1209469
14637A209469l0677J33976N0436j33958r0912N5123J95459j05044j42563j2950
$$ 1209469 1178792 1312768 1363204 1229246 1138334 1193457 1388916 1283872 1141309 1128359
14627A128359J97966k50845K02867r9239M8534K7224j5264K29273j02090k4362
$$ 1128359 1326325 1075480 1278347 1179108 1227642 1254866 1239602 1468875 1366785 1342423
14617A342423J46862l50603K89378l92488N01536m6117P3040P826K5919l920k81968
$$ 1342423 1489285 1138682 1428060 1035572 1537108 1490991 1564031 1571857 1597776 1593856 1311888
14606A311888n2706K80277J30116k70657K59384m6056m923k26681K80609L1766
$$ 1311888 1259182 1539459 1669575 1398918 1658302 1612246 1607323 1380642 1661251 1693017
14596A693017j10092j15286j01502L19253L0282J44734m77335L43477J87399m63203
$$ 1693017 1582925 1467639 1366137 1685390 1715672 1860406 1383071 1726548 1913947 1450744
14586A450744K1776Q7513M72739l39843n3721J27565j10410K21246J18446m32066
$$ 1450744 1472520 1560033 2032772 1692929 1639208 1766773 1656363 1877609 1996055 1563989
14576A563989N25751j81255P4250R2598P7725l86873K96842j42248J66396K58814
$$ 1563989 2089740 1908485 1982735 2075333 2153058 1766185 2063027 1920779 2087175 2345989
14566B345989k3624k43628q6943K90246p6053j956N01344l60877o3083M34212
$$ 2345989 2322365 2078737 1991794 2282040 2205987 2204031 2705375 2344498 2281415 2715627
14556B715627J74977k5236N50645J89633p0499N03775R50198J570636K933064
$$ 2715627 2890604 2865368 3416013 3605646 3535147 4038922 4989120 6559756 9492820
14547I492820P307656K0400406J3927554B3634941A0243222D811171k272061o09669
$$ 9492820 16800476 37200882 51128436 23634941 10243222 4811171 2539110 1929441
14539A929441p6695l14288J92654J02612k26456J87671J52716K1623l54821j3273
$$ 1929441 1852746 1538458 1731112 1833724 1607268 1794939 1947655 1969278 1614457 1601184
14529A601184L37291K47713k80567k16775k3030K51639l892j42397L75560J84752
$$ 1601184 1938475 2186188 1905621 1688846 1665816 1917455 1913563 1771166 2146726 2331478
14519B331478M14526k93637n07059M20163J90137k98115K59369K7178j24926o6081
$$ 2331478 2746004 2452367 1945308 2365471 2555608 2257493 2516862 2544040 2419114 2353033
14509B353033L2909K37613p0373J59028j31072J70842J3468o5728j68226J25736
$$ 2353033 2385942 2623555 2553182 2712210 2581138 2751980 2765448 2699720 2531494 2657230
14499B657230J31069K52130j09723R1366J52359m56364L36428K40148l40645L33980
$$ 2657230 2788299 3040429 2930706 3022072 3174431 2718067 3054495 3294643 2953998 3287978
14489C287978l03341M04300m7769j15879M50061m332o12247M41423l38456K79458
$$ 3287978 2984637 3388937 3341168 3225289 3675350 3671018 3058771 3500194 3161738 3441196
14479C441196L08041j95875K82645k4953l15950K87208N25633m94174r1581J53627
$$ 3441196 3749237 3553362 3836007 3811054 3495104 3782312 4307945 3813771 3722190 3875817
14469C875817L12862j73766J42326K37751m06039L40771k9785J91857k14576P518
$$ 3875817 4188679 4014913 4157239 4394990 3988951 4329722 4299937 4491794 4277218 4284736
14459D284736M81982l14789P0784K38382r6974P1509N50552n71517l8786K16526
$$ 4284736 4766718 4451929 4522713 4761095 4664121 4735630 5286182 4714665 4675879 4892405
14449D892405J73309k9650q0366Q3995K46054j0379L67393j0833k87219K94749
$$ 4892405 5065714 5036064 4955698 5039693 5285747 5275368 5642761 5631928 5344709 5639458
14439E639458P9042k41020M3262L62099K484J12528L57558k06027K73033O6632
$$ 5639458 5718500 5477480 5520742 5882841 5885325 5997853 6355411 6149384 6422417 6489049
14429F489049J2514j19780N22708j32876j56768Q0773M06972r5998K06578j07443
$$ 6489049 6501563 6381783 6904491 6771615 6614847 6695620 7102592 7006594 7213172 7105729
14419G105729k8253J01269L03085K38261L17658j41616Q4K32860J23533n7755
$$ 7105729 7077476 7178745 7481830 7720091 8037749 7896133 7896217 8129077 8252610 8194855
14409H194855J78926M47156j13088O0410K43493j7415L08366J10242P980K13701
$$ 8194855 8373781 8820937 8707849 8768259 9011752 8994337 9302703 9412945 9420925 9634626
14399I634626L98956N245K24881J06481O6468R1556K50235M9727K62194M14844
$$ 9634626 10033582 10038827 10263708 10370189 10436657 10528213 10778448 10828175 11090369 11505213
14389A1505213K29697M99301J1882J98570k93940N33490N64463M2492N5709L92310
$$ 11505213 11734910 12234211 12246093 12444663 12150723 12684213 13248676 13291168 13346877 13739187
14379A3739187K43680R0524O87031J90292j24286K77700N19341K03008P38655
$$ 13739187 13982867 14073391 14760422 14950714 14826428 15104128 15623469 15826477 16565132
14370A6565132j19173L57609O10862J43553N02059L98084J97082N61611K94340
$$ 16565132 16445959 16803568 17414430 17557983 18060042 18458126 18655208 19216819 19511159
14361A9511159M40241J79419M75214Q15181N05499M12451M93992O91346K86646
$$ 19511159 19951400 20130819 20606033 21421214 21926713 22339164 22833156 23524502 23811148
14352B3811148P96621N28297M74174M97346P65537P83425O18466N55621J208138
$$ 23811148 24607769 25136066 25610240 26107586 26873123 27656548 28275014 28830635 30038773
14343C0038773M50547P68208J098374P32652R02861O56769J570961P55643J021991
$$ 30038773 30489320 31257528 32355902 33088554 33991415 34648184 36219145 36974788 37996779
14334C7996779J171372J472614Q38205J184391J637828J208293J624210J312590
$$ 37996779 39168151 40640765 41478970 42663361 44301189 45509482 47133692 48446282
14326D8446282J661302J790861J751542J717041K178189J696203K557626J960128
$$ 48446282 50107584 51898445 53649987 55367028 57545217 59241420 61799046 63759174
14318F3759174K659384K236132K739701K924033K949442K972489L777115K921543
$$ 63759174 66418558 68654690 71394391 74318424 77267866 80240355 84017470 86939013
14310H6939013L887280L996833M147426M501986M675266M766564N429745N468794
$$ 86939013 90826293 94823126 98970552 103472538 108147804 112914368 118344113 123812907
14302A23812907O134267O064189P143795O955453P557934Q119079Q391467R222915
$$ 123812907 129947174 136011363 143155158 150110611 157668545 165787624 174179091 183402006
14294A83402006R742629R930076J1036042J1113777J2425719J2780755J2709797
$$ 183402006 193144635 203074711 214110753 225224530 237650249 250431004 263140801
14287B63140801J4035959J4765000J4806201J5269344J5701192J5801674J5677740
$$ 263140801 277176760 291941760 306747961 322017305 337718497 353520171 369197911
14280C69197911J5782574J4806166J4163812J2889588J1989075J0362340P881713
$$ 369197911 384980485 399786651 413950463 426840051 438829126 449191466 457073179
14273D57073179M721875J132604p63762k397056l716558l549314l506981q933080
$$ 457073179 461795054 462927658 462163896 459766840 456050282 452500968 448993987 440060907
14265D40060907j1192935j3222255j4573770j5423760j5884117j6331994j6440496
$$ 440060907 428867972 415645717 401071947 385648187 369764070 353432076 336991580
14258C36991580j5802510j5958122j5376171j4778811j3636727j3009961j2529354
$$ 336991580 321189070 305230948 289854777 275075966 261439239 248429278 235899924
14251B35899924j2513675j1499132j0934502j0432061r510011r160226q402712
$$ 235899924 223386249 211887117 200952615 190520554 181010543 171850317 163447605
14244A63447605p639275p374398p355150o645947o612404n781820n077813m759986
$$ 163447605 155808330 148433932 141078782 134432835 127820431 122038611 116960798 112200812
14236A12200812m918698n207387l955033m640340l417343l172887l690549l301448
$$ 112200812 107282114 102074727 98119694 93479354 90062011 86889124 83198575 79897127
14228G9897127l323252k792935k884029k383667k685147k096855k711186j761696
$$ 79897127 76573875 73780940 70896911 68513244 65828097 63731242 61020056 59258360
14220E9258360j605419k397823j589730k205128j825443j612871r33452r54893
$$ 59258360 57652941 55255118 53665388 51460260 49634817 48021946 47088494 46133601
14212D6133601j981165j335770j624347j052423j059414q32890k52965j804908
$$ 46133601 44152436 42816666 41192319 40139896 39080482 38247592 37994627 36189719
14204C6189719r98564r81245j114681p75215k96600r75108j244495q92862q53345
$$ 36189719 35191155 34209910 33095229 32320014 32023414 31048306 29803811 28910949 28057604
14195B8057604m82175p67062j56066j005970o83563m77055r06116j64880q00108
$$ 28057604 27575429 26808367 26652301 25646331 24962768 24485713 23579597 23414717 22614609
14186B2614609m55659m75066n10410n04577n9371n39814p92469k60389l81608
$$ 22614609 22158950 21683884 21173474 20668897 20609526 20069712 19277243 19016854 18635246
14177A8635246m34451m13571l84287n18246P5526o16240j42620j68684L6913o36740
$$ 18635246 18200795 17787224 17402937 16884691 16960217 16343977 16201357 16032673 16069586 15432846
14167A5432846l34599k62602q9107o26478j98740k62372p6435k84958j88597l92215
$$ 15432846 15098247 14835645 14746538 14120060 13921320 13658948 13582513 13297555 13108958 12716743
14157A2716743j52220j78579j53290l44892j89625k2984l57620l43380J76868
$$ 12716743 12564523 12385944 12232654 11887762 11698137 11675153 11317533 10974153 11151021
14148A1151021l45748k93928k02448K18217n36605j22243J66500m32784N4543
$$ 11151021 10805273 10511345 10308897 10527114 9990509 9868266 10034766 9601982 9656525
14139I656525k93853r4562q1538j84383p2737k28426M1098l76506r5513J30583
$$ 9656525 9362672 9268110 9186572 9002189 8929452 8701026 8742124 8365618 8270105 8400688
14129H400688R5073p5720q11942O1972L8655k66157j05905n5715R6593j29098
$$ 8400688 8495761 8420041 7608099 7670071 7708726 7442569 7336664 7280949 7377542 7248444
14119G248444l8661m85576K25891k98611j04995K41167m70629J66069r226m6893
$$ 7248444 7209783 6724207 6950098 6651487 6546492 6787659 6317030 6483099 6473873 6426980
14109F426980J1525p8871J10692j62299l51787k72432m1173R9462j72188J83523
$$ 6426980 6438505 6359634 6470326 6308027 5956240 5683808 5642635 5742097 5569909 5753432
14099E753432p78232M27439J08525l269l76819P7253L00965m84224J951N0517
$$ 5753432 4975200 5402639 5511164 5507895 5131076 5208329 5509294 5025070 5027021 5077538
14089E077538r4770J03784n47789M7459K20475l44864K66338o3640J61647o07513
$$ 5077538 4982768 5086552 4538763 4586222 4806697 4461833 4728171 4664531 4826178 4218665
14079D218665N96002l92967J5474j49868Q2942j33217J4971r2534K09419k07090
$$ 4218665 4814667 4421700 4437174 4287306 4370248 4237031 4252002 4159468 4368887 4161797
14069D161797j54757q8667k12452K80420L0267j60925m2685K35143n02771L92298
$$ 4161797 4007040 3918373 3705921 3986341 4016608 3855683 3812998 4048141 3545370 3937668
14059C937668l44858L57514m83868J89693j81546K14961k47832r5759K45388K5626
$$ 3937668 3592810 3950324 3466456 3656149 3474603 3689564 3441732 3345973 3591361 3616987
14049C616987k40696n01408M12267L22280k42441k09208L21944k24046k57620
$$ 3616987 3376291 2874883 3287150 3609430 3366989 3157781 3479725 3255679 2998059
14040B998059J66889j9706n0995J39232k03532l05253N35228l14023q2651J43749
$$ 2998059 3164948 3145242 3094247 3233479 3029947 2724694 3259922 2945899 2863248 3006997
14030C006997j6971j87430N6943M1282k83696J25991j25512J37467l12443k0119
$$ 3006997 2990026 2802596 2859539 2900821 2617125 2743116 2617604 2755071 2442628 2422509
14020B422509m3351O2844J05119k99973J890M35293l61133j01156K57921k4020
$$ 2422509 2379158 2442002 2547121 2247148 2249038 2684331 2323198 2222042 2479963 2455943
14010B455943J07623j70117j92615j98030J30688R8336j68937N3334o6890J48008
$$ 2455943 2563566 2393449 2200834 2002804 2133492 2231828 2062891 2116225 2049335 2197343
14000B197343l24200J24249J86984l1969q1594J67717k73570p1596J15561j71857
$$ 2197343 1873143 1997392 2184376 2152407 2070813 2238530 1964960 1893364 2008925 1837068
13990A837068O26559K74028J258408N820710J8069321K3430733k1202044A3110909
$$ 1837068 2463627 2737655 3996063 9816773 27886094 51316827 30114783 13110909
13981G130053j858773j013325q02644n94492K66674l98477K02845n55411r8629
$$ 7130053 5271280 4257955 3455311 2860819 3127493 2729016 2931861 2376450 2277821
13972B277821j0571M05616l29058j88887l6245J43822j09536P359J36080l46957
$$ 2277821 2267250 2672866 2343808 2154921 2118676 2262498 2152962 2160321 2296401 1949444
13962A949444J80521l41458L30518l20084n3989Q8346L08752j14088l66779K25108
$$ 1949444 2129965 1788507 2119025 1798941 1744952 1833298 2142050 2027962 1661183 1886291
13952A886291j77413J61715j07834N4175R6710j34193J56247m31617k0231q0479
$$ 1886291 1708878 1870593 1762759 1816934 1913644 1779451 1935698 1504081 1483850 1403371
13942A403371J60693J87051j44048j21724J80178r2560r0952K49624l21923J37852
$$ 1403371 1564064 1751115 1607067 1485343 1665521 1572961 1482009 1731633 1409710 1547562
13932A547562p036l6182N8019j03771J95586l06815P9282Q6221k38353J46544
$$ 1547562 1540526 1504344 1562363 1458592 1654178 1347363 1426645 1512866 1274513 1421057
13922A421057j88014L1307j05026L07565j7709l32459L3063J15277j24549J88851
$$ 1421057 1233043 1264350 1159324 1466889 1449180 1116721 1149784 1265061 1140512 1329363
13912A329363P91J87145J34179m78932K46277k70124L22394k07522n867P7878
$$ 1329363 1330154 1517299 1651478 1172546 1418823 1148699 1471093 1263571 1257704 1335582
13902A335582K12112k7922j93371J15718P2848j22153k40709o9589K36791j14058
$$ 1335582 1547694 1519772 1326401 1442119 1514967 1392814 1152105 1082516 1319307 1205249
13892A205249r1835K36129k23214M26355l63534P392n0942O9440M2311R576m84995
$$ 1205249 1113414 1349543 1126329 1552684 1189150 1196542 1145600 1215040 1257351 1266927 781932
13881G81932L84805j62090k8068L28348l23651j60681L48261K01028q6623k78472
$$ 781932 1166737 1004647 976579 1304927 981276 820595 1168856 1369884 1283261 1004789
13871A004789k23980L62023k74368K69678n1084j83165J7983J74449j3013o2758
$$ 1004789 780809 1142832 868464 1138142 1087058 903893 921876 1096325 1083312 1020554
13861A020554q4815k9743L21910j33678j89926K08692q967M4564k38143Q4314
$$ 1020554 935739 905996 1227906 1094228 904302 1112994 1104027 1148591 910448 994762
13851I94762K22685k1701n16658M00046j4425k20894J52482j49922k57323K94691
$$ 994762 1217447 1195746 679088 1079134 1064709 843815 996297 846375 589052 883743
13841H83743k13834L59844k58490j2826N43913m06527L6250J09789k34179L71427
$$ 883743 669909 1029753 771263 758437 1302350 895823 932073 1041862 807683 1179110
13831A179110j60403j03047j83437j13884K50312j65766K31859N6141j26506j8342
$$ 1179110 1018707 915660 732223 618339 868651 702885 934744 990885 864379 846037
13821H46037R6764j48593j38023K07216j47487j1354K51731D69980L02320j29722
$$ 846037 942801 794208 656185 863401 715914 704560 956291 469980 772300 642578
13811F42578L67949R9212l31047J12885K7413j23964m8291J69080J07781k38266
$$ 642578 1010527 1109739 778692 891577 918990 795026 746735 915815 1023596 785330
13801G85330J16360l28992L95074L8779l05077j90986K51846J92704k52493J08836
$$ 785330 901690 572698 967772 1006551 701474 510488 762334 955038 702545 811381
13791H11381r2355j3677j43634L10910k69909J02685M3815p3585o3820L02581
$$ 811381 719026 705349 561715 872625 602716 705401 749216 675631 611811 914392
13781I14392k45341O8871J71879l13982j05238L86808l45062j2735L547p0796
$$ 914392 669051 737922 909801 595819 490581 877389 532327 519592 523139 452343
13771D52343M28815j09858j22969J10440O9183k09890m0865j20650l5547M93114
$$ 452343 881158 771300 648331 758771 827954 618064 577199 456549 421002 914116
13761I14116k20860j34262L92478D09086k00575J72515M5877K60918J30926k9957
$$ 914116 693256 558994 951472 409086 208511 381026 426903 687821 818747 788790
13751G88790j82365o497l5838p8916K52691O8482j502k61251J3188L3722L2635
$$ 788790 606425 599928 564090 485174 737865 806347 804845 543594 556782 590504 623139
13740F23139R56K12649m01733J44951j29208K41015j8455j10237J06872l01988
$$ 623139 624095 836744 435011 579962 450754 691769 673314 563077 669949 367961
13730C67961J22311Q7435O4056J86456p3734k01274n6812Q6465A52994L92091
$$ 367961 490272 577707 641763 828219 754485 553211 496399 582864 152994 545085
13720E45085j22232K6143J48661j35916L46166l74561j34686O77914C59618N8225
$$ 545085 422853 448996 597657 461741 807907 433346 298660 976574 359618 417843
13710D17843Q3698B30641M54035l37496M2288L23917C08657K28340j45468K21287
$$ 417843 501541 230641 684676 347180 389468 713385 308657 536997 391529 612816
13700F12816k33843J18673j13465J82373n4578p5802q0537J67079k35978K57811
$$ 612816 378973 497646 384181 566554 511976 436174 355637 522716 286738 544549
13690E44549k14969K14941o0264m1573K17578n7668l6417J15226j64170j02990
$$ 544549 329580 544521 484257 442684 660262 602594 566177 681403 517233 414243
13680D14243k0639J10214j95202K64311B52172L8054P6273J86139k28844J2171
$$ 414243 393604 503818 308616 572927 252172 290226 366499 552638 323794 335965
13670C35965L2694k9043l0525M05578B08210M19773n4360j85028K31397j11420
$$ 335965 368659 339616 309091 714669 208210 627983 573623 388595 619992 508572
13660E08572K49542k83321L63251C41466q3627R4517n3825K15354B52209K36983
$$ 508572 758114 474793 838044 341466 257839 352356 298531 513885 252209 489192
13650D89192j97591K38533l5958K1777n3522j67514O2589O017K38546B97363K94960
$$ 489192 291601 530134 494176 515953 462431 294917 357506 363523 602069 297363 592323
13639E92323B73787P12640C41480M9689K49755k15896H4193K29933K106Q1411
$$ 592323 273787 986427 341480 391169 640924 425028 84193 314126 316232 397643
13629C97643L9551l6835I4488K68836j49767K502k0146M04687j12283k00211J09972
$$ 397643 437194 400359 94488 363324 213557 216059 195913 600600 488317 288106 398078
13618C98078J15002o1954l3228A42185F2842O7070j6243L09992d601C44525M0781
$$ 398078 513080 451126 417898 142185 62842 129912 113669 423661 -4601 344525 385306
13607C85306c731C59471A78752K09761P9799o4054A35991K49151m4113j02084
$$ 385306 -3731 359471 178752 388513 468312 404258 135991 385142 341029 238945
13597B38945G4248L74235I2908M12228Q0117q5642G5776M67575o3300B10059N8562
$$ 238945 74248 448483 92908 505136 585253 499611 75776 543351 480051 210059 268621
13586B68621K70957k64588j09958K05351L13570B46464J11143l9264N2712e8029
$$ 268621 539578 274990 165032 370383 683953 246464 357607 318343 371055 -58029
13575A76828Q3184j09885K92888j764k2731b3587D55249A44027M1519m9505l1912
$$ 176828 260012 150127 443015 441251 418520 -23587 455249 144027 185546 136041 104129
13564A04129L19207A70179n2834J58860n826P5211r4413n2771L76855B77035m8589
$$ 104129 423336 170179 117345 276205 270379 345590 251177 198406 575261 277035 228446
13553B28446j09508K19324F9922L60848p1928J54649k50726A15953L35358q6032
$$ 228446 118938 338262 69922 430770 358842 513491 262765 115953 451311 365279
13543C65279j18547L27253j59111H4035L49519j99529j0347L86241B94774m0758
$$ 365279 246732 573985 414874 84035 433554 234025 223678 609919 294774 254016
13533B54016j05013K13001j69900j1948J55579N7114A57083J89030F5572J11772
$$ 254016 149003 362004 192104 180156 335735 392849 157083 346113 65572 177344
13523A77344J74442q7092J38742D4498J90414a570B11989J87821q8972j22593
$$ 177344 351786 264694 403436 44498 234912 -1570 211989 399810 310838 188245
13513A88245L7788L96947H3490R4690R5274k1750j4825f661m2506B98656J61185
$$ 188245 226033 622980 83490 178180 273454 251704 236879 -6661 -49167 298656 459841
13502D59841k4439F1668L34386K92668B14836I3645K38332j06848J39250J36031
$$ 459841 435402 61668 396054 688722 214836 93645 331977 225129 364379 500410
13492E00410j19759A48746K21615j06391A11922L89218B2048J89518F0607L86626
$$ 500410 380651 148746 370361 263970 111922 501140 22048 211566 60607 447233
13482D47233C6389K78515p7084F5306K50044h895A43920L5412L344Q222K47642
$$ 447233 36389 314904 237820 65306 315350 -8895 143920 179332 182676 190898 438540
13471D38540A50564o5535A3508M0565K47613K2233j48796j4159K60307e286C64664
$$ 438540 150564 85029 13508 54073 301686 323919 175123 160964 421271 -5286 364664
13459A44869K06489C4024J5469J87637a74127C53730F0781j5363J45331C9313
$$ 144869 351358 34024 49493 237130 -174127 353730 60781 45418 190749 39313
13448C91598q2531F0937J63039H8393J23453J00116L2014j23198F6456J76007
$$ 391598 309067 60937 223976 88393 211846 311962 343976 220778 66456 242463
13438B42463J03190K40369A42434a7474G2919l4746A7781J14251J87471O0599
$$ 242463 345653 586022 142434 -17474 72919 38173 17781 132032 319503 380102
13428C80102c6211G7539r310A9059K62643o7452l7721K99468k00989A28306L66134
$$ 380102 -36211 77539 68229 19059 281702 214250 176529 475997 275008 128306 494440
13417D94440k12144a12825a1401H6787J92583F9554Q1809l6292M4573N9888C9301
$$ 494440 282296 -112825 -11401 86787 279370 69554 151363 115071 159644 219532 39301
13405A82575G9134K001N7802K02661j56084D1328J90456J64754a20792B93693
$$ 182575 79134 81135 138937 341598 185514 41328 231784 396538 -120792 293693
13394A01311R142h421B80151j32945q343J20931J73877K8086C6976J11942M2618
$$ 101311 110453 -8421 280151 147206 138863 259794 433671 461757 36976 148918 191536
13383A91536L6475M24368j44496k2086a46665I1636b23492C03150p8868c0868
$$ 191536 228011 652379 507883 485797 -146665 91636 -223492 303150 224282 -30868
13372B66853b6565B92612l5561n6947P7769J12575A89697J23799J0353A48389
$$ 266853 -26565 292612 257051 200104 277873 390448 189697 313496 323849 148389
13361h0100E26707b5244C38558H244K62664c3539G4273K94802a50756H6946J73696
$$ -80100 526707 -25244 338558 8244 270908 -33539 74273 369075 -150756 86946 260642
13350B60642K55942C5081K82516j23935J76282n6122Q3574a1155C0987b7187E11461
$$ 260642 516584 35081 317597 193662 369944 313822 397396 -11155 30987 -27187 511461
13338B46841A21900a7672A99340o9787K13541j60601l4063a50168D29935j92895
$$ 246841 121900 -17672 199340 129553 343094 182493 148430 -150168 429935 237040
13328B37040j01324J53107e544A82617d6796B73513h7272B79576N5415A41495
$$ 237040 135716 288823 -5544 182617 -46796 273513 -87272 279576 334991 141495
13317D36572M1627k26139N1089A24024k7180j5080p132J13552f4304j43081A46718
$$ 436572 478199 252060 303149 124024 96844 81764 74632 188184 -64304 -207385 146718
13305A98892c2374l4574B08807N1113J16986a8322B0192N6629l6099J22947K05253
$$ 198892 -32374 -66948 208807 259920 376906 -18322 20192 76821 40722 163669 368922
13294C68922A68481q0168L59300l1222A66464a599D88944j17082b9084B66604
$$ 368922 168481 88313 447613 416391 166464 -1599 488944 371862 -29084 266604
13283F1370i0943B65072a96929B90759J6946d346A08470a98797C31576E4414K2968
$$ 61370 -90943 265072 -196929 290759 307705 -4346 108470 -198797 331576 54414 77382
13272G7382J71871i4413r6986F4504J96027a10502B51575f6872H7967a81493B27196
$$ 77382 249253 -94413 -191399 64504 260531 -110502 251575 -66872 87967 -181493 227196
13260C38341j68972B9003K55210a8982B29774J6161M1072K7552A2058O3780K56596
$$ 338341 169369 29003 284213 -18982 229774 245935 287007 314559 12058 75838 332434
13249C32434K07530A34933a58935C29079D789J77499a7031C19318G4581L1399
$$ 332434 539964 134933 -158935 329079 4789 182288 -17031 319318 74581 105980
13239A05980a3974o7511B78328b4464A18398l1047L03198F8854i017C02666A5020
$$ 105980 -13974 -81485 278328 -24464 118398 87351 390549 68854 -9017 302666 15020
13227A99349o1396e6449j2752j07678A50037o0491J45594F4583L3749B9084L63351
$$ 199349 137953 -56449 -69201 -176879 150037 89546 235140 64583 98332 29084 392435
13216C92435D3907N0805O6457j4513D6883j0689Q6305b16389C60517A12918j3008
$$ 392435 43907 94712 161169 146656 46883 36194 122499 -216389 360517 112918 99910
13205I9910C4358P4812c9379a7797k63506E4769K20822j00287B419J54617c5470
$$ 99910 34358 109170 -39379 -17797 -281303 54769 275591 175304 2419 157036 -35470
13193a09866M7343C33645k7326D5012a39933j55956i7262D2553b51176a7469B79146
$$ -109866 -62523 333645 306319 45012 -139933 -295889 -97262 42553 -251176 -17469 279146
13181A75661c05766B51011r8420r397P7031D2236c7862A38680k0165P3488e107
$$ 175661 -305766 251011 152591 143194 220225 42236 -37862 138680 118515 192003 -5107
13169d2734D1909a99460A81270C4620J43927K05230E2149N579f5373A27010J04640
$$ -42734 41909 -199460 181270 34620 178547 383777 52149 57728 -65373 127010 231650
13158B31650n9006q4222P7635c20049B24032a88300A26233J0404N0455J29041
$$ 231650 172644 88422 166057 -320049 224032 -188300 126233 136637 187092 316133
13148C16133b411C22124B801h5863A85226I2020L90361a44993D2708b18883C22274
$$ 316133 -2411 322124 2801 -85863 185226 92020 482381 -144993 42708 -218883 322274
13136b21362B04735e6583A36292M5931i4286j61041H5179C9908c3980E77477e3429
$$ -221362 204735 -56583 136292 182223 -94286 -255327 85179 39908 -33980 577477 -53429
13124B01828h2719k18145A78572n341o5801J92243b25716A12587j6420K04675
$$ 201828 -82719 -300864 178572 173231 107430 299673 -225716 112587 96167 300842
13114C00842a14137D26218g4381A34890K2416J36933a07887C2566J02025K3397
$$ 300842 -114137 426218 -74381 134890 157306 294239 -107887 32566 134591 157988
13104A57988e49o8445C26350b32830b3037A16029c4628q9870B05899q5277J33781
$$ 157988 -549 -68994 326350 -232830 -23037 116029 -34628 -124498 205899 120622 254403
13093B54403a29157H8711K14289b9918A3401p61N3054K4550K51414C9160L006
$$ 254403 -129157 88711 303000 -29918 13401 12640 65694 90244 341658 39160 42166
13082D2166b74186A37680a38859D26801g6212A58384i5410J5973A70609p062b47915
$$ 42166 -274186 137680 -138859 426801 -76212 158384 -95410 -79437 170609 163547 -247915
13070A28110P7998L1726b98426A43978L9637a35842K5953A73182H1613J8400N4410
$$ 128110 206108 237834 -298426 143978 183615 -135842 -109889 173182 81613 100013 154423
13059A54423C0978j3393m890J23274J56789M5465j59128K19680F5190L6294J60988
$$ 154423 30978 17585 12695 135969 292758 338223 179095 398775 65190 101484 262472
13048B62472j25978m4669K81011A0590M5325b8327C88111f4205C21989i7584K3963
$$ 262472 136494 91825 372836 10590 55915 -28327 388111 -64205 321989 -97584 -73621
13037g3621k9687E054Q3767a09202A38623b06656A32573L13241J6425A47451J21327
$$ -73621 -103308 5054 88821 -109202 138623 -206656 132573 445814 462239 147451 268778
13026B68778E8820J73654C91J11222L2731E4475L14004A08394P5917n261n140
$$ 268778 58820 232474 391 111613 144344 54475 368479 108394 184311 179050 173910
13015A73910n9599Q6421B6688P0681c5216B34597B6656K09772a41706n7205B37729
$$ 173910 114311 200732 26688 97369 -35216 234597 26656 236428 -141706 -198911 237729
13003A15905b37632d3111k12532A55582D5524d844E7970J36203a2105N673G8213
$$ 115905 -237632 -43111 -255643 155582 45524 -4844 57970 194173 -12105 -6432 78213
12991b1290B72416a47915A96703a16182H0364O0939B5208c1082D214P6349C9869
$$ -21290 272416 -147915 196703 -116182 80364 141303 25208 -31082 4214 80563 39869
12979a44462f6000A93304d005F3514Q4582a32354j7654G0429h1390B08645a69235
$$ -144462 -66000 193304 -4005 63514 148096 -132354 -150008 70429 -81390 208645 -169235
12967a58501b1934A7166d45234A67160D6013J60611m9149a41697A01417a41383
$$ -158501 -21934 17166 -445234 167160 46013 206624 157475 -141697 101417 -141383
12956D32015a05157K8157B81843M3551D180a36481i158k6618j64234K7476F7104
$$ 432015 -105157 -77000 281843 325394 4180 -136481 -9158 -35776 -200010 -172534 67104
12944B66263a13068A92717N2478j456r9850a70784c9744J5216A02746a00318A78920
$$ 266263 -113068 192717 245195 243739 143889 -170784 -39744 -24528 102746 -100318 178920
12932h8917A82889I0342b73278A26626l7979B573K7592K74294H0751j8506R2770
$$ -88917 182889 90342 -273278 126626 88647 2573 30165 304459 80751 62245 155015
12921A55015f2551C15917i132A6263E711Q1616J27024J0784K933r3854a18970
$$ 155015 -62551 315917 -9132 16263 5711 87327 214351 225135 228068 134214 -118970
12909b38317R1839A80811a42148B50725a77614B9231a10171A39801j158a36762
$$ -238317 -146478 180811 -142148 250725 -177614 29231 -110171 139801 138643 -136762
12898E3450Q049a821C7170K4194O534A9716L1354c869C42874D0500P7034a27801
$$ 53450 61499 -1821 37170 61364 67898 19716 51070 -3869 342874 40500 117534 -127801
12885a05049r1987A32061J16409a71488I0584b16692A01302e1629A37917F2318
$$ -105049 -197036 132061 248470 -171488 90584 -216692 101302 -51629 137917 62318
12874B6261a70510L0995C0055c57148G0416J67979C2725J20276O2048b22069l00929
$$ 26261 -170510 -139515 30055 -357148 70416 238395 32725 153001 215049 -222069 -522998
12863e22998B86559q2274l8797j7594K476F5111M8197f1810A78458b3968A51254
$$ -522998 286559 204285 165488 147894 150370 65111 113308 -61810 178458 -23968 151254
12851B58088F3184a5475B7293J05282m5477i9359B6594M53619j95502A22448a07650
$$ 258088 63184 -15475 27293 132575 87098 -99359 26594 480213 284711 122448 -107650
12839e2322b2939j13064A37127F5844a16318L9428C59229A36189J08658o3457
$$ -52322 -22939 -136003 137127 65844 -116318 -76890 359229 136189 244847 181390
12829A81390K13362a86814b9592B42147J34621A46861h8829j74987f9233I5870
$$ 181390 394752 -186814 -29592 242147 376768 146861 -88829 -263816 -69233 95870
12818G6271R843K0378L24527k00953C1487J34311h7206A97086P7532J6201B731
$$ 76271 86114 106492 431019 230066 31487 165798 -87206 197086 274618 290819 2731
12806a55711A26578K32495j63517a1088D1277J18024c3639j15659O7532k5779
$$ -155711 126578 359073 195556 -11088 41277 159301 -33639 -149298 -81766 -107545
12796a07545a0651j83532F0915J54214J09301F4356J65973i0512A04983J54953
$$ -107545 -10651 -194183 60915 215129 324430 64356 230329 -90512 104983 259936
12786B59936B7843c21306i6407J2222M784b4556m749C05877b13566A44750b96442
$$ 259936 27843 -321306 -96407 -84185 -79401 -24556 -29305 305877 -213566 144750 -296442
12774a75690E2078a0218l00492F9798J03101i6155L4519F9797a84515Q8170o7652
$$ -175690 52078 -10218 -310710 69798 172899 -96155 -61636 69797 -184515 -96345 -163997
12763a63997C8247A2731a57949C9036R2201K36192I4684d8127C0158q988a45958
$$ -163997 38247 12731 -157949 39036 131237 367429 94684 -48127 30158 21170 -145958
12751b07410M2457f0607A2825a67529C60373e4908j84038R6100f2162j73002a626
$$ -207410 -164953 -60607 12825 -167529 360373 -54908 -238946 -142846 -62162 -235164 -1626
12739D6158A813a12354B72007b1981E9854J61294A4037M69283B37907a32528l6009
$$ 46158 1813 -112354 272007 -21981 59854 221148 14037 483320 237907 -132528 -168537
12728a68537B15641F8658K32915b6480j52755H7641J7907a36857b4424A16261
$$ -168537 215641 68658 301573 -26480 -179235 87641 105548 -136857 -24424 116261
12717a69987C26065j04738a84329A80739M9568N6241l8807n6890E8812L7949h7981
$$ -169987 326065 221327 -184329 180739 230307 286548 247741 190851 58812 96761 -87981
12705b3287C56646G1544K22506A17409R8322l7635M041Q6679a30251B04331c18622
$$ -23287 356646 71544 294050 117409 215731 178096 182137 268816 -130251 204331 -318622
12693e9207B79973E263K14882c00351A34946d6045H0000K66167A05662J07129
$$ -59207 279973 5263 220145 -300351 134946 -46045 80000 346167 105662 212791
12683B12791a13969L9838A00891m8300J91596a68497H7023J73415g5272D0674
$$ 212791 -113969 -74131 100891 52591 244187 -168497 87023 260438 -75272 40674
12672A49806P9237b8755m3168A65332P5300C6491a3524C10962j20430B762N7209
$$ 149806 229043 -28755 -71923 165332 240632 36491 -13524 310962 190532 2762 59971
12661E9971J00646i3359E28785c9978E7860J01939J19397g0481A16052M33a25167
$$ 59971 160617 -93359 528785 -39978 57860 159799 279196 -70481 116052 116485 -125167
12649C04553d9444j01419D4697b12951N1217j4851c073C83069h1398B00044k6060
$$ 304553 -49444 -150863 44697 -212951 -161734 -176585 -3073 383069 -81398 200044 173984
12638A73984a28561C06863a68576J8204A88360D2543j5451b27035B88128j24259
$$ 173984 -128561 306863 -168576 -150372 188360 42543 27092 -227035 288128 163869
12628A63869K59988O3756A58221E3683e559B96377E8885J16289k7610n5346a26978
$$ 163869 423857 487613 158221 53683 -5559 296377 58885 175174 147564 92218 -126978
12616A62346a67275i06l2036q9928A09835n2316Q5634j3808C3741g5926j40772
$$ 162346 -167275 -906 -32942 -122870 109835 57519 143153 129345 33741 -75926 -216698
12605b16698h4762j91760B51128p2820K66550A24151a36577b7344E6360i8260
$$ -216698 -84762 -276522 251128 178308 444858 124151 -136577 -27344 56360 -98260
12594A6937Q2852J38722b4029B62594c6164A89640K55314i0146A7841b07983A68476
$$ 16937 99789 238511 -24029 262594 -36164 189640 444954 -90146 17841 -207983 168476
12582C29461a06749A26395a59577F4027L68410a52794B11984E6016B990g2607
$$ 329461 -106749 126395 -159577 64027 432437 -152794 211984 56016 2990 -72607
12571I8260h2456C15048n8181l5421b2601G7796e23965H6497I258K8644j567K4283
$$ 98260 -82456 315048 256867 221446 -22601 77796 -523965 86497 9258 37902 36335 60618
12559F0618J23782m3709C5850a20540A83059F223b5290A80780b69565G2272B5139
$$ 60618 184400 140691 35850 -120540 183059 6223 -25290 180780 -269565 72272 25139
12547c30186A71002l8095K4416C811J36463c54389A77973b81865a09532A1338
$$ -330186 171002 132907 157323 3811 140274 -354389 177973 -281865 -109532 11338
12536C1808H31J03855M8987e3438A51526m6791b0284B09831N1373e85j67350A4912
$$ 31808 831 104686 153673 -53438 151526 104735 -20284 209831 261204 -585 -167935 14912
12523C0890K34015m3680a68103p2253Q691K625c8507r6057j65889A04294N9604
$$ 30890 264905 221225 -168103 -240356 -231665 -229040 -38507 -134564 -300453 104294 163898
12512A63898e1101H7450j5829B5903q36M6176J7978K67243a6941G4390j8282c66591
$$ 163898 -51101 87450 71621 25903 25067 71243 89221 356464 -16941 74390 56108 -366591
12499A11838O244Q5499M1888n6848N2435c0250q0074A76484d51546a23360m03474
$$ 111838 118082 203581 245469 188621 241056 -30250 -110324 176484 -451546 -123360 -526834
12488e26834A26768k9048o570J75194j24490a36994K6350B11852A04914C7105
$$ -526834 126768 97720 91150 266344 141854 -136994 -110644 211852 104914 37105
12477A90276b16915A0867K57133k8314e2800A38449c570G7572L4110n201M35858
$$ 190276 -216915 10867 268000 239686 -52800 138449 -3570 77572 111682 106481 542339
12466E42339d4702p6286b3382k09868k13628I2070J71816p7444b45304j5854d367
$$ 542339 -44702 -120988 -23382 -233250 -446878 92070 263886 186442 -245304 -261158 -4367
12454D1847J69601b91B58044A28596a29408H1579d1579j72257R6060E1816a19135
$$ 41847 211448 -291 258044 128596 -129408 81579 -41579 -213836 -117776 51816 -119135
12442D9288J50594h1281m033J2127C05503d4553J6490j49236P2238A14643a30258
$$ 49288 199882 -81281 -85314 -73187 305503 -44553 -28063 -177299 -105061 114643 -130258
12430f3440I9075g876C91264i6593D31278j05350f4025o6087m3019N7274j23322
$$ -63440 99075 -7876 391264 -96593 431278 325928 -64025 -130112 -173131 -115857 -239179
12419b39179A31516C0902P2353b42347A25680j9257A5020a26276B30436a6753
$$ -239179 131516 30902 103255 -242347 125680 106423 15020 -126276 230436 -16753
12408d0985j06773A37980A7264p125b36401H3348K11466c5646E6203a13025d6725
$$ -40985 -147758 137980 17264 10139 -236401 83348 294814 -35646 56203 -113025 -46725
12396a26998k66859C8611c32266a12168i62A21063D5637e4320q9678D9862k3168
$$ -126998 -393857 38611 -332266 -112168 -962 121063 45637 -54320 -143998 49862 26694
12385B6694E711K26328I0783a27838J7105A17894C6618h2210F036g6769A1484
$$ 26694 5711 232039 90783 -127838 -110733 117894 36618 -82210 6036 -76769 11484
12373b58600e5630m76A79506b31065h3293n5732L556k0220O0046o5414k360F7450
$$ -258600 -55630 -56106 179506 -231065 -83293 -139025 -135469 -155689 -95643 -161057 -163417 67450
12360e381q8455B73881A17963a33241k79756E2441P3791P3763C9504a73357j9979
$$ -5381 -93836 273881 117963 -133241 -412997 52441 126232 199995 39504 -173357 -193336
12349a93336N4620e1867C1684H274c6233j85145B00560b29727A82276b37532C79945
$$ -193336 -138716 -51867 31684 8274 -36233 -221378 200560 -229727 182276 -237532 379945
12337C30878c08926b4465A56413f9382F8883k4198M8342C0197K12419M176H8348
$$ 330878 -308926 -24465 156413 -69382 68883 44685 93027 30197 242616 246792 88348
12325B0785i4639C08007r4857L9772D0519b52260A79539q64q0563b12675D6940
$$ 20785 -94639 308007 213150 252922 40519 -252260 179539 178675 98112 -212675 46940
12313b11087C18332A08195k2750P1502g733q3345E2392a37671A87564a50101D4101
$$ -211087 318332 108195 85445 156947 -7733 -91078 52392 -137671 187564 -150101 44101
12301b35679C6177b33942l4911E3998K44385F0094c63241J62740C149a55625B69240
$$ -235679 36177 -233942 -268853 53998 298383 60094 -363241 -200501 3149 -155625 269240
12289A19324b43006B8448H909L5262c0806i64B56632E8541K39703d9507j01484
$$ 119324 -243006 28448 8909 44171 -30806 -964 256632 58541 298244 -49507 -150991
12278a50991b9996F1767P8131a60788C94538C9383J90405O1295A4597J39801i7410
$$ -150991 -29996 61767 139898 -160788 394538 39383 229788 291083 14597 154398 -97410
12266a26847B54610j7338f8570B7997j128e5401r3237A78357E6875L58729j94385
$$ -126847 254610 237272 -68570 27997 26869 -55401 -148638 178357 56875 415604 221219
12255B21219j2286e3461A56373a01274G6064b3434A10031i2237b3177N872A16016
$$ 221219 208933 -53461 156373 -101274 76064 -23434 110031 -92237 -23177 -17305 116016
12243A35102A810M42108A7612J04549a25638A53700a57652o9748h7973D4970a06807
$$ 135102 1810 443918 17612 122161 -125638 153700 -157652 -227400 -87973 44970 -106807
12231B65485d0919f868B31859m6970J44541l6341a35776B3746J98496K12245J2318
$$ 265485 -40919 -6868 231859 184889 329430 293089 -135776 23746 222242 434487 446805
12220D46805m5750H7237A8819J75305l5786F5093J94688R2421j62976a71641d7387
$$ 446805 401055 87237 18819 194124 158338 65093 259781 352202 189226 -171641 -47387
12208B73188j6549g395B7873K27635O5729B692J4424N9439J24581L3833r7713
$$ 273188 256639 -7395 27873 255508 321237 2692 17116 76555 201136 234969 137256
12197A37256J29806e3839C15366A50943h4361A41837b54101B86933a53511B01602
$$ 137256 267062 -53839 315366 150943 -84361 141837 -254101 286933 -153511 201602
12186A25298J13821b23107g4691C18585A13784n3596J06491k5728p0153i752A00379
$$ 125298 239119 -223107 -74691 318585 113784 60188 166679 140951 70798 -9752 100379
12174b73894c0470n501j02221O4977B53495c4553E26552I4759J10626a2359k3746
$$ -273894 -30470 -35971 -138192 -73215 253495 -34553 526552 94759 205385 -12359 -36105
12163c6105q5189B44379G4466K2587K62425c1488r89A73714J87180c0274N068
$$ -36105 -121294 244379 74466 97053 359478 -31488 -32477 173714 360894 -30274 -25206
12152b5206A676L02818A40248m6793j3559b89546C7704J47348B2072K49983o2779
$$ -25206 1676 304494 140248 93455 79896 -289546 37704 185052 22072 272055 209276
12141B09276L8041A20714j8478a56400O3839b7659k27274A22812j1651J2310a35833
$$ 209276 247317 120714 102236 -156400 -92561 -27659 -254933 122812 111161 123471 -135833
12129a5502A61473C3422J15774b31445D5940L2994J39349a14931b3897A77718
$$ -15502 161473 33422 149196 -231445 45940 78934 218283 -114931 -23897 177718
12118b94592b7014j25310g694H2373b98073F111O1306B124J49122L5149b68893
$$ -294592 -27014 -152324 -7694 82373 -298073 6111 67417 2124 151246 186395 -268893
12106B60085A9780P5316b18300G7094b94177a17316J4475j9161n6198A40710D9807
$$ 260085 19780 95096 -218300 77094 -294177 -117316 -102841 -122002 -178200 140710 49807
12094F4818A8311c3928p9838j16380E0233M02631c6346j10912j42659G5917f5861
$$ 64818 18311 -33928 -113766 -230146 50233 452864 -36346 -147258 -289917 75917 -65861
12082C4329K0938a8434o6242B78450e6499C49455i5355B12557O0433R83555P75668
$$ 34329 55267 -18434 -84676 278450 -56499 349455 -95355 212557 272990 1256545 2032213
12071B032213I03866C82704a01310k2764Q623n6738A05769M3205l8849A3567J91532
$$ 2032213 903866 382704 -101310 -124074 -115451 -172189 105769 148974 110125 13567 205099
12060B05099b79248D14741a59498A02404C3148b6548A5555J71037b31955o9888
$$ 205099 -279248 414741 -159498 102404 33148 -26548 15555 186592 -231955 -301843
12050c01843B46409b4745G8250a89590f3956j01965L8413A20878b34034D6049
$$ -301843 246409 -24745 78250 -189590 -63956 -165921 -127508 120878 -234034 46049
12039f178H9172D4326a24511D9982b15485A95846d5815o998B24206E1182b15643
$$ -6178 89172 44326 -124511 49982 -215485 195846 -45815 -52813 224206 51182 -215643
12027a32278j55950C71515A45206A6815F947d3394m3425A82703a09108B96170
$$ -132278 -288228 371515 145206 16815 6947 -43394 -86819 182703 -109108 296170
12016C0739g4847K6562k5970J091A35179b03368A85855b05389D6870M3870j3230
$$ 30739 -74847 -48285 -74255 -73164 135179 -203368 185855 -205389 46870 90740 77510
12005G7510a97003B19984J5562c9669k3626A68397i6609E2275i7067H0869a52116
$$ 77510 -197003 219984 235546 -39669 -63295 168397 -96609 52275 -97067 80869 -152116
11993C0074c23461A11929a8081j21829A83194a21992B34719a62882e0379A16708
$$ 30074 -323461 111929 -18081 -139910 183194 -121992 234719 -162882 -50379 116708
11982b65D8203L20881b08311A75715a59181l42193D07272a89151k4694d4326B31363
$$ -265 48203 369084 -208311 175715 -159181 -501374 407272 -189151 -213845 -44326 231363
11970H5190H918R4281l7556b43117B1833b9139D9395k3121c6981C25762A50421
$$ 85190 8918 103199 65643 -243117 21833 -29139 49395 26274 -36981 325762 150421
11958b31581F9887J48287c58439F7495f27358i7900j81106H839a77081D0956h4673
$$ -231581 69887 218174 -358439 67495 -627358 -97900 -279006 8839 -177081 40956 -84673
11946c17409H9904l2764h2488A20418J07339a91968r8966H3207b17013d0865k95076
$$ -317409 89904 57140 -82488 120418 227757 -191968 -290934 83207 -217013 -40865 -335941
11935c35941C77Q8039J57478H0288a34581I3348L27m4488B3572a00638n876B69954
$$ -335941 377 88416 245894 80288 -134581 93348 93675 49187 23572 -100638 -106514 269954
11922a17182A96056P1480a05177L9961K833j92212J20109B590f6708j08326A1560
$$ -117182 196056 267536 -105177 -65216 -62383 -254595 -134486 2590 -66708 -175034 11560
11910a55889A21591b35452O5336M5274d1210A59706b22778c9764C08840p1326
$$ -155889 121591 -235452 -170116 -124842 -41210 159706 -222778 -39764 308840 237514
11900B37514a12585H487a34051b9456k9253j24100R0730E4018e3556q1585L0257
$$ 237514 -112585 8487 -134051 -29456 -58709 -182809 -92079 54018 -53556 -135141 -104884
11889a04884b2963p3727L8852i74m2028j06967j32995A81105i0161A4722a14289
$$ -104884 -22963 -96690 -57838 -974 -43002 -149969 -282964 181105 -90161 14722 -114289
11877c68654M1563e0630H4108C1617d3292r3948B19954i0626k03906E6349J54127
$$ -368654 -327091 -50630 84108 31617 -43292 -137240 219954 -90626 -294532 56349 210476
11866B10476c7398L786j51661A12571b33111J12090j85032Q3684Q5521M7404k1936
$$ 210476 -37398 -33612 -185273 112571 -233111 -121021 -306053 -222369 -136848 -89444 -111380
11855a11380q0048E2386J09290G5294K61989c59660H9206C7291d59985B34094
$$ -111380 -191428 52386 161676 75294 337283 -359660 89206 37291 -459985 234094
11844A29898L1462b49350D2508J47221b49543j85261a15973l3654k2436A44822
$$ 129898 161360 -249350 42508 189729 -249543 -434804 -115973 -149627 -172063 144822
11833e4989l3102A54151c1787G3305l2634a05477B2279a52396A76428a01445M0479
$$ -54989 -88091 154151 -31787 73305 40671 -105477 22279 -152396 176428 -101445 -60966
11822f0966B65459P4324a35726C51890A24460a73675B94109a55622p2587A31917
$$ -60966 265459 339783 -135726 351890 124460 -173675 294109 -155622 -228209 131917
11811A54880E6201b33549G5980b51952B42128k1770a31904j48058b5525o553j24411
$$ 154880 56201 -233549 75980 -251952 242128 220358 -131904 -279962 -25525 -32078 -156489
11800a56489C85563q9587A06968b9055A46365Q7015d29710B57876C9393a91206
$$ -156489 385563 295976 106968 -29055 146365 233380 -429710 257876 39393 -191206
11789b32673E3965a88833h7490k6384A93020D2475f0655a5296j2925r3841F3264
$$ -232673 53965 -188833 -87490 -113874 193020 42475 -60655 -15296 -28221 -122062 63264
11777h8503A52935j930F4024L9228m1324b28664a05470A4661a22283j06364h1781
$$ -88503 152935 151005 64024 103252 61928 -228664 -105470 14661 -122283 -228647 -81781
11765D8841b37243J2626B22418a5114B84243L4249A13553m7099B622c9075l8563
$$ 48841 -237243 -224617 222418 -15114 284243 318492 113553 66454 2622 -39075 -77638
11754g7638A84361h5982A02902a02400c184j15347H0732a38990k74881G8362K2840
$$ -77638 184361 -85982 102902 -102400 -3184 -118531 80732 -138990 -413871 78362 101202
11743A01202M1465a3479A81842b7033A27452b1249l85441E6559N8761a89713j12030
$$ 101202 142667 -13479 181842 -27033 127452 -21249 -406690 56559 115320 -189713 -301743
11732c01743J9584A35812a8961m5342B36732G3856h2673j03160o0013a14926m14124
$$ -301743 -282159 135812 -18961 -64303 236732 73856 -82673 -185833 -245846 -114926 -529050
11721e29050b59363L4964o3840g7629j6836r3591B62624a53124F6835N4656B4380
$$ -529050 -259363 -224399 -288239 -77629 -94465 -188056 262624 -153124 66835 121491 24380
11709f9805J6802k333C83692f7283A53161Q4861j2889r4608a76154C7045J57116
$$ -69805 -53003 -55336 383692 -67283 153161 238022 225133 130525 -176154 37045 194161
11698A94161q2732a10855e2125o9705O862B53844b03741g3944k2792C95926f6211
$$ 194161 111429 -110855 -52125 -121830 -114968 253844 -203741 -73944 -96736 395926 -66211
11686B03336c2826F9282a60745A57676L39374B09437m3267j8774g6221j9568j47909
$$ 203336 -32826 69282 -160745 157676 497050 209437 166170 147396 -76221 -95789 -243698
11675b43698B47644b6664A14055o125b32717Q2023j5473O1569B57820C4635h8036
$$ -243698 247644 -26664 114055 107930 -232717 -150694 -166167 -104598 257820 34635 -88036
11663D5028K165M1476R9992B9820a78560J0259A58971h7336A27042b05095F5832
$$ 45028 47193 88669 188661 29820 -178560 -168301 158971 -87336 127042 -205095 65832
11651g3315b0638g018k76963A61040E8387g9786H1454l3368a66943q5281j04248
$$ -73315 -20638 -7018 -283981 161040 58387 -79786 81454 48086 -166943 -252224 -356472
11640c56472a8790j11356A04432B3205J23192b93402c3491A81058b69267i7042
$$ -356472 -18790 -130146 104432 23205 146397 -293402 -33491 181058 -269267 -97042
11629A84455H8806a71194D5422J55789f7566A9242J0344J07804D4517J11960a63364
$$ 184455 88806 -171194 45422 201211 -67566 19242 29586 137390 44517 156477 -163364
11617A12225g6604k22178A51592b59494A49350a1932l84950B5170J80017a0504
$$ 112225 -76604 -298782 151592 -259494 149350 -11932 -396882 25170 205187 -10504
11606a00628j67883A92493p8211J61456d55102D7129J0267R2997l7159l5986J5011
$$ -100628 -268511 192493 114282 275738 -455102 47129 57396 150393 113234 77248 92259
11595I2259B8861F020J57311B0530a46610B10516a04685A05561J66955C043J28168
$$ 92259 28861 6020 163331 20530 -146610 210516 -104685 105561 272516 3043 131211
11584A31211c3057l3478l0302B6868J47700L6610g5154J3378D1180P0229j1251
$$ 131211 -33057 -66535 -96837 26868 174568 211178 -75154 -61776 41180 111409 100158
11573A00158j9728A6560b85518B35992b03500O9074L1079a8343A6319a98554B50044
$$ 100158 80430 16560 -285518 235992 -203500 -134426 -103347 -18343 16319 -198554 250044
11561a4235A33521J51806I249K3064J93964f0890H0184M3000i5019M534A76376
$$ -14235 133521 285327 9249 32313 226277 -60890 80184 123184 -95019 -90485 176376
11549c35439c4257j48513B00860b20427B55296A07510c6666q5867B97366a81896
$$ -335439 -34257 -182770 200860 -220427 255296 107510 -36666 -122533 297366 -181896
11538G4710J63876i5954f13k95394O1357A57764C6957Q0655J04330A08579C3878
$$ 74710 238586 -95954 -613 -296007 -234650 157764 36957 117612 221942 108579 33878
11526B9162K39337g9253E8851B0203b0057A07907E1377L95590b1835C72772a02402
$$ 29162 268499 -79253 58851 20203 -20057 107907 51377 446967 -21835 372772 -102402
11514b55761D1286O2382g2937A82455R5213a38165J6568L4749E1633J85250l6624
$$ -255761 41286 103668 -72937 182455 277668 -138165 -121597 -86848 51633 236883 200259
11503B00259g1193a6737D99843e6460j7411b6477G1168q074e7430F8895K3532
$$ 200259 -71193 -16737 499843 -56460 -73871 -26477 71168 63094 -57430 68895 92427
11492I2427Q0508A6632J92405K65562A36278A5973g4927B9277a41580A64699J88407
$$ 92427 172935 16632 209037 474599 136278 15973 -74927 29277 -141580 164699 353106
11481C53106G7995l8452g1009j4094A35896E4053J98267a40291A37835L11187
$$ 353106 77995 39543 -71009 -85103 135896 54053 252320 -140291 137835 449022
11471D49022m7476G7469K19334i6255R604K345C83825a1473F804K21503e7967
$$ 449022 401546 77469 296803 -96255 -86651 -84306 383825 -11473 6804 228307 -57967
11459a48150D94313G8505C1784J53512A3462h7350I6042d161A52667m0839c9849
$$ -148150 494313 78505 31784 185296 13462 -87350 96042 -4161 152667 111828 -39849
11447a42658A18847A7723J36994L7121H3958A9433J02526K1415P1913N0319O9285
$$ -142658 118847 17723 154717 191838 83958 19433 121959 143374 215287 265606 334891
11436C34891L6692j40378l033j07955h319j8881A09339f5161I2593A5928a09788
$$ 334891 371583 231205 228172 120217 -8319 -27200 109339 -65161 92593 15928 -109788
11424D84320I7842c04853A48604B9704h1312E1221b34413A03874K244a77957j06901
$$ 484320 97842 -304853 148604 29704 -81312 51221 -234413 103874 106118 -177957 -284858
11413b84858h5691G7072L909O9908e8977B03907a34103c019B20326a41121O7709
$$ -284858 -85691 77072 80981 150889 -58977 203907 -134103 -3019 220326 -141121 -73412
11402g3412F6542R9962K51526I9474h958B24768h6707H5580c25229A46000M104
$$ -73412 66542 166504 418030 99474 -8958 224768 -86707 85580 -325229 146000 150104
11391A50104o3638c19959A46509C4185b04039G2772d7299k97009d8800F6234P6867
$$ 150104 86466 -319959 146509 34185 -204039 72772 -47299 -344308 -48800 66234 143101
11380A43101h2905n0236c0814H7730a17291j18183a06790B51735b45052d5222
$$ 143101 -82905 -133141 -30814 87730 -117291 -235474 -106790 251735 -245052 -45222
11369b12458A212J04835e0125D9809a52945G2717a50565A29627D8863i4743B30131
$$ -212458 1212 106047 -50125 49809 -152945 72717 -150565 129627 48863 -94743 230131
11357a06133h869k74089J21344o7918J01250q1170j26635B15835d324j27769f4342
$$ -106133 -8869 -282958 -161614 -229532 -128282 -209452 -336087 215835 -4324 -132093 -64342
11345a15487H6928K2514K32095E0136a60924j71922A99628a80321M3315A85837
$$ -115487 86928 109442 341537 50136 -160924 -332846 199628 -180321 -137006 185837
11334c6449k26234c0944q1012A67345b9792j51971A93705i519k99809A25923b17242
$$ -36449 -262683 -30944 -111956 167345 -29792 -181763 193705 -9519 -309328 125923 -217242
11322A5117a52765k9897A68320a74840a2957j18333p617J9233K7831o8939N9949
$$ 15117 -152765 -182662 168320 -174840 -12957 -131290 -138907 -119674 -91843 -160782 -100833
11311a00833j30259n1485c3534A75520h0517B18345b73516J30455B670J13330
$$ -100833 -231092 -282577 -33534 175520 -80517 218345 -273516 -143061 2670 116000
11301A16000O7728M3088j08049J40885c11321A84559b9991A08473c6545A69089
$$ 116000 183728 226816 118767 259652 -311321 184559 -29991 108473 -36545 169089
11290B09141G4015g9369k00855A76370H586a20854K3480j82096a10104p2420C04613
$$ 209141 74015 -79369 -280224 176370 8586 -120854 -97374 -279470 -110104 -182524 304613
11278c11053J45077l1205N5146A02158d2501E0576a28569A04231e856q7498m80531
$$ -311053 -165976 -197181 -142035 102158 -42501 50576 -128569 104231 -5856 -93354 -573885
11267e73885C535b01402o3308J2870A9273L736c04211A49735b2623k66202J19120
$$ -573885 3535 -201402 -264710 -251840 19273 23009 -304211 149735 -22623 -288825 -169705
11256a69705l6783P5895A31803b20982i4504p1777A05183a79156a7329A21816
$$ -169705 -206488 -130593 131803 -220982 -94504 -166281 105183 -179156 -17329 121816
11245A54085m0729c50130g5864L3969k64306A30499K11351a66318I5991P881h9289
$$ 154085 113356 -350130 -75864 -41895 -306201 130499 341850 -166318 95991 103872 -89289
11233a5534D4500c39055A39214D7036J42467d5143G4215L13431A15811a27076
$$ -15534 44500 -339055 139214 47036 189503 -45143 74215 387646 115811 -127076
11222B08148i0812H2698a13252e3963I8037j5837R9081p9072B9491Q9474b35806
$$ 208148 -90812 82698 -113252 -53963 98037 82200 181281 102209 29491 118965 -235806
11210I5270g4069F0446b63231d4575E5059a44835d3758l2582j35562n5331h0551
$$ 95270 -74069 60446 -263231 -44575 55059 -144835 -43758 -76340 -211902 -267233 -80551
11198C693a20516I2899c76534C31713A35606J06184g3359j78249R1805j8171C64013
$$ 3693 -120516 92899 -376534 331713 135606 241790 -73359 -251608 -159803 -177974 364013
11186i2180E8379J97981f8153k45603a55266g88D5985J6879M5413J20628H5956
$$ -92180 58379 256360 -68153 -313756 -155266 -788 45985 62864 108277 228905 85956
11174C5537J87158d9098A03359a17278B13507d0389j07310j83161D8092b27331
$$ 35537 222695 -49098 103359 -117278 213507 -40389 -147699 -330860 48092 -227331
11163B13210D8949J3073j4250a74774N5252A54337b28217h324p6248n5722q7257
$$ 213210 48949 62022 47772 -174774 -119522 154337 -228217 -8324 -84572 -140294 -227551
11152b27551F2991O6686b04875j48771C3468C416i8809a3447A40547A4622c27897
$$ -227551 62991 129677 -204875 -353646 33468 3416 -98809 -13447 140547 14622 -327897
11140C2505G855N3795a9577j20887B14019a52131B67381a75827A49893b4671p1933
$$ 32505 7855 61650 -19577 -140464 214019 -152131 267381 -175827 149893 -24671 -96604
11129i6604a129A62294a86870j30527D6560B790e0051A43910o4665a12321m1073
$$ -96604 -1129 162294 -186870 -317397 46560 2790 -50051 143910 79245 -112321 -153394
11118a53394p2906b2172C32303A37567a4301j40801A63699n3845b27350B36895
$$ -153394 -226300 -22172 332303 137567 -14301 -155102 163699 109854 -227350 236895
11107B41079f6882B53569F788K48892C4474M66259A02130K18932a0926b665D3070
$$ 241079 -66882 253569 6788 255680 34474 500733 102130 321062 -10926 -2665 43070
11095I3939N7363F7303a6809j91245a02044D81381A79225J52202a40811B85139
$$ 93939 151302 67303 -16809 -208054 -102044 481381 179225 331427 -140811 285139
11084b87439F18690B18266J15425p6866A7540L17649Q2790j0520l235L01789B33665
$$ -287439 618690 218266 333691 256825 17540 335189 417979 407459 404224 706013 233665
11072C64569O7635j95707L0948a14613A08389K4382o2250O3433L21965j95391
$$ 364569 432204 236497 267445 -114613 108389 132771 70521 133954 455919 260528
11062B60528K28148L8427J14800j96720j09233J78712A38183L70868k45P3897
$$ 260528 488676 527103 641903 445183 335950 514662 138183 509051 508806 582703
11052E82703j93216J86842L2930J65805l48173M60244l0545q2703l54455J14055
$$ 582703 389487 576329 609259 775064 426891 887135 856590 773887 419432 533487
11042E33487J90255K9083n943j87215K41352k93542J79763m7164p315J49538j03300
$$ 533487 723742 752825 746882 559667 801019 507477 687240 640076 632761 782299 678999
11031F78999k56102J80842M7716k75048N0997K79625j37691k62111M16508k64300
$$ 678999 422897 603739 651455 376407 427404 707029 569338 307227 723735 459435
11021D59435J9941O2335l4860R1400J47656m8101l14053J2075K08606k67502M32505
$$ 459435 479376 541711 506851 598251 745907 697806 383753 395828 604434 336932 769437
11010G69437H5601K08641M12716l5752B59629L26174N4187k24514Q4493J69323
$$ 769437 85601 294242 706958 671206 259629 585803 639990 415476 499969 669292
11000F69292K8823J80409k74160O5548p3427R7701J16083j97712B98517K56970
$$ 669292 698115 878524 604364 669912 596485 694186 810269 612557 298517 555487
10990E55487J03683L6947o5397K80690j08049J96939k39537j31947M07080M4091
$$ 555487 659170 696117 630720 911410 803361 1000300 760763 628816 1035896 1079987
10980A079987k78894L63882k52016P82006k32337O2992L89291K68545K10257J25799
$$ 1079987 801093 1164975 912959 1694965 1462628 1525620 1914911 2183456 2393713 2519512
10970B519512L52064m06213J96733n98030k75642J11420n76403j11227k57133
$$ 2519512 2871576 2465363 2662096 2064066 1788424 1899844 1323441 1212214 955081
10961I55081L44158J13993k78342J35873o8495M3468K19077j0326n22046L1378
$$ 955081 1299239 1413232 1134890 1270763 1202268 1245736 1464813 1454487 932441 963819
10951I63819k13432L1098k94938l8736m0011P5850k18588c3603C38255p9444a0778
$$ 963819 750387 781485 486547 447811 407800 483650 265062 -33603 338255 258811 -10778
10939D33777j93720D7492K98182j22846J38283G3083K06208b5797j98025A28870
$$ 433777 240057 47492 345674 222828 361111 73083 279291 -25797 -223822 128870
10928b52886b4426F8261Q456K40210H0797M3011a5389A50380L4931d8105B56772
$$ -252886 -24426 68261 76717 316927 80797 123808 -15389 150380 185311 -48105 256772
10916e4350I64a55906f7120B99329i385j73880G017J5171J94774A07747K13521
$$ -54350 964 -155906 -67120 299329 -9385 -183265 7017 22188 216962 107747 321268
10905C21268a45820B25166A09149m7427f5285E3915a74315C4622b98947d0797
$$ 321268 -145820 225166 109149 61722 -65285 53915 -174315 34622 -298947 -40797
10894d61147D899c26010e8222r3815A29539J22439b88102C84313a88480c9078
$$ -461147 4899 -326010 -58222 -152037 129539 251978 -288102 384313 -188480 -39078
10883A67069c35920A70499h6465b4154o1592b034B05457e1447o1059c2563A3781
$$ 167069 -335920 170499 -86465 -24154 -85746 -2034 205457 -51447 -112506 -32563 13781
10871A55308i6011b234A06957e1742l122j19622A55354b20239J02921F6920L657
$$ 155308 -96011 -2234 106957 -51742 -54864 -174486 155354 -220239 -117318 66920 70577
10860G0577J55618J08070A38151P5310H5171i8712A54608o1079p555b9598D7698
$$ 70577 226195 334265 138151 213461 85171 -98712 154608 93529 85974 -29598 47698
10848C37479c17856A02905J99975C7240a35329G410a55015I0047K19802H7046
$$ 337479 -317856 102905 302880 37240 -135329 7410 -155015 90047 309849 87046
10837G3093a356m78512G7118M972g9736a9701m4698A10717f7717a9878A24685
$$ 73093 -1356 -479868 77118 82090 -79736 -19701 -64399 110717 -67717 -19878 124685
10825a63553f5417o50k87708c1443j5242n221k4280A01226B9644J92496a78486
$$ -163553 -65417 -66067 -353775 -31443 -46685 -51906 -76186 101226 29644 222140 -178486
10813d85l0280l5408q2850I5752a6500l33630A70145p9500M07626e2110q4992
$$ -485 -30765 -66173 -149023 95752 -16500 -350130 170145 90645 498271 -52110 -137102
10802a37102j26967F319a01101r5061b8091B09233O594m8335b57628C4906O4294
$$ -137102 -264069 6319 -101101 -196162 -28091 209233 215827 167492 -257628 34906 99200
10791I9200a8002p9451E3914P325a02204E6646L1107b54478J09194B18394c4303
$$ 99200 -18002 -97453 53914 61239 -102204 56646 87753 -254478 -145284 218394 -34303
10779a13195A5409J82577a7543r0160C21088d8519j26413l1959N3113E9J33083
$$ -113195 15409 197986 -17543 -107703 321088 -48519 -174932 -206891 -153778 59 133142
10768A33142a74408C02330j02816A0510N5780b97134J22326b5409q5701e988n9564
$$ 133142 -174408 302330 199514 10510 66290 -297134 -174808 -25409 -111110 -5988 -65552
10757f5552G6721N435l7976c7028r0663a3323e951F4076R8977a12019A33657a05729
$$ -65552 76721 82156 44180 -37028 -127691 -13323 -5951 64076 163053 -112019 133657 -105729
10744C26407n7381g5575A95535a57785j91666C36621d8207o3621n4348B59077
$$ 326407 269026 -75575 195535 -157785 -349451 336621 -48207 -111828 -166176 259077
10733a28772k4970D0330b05115h1382j19216d2861o9116C7925c45520A55365d27119
$$ -128772 -153742 40330 -205115 -81382 -200598 -42861 -111977 37925 -345520 155365 -427119
10721c52544a10862E3725i6817M0200k19842J01805j3961Q2992a2693E3011M66399
$$ -352544 -110862 53725 -96817 -56617 -276459 -174654 -188615 -105623 -12693 53011 519410
10710E19410A7864R327Q5284b98704I5371K35890B7086d77590A95902a09384a6434
$$ 519410 17864 27191 112475 -298704 95371 331261 27086 -477590 195902 -109384 -16434
10698a28273m0804E3162L43994b10011d3056N852B9744a2754k7178A01388a32876
$$ -128273 -169077 53162 397156 -210011 -43056 -37204 29744 -12754 -39932 101388 -132876
10686A01174D863a24489A826Q7662b08070N2869G844a55772a8226n8391I3962
$$ 101174 4863 -124489 1826 89488 -208070 -155201 7844 -155772 -18226 -76617 93962
10674a22756B43564o0685K45776H3654f8576K3111k5402n3813o8236b5961j3846
$$ -122756 243564 182879 428655 83654 -68576 -45465 -70867 -124680 -192916 -25961 -39807
10663c9807a3724B01872J2489b78767A17704e1008D7400J02746b27606Q3492B60006
$$ -39807 -13724 201872 214361 -278767 117704 -51008 47400 150146 -227606 -144114 260006
10651G0347L08539e5049m01866c2673j31643B05309o0964d93094A46354B5350
$$ 70347 378886 -55049 -456915 -32673 -164316 205309 144345 -493094 146354 25350
10640C3333J0291q728a25852e1849l6811B17011e83723i5793A46921a3858A24840
$$ 33333 43624 34896 -125852 -51849 -88660 217011 -583723 -95793 146921 -13858 124840
10628A479P0576c1175j78633o7178L5393B2495a33269j19909J08387E0817b27014
$$ 1479 72055 -31175 -209808 -276986 -241593 22495 -133269 -253178 -144791 50817 -227014
10616b3275B1898K13650o8296P1445a62071E982M4920a68517j98498h7874j25365
$$ -23275 21898 235548 167252 238697 -162071 5982 50902 -168517 -367015 -87874 -213239
10605b13239p782P6270B7366b10335A01368c2652o8054n8822N6665L9523C8539
$$ -213239 -221021 -144751 27366 -210335 101368 -32652 -100706 -159528 -102863 -63340 38539
10593i6553B9851J68978G0694k3654f8727l7012e0812H4117b93144C77027a5625
$$ -96553 29851 198829 70694 47040 -68727 -105739 -50812 84117 -293144 377027 -15625
10581B398h2757l1756E38408E9921f7087j15329A2575i520l39360A29773f19124
$$ 2398 -82757 -114513 538408 59921 -67087 -182416 12575 -9520 -348880 129773 -619124
10569b70610A21032J11471b92935A29307a61732j20730Q9021I5093l3696d5444
$$ -270610 121032 232503 -292935 129307 -161732 -282462 -193441 95093 61397 -45444
10558I3639b80578i9704J6142L7599A22363c8620a3864m4849k05220O2498I9995
$$ 93639 -280578 -99704 -83562 -45963 122363 -38620 -13864 -58713 -263933 -201435 99995
10546A58435a8170A44033c33531J50457d3634p6641A66386i7361l34199B04788
$$ 158435 -18170 144033 -333531 -183074 -43634 -120275 166386 -97361 -431560 204788
10535A89484a29953H4653J56502a09416c055k32093i9121b0841A75792a07362
$$ 189484 -129953 84653 241155 -109416 -3055 -235148 -99121 -20841 175792 -107362
10524a18825G0269J10246J3437a40609j59711D8882e9665B5704P3590Q1778R4674
$$ -118825 70269 180515 193952 -140609 -300320 48882 -59665 25704 99294 181072 275746
10513B75746G2538J57252j00592C9787J03823c63117a1545B13702A8643N8406
$$ 275746 72538 229790 129198 39787 143610 -363117 -11545 213702 18643 77049
10503G7049a05809c2853j93863a416l35805F7801J8220q896c60712d7466B16068
$$ 77049 -105809 -32853 -226716 -1416 -337221 67801 86021 77125 -360712 -47466 216068
10491b07225j03238D07109c66684a21775j95479C07560F0591j6961J41271K45378
$$ -207225 -310463 407109 -366684 -121775 -317254 307560 60591 43630 184901 430279
10481D30279P2246k08638J26824l0556P0691j36418a40271B94584A02016J8498
$$ 430279 502525 293887 420711 390155 460846 324428 -140271 294584 102016 120514
10471A20514d6053n8658A86767E4a36755M4728d0473D5607a44243C22187n8999
$$ 120514 -46053 -104711 186767 54 -136755 -92027 -40473 45607 -144243 322187 263188
10460B63188a44911p8196B13089f7739A96610e5135q6039A41177J20390r7815
$$ 263188 -144911 -223107 213089 -67739 196610 -55135 -141174 141177 261567 163752
10450A63752d6200F1408j9899c01678a44015J9952A38197D0338L35895j75753
$$ 163752 -46200 61408 41509 -301678 -144015 -124063 138197 40338 376233 200480
10440B00480a70095B43563q9959c57069e7563E4151M41113f1295K9891I8893a05790
$$ 200480 -170095 243563 153604 -357069 -57563 54151 495264 -61295 -31404 98893 -105790
10428B8928J01070a23277B28723e1667o1168B33859j03955n595E0693R973b96761
$$ 28928 129998 -123277 228723 -51667 -112835 233859 129904 124309 50693 60666 -296761
10416a48849L0633k36301a25997A18419d8997o9749b8200B62282I4465i1524j63638
$$ -148849 -118216 -354517 -125997 118419 -48997 -118746 -28200 262282 94465 -91524 -255162
10405b55162M6169C50990g6788B06195b83018f54j06864n8378D6202R8938m2948
$$ -255162 -208993 350990 -76788 206195 -283018 -654 -107518 -165896 46202 145140 102192
10394A02192m9132a47204A79286B8259P5276K06591a03500A73715R780m2599O7824
$$ 102192 53060 -147204 179286 28259 103535 310126 -103500 173715 183495 140896 208720
10383B08720m5696K56824a58395a155C04987I2653J004Q5460e7386C77041o9775
$$ 208720 163024 419848 -158395 -1155 304987 92653 93657 179117 -57386 377041 307266
10372C07266O4396G9987J73222A06188N7732J24677n0384K3318J08641m2965A23501
$$ 307266 371662 79987 253209 106188 163920 288597 238213 261531 370172 327207 123501
10360B92109f6519F41L0271O1396K7286c5623A72663J79084j60104L04646j98066
$$ 292109 -66519 641 30912 92308 119594 -35623 172663 351747 191643 496289 298223
10349B98223J78015a9837H0270L71037j51969j07943G867L85591j82178E9872
$$ 298223 476238 -19837 80270 451307 299338 191395 7867 393458 211280 59872
10338A54347l3798r946C3674a1929D28672B10064O5414a88751C33671j21916b3596
$$ 154347 120549 110603 33674 -11929 428672 210064 275478 -188751 333671 211755 -23596
10326A01948N0443d2893I1403l0662k5270J8931b5505p1442l8728d7166D81191
$$ 101948 152391 -42893 91403 60741 35471 54402 -25505 -96947 -135675 -47166 481191
10314e1581I4315b11441a144B43311n3020j2179a99382C27068J6614n7523f1785
$$ -51581 94315 -211441 -1144 243311 190291 178112 -199382 327068 343682 286159 -61785
10302A16520f9054B64344a83686N6931B58762q1298h8419L135k4717j3925B743
$$ 116520 -69054 264344 -183686 -126755 258762 177464 -88419 -85284 -110001 -123926 2743
10290A18421E4151i1171d2758I7524a89319B0644K12083g6823j14425f7672A63145
$$ 118421 54151 -91171 -42758 97524 -189319 20644 232727 -76823 -191248 -67672 163145
10278a39812p8819M1115b6703j90726e546j48976M5470c2354B87931d84666a82427
$$ -139812 -218631 -177516 -26703 -217429 -5546 -154522 -109052 -32354 287931 -484666 -182427
10266h1511A59521a19650A8770a65537g7597E8833K88275j60020J37529a60022
$$ -81511 159521 -119650 18770 -165537 -77597 58833 347108 187088 324617 -160022
10255B77874q9017J06668p3755a56277A70733a82554b2878A61468b9929a0434
$$ 277874 188857 295525 221770 -156277 170733 -182554 -22878 161468 -29929 -10434
10244d2211L930m0881j9760c1108A66296m7478b01667L3724j30130B16622f5295
$$ -42211 -38281 -79162 -98922 -31108 166296 118818 -201667 -167943 -298073 216622 -65295
10232c58490a44384k7759B71089a24360j64914a19287K8351C0133b17487a04921
$$ -358490 -144384 -172143 271089 -124360 -289274 -119287 -90936 30133 -217487 -104921
10221a888j57754k8405j51730b1541k04776k77426A06404b37241h0263L9006E5532
$$ -1888 -159642 -188047 -339777 -21541 -226317 -503743 106404 -237241 -80263 -41257 55532
10209f1016a0045m9295n8297p625c5604A7056b15349D8629b97626f8873C6816
$$ -61016 -10045 -59340 -117637 -125262 -35604 17056 -215349 48629 -297626 -68873 36816
10197H6707d5536R596R58e992j52821A45262n1922d2734A49958a20776G4811c48464
$$ 86707 -45536 -35940 -34982 -5992 -158813 145262 93340 -42734 149958 -120776 74811 -348464
10184A00367g3754o9078g677j82877C7294B140e1810j24151H7742P5400K8149
$$ 100367 -73754 -142832 -7677 -190554 37294 2140 -51810 -175961 87742 163142 191291
10173A91291E0276h7088j73722A7784M1286b00419A82779a64087A50430d6917
$$ 191291 50276 -87088 -260810 17784 59070 -200419 182779 -164087 150430 -46917
10162a29853m7461g0641a5625j96934B98354a82272D29985a3652a828k33995J16570
$$ -129853 -177314 -70641 -15625 -212559 298354 -182272 429985 -13652 -1828 -235823 -119253
10151a19253M986k94434A06453i7390L6893o2488j03903P4040d5529j90312O4093
$$ -119253 -114267 -408701 106453 -97390 -60497 -122985 -226888 -152848 -45529 -235841 -171748
10140a71748A02835B1133M1267a86508M005E6222A8977a13820B8752c49462a10920
$$ -171748 102835 21133 62400 -186508 -182503 56222 18977 -113820 28752 -349462 -110920
10128A29719M3455B4851a41057j11792i2006a4021j50459j90772J153c4976k00915
$$ 129719 173174 24851 -141057 -252849 -92006 -14021 -164480 -355252 -354099 -34976 -235891
10117b35891R5390B6211a5171o3574l48138A06562A6959a2746E941a43588q5949
$$ -235891 -140501 26211 -15171 -78745 -426883 106562 16959 -12746 5941 -143588 -229537
10106b29537L241D7724j4087O4100J17830a17708k6956k3680j90981Q4062C3659
$$ -229537 -226296 47724 33637 97737 215567 -117708 -144664 -168344 -359325 -275263 33659
10094C72323m0443a82538C7195i3220j2233D69055b52663A78515i3881m7536f9183
$$ 372323 331880 -182538 37195 -93220 -105453 469055 -252663 178515 -93881 -141417 -69183
10082E0492c9603B01252b51957e0214A24160C7079A298c24205b2153C8362b4915
$$ 50492 -39603 201252 -251957 -50214 124160 37079 1298 -324205 -22153 38362 -24915
10070H1856J4528m1308b09242i6187j18626o6520i7385B92616b31205D4118c01889
$$ 81856 96384 55076 -209242 -96187 -214813 -281333 -97385 292616 -231205 44118 -301889
10058D09268j40525a32772j64484J30795j02098B2819d342I118J95220a45909
$$ 409268 268743 -132772 -297256 -166461 -268559 22819 -4342 9118 204338 -145909
10047C76315a20294j61440O0633a08657c2132j81059A1740g7923A81171F399J06734
$$ 376315 -120294 -281734 -221101 -108657 -32132 -213191 11740 -77923 181171 6399 113133
10036A13133M4792G8259J27779A6819e0522J1092a1497F030c1662j77154B9514
$$ 113133 157925 78259 206038 16819 -50522 -39430 -11497 6030 -31662 -208816 29514
10024d0923r3068A3171K27955a02198a9525r1560j35759g9195m85345a24117A00873
$$ -40923 -133991 13171 241126 -102198 -19525 -111085 -246844 -79195 -564540 -124117 100873
10012c3997I6901k9877a09585E2939j8471a13483k15338A9916J3370A0277M420
$$ -33997 96901 67024 -109585 52939 34468 -113483 -328821 19916 33286 10277 14697
10001A4697c712j07418J0234k64997a4418D5047a844B02198m0322c2664l26897
$$ 14697 -3712 -111130 -100896 -365893 -14418 45047 -1844 202198 161876 -32664 -359561
9990c59561c3733D75926A80849a90917A27331l6142c08601B02982q9234c48984
$$ -359561 -33733 475926 180849 -190917 127331 91189 -308601 202982 113748 -348984
9979f5723k0270k8312j52441D8610j26a98256A02425a02981k15786B2705a43295
$$ -65723 -85993 -114305 -266746 48610 48484 -198256 102425 -102981 -318767 22705 -143295
9967a93676E8112G302b79598J31559A76989g7521K3770a9935k6546j12410H2985
$$ -193676 58112 7302 -279598 -148039 176989 -77521 -53751 -19935 -46481 -158891 82985
9955a31319l29454I0419c39654i2371D5983d27643A872J11928R792L2234B8404
$$ -131319 -460773 90419 -339654 -92371 45983 -427643 1872 113800 123592 155826 28404
9943a77085A56530a46320e9288C6963M7214a35117j10095A45564b13304A29871
$$ -177085 156530 -146320 -59288 36963 84177 -135117 -245212 145564 -213304 129871
9932a5578j7902l43129D3803b0235F3946a72779d2274k07179J11763B67790G7702
$$ -15578 -33480 -376609 43803 -20235 63946 -172779 -42274 -249453 -137690 267790 77702
9920A62597b67962p1399J21331J00373A85158c03623j03158a30551A36237b6685
$$ 162597 -267962 -339361 -218030 -117657 185158 -303623 -406781 -130551 136237 -26685
9909d82600e8378A56715a51057e5053n1527C4530a94774d9739l28667B19466e2864
$$ -482600 -58378 156715 -151057 -55053 -106580 34530 -194774 -49739 -378406 219466 -52864
9897A54318a49858A59184B9134b24945d4108E6896a98808j7709A44862a99996
$$ 154318 -149858 159184 29134 -224945 -44108 56896 -198808 -216517 144862 -199996
9886C8467b03258n139b7615j27866f549k52676l3914a03349d5491j77545I4049
$$ 38467 -203258 -208397 -27615 -155481 -6549 -259225 -293139 -103349 -45491 -223036 94049
9874D0572a93448J3863f3911j8965A41935b7382G2615a39894G6048b02810D51226
$$ 40572 -193448 -179585 -63911 -82876 141935 -27382 72615 -139894 76048 -202810 451226
9862c20241R3435a02405k66463R8676A5192a11128J4829a5860p7423l1069k65687
$$ -320241 -226806 -102405 -368868 -270192 15192 -111128 -96299 -15860 -93283 -124352 -390039
9851c90039c5576A65571a86632A1200a23356B3378b38933g0930p4559N1775K0431
$$ -390039 -35576 165571 -186632 11200 -123356 23378 -238933 -70930 -145489 -93714 -73283
9840g3283F3747a04860L7257F2295b61394O6239Q4850j10369C16581H5059m417
$$ -73283 63747 -104860 -67603 62295 -261394 -195155 -110305 -220674 316581 85059 80642
9829H0642f767B58279b13737d7859I5707J61103k2213c60231g3468B47059a61113
$$ 80642 -6767 258279 -213737 -47859 95707 256810 234597 -360231 -73468 247059 -161113
9817f4543q5579A79453b96570A57490a03179j8888G9419b19893m469K8384q2830
$$ -64543 -150122 179453 -296570 157490 -103179 -122067 79419 -219893 -224362 -195978 -278808
9806b78808f3114j39091k14232J19252b4643G2108a68173A19417d10771A8719
$$ -278808 -63114 -202205 -416437 -297185 -24643 72108 -168173 119417 -410771 18719
9795b00291a1088q4401j76586J14778K0148A1010a52816C39070b42718a06387
$$ -200291 -11088 -95489 -272075 -157297 -137149 11010 -152816 339070 -242718 -106387
9784b40629e0500A33737a21718J2206l36734h9607k53479D9850A6141K61002a55609
$$ -240629 -50500 133737 -121718 -109512 -446246 -89607 -343086 49850 16141 277143 -155609
9772B85617h27k8970B0371J31499P2886I5954M4324n5838N4398a33253M8850j70410
$$ 285617 -827 -29797 20371 151870 224756 95954 140278 84440 138838 -133253 -84403 -254813
9760b54813N3788i3377B9521b96040i9709i260A47312g3489n1766C66J36614i9041
$$ -254813 -201025 -93377 29521 -296040 -99709 -9260 147312 -73489 -125255 366 136980 -99041
9747c06047B42971E7153a79635J0933C3837b55670B34827b92511A23015a69698
$$ -306047 242971 57153 -179635 -168702 33837 -255670 234827 -292511 123015 -169698
9736D0460J45726a65258A74076E2972O2497L1309E7363d6656Q606j57866h652
$$ 40460 186186 -165258 174076 52972 115469 146778 57363 -46656 -38050 -195916 -8652
9724g2303j17049J314B35239J44342a53432n9604j76204E5609K12473G616A746
$$ -72303 -189352 -188038 235239 379581 -153432 -213036 -389240 55609 268082 7616 1746
9712a56868E7815e2381l49078a48990C8262g7239C40880b59676H4907J5271i2594
$$ -156868 57815 -52381 -401459 -148990 38262 -77239 340880 -259676 84907 100178 -92594
9700G1155b4277k8661B75362A05763a1114k64281J04132e0072A45099n3493i5514
$$ 71155 -24277 -52938 275362 105763 -11114 -275395 -171263 -50072 145099 91606 -95514
9688d8784k9158h586l10783A65585F3581f1462G7043a91354E9442N7074a36208
$$ -48784 -77942 -8586 -319369 165585 63581 -61462 77043 -191354 59442 116516 -136208
9676A61670d16069A77549P5443e2678k9267B02195d540D43603a36104A54603o6666
$$ 161670 -416069 177549 252992 -52678 -81945 202195 -4540 443603 -136104 154603 87937
9665H7937i4612k05260b5735C65025G4663J67192J66125A21506a76557F3450a13774
$$ 87937 -94612 -299872 -25735 365025 74663 241855 407980 121506 -176557 63450 -113774
9653g5333b8094D30512c36000D9950J16245a04233n5580O8435J9326B15307f8232
$$ -75333 -28094 430512 -336000 49950 166195 -104233 -159813 -91378 -72052 215307 -68232
9641b34935J00816D7238a09585A78343b06698O8563d2076A16499a26607N4539
$$ -234935 -134119 47238 -109585 178343 -206698 -138135 -42076 116499 -126607 -72068
9631g2068q3640M5251A22412a10008L2283B28839f6311j74079R5985d4826B1045
$$ -72068 -155708 -110457 122412 -110008 -77725 228839 -66311 -240390 -144405 -44826 21045
9619a64661L5183j7010C64404A53292b14765A00242c21402b9879D6336K01689
$$ -164661 -129478 -146488 364404 153292 -214765 100242 -321402 -29879 46336 248025
9609B48025c31864a17835B25704j422a13542p9259E154a42169b2376A1806b2671
$$ 248025 -331864 -117835 225704 224282 -113542 -192801 5154 -142169 -22376 11806 -22671
9597H3264b34031j06004a61974j39106J03943R7356B23534A7097a6991p6262B43327
$$ 83264 -234031 -340035 -161974 -301080 -197137 -99781 223534 17097 -16991 -93253 243327
9585b12239g807F734K73005a79089P1183j56796L8997n3939N8227C0093a46733
$$ -212239 -7807 6734 279739 -179089 -107906 -264702 -225705 -279644 -221417 30093 -146733
9573c42600H9956b7101A6241J60196C5479b00772A58831L9578d6615a2578B4102
$$ -342600 89956 -27101 16241 176437 35479 -200772 158831 198409 -46615 -12578 24102
9561c19346A7679J43995Q2249B0684J63510c8049B32886a5553k20411k5870A99824
$$ -319346 17679 161674 243923 20684 184194 -38049 232886 -15553 -235964 -261834 199824
9549b51568M6820A27204f638q4272k87263J85538B87629f2859m3717B97603C6541
$$ -251568 -204748 127204 -6638 -90910 -378173 -192635 287629 -62859 -106576 297603 36541
9537b21100p3066A70761d31651e3370j74524g9381i396A45250b40785A25983r865
$$ -221100 -294166 170761 -431651 -53370 -227894 -79381 -9396 145250 -240785 125983 116118
9526A16118L6895D1623a11363q0172I6357a86754Q7993j61529E7318b1709A47205
$$ 116118 153013 41623 -111363 -191535 96357 -186754 -98761 -260290 57318 -21709 147205
9514b84570f5285j5239e232j01554A1600d15106C4038b95897a09641j32980A77229
$$ -284570 -65285 -80524 -5232 -106786 11600 -415106 34038 -295897 -109641 -242621 177229
9502a87572A65187a33348C33668a67110e1008k34764J10654f8145q0068A04398
$$ -187572 165187 -133348 333668 -167110 -51008 -285772 -175118 -68145 -148213 104398
9491A05285a87254n5851j5327P4826B55406a85225o1181B5523K32889a835j13381
$$ 105285 -187254 -243105 -258432 -183606 255406 -185225 -246406 25523 258412 -1835 -115216
9480a15216j71560c7284m1705H7401f26633A21902D7331a48955O6867r6990g0094
$$ -115216 -286776 -37284 -78989 87401 -626633 121902 47331 -148955 -82088 -179078 -70094
9468A87586e6642A93342m1801b13655a5152j09642b1264C01734B6253b69361J34486
$$ 187586 -56642 193342 151541 -213655 -15152 -124794 -21264 301734 26253 -269361 -134875
9457a34875j3451A41100j8537d2211A66674b2626B12649d2152k04614h683B07358
$$ -134875 -148326 141100 122563 -42211 166674 -22626 212649 -42152 -246766 -8683 207358
9445a14682j02537o6604i466l08212E0268Q4885j7777M2846a33456C98815h758
$$ -114682 -217219 -283823 -9466 -317678 50268 135153 117376 160222 -133456 398815 -8758
9433f6737A78459a29218C6193b43618c5664j00725f0008B35292C8107c49132G047
$$ -66737 178459 -129218 36193 -243618 -35664 -136389 -60008 235292 38107 -349132 7047
9421a36904l2580d3919l64749J65801A17570h8346B35480a85271E349K7765J76865
$$ -136904 -169484 -43919 -408668 -242867 117570 -88346 235480 -185271 5349 33114 209979
9410B09979a90342A33373l8943R2094p9395a42317O6537B71829b22701B2593R2399
$$ 209979 -190342 133373 94430 186524 107129 -142317 -75780 271829 -222701 22593 114992
9399A14992K1871b13623k9579p433j67804a02345k5836j00716m5973r5454A1251
$$ 114992 136863 -213623 -243202 -250635 -418439 -102345 -128181 -228897 -274870 -370324 11251
9387G9416b26516R7291A72823n2623b3117o8145I4217B2058b3010j13333j76071
$$ 79416 -226516 -129225 172823 120200 -23117 -91262 94217 22058 -23010 -136343 -312414
9376c12414A84040a72836f6445l50655a44405b3726g471r5632k89423J93846R3913
$$ -312414 184040 -172836 -66445 -417100 -144405 -23726 -7471 -103103 -392526 -198680 -104767
9365a04767L4042A89155b19943I1293g3474J6956D3240b16698C8998e0934q6010
$$ -104767 -70725 189155 -219943 91293 -73474 -56518 43240 -216698 38998 -50934 -136944
9354a36944q8375J10941c2601p6304C126b59365G4264n892B2470J38019n9466
$$ -136944 -225319 -114378 -32601 -108905 3126 -259365 74264 68372 22470 160489 101023
9343A01023b88402A39813a18968C923a21352l4148D7618a09607j70268A53613
$$ 101023 -288402 139813 -118968 3923 -121352 -155500 47618 -109607 -279875 153613
9332a65065H6173L9770J32560c42302D1742b41276R8534j95621a67800B10650
$$ -165065 86173 125943 258503 -342302 41742 -241276 -142742 -338363 -167800 210650
9321a13775j61702J18118A80696b16197H2900L32421F9367c11224J47580E7606
$$ -113775 -275477 -157359 180696 -216197 82900 415321 69367 -311224 -163644 57606
9310a20015H6379a74730Q264o2124E3078f1896K1736E8881K5616b38237b3069
$$ -120015 86379 -174730 -166466 -228590 53078 -61896 -40160 58881 84497 -238237 -23069
9298a34450A11904c75527J66669A36523a9589A19723a50949A21404a62620F6088
$$ -134450 111904 -375527 -208858 136523 -19589 119723 -150949 121404 -162620 66088
9287A91951b04231Q8528e2522a1003q6734K716C76099h4485o53m185G2774a11177
$$ 191951 -204231 -115703 -52522 -11003 -97737 -95021 376099 -84485 -85138 -89323 72774 -111177
9274A93813d09649i5640A25087M6017a19574A34457a85120B04639a62488b9178
$$ 193813 -409649 -95640 125087 171104 -119574 134457 -185120 204639 -162488 -29178
9263c5135n9528L741j45457Q4123L7659N5667C8267c992k94190A53367A4770b00610
$$ -35135 -94663 -90922 -236379 -152256 -114597 -58930 38267 -3992 -298182 153367 14770 -200610
9250A09585m7531b66079j60634A04190L9776L7829a45087c7948H835c0949k53087
$$ 109585 62054 -266079 -426713 104190 143966 181795 -145087 -37948 8835 -30949 -284036
9239b84036L3449B2426f0297B65419m0468b0497j30321L216A14753c52391i5621
$$ -284036 -250587 22426 -60297 265419 224951 -20497 -150818 -147602 114753 -352391 -95621
9227a15978P04C01864e393B87173F712d0065L394k89618A08019b07769c8122j20661
$$ -115978 -115274 301864 -5393 287173 6712 -40065 -36671 -326289 108019 -207769 -38122 -158783
9215a58783B39370a18123A18807a64001P2266A1129J41113d3372D4437a17875
$$ -158783 239370 -118123 118807 -164001 -91735 11129 152242 -43372 44437 -117875
9204H8350a21271p2800I68J19045Q744a2708k22761o2653A87149a0117n1433p8101
$$ 88350 -121271 -194071 968 120013 128757 -12708 -235469 -298122 187149 -10117 -61550 -139651
9192a39651E4759A8129K53826c2431j05971I16i3222P829A17292b49621N1219
$$ -139651 54759 18129 271955 -32431 -138402 916 -93222 -85393 117292 -249621 -198402
9181a98402G3852L74b02121E5005g1311n4630d9142R812j03592N5991k037k38442
$$ -198402 73852 74226 -202121 55005 -71311 -125941 -49142 -39330 -142922 -86931 -88968 -327410
9169c27410B3627i3183K3984b7165A66979b30761C2079b10784R879p8390A1470
$$ -327410 23627 -93183 -69199 -27165 166979 -230761 32079 -210784 -200905 -279295 11470
9157c73038E9651J20901a0042E19452b05172f3371r2552j32556E1515d5717b1233
$$ -373038 59651 180552 -10042 519452 -205172 -63371 -155923 -288479 51515 -45717 -21233
9145a46065D0106K22348i9693j21763m3163M956J0614G3349J07279f5627I722
$$ -146065 40106 262454 -99693 -221456 -264619 -259663 -249049 73349 180628 -65627 9722
9133b01084G1921j1060i5516L9280j56090M2028l1125R9254A41916a45672H1851
$$ -201084 71921 60861 -95516 -56236 -212326 -170298 -201423 -102169 141916 -145672 81851
9121b4452j11220j08967A2203c06487J00776G2349D812a80242B30883E8733c98765
$$ -24452 -135672 -244639 12203 -306487 -205711 72349 4812 -180242 230883 58733 -398765
9109A99445q0393b59869B91733a81211A60146M8598a57580A0258b07101B8427
$$ 199445 119052 -259869 291733 -181211 160146 208744 -157580 10258 -207101 28427
9098a24025J9860F8250J6695P8883c051j38367a4681j89614M2239I9299q747b0060
$$ -124025 -104165 68250 84945 163828 -3051 -141418 -14681 -204295 -162056 99299 90552 -20060
9085a24032H7960A9116O4576R4837a89702j1404I4446J8009a09452B63474a86595
$$ -124032 87960 19116 83692 178529 -189702 -201106 94446 112455 -109452 263474 -186595
9073b17075o6985G9670g1144l50826P4530a16577L5773j86475k3473a32470j32631
$$ -217075 -284060 79670 -71144 -421970 -347440 -116577 -80804 -267279 -290752 -132470 -265101
9062b65101i9140B48079e189j16284A46721C1853j1960R4327B2458d4526k58006
$$ -265101 -99140 248079 -5189 -121473 146721 31853 19893 114220 22458 -44526 -302532
9051c02532I1451L215b68609f2811k23981A03312a15894d0973A97422P4467c12776
$$ -302532 91451 94666 -268609 -62811 -286792 103312 -115894 -40973 197422 271889 -312776
9039A62416D1733J91522r7228g8062A10307h8572A91872h6710m8945I2140c37806
$$ 162416 41733 233255 136027 -78062 110307 -88572 191872 -86710 -135655 92140 -337806
9027C532a95593P639j16783B2066J3191L93902a01864c4182A62857O1647C4893
$$ 3532 -195593 -187954 -304737 22066 35257 429159 -101864 -34182 162857 224504 34893
9015A51984c59947J02885O2525A2694b35563R8100J056p0931C3500J0018i8433
$$ 151984 -359947 -257062 -194537 12694 -235563 -137463 -136407 -207338 33500 43518 -98433
9003C7115c31543r2220B5888c69850A84727K3689o8085a11673r7690G632b8309
$$ 37115 -331543 -423763 25888 -369850 184727 208416 140331 -111673 -209363 7632 -28309
8991a96468j97101a84196g4516L4544B74519j04521a25434c5206C22105c67547
$$ -196468 -393569 -184196 -74516 -39972 274519 169998 -125434 -35206 322105 -367547
8980C27649c18708A03149J67646c02760i1799A6957J84174a22083C509b24139
$$ 327649 -318708 103149 270795 -302760 -91799 16957 201131 -122083 3509 -224139
8969b06131A60330n3569b21132k332A53551H245d8005I8984i3834I2992c30025
$$ -206131 160330 106761 -221132 -223464 153551 8245 -48005 98984 -93834 92992 -330025
8957B5434J68460f4025B7567b16703n211n4839a12212M690A34612C5648K12614
$$ 25434 193894 -64025 27567 -216703 -221914 -276753 -112212 -107522 134612 35648 248262
8946B48262p7033C5561J73140E281N3473B6116d1298j67191q723A39589K0554
$$ 248262 171229 35561 208701 5281 58754 26116 -41298 -208489 -217212 139589 160143
8935A60143a18070E43494e644l6823D7106k2102P1307a39914J4556C46249J62330
$$ 160143 -118070 543494 -5644 -42467 47106 25004 96311 -139914 -125358 346249 508579
8924E08579K50265R67474N164377J6360423A0586246B281999F89157P3023l00629
$$ 508579 758844 1726318 6890695 23251118 10586246 2281999 689157 762180 461551
8915D61551A59566c62272e7928I0197J38648M3356j35880N23542j24265A50559
$$ 461551 159566 -362272 -57928 90197 228845 272201 136321 659863 535598 150559
8904C66853b02775g5503B09846r0165j0700c52348a42676o0842B1426i073A24328
$$ 366853 -202775 -75503 209846 119681 108981 -352348 -142676 -203518 21426 -9073 124328
8892b0459j32778d1441A0499c04674J25736P7169q1942G7079a09813A32446a30245
$$ -20459 -153237 -41441 10499 -304674 -178938 -101769 -183711 77079 -109813 132446 -130245
8880A88422b30753g5553l79780a80937f0214o5300B2627J19963J84769E8242a62009
$$ 188422 -230753 -75553 -455333 -180937 -60214 -125514 22627 142590 327359 58242 -162009
8868A46434b75535i8840A78147d17058c2001o649q9083j36753E602a44697C0142
$$ 146434 -275535 -98840 178147 -417058 -32001 -38650 -127733 -264486 5602 -144697 30142
8856c5579j35453N694p0908B19556q7111f6913m1376H9783f7531j47504F4258
$$ -35579 -171032 -165338 -236246 219556 132445 -66913 -108289 89783 -67531 -215035 64258
$$ [...]
##END NTUPLES=NMR SPECTRUM
##END=
