
##TITLE=UV1239_M8_1260-1248_50_7241349_E9UsV6gr8g
##JCAMPDX= 6.0         $$ Bruker NMR JCAMP-DX V2.0
##DATA TYPE= NMR SPECTRUM
##DATA CLASS= NTUPLES
##ORIGIN= BRUKER
##OWNER= Administrator
$$ 1.72 TOPSPIN		Version 2.1
$$ 2013-01-23 16:33:01.723 -0500  Administrator@X
$$ Compression mode = diff/dup
##.OBSERVE FREQUENCY= 400.02188249412
##.OBSERVE NUCLEUS= ^1H
##.ACQUISITION MODE= SIMULTANEOUS (DQD)
##.ACQUISITION SCHEME= undefined
##.AVERAGES= 64
##.DIGITISER RES= 22
##SPECTROMETER/DATA SYSTEM= spect
##.PULSE SEQUENCE= noesygpps1d.comp
##.SOLVENT NAME= COFFEE_meoh
##.SHIFT REFERENCE= INTERNAL, COFFEE_meoh, 1, 14.96137
##AUDIT TRAIL= $$ (NUMBER, WHEN, WHO, WHERE, PROCESS, VERSION, WHAT)
$$ ##TITLE= Audit trail, TOPSPIN		Version 2.1
$$ ##JCAMPDX= 5.01
$$ ##ORIGIN= Bruker BioSpin GmbH
$$ ##OWNER= Administrator
$$ $$ E:\/data/COFFEE/nmr/UV1239_M8_1260-1248_50_7241349_E9UsV6gr8g/22/pdata/1/auditp.txt
$$ ##AUDIT TRAIL=  $$ (NUMBER, WHEN, WHO, WHERE, PROCESS, VERSION, WHAT)
(   1,<2013-01-19 02:01:53.552 -0500>,<Administrator>,<X>,<go>,<TOPSPIN 2.1>,
      <created by zg
	started at 2013-01-19 01:50:23.334 -0500,
	POWCHK enabled, PULCHK disabled,
       configuration hash MD5:
       86 BA 57 50 F2 9D 5C 9B 26 00 A9 28 5F 66 2E 89
       data hash MD5: 64K
       D0 02 C8 C2 17 5C 4B 9F 70 2F 68 A3 25 5C D2 CF>)
(   2,<2013-01-19 02:01:56.646 -0500>,<Administrator>,<X>,<proc1d>,<TOPSPIN 2.1>,
      <Start of raw data processing
       efp LB = 0.3 FT_mod = 6 PKNL = 1 PHC0 = 0 PHC1 = 0 SI = 128K 
       data hash MD5: 128K
       DF 97 B0 77 5D B0 20 6E 41 59 CB 56 C2 B5 C1 BF>)
(   3,<2013-01-19 02:01:57.693 -0500>,<Administrator>,<X>,<proc1d>,<TOPSPIN 2.1>,
      <pk PHC0 = -82.1283 PHC1 = 0 
       data hash MD5: 128K
       73 87 9D 77 19 3A 40 BD 2B 39 0B 5A 96 BE F1 30>)
(   4,<2013-01-19 02:01:58.380 -0500>,<Administrator>,<X>,<proc1d>,<TOPSPIN 2.1>,
      <abs ABSG = 1 
       data hash MD5: 128K
       E0 05 D9 70 EF 39 29 08 12 BF 08 E5 87 8B 0F 2F>)
(   5,<2013-01-19 02:01:58.537 -0500>,<Administrator>,<X>,<proc1d>,<TOPSPIN 2.1>,
      <abs ABSG = 2 
       data hash MD5: 128K
       C5 4C A9 60 9D 1A 8D CB 11 44 80 C9 4C 74 54 96>)
(   6,<2013-01-19 02:01:58.709 -0500>,<Administrator>,<X>,<proc1d>,<TOPSPIN 2.1>,
      <abs ABSG = 3 
       data hash MD5: 128K
       22 34 A6 A4 A2 6F AE 52 5B 74 A8 37 81 3C 8E 00>)
(   7,<2013-01-19 02:01:58.880 -0500>,<Administrator>,<X>,<proc1d>,<TOPSPIN 2.1>,
      <abs ABSG = 4 
       data hash MD5: 128K
       BA CB 4C CB 0B 32 3E C8 DF AA F9 EF 38 75 2A 89>)
(   8,<2013-01-19 02:01:59.052 -0500>,<Administrator>,<X>,<proc1d>,<TOPSPIN 2.1>,
      <abs ABSG = 5 
       data hash MD5: 128K
       1F AA 30 A1 71 E7 FA 77 37 7E CE 95 D4 4D D1 66>)
(   9,<2013-01-19 02:02:05.584 -0500>,<Administrator>,<X>,<audit>,<TOPSPIN 2.1>,
      <user comment:
       ICON-NMR User ID: COFFEE
       data hash MD5: 128K
       1F AA 30 A1 71 E7 FA 77 37 7E CE 95 D4 4D D1 66>)
$$ ##END=
$$ 
$$ $$ hash MD5
$$ [...]
150 150 150 150 150 150 150 150
##$TP07= 0
##$TPNAME0= <>
##$TPNAME1= <>
##$TPNAME2= <>
##$TPNAME3= <>
##$TPNAME4= <>
##$TPNAME5= <>
##$TPNAME6= <>
##$TPNAME7= <>
##$TPOAL= (0..7)
0.5 0.5 0.5 0.5 0.5 0.5 0.5 0.5
##$TPOFFS= (0..7)
0 0 0 0 0 0 0 0
##$TUNHIN= 0
##$TUNHOUT= 0
##$TUNXOUT= 0
##$USERA1= <user>
##$USERA2= <user>
##$USERA3= <user>
##$USERA4= <user>
##$USERA5= <user>
##$V9= 5
##$VALIST= <valist>
##$VCLIST= <CCCCCCCCCCCCCCC>
##$VD= 0
##$VDLIST= <DDDDDDDDDDDDDDD>
##$VPLIST= <PPPPPPPPPPPPPPP>
##$VTLIST= <TTTTTTTTTTTTTTT>
##$WBST= 1024
##$WBSW= 4
##$XGAIN= (0..3)
0 0 0 0
##$XL= 0
##$YL= 0
##$YMAX_a= 5994909
##$YMIN_a= -13042409
##$ZGOPTNS= <>
##$ZL1= 120
##$ZL2= 120
##$ZL3= 120
##$ZL4= 120
##$ABSF1= 14.96137
##$ABSF2= -5.596811
##$ABSG= 5
##$ABSL= 3
##$ALPHA= 0
##$AQORDER= 0
##$ASSFAC= 0
##$ASSFACI= 0
##$ASSFACX= 0
##$ASSWID= 0
##$AUNMP= <proc_prof1d_extract.lims>
##$AXLEFT= 0
##$AXNAME= <>
##$AXNUC= <1H>
##$AXRIGHT= 0
##$AXTYPE= 0
##$AXUNIT= <>
##$AZFE= 0.1
##$AZFW= 0.1
##$BCFW= 0
##$BC_mod= 0
##$BYTORDP= 0
##$COROFFS= 0
##$CY= 15
##$DATMOD= 1
##$DC= 0
##$DFILT= <>
##$DTYPP= 0
##$F1P= 0
##$F2P= 0
##$FCOR= 0.5
##$FTSIZE= 131072
##$FT_mod= 6
##$GAMMA= 0
##$GB= 0
##$INTBC= 1
##$INTSCL= 1
##$ISEN= 128
##$LB= 0.3
##$LEV0= 0
##$LPBIN= 0
##$MAXI= 10000
##$MC2= 0
##$MEAN= 0
##$ME_mod= 0
##$MI= 0
##$NCOEF= 0
##$NC_proc= -2
##$NLEV= 6
##$NOISF1= 0
##$NOISF2= 0
##$NSP= 0
##$NTH_PI= 0
##$NZP= 0
##$OFFSET= 14.96137
##$PC= 1
##$PHC0= -82.1283
##$PHC1= 0
##$PH_mod= 1
##$PKNL= yes
##$PPARMOD= 0
##$PPDIAG= 0
##$PPIPTYP= 0
##$PPMPNUM= 2147483647
##$PPRESOL= 1
##$PSCAL= 4
##$PSIGN= 0
##$PYNMP= <proc.py>
##$REVERSE= no
##$SF= 400.020009490173
##$SI= 131072
##$SIGF1= 0
##$SIGF2= 0
##$SINO= 400
##$SIOLD= 131072
##$SPECTYP= <>
##$SREGLST= <1H.CDCl3>
##$SSB= 0
##$STSI= 131072
##$STSR= 0
##$SW_p= 8223.68421052631
##$SYMM= 0
##$S_DEV= 0
##$TDeff= 65536
##$TDoff= 0
##$TI= <>
##$TILT= no
##$TM1= 0
##$TM2= 0
##$TOPLEV= 0
##$USERP1= <user>
##$USERP2= <user>
##$USERP3= <user>
##$USERP4= <user>
##$USERP5= <user>
##$WDW= 1
##$XDIM= 131072
##$YMAX_p= 432373718
##$YMIN_p= -17937
##$CURPLOT= <Network HP LaserJet P1505>
##$CURPRIN= <$Network HP LaserJet P1505>
##$DFORMAT= <normdp>
##$LAYOUT= <+/1D_H.xwp>
##$LFORMAT= <normlp>
##$PFORMAT= <normpl>
##$SURQMSG= 1
$$ End of Bruker specific parameters
$$ ---------------------------------
##NTUPLES= NMR SPECTRUM
##VAR_NAME=  FREQUENCY,     SPECTRUM/REAL,   SPECTRUM/IMAG
##SYMBOL=    X,             R,               I
##VAR_TYPE=  INDEPENDENT,   DEPENDENT,       DEPENDENT
##VAR_FORM=  AFFN,          ASDF,            ASDF
##VAR_DIM=   131072,        131072,          131072
##UNITS=     HZ,            ARBITRARY UNITS, ARBITRARY UNITS
##FACTOR=    0.0627417313425164, 1,          1
##FIRST=     8223.62146879497, 214,          -59992
##LAST=      0,             1351,            -60533
##MIN=       0,             -17937,          0
##MAX=       8223.62146879497, 432373718,    0
$$ Real data points
##PAGE= N=1
##DATA TABLE= (X++(R..R)), XYDATA
$$ [...]
63865F43772J7896K0036K2974K6307K9441L2097L4077L5153L5510L5838L6516
63854I69617L6972L6305L4436L2134K9846K7142K3495J9150J4774J0487N800M47
63842A240605n189j0583j5670k0730k5865l0758l4847l7663l9216m0124m1139
63831I38821m2309m2777m1751l9566l7390l5836l4331l2195k9779k7899k6399
63820E48589k4172k0815j7488j5553j4958j4568j3697j2554j1437j0264q966p670
63808C76447o413n252m579m718n208n252m955n189o011o195m950l228k542l109
63794C08846l942m287m091l465k606k079k357l073l390l007k281j525q81o20q57
63779B70385j121r59q08j394k410k733k010j040m95k58j94m61o84lJ466K192J164
$$ y = [643772, 661668, 681704, 704678, 730985, 760426, 792523, 826600, 861753, 897263, 933101, 969617, 1006589, 1042894, 1077330, 1109464, 1139310, 1166452, 1189947, 1209097, 1223871, 1234358, 1240158, 1240605, 1235416, 1224833, 1209163, 1188433, 1162568, 1131810, 1096963, 1059300, 1020084, 979960, 938821, 896512, 853735, 811984, 772418, 735028, 699192, 664861, 632666, 602887, 574988, 548589, 524417, 503602, 486114, 470561, 455603, 441035, 427338, 414784, 403347, 393083, 384117, 376447, 370034, 364782, 360203, 355485, 350277, 345025, 340070, 334881, 328870, 322675, 317725, 314497, 311955, 308846, 304904, 300617, 296526, 293061, 290455, 288376, 286019, 282946, 279556, 276549, 274268, 272743, 271862, 271242, 270385, 269264, 268305, 267497, 266103, 263693, 260960, 258950, 257910, 257415, 257157, 256963, 256502, 255818, 255815, 257281, 259473, 260637]
63762B60637n92j393j093q81j296j672j405p48j66K71O05P20O18N80P65R97J069
63745B57016J065J274J902K844L593L613K969K426K569L035K979K154J135N46
63731B89120N43R98J706K371K758L058L705M794N887O458O283N440M246L244K836
63716C43447K833K665K073J283M92m29j552k647l445l855l760l097k303k156k721
63701C26828k923j784K07J618J883J855K451L461M033L870L427L187L180L122
63687C54415K677J663L18o85q31l54P3J95L47O46N97j48r90r53O6J193J737J952
63669C61918K346K794K809K447K291K478K316J170n84j934k364k313k472l032
63655C67870l678m044m022l779l620l675l657l173k322j718j664j754j566j374
$$ y = [260637, 260045, 258652, 257559, 256678, 255382, 253710, 252305, 251557, 251391, 251662, 252267, 252987, 253605, 254185, 254950, 255947, 257016, 258081, 259355, 261257, 264101, 267694, 271307, 274276, 276702, 279271, 282306, 285285, 287439, 288574, 289120, 289663, 290661, 292367, 294738, 297496, 300554, 304259, 309053, 314940, 321398, 327681, 333121, 337367, 340611, 343447, 346280, 348945, 351018, 352301, 352793, 352364, 350812, 348165, 344720, 340865, 337105, 334008, 331705, 329549, 326828, 323905, 322121, 322328, 323946, 325829, 327684, 330135, 333596, 337629, 341499, 344926, 348113, 351293, 354415, 357092, 358755, 359073, 358388, 357557, 357203, 357276, 357471, 357818, 358464, 359061, 358913, 357923, 356970, 357036, 358229, 359966, 361918, 364264, 367058, 369867, 372314, 374605, 377083, 379399, 380569, 379985, 378051, 375687, 373374, 370902, 367870, 364192, 360148, 356126, 352347, 348727, 345052, 341395, 338222, 335900, 334182, 332518, 330764, 329198, 327824]
63641C27824j549j604o10J357L097L785L857L988L973L359K583K648L865N642
63627C62215P310Q519Q972Q599Q038Q203R247J0621J2095J3958J6062J7608J8375
63614E09822J9346K1389K3862K5381K5707K6064K7557K9815L1332L0856K8278
63603G99409K4351J9670J4067P272J26n428q041q318q038q309q923r382r848j0880
63589G87728j2661j4798j6762j8305j9479k0353k0765k0475j9462j7921j6007
63578E90740j3869j1886j0439r253p507m878k093o0J184K184L149L937M653N544
63564E51406O368O634O475O620P301P939Q107Q234R014J0627J2906J5796J9161
63551F76588K2526K5501K8355L1724L5836M0194M3717M4861M1908L3915K1694
$$ y = [327824, 326275, 324671, 324061, 325418, 328515, 332300, 336157, 340145, 344118, 347477, 350060, 352708, 356573, 362215, 369525, 378044, 387016, 395615, 403653, 411856, 421103, 431724, 443819, 457777, 473839, 491447, 509822, 529168, 550557, 574419, 599800, 625507, 651571, 679128, 708943, 740275, 771131, 799409, 823760, 843430, 857497, 864769, 864895, 859467, 851426, 843108, 835070, 826761, 817838, 808456, 798608, 787728, 775067, 760269, 743507, 725202, 705723, 685370, 664605, 644130, 624668, 606747, 590740, 576871, 564985, 554546, 545293, 537786, 532908, 530815, 530755, 531939, 534123, 537272, 541209, 545862, 551406, 557774, 564408, 570883, 577503, 584804, 592743, 600850, 609084, 618098, 628725, 641631, 657427, 676588, 699114, 724615, 752970, 784694, 820530, 860724, 904441, 949302, 991210, 1025125, 1046819]
63540A046819P750m873j3906j8590j9693j8786j7153j5233j3041j0889r384q987
63528I04034r899j2195j5596j9273k2369k4776k6846k8383k8594k7288k5452k4091
63516F39272k3022k1437j9317j7491j6390j5516j4258j2650j1052r622q400p516
63504D62601o951o397n695n072m673m177l356k688k826l605m122l834l038k259
63490D03908j663j269j197j347j196l55Q64J740J996K134K858M251N566N895N092
63475D27277L899L071K654K358K211K273J891K09k456m568n116m738m634m974
63461D19357n114m791m353l978l485k814k065j149N6J253K062K674L586M687N368
63446D11294N588O085P362R071J0728J2390J4267J6221J8118K0356K3626K8235
$$ y = [1046819, 1054569, 1049696, 1035790, 1017200, 997507, 978721, 961568, 946335, 933294, 922405, 913021, 904034, 894135, 881940, 866344, 847071, 824702, 799926, 773080, 744697, 716103, 688815, 663363, 639272, 616250, 594813, 575496, 558005, 541615, 526099, 511841, 499191, 488139, 478517, 470117, 462601, 455650, 449253, 443558, 438486, 433813, 429636, 426280, 423592, 420766, 417161, 413039, 409205, 406167, 403908, 402245, 400976, 399779, 398432, 397236, 396881, 397745, 399485, 401481, 403615, 406473, 410724, 416290, 422185, 427277, 431176, 434247, 436901, 439259, 441470, 443743, 445634, 445843, 443387, 438819, 433703, 428965, 424331, 419357, 414243, 409452, 405099, 401121, 397636, 394822, 392757, 391608, 391664, 392917, 394979, 397653, 401239, 405926, 411294, 416882, 422967, 430329, 439400, 450128, 462518, 476785, 493006, 511124, 531480, 555106, 583341]
63434E83341L3731L8769M1318L9631L3609K5003J6064Q279K416j011j926q90J493
63421H19827N101R849J5121K0192K4810K8745L1165L1213K8997K5217K0062J3412
63409A073711O013n70n415q816j1147j2173j1915j1320j1291j1736j2387j3875
63397I69079j7028k1378k5415k8232l0061l1157l1179k9955k8004k5853k3415
63386F77402k0612j8043j6357j5262j3775j1416q643o183m357l084k048q29R06
63373E57699L095N374P443R149J0397J1303J2398J4186J6385J8129J9107K0052
63361G04717K1745K3997K6114K7987L0007L2085L3510L3884L3401L1888K8302
63350A027637K1938J3762N814n91n510r283j1640j2258j1630j0871j0790j1590
$$ y = [583341, 617072, 655841, 697159, 736790, 770399, 795402, 811466, 819745, 822161, 821150, 819224, 818334, 819827, 824928, 834777, 849898, 870090, 894900, 923645, 954810, 986023, 1015020, 1040237, 1060299, 1073711, 1079724, 1079154, 1073739, 1064923, 1053776, 1041603, 1029688, 1018368, 1007077, 995341, 982954, 969079, 952051, 930673, 905258, 877026, 846965, 815808, 784629, 754674, 726670, 700817, 677402, 656790, 638747, 622390, 607128, 593353, 581937, 573294, 567111, 562754, 559670, 557622, 556793, 557699, 560794, 566168, 573611, 582760, 593157, 604460, 616858, 631044, 647429, 665558, 684665, 704717, 726462, 750459, 776573, 804560, 834567, 866652, 900162, 934046, 967447, 999335, 1027637, 1049575, 1063337, 1069151, 1068560, 1063050, 1053767, 1042127, 1029869, 1018239, 1007368, 996578, 984988]
63338I84988j3171j5357j7841k0410k3189k6290k9140l0634l0219k8470k6289
63327G23978k3782k0400j6041j1514p701m527j118K883O295O873L172l913j1610
63314F42595j7427k0731k2235k2469k1296j8784j5785j3346j1888j1125j0499
63303D57010r496p932o216n115m906n022m730l997l309k899k603k355k366k736
63289C93328l283l823m308m593m420l764k965k316j765j154n52j98k14n83j188
63274C58202j731j770j136k62J25k34q20q86k34N91Q80N20L6l9K37M24M06N84
63256C54893J295K244K770K578K027J728K019K817L728M245M018L169K366K310
63242C92207L109M163M811N009N283O068P266Q459R390J0166J1058J2194J3364
$$ y = [984988, 971817, 956460, 938619, 918209, 895020, 868730, 839590, 808956, 778737, 750267, 723978, 700196, 679796, 663755, 652241, 644540, 640013, 638895, 641778, 648073, 654946, 658118, 654205, 642595, 625168, 604437, 582202, 559733, 538437, 519653, 503868, 490522, 478634, 467509, 457010, 447514, 439582, 433366, 428251, 423345, 418323, 413593, 409596, 406287, 403388, 400785, 398430, 396064, 393328, 390045, 386222, 381914, 377321, 372901, 369137, 366172, 363856, 362091, 360937, 360385, 360187, 359973, 359390, 358202, 356471, 354701, 353565, 353303, 353428, 353194, 352374, 351488, 351254, 351845, 352725, 353245, 353281, 353242, 353479, 353903, 354309, 354893, 356188, 358432, 361202, 363780, 365807, 367535, 369554, 372371, 376099, 380344, 384362, 387531, 389897, 392207, 395316, 399479, 404290, 409299, 414582, 420650, 427916, 436375, 445765, 455931, 466989, 479183, 492547]
63229D92547J4100J4103J3627J3279J3336J3545J3689J3965J4464J4657J4003
63218F45315J2960J2637J3348J4175J4282J3979J4013J4220J3638J1753Q969N880
63206G95169K765j90k755n039p526j0429j3338j5704j7360j8295j8311j7350j5826
63193F55811j4200j2361r952p186m835l314k259j085L93K104M120O544R169J1470
63179F34419J2973J3588J3675J3775J4129J4408J4159J3474J2956J2988J3360
63168G83904J3683J3748J3346J2168J0253Q120O081L788Q83k238m935p303j0020
63155H41478j3338j6857k0134k2849k4339k3939k2068k0259j9611j9617j9004
63144F19463j7229j4814j2487j0586r050p624o208n169n069n762o130n153l043
$$ y = [492547, 506647, 520750, 534377, 547656, 560992, 574537, 588226, 602191, 616655, 631312, 645315, 658275, 670912, 684260, 698435, 712717, 726696, 740709, 754929, 768567, 780320, 789289, 795169, 797934, 797744, 794989, 789950, 782424, 771995, 758657, 742953, 725593, 707298, 688987, 671637, 655811, 641611, 629250, 619298, 612112, 607277, 603963, 601704, 600619, 601012, 603116, 607236, 613780, 622949, 634419, 647392, 660980, 674655, 688430, 702559, 716967, 731126, 744600, 757556, 770544, 783904, 797587, 811335, 824681, 836849, 847102, 855222, 861303, 865091, 865974, 863736, 858801, 851498, 841478, 828140, 811283, 791149, 768300, 743961, 720022, 697954, 677695, 658084, 638467, 619463, 602234, 587420, 574933, 564347, 555297, 547673, 541465, 536296, 531227, 525465, 519335, 514182, 511139]
63131E11139r18M45J154J619J985K212K400K796L517M256M378L693L021L493N072
63116E50262O373O322N439M884M850M642L993L355K958K503J897J530J620J914
63102F02542K209K555K805K606K091J961K475L033L154L318M183N366N817N208
63088F49323M323L961M033L922L335K457J466K86j092k287k804k607k236k245
63074F59835k728l447m154m575m308l171j556j04R66J988L363N203P296R166J0322
63059F74096J0774J1169J2091J3425J4876J6765J9611K3068K6045K8037K9584
63048H79541L1294L3104L4716L6048L6920L7001L6432L5890L5621L5085L3957
63037A265609L2800L2204L1834L1055K9953K9018K8271K7382K6315K5013K2804
$$ y = [511139, 510221, 510666, 511820, 513439, 515424, 517636, 520036, 522832, 526349, 530605, 534983, 538676, 541697, 545190, 550262, 556635, 562957, 568396, 573280, 578130, 582772, 586765, 590120, 593078, 595581, 597478, 599008, 600628, 602542, 604751, 607306, 610111, 612717, 614808, 616769, 619244, 622277, 625431, 628749, 632932, 638298, 644115, 649323, 653646, 657607, 661640, 665562, 668897, 671354, 672820, 673106, 672014, 669727, 666923, 664316, 662080, 659835, 657107, 653660, 649506, 644931, 640623, 637452, 635896, 635792, 636758, 638746, 642109, 647312, 654608, 663774, 674096, 684870, 696039, 708130, 721555, 736431, 753196, 772807, 795875, 821920, 849957, 879541, 910835, 943939, 978655, 1014703, 1051623, 1088624, 1125056, 1160946, 1196567, 1231652, 1265609, 1298409, 1330613, 1362447, 1393502, 1423455, 1452473, 1480744, 1508126, 1534441, 1559454, 1582258]
63026A582258J8932J3598P677J531n146j2304j9259k5578l1523l7275m2263m5649
63014A404999m7178m7184m6001m3648m0113l5793l1451k7529k3630j9013j3737
63003A029722q728m529n84L739Q084J1672J4473J6955J9120K0710K1999K3382
62991A156015K4373K4219K3512K3799K5303K6380K5808K4455K3679K3072K1001
62980A421616J6919J1971P362L063j720p439j3833k0245k6127l1260l5511l8512
62968A286284l9943m0188m0184m0289l9872l8386l6364l4675l3259l1391k8975
62957H82758k6742k5160k3886k2529k1245k0317j9581j8686j7603j6579j5726
62946F54704j4928j4054j3088j2052j0998j0042r302q770q226p473o677o272o324
$$ y = [1582258, 1601190, 1614788, 1622465, 1623996, 1618850, 1606546, 1587287, 1561709, 1530186, 1492911, 1450648, 1404999, 1357821, 1310637, 1264636, 1220988, 1180875, 1145082, 1113631, 1086102, 1062472, 1043459, 1029722, 1020994, 1016465, 1015881, 1019620, 1027704, 1039376, 1053849, 1070804, 1089924, 1110634, 1132633, 1156015, 1180388, 1204607, 1228119, 1251918, 1277221, 1303601, 1329409, 1353864, 1377543, 1400615, 1421616, 1438535, 1450506, 1457868, 1460931, 1459211, 1451772, 1437939, 1417694, 1391567, 1360307, 1324796, 1286284, 1246341, 1206153, 1165969, 1125680, 1085808, 1047422, 1011058, 976383, 943124, 911733, 882758, 856016, 830856, 806970, 784441, 763196, 742879, 723298, 704612, 687009, 670430, 654704, 639776, 625722, 612634, 600582, 589584, 579542, 570240, 561470, 553244, 545771, 539094, 532822, 526498]
62933E26498o175n160l651k717k722k863k468k000k171k679k663k112j842k190
62919D85085k637k726k525k050j123r0J96m78j194j117n29j66p5J50M73N45M64
62902D72203O93J289J825K069K224K497K907L420L866L825L128K374K355K900
62888E07575L060K509K041K347K938K857K003J085N63J92l94j208k078k879l530
62873E17081l969m255m428m321l814l277l417m430n572n848n062l951l319l297
62859D58121l439l327k880k200j375m93K94Q17R99Q60M44j70q48j352j409q73
62843D43169KN80L70m04j042j201j195j296j245p72k60k63n86n22M5M86M59M18
62825D36743P65J153J093P56O59Q54J000J061J381K084K845L267L238K955K780
$$ y = [526498, 520323, 515163, 511512, 508795, 506073, 503210, 500742, 498742, 496571, 493892, 491229, 489117, 487275, 485085, 482448, 479722, 477197, 475147, 474024, 473934, 474130, 473652, 472458, 471341, 470812, 470646, 470571, 470721, 471194, 471739, 472203, 472896, 474185, 476010, 478079, 480303, 482800, 485707, 489127, 492993, 496818, 499946, 502320, 504675, 507575, 510635, 513144, 515185, 517532, 520470, 523327, 525330, 526415, 526978, 527170, 526776, 525568, 523490, 520611, 517081, 513112, 508857, 504429, 500108, 496294, 493017, 489600, 485170, 479598, 473750, 468688, 464737, 461418, 458121, 454682, 451355, 448475, 446275, 444900, 444407, 444701, 445518, 446517, 447377, 447821, 447651, 446803, 445451, 444042, 443169, 443171, 443751, 444121, 443717, 442675, 441474, 440279, 438983, 437738, 436966, 436706, 436443, 435857, 435335, 435380, 435866, 436325, 436743, 437508, 438661, 439754, 440510, 441169, 442023, 443023, 444084, 445465, 447549, 450394, 453661, 456899, 459854, 462634]
62810D62634L003L497L747L417K821K540K753L173L462L529L541L779M306M696
62796E10898M491M081M512O087P794Q660R096J0127J1822J3511J5117J7166J9555
62783F42917K1576K3287K5669K9075L2561L5286L7655M0451M3628M6618M9236
62772A027959N1442N2829N3038N2350N1144M9024M5149L9306L2088K4136J5653
62761A494118O619k902j2643k2007l0270l7032m2358m6389m9156n0905n2043n2514
62749A102518n1789m9833m7522m5596m3725m1197l8029l4811l1808k8886k6002
62738F63320k3152k0127j6960j4304j2699j1790j0890r955r330q824p919o649
62726E10721n440m292k938j672j082r81n42N02J562K250K791L383L934M563N478
$$ y = [462634, 465637, 469134, 472881, 476298, 479119, 481659, 484412, 487585, 491047, 494576, 498117, 501896, 506202, 510898, 515389, 519470, 523982, 530069, 537863, 546523, 555619, 565746, 577568, 591079, 606196, 623362, 642917, 664493, 687780, 713449, 742524, 775085, 810371, 848026, 888477, 932105, 978723, 1027959, 1079401, 1132230, 1185268, 1237618, 1288762, 1337786, 1382935, 1422241, 1454329, 1478465, 1494118, 1500737, 1497835, 1485192, 1463185, 1432915, 1395883, 1353525, 1307136, 1257980, 1207075, 1155032, 1102518, 1050729, 1000896, 953374, 907778, 864053, 822856, 784827, 750016, 718208, 689322, 663320, 640168, 620041, 603081, 588777, 576078, 564288, 553398, 543443, 534113, 525289, 517370, 510721, 505281, 500989, 498051, 496379, 495297, 494316, 493774, 494276, 495838, 498088, 500879, 504262, 508196, 512759, 518237]
62711E18237O309O532O724Q268J1452J4827J7023J8266J9527K1088K2713K4518
62699F95484K6762K9213L1457L3614L6130L9154M2518M6000M9170N1368N2269
62688A133139N2076N0861M8216M3885L8146L1145K2598J2665K478o991j5920k4704
62676A387594l2674l8754m2970m6300m9241n1448n2561n2443n0794m7600m3826
62665H78983m0660l8044l5011l1446k8314k6056k3955k1498j9151j7246j5282
62654E82320j3062j1466j1099j1049j0106q589p764p824p685o744n633n028m668
62641D71603l999l013k018j120l28K02L70L15J43k19p65j321j876k655l604m191
62625D47524m041l377k570j615m84L42L61j23k33L77J243J883K306K532K327J700
$$ y = [518237, 524546, 531078, 537802, 546070, 557522, 572349, 589372, 607638, 627165, 648253, 670966, 695484, 722246, 751459, 782916, 816530, 852660, 891814, 934332, 980332, 1029502, 1080870, 1133139, 1185215, 1236076, 1284292, 1328177, 1366323, 1397468, 1420066, 1432731, 1435209, 1428218, 1412298, 1387594, 1354920, 1316166, 1273196, 1226896, 1177655, 1126207, 1073646, 1021203, 970409, 922809, 878983, 838323, 800279, 765268, 733822, 705508, 679452, 655497, 633999, 614848, 597602, 582320, 569258, 557792, 546693, 535644, 525538, 516949, 509185, 501361, 493676, 486932, 481299, 476271, 471603, 467604, 464591, 462573, 461453, 461125, 461327, 461697, 462012, 462155, 461936, 461171, 459850, 457974, 455319, 451715, 447524, 443483, 440106, 437536, 435921, 435437, 435779, 436140, 436017, 435784, 436161, 437404, 439287, 441593, 444125, 446452, 448152]
62609D48152J232J416J975K294K289K421K989L885M962O195P452Q549R636J1150
62595E14597J3166J5158J6645J7909J9717K2303K4894K6444K6710K6421K6288
62584G50252K6111K5098K2869J9730J5923J1215N511n55o118j0905j5100j8677
62572H25354k1420k3423k4909k5646k5200k3863k2615k1910k1106j9555j7611
62561E78096j6063j4984j3752j2079j0389r151q368p815p429p181o769n765m155
62548D54196k577j768j768j865j529j026q69r00m84M01J002P93J43l36n84q21
62532D42008r60p39j84N39J504K760L874M327M318M686N881P482Q860R936J1045
62517E05337J2321J3572J4748J6159J8135K0574K3059K5364K7631K9969L2082
$$ y = [448152, 449384, 450800, 452775, 455069, 457358, 459779, 462768, 466653, 471615, 477810, 485262, 493811, 503447, 514597, 527763, 542921, 559566, 577475, 597192, 619495, 644389, 670833, 697543, 723964, 750252, 776363, 801461, 824330, 844060, 859983, 871198, 876709, 876154, 870036, 859131, 844031, 825354, 803934, 780511, 755602, 729956, 704756, 680893, 658278, 636368, 615262, 595707, 578096, 562033, 547049, 533297, 521218, 510829, 501678, 493310, 485495, 478066, 470885, 464116, 458351, 454196, 451619, 449851, 448083, 446218, 444689, 443663, 442794, 441894, 441410, 441811, 442813, 443606, 443749, 443413, 442829, 442008, 441048, 440309, 440125, 440664, 442168, 444928, 448802, 453129, 457447, 462133, 468014, 475496, 484356, 494292, 505337, 517658, 531230, 545978, 562137, 580272, 600846, 623905, 649269, 676900, 706869, 738951]
62506G38951L3535L4174L3999L2849L0625K7717K4714K1582J7734J3129Q783N750
62494A023542L980K626J267L79O88K382M978P818J0615J3572J6857K0052K2349
62481A131105K3179K2256J9193J3867P298J362l023o845j1750j8235k5553l2739
62469A120115l8965m3345m5405m5785m5732m5886m5913m5175m3144l9472l4427
62458F46866k9213k5129k2244j9540j6342j2963r973p584n967n369n544n612m870
62445D76516l391j623J25J629K665L320L935M523M678M247L651L202K647J732
62431E07856O94k64j481l179m729n289n025m976n641o417o544o079n546n124m574
62416D43682l839l233k989k935k707k124j275m11R3j13r06j513j188j62N20L53
$$ y = [738951, 772486, 806660, 840659, 873508, 904133, 931850, 956564, 978146, 995880, 1009009, 1017792, 1023542, 1027522, 1030148, 1031415, 1031794, 1032482, 1034864, 1039842, 1047660, 1058275, 1071847, 1088704, 1108756, 1131105, 1154284, 1176540, 1195733, 1209600, 1216898, 1218260, 1215237, 1208392, 1196642, 1178407, 1152854, 1120115, 1081150, 1037805, 992400, 946615, 900883, 854997, 809084, 763909, 720765, 681293, 646866, 617653, 592524, 570280, 550740, 534398, 521435, 511462, 503878, 497911, 492542, 486998, 481386, 476516, 473125, 471502, 471627, 473256, 475921, 479241, 483176, 487699, 492377, 496624, 500275, 503477, 506124, 507856, 508550, 508286, 506805, 503626, 498897, 493608, 488583, 483607, 477966, 471549, 465005, 458926, 453380, 448256, 443682, 439843, 436610, 433621, 430686, 427979, 425855, 424580, 424169, 424262, 424149, 423243, 421730, 420542, 420380, 420900, 421253]
62400D21253P9O13J692K216J795J288J642K772L822M154L851L512L754M686N750
62385D62879O274O212O080O207O487O895P725R000J0068J0232R540Q613P888P385
62371E71485P059P024P395Q142R222J0698J2742J5464J8727K2140K5444K8874
62359G44416L2884L7469M1955M5694M8742N1655N4635N7017N7601N5476N0601
62348A278145M3709L5770K7548J9528J1946M764k159q643j4264j9024k3533k8130
62336A325657l2166l4818l6266l7344l8231l8350l7490l6048l4103l1356k8342
62325I41143k6544k6537k6932k6122k4333k2939k2305k1579k0372j9365j8966
62314F85149j8477j7107j5101j3272j1898j0629r260q051p255o666n759m319k761
$$ y = [421253, 421332, 421945, 423637, 425853, 427648, 428936, 430578, 433350, 437172, 441326, 445177, 448689, 452443, 457129, 462879, 469153, 475365, 481445, 487652, 494139, 501034, 508759, 517759, 527827, 538059, 547599, 556212, 564100, 571485, 578544, 585568, 592963, 601105, 610327, 621025, 633767, 649231, 667958, 690098, 715542, 744416, 777300, 814769, 856724, 902418, 951160, 1002815, 1057450, 1114467, 1172068, 1227544, 1278145, 1321854, 1357624, 1385172, 1404700, 1416646, 1421410, 1419251, 1410608, 1396344, 1377320, 1353787, 1325657, 1293491, 1258673, 1222407, 1185063, 1146832, 1108482, 1070992, 1034944, 1000841, 969485, 941143, 914599, 888062, 861130, 835008, 810675, 787736, 765431, 743852, 723480, 704115, 685149, 666672, 649565, 634464, 621192, 609294, 598665, 589405, 581354, 574099, 567433, 561674, 557355, 554594]
62301E54594j749j441j328q47J8R48J762K403K712K650K582K898L466L803L795
62286E76266L745L774L641L291L086L235L401L124K410J587Q24J61j38L38J594
62271F10339L022M012M626N502P071R084J1038J2893J5135J8161K1860K5873L0035
62258G78651L4411L9045M3859M8629N2976N6421N8591N9214N7902N4263M8414
62247A332376M1131L3119K4390J4734M667m557j2099j8345k4367l0770l7169m2692
62235A280418m6734m9248n0473n0548m9491m7387m4416m0718l6487l2179k8365
62224H04372k5174k2102j8551j4469j0360o837m290k718j660n11Q72K049K675
62211G03296L017L511M055M139L602K788K027J298N04k82r62j527j958k199k356
$$ y = [554594, 552845, 551404, 550076, 549229, 549247, 550195, 551957, 554360, 557072, 559722, 562304, 565202, 568668, 572471, 576266, 580011, 583785, 587426, 590717, 593803, 597038, 600439, 603563, 605973, 607560, 608384, 608545, 608407, 608745, 610339, 613361, 617373, 621999, 627501, 634572, 643656, 654694, 667587, 682722, 700883, 722743, 748616, 778651, 813062, 852107, 895966, 944595, 997571, 1053992, 1112583, 1171797, 1229699, 1283962, 1332376, 1373507, 1406626, 1431016, 1445750, 1450417, 1445860, 1433761, 1415416, 1391049, 1360279, 1323110, 1280418, 1233684, 1184436, 1133963, 1083415, 1033924, 986537, 942121, 901403, 864916, 832737, 804372, 779198, 757096, 738545, 724076, 713716, 706879, 702589, 699871, 698211, 697700, 698572, 700621, 703296, 706313, 709824, 713879, 718018, 721620, 724408, 726435, 727733, 728237, 727955, 726993, 725466, 723508, 721309, 718953]
62196G18953k733l455m139m101k955j040Q18K076K919L846M927N798O310O768
62182G33992P379P944Q233Q267P955O977N432M126L718M008M634N953Q468J1721
62168H28807J4761J7662K1521K6771L2296L6648L9440M1154M2069M1816L9628
62157A182573L4871K7732J9602J2256O407J375l637q632j3434j8358k3618k8553
62145A188584l2171l4273l5366l5703l5036l3276l0814k8113k5413k2838k0467
62134H55114j8179j5814j3451j1317r525q120p250o959o898o647o207n772n098
62121G33877l727j750J60J679L213N101P002Q501R846J1517J3336J4548J4623
62108H17926J3460J0954P058K497j265l198l521l055k143p47O04P18j111m209
$$ y = [718953, 716220, 712765, 708626, 704525, 701570, 700530, 701348, 703424, 706343, 710189, 715116, 720914, 727224, 733992, 741371, 749315, 757548, 765815, 773770, 780747, 786179, 790305, 794023, 798031, 802665, 808618, 817086, 828807, 843568, 861230, 882751, 909522, 941818, 978466, 1017906, 1059060, 1101129, 1142945, 1182573, 1217444, 1245176, 1264778, 1277034, 1283441, 1284816, 1281179, 1272547, 1259113, 1240755, 1217137, 1188584, 1156413, 1122140, 1086774, 1051071, 1016035, 982759, 951945, 923832, 898419, 875581, 855114, 836935, 821121, 807670, 796353, 786828, 778708, 771458, 764499, 757601, 750954, 744747, 738975, 733877, 730150, 728400, 728560, 730239, 733452, 738553, 745555, 754056, 763902, 775419, 788755, 803303, 817926, 831386, 842340, 849398, 851895, 850630, 847432, 843911, 840856, 838713, 837966, 838570, 839288, 838177, 833968]
62094H33968p045q441q193o821n036l372j947m77J370L570N702P309Q325R131
62080H28043J0233J1762J3359J4645J5783J7316J9440K1683K3381K4236K4347
62069A024228K3995K3653K3825K4622K5644K6614K7755K9242L0490L0552K9063
62058A319683K6293K2458J7546J1836N904N8n642j0726j4389j6635j8652k1463
62046A316271k4750k7640l0195l3263l6859l9683m0537l9626l8079l6590l5002
62035I34047l3042l0858k8764k6786k4726k2468k0116j7825j5722j3959j2666
62024F87115j1746j0894r959r168q835q898r004r018r179r600r895r560q654p782
62010E54923p321o890n823m092k388j204k19J135K728L924M584N248O101O470
$$ y = [833968, 826923, 818482, 810289, 803468, 798432, 795060, 793113, 792636, 794006, 797576, 803278, 810587, 818912, 828043, 838276, 850038, 863397, 878042, 893825, 911141, 930581, 952264, 975645, 999881, 1024228, 1048223, 1071876, 1095701, 1120323, 1145967, 1172581, 1200336, 1229578, 1260068, 1290620, 1319683, 1345976, 1368434, 1385980, 1397816, 1403720, 1403778, 1398136, 1387410, 1373021, 1356386, 1337734, 1316271, 1291521, 1263881, 1233686, 1200423, 1163564, 1123881, 1083344, 1043718, 1005639, 969049, 934047, 901005, 870147, 841383, 814597, 789871, 767403, 747287, 729462, 713740, 699781, 687115, 675369, 664475, 654516, 645348, 636513, 627615, 618611, 609593, 600414, 590814, 580919, 571359, 562705, 554923, 547602, 540712, 534889, 530797, 528409, 527205, 526986, 528121, 530849, 534773, 539357, 544605, 550706, 557176]
61996E57176N714M136K487J042k66j228j718k313l673n366o285o299o468p342
61982E29597q064p704o596n652n037m304l328k309j193R2J052J153P87R31J763
61967D91188K410K203J510J024Q81Q86J195K134L460M280L871K542J482J671K930
61952E23667M184M670M636M757N247N949O995Q755J1156J3579J5630J7574J9721
61939F46520K1785K3185K3787K3984K4134K4216K4102K3823K3456K2886K1933
61928I03811K0627J9101J7207J4603J1382Q223N531K699j124n628r314j1017j0880
61915I65221r704q005o037m017j793J177M932Q641J1689J4522J7597J9980K0105
61902A034308J7688J3825R321M146j424o372j0187j3472j6736j9452k1019k1841
$$ y = [557176, 562890, 567026, 569513, 570555, 570289, 569061, 567343, 565030, 561357, 555991, 549706, 543407, 536939, 529597, 521533, 513829, 507233, 501581, 496544, 492240, 488912, 486603, 485410, 485502, 486554, 487707, 488494, 489425, 491188, 493598, 495801, 497311, 498335, 499216, 500102, 501297, 503431, 506891, 511171, 515042, 517584, 519066, 520737, 523667, 527851, 532521, 537157, 541914, 547161, 553110, 560105, 568860, 580016, 593595, 609225, 626799, 646520, 668305, 691490, 715277, 739261, 763395, 787611, 811713, 835536, 858992, 881878, 903811, 924438, 943539, 960746, 975349, 986731, 994954, 1000485, 1003184, 1002060, 996432, 987118, 976101, 965221, 955517, 947512, 941475, 937458, 935665, 936842, 941774, 950415, 962104, 976626, 994223, 1014203, 1034308, 1051996, 1065821, 1075142, 1079288, 1077864, 1071492, 1061305, 1047833, 1031097, 1011645, 990626, 968785]
61890I68785k2662k3383k3375k2588k1524k0440j9249j8036j6990j6016j5031
61879G49491j4408j4501j4941j4998j4486j3643j2308j0170p706n935n038m102
61867F17255k526p95N60J900L668N433O627P827J0147J3550J6684J8670K0176
61854G19176K2383K5580K9248L2950L6533L9719M2165M3881M5137M5926M5880
61843A128578M4718M2377L8714L3513K6996J9866J2679N526j350p063j0662j2051
61831A321841j1889j0734q695n796k135K295P340J2152J5456J6675J6337J5078
61819A367925J2665Q431K332m946j2698k0494k7829l4035l8735m2076m4320m5417
61807A120803m5118m3434m0860l8184l5957l4081l1979k9248k6013k2596j9189
$$ y = [968785, 946123, 922740, 899365, 876777, 855253, 834813, 815564, 797528, 780538, 764522, 749491, 735083, 720582, 705641, 690643, 676157, 662514, 650206, 640036, 632330, 626395, 621357, 617255, 614729, 613934, 614494, 616394, 620062, 625495, 632122, 639949, 650096, 663646, 680330, 699000, 719176, 741559, 767139, 796387, 829337, 865870, 905589, 947754, 991635, 1036772, 1082698, 1128578, 1173296, 1215673, 1254387, 1287900, 1314896, 1334762, 1347441, 1352967, 1351617, 1344554, 1333892, 1321841, 1309952, 1299218, 1290523, 1284727, 1282592, 1284887, 1292227, 1304379, 1319835, 1336510, 1352847, 1367925, 1380590, 1389021, 1391353, 1386407, 1373709, 1353215, 1325386, 1291351, 1252616, 1210540, 1166220, 1120803, 1075685, 1032251, 991391, 953207, 917250, 883169, 851190, 821942, 795929, 773333, 754144]
61796G54144j6059j3758j2603j2075j1314j0146r173q679q123o990n644m826m591
61783F30163m307l664l120l211l733l960l519k775k326k254k105j532p95l81l76
61768E92105m12k41qJ42L73R05J601K096K243K257K408K691K836K632K296K334
61752F16258K852L096K136P8j845k661k664k677k804k595k097j921k202k314j867
61737E98773j319j175j155o93J42P83J023J160J388J585J745K115K794L503L923
61722F14592L935L541K811K075J789K026K407K636K863L195L196K269M75j434
61708F46376k784l521l914m128m192m187m206m189m031l754l485l293l161l119
61694E94412l202l294l163k791k586k980l777m110l372k114j609k401l528l579
$$ y = [754144, 738085, 724327, 711724, 699649, 688335, 678189, 669016, 660337, 652214, 645224, 639580, 634754, 630163, 625856, 622192, 619072, 615861, 612128, 608168, 604649, 601874, 599548, 597294, 595189, 593657, 592862, 592481, 592105, 591693, 591452, 591444, 591586, 591959, 592864, 594465, 596561, 598804, 601061, 603469, 606160, 608996, 611628, 613924, 616258, 619110, 622206, 624342, 624420, 622575, 619914, 617250, 614573, 611769, 609174, 607077, 605156, 602954, 600640, 598773, 597454, 596279, 595124, 594431, 594573, 595356, 596379, 597539, 598927, 600512, 602257, 604372, 607166, 610669, 614592, 618527, 622068, 624879, 626954, 628743, 630769, 633176, 635812, 638675, 641870, 645066, 647335, 647810, 646376, 643592, 640071, 636157, 632029, 627837, 623650, 619444, 615255, 611224, 607470, 603985, 600692, 597531, 594412, 591210, 587916, 584753, 581962, 579376, 576396, 572619, 568509, 565137, 563023, 561414, 559013, 555485, 551906]
61680E51906k335r69n98j127j736k095k524l153l482l030k096j522j819k659l274
61665E19487l195k612k047j767j572j201p75o62r27j153r54m42k7R1R7L54J116
61648E03811K314L484M089M091M054M431M967N121M828M365L602K109J34j252
61634E50148j407r97j081j731k218k373k850l960n012n214m737m344m237l917
61620E06070l084k160j669j497j103l78R7k34j238k316l201m165n450o801p759
61605D65112q152q030p377o238n020m295m188m335m420m497m663m745m486l842
61591C90824k918j899j182j223k001k825k988k530k028j814j684j371r13n50m84
61576C64414q08j411j895j798j108l69j53m81q46q02l77%k1l53n64l38K16P00
$$ y = [551906, 549571, 548602, 548004, 546877, 545141, 543046, 540522, 537369, 533887, 530857, 528761, 527239, 525420, 522761, 519487, 516292, 513680, 511633, 509866, 508294, 507093, 506318, 505656, 504729, 503576, 502622, 502180, 502153, 502244, 502341, 502695, 503811, 506125, 509609, 513698, 517789, 521843, 526274, 531241, 536362, 541190, 545555, 549157, 551266, 551400, 550148, 548741, 547744, 546663, 544932, 542714, 540341, 537491, 533531, 528519, 523305, 518568, 514224, 509987, 506070, 502986, 500826, 499157, 497660, 496557, 496179, 496276, 496042, 494804, 492488, 489287, 485122, 479672, 472871, 465112, 456960, 448930, 441553, 435315, 430295, 426000, 421812, 417477, 413057, 408560, 403897, 399152, 394666, 390824, 387906, 386007, 384825, 383602, 381601, 378776, 375788, 373258, 371230, 369416, 367732, 366361, 365448, 364898, 364414, 363606, 362195, 360300, 358502, 357394, 357025, 356872, 356391, 355545, 354743, 354366, 354366, 354345, 353992, 353428, 353090, 353306, 354006]
61558C54006Q24O19M14O09J330K170K438J835P93q6o62j066j116n33L09O10L37
61541C62831N85K090L924M432L314J973J728K443L209L648L896L835L096J776
61527D02780M87l91r67j289j120n90n35j644l446m646m454l202j727n50K18N60
61511C79484M85R0m44r32j214j187r65p90p64p50o20m58m04m17k84J94R88J777
61493C73789K028J456L88m86p97p08m23R4P45J092Q75N18O12J154J678J974K187
61476C86176K245J811Q99P4j74N4L21K97r9o87j045q77m26j34N4N49J195J263
61458C91496O63L48R61J743J634R06P07J226J443Q00Q9K12Q97J234R91P55J004
61441D07109J562J999K215K540L329M403N040M732L851L252L194L201K956K799
$$ y = [354006, 354830, 355449, 355863, 356472, 357802, 359972, 362410, 364245, 365038, 364952, 364290, 363224, 362108, 361575, 361884, 362494, 362831, 363416, 365506, 369430, 373862, 377176, 379149, 380877, 383320, 386529, 390177, 394073, 397908, 401004, 402780, 403267, 402876, 401909, 400620, 399500, 398910, 398375, 396731, 393285, 388639, 384185, 380983, 379256, 378706, 378924, 379484, 379969, 380059, 379615, 378683, 377469, 376282, 375317, 374527, 373763, 373013, 372393, 371935, 371531, 371114, 370830, 371024, 372012, 373789, 375817, 377273, 377661, 377175, 376378, 375670, 375247, 375341, 376086, 377178, 378053, 378571, 379183, 380337, 382015, 383989, 386176, 388421, 390232, 391131, 391205, 391031, 391085, 391406, 391703, 391604, 390917, 389872, 388995, 388569, 388435, 388489, 389038, 390233, 391496, 392159, 392507, 393468, 395211, 396845, 397751, 398458, 399684, 401127, 401927, 402016, 402228, 403125, 404359, 405350, 406105, 407109, 408671, 410670, 412885, 415425, 418754, 423157, 428197, 432929, 436780, 440032, 443226, 446427, 449383, 452182]
61427D52182L031L334L242K795K351K120K214K763L549L944L643L096K733K264
61413D93261J294K02m08p95j660k810l258k728k097k084k384k447k270k045j722
61398D68049j429j593k171k352j650p38n22q86j050p19j63N11J297J746J360M67
61382D60157k2K21O95J001J213J344J125O66N61J036J557J610J423J504J893K248
61366D78232K349K176J781J433J659K683L998M810M840M462M199M349N002O122
61352E28095P570R160J0711J2029J2990J3673J4230J4531J4151J2808J0743Q481
61340F69172O406M620L079J739O55k2l00n88j434k934m635o011o856p149o931
61325F48811o425n960n580n011m149l276k623k055j386o74j4O52J246J528J642
$$ y = [452182, 455213, 458547, 461789, 464584, 466935, 469055, 471269, 474032, 477581, 481525, 485168, 488264, 490997, 493261, 494555, 494757, 494349, 493554, 491894, 489084, 485826, 483098, 481001, 478917, 476533, 474086, 471816, 469771, 468049, 466620, 465027, 462856, 460504, 458854, 458116, 457594, 456708, 455658, 454939, 454776, 455287, 456584, 458330, 459690, 460157, 460135, 460356, 461051, 462052, 463265, 464609, 465734, 466400, 466961, 467997, 469554, 471164, 472587, 474091, 475984, 478232, 480581, 482757, 484538, 485971, 487630, 490313, 494311, 499121, 503961, 508423, 512622, 516971, 521973, 528095, 535665, 544825, 555536, 567565, 580555, 594228, 608458, 622989, 637140, 649948, 660691, 669172, 675578, 680198, 683277, 685016, 685671, 685649, 685349, 684761, 683327, 680393, 675758, 669747, 662891, 655742, 648811, 642386, 636426, 630846, 625835, 621686, 618410, 615787, 613732, 612346, 611672, 611658, 612310, 613556, 615084, 616726]
61310F16726K264L775N641P103Q188R481J1165J2942J4648J6261J7191J6426J3640
61297G55451R657N548J710j894n051p353q663r199r183q821q499q648r213r514
61283F86328q907p544o267n626n248m343k693p75R37K379L524M215M583N158O119
61268F71840O891O946O642O718P218P603P782Q331R597J1280J3057J5009J7114
61255G96028J8768J9155J7883J5099J1160O488J532l223p247j0082j1634j2276
61243H41651j2414j2091j1298j0402r766r064p668n636l706k271j101k09p8o80
61229G55267r74q3J595L028L889M582N294N779N927N883N587M786L555K375J573
61214H08063J096Q16P50Q18Q17P04O81Q06Q40O00L67O29J494K589L581M673O382
$$ y = [616726, 618990, 622765, 628406, 635509, 643697, 653178, 664343, 677285, 691933, 708194, 725385, 741811, 755451, 765108, 770656, 772366, 770472, 765421, 758068, 749405, 740206, 731023, 722202, 713703, 705055, 695842, 686328, 677421, 669877, 663610, 657984, 652736, 648393, 645700, 644925, 645862, 648241, 651765, 655980, 660563, 665721, 671840, 678731, 685677, 692319, 699037, 706255, 713858, 721640, 729971, 739568, 750848, 763905, 778914, 796028, 814796, 833951, 851834, 866933, 878093, 884581, 886113, 882890, 875643, 865561, 853927, 841651, 829237, 817146, 805848, 795446, 785680, 776616, 768948, 763312, 759606, 757335, 756234, 756025, 755947, 755267, 754293, 754210, 755805, 758833, 762722, 767304, 772598, 778377, 784304, 790187, 795774, 800560, 804115, 806490, 808063, 809159, 809975, 810725, 811543, 812360, 813064, 813745, 814551, 815391, 815991, 816358, 816987, 818481, 821070, 824651, 829324, 835706]
61197H35706Q821J1540J4144J6812J9781K2635K4568K5353K5376K4663K2512J8490
61185A070401J3331Q429M733K435J315Q22J48j240l164n159p125r199j1223j2837
61171A051667j3982j4907j5751j6532j7397j8473j9540k0268k0756k1324k1811
61160H50926k1514j9999j7643j5296j3558j2345j0982q805n963l368j596j70J673
61147G21360L841N651O875P707P828O461L500j32l524o435q705r738r113p137
61133G18439m465j580J088L138M695O418Q585J0684J2319J3911J6011J8390K0508
61120H28141K2324K4015K5268K5726K5834K6345K7096K7174K6295K5239K4619
61109A108076K4030K2748K0702J8311J5736J2834R688O783M540K768O09k810p549
$$ y = [835706, 844527, 856067, 870211, 887023, 906804, 929439, 954007, 979360, 1004736, 1029399, 1051911, 1070401, 1083732, 1092161, 1096894, 1099329, 1100644, 1101466, 1101614, 1100374, 1097210, 1092051, 1084926, 1075727, 1064504, 1051667, 1037685, 1022778, 1007027, 990495, 973098, 954625, 935085, 914817, 894061, 872737, 850926, 829412, 809413, 791770, 776474, 762916, 750571, 739589, 730784, 724821, 721453, 719857, 719687, 721360, 725201, 730852, 737727, 745434, 753262, 759723, 763223, 763091, 759567, 753132, 744427, 734689, 725576, 718439, 713974, 712394, 713482, 716620, 721315, 727733, 736318, 747002, 759321, 773232, 789243, 807633, 828141, 850465, 874480, 899748, 925474, 951308, 977653, 1004749, 1031923, 1058218, 1083457, 1108076, 1132106, 1154854, 1175556, 1193867, 1209603, 1222437, 1232125, 1238908, 1243448, 1246216, 1246825, 1244015, 1236466]
61096A236466j2745j7511k1695k5486k8613l0455l0999l0985l0996l0812k9934
61085I46235k8280k6130k3787k1621k0074j9151j8165j6421j4155j2299j1233
61074G34919j0234q425n984l935k861k273j437m02L46Q06J477K493L475M293N226
61059G17484O184O599O530P016Q599J0297J1024J1362J2704J5039J6983J7970
61047H47791J8952K0627K2290K3088K3383K4142K5698K7668K9445L0307K9780
61036A123171K8387K7415K7438K7784K7834K7909K8353K8737K8791K9135L0178
61025A435132L1228L1820L3036L6133M0466M4228M6739M8628N0236N1567N3698
61014A902911N8439O6249P5828Q6153R7550J10464J24383J38563J53074J69081
$$ y = [1236466, 1223721, 1206210, 1184515, 1159029, 1130416, 1099961, 1068962, 1037977, 1006981, 976169, 946235, 917955, 891825, 868038, 846417, 826343, 807192, 789027, 772606, 758451, 746152, 734919, 724685, 716260, 710276, 706341, 703480, 701207, 699770, 699368, 699714, 700520, 701997, 704490, 707965, 712258, 717484, 723668, 730267, 736797, 743813, 752412, 762709, 773733, 785095, 797799, 812838, 829821, 847791, 866743, 887370, 909660, 932748, 956131, 980273, 1005971, 1033639, 1063084, 1093391, 1123171, 1151558, 1178973, 1206411, 1234195, 1262029, 1289938, 1318291, 1347028, 1375819, 1404954, 1435132, 1466360, 1498180, 1531216, 1567349, 1607815, 1652043, 1698782, 1747410, 1797646, 1849213, 1902911, 1961350, 2027599, 2103427, 2189580, 2287130, 2397594, 2521977, 2660540, 2813614, 2982695]
61004B982695J89064K16648K55001L05542L69491M50086N51236O74655Q21291
60995F815709R95477J204350J453392J746373K084522K445713K748296K848197
60987B2342029K610801K019774J221745M52507r2229l30000k75351o17L66053
60978B8314712O35491O12354K03538n12339j326366k018640k458002k623717k568714
60969A8258317k373091k112443j840696j585509j355692j152590r75573q21941
60961F040782o88035n72217m74854l95236l30675k78700k37876k06050j79922
60952B677217j57347j38409j23341j10761r8894q7337p6654o7241n9502n4263
60942A703468n1865n1380n1475n1642n1879n1681n0205m7273m3535l9762l6394
$$ y = [2982695, 3171759, 3388407, 3643408, 3948950, 4318441, 4768527, 5319763, 5994418, 6815709, 7811186, 9015536, 10468928, 12215301, 14299823, 16745536, 19493832, 22342029, 24952830, 26972604, 28194349, 28646856, 28554627, 28224627, 27949276, 27948659, 28314712, 28950203, 29562557, 29766095, 29253756, 27927390, 25908750, 23450748, 20827031, 18258317, 15885226, 13772783, 11932087, 10346578, 8990886, 7838296, 6862723, 6040782, 5352747, 4780530, 4305676, 3910440, 3579765, 3301065, 3063189, 2857139, 2677217, 2519870, 2381461, 2258120, 2147359, 2048465, 1961128, 1884474, 1817233, 1757731, 1703468, 1651603, 1600223, 1548748, 1497106, 1445227, 1393546, 1343341, 1296068, 1252533, 1212771, 1176377]
60931A176377l3585l1201k8858k6247k3395k0547j7977j5912j4350j2885j1090
60920I40330r070p299n857m374k640p75J256L631O086Q015R413J0959J2911J4665
60906I77251J5784J6788J8304K0037K1170K1415K1136K0674K0088J9436J8836
60895A190919J8340J7902J7374J6531J5254J3765J2304J0729Q791O701M738K509
60883A335857o01m241p343r666j2123j5186j8070k0019k1399k2800k3962k4388
60871A156059k4361k4463k4653k4545k4116k3485k2491k1139j9829j8672j7259
60860I11046j5751j5220j6008j6692j5854j4098j2915j2349j1421j0407j0705
60849G59626j2314j3248j2113r840q166p531p309p261p753q925j0338j1349j1562
$$ y = [1176377, 1142792, 1111591, 1082733, 1056486, 1033091, 1012544, 994567, 978655, 964305, 951420, 940330, 931260, 923961, 918104, 913730, 911090, 910315, 911571, 915202, 921288, 929303, 938716, 949675, 962586, 977251, 993035, 1009823, 1028127, 1048164, 1069334, 1090749, 1111885, 1132559, 1152647, 1172083, 1190919, 1209259, 1227161, 1244535, 1261066, 1276320, 1290085, 1302389, 1313118, 1321909, 1328610, 1333348, 1335857, 1335256, 1331015, 1323672, 1314006, 1301883, 1286697, 1268627, 1248608, 1227209, 1204409, 1180447, 1156059, 1131698, 1107235, 1082582, 1058037, 1033921, 1010436, 987945, 966806, 946977, 928305, 911046, 895295, 880075, 864067, 847375, 831521, 817423, 804508, 792159, 780738, 770331, 759626, 747312, 734064, 721951, 712111, 703945, 696414, 689105, 681844, 674091, 665166, 654828, 643479, 631917]
60836F31917j1115j0653j0685j0923j0588r383p765o291n138m273l533k593j322
60823E37655j23N42Q44J216J500J227O19M22P56J061J261J931L035L488K582J089
60807E59105K91M99J069J403J319Q57K07k91m92n55n57l64q7k56j150k323l110
60790E55565l339l307l298l410l641l909m166m526n076n553n638n542n798o419
60776D91943o773o458n740m922l972l019k624l007l508l311k428j497q86m48k
60761D43348L96O61Q82J295K033K915L520L672L748M149M669M826M708M844N224
60746D90890N142M253L152K584K579K676K521J956Q57p38k567m284n489n797n380
60731D92355n226o073p214p319o394n781n987n896m719l428l226l693l644l028
$$ y = [631917, 620802, 610149, 599464, 588541, 577953, 568570, 560805, 554514, 549376, 545103, 541570, 538977, 537655, 537532, 538074, 538918, 540134, 541634, 542861, 543480, 543902, 544658, 545719, 546980, 548911, 551946, 555434, 558016, 559105, 559396, 559895, 560964, 562367, 563686, 564543, 564750, 564459, 563967, 563412, 562855, 562491, 562404, 562148, 560998, 558675, 555565, 552226, 548919, 545621, 542211, 538570, 534661, 530495, 525969, 520893, 515340, 509702, 504160, 498362, 491943, 485170, 478712, 472972, 468050, 464078, 461059, 458435, 455428, 451920, 448609, 446181, 444684, 443798, 443350, 443348, 443744, 444405, 445287, 446582, 448615, 451530, 455050, 458722, 462470, 466619, 471288, 476114, 480822, 485666, 490890, 496032, 500285, 503437, 506021, 508600, 511276, 513797, 515753, 516610, 515872, 513305, 509021, 503532, 497735, 492355, 487129, 481056, 473842, 466523, 460129, 454348, 448361, 442465, 437746, 434318, 431092, 427399, 423755, 420727]
60717D20727k743l003l165k949k668k387j803j004n08n28q44j271j636j536q27
60702C93855j49j78o03o47l42l35n40q8J220K450K807K544K228J939J594J480
60686D07235J896K688L500M154M572M746M963N669O804P700P854P430O890O490
60672D82591O362O603P004P011O247M859L165J388j50r85j043r19j260k068k859
60657E15946l325l454l255k744k197k012k214k313j862j026m10l05m03m14p36
60642D89276j995l982n485n558m542l563l246l362l457l327k995k631k500k600
60628D40033k500j839q84j61K75P52J257J382J002N35L46L37K19q9m07m11J22
60611D39969R54J435J286J028J228J605J545J168J061J145Q25K06Q0M85M43l79
$$ y = [420727, 417984, 414981, 411816, 408867, 406199, 403812, 402009, 401005, 400497, 399969, 399125, 397854, 396218, 394682, 393855, 393706, 393528, 392925, 392278, 391936, 391601, 391061, 390973, 392193, 394643, 397450, 399994, 402222, 404161, 405755, 407235, 409131, 411819, 415319, 419473, 424045, 428791, 433754, 439423, 446227, 453927, 461781, 469211, 476101, 482591, 488953, 495556, 502560, 509571, 515818, 520677, 523842, 525230, 525080, 524095, 523052, 522133, 520873, 518805, 515946, 512621, 509167, 505912, 503168, 500971, 498959, 496745, 494432, 492570, 491544, 491134, 490829, 490426, 490012, 489276, 487281, 483299, 477814, 472256, 467714, 464151, 460905, 457543, 454086, 450759, 447764, 445133, 442633, 440033, 437533, 435694, 434810, 434649, 434924, 435676, 436933, 438315, 439317, 439852, 440198, 440535, 440754, 440665, 440258, 439847, 439969, 440923, 442358, 443644, 444672, 445900, 447505, 449050, 450218, 451279, 452424, 453249, 453455, 453535, 454020, 454463, 454084]
60595D54084r40l87N90R43R72J707L135M165M177L553K735J710N77j91k87J21
60579D76664P43J368J712J646J596K135L138L883M178M715O092Q022R817J1216
60565E36925J2393J3605J5153J7307J9884K2131K3373K3519K2608K0206J5804
60554G42908R709L085k856p343r983j0784j0359r585q770p554n736l735j874L23
60540F77446L551P616J1539J4799J7936K1670K5880K9811L2978L5401L6938L6842
60528I52407L4248K8965K1648J3274M651l505j0315j4975j7367j8160j8091j7341
60516I55439j5968j4581j3956j3929j3337j1447q825o398m149j461J556M003N527
60503H62474O927R147J2285J5991K0305K5519L1491L7709M4073N1128N9323O8300
$$ y = [454084, 453144, 452757, 453347, 454290, 455262, 456969, 460104, 464269, 468446, 471999, 474734, 476444, 477021, 476830, 476543, 476664, 477407, 478775, 480487, 482133, 483729, 485864, 489002, 492885, 497063, 501778, 507870, 515892, 525709, 536925, 549318, 562923, 578076, 595383, 615267, 637398, 660771, 684290, 706898, 727104, 742908, 752617, 755702, 752846, 745503, 735520, 724736, 714377, 704792, 696022, 688468, 682732, 678997, 677123, 677446, 680997, 688613, 700152, 714951, 732887, 754557, 780437, 810248, 843226, 878627, 915565, 952407, 986655, 1015620, 1037268, 1050542, 1055193, 1051688, 1041373, 1026398, 1009031, 990871, 972780, 955439, 939471, 924890, 910934, 897005, 883668, 872221, 863396, 856998, 852849, 851388, 852944, 856947, 862474, 869401, 878548, 890833, 906824, 927129, 952648, 984139, 1021848, 1065921, 1117049, 1176372, 1244672]
60491A244672P6961Q4098Q8908R1046R0378Q6702P9815O9895N7674M3960K8979
60480B043088J2410n739k4498m2381n8414p2387q4119r2808r7546r8321r6099
60469A383186r1830q5785p8112o9621o1469n4151m7383m1046l5729l1974k9364
60458G56722k6914k4167k1431j8955j6486j3856j1529j0067r299q530p473o488
60446E81527n887n494n089m768m585m263l613k960k678k570k248j843j764j879
60432E31886j668j179j049j431j642j238p71r77j724k346k544k417j981j253o11
60417E09055l82k88J69Q67J202R47M53O4j75k51j51j32m44p78n45K66R70J094
60399E11941Q79P77R23J275J844K480K856K842K619K288J781J265J164J507J751
$$ y = [1244672, 1321633, 1405731, 1494639, 1585685, 1676063, 1762765, 1842580, 1912475, 1970149, 2014109, 2043088, 2055498, 2049759, 2025261, 1982880, 1924466, 1852079, 1767960, 1675152, 1577606, 1479285, 1383186, 1291356, 1205571, 1127459, 1057838, 996369, 942218, 894835, 853789, 818060, 786086, 756722, 729808, 705641, 684210, 665255, 648769, 634913, 623384, 613317, 604018, 595488, 588015, 581527, 575640, 570146, 565057, 560289, 555704, 551441, 547828, 544868, 542190, 539620, 537372, 535529, 533765, 531886, 530218, 529039, 527990, 526559, 524917, 523679, 522908, 521931, 520207, 517861, 515317, 512900, 510919, 509666, 509055, 508673, 508385, 508554, 509421, 510623, 511570, 512023, 512087, 511912, 511661, 511510, 511378, 510934, 510156, 509611, 509877, 510847, 511941, 512820, 513597, 514520, 515795, 517639, 520119, 522975, 525817, 528436, 530724, 532505, 533770, 534934, 536441, 538192]
60384E38192J567J403J832K688L304L334K910K251J610J440K003K812K941K142
60370E70429J178Q79J154J290R57N30M66O89Q62R22J070J309J374J236J291J821
60354E87457K450K552K111J826K294L401M622N706O766P827Q545Q490P638O375
60340F58060N049L626J977K95j134k441m026n768o948p152o796o372n711m517
60326F18142l175k322j887j332o72m87r04j358j422j230q99k71N58J071J072J071
60310F05955J729L297N642Q273J0344J1405J2339J4696J8790K3399K7697L2241
60298G75807L7130M0250L8938L3027K4850J6290P170l124j3720k2695k8794l2012
60286H73117l2884l1879k9455k6218k2787j9579j6712j4180j2150j0933j0544
$$ y = [538192, 539759, 541162, 542994, 545682, 548986, 552320, 555230, 557481, 559091, 560531, 562534, 565346, 568287, 570429, 571607, 572486, 573640, 574930, 575887, 576417, 576883, 577572, 578434, 579356, 580426, 581735, 583109, 584345, 585636, 587457, 589907, 592459, 594570, 596396, 598690, 602091, 606713, 612419, 619185, 627012, 635557, 644047, 651685, 658060, 663109, 666735, 668712, 669007, 667873, 665432, 661406, 655638, 648690, 641538, 634742, 628370, 622659, 618142, 614967, 612645, 610758, 609426, 608754, 608267, 607363, 606005, 604583, 603353, 602454, 602183, 602741, 603812, 604884, 605955, 607684, 610981, 616623, 624896, 635240, 646645, 658984, 673680, 692470, 715869, 743566, 775807, 812937, 853187, 892125, 925152, 950002, 966292, 973462, 970338, 956618, 933923, 905129, 873117, 840233, 808354, 778899, 752681, 729894, 710315, 693603, 679423, 667273, 656340, 645796]
60275F45796j0457j0091r325q343p162n769m491l702l125k076n91L49L4r43j372
60260E78732q35J4M89O00O79P12M02k61p80o61N3Q16J174J146J041R73P57J92
60242E85243o20j315j572j409j159j081j050p06J4P28J097J319J887K903L903
60227E88182M371M200L654L093K844L070L547L756L496L312L926N212O148O018
60213F44829N347N176N671O072N947N822O185O570O183N066M012L483L273L105
60199G16741K903K469J580N90K28M71K62j194l345m994n712n906n880n554n059
60184F87600m856n034m999m274l205k515k372k302j946j540j462j607j522j072
60170F48894o26n00n21l38O7M54P33R77J142J086Q74O84N14K85K14O03J252J584
$$ y = [645796, 635339, 625248, 615923, 607580, 600418, 594649, 590158, 586456, 583331, 581255, 580664, 581013, 581047, 580104, 578732, 577897, 577911, 578400, 579000, 579679, 580391, 580793, 580532, 579752, 579091, 579144, 579960, 581134, 582280, 583321, 584294, 585051, 585243, 584623, 583308, 581736, 580327, 579168, 578087, 577037, 576331, 576345, 577073, 578170, 579489, 581376, 584279, 588182, 592553, 596753, 600407, 603500, 606344, 609414, 612961, 616717, 620213, 623525, 627451, 632663, 638811, 644829, 650176, 655352, 661023, 667095, 673042, 678864, 685049, 691619, 697802, 702868, 706880, 710363, 713636, 716741, 719644, 722113, 723693, 724283, 724511, 724982, 725244, 724050, 720705, 715711, 709999, 704093, 698213, 692659, 687600, 682744, 677710, 672711, 668437, 665232, 662717, 660345, 658043, 656097, 654557, 653095, 651488, 649966, 648894, 648268, 647768, 647247, 646909, 646976, 647430, 648163, 649140, 650282, 651368, 652242, 652926, 653440, 653725, 653939, 654542, 655794, 657378]
60152F57378J548J790K652L548L725L326L162L690M696N785O667P106P048O859
60138G18980O974P306P409P293P565Q560R682J0052R595R033Q775Q236O567L794
60124H29821Q42j519l304m761n681n681m925m034l349k715j985j307q12m37k00
60109G89953k89p24j223j568j831k107k340k529k786l019k909k417j982j957k105
60094G60167j880j089j9Q99J428J702K138K967L802M038L672L340L417L547L322
60079G91451K899K598K275J516J88j607l857o516r213j1412j2760j3137j2569
60066G29856j1378j0159r338q870q514q170p754p091o208n495n262n307n126m423
60052F26761l300k133j319q89l61O93K016K998L506L806L779L130K313K245K835
$$ y = [657378, 658926, 660716, 663368, 666916, 670641, 673967, 677129, 680819, 685515, 691300, 697967, 705073, 712121, 718980, 725954, 733260, 740669, 747962, 755527, 764087, 773769, 783821, 793416, 802449, 811224, 819460, 826027, 829821, 830663, 829144, 825840, 821079, 815398, 809717, 804792, 800758, 797409, 794694, 792709, 791402, 790590, 790153, 789953, 789664, 788940, 787717, 786149, 784318, 782211, 779871, 777342, 774556, 771537, 768628, 766211, 764229, 762272, 760167, 758287, 757198, 757179, 758078, 759506, 761208, 763346, 766313, 770115, 774153, 777825, 781165, 784582, 788129, 791451, 794350, 796948, 799223, 800739, 800927, 799320, 795463, 788947, 779734, 768322, 755562, 742425, 729856, 718478, 708319, 698981, 690111, 681597, 673427, 665673, 658582, 652374, 646879, 641617, 636310, 631184, 626761, 623461, 621328, 620009, 619120, 618759, 619452, 621468, 624466, 627972, 631778, 635557, 638687, 641000, 643245, 646080]
60037F46080K874J888Q39L62l99k147l784l886l043l083m406n668o062o264o939
60022F06362p667p884p742p544p113o299n364m497l491k310j347q09l89P5J31
60007E44112o48j921k840k898k242j299l47N92J465J932J658R96Q96J793K985
59992E44234L553L473L328L322L289L270L312L003K045J077R40J309J028j63j291
59977E75729j672j797k439l560m465m479l372j604j59M26P33J541K561K965K863
59962E63271L087L669L874L784M353N586O137N283L926K956J960M89o62n87K53
59947F07379Q44J079J370J480R40Q4m43p95j505k312k467j960j394r09j87N85
59931F01789P97M43K01M41R33J485K102K478K135J216M79L47O43J305K578M313
$$ y = [646080, 648954, 650842, 651681, 652043, 651644, 649497, 645713, 641827, 638784, 635701, 631295, 625627, 619565, 613301, 606362, 598695, 590811, 583069, 575525, 568412, 562113, 556749, 552252, 548761, 546451, 545104, 544295, 543906, 543981, 544112, 543464, 541543, 538703, 535805, 533563, 532264, 531917, 532509, 533974, 535906, 537564, 538560, 539456, 541249, 544234, 547787, 551260, 554588, 557910, 561199, 564469, 567781, 570784, 572829, 573906, 574846, 576155, 577183, 577020, 575729, 574057, 572260, 569821, 566261, 561796, 557317, 553945, 552341, 552182, 552608, 553341, 554882, 557443, 560408, 563271, 566358, 570027, 573901, 577685, 582038, 587624, 593761, 599044, 602970, 605926, 607886, 608375, 607713, 607126, 607379, 608223, 609302, 610672, 612152, 613092, 613176, 612733, 611938, 610433, 608121, 605654, 603694, 602300, 601391, 601204, 601789, 602586, 603029, 603230, 603671, 604604, 606089, 608191, 610669, 612804, 614020, 614499, 614846, 615489, 616794, 619372, 623685]
59915F23685N744O424O790P387P997Q016P443O902O701O313M997K756M52j041
59901G00566j600j713j800j904j862j465n18Q22J834J896J410J486K516L634L938
59886G07240L650L559L818L897L561L241L476M295N179N476N000M263L820L379
59872G63854K060l04k725m265n037n580n860n629n218n210n590n905o061o230
59858G02300o178n459m222l184k778k805k877k668j802j44J816L426M729O306
59844F86460Q247R894J0805J1415J2451J3938J4980J4389J1601P303L219R05O85
59831H06292J796L370M825N545M799K254j719o311j0644j3955j5821j6337j5873
59818G48221j4709j3104j1500j0216r013p422n560m127l554l469l266k809k426
$$ y = [623685, 629429, 635853, 642643, 650030, 658027, 666043, 673486, 680388, 687089, 693402, 698399, 701155, 701607, 700566, 698966, 697253, 695453, 693549, 691687, 690222, 689704, 690526, 692360, 694256, 695666, 697152, 699668, 703302, 707240, 710890, 714449, 718267, 722164, 725725, 728966, 732442, 736737, 741916, 747392, 752392, 756655, 760475, 763854, 765914, 765610, 762885, 758620, 753583, 748003, 742143, 736514, 731296, 726086, 720496, 714591, 708530, 702300, 696122, 690663, 686441, 683257, 680479, 677674, 674797, 672129, 670327, 670183, 671999, 675425, 680154, 686460, 694707, 704601, 715406, 726821, 739272, 753210, 768190, 782579, 794180, 801483, 804702, 805607, 806292, 808088, 811458, 816283, 821828, 826627, 828881, 827162, 820851, 810207, 796252, 780431, 764094, 748221, 733512, 720408, 708908, 698692, 689679, 682257, 676697, 672570, 669016, 665547, 662281, 659472, 657046]
59805F57046k363k483k443k122j794j785j953j723q78j2J03n77j392j804j862
59790F33958j857j875j742j236m65om60j686k727k836k259j742j614j744k069
59775F09640k556k834k456j561p79n13o59q89r19n50J5J97k18n38L0J249K194
59758E98853K627L189M156M901M924M711N021N819O387O307N869N606N724N947
59744F70041N831N236M456L783L116K282J495J078Q69L84l96r73j121j134j202
59729F93745j067o33l35n60j075j424j597j862k191k295k149k107k414k814k785
59714F68437k123j260q54j012j103n03O69J813K536K703K102Q31j06N16K511M153
59698F79310M151L162K689L105L570L641L795M249M256L085J134n46j427j632
$$ y = [657046, 654683, 652200, 649757, 647635, 645841, 644056, 642103, 640380, 639502, 639490, 639593, 639016, 637624, 635820, 633958, 632101, 630226, 628484, 627248, 626783, 626777, 626317, 624631, 621904, 619068, 616809, 615067, 613453, 611709, 609640, 607084, 604250, 601794, 600233, 599454, 598941, 598282, 597393, 596474, 595924, 595939, 596136, 595918, 595380, 595410, 596659, 598853, 601480, 604669, 608825, 613726, 618650, 623361, 628382, 634201, 640588, 646895, 652764, 658370, 664094, 670041, 675872, 681108, 685564, 689347, 692463, 694745, 696240, 697318, 698187, 698571, 698175, 697202, 696081, 694947, 693745, 692678, 692045, 691710, 691150, 690075, 688651, 687054, 685192, 683001, 680706, 678557, 676450, 674036, 671222, 668437, 666314, 665054, 664200, 663188, 662085, 661582, 662251, 664064, 666600, 669303, 671405, 672236, 672130, 672646, 675157, 679310, 683461, 686623, 689312, 692417, 695987, 699628, 703423, 707672, 711928, 715013, 716147, 715601, 714174, 712542]
59684G12542j230k21P58O74o00j876k153j996k645m161n397n788n974o412o443
59669F69078n480m274l940m279m077k919j683j149j049p72l21m1J17N77J491K464
59653F43743K960K901K790L128L723L815L003J656K46j267k905m081m305m104
59639F51303m392n060n104m200l166k650k207j230l3O00N11J16m43j438k936m401
59623F15270n037m388k748j116m86r91j861k373k577k949l545l867l470k431j146
59608E76285J55J501K826L733L818L229K523J935J179R8r10j435j619j684j422
59593E90212o86m9j62p23q85n44l48m57k69M14R06O68O3l93q13j495k244k627
59575E80568k556k210j759j424j455j732j824j624j451j346q83N2Q18Q39L13j90
$$ y = [712542, 711312, 711091, 711849, 712523, 711923, 710047, 707894, 705898, 703253, 699092, 693695, 687907, 681933, 675521, 669078, 663598, 659324, 655384, 651105, 647028, 644109, 642426, 641277, 640228, 639456, 639135, 639094, 639211, 639788, 641279, 643743, 646703, 649604, 652394, 655522, 659245, 663060, 666063, 667719, 667965, 666698, 663793, 659712, 655407, 651303, 646911, 641851, 636747, 632547, 629381, 626731, 624524, 623294, 623261, 623861, 624372, 624488, 624045, 622607, 619671, 615270, 610233, 605845, 603097, 601981, 601495, 600504, 598643, 596270, 593693, 590744, 587199, 583332, 579862, 577431, 576285, 576440, 577941, 580767, 584500, 588318, 591547, 594070, 596005, 597184, 597282, 596372, 594937, 593318, 591634, 590212, 589526, 589477, 589315, 588592, 587707, 587163, 586815, 586358, 586089, 586503, 587409, 588077, 588140, 587747, 586934, 585439, 583195, 580568, 578012, 575802, 574043, 572619, 571164, 569432, 567608, 565984, 564533, 563187, 562304, 562356, 563174, 564013, 564326, 564136]
59559E64136l31O2R97J859J714O65P1P66J797J876J312J323J973K231J948K333
59543E84732M137O589Q689J0498J2477J4394J5786J7049J9005K1250K1662J8093
59531G54361J0578J802m793p477p036n296l233q04J875L923M490L638K078L61
59517G54467j414l319n384p533r470j0726j1059j0767j0447j0405j0449j0207
59505F53287r495q383p114n982n134m402l482k397j596j409j497j151j94P49R84
59490F02784N34m6l87m61j95O12J881L114L886M272M593M995N428N946O721P766
59474F51443Q822R547R765R433Q516O942M826K593P56m43j091j296j044l60O45
59459G09054K025M020O528Q899J0519J1431J2053J2442J2329J1715J0973J0323
$$ y = [564136, 563805, 563867, 564864, 566723, 568437, 569102, 569173, 569939, 571736, 573612, 574924, 576247, 578220, 580451, 582399, 584732, 588869, 595458, 604147, 614645, 627122, 641516, 657302, 674351, 693356, 714606, 736268, 754361, 764939, 766741, 761948, 754471, 747435, 742139, 738906, 738102, 739977, 743900, 748390, 752028, 754106, 754467, 753053, 749734, 744350, 736817, 727347, 716621, 705562, 694795, 684348, 673943, 663494, 653287, 643792, 635409, 628295, 622313, 617179, 612777, 609295, 606898, 605302, 603893, 602396, 601245, 601051, 601800, 602784, 603318, 603272, 602885, 602424, 602229, 602841, 604722, 607836, 611722, 615994, 620587, 625582, 631010, 636956, 643677, 651443, 660265, 669812, 679577, 689010, 697526, 704468, 709294, 711887, 712643, 712200, 711109, 709813, 708769, 708409, 709054, 711079, 715099, 721627, 730526, 741045, 752476, 764529, 776971, 789300, 801015, 811988, 822311]
59447H22311R613Q636P266N259K318j420n351q904j1847j4020j5116j4946j3692
59434G70107j1836r908q272o907n537m138l158k829k484j156J200L727N910Q169
59420G32888J0933J3812J6114J7736J9062K0268K1182K1783K2518K3852K5281
59409I45429K4749J9625R147m071j5534k2135k3725k1825j7711j1986n054K492
59397H79401R358J3177J1478L969o517j6081k2518k5821k6669k5408k2403j8456
59385G53510j4512j1240q906p311n849l985j808P4J135J383J275J353J811K313
59371G09243K440K346K759M101N935P435Q210Q490Q734R223R811R995R450Q595
59357H06767Q230Q602R255R849J0649J1852J3121J4140J5174J6613J8270J9588
$$ y = [822311, 831924, 840560, 847826, 853085, 855403, 853983, 848632, 839728, 827881, 813861, 798745, 783799, 770107, 758271, 748363, 740091, 733184, 727647, 723509, 720351, 717522, 715038, 713882, 715082, 718809, 724719, 732888, 743821, 757633, 773747, 791483, 810545, 830813, 851995, 873778, 896296, 920148, 945429, 970178, 989803, 998950, 994879, 979345, 957210, 933485, 911660, 893949, 881963, 876909, 879401, 888759, 901936, 913414, 917383, 910866, 894785, 872267, 846446, 819777, 794369, 771966, 753510, 738998, 727758, 718852, 711541, 705692, 701707, 699899, 699973, 701108, 702491, 703766, 705119, 706930, 709243, 711683, 714029, 716788, 720889, 726824, 734259, 742469, 750959, 759693, 768916, 778727, 788722, 798172, 806767, 814997, 823599, 832854, 842703, 853352, 865204, 878325, 892465, 907639, 924252, 942522, 962110]
59345I62110K0231K0169J9415J8032J6058J3200R088M107m98l897o531r254j2100
59332A050130j4584j6697j8768k0555k1326k0816j9454j7666j5630j3690j2258
59321H58686j1195r904q226o775o064n794n296m426l636l302l228k927k239j551
59307G84123j346j620j897j831j522j217r24m68K90J314K368L172L885N273P975
59292G97575J1617J5045J7354J8000J6046J0476J765p581j4745j8457j8978j7101
59280H11016j3902j0678q146n823k903N31L677O062P825R293J0799J2540J3985
59267H34276J3981J2080R441P529O316M538J556j962n067p334q667r186r410r920
59253H38171j0669j1135j1083j0643r845q688p546o755n852m029j364J158K962
$$ y = [962110, 982341, 1002510, 1021925, 1039957, 1056015, 1069215, 1078303, 1082410, 1081912, 1078015, 1071484, 1062230, 1050130, 1035546, 1018849, 1000081, 979526, 958200, 937384, 917930, 900264, 884634, 870944, 858686, 847491, 837587, 829361, 822586, 816522, 810728, 805432, 801006, 797370, 794068, 790840, 787913, 785674, 784123, 782777, 781157, 779260, 777429, 775907, 774690, 773766, 773298, 773588, 774902, 777270, 780442, 784327, 789600, 797575, 809192, 824237, 841591, 859591, 875637, 886113, 887878, 880297, 865552, 847095, 828117, 811016, 797114, 786436, 778290, 772467, 769564, 770095, 773772, 779834, 787659, 796952, 807751, 820291, 834276, 848257, 860337, 869778, 877307, 883623, 888161, 889717, 887755, 882688, 875354, 866687, 857501, 848091, 838171, 827502, 816367, 805284, 794641, 784796, 776108, 768562, 761807, 755955, 751926, 750562, 751720, 754682]
59240G54682M447O076P558Q389Q601Q589Q471P919O547M412K193P06Kp74k312
59225H25506m240n752o695p426p916p794p098o235n334m330l519l178k827j788
59211G51374m00L24K96M37R83Q83n04k191k779k227j578j509j814k049j986j645
59195G35615j342j475j912j948j205k72J23J39M98J337K047K247K252K442K635
59180G41181K449K007J878K391L288M110M672N008N158N292N882P273R096J0557
59166H10242J1399J2068J2773J2937J1948R999P693N249K554k78k945n353p492
59153H80794r155j0234j1074j2051j2958j3251j2777j1851j0810r903r324r042
59141G48364q835q772r238j0043j0185r036p265n872m914l980l291l182k977j633
$$ y = [754682, 759129, 765205, 772763, 781152, 789753, 798342, 806813, 814732, 821279, 825691, 827884, 828590, 828592, 827818, 825506, 821266, 815514, 808819, 801393, 793477, 785683, 778585, 772350, 767016, 762686, 759167, 755989, 753162, 751374, 750974, 751298, 751594, 752031, 753014, 753897, 753393, 751202, 748423, 746196, 744618, 743109, 741295, 739246, 737260, 735615, 734273, 732798, 730886, 728938, 727733, 727461, 727584, 727723, 728221, 729558, 731605, 733852, 736104, 738546, 741181, 743630, 745637, 747515, 749906, 753194, 757304, 761976, 766984, 772142, 777434, 783316, 790589, 799685, 810242, 821641, 833709, 846482, 859419, 871367, 881366, 889059, 894308, 896862, 896584, 893639, 888286, 880794, 871639, 861405, 850331, 838280, 825322, 812071, 799294, 787443, 776633, 766730, 757406, 748364, 739529, 730757, 721519, 711476, 701291, 692255, 684990, 679118, 674204, 670224, 666933, 663751, 660774, 659141]
59127F59141O44K605L665M306M864N166N449O388P960R342J0256J1339J2919J4427
59113G58471J5440J6220J6856J6834J6008J5091J4560J3895J2466J0478Q472O537
59101I21328M570K716R60j147l785o325p981q658q760q587q264p786o862n157
59087H56262l073j766j979l319m934o460p904r079r687r739r552r438r442r301
59073G60589q617p464o559o373o333n560m255l455l472l530l073k449k061j784
59059F95604j572j780k444k943k847k392j849j094j97L44L01R3J18L58P65J297
59043F81762J449O35p31j503j294p97l80L20J172J288O24M66J557L013M023N273
59027F96877P516R952J1433J2336J3739J5444J6293J5985J5122J3773J1383Q050
$$ y = [659141, 659785, 662390, 666055, 670361, 675225, 680391, 685840, 692228, 700188, 709530, 719786, 731125, 744044, 758471, 773911, 790131, 806987, 823821, 839829, 854920, 869480, 883375, 895841, 906319, 914791, 921328, 925898, 928614, 929574, 928427, 924642, 918317, 910336, 901678, 892918, 884331, 876067, 868281, 861419, 856262, 853189, 851423, 849444, 846125, 841191, 834731, 826827, 817748, 808061, 798322, 788770, 779332, 769890, 760589, 751972, 744508, 737949, 731576, 725243, 719683, 715428, 711973, 708501, 704971, 701898, 699449, 697388, 695604, 694032, 692252, 689808, 686865, 684018, 681626, 679777, 678683, 678486, 678830, 679131, 679224, 679342, 679700, 680465, 681762, 683211, 683846, 683115, 681612, 680318, 679521, 679141, 679461, 680633, 681921, 682545, 683011, 684568, 687581, 691604, 696877, 704393, 714345, 725778, 738114, 751853, 767297, 783590, 799575, 814697, 828470, 839853, 847903]
59015H47903M648J647j153l746n666o719p149p042o249m865l199j287R95L463
59001H11581N663P268Q142Q313Q185Q216Q072O797M368K215J453J404P27p52k350
58986H79302l979n953p844q841r003r002q761p591n562l521j799N6K144L968N408
58971H19022O910Q526R760J0553J1475J2649J3456J3683J4046J5051J6058J6027
58959I67216J4651J2338R477O226K749q33m528q359j2157j5566j8178j9690k0118
58946I13228j9728j8691j7018j4966j3117j1701j0287q514o727n366m182k764
58934G80167j545j436k517l789m345m255m217m695n491n918n521m642m018l714
58920G24064l049j813q31p85j187j225r38p51m49M33J638K576L338M341N401O163
$$ y = [847903, 852551, 854198, 853045, 849299, 843633, 836914, 829765, 822723, 816474, 811609, 808410, 807123, 808118, 811581, 817244, 824512, 832654, 840967, 849152, 857368, 865440, 872237, 876605, 878820, 880273, 881677, 882404, 881652, 879302, 875323, 869370, 861526, 852685, 843682, 834680, 825919, 818328, 812766, 809245, 807446, 807502, 809646, 813614, 819022, 825932, 834458, 844218, 854771, 866246, 878895, 892351, 906034, 920080, 935131, 951189, 967216, 981867, 994205, 1003682, 1009908, 1012657, 1011824, 1007296, 998937, 986780, 971214, 953036, 933346, 913228, 893500, 874809, 857791, 842825, 829708, 818007, 807720, 799206, 792479, 787113, 782931, 780167, 778622, 777186, 774669, 770880, 766535, 762280, 758063, 753368, 747877, 741959, 736438, 731796, 727778, 724064, 721015, 719202, 718371, 717586, 716399, 715174, 714236, 713485, 713036, 713469, 715107, 717683, 721021, 725362, 730763, 736926]
58904G36926P126R107J1807J4031J5250J5930J6423J6657J6850J7444J8234J8581
58892I14366J8625J9203K0529K1990K3421K5397K7918K9809K9888K7881K4028
58881A183055J8748J3043Q177M368N33m184r381j4243j8508k2043k4285k4776
58869A110504k3750k1725j9058j6244j3968j2348j0840r320q602r262j0657j1796
58857I42934j2544j3204j3536j3173j2604j2644j3012j2480j0691q894q442r141
58845H02569r687r452r153r769j1247j2587j2929j2172j0688q927p443o724o619
58832F75172o205m819l037k046k152k448k045j022JP30J236J562J668J674J868
58817F60137K370K984L326L133K524J920J684J725J592R63R9l13Q2O76L66j086
$$ y = [736926, 744052, 753159, 764966, 778997, 794247, 810177, 826600, 843257, 860107, 877551, 895785, 914366, 932991, 952194, 972723, 994713, 1018134, 1043531, 1071449, 1101258, 1131146, 1159027, 1183055, 1201803, 1214846, 1223023, 1227391, 1227924, 1223740, 1214359, 1200116, 1181608, 1159565, 1135280, 1110504, 1086754, 1065029, 1045971, 1029727, 1015759, 1003411, 992571, 983251, 974649, 965387, 954730, 942934, 930390, 917186, 903650, 890477, 877873, 865229, 852217, 839737, 829046, 820152, 811710, 802569, 792882, 783430, 774277, 764508, 753261, 740674, 727745, 715573, 704885, 695958, 688515, 681791, 675172, 668967, 664148, 661111, 659065, 656913, 654465, 652420, 651398, 651399, 652129, 653365, 654927, 656595, 658269, 660137, 662507, 665491, 668817, 671950, 674474, 676394, 678078, 679803, 681395, 682358, 682457, 682144, 682226, 682902, 683268, 682182]
58801F82182k524k731j956j424j567j750j755k284l543m459m082k962k199j920
58787F47026j458m83R52K821M741N761N556N243N912O978P103O312N774N768N315
58772G13321L813J690p12l505o263p849p806o962o275n828n254m388l148j559
58758F59275j35M44L35M38J063J497J155N11M30J117K114K948L522M149N182O366
58742F90411O907O705P009Q878J1365J2470J1782J0906J1133J2068J2885J3534
58730H16053J4028J3757J2487J1155J0653J0424R209O855M545L496L977N481P232
58717I29352Q636R546J0151J0498J0328R394P678N212K135j089l947o479r237
58704I82178j2426j5635j8433k0850k3040k4890k6124k6604k6394k5731k4791
$$ y = [682182, 679658, 676927, 674971, 673547, 671980, 670230, 668475, 666191, 662648, 658189, 654107, 651145, 648946, 647026, 645568, 645085, 646037, 648858, 653599, 659360, 664916, 670159, 676071, 683049, 690152, 696464, 702238, 708006, 713321, 717134, 718824, 718112, 714607, 708344, 700495, 692689, 685727, 679452, 673624, 668370, 663982, 660834, 659275, 659140, 659584, 659919, 660357, 661420, 662917, 664072, 664583, 665013, 666130, 668244, 671192, 674714, 678863, 684045, 690411, 697318, 704023, 711032, 719910, 731275, 743745, 755527, 766433, 777566, 789634, 802519, 816053, 830081, 843838, 856325, 867480, 878133, 888557, 897766, 904621, 909166, 912662, 916639, 922120, 929352, 937988, 947534, 957685, 968183, 978511, 987905, 995583, 1000795, 1002930, 1001841, 997894, 991415, 982178, 969752, 954117, 935684, 914834, 891794, 866904, 840780, 814176, 787782, 762051, 737260]
58693G37260k3354k0946j7728j4735j2774j1490j0130q738p784p069o088n168
58681E91256n070n541n434m367l124k249j405l44N70J229K290M241O698R026J1066
58666E98842J2968J4828J6713J8414J9117J8008J5199J1464P104J989l336p663
58654G23647j0402j1933j2581j2220j1177j0402j0294j0144r179p475n588l952
58642F08300k907k571k480k000j159m64J2N33R29Q38O36R41J337Q58k84q52n23
58625F01144k67m93l79N55J634K404L436N069O672P816Q966J0301J1035J0699
58611F68592R877Q990P387M643J676l21j364k182l082l943m651m946m475l555
58597F72646l069l265l439l172k823k362r69J626M453O630Q361J0066J1560J2737
$$ y = [737260, 713906, 692960, 675232, 660497, 647723, 636233, 626103, 617365, 609581, 602512, 596424, 591256, 586186, 580645, 575211, 570844, 567720, 565471, 564066, 563722, 564292, 565521, 567811, 572052, 578750, 587776, 598842, 611810, 626638, 643351, 661765, 680882, 698890, 714089, 725553, 732657, 734646, 731310, 723647, 713245, 701312, 688731, 676511, 665334, 654932, 644638, 634494, 625315, 617840, 612252, 608300, 605393, 602822, 600342, 598342, 597183, 596719, 596731, 597264, 598193, 599031, 599667, 600608, 601945, 602803, 602519, 601667, 601144, 600877, 600384, 600005, 600560, 602194, 604598, 608034, 613103, 619775, 627591, 636557, 646858, 657893, 668592, 678469, 687459, 694846, 699489, 701165, 700844, 699480, 697298, 694216, 690273, 685622, 680676, 676201, 672646, 669577, 666312, 662873, 659701, 656878, 654516, 653547, 655173, 659626, 666256, 674617, 684683, 696243, 708980]
58583G08980J3995J5330J6036J5887J5513J5060J3711J1197Q556O610M972L372
58571H49219K754M009O673R841J3282J6901K0174K3079K6440L0417L3726L5158
58559A071673L4817L2945K8956K2751J5824R687M319p76m997p585r080j0528j1883
58546A176123j2531j2678j3019j3678j4524j5990j8494k1531k4121k5699k6013
58535I77845k5038k3445k2209k1189j9289j6424j3889j2158j0080p130m548l116
58523G99330j685O33K655L243L426M459N363M579K761J650J204J37j606l063m199
58508H18887n486o223n469m035l555m011m204m144m796n848n954n016m234l931
58494G51981l254k085j299j082o07M03J378K252L653N682P774R733J1766J3684
$$ y = [708980, 722975, 738305, 754341, 770228, 785741, 800801, 814512, 825709, 834265, 840875, 845847, 849219, 851973, 855982, 862655, 872496, 885778, 902679, 922853, 945932, 972372, 1002789, 1036515, 1071673, 1106490, 1139435, 1168391, 1191142, 1206966, 1216653, 1220972, 1220196, 1215199, 1207614, 1198534, 1188006, 1176123, 1163592, 1150914, 1137895, 1124217, 1109693, 1093703, 1075209, 1053678, 1029557, 1003858, 977845, 952807, 929362, 907153, 885964, 866675, 850251, 836362, 824204, 814124, 806994, 802446, 799330, 797645, 798278, 800933, 804176, 807602, 812061, 817424, 822003, 824764, 826414, 827618, 827755, 826149, 823086, 818887, 813401, 807178, 801709, 797674, 794119, 790108, 785904, 781760, 776964, 771116, 765162, 760146, 755912, 751981, 748727, 746642, 745343, 744261, 743654, 744057, 745435, 747687, 751340, 757022, 764796, 774529, 786295, 799979]
58480G99979J5248J6944J9053K0473J9852J7574J4992J2178Q092K795k243o069
58468I38868q988j1333j2894j3619j3726j3074j1429r184o823m117q30K391M912
58455H40154P206R786J1784J2016J0763R057O928L894M29k640n464q293j0097
58442H85523r977r055q918q889p052l538n01R43J550J979K112K348L420M820N397
58427H60162N501O659R006J1019J1897J2334J2648J2041J0068P353M468J513j191
58414I63478l275n190p545r827j1045j1347j1610j1898j1739j1339j0970r881
58402H47812p545n168m061l326j286J532L241L727M386N226M902L431K231J529
58388H56631L20j133j356l74J78o8K79J726L176M198N646P593Q880R139R208R260
$$ y = [799979, 815227, 832171, 851224, 871697, 891549, 909123, 924115, 936293, 944385, 947180, 944937, 938868, 929880, 918547, 905653, 892034, 878308, 865234, 853805, 844621, 837798, 833681, 832851, 835242, 840154, 847360, 857146, 868930, 880946, 891709, 900766, 907694, 911588, 912017, 909377, 903913, 895620, 885523, 875546, 866491, 857573, 848684, 841632, 838094, 837593, 838536, 840086, 842065, 844177, 846525, 849945, 854765, 860162, 865663, 872322, 881328, 892347, 904244, 916578, 929226, 941267, 951335, 958688, 963156, 964669, 963478, 960203, 955013, 947468, 937641, 926596, 915249, 903639, 891741, 880002, 868663, 857693, 847812, 840267, 835099, 831038, 827712, 826426, 827958, 831199, 834926, 839312, 844538, 849440, 852871, 855102, 856631, 856951, 855818, 854462, 854088, 854266, 854198, 854477, 856203, 859379, 863577, 869223, 876816, 885696, 894835, 904043, 913303]
58372I13303Q589P446O974P200P201P288Q637J0758J1786J1547J1765J2908J3413
58359A038815J2522J1366J0631R469P435N412L897K367P45k88p16j058q83N96
58345A100310K598L656M155N689Q156J0029J1259J3154J5573J7055J7608J8479
58333A227721J9272J8348J6046J4388J3537J1735Q830O544N132L197R91L77J181
58320A347299J187J92M05K283L713M042N055P219Q710R158J0532J3229J4987J4875
58306A442886J4787J5802J6544J6308J6279J6675J6127J4843J4758J5773J5710
58295A616492J4645J5170J7465J8588J7714J7564J9265K0490K0203K0634K2755
58284A820985K4331K4361K4915K6795K7854K7511K8294L0988L2914L3062L4151
$$ y = [913303, 921892, 929338, 936312, 943512, 950713, 958001, 966638, 977396, 989182, 1000729, 1012494, 1025402, 1038815, 1051337, 1062703, 1073334, 1082803, 1090238, 1095650, 1099547, 1101914, 1102659, 1102371, 1101655, 1100597, 1099714, 1100310, 1102908, 1106564, 1110719, 1116408, 1124564, 1134593, 1145852, 1159006, 1174579, 1191634, 1209242, 1227721, 1246993, 1265341, 1281387, 1295775, 1309312, 1321047, 1329877, 1336421, 1341553, 1344750, 1345741, 1346118, 1347299, 1348486, 1348678, 1349083, 1351366, 1355079, 1359121, 1364176, 1371395, 1380105, 1389263, 1399795, 1413024, 1428011, 1442886, 1457673, 1473475, 1490019, 1506327, 1522606, 1539281, 1555408, 1570251, 1585009, 1600782, 1616492, 1631137, 1646307, 1663772, 1682360, 1700074, 1717638, 1736903, 1757393, 1777596, 1798230, 1820985, 1845316, 1869677, 1894592, 1921387, 1949241, 1976752, 2005046, 2036034, 2068948, 2102010, 2136161]
58273B136161L7449M0473M1984M4295M8287N1212N1884N3022N5915N8043N8501
58262B677226O0292O4375O7029O6211O5018O5660O5645O3288O1383O1849O2368
58251C380344O1777O3064O7503P1739P4311P8783Q6705R3963R8192J03112J11238
58240D290731J19229J25004J32219J42715J51948J57350J63760J74804J86517
58231E644277J95543K05909K21158K37577K51935K68064K88867L10012L28811
58222G952153L50785L79808M10770M40118M74120N17867N65903O13416O66506
58213A2371446P31257Q03231Q78818R66004J072142J192764J325241J481149J671556
58204B2493608J893941K149419K458859K845412L317583L889918M604347N510260
$$ y = [2136161, 2173610, 2214083, 2256067, 2300362, 2348649, 2399861, 2451745, 2504767, 2560682, 2618725, 2677226, 2737518, 2801893, 2868922, 2935133, 3000151, 3065811, 3131456, 3194744, 3256127, 3317976, 3380344, 3442121, 3505185, 3572688, 3644427, 3718738, 3797521, 3884226, 3978189, 4076381, 4179493, 4290731, 4409960, 4534964, 4667183, 4809898, 4961846, 5119196, 5282956, 5457760, 5644277, 5839820, 6045729, 6266887, 6504464, 6756399, 7024463, 7313330, 7623342, 7952153, 8302938, 8682746, 9093516, 9533634, 10007754, 10525621, 11091524, 11704940, 12371446, 13102703, 13905934, 14784752, 15750756, 16822898, 18015662, 19340903, 20822052, 22493608, 24387549, 26536968, 28995827, 31841239, 35158822, 39048740, 43653087, 49163347]
58196D9163347O643843Q054047R827260J2051238J4770542J8008145K1801673
58189A40320095K6165158L1011957L6086524M0789971M3859989M3314419L7210009
58182C98758122K5030700Q584896q565129k2826808l2115136l6213635l6132750
58175B96520260l3296152k9088424k4706069k1046213j8551712j7140819j6350745
58168A36340126j5648636j4704532j3457971j2008872j0492713r029052p706435
58161E3291915o563147n587946m755156m051376l465504k975041k557821k204860
58153B1131064j910269j660477j444259j262187j115280r93895q87628p96882
58145A1060187p24693o65437o11191n61732n19154m79377m37736l96897l61183
$$ y = [49163347, 55807190, 63861237, 73688497, 85739735, 100510277, 118518422, 140320095, 166485253, 197497210, 233583734, 274373705, 318233694, 361548113, 398758122, 423788822, 432373718, 423808589, 400981781, 368866645, 332653010, 296520260, 263224108, 234135684, 209429615, 188383402, 169831690, 152690871, 136340126, 120691490, 105986958, 92528987, 80520115, 70027402, 60998350, 53291915, 46728768, 41140822, 36385666, 32334290, 28868786, 25893745, 23335924, 21131064, 19220795, 17560318, 16116059, 14853872, 13738592, 12744697, 11857069, 11060187, 10335494, 9670057, 9058866, 8497134, 7977980, 7498603, 7060867, 6663970, 6302787]
58136F302787l28676k96281k66725k43277k23165k03510j88229j81571j79624
58127D191729j75527j68860j62920j56929j48006j37594j29180j22297j14499
58118B875917j06567j00490r5025q8290q1848p7566p3510o7621o2232o0158n9413
58107B003197n6692n3081n1410n0788m8702m6027m5066m4807m2786l9712l7796
58096A486330l6401l3558l0061k8025k7052k5544k4058k3802k3554k1592j8903
58085A193780j7255j5997j4052j2942j4382j6902j8204j8919k0664k2466k2577
58074I99420k1901k2120k2282k0786j8873j8576j8900j7613j5303j4045j3602
58063G95419j2391j0839j0234r712p759n534n167n955n721m821n366p292q655
$$ y = [6302787, 5974111, 5677830, 5411105, 5167828, 4944663, 4741153, 4552924, 4371353, 4191729, 4016202, 3847342, 3684422, 3527493, 3379487, 3241893, 3112713, 2990416, 2875917, 2769350, 2668860, 2573835, 2485545, 2403697, 2326131, 2252621, 2185000, 2122768, 2062610, 2003197, 1946505, 1893424, 1842014, 1791226, 1742524, 1696497, 1651431, 1606624, 1563838, 1524126, 1486330, 1449929, 1416371, 1386310, 1358285, 1331233, 1305689, 1281631, 1257829, 1234275, 1212683, 1193780, 1176525, 1160528, 1146476, 1133534, 1119152, 1102250, 1084046, 1065127, 1044463, 1021997, 999420, 977519, 955399, 933117, 912331, 893458, 874882, 855982, 838369, 823066, 809021, 795419, 783028, 772189, 761955, 752243, 744484, 738950, 733783, 727828, 722107, 717286, 711920, 704628, 695973]
58050F95973r042r539r930r099p586o824o457n269l982m296n827o866p426q651
58036E95179r874r339p377o053n946n988o053o974q250q406p566p202p516p351
58022D91284o519n956n783n316m718m615m490l470k261k194k838k696j732j151
58008D37545j181j095j014j541k138j877j227j086p45R22K979L547K840K647L211
57993D41787L157K265J774J967J803J103Q13J012O78l47j124j422j969k888l606
57978D45003m244n340o411o512n955n660n186l502j342o55j676k735k896k774
57964C90115k652j991j011p17j007o16P38J868K046J728J154Q3r49q62J32N77
57948C88636L0l78R6Q79J479K211L154L826M317N417P270R120J0582J1998J3388
$$ y = [695973, 686931, 677392, 667462, 658363, 650777, 643953, 637496, 632227, 628245, 623949, 618122, 611256, 603830, 595179, 585305, 575966, 568589, 562536, 556590, 550602, 544549, 537575, 529325, 520919, 513353, 506151, 498635, 491284, 484765, 478809, 473026, 467710, 462992, 458377, 453887, 450417, 448156, 445962, 443124, 440428, 438696, 437545, 436364, 435269, 434255, 432714, 430576, 428699, 427472, 426386, 425641, 426563, 429542, 433089, 435929, 438576, 441787, 444944, 447209, 448983, 450950, 452753, 453856, 454669, 455681, 456359, 456012, 454888, 453466, 451497, 448609, 445003, 440759, 435419, 429008, 422496, 416541, 410881, 405695, 402193, 400851, 400196, 398520, 395785, 392889, 390115, 387463, 385472, 384461, 383744, 382737, 382121, 382859, 384727, 386773, 388501, 389655, 389738, 388789, 387927, 388059, 388636, 388666, 388288, 388384, 389263, 390742, 392953, 396107, 399933, 404250, 409667, 416937, 426057, 436639, 448637, 462025]
57933D62025J4365J5106J6156J7233J7434J6607J5209J3101R872O195L231P64
57921F07298k374o110r122j1065j2940j5010j6154j5778j4759j3964j3289j2534
57909D64199j1860j0982r298p175n777n294m744l781l341m013n190o136o656o418
57895C73534m982k863j230k47J011K704L784L754L511L888M697N633O829P952
57881D07975Q100P108N933N142M222K772J230j03j637l556n346o697p844q585
57867D08714q092o264m268l172k926l064l493m105m443m204l441k161l80J361
57853C60062K499L287M204M736M063K791K487L392M114L784K938K022P29p27j420
57838C98961j503k516m981p202p539o610o000n934n484m311k977j934j182n96
$$ y = [462025, 476390, 491496, 507652, 524885, 542319, 558926, 574135, 587236, 597108, 603303, 606534, 607298, 604924, 598814, 589692, 578627, 565687, 550677, 534523, 518745, 503986, 490022, 476733, 464199, 452339, 441357, 432059, 424884, 419107, 413813, 409069, 405288, 401947, 397934, 392744, 386608, 379952, 373534, 368552, 365689, 364459, 364212, 365223, 367927, 371711, 375465, 378976, 382864, 387561, 393194, 400023, 407975, 416075, 423183, 429116, 434258, 438480, 441252, 442482, 442379, 440742, 437186, 431840, 425143, 417299, 408714, 400622, 394358, 390090, 386918, 383992, 380928, 377435, 373330, 368887, 364683, 361242, 359081, 358701, 360062, 362561, 365848, 370052, 374788, 378851, 381642, 384129, 387521, 391635, 395419, 398357, 400379, 401108, 400381, 398961, 397458, 394942, 389961, 382759, 375220, 368610, 362610, 356676, 351192, 346881, 343904, 341970, 340788, 340192]
57824C40192QQ51J870K775L550M282M545L813K609K159K639K880K146J125P21
57809C76165R40J407J942K127J307m22k102l205m054m736m738m129l832m168m231
57794C48271l433k511k349k781l280l793m177l870k828j898j547j145j94Q38J555
57779C16858K400L612M502M704N015O042P051P210P030P298P498O598M868L509
57765C94195K866K182R24o88k283l640m492m761m828m993m945m296l224k096r08
57750C59013L07J049R45M04k3m62j312k371l102l445l799m381n037n510n541n055
57734C21680m469m391m790m920m349l444k678k122j852k078k510k399j664j131
57720B78883j252j394j019o41r38j654k158k384k528k438k036j808k176k807l171
$$ y = [340192, 340200, 341051, 342921, 345696, 349246, 353528, 358073, 361886, 364495, 366654, 369293, 372173, 374319, 375444, 376165, 377105, 378512, 380454, 382581, 383888, 383466, 381364, 378159, 374105, 369369, 364631, 360502, 356670, 352502, 348271, 344838, 342327, 339978, 337197, 333917, 330124, 325947, 322077, 319249, 317351, 315804, 314659, 314465, 315303, 316858, 319258, 322870, 327372, 332076, 337091, 343133, 350184, 357394, 364424, 371722, 379220, 385818, 390686, 394195, 397061, 399243, 400167, 399479, 397196, 393556, 389064, 384303, 379475, 374482, 369537, 365241, 362017, 359921, 359013, 359320, 360369, 361314, 361718, 361695, 361233, 359921, 357550, 354448, 351003, 347204, 342823, 337786, 332276, 326735, 321680, 317211, 312820, 308030, 303110, 298761, 295317, 292639, 290517, 288665, 286587, 284077, 281678, 280014, 278883, 277631, 276237, 275218, 274577, 273639, 271985, 269827, 267443, 264915, 262477, 260441, 258633, 256457, 253650, 250479]
57705B50479l262l266l068k662k454k593k587k065j396j017p59l48N4K58M35O59
57689B26408P16P09J052J613J726J383J403J990K411K605L653N894Q029R233J0785
57674B79610J4298J9448K5013L1128L8866M8331N8800P0165Q2546R4444J02371
57663H65020J02100Q9841O3730K6374j4495m9850p4435q7697r1089q6609p7441
57652F65449o7364n8416n0332m2614l5780l0215k5317k0610j6595j3809j1835
57641B92562j0003q366p307o611n721m606l853l832m134l958l013j912j440j594
57627B26212j714j523j362j367j221j025j462k584l356l090k465k310k316j894
57613A98523j421j457j505q96k31n39j414j456l80P11J037R22Q54Q90J038J259
$$ y = [250479, 247217, 243951, 240883, 238221, 235767, 233174, 230587, 228522, 227126, 226109, 225350, 225002, 225056, 225314, 225749, 226408, 227124, 227833, 228885, 230498, 232224, 233607, 235010, 237000, 239411, 242016, 245669, 251563, 259592, 268825, 279610, 293908, 313356, 338369, 369497, 408363, 456694, 515494, 585659, 668205, 762649, 865020, 967120, 1056961, 1120691, 1147065, 1132570, 1082720, 1008285, 920588, 829499, 742890, 665449, 598085, 539669, 489337, 446723, 410943, 380728, 355411, 334801, 318206, 304397, 292562, 282559, 274193, 266886, 260275, 254554, 249948, 246095, 242263, 238129, 234171, 231158, 229246, 227806, 226212, 224498, 222975, 221613, 220246, 219025, 218000, 216538, 213954, 210598, 207508, 205043, 202733, 200417, 198523, 197102, 195645, 194140, 193244, 193013, 192474, 191060, 189604, 189224, 189935, 190972, 191894, 192748, 193638, 194676, 195935]
57597A95935J164N75J39M11P52K56o42q37m97q35k044k979l002k657k386j987
57581A81366j619j937k746k908k054j208j191j528j504j240j180j371j814k671
57567A56395l621l839l081k093j586j509j585j764j838j407n90L7L53P55J164
57552A35791J023M88M82J212J791J796J982K794L330K716J527Q83Q69Q64Q50J342
57536A59740K328L081K914J696j43j752k402k226k088k420k736k553k068j618
57522A49753j069k54N80J187J664J982J803J189Q56J261K004K554K896L085K840
57507A72331K204J827J970J944J235N05O48J385J703J246M50m05j361k198k518
57492A80966k316j862j198l36K57J51k86k92J11J78l85j014j197j129j134j046
$$ y = [195935, 197099, 197674, 197813, 198224, 198976, 199232, 198590, 197753, 197256, 196421, 194377, 191398, 188396, 185739, 183353, 181366, 179747, 177810, 175064, 172156, 170102, 168894, 167703, 166175, 164671, 163431, 162251, 160880, 159066, 156395, 152774, 148935, 145854, 143761, 142175, 140666, 139081, 137317, 135479, 134072, 133482, 133519, 133872, 134627, 135791, 136814, 137302, 137784, 138996, 140787, 142583, 144565, 147359, 150689, 153405, 154932, 155815, 156684, 157548, 158398, 159740, 162068, 165149, 168063, 169759, 169616, 167864, 165462, 163236, 161148, 158728, 155992, 153439, 151371, 149753, 148684, 148430, 149010, 150197, 151861, 153843, 155646, 156835, 157691, 158952, 160956, 163510, 166406, 169491, 172331, 174535, 176362, 178332, 180276, 181511, 182016, 182664, 184049, 185752, 186998, 187448, 187043, 185682, 183484, 180966, 178650, 176788, 175590, 175254, 175511, 175662, 175376, 175084, 175195, 175373, 174988, 173974, 172777, 171648, 170514, 169468]
57476A69468n53J00K83k13q74j052p10m04n83j046j279j125q93q63r02o95j16
57459A58543N63Q66O11K67N25J349J879J611J123J084J035R7j429k205j607m15
57443A63897L88N83L32k55q06p48o4N94Q34R00R91R29P51Q30J164J297J206J376
57425A74199J742J542O89J88N70R39L68o12q85l92O7J42K13N56J091J654K038
57408A84109K033J825J853K009J633O76P4L76R38J071J096J407J494R33M89J012
57392B03028J906K013J432J150J297J208R30J208K015K416K091J720J670J511
57378B25595J089J035J696K437K509K020J608J610J833J869J529J239J732K974
57364B50775L789L261K078J599J935K033J491J080J325J820K197K763L654M329
$$ y = [169468, 168915, 169015, 169298, 169085, 168211, 167159, 166449, 166045, 165462, 164416, 163137, 162012, 161119, 160256, 159354, 158659, 158543, 159106, 159972, 160583, 160850, 161375, 162724, 164603, 166214, 167337, 168421, 169456, 169553, 168124, 165919, 164312, 163897, 164285, 164868, 165200, 164945, 164139, 163391, 163327, 163921, 164755, 165655, 166646, 167575, 168326, 169156, 170320, 171617, 172823, 174199, 175941, 177483, 178172, 178360, 178930, 179869, 180237, 179625, 178740, 178348, 178415, 178557, 178770, 179326, 180417, 182071, 184109, 186142, 187967, 189820, 191829, 193462, 194138, 194212, 194588, 195526, 196597, 197693, 199100, 200594, 201527, 202016, 203028, 204934, 206947, 208379, 209529, 210826, 212034, 212964, 214172, 216187, 218603, 220694, 222414, 224084, 225595, 226684, 227719, 229415, 231852, 234361, 236381, 237989, 239599, 241432, 243301, 244830, 246069, 247801, 250775, 254564, 257825, 259903, 261502, 263437, 265470, 266961, 268041, 269366, 271186, 273383, 276146, 279800, 284129]
57350B84129M453M492M876N195M824L876K987K542K421K268J809J176R82J650
57336C27680K717L347L503L813M281M039K770J477J264K059L035L738M139M136
57322C71998L775L579M008M768N171N077M885M789M549M058L650L684M131M725
57308D32847N309N878O353O497O173N571N073M899N040N534O434P381P710P255
57294E17954O723O768P184P434P609Q148Q897R251R125R017R183R481J0050J1215
57280F38039J2662J3620J4022J4685J6029J7477J8498J9391K0570K1801K2712
57269H29506K3378K3906K3996K3557K3133K3133K3124K2528K1542K0745K0192
57258A078740J9623J9185J9208J9509J9650J9730K0235K1186K2040K2384K2190
$$ y = [284129, 288582, 293074, 297950, 303145, 307969, 311845, 314832, 317374, 319795, 322063, 323872, 325048, 326030, 327680, 330397, 333744, 337247, 341060, 345341, 349380, 352150, 353627, 354891, 356950, 359985, 363723, 367862, 371998, 375773, 379352, 383360, 388128, 393299, 398376, 403261, 408050, 412599, 416657, 420307, 423991, 428122, 432847, 438156, 444034, 450387, 456884, 463057, 468628, 473701, 478600, 483640, 489174, 495608, 502989, 510699, 517954, 524677, 531445, 538629, 546063, 553672, 561820, 570717, 579968, 589093, 598110, 607293, 616774, 626824, 638039, 650701, 664321, 678343, 693028, 709057, 726534, 745032, 764423, 784993, 806794, 829506, 852884, 876790, 900786, 924343, 947476, 970609, 993733, 1016261, 1037803, 1058548, 1078740, 1098363, 1117548, 1136756, 1156265, 1175915, 1195645, 1215880, 1237066, 1259106, 1281490, 1303680]
57247A303680K1457K0320J9428J9538K0534K1478K1875K2257K3209K4377K5003
57236A543156K5096K5360K6070K6640K6494K5855K5302K4967K4646K4495K4982
57225A823063K6058K7053K7538K7832K8318K8844K9229K9883L1199L2758L3772
57214B145547L4083L4070L3887L3688L4211L6066L8465L9863M0047M0411M1842
57203B552180M3561M4690M5693M7276M8841M9316M8934M8967M9897N1031N1845
57192C082231N2661N3773N4784N5175N5013N4739N4586N4399N3915N3087N2177
57181C676540N1448N0818N0120M9668N0064N1164N1929N1657N0836N0222M9646
57170D234112M8455M6727M5196M4195M3466M2915M2763M2987M3251M3401M3537
$$ y = [1303680, 1325137, 1345457, 1364885, 1384423, 1404957, 1426435, 1448310, 1470567, 1493776, 1518153, 1543156, 1568252, 1593612, 1619682, 1646322, 1672816, 1698671, 1723973, 1748940, 1773586, 1798081, 1823063, 1849121, 1876174, 1903712, 1931544, 1959862, 1988706, 2017935, 2047818, 2079017, 2111775, 2145547, 2179630, 2213700, 2247587, 2281275, 2315486, 2351552, 2390017, 2429880, 2469927, 2510338, 2552180, 2595741, 2640431, 2686124, 2733400, 2782241, 2831557, 2880491, 2929458, 2979355, 3030386, 3082231, 3134892, 3188665, 3243449, 3298624, 3353637, 3408376, 3462962, 3517361, 3571276, 3624363, 3676540, 3727988, 3778806, 3828926, 3878594, 3928658, 3979822, 4031751, 4083408, 4134244, 4184466, 4234112, 4282567, 4329294, 4374490, 4418685, 4462151, 4505066, 4547829, 4590816, 4634067, 4677468, 4721005]
57159D721005M3683M3913M4691M6336M8240M9233M8745M6963M3977L9521L3710
57148E210017K7330K1207J5848J1739R252P985O810M966K780J110M96R53K164
57135E322657L726N595Q398J2885J8874K5219L0911L5792M0122M3936M7073M9397
57123E644585N0848N1520N1745N1816N1755N1802N2950N6378O2535P1434Q3601
57112F280969R9685J19170J40543J63016J87192K13917K43680K77636L18166L67868
57102H411842M28854N03586N95470P08397Q47049J018359J231269J493803J810821
57093A7049450K184389K613612L091750L604129M129932M644904N121846N532128
57085D7972140N850373O056180O127683O035356N748397N249734M543111L647997
$$ y = [4721005, 4764688, 4808601, 4853292, 4899628, 4947868, 4997101, 5045846, 5092809, 5136786, 5176307, 5210017, 5237347, 5258554, 5274402, 5286141, 5295393, 5303378, 5310188, 5315154, 5317934, 5319044, 5319540, 5320493, 5322657, 5326383, 5331978, 5340376, 5353261, 5372135, 5397354, 5428265, 5464057, 5504179, 5548115, 5595188, 5644585, 5695433, 5746953, 5798698, 5850514, 5902269, 5954071, 6007021, 6063399, 6125934, 6197368, 6280969, 6380654, 6499824, 6640367, 6803383, 6990575, 7204492, 7448172, 7725808, 8043974, 8411842, 8840696, 9344282, 9939752, 10648149, 11495198, 12513557, 13744826, 15238629, 17049450, 19233839, 21847451, 24939201, 28543330, 32673262, 37318166, 42440012, 47972140, 53822513, 59878693, 66006376, 72041732, 77790129, 83039863, 87582974, 91230971]
57077I1230971K596138J437405K41918r14846j974539k905558l695583m340670
57069H1675236m840720n198393n417616n504126n468604n327270n097990m797335
57061D0023182m442317m052554l648285l246682k860979k501447k174979j884179
57053A5211760j628658j407323j218554j058909r23506q08050p09807o26585n55843
57044F274525m95018m41975l94975l52753l14817k81218k51843k26149k03501
57035C312276j83462j65719j49961j35781j22646j10184r8541q8026p8285o8353
57025B111318n7610m6045l3409j8868j851J7602L9211O1238P7769P9215N8745
57014B287315J8958k8933p2571j04581j22990j29090j26185j18429j08863r8536
$$ y = [91230971, 93827109, 95264514, 95506432, 94591586, 92617047, 89711489, 86015906, 81675236, 76834516, 71636123, 66218507, 60714381, 55245777, 49918507, 44820517, 40023182, 35580865, 31528311, 27880026, 24633344, 21772365, 19270918, 17095939, 15211760, 13583102, 12175779, 10957225, 9898316, 8974810, 8166760, 7456953, 6830368, 6274525, 5779507, 5337532, 4942557, 4589804, 4274987, 3993769, 3741926, 3515777, 3312276, 3128814, 2963095, 2813134, 2677353, 2554707, 2444523, 2345982, 2257956, 2179671, 2111318, 2053708, 2007663, 1974254, 1955386, 1953535, 1971137, 2010348, 2071586, 2149355, 2228570, 2287315, 2306273, 2277340, 2204769, 2100188, 1977198, 1848108, 1721923, 1603494, 1494631, 1396095]
57004A396095q7842p7686o8821o1048n3913m7583m2326l7816l3614k9756k6219
56993H29471k2534j8597j5259j3180j1631r371o255l065rL495P459J0628J1437
56980G62589R182M198k586r942j6609k1710k4922k6304k6041k4334k1521j8234
56968E83766j5295j3099j1182q800n910l114o17K156N684R790J4164J8741K2987
56955E99271K5375K4201J8767R551j992j3424k1976k6253k7125k6345k4714k2232
56943E13104j9242j6339j3406r862n799j936J550N216R332J3590J8001K3147K9138
56930E46494L4928L8847L9244L4581K3940Q300r095k4235l4444l9248l9821l7921
56918E41570l4906l1330k7369k3451k0097j7345j4859j2659j1065r893q380o235
$$ y = [1396095, 1308253, 1230567, 1161746, 1100698, 1046785, 999202, 956876, 919060, 885446, 855690, 829471, 806937, 788340, 773081, 759901, 748270, 738899, 732644, 729579, 729570, 733065, 740524, 751152, 762589, 771771, 775969, 773383, 763441, 746832, 725122, 700200, 673896, 647855, 623521, 602000, 583766, 568471, 555372, 544190, 535390, 529480, 526366, 525749, 527905, 533589, 543379, 557543, 576284, 599271, 624646, 648847, 667614, 677165, 675173, 661749, 639773, 613520, 586395, 560050, 535336, 513104, 493862, 477523, 464117, 454255, 448456, 446520, 448070, 453286, 462618, 476208, 494209, 517356, 546494, 581422, 620269, 659513, 694094, 718034, 726334, 717239, 693004, 658560, 619312, 579491, 541570, 506664, 475334, 447965, 424514, 404417, 387072, 372213, 359554, 348489, 338596, 330216, 323981]
56906C23981m189l013k461j696n06M49N97K69M24J625L437M979N990P083Q826
56891C45795J0984J3161J5649J8938K2633K5715K7808K9125K8985K5538J7849
56880E82180P433k965j1709j8555k3222k4907k3503k0261j6697j3229r340m772
56868D20453j6M374Q579J3350J9225K6150L3785M1940N0522N9148O6558P0220
56856H14288O6696N3413L1076M306k0580l8938m9340n2728n0916m5832l9161l1970
56844F40314k4561j6850q740k06Q761J8247K8537M0095N3137O7336Q2084R6661
56832I84815J09379J16344J11937R1674N5718J0187l5041p0868r2789j01429j00187
56821A079740r2736q2152p0787n9754m8846l7700k6828j6913p593K191J2923K4462
$$ y = [323981, 319792, 316779, 314318, 312622, 312116, 312565, 313162, 313431, 313855, 315480, 318917, 323896, 329886, 336969, 345795, 356779, 369940, 385589, 404527, 427160, 452875, 480683, 509808, 538793, 564331, 582180, 589613, 586648, 574939, 556384, 533162, 508255, 484752, 464491, 447794, 434565, 425225, 420453, 420437, 424811, 433390, 446740, 465965, 492115, 525900, 567840, 618362, 677510, 744068, 814288, 880984, 934397, 965473, 969779, 949199, 910261, 860921, 808193, 757277, 711445, 672284, 640314, 615753, 598903, 590163, 589957, 598718, 616965, 645502, 685597, 738734, 806070, 888154, 984815, 1094194, 1210538, 1322475, 1414149, 1469867, 1480054, 1445013, 1374145, 1281356, 1179927, 1079740, 987004, 904852, 834065, 774311, 725465, 687765, 660937, 644024, 636431, 638622, 651545, 676007]
56809F76007L6897N0374O3992P5648Q2718Q2106P0362M5966J2281k2985n2270
56798A121096p1827q1443q2567p7621o9701o1157n2622m4004l5736k8263k1059
56787D95096j3313n229K313R059J5594K2415K9519L6412M1644M2612L6965K4481
56775G37568P277j1498k8633m1254m7779m8861m6711m3186l8955l4296k9743k5691
56763C48238k2122j9063j6767j5105j3253j0572p527n348m780n384o008n810m862
56750B11637l877l484l699m016l897l209k393k045k272k501k263j887j991k347
56736A71756k020p52N07Q43N48M56O52N08j55p02n10K65R36J100J013J222J795
56719A77462K140J820J371J702K796L654L654L270L158L242L096K647J981J070
$$ y = [676007, 712904, 763278, 827270, 902918, 985636, 1067742, 1138104, 1184070, 1196351, 1173366, 1121096, 1049269, 967826, 885259, 807638, 737937, 676780, 624158, 580154, 544418, 516155, 495096, 481783, 476554, 478867, 487926, 503520, 525935, 555454, 591866, 633510, 676122, 713087, 737568, 744845, 733347, 704714, 663460, 615681, 566820, 520109, 476923, 437968, 403672, 373929, 348238, 326116, 307053, 290286, 275181, 261928, 251356, 243829, 238481, 233701, 228317, 222309, 216499, 211637, 207760, 204276, 200577, 196561, 192664, 189455, 187062, 185017, 182745, 180244, 177981, 176094, 174103, 171756, 169736, 168984, 169491, 170334, 170882, 171338, 171990, 172498, 172343, 171641, 171131, 171396, 172332, 173432, 174445, 175667, 177462, 179602, 181422, 182793, 184495, 187291, 190945, 194599, 197869, 201027, 204269, 207365, 210012, 211993, 213063]
56705B13063J64j04M32J010R17L98Pl40r93j685j919j891k168k618k499j650q15
56688A99309p04j236j777j781j206n89n20q65q12l1P08N60k47q67j063j234j519
56671A86126j642j492j244q83k26O92J601K303K604K302J551R13O80N42L86O70
56655A94883J501K083J871J604K125K896K808K007J604J878K065J811J536J401
56641B22073J204J303K314L732M210L464K677K522K186Q91p29j670j986k311k675
56626B37205k700k492k501k804l175l601m115m337l751k451j228p91j033j081
56612B01145k39J062J516M60j157j811j154j66K24r2p70j369j322m43N00N04k74
56595A96614o64j08P19J102J144J124Q85M29L27R01J559J515P94N6k41j25J45
$$ y = [213063, 213227, 213123, 213555, 214565, 215482, 215880, 215887, 215547, 214554, 212869, 210950, 209059, 206891, 204273, 201774, 200124, 199309, 198605, 197369, 195592, 193811, 192605, 192016, 191496, 190631, 189819, 189788, 190496, 191056, 190809, 189942, 188879, 187645, 186126, 184484, 182992, 181748, 180865, 180639, 181331, 182932, 185235, 187839, 190141, 191692, 192605, 193285, 193827, 194213, 194883, 196384, 198467, 200338, 201942, 204067, 206963, 209771, 211778, 213382, 215260, 217325, 219136, 220672, 222073, 223277, 224580, 226894, 230626, 234836, 238300, 240977, 243499, 245685, 246576, 245847, 244177, 242191, 239880, 237205, 234505, 232013, 229512, 226708, 223533, 219932, 215817, 211480, 207729, 205278, 204050, 203259, 202226, 201145, 200906, 201968, 203484, 203944, 202787, 200976, 199822, 199656, 199880, 199788, 199018, 197649, 196327, 195884, 196384, 196888, 196614, 195950, 195842, 196561, 197663, 198807, 199931, 200816, 201245, 201572, 202473, 204032, 205547, 206341, 206397, 206156, 206031, 206176]
56578B06176K82J41j20k59l16m17k87N24J925L267M043M128L488K380J757K537
56562B29249M317N717O210O684P890R251R752R267Q303P072N506L930K973K869
56548C18990L151L077K313J291P87R72J144O94n7n44r67j796k726l089l108l542
56532C16590m237m264l557l124l422l738l550l321l463l643l535l284k859k040
56518B68553j364j820l142l722k913k039k305l004k887k201k056k630l219l483
56504B31768l508l100k110j098p81j116j608k056k334k036j118l85m52p26k28
56489B09112R66J896K065J822J634J603J540J100J18r15j177o22j32k51n05l44
56473B17910P0N53J416K613L209K530J212K73j29k98j69L12O47M99L23N36P50
$$ y = [206176, 206458, 206599, 206479, 206220, 205904, 205487, 205200, 205724, 207649, 210916, 214959, 219087, 222575, 224955, 226712, 229249, 233566, 239283, 245493, 252177, 260067, 269318, 279070, 288337, 296640, 303712, 309218, 313148, 316121, 318990, 322141, 325218, 327531, 328822, 329609, 330581, 331725, 332419, 332362, 331818, 330851, 329055, 326329, 323240, 320132, 316590, 312353, 308089, 304532, 301408, 297986, 294248, 290698, 287377, 283914, 280271, 276736, 273452, 270593, 268553, 267189, 265369, 262227, 258505, 255592, 253553, 251248, 248244, 245357, 243156, 241100, 238470, 235251, 231768, 228260, 225160, 223050, 221952, 221171, 220055, 218447, 216391, 214057, 212021, 210903, 210518, 210066, 209340, 209112, 210078, 211974, 214039, 215861, 217495, 219098, 220638, 221738, 221856, 220941, 219764, 219142, 219010, 218759, 218254, 217910, 217980, 218533, 219949, 222562, 225771, 228301, 229513, 229786, 229657, 229359, 229190, 229502, 230149, 230648, 230971, 231507, 232257]
56456B32257N98M91O77M66n68j422j032lL03r2j3Q42J503J318O87K26J45N10J209
56437B38102J719J590J093P51N56L12L12P95J120M79q02j576j360p15l09k72l27
56420B41468K4J083K265K331R48n97r60l40K75O37R70R35J24q14q38j6P24R72
56402B49191R58P03J66j43J67M47l5o78l76N37O83j19n06L51J648K306K319K295
56384B59914K511K802K873K478J744J200J158J285J280J417J848J957J234K49
56370B83950j31Q2M48J070K015K475J736N15JJ02m7k96J84J106J258M62k04j49
56352B94577Q2R0J88N10P36Q45J131J401J200P56O62P85N88L35P52J619J976J682
56334C09915J466J526J352R49R03J179J091N33R0n1r1K94J495K735K767J782J193
$$ y = [232257, 232855, 233346, 234023, 234489, 233921, 232499, 231467, 231464, 231767, 231675, 231662, 232504, 234007, 235325, 236012, 236238, 236383, 236893, 238102, 239821, 241411, 242504, 243255, 243811, 244123, 244435, 245230, 246350, 246829, 246027, 244451, 243091, 242376, 242067, 241795, 241468, 241492, 242575, 244840, 247171, 248119, 247522, 246562, 246222, 246497, 247134, 248104, 249039, 249163, 248349, 247511, 247495, 248219, 249191, 250149, 250852, 251018, 250875, 251042, 251489, 251454, 250776, 250400, 250937, 251620, 251501, 250995, 251346, 252994, 255300, 257619, 259914, 262425, 265227, 268100, 270578, 272322, 273522, 274680, 275965, 277245, 278662, 280510, 282467, 283701, 283950, 283819, 283901, 284349, 285419, 287434, 289909, 291645, 292160, 292161, 292263, 292216, 291920, 292104, 293210, 294468, 294930, 294726, 294577, 294659, 294749, 294937, 295447, 296183, 297028, 298159, 299560, 300760, 301516, 302178, 302963, 303551, 303886, 304638, 306257, 308233, 309915, 311381, 312907, 314259, 315208, 316111, 317290, 318381, 318914, 319004, 318953, 318862, 319156, 320651, 323386, 326153, 327935, 329128]
56317C29128J400J384O53L9K00P16J039J182J152R14J005K002L292L667L206L185
56301C54164M016M805N050N261N573N280M212L148K482J801J194J492K726L674
56287D04878L565L021K844L079L649M691N766N904M969L970L680L901M295M794
56273D63006N096M863M649N401O920Q051Q480Q962R792J0444J0930J2001J3769
56260E72364J5529J7149J9209K1609K3659K5678K8962L3794L9052M3979M8823
56249H89807N3574N7792O1977O7280P3534P9254Q3812Q7830R1184R2646R1873
56238A730563Q9709Q6062P9494O9555N7483M4071K8991J2866k352j5884k8840
56227B151718m1477n2081n9737o5869p1684p6122p7894p7649p6524p4379p0972
$$ y = [329128, 330528, 331912, 332565, 332604, 332804, 333520, 334559, 335741, 336893, 337807, 338812, 340814, 344106, 347773, 350979, 354164, 358180, 362985, 368035, 373296, 378869, 384149, 388361, 391509, 393991, 395792, 396986, 398478, 401204, 404878, 408443, 411464, 414308, 417387, 421036, 425727, 431493, 437397, 442366, 446336, 450016, 453917, 458212, 463006, 468102, 472965, 477614, 483015, 489935, 497986, 506466, 515428, 525220, 535664, 546594, 558595, 572364, 587893, 605042, 624251, 645860, 669519, 695197, 724159, 757953, 797005, 840984, 889807, 943381, 1001173, 1063150, 1130430, 1203964, 1283218, 1367030, 1454860, 1546044, 1638690, 1730563, 1820272, 1906334, 1985828, 2055383, 2112866, 2156937, 2185928, 2198794, 2196442, 2180558, 2151718, 2110241, 2058160, 1998423, 1932554, 1860870, 1784748, 1706854, 1629205, 1552681, 1478302, 1407330]
56216A407330o7312o4252o1111n7125n2884m9095m5407m1644l8646l6626l4266
56205H58962l0790k7346k5049k3185k0736j8167j6223j4456j2464j1092j0862
56194F48592j0526q795o326m534l565k834k453k631k706k074j246q65o61k94j48
56179E98934l64k95K41M43L1j09M56R44R91J337K156K475K128K426L889N256N730
56162F26669O170P061P393O820O705P719Q533Q366Q592J0258J2175J3098J3720
56149G43279J4892J6009J6826J8644K1971K5235K7655L1045L6841M3750N0459
56138A046606N8318O9086Q2136R6299J12029J29191J44742J55231J59713J57932
56128B211283J48240J30517J09188R0112P5686O5484N9437N6863N3920M5817L1434
$$ y = [1407330, 1340018, 1275766, 1214655, 1157530, 1104646, 1055551, 1010144, 968500, 929854, 893228, 858962, 828172, 800826, 775777, 752592, 731856, 713689, 697466, 683010, 670546, 659454, 648592, 638066, 629271, 622945, 618411, 614846, 612012, 609559, 606928, 604222, 602148, 600902, 600037, 599376, 599082, 598934, 598570, 598275, 598516, 598959, 598990, 598881, 599337, 600281, 601272, 602609, 604765, 607240, 609368, 611794, 615683, 620939, 626669, 632839, 639900, 647293, 654113, 660818, 668537, 677070, 685436, 694028, 704286, 716461, 729559, 743279, 758171, 774180, 791006, 809650, 831621, 856856, 884511, 915556, 952397, 996147, 1046606, 1104924, 1174010, 1256146, 1352445, 1464474, 1593665, 1738407, 1893638, 2053351, 2211283, 2359523, 2490040, 2599228, 2689340, 2765026, 2830510, 2889947, 2946810, 3000730, 3046547, 3077981]
56117C077981J3513m640k0340l0986l5693l7183l9915m6829n9024p6697r8080
56106B642107j18879j34997j44854j47921j43413j32384j18601j04949r1080p6636
56096A428393o3863n4324m5957l6679k8283k3229k0125j6128j1594q492o349l618
56084A109752j270r76j459n23R74J019O36K166M937O633P525R400J1684J2600
56070A163098J2844J4228J6005J6343J6000J6758J7703J6990J5591J5377J5225
56059A336162J3186J0714J0341J0966R976Q352Q888J0932J1724J1602J2941J5241
56047A471025J6139J6127J7500J9761K0809K1299K3157K5214K5200K4450K5613
56036A706294K7480K7348K6723K8973L3068L5445L6518L9286M2980M4337M3940
$$ y = [3077981, 3091494, 3086854, 3066514, 3035528, 2999835, 2962652, 2922737, 2875908, 2816884, 2740187, 2642107, 2523228, 2388231, 2243377, 2095456, 1952043, 1819659, 1701058, 1596109, 1505029, 1428393, 1364530, 1310206, 1264249, 1227570, 1199287, 1176058, 1155933, 1139805, 1128211, 1119719, 1113370, 1109752, 1108482, 1107506, 1106047, 1105524, 1106498, 1107517, 1108153, 1110319, 1115256, 1121889, 1129414, 1138814, 1150498, 1163098, 1175942, 1190170, 1206175, 1222518, 1238518, 1255276, 1272979, 1289969, 1305560, 1320937, 1336162, 1349348, 1360062, 1370403, 1381369, 1391345, 1399697, 1408585, 1419517, 1431241, 1442843, 1455784, 1471025, 1487164, 1503291, 1520791, 1540552, 1561361, 1582660, 1605817, 1631031, 1656231, 1680681, 1706294, 1733774, 1761122, 1787845, 1816818, 1849886, 1885331, 1921849, 1961135, 2004115, 2048452, 2092392]
56025B092392M4984M6993M7038M6018M7250N0005N0943N0859N3332N7799O0772
56014B648385O2714O6832P2111P4736P5347P7738Q1616Q3914Q5861R1029R7812
56003C518095J01824J04358J10211J18649J25143J30484J38973J49160J55932
55994D652829J60617J69045J80802J90602J99068K11529K27177K40447K52257
55985F484373K68572K88889L07795L26652L51498L80883M08791M37963M76408
55976I731824N22398N67798O14621O72402P41004Q13135Q92168R89129J103769
55967A6648248J228604J369962J543613J751776J988849K268519K619069L054175
55959C2472815L579124M226030N050874O098055P407488R055608J1139709J3712350
$$ y = [2092392, 2137376, 2184369, 2231407, 2277425, 2324675, 2374680, 2425623, 2476482, 2529814, 2587613, 2648385, 2711099, 2777931, 2850042, 2924778, 3000125, 3077863, 3159479, 3243393, 3329254, 3420283, 3518095, 3619919, 3724277, 3834488, 3953137, 4078280, 4208764, 4347737, 4496897, 4652829, 4813446, 4982491, 5163293, 5353895, 5552963, 5764492, 5991669, 6232116, 6484373, 6752945, 7041834, 7349629, 7676281, 8027779, 8408662, 8817453, 9255416, 9731824, 10254222, 10822020, 11436641, 12109043, 12850047, 13663182, 14555350, 15544479, 16648248, 17876852, 19246814, 20790427, 22542203, 24531052, 26799571, 29418640, 32472815, 36051939, 40277969, 45328843, 51426898, 58834386, 67889994, 79029703, 92742053]
55951I2742053J6777758K0356473K4491166K9163860L4216534L9224199M3175180
55944C00147223M4209691M0087787K9568203J3714499m191741k0254072l1781634
55937C71499956l8020807l9705119l8212549l4941719l0982246k6992485k3264967
55930A39380064j9899582j6928483j4343842j2109407j0194019q578917p231562
55923E0094252o102664n155017m370422l725841l187923k734780k360445k054145
55915B0403015j795567j573295j388299j236085j103211r83953q83114p99770
55907A0639721p24121o52769n91519n40782m92916m46286m07520l77253l47406
55898F059149l15372k87829k67485k48452k27880k10393j97729j84888j69823
$$ y = [92742053, 109519811, 129876284, 154367450, 183531310, 217747844, 256972043, 300147223, 344356914, 384444701, 414012904, 427727403, 423535662, 403281590, 371499956, 333479149, 293774030, 255561481, 220619762, 189637516, 162645031, 139380064, 119480482, 102551999, 88208157, 76098750, 65904731, 57325814, 50094252, 43991588, 38836571, 34466149, 30740308, 27552385, 24817605, 22457160, 20403015, 18607448, 17034153, 15645854, 14409769, 13306558, 12322605, 11439491, 10639721, 9915600, 9262831, 8671312, 8130530, 7637614, 7191328, 6783808, 6406555, 6059149, 5743777, 5455948, 5188463, 4940011, 4712131, 4501738, 4304009, 4119121, 3949298]
55889C949298j56791j47159j36446j23151j11277j01745r0337p6297o4134n4647
55879B887314m2927k7406j2570o95J0614K0411K2223J2674m798k6575n1830p7220
55867B709215r6372j07236j13320j16133j13326j05665r8328r3224q7001p8535
55857A700075p1331o6622o1143n3958m8652m6382m3524l8625l5193l4981l4817
55846A164847l2634l0699l0259k8898k5759k3714k3824k3188k0650j9083j9608
55835H86531j9139j6270j4141j4694j5335j4039j2717j2844j2606j0966r915j0211
55823G23654r651p873p870j0359j1708j0067q504r162r441p240n026n089n236
55810F16428k962J01J606K637M884P095P876Q792J1325J3599J3314J1233Q903
$$ y = [3949298, 3792507, 3645348, 3508902, 3385751, 3274474, 3172729, 3082392, 3006095, 2941961, 2887314, 2844387, 2816981, 2804411, 2803716, 2814330, 2834741, 2856964, 2869638, 2864840, 2838265, 2786435, 2709215, 2612843, 2505607, 2392287, 2276154, 2162828, 2057163, 1958835, 1865611, 1778610, 1700075, 1628744, 1562122, 1500979, 1447021, 1398369, 1351987, 1308463, 1269838, 1234645, 1199664, 1164847, 1132213, 1101514, 1071255, 1042357, 1016598, 992884, 969060, 945872, 925222, 906139, 886531, 867392, 851122, 836981, 822287, 806952, 792913, 780196, 767352, 754746, 743780, 733865, 723654, 714003, 706130, 698260, 687901, 676193, 666126, 657622, 648460, 639019, 631779, 626753, 621664, 616428, 613466, 613567, 615173, 617810, 622694, 629789, 637665, 646457, 657782, 671381, 684695, 695928, 704831]
55797G04831N700R45l856p512j1198j5525j8408j8406j7362j7175j6725j4561
55785E70748j1840j0004q132n303l095l206m718o009p103q025p391m754j929J06
55771D89345L036P968J2965J5803J6393J4466Q167k358j2807j9125k1717k2821
55759D89315k2448j9887j6672j4727j3390j1168q787p717p371o484n681o067o724
55746C42192o122m772m112m035l668l280l345l016j534N4M26m9m49r79j948k575
55730C02788k382k230k590k553j883j980l313m115l385k810l717m528l508j873
55716B61921j565j857q69J103K364K714L134L714L970M182M507L979K140L62k44
55701B89555o74k109l798m686n529p266q860q860p705o576n353l647k270j787
$$ y = [704831, 710531, 711476, 707620, 700108, 688910, 673385, 654977, 636571, 619209, 602034, 585309, 570748, 558908, 548904, 540772, 535469, 532374, 529168, 524450, 518441, 511338, 503313, 495922, 491168, 489239, 489345, 492381, 500349, 513314, 529117, 545510, 559976, 568143, 565785, 552978, 533853, 512136, 489315, 466867, 446980, 430308, 415581, 402191, 391023, 382236, 374519, 367148, 360664, 354983, 348916, 342192, 336070, 331298, 327186, 323151, 319483, 316203, 312858, 309842, 308308, 308362, 308788, 308739, 308290, 307311, 305363, 302788, 300406, 298176, 295586, 293033, 291150, 289170, 285857, 281742, 278357, 275547, 271830, 267302, 263794, 261921, 260356, 258499, 257630, 258733, 261097, 263811, 266945, 270659, 274629, 278811, 283318, 287297, 289437, 289799, 289555, 288881, 286772, 282974, 278288, 272759, 265493, 256633, 247773, 240068, 233492, 228139, 224492, 222222, 220435]
55687B20435j178J53Q32K2m56J154L490M272L827L754L708K445P74M33R76N81
55671B45222p56j539j593j965k568k361j453p14J31J788L367L417K476K342L268
55656B49062M089M644N811P403Q115P495O105M066J225j648l635n239p379r386
55642B70728r796q776p825p516p244o845o676o450n682m881m727m618l666k511
55628A83515k361k792k432j374r42j363j517r57m81p39j582k604l214k643j032
55613A57482Q6l16j251j305p94p95j149j086r03j223j503j039n48q98j282o53
55597A42823Q7m46j460j206m8K34m01m90%l04j346j523n49J13k1K50J316J857
55579A38886J143K09M7K79K86K06K93N30J121K140K745K165J278J630K941L379
$$ y = [220435, 219257, 219410, 220242, 220264, 219808, 220962, 224452, 228724, 232551, 236305, 240013, 242458, 243232, 243665, 244641, 245222, 244466, 242927, 241334, 239369, 236801, 234440, 232987, 232273, 232404, 234192, 237559, 240976, 243452, 245794, 249062, 253151, 257795, 263606, 271009, 279124, 286619, 292724, 296790, 298015, 296367, 292732, 287493, 280114, 270728, 260932, 252156, 244331, 236815, 229571, 222726, 216050, 209600, 203918, 199037, 194310, 189692, 186026, 183515, 181154, 178362, 175930, 174556, 173614, 172251, 170734, 169777, 169296, 168557, 166975, 164371, 161157, 158514, 157482, 157568, 157252, 156001, 154696, 153902, 153107, 151958, 150872, 149969, 148746, 147243, 146204, 145656, 144758, 143476, 142823, 142910, 142464, 141004, 139798, 139750, 139984, 139583, 139093, 139093, 138789, 137443, 135920, 135371, 135484, 135463, 135713, 137029, 138886, 140029, 140238, 140285, 140564, 140850, 141056, 141349, 141879, 143000, 145140, 147885, 150050, 151328, 152958, 155899, 159278]
55563A59278K323J109P44O16j05j216k121k590k626k488k781l544l704k648j626
55548A38621k053l022k437k06J706K229K133K024J566Q59P28J178J338J113J201
55533A46978J344M78j109j717q38J1k99r98r98m83j89l40q88j708k177j663o85
55516A34719l21m31J56J572K530K283J447O37j97p65l78N68N83q76k651l622l906
55499A31348l883l393k465j638j080l81M04O33K48p9j36k97l80K37J197J308L72
55482A22015n11p41q58j089p88K20J095J311J250J119O44Q0J40O02M74j74j70
55465A24619N33M30j048k375k164j044k84L8M21O73M08r8m75q58j250j154n26
55448A15846j53l97n44m1N77O36K97m3m02o77l85M61J013P46J86k7K3M1J12K79
$$ y = [159278, 161601, 162710, 163454, 164070, 163965, 162749, 160628, 158038, 155412, 152924, 150143, 146599, 142895, 140247, 138621, 136568, 133546, 131109, 130903, 132609, 134838, 136971, 138995, 140561, 141420, 142148, 143326, 144664, 145777, 146978, 148322, 148800, 147691, 145974, 145136, 145147, 144848, 143850, 142852, 142369, 142180, 141840, 140952, 139244, 137067, 135404, 134719, 134398, 133967, 134123, 135695, 138225, 140508, 141955, 142592, 142395, 141630, 141252, 141820, 142403, 141527, 138876, 135254, 131348, 127465, 124072, 121607, 119969, 118889, 118508, 118912, 119545, 119793, 119714, 119578, 119281, 118901, 119138, 120335, 121643, 122015, 121504, 120763, 119905, 118816, 118028, 118248, 119343, 120654, 121904, 123023, 123667, 123747, 123887, 124489, 124963, 124789, 124619, 125152, 125582, 124534, 122159, 119995, 118951, 118667, 118705, 119126, 119799, 120207, 120109, 119634, 118776, 117526, 116372, 115846, 115693, 115296, 114752, 114711, 115288, 115924, 116221, 116178, 115776, 115099, 114714, 115175, 116188, 116934, 117120, 117093, 117116, 117157, 117269, 117548]
55428A17548L13K33L67O06N24L11O33J363J594J116P47R46J252J393J731K237
55412A32914K207J463O93L04jk12L8K84n13k117k901k161j090q47j103j224j399
55395A24335j722j540o66m2k58n67k93pl96j029j144p34l8R54J790J510J55q77
55377A19431q08o22j275k066j903j061m90l09j41l1K1N93J792K553K048J037O84
55360A19453Q81Q42N82O41R03Q36M16r2p50j495j693j001j35N0l18o49q39r22
55342A16710n48L46R84P21m4o29j001j221q27K83J167R73J52l97o54j021j265
55325A13729r58m37k55j89L06J045J378J156P19L56K79O92J264J262O47L10O47
55308A21951Q38J97p34j188j301j339q73K14Q98L92n23o95l26k54k89K97J257
$$ y = [117548, 117861, 118094, 118461, 119067, 119591, 119902, 120535, 121898, 123492, 124608, 125355, 126301, 127553, 128946, 130677, 132914, 135121, 136584, 137277, 137581, 137580, 137368, 137406, 137690, 137177, 135060, 132159, 129998, 128908, 128061, 126958, 125734, 124335, 122613, 121073, 120407, 120365, 120107, 119540, 119247, 119240, 118844, 117815, 116671, 115937, 115899, 116853, 118643, 120153, 120308, 119431, 118623, 118001, 116726, 114660, 112757, 111696, 111206, 110897, 110756, 110725, 110746, 111339, 113131, 115684, 117732, 118769, 119453, 120334, 121176, 121758, 122399, 123302, 124138, 124554, 124462, 123712, 122217, 120524, 119523, 119388, 119438, 119120, 118471, 117632, 116710, 116162, 116508, 117492, 118213, 118169, 117540, 116539, 115318, 114491, 114774, 115941, 116914, 117066, 116669, 116015, 114994, 113729, 112771, 112334, 112079, 111890, 112196, 113241, 114619, 115775, 116494, 116850, 117129, 117821, 119085, 120347, 120994, 121304, 121951, 122789, 122986, 122252, 121064, 119763, 118424, 117551, 117765, 118663, 119055, 118532, 117837, 117511, 117257, 116968, 117265, 118522]
55291A18522J687J512J328J197P48K04R7K49J13j47M2N29O79M61L13K13j86o85
55273A26876p65m79k61j50N7J49j29m16k42J40K03N5N7P6j15j73J68L18k66r05
55253A24198n49N55J188Q99L30m7l68o34m81P9M71K57m58j204j410p55L20Q62
55235A23253N14j38n96j033j428j167k07L55j81r81j057p41o65l59O29J274L95
55218A17867j195j654p95l7L2K19Q76J259R69O05O68R35J149J307J211P48N22
55201A24686J110J828J508L60k34J73N52R6p90j511k036k315j999j230p24p79
55185A18695r33q22n38o5P35J460J438Q29N12P29P87K91k73m43l67j84K98R89
55167A23138J361J259J174J419J649J427P95P0l87k21N18J076P46j30o06m92n15
$$ y = [118522, 120209, 121721, 123049, 124246, 124994, 125198, 125295, 125544, 125657, 125510, 125552, 126081, 126760, 127221, 127534, 127747, 127561, 126876, 126111, 125632, 125371, 125221, 125278, 125427, 125298, 124882, 124640, 124780, 124983, 125038, 125095, 125171, 125056, 124883, 125051, 125369, 125103, 124198, 123649, 124204, 125392, 126291, 126621, 126574, 126206, 125572, 125091, 125170, 125641, 125898, 125440, 124236, 122826, 122071, 122391, 123253, 123767, 123629, 123033, 122000, 120572, 119405, 119198, 119553, 119372, 118391, 117334, 116593, 115928, 115569, 116198, 117472, 117867, 116672, 115018, 114223, 114186, 114218, 114437, 115313, 116572, 117541, 118146, 118814, 119749, 120898, 122205, 123416, 124164, 124686, 125796, 127624, 129132, 129492, 129258, 129431, 129983, 130079, 129289, 127778, 125742, 123427, 121428, 120198, 119474, 118695, 117762, 116940, 116402, 116337, 117072, 118532, 119970, 120799, 121311, 122040, 122827, 123118, 122845, 122402, 122035, 121851, 122149, 123138, 124499, 125758, 126932, 128351, 130000, 131427, 132222, 132292, 131905, 131684, 132202, 133278, 134024, 133894, 133288, 132796, 132281]
55150A32281j067j622j548q20J13O78M44l59p62j45P37O42m58j384j354p34k09
55133A24433n7k35m33j03Q65J631J331L13m05n75o67o33L2J104J653J413J031
55116A30698Q95P09L73K48L83M29L81N53P38M13k06l25J04K70j54o06p04o70n42
55097A32987QP92J071O76K57K82O04J180K087K795K470J211m4q75j547j819j059
55080A41076K16M71o97j895k003j470r57j17J235K073J460P9o95n42j57l9j86
55063A37852n05p17l80M00Q06M20o2J50Q09J128Q88M38n0o72j470k301k823k506
55045A31405j210K15O63K05n9L11O15M77N18J029J193M48m09m49l0J3j97rM45
55026A35174N61M32O86J260J337N29n50r90m90M41R23N49j48l22J8J18k14k18
$$ y = [132281, 131214, 129592, 128044, 127224, 127337, 128015, 128459, 128100, 127338, 127193, 127930, 128572, 128114, 126730, 125376, 124642, 124433, 124376, 124141, 123708, 123605, 124470, 126101, 127432, 127745, 127340, 126765, 126098, 125465, 125497, 126601, 128254, 129667, 130698, 131593, 132302, 132675, 132923, 133306, 133735, 134116, 134669, 135407, 135820, 135614, 135289, 135393, 135663, 135509, 134903, 134199, 133529, 132987, 132995, 133787, 134858, 135534, 135791, 136073, 136677, 137857, 139944, 142739, 145209, 146420, 146376, 145501, 143954, 142135, 141076, 141292, 141763, 141066, 139171, 137168, 135698, 134741, 134624, 135859, 137932, 139392, 139471, 138776, 138234, 138077, 138038, 137852, 137347, 136630, 136250, 136650, 137456, 137876, 137814, 137964, 138773, 139901, 140789, 141227, 141177, 140505, 139035, 136734, 133911, 131405, 130195, 130410, 131073, 131278, 131219, 131530, 132145, 132622, 133140, 134169, 135362, 135810, 135401, 134952, 134922, 134935, 134738, 134729, 135174, 135735, 136167, 136853, 138113, 139450, 139979, 139429, 138439, 137949, 138390, 139313, 139862, 139714, 139392, 139410, 139528, 139314, 139096]
55008A39096N01J205J067L22k60m53m93m24j43K58O11Q00N15m67j466j240L36
54991A39765J753J640L56q46j436j519r58L89J825K307J627N01l60p07n72k06
54975A43559k2j07m7M39J055J450J684J857J839J702J803J979J506L26n55n00
54959A57968j96l78n49j8O70O57M04Q89J674J349j71j312j094k89K4o9N6M43P79
54940A60837J053J347J404R89M26L16Q16J514J971K149K323K725L377M253N377
54925A90877O656P714Q287Q655R187R549Q896P016M639K329j59k989n479o898
54911B48280p503p973q305q028p268o655o308n719m701l758l357l299l110k671
54897A69625k265k045j728r12K26Q61N72K07R68K684L916M001L904M554N409N643
$$ y = [139096, 139597, 140802, 141869, 142191, 141931, 141478, 140985, 140561, 140418, 140676, 141287, 142087, 142602, 142135, 140669, 139429, 139765, 141518, 143158, 143514, 142668, 141232, 139713, 138755, 139144, 140969, 143276, 144903, 145404, 145044, 144337, 143765, 143559, 143537, 143430, 143383, 143822, 144877, 146327, 148011, 149868, 151707, 153409, 155212, 157191, 158697, 159023, 158468, 157968, 157772, 157394, 156845, 156827, 157497, 158154, 158558, 159447, 161121, 162470, 162299, 160987, 159893, 159604, 159628, 159559, 159615, 160058, 160837, 161890, 163237, 164641, 165630, 166056, 166372, 167188, 168702, 170673, 172822, 175145, 177870, 181247, 185500, 190877, 197533, 205247, 213534, 222189, 231376, 240925, 249821, 256837, 261476, 263805, 263646, 260657, 255178, 248280, 240777, 232804, 224499, 216471, 209203, 202548, 196240, 190521, 185820, 182062, 178705, 175406, 172296, 169625, 167360, 165315, 163587, 162675, 162901, 163762, 164334, 164541, 165509, 168193, 172109, 176110, 180014, 184568, 189977, 195620]
54881A95620N774O895Q773J0002R858Q836P399N354K683Nk202m119o045p732q629
54866B32472q482p578o616o226o317o002m668k946k119k567l376l542l034k479
54852A66520k261k239k121j848j607j546j509j229p44m11m07m91m45l79l96k89
54836A48598R0M14K27m68j250j724j721j251n15K18Q24J256J270O56k00n32j71
54819A45721K10N4m29q19r92q67l46J75L4n17k78J163K554K644J863J373J259
54802A52802Q75L51M53J179J677J457P04l42j373j641p86K01Jj037j269j38J107
54785A54221J403J248J501J937J872J444J369J868K521K983L328L768M425N265
54771A89153O104O808P543Q567R683J0246R783Q399O420L971J074j999m680o438
$$ y = [195620, 201394, 208289, 217062, 227064, 236922, 245758, 253157, 258511, 261194, 261199, 258997, 254878, 248833, 241101, 232472, 223990, 216412, 209796, 203570, 197253, 191251, 186583, 183637, 181518, 178951, 175575, 172033, 168999, 166520, 164259, 162020, 159899, 158051, 156444, 154898, 153389, 152160, 151416, 151005, 150598, 150107, 149662, 149283, 148887, 148598, 148688, 149102, 149329, 148861, 147611, 145887, 144166, 142915, 142400, 142618, 143442, 144698, 145968, 146624, 146424, 145892, 145721, 145931, 145985, 145556, 144737, 143745, 142878, 142532, 142707, 142741, 142224, 141946, 143109, 145663, 148307, 150170, 151543, 152802, 153677, 154028, 154481, 155660, 157337, 158794, 159498, 159156, 157783, 156142, 155356, 155557, 155558, 154521, 153252, 153114, 154221, 155624, 156872, 158373, 160310, 162182, 163626, 164995, 166863, 169384, 172367, 175695, 179463, 183888, 189153, 195257, 202065, 209608, 218175, 227858, 238104, 247887, 256286, 262706, 266677, 267751, 265752, 261072, 254634]
54757B54634p163p249p130o828o171n453n295n644n559m407k780j724j544j941
54743A85746k667l343l190j922m91M3O9P80K148K894K481J938K259L133L835M423
54727A98136N384O643P684Q235Q333P979P098N694L787J438j037l207m965o526
54713B44676p798q284p842p111o852p046o979o100m574l070k121j723j511j228
54699A72437r46q19q67j046j241j185p42l16m49q65o45L57J090Q06J18j39k47
54682A65301q00j361j159n72n40q53n18L86P15K13j47j7l21j449k265j816q47
54665A53950o36j168j433r75k18L31M78K46n6L0M98P40L92p3J6P32J633K227K049
54646A58763R19n45j222p57oJ34k15m70n11m85k39L64R27R88P08N14L73L2l03
$$ y = [254634, 247471, 240222, 233092, 226264, 220093, 214640, 209345, 203701, 198142, 193735, 190955, 189231, 187687, 185746, 183079, 179736, 176546, 174624, 174133, 174176, 174245, 175025, 177173, 180067, 182548, 184486, 186745, 189878, 193713, 198136, 203520, 210163, 217847, 226082, 234415, 242394, 249492, 255186, 258973, 260411, 259374, 256167, 251202, 244676, 236878, 228594, 220752, 213641, 206789, 199743, 192764, 186664, 182090, 179020, 176899, 175176, 173665, 172437, 171491, 170672, 169805, 168759, 167518, 166333, 165591, 165275, 164826, 163961, 163316, 163673, 164763, 165569, 165687, 165548, 165301, 164501, 163140, 161981, 161409, 160869, 160016, 159498, 159884, 160599, 160812, 160665, 160648, 160327, 158878, 156613, 154797, 153950, 153314, 152146, 150713, 149738, 149520, 149851, 150329, 150575, 150519, 150549, 151047, 151787, 152179, 152106, 152122, 152854, 154487, 156714, 158763, 159682, 159137, 157915, 157158, 157152, 157286, 157071, 156601, 156090, 155605, 155366, 155730, 156657, 157645, 158353, 158867, 159240, 159272, 158969]
54627A58969j87K97N49K52k76n47l93n6J5l96r06q38q1O76Q11N15L39M55P16J081
54607A60995J459J426O92l26q40n61J47P41Q11J81q31j433j134l47J95L72M89
54590A62036M68j3n86l44Q63J971K013J208L53l70j232j993j930q72M83J412J781
54573A65248J678J055J07n32m89j95j67q3O85J827K227J419J61o80j052j227j116
54556A68866n92J9L66O01R70J276J204Q53M78R0k25m0P71J559J708J513J598J875
54538A82890J899J809K022K186J549K73o35p53o70q14p98k86L11M28j1p81j672
54521A86947k295k227j556q84n47l04K3J77o3m86p69p60l79L54J099J404J196
54504A80930O80j12j104j692j224KR81J243J134R28M89m9k48k33o43j374j319
$$ y = [158969, 158782, 159079, 159628, 159880, 159604, 159057, 158664, 158608, 158623, 158227, 157321, 156483, 156402, 157078, 157889, 158404, 158743, 159198, 159914, 160995, 162454, 163880, 164572, 164246, 163406, 162845, 162992, 163733, 164544, 164725, 163894, 162461, 161327, 160980, 161175, 161547, 162036, 162504, 162491, 161905, 161561, 162424, 164395, 166408, 167616, 167969, 167599, 166367, 164374, 162444, 161572, 162055, 163467, 165248, 166926, 167981, 168088, 167556, 167067, 166872, 166705, 166622, 167307, 169134, 171361, 172780, 172941, 172261, 171209, 169982, 168866, 168274, 168293, 168659, 169260, 170230, 171506, 172710, 173563, 174041, 174131, 173906, 173866, 174637, 176196, 177904, 179417, 181015, 182890, 184789, 186598, 188620, 190806, 192355, 192628, 191993, 191240, 190570, 189756, 188958, 188672, 188983, 189411, 189400, 188619, 186947, 184652, 182425, 180869, 179985, 179438, 179134, 179157, 179334, 179271, 178785, 178016, 177256, 176877, 177231, 178330, 179734, 180930, 181610, 181498, 180394, 178702, 177478, 177480, 178461, 179704, 180838, 181766, 182255, 182206, 181958, 181725, 181082, 179708, 178389]
54487A78389R1J873K542J704J35j063j111rJ290J718J352J210J662J954J630J386
54471A94753J857K525K546J981J375Q04O5o18q67p79o97o27m13q0L69J010J451
54454B04655Q81p54k213k310j321m50l32p03j130j425j542j589j720j727j170
54439A87150k04L57J56j94j82j95o08q86m26L45O51N92P74J112R71K83l41m38
54421A88917rQ04J632J851J244M02j16n36j135j369o40M81Q69L90n5O6M73Q55
54403A94124J182J295J015O42N84O50M35K14N47J182J341R76P61Q37O02o8m67
54386B05852k00J91Q7m55j094j667j960j737j226r64r14m59N24J271J195O74L62
54369A99480L29L61M93P26O36j21j080j316m40R96K038K107J401O76N43Q62R83
$$ y = [178389, 178480, 180353, 182895, 184599, 184734, 183671, 182560, 182551, 183841, 185559, 186911, 188121, 189783, 191737, 193367, 194753, 196610, 199135, 201681, 203662, 205037, 205841, 205906, 205288, 204421, 203642, 202945, 202318, 201905, 201825, 202194, 203204, 204655, 205536, 204782, 202569, 200259, 198938, 198488, 198156, 197453, 196323, 194898, 193356, 191767, 190047, 188320, 187150, 186946, 187303, 187459, 187265, 187083, 186888, 186280, 185394, 184968, 185313, 185964, 186556, 187330, 188442, 189413, 189696, 189355, 188917, 188908, 189712, 191344, 193195, 194439, 194841, 194725, 194189, 193054, 191685, 191045, 191526, 192395, 192785, 192730, 192796, 193269, 194124, 195306, 196601, 197616, 198258, 198842, 199492, 199927, 200141, 200688, 201870, 203211, 204187, 204948, 205785, 206387, 206319, 205852, 205652, 205843, 205930, 205475, 204381, 202714, 200754, 199017, 197791, 196827, 195913, 195454, 195978, 197249, 198444, 199118, 199480, 199809, 200170, 200663, 201389, 202025, 201904, 200824, 199508, 199068, 200064, 202102, 204209, 205610, 206286, 206829, 207691, 208674]
54352B08674N67o2m13m10l21l61m57k90M28J510K222J903P33m11q44o47l81m65
54334B10975r22j512j970k157k071j747j373j295j604j736j024K27Q42K91n42
54319A94382o07q9J24j05j51K37O78R07R77P22q4j012j212o00p1l17j025j496
54301A91258j538j387j118o26N2O09O87K13m23o73m71k93l65k24N59J514J738
54284A89512R82j79j067j274o72L39Q06K08p89j150q10l85K9P79J529J475P00
54267A90033K10L52L37k90p98m69L00Q00J059J421J682J506J161J101J158Q75
54251B00438L68J72L21K74k99j055j389j000o1R36J454J252M47n99j437j687j392
54234A96743j105j283j673j665j190p17m34j20J84O9m55p38l73K98Q61J346J716
$$ y = [208674, 209241, 209179, 208766, 208356, 208035, 207674, 207217, 206927, 207355, 208865, 211087, 212990, 213723, 213312, 212468, 211821, 211440, 210975, 210053, 208541, 206571, 204414, 202343, 200596, 199223, 197928, 196324, 194588, 193564, 193791, 194633, 194924, 194382, 193775, 193686, 193810, 193705, 193554, 193791, 194469, 195376, 196353, 197075, 196991, 195979, 194767, 194167, 194096, 193779, 192754, 191258, 189720, 188333, 187215, 186589, 186641, 187250, 187937, 188150, 187727, 187054, 186583, 186290, 185925, 185701, 186260, 187774, 189512, 190494, 190315, 189248, 187974, 187302, 187641, 188447, 188655, 187866, 186716, 185906, 185521, 185550, 186329, 187858, 189333, 190033, 190243, 190595, 190932, 190642, 189844, 189375, 189675, 190475, 191534, 192955, 194637, 196143, 197304, 198405, 199563, 200438, 200806, 200978, 201299, 201573, 201274, 200219, 198830, 197830, 197769, 198705, 200159, 201411, 201858, 201259, 199822, 198135, 196743, 195638, 194355, 192682, 191017, 189827, 189110, 188676, 188556, 188740, 188809, 188354, 187616, 187243, 187541, 188402, 189748, 191464]
54217A91464J504N20o18j233j415j580j613j153l97M2o1l89o05n64j70N00J023
54200A85255J040P99P78R20P10R7k28L04J338J891J396K47o56p59k97Q7K3l37
54182A92608o82q49q07n75k71n1J26M54Q43Q23Q1r75j527j200m19Q3jl64n51m87
54162A86259m00l76j83K81O77N80L5n66r68j135r46l05M73P90M64k3p1L77Q59
54143A85822Q43K18o03j066j011p25l61K83J216J858J727J164R08J070J162R22
54127A93427M87p2p41j139q21l6N07O27P89J134J215Q36M32L52M59N99Q40J001
54109A99896O80kl50j05K58M43P07R83O03n05j201o14M89O76j86r10o35L29J169
54090B01725J355P76k81j216j597j493j142n78Q3M28L01K57R44K172L197L611
$$ y = [191464, 192968, 193488, 192870, 191637, 190222, 188642, 187029, 185876, 185479, 185521, 185460, 185071, 184466, 183902, 183732, 184232, 185255, 186295, 187094, 187872, 188792, 189502, 189599, 189371, 189675, 191013, 192904, 194300, 194547, 193891, 193132, 192835, 192922, 192945, 192608, 191926, 191077, 190270, 189695, 189424, 189373, 189499, 189953, 190796, 191619, 191700, 190725, 189198, 187998, 187579, 187662, 187661, 187297, 186746, 186259, 185859, 185483, 185300, 185581, 186258, 186838, 186873, 186307, 185339, 184204, 183258, 182953, 183426, 184216, 184680, 184657, 184586, 184963, 185822, 186665, 186883, 186280, 185214, 184203, 183478, 183117, 183400, 184616, 186474, 188201, 189365, 190273, 191343, 192505, 193427, 193914, 193842, 193101, 191962, 191141, 191105, 191612, 192239, 193028, 194162, 195377, 196213, 196645, 196997, 197456, 198055, 198895, 199896, 200576, 200574, 200224, 200119, 200377, 200820, 201527, 202510, 203113, 202608, 201407, 200793, 201282, 201958, 201772, 200862, 200227, 200556, 201725, 203080, 203856, 203575, 202359, 200762, 199269, 198127, 197549, 197632, 198060, 198361, 198618, 199562, 201734, 204931, 208542]
54074B08542L506L000K173J392J139J560K513L868N434O858P999R138J0417J1370
54060B78909J1451J0586Q760N516Q19m036p323q684r113r230q643p212n849n295
54046B50656m942l645j436L96Q92M69K48P26J399J640J564J840K720L678M121
54031B60326M154M277M667N100N408N595N552N100M328L511K747K034J637J909
54017C16345K653L063K496J044p14k232l173l465l357l223l207l201l185l277
54003B96567l456l545l576l774m059l972l341k671k504k614k234j067K81R22N89
53988B61546j10k09P69K359L557L729L081K180J265K85o38j220j503j838k306
53973B70947k583k585k785l448l993l734k945k469k321j688m27L65j15j075j224
$$ y = [208542, 212048, 215048, 217221, 218613, 219752, 221312, 223825, 227693, 233127, 239985, 247984, 257122, 267539, 278909, 290360, 300946, 309706, 315222, 316041, 312005, 304682, 295998, 286885, 277655, 269012, 261800, 255951, 250656, 245714, 242069, 240633, 241029, 241921, 242390, 242638, 243364, 244763, 246403, 247967, 249807, 252527, 256205, 260326, 264480, 268757, 273424, 278524, 283932, 289527, 295079, 300179, 304507, 308018, 310765, 312799, 314436, 316345, 318998, 322061, 324557, 325601, 324887, 322655, 319482, 316017, 312660, 309437, 306230, 303029, 299844, 296567, 293111, 289566, 285990, 282216, 278157, 274185, 270844, 268173, 265669, 263055, 260821, 259754, 260035, 260957, 261546, 261436, 261227, 261996, 264355, 267912, 271641, 274722, 276902, 278167, 278452, 277814, 276594, 275091, 273253, 270947, 268364, 265779, 262994, 259546, 255553, 251819, 248874, 246405, 244084, 242396, 241969, 242334, 242219, 241144, 239920]
53958B39920n59q9j61p1N98J360J716J795J775J454Q55O10J159K071K695L053
53942B58181L502L877L693L046K697L117L927M446M510M477M619M679M141K941
53928C11853J744J307J639K072K155K188K646L522M383M918N157N350N877P066
53914C61877Q888J0859J2503J3822J5256J7212J9707K2314K4237K4454K2008J6461
53902E69598Q380n78q380j3750j6592j7381j6538j4681j2851j1853j1507j1131
53890D42736j0492r778q950p980p451p957q893q935p865o860o715o829o453n844
53876C31734n491n115m247l220k691k733l052l663m536n051m636l627k833k494
53862B78345k309k179k238k339k182j798j466j335j492k055k710k637j522k44
$$ y = [239920, 239361, 239272, 239111, 239040, 239638, 240998, 242714, 244509, 246284, 247738, 248593, 249203, 250362, 252433, 255128, 258181, 261683, 265560, 269253, 272299, 274996, 278113, 282040, 286486, 290996, 295473, 300092, 304771, 308912, 311853, 313597, 314904, 316543, 318615, 320770, 322958, 325604, 329126, 333509, 338427, 343584, 348934, 354811, 361877, 370765, 381624, 394127, 407949, 423205, 440417, 460124, 482438, 506675, 531129, 553137, 569598, 577978, 577400, 569020, 555270, 538678, 521297, 504759, 490078, 477227, 465374, 453867, 442736, 432244, 422466, 413516, 405536, 398085, 390128, 381235, 372300, 364435, 357575, 350860, 344031, 337578, 331734, 326243, 321128, 316881, 313661, 310970, 308237, 305185, 301522, 296986, 291935, 287299, 283672, 280839, 278345, 276036, 273857, 271619, 269280, 267098, 265300, 263834, 262499, 261007, 258952, 256242, 253605, 252083, 251839]
53848B51839M6p13j682k244k311j896j165o38o15o04n0O87P97K44k99n31o82p23
53830B39460l33L60Q00P55M90J19m37r03p78q4N83P65M38k41r30j059m98M3M1
53811B38591J76J322K868L358K749K547L449M219L654K409J990K819M128N202
53797B79481N828N961N698N431N453N570N450N115M776M448M008L379K501J442
53783C44541O22M13M29k01j622k993l619l772l956m095l972l886m223m803n126
53768C03737m999m452l516k523k167k695l406l540l283l264l407l123k372j760
53754B59230j566j405r92o52p65j212j545j515j246j044j094j216r95l06M38Q03
53738B44918Q84J002J068O96q8p58r91r87r50o46J57J138J640J422R47Q97J492
$$ y = [251839, 251885, 251172, 249490, 247246, 244935, 243039, 241874, 241236, 240621, 240017, 239967, 240654, 241451, 241695, 241396, 240865, 240183, 239460, 239127, 239487, 240287, 241042, 241532, 241651, 241214, 240311, 239533, 239449, 240032, 240797, 241235, 240994, 240064, 239005, 238507, 238550, 238591, 238767, 240089, 242957, 246315, 249064, 251611, 255060, 259279, 262933, 265342, 267332, 270151, 274279, 279481, 285309, 291270, 296968, 302399, 307852, 313422, 318872, 323987, 328763, 333211, 337219, 340598, 343099, 344541, 345163, 345576, 346005, 345804, 344182, 341189, 337570, 333798, 329842, 325747, 321775, 317889, 313666, 308863, 303737, 298738, 294286, 290770, 288247, 286080, 283385, 279979, 276439, 273156, 269892, 266485, 263362, 260990, 259230, 257664, 256259, 255267, 254615, 253850, 252638, 251093, 249578, 248332, 247288, 246194, 244978, 243983, 243677, 244115, 244918, 245802, 246804, 247872, 248568, 248480, 247722, 246731, 245744, 244794, 244148, 244305, 245443, 247083, 248505, 249452, 250349, 251841]
53721B51841K272K537K015J141N71M61M19J49j17OM90R51J191J383J657J839J728
53704B70534J409J148J064J164J514K144K773K966K629K177K136K626L316L649
53690C01249L256K231J064J84l62o49n39J7N73N61J20o1K55N42M09J70K01L28
53672C09549K14o8l53p51j237j320p06J12M73L89K47J8n20j110j282j106r53p54
53654C00842k16L81M29j1k83j72q1j70j21J01J02j49j91Q7K12O5K07Q53J348J182
53634C04415Q44J024J521J627J231Q56Q06Q98R24Q64P38O78R93J783K578K815
53618C24595K615K599K947L130K787K374K543L115L251K658K124K517L611M381
53604C65247M334L936L717L535L049K393J986K013K390K943L287K952J997J140
$$ y = [251841, 254113, 256650, 258665, 259806, 260377, 260838, 261257, 261406, 261289, 261295, 261785, 262736, 263927, 265310, 266967, 268806, 270534, 271943, 273091, 274155, 275319, 276833, 278977, 281750, 284716, 287345, 289522, 291658, 294284, 297600, 301249, 304505, 306736, 307800, 307984, 307622, 306973, 306434, 306451, 307024, 307585, 307705, 307644, 307899, 308441, 308850, 309020, 309221, 309549, 309763, 309695, 309342, 308591, 307354, 306034, 305328, 305440, 305913, 306302, 306549, 306567, 306047, 304937, 303655, 302549, 301596, 300842, 300626, 301007, 301436, 301425, 301142, 300970, 300889, 300719, 300598, 300699, 300801, 300652, 300461, 300548, 300760, 300825, 301032, 301885, 303233, 304415, 305259, 306283, 307804, 309431, 310662, 311518, 312324, 313222, 314146, 315010, 315748, 316426, 317419, 319202, 321780, 324595, 327210, 329809, 332756, 335886, 338673, 341047, 343590, 346705, 349956, 352614, 354738, 357255, 360866, 365247, 369581, 373517, 377234, 380769, 383818, 386211, 388197, 390210, 392600, 395543, 398830, 401782, 403779, 404919]
53590D04919Q86R25Q26P92J227J989K680L235L563L119J632j48j234j626j916
53575D20869k126j982j890k469l285l343k683k214k131j869j634k299l515l629
53561C85800k094m41l0k65k7N09O80Q43J619K473K392J512Q28P26Q40J037J434
53544C97836J667J276O82Q57J949L083L492L269K941K926L368M060M536M624M700
53529D41266N082N516N692N881O473P263P819Q241Q905R680J0157J0479J1233
53516E43687J2538J3863J4775J5357J5840J6322J6837J7452J8255J9406K1003
53505G25335K2628K3391K2829K1537K0507K0086J9973J9870J9723J9505J9276
53494I54660J9292J9684K0161K0345K0150J9658J8993J8550J8828J9618J9980
$$ y = [404919, 405805, 406730, 407556, 408348, 409575, 411564, 414244, 417479, 421042, 424161, 425793, 425645, 424411, 422785, 420869, 418743, 416761, 414871, 412402, 409117, 405774, 403091, 400877, 398746, 396877, 395243, 392944, 389429, 385800, 383706, 383265, 383235, 382970, 382943, 383452, 384132, 384975, 386594, 389067, 391459, 392971, 393799, 394525, 395365, 396402, 397836, 399503, 400779, 401461, 402318, 404267, 407350, 410842, 414111, 417052, 419978, 423346, 427406, 431942, 436566, 441266, 446348, 451864, 457556, 463437, 469910, 477173, 484992, 493233, 502138, 511818, 521975, 532454, 543687, 556225, 570088, 584863, 600220, 616060, 632382, 649219, 666671, 684926, 704332, 725335, 747963, 771354, 794183, 815720, 836227, 856313, 876286, 896156, 915879, 935384, 954660, 973952, 993636, 1013797, 1034142, 1054292, 1073950, 1092943, 1111493, 1130321, 1149939, 1169919]
53483A169919J9454J8686J8266J7738J6528J5225J4886J5413J5750J5433J4888
53472A352186J4239J2943J0813Q510O651N129L558J787k23k581n226p921j0542
53459A389323j3060j5170j6431j6838j6873j6949j7123j7366j7772j8397j9211
53448A204133k0066k0577k0381j9771j9727k0663k1537k0940j8905j6879j5904
53437I88783j5542j4782j3308j1515r816q244o677n165l961l113k082k69K011
53424H96320L642M179M579N891P804R295J0245J1408J3083J4797J6254J7680J9192
53411A034369K0587K1820K2962K3755K3967K4199K5422K7647K9889L1468L2538
53400A318623L3357L4049L5211L7596M0816M3407M4706M5795M7877N0602N2706
$$ y = [1169919, 1189373, 1208059, 1226325, 1244063, 1260591, 1275816, 1290702, 1306115, 1321865, 1337298, 1352186, 1366425, 1379368, 1390181, 1398691, 1405342, 1410471, 1414029, 1415816, 1415593, 1413012, 1407786, 1399865, 1389323, 1376263, 1361093, 1344662, 1327824, 1310951, 1294002, 1276879, 1259513, 1241741, 1223344, 1204133, 1184067, 1163490, 1143109, 1123338, 1103611, 1082948, 1061411, 1040471, 1021566, 1004687, 988783, 973241, 958459, 945151, 933636, 923820, 915576, 908899, 903734, 899773, 896660, 894578, 894309, 896320, 899962, 904141, 908720, 914611, 922415, 931710, 941955, 953363, 966446, 981243, 997497, 1015177, 1034369, 1054956, 1076776, 1099738, 1123493, 1147460, 1171659, 1197081, 1224728, 1254617, 1286085, 1318623, 1351980, 1386029, 1421240, 1458836, 1499652, 1543059, 1587765, 1633560, 1681437, 1732039, 1784745]
53389A784745N3716N4090N4170N3874N3322N2920N2736N2302N1129M9104M6380
53378B358488M3256M0221L7849L6294L4888L2447K8318K3229J8767J5829J3744
53367B683330J1172P412K512l424j0258j7440k4319l0837l7204m3010m7415n0240
53355B440279n2101n3420n4132n4431n4907n5594n5729n4851n3436n1992n0327
53344A849359m8258m6387m5463m5383m5422m5106m4304m2828m0656l8283l6355
53333A370914l4867l3189l0823k7861k4804k2154k0074j8278j6372j4365j2668
53322A115459j1472j0540r652q917q424q045p800p892q111p651o051l954k331
53309A014619j297k19J119K192K704L206M432O274P869Q628Q861R316J0348J1834
$$ y = [1784745, 1838461, 1892551, 1946721, 2000595, 2053917, 2106837, 2159573, 2211875, 2263004, 2312108, 2358488, 2401744, 2441965, 2479814, 2516108, 2550996, 2583443, 2611761, 2634990, 2653757, 2669586, 2683330, 2694502, 2701914, 2704426, 2701002, 2690744, 2673304, 2648985, 2618148, 2580944, 2537934, 2490519, 2440279, 2388178, 2334758, 2280626, 2226195, 2171288, 2115694, 2059965, 2005114, 1951678, 1899686, 1849359, 1801101, 1754714, 1709251, 1663868, 1618446, 1573340, 1529036, 1486208, 1445552, 1407269, 1370914, 1336047, 1302858, 1272035, 1244174, 1219370, 1197216, 1177142, 1158864, 1142492, 1128127, 1115459, 1103987, 1093447, 1083795, 1074878, 1066454, 1058409, 1050609, 1042717, 1034606, 1026955, 1020904, 1016950, 1014619, 1013322, 1013103, 1014222, 1016414, 1019118, 1022324, 1026756, 1033030, 1040899, 1049527, 1058388, 1067704, 1078052, 1089886]
53295A089886J3702J6094J8761K0870K1857K2305K3340K5198K6887K7381K6739
53284A333020K5855K5407K5294K4882K3651K1717J9737J8190J6797J4913J2349
53273A561812R543O971M764K778P31j723m676p702j0310j2566j4894j7390j9756
53260A497582k1856k3800k5576k7093k8564l0250l1843l2702l2777l2617l2440
53249A178064l1899l0903k9963k9338k8622k7484k6262k5405k4837k4298k3846
53238H75207k3575k3290k2828k2378k2089k1694k0837j9552j8132j6792j5647
53227F48393j4651j3493j1913j0219r038q483q082p695p739q354q974r144r083
53214E21525r066q932q661q784r568j0322j0212r340q424p761p133o426n742n092
$$ y = [1089886, 1103588, 1119682, 1138443, 1159313, 1181170, 1203475, 1226815, 1252013, 1278900, 1306281, 1333020, 1358875, 1384282, 1409576, 1434458, 1458109, 1479826, 1499563, 1517753, 1534550, 1549463, 1561812, 1571355, 1578326, 1583090, 1585868, 1586599, 1584876, 1580200, 1572498, 1562188, 1549622, 1534728, 1517338, 1497582, 1475726, 1451926, 1426350, 1399257, 1370693, 1340443, 1308600, 1275898, 1243121, 1210504, 1178064, 1146165, 1115262, 1085299, 1055961, 1027339, 999855, 973593, 948188, 923351, 899053, 875207, 851632, 828342, 805514, 783136, 761047, 739353, 718516, 698964, 680832, 664040, 648393, 633742, 620249, 608336, 598117, 589079, 580596, 572514, 564819, 557080, 548726, 539752, 530608, 521525, 512459, 503527, 494866, 486082, 476514, 466192, 455980, 446640, 438216, 430455, 423322, 416896, 411154, 406062]
53200D06062m537m383m727n035m728m013l643l977m658n075m773l664k292j686
53186C48871k432l918m857m545l422k509k467k981k969j723M0P26k71j832k572
53171C13139k425k245k426k666k709k576k251j757j432j491j572j268q98j048
53157B86375j503j404n40K37J32o26j159r68l76j07n63j348j601r84q3L29K64
53140B76075K45L29J6q00j426j182l30K27Q7j57K80J289J928J648J051J005J358
53123B81643J266O38M50J279K376K662K078J396J095J033R52Q06P04Q14J154J308
53107C01654P39l90j244j429j511k014k561k548k159j975j992j737j079l37J34
53092B81551pr88k288k639j458J61O89L7o80q96j055j426j553j076k73M47R33
$$ y = [406062, 401525, 397142, 392415, 387380, 382652, 378639, 374996, 371019, 366361, 361286, 356513, 352849, 350557, 348871, 346439, 342521, 337664, 333119, 329697, 327188, 324721, 321740, 318771, 317048, 317088, 317814, 317543, 315711, 313139, 310714, 308469, 306043, 303377, 300668, 298092, 295841, 294084, 292652, 291161, 289589, 288321, 287423, 286375, 284872, 283468, 282928, 283165, 283297, 282671, 281512, 280544, 280168, 280061, 279498, 278150, 276549, 275565, 275482, 275811, 276075, 276320, 276649, 276665, 275865, 274439, 273257, 272927, 273154, 273241, 273084, 273364, 274653, 276581, 278229, 279280, 280285, 281643, 282909, 283547, 283997, 285276, 287652, 290314, 292392, 293788, 294883, 295916, 296868, 297674, 298378, 299192, 300346, 301654, 302393, 302003, 300759, 299330, 297819, 295805, 293244, 290696, 288537, 286562, 284570, 282833, 281754, 281417, 281551, 281544, 280556, 278268, 275629, 274171, 274332, 275021, 275058, 274378, 273482, 272427, 271001, 269448, 268372, 268099, 268546, 269479]
53075B69479J110R73Q36J039J392J469J306J205R68Q8j282k341k647k464k024
53060B69107j267m28l3r5k1M14O58L14j99k93n1M6j42l65m66n60p97j083j069
53041B63670n20J98L58j37m26J65J026J033P3r84j638k090k325j926j048n42p23
53024B54164q20j22J010J746J766J216K99o39j052p09K6O89J131J257R29L85K38
53007B61514O54J028Q17K43j71k64j28K00N22M27j13n19l53R8L61M42N11L66j64
52988B65471o80o00L6O90J077J369J760K234K629K686K236J558J304J669J941
52973B85380J331Q9p03m23M28Q66M93j58k12O01J631K025J688J206R31O20J00
52956B95893m00p72j287j961k272k038j919k383k765k280j462j504k327k567j603
$$ y = [269479, 270589, 271562, 272398, 273437, 274829, 276298, 277604, 278809, 279777, 279865, 278583, 276242, 273595, 271131, 269107, 267840, 267412, 267379, 267284, 267263, 267677, 268335, 268649, 268450, 268157, 268106, 268152, 268010, 267645, 267179, 266619, 265822, 264739, 263670, 263150, 263348, 263706, 263569, 263143, 263308, 264334, 265367, 265440, 264456, 262818, 260728, 258403, 256477, 255429, 254887, 254164, 253344, 253222, 254232, 255978, 257744, 258960, 259259, 258620, 257568, 256859, 256885, 257574, 258705, 259962, 260891, 261276, 261514, 262168, 263196, 264013, 264256, 264085, 263821, 263693, 263893, 264415, 264842, 264729, 264210, 263857, 263955, 264316, 264758, 265269, 265635, 265471, 264791, 264191, 264227, 264917, 265994, 267363, 269123, 271357, 273986, 276672, 278908, 280466, 281770, 283439, 285380, 286711, 286800, 286097, 285674, 286102, 286968, 287461, 287303, 287091, 287692, 289323, 291348, 293036, 294242, 295173, 295793, 295893, 295493, 294721, 293434, 291473, 289201, 287163, 285244, 282861, 280096, 277816, 276354, 274850, 272523, 269956, 268353]
52941B68353m48j26k00K33R48R80K41l24k01J0l71j096j474j331j026q09o47o01
52923B62111q32j239j466j297q28k06M45Q78Q68O25O43R91J149Q01L31K38L82
52906B63594K76j64n97p88p53n47k93k46m14l72J34O64P41P45J435K609L119K357
52888B71500J051K38N7r1n59j079j176p38k12j83o35q35l10L48K44m58p33j72
52870B66257N39P95Q48J106J397J391J196J073J054J235J847K728L281L280L129
52855B91156K903J920r7k169l140l196l349l872m104l697l088k690k383k010j727
52840B60457j697j819j912j815j345n48L1j58q39j022j25J367K508K798K406J771
52824B60058J187O66L2p75j496j800j662j357j052o62p8O69J535K602L901N119
$$ y = [268353, 267905, 267779, 267579, 267812, 268760, 269740, 269981, 269657, 269456, 269466, 269095, 267999, 266525, 265194, 264168, 263359, 262712, 262111, 261279, 260040, 258574, 257277, 256449, 256243, 256688, 257566, 258434, 259059, 259702, 260693, 261842, 262643, 262974, 263212, 263594, 263870, 263706, 263109, 262321, 261568, 261021, 260728, 260482, 260068, 259696, 259830, 260494, 261235, 261980, 263415, 266024, 269143, 271500, 272551, 272789, 272846, 272755, 272196, 271117, 269941, 269203, 268991, 268808, 268173, 267338, 267028, 267376, 267620, 267162, 266429, 266257, 266796, 267591, 268439, 269545, 270942, 272333, 273529, 274602, 275656, 276891, 278738, 281466, 284747, 288027, 291156, 294059, 295979, 295882, 293713, 290573, 287377, 284028, 280156, 276052, 272355, 269267, 266577, 264194, 262184, 260457, 258760, 256941, 255029, 253214, 251869, 251321, 251352, 251194, 250355, 249333, 249208, 250575, 253083, 255881, 258287, 260058, 261245, 261911, 261943, 261168, 259672, 257872, 256210, 254853, 253801, 253139, 253061, 253730, 255265, 257867, 261768, 266887]
52808B66887N551M579K285m28k532l651m045l976l464k660j969j657j548j394
52794B51978j185j029r50j029j342j612j306l15P46J233J158R09O06J48m13q51
52778B46746r98p72k00L80N26L19L60Q52J184Q84M41N36R10Q21K53j06k6L2j17
52759B52025l3M65Q21N92J73K13O93J019Q11K43l00n57m14J37R67J774K144J834
52741B62607J082N33O55J251J674J486P82j4m48k83K62O31M93K07M11J176J857
52724B74362J795R83o7q87j388j712j869j690j167o74o50j029j341j357j307j363
52708B60639j320j002n46q7M82J090J319J024P51R67J272R83J79m17m20j2O31
52691B65533J441J999J739P73l0k7N39R84Q76K69m16o68l95j15l30p86p98k75
$$ y = [266887, 272438, 277017, 279302, 278874, 276342, 272691, 268646, 264670, 261206, 258546, 256577, 254920, 253372, 251978, 250793, 249764, 248814, 247785, 246443, 244831, 243525, 243210, 243956, 245189, 246347, 247256, 247862, 248010, 247597, 246746, 245748, 244976, 244776, 245156, 245682, 246001, 246361, 247213, 248397, 249281, 249722, 250258, 251168, 251989, 252242, 252136, 252110, 252142, 252025, 251992, 252457, 253278, 253870, 254043, 254256, 254949, 255968, 256779, 257022, 256722, 256165, 255751, 255888, 256855, 258629, 260773, 262607, 263689, 264222, 264877, 266128, 267802, 269288, 270070, 270056, 269608, 269325, 269587, 270218, 270711, 270918, 271329, 272505, 274362, 276157, 277140, 277073, 276186, 274798, 273086, 271217, 269527, 268360, 267686, 267036, 266007, 264666, 263309, 262002, 260639, 259319, 258317, 257771, 257684, 258166, 259256, 260575, 261599, 262350, 263317, 264589, 265572, 265751, 265334, 264914, 264902, 265533, 266974, 268973, 270712, 271485, 271455, 271428, 271967, 272951, 273827, 274096, 273680, 273012, 272617, 272502, 272172, 271386, 270588, 270313]
52673B70313J23j25q10j329j204l25Q34J323O33m62p08L7P07O72N10Q44J265J083
52655B73381N09L14P45J399J920K201K090J496O75n9p55j578k249k246j504n24
52639B75815K19N94O21L26j15l69j77N02J502K520L240L612L882M163M065L086
52623C03486J258p83k391l379l929m272m459m304l507k033m12N34L86m03q67m43
52607B74482M67R54O11q5n05o19p31p91m97N8M66P19J157J572J191p6j103q43
52589B76427L62J379J733J748J628J267Q06O05N85L33j21k67N4M36O07O75N36
52572B88793k07j385k107j875j260r29o26J37R07P20m06j342j284n94j8K63L86
52555B79173J92n22j378j569p78L71R17N14k94o90m21N0J78n2l00m52p21j123
$$ y = [270313, 270436, 270311, 269501, 268172, 266968, 266643, 267477, 268800, 269433, 268971, 268263, 268300, 269007, 269679, 270189, 271033, 272298, 273381, 273890, 274204, 274949, 276348, 278268, 280469, 282559, 284055, 284730, 284671, 283916, 282338, 280089, 277843, 276339, 275815, 276034, 276628, 277249, 277575, 277460, 277091, 276914, 277416, 278918, 281438, 284678, 288290, 292172, 296335, 300400, 303486, 304744, 303961, 301570, 298191, 294262, 289990, 285531, 281227, 277720, 275687, 275275, 275809, 276195, 275792, 274925, 274482, 274949, 275903, 276514, 276429, 275924, 275305, 274574, 273783, 273286, 273344, 273810, 274529, 275686, 277258, 278449, 278373, 277270, 276427, 276789, 278168, 279901, 281649, 283277, 284544, 285350, 285955, 286540, 286873, 286752, 286485, 286539, 286975, 287582, 288257, 288793, 288586, 287201, 285094, 283219, 281959, 281030, 280404, 280541, 281448, 282168, 281762, 280420, 279136, 278542, 278524, 278787, 279173, 279365, 278843, 277465, 275896, 275118, 275489, 276406, 276920, 276626, 275936, 275515, 275565, 275743, 275691, 275391, 274939, 274218, 273095]
52537B73095j256q04p6L16K18J06M44J106J533J369P62J71J7M01J066J497J358
52520B81323Q55N81Q17J153J053O66O89J381K195K566K605K688K722K421J974
52505C05689J793J675R58m49j776k395k469k333j964j453j358j941k502k241j366
52490B87868o76k56M80J560K134J655O23j79n73p31o03r1N65J024J293J565J750
52473B97408J577J045N45M62Q94J686K542L169L468L622L839M017L702K537P32
52458C31245r29j759j861j986k646l534m021l875l277k423j570j230j718k567
52444B97849k906k464j706j041m87j76m66j265j811j577q82l45j07K9J60L78R11
52427B84094J687K082J584N46k08l01K4M98J095J656J742J047j00q44n40N58J496
$$ y = [273095, 271839, 271035, 270959, 271275, 271493, 271599, 272043, 273149, 274682, 276051, 276813, 276984, 277001, 277402, 278468, 279965, 281323, 282178, 282759, 283576, 284729, 285782, 286448, 287137, 288518, 290713, 293279, 295884, 298572, 301294, 303715, 305689, 307482, 309157, 310115, 309666, 307890, 305495, 303026, 300693, 298729, 297276, 295918, 293977, 291475, 289234, 287868, 287192, 286936, 287416, 288976, 291110, 292765, 293388, 293209, 292636, 291905, 291302, 291211, 291776, 292800, 294093, 295658, 297408, 298985, 300030, 300575, 301037, 301931, 303617, 306159, 309328, 312796, 316418, 320257, 324274, 327976, 330513, 331245, 330316, 328557, 326696, 324710, 322064, 318530, 314509, 310634, 307357, 304934, 303364, 302134, 300416, 297849, 294943, 292479, 290773, 289732, 289245, 289069, 288603, 287338, 285527, 283950, 283068, 282723, 282616, 282645, 282805, 283183, 284094, 285781, 287863, 289447, 289993, 289785, 289484, 289508, 290006, 291101, 292757, 294499, 295546, 295446, 294602, 294062, 294620, 296116]
52410B96116J727J789K549L957N207N968O744P906R178J0236J0989J0893Q992
52397C82251N217R07k665n515p991r504r273p790o301n150l795k240j252j104
52383C25795j200j109r82q18k44O32J095R19Q15J343K094K421K366K356K471K557
52367C40511K608K583K169J181J4p11q11n72l46l31n46p03l41O57J743K123J519
52350C50747M36l36m06q8L6j89l75k32J7J68N83J605K707K907K150J544K016L193
52332C66483L967L820L254L139L894N189O376P200P969Q914R653R687R175Q699
52318D57419Q323P541O202M946M508N012O059P186Q053Q602R163J0121J1392J2463
52304E66990J2996J3074J2923J2773J2866J3189J3260J2632J1551J0593R813Q850
$$ y = [296116, 297843, 299632, 302181, 306138, 311345, 317313, 324057, 331963, 341141, 351377, 362366, 373259, 382251, 387468, 388375, 385710, 380195, 372204, 362700, 353427, 345637, 339336, 334186, 330391, 328151, 326899, 325795, 324595, 323486, 322504, 321686, 321442, 322074, 323169, 324088, 324903, 326246, 328340, 330761, 333127, 335483, 337954, 340511, 343119, 345702, 347871, 349052, 349066, 348355, 347544, 346972, 346626, 346295, 345749, 345046, 344705, 345362, 347105, 349228, 350747, 351183, 350847, 350441, 350353, 350389, 350200, 349825, 349593, 349610, 349778, 350361, 351966, 354673, 357580, 359730, 361274, 363290, 366483, 370450, 374270, 377524, 380663, 384557, 389746, 396122, 403322, 411291, 420205, 429858, 439545, 448720, 457419, 465742, 473283, 479485, 484431, 488939, 493951, 500010, 507196, 515249, 523851, 533014, 543135, 554527, 566990, 579986, 593060, 605983, 618756, 631622, 644811, 658071, 670703, 682254, 692847, 702660, 711510]
52292G11510P695O671N734M636L730L645M045L830K822K131K338K437J374k93
52278G62305j285j370j220j015m47J99J32o91j312r92L1J149K130K948L431L390
52262G67383K916K253J620J254J529K767M868P156Q772R441R782J0598J1853J2604
52248H54796J2034J0204P804N575M066L457L333L083K760L106M355N490N225L520
52234I28808J587M74L8o03j846l067l324k630k051k328k853k663k090k372l662
52219I01418m612m265l277k743k778k995l319l498k682o07J477K206J904J874
52205H78103K385K691K702L129L939M129L442L002L668M808N422N613O124O962
52191I36119P348O839N760M525L073J168r83k641l191k860k548k881l655m421
$$ y = [711510, 719205, 725876, 731610, 736246, 739976, 743621, 747666, 751496, 754318, 756449, 758787, 761224, 762598, 762305, 761020, 759650, 758430, 757415, 756968, 757167, 757299, 756608, 755296, 754304, 754335, 755484, 757614, 760562, 763993, 767383, 770299, 772552, 774172, 775426, 776955, 779722, 784590, 791746, 800518, 809959, 819741, 830339, 842192, 854796, 866830, 877034, 884838, 890413, 894479, 897936, 901269, 904352, 907112, 910218, 914573, 920063, 925288, 928808, 930395, 930869, 930907, 930304, 928458, 925391, 922067, 919437, 917386, 915058, 912205, 909542, 907452, 905080, 901418, 896806, 892541, 889264, 886521, 883743, 880748, 877429, 873931, 871249, 870642, 872119, 874325, 876229, 878103, 880488, 883179, 885881, 889010, 892949, 897078, 900520, 903522, 907190, 911998, 917420, 923033, 929157, 936119, 943467, 950306, 956066, 960591, 963664, 964832, 963849, 961208, 958017, 955157, 952609, 949728, 946073, 941652]
52177I41652n155n900o192n598m655m397m864m903l774k221j481j739k145j973
52163H86655j270m09M57J399K352K944K785J945J017M83J93k23o64o49r0N77J056
52146H98558J541K195K743K866K626K283J860J241M86k11p56j146j284j010k91
52131I11701O45J433J878K242L087M655O510Q043R202J0399J1798J3065J3826
52118I98484J3950J3363J2068J0547R635R584R611Q811P389O513O952Q215R235
$$ y = [941652, 936497, 930597, 924405, 918807, 914152, 909755, 904891, 899988, 896214, 893993, 892512, 890773, 888628, 886655, 885385, 884976, 885433, 886832, 889184, 892128, 894913, 896858, 897875, 898358, 898551, 898328, 897664, 897015, 896925, 897502, 898558, 900099, 902294, 905037, 907903, 910529, 912812, 914672, 915913, 916399, 916188, 915432, 914286, 913002, 911992, 911701, 912346, 913779, 915657, 917899, 920986, 925641, 932151, 940194, 949396, 959795, 971593, 984658, 998484, 1012434, 1025797, 1037865, 1048412, 1058047, 1067631, 1077242, 1086053, 1093442, 1099955, 1106907, 1115122, 1124357]
$$ [...]
##END NTUPLES=NMR SPECTRUM
##END=
